##TITLE=1H_Pr 54-dep
 CDCl3
 8 sc, 
 24.10.2022
##JCAMPDX= 6.0         $$ Bruker NMR JCAMP-DX V2.0
##DATA TYPE= NMR FID
##DATA CLASS= NTUPLES
##ORIGIN= UXNMR, Bruker Analytische Messtechnik GmbH
##OWNER= root
$$ XWIN-NMR		Version 3.5
$$ Mon Oct 24 15:34:13 2022 Russian Standard Time (UT+4h)  she@DPX200
##.OBSERVE FREQUENCY= 200.1313499994
##.OBSERVE NUCLEUS= ^1H
##.DELAY= (6, 6)
##.ACQUISITION MODE= SIMULTANEOUS
##.ACQUISITION SCHEME= undefined
##.AVERAGES= 8
##.DIGITISER RES= 18
##SPECTROMETER/DATA SYSTEM= spect
##.PULSE SEQUENCE= zg30
##.SOLVENT NAME= CDCl3
##.SHIFT REFERENCE= (INTERNAL, CDCl3, 0, 15.7039)
##AUDIT TRAIL= $$ (NUMBER, WHEN, WHO, WHERE, WHAT)
$$ ##TITLE= Audit trail, XWIN-NMR		Version 3.5
$$ ##JCAMPDX= 5.01
$$ ##ORIGIN= Bruker BioSpin GmbH
$$ ##OWNER= she
$$ F:/spectra/data/she/nmr/H-F/1/audita.txt
$$ ##AUDIT TRAIL=  $$ (NUMBER, WHEN, WHO, WHERE, WHAT)
(   1,<2022-10-24 15:32:59.71 +0400>,<she>,<DPX200>,
      <created by zg, POWCHK disabled, PULCHK disabled
       configuration hash MD5:
       00 E9 B6 7A A2 85 ED C7 34 08 36 98 17 FE 4E 26
       data hash MD5: 16K
       98 1C CC 7E C9 BC 44 5A 2F BA 0A 33 DC 89 5D 71>)
$$ ##END=
$$ 
$$ hash MD5
$$ 30 D1 74 31 74 37 BB 0D 48 22 44 ED 05 EB 7B AD
##$RELAX= 
##$RELAX= 
##$RELAX= 
##$RELAX= 
##$RELAX= 
##$RELAX= 
$$ Bruker specific parameters
$$ --------------------------
##$DU= <F:/spectra>
##$EXPNO= 1
##$NAME= <H-F>
##$PROCNO= 1
##$TYPE= <nmr>
##$USER= <she>
##$AMP= (0..31)
100 100 100 100 100 100 100 100 100 100 100 100 100 100 100 100 100 100 
100 100 100 100 100 100 100 100 100 100 100 100 100 100 
##$AQSEQ= 0
##$AQ_mod= 1
##$AUNM= <au_zg>
##$AUTOPOS= <>
##$BF1= 200.13
##$BF2= 200.13
##$BF3= 200.13
##$BF4= 200.13
##$BF5= 200.13
##$BF6= 200.13
##$BF7= 200.13
##$BF8= 200.13
##$BYTORDA= 1
##$CFDGTYP= 0
##$CFRGTYP= 5
##$CHEMSTR= <none>
##$CNST= (0..31)
1 1 145 1 1 1 1 1 1 1 1 1 1 1 1 1 1 1 1 1 1 1 1 1 1 1 1 1 1 1 1 1 
##$CPDPRG= <>
##$CPDPRG1= <>
##$CPDPRG2= <>
##$CPDPRG3= <>
##$CPDPRG4= <mlev>
##$CPDPRG5= <mlev>
##$CPDPRG6= <mlev>
##$CPDPRG7= <mlev>
##$CPDPRG8= <mlev>
##$CPDPRGB= <>
##$CPDPRGT= <>
##$D= (0..31)
0 1.2 0 0 0 0 0 0 0 0.06 0 0.03 0 0 0 0 0.0002 0 0 0 0 0 0 0 0 0 0 0 0 
0 0 0 
##$DATE= 1666611179
##$DBL= (0..7)
120 120 120 120 120 120 120 120 
##$DBP= (0..7)
150 150 150 150 150 150 150 150 
##$DBP07= 0
##$DBPNAM0= <>
##$DBPNAM1= <>
##$DBPNAM2= <>
##$DBPNAM3= <>
##$DBPNAM4= <>
##$DBPNAM5= <>
##$DBPNAM6= <>
##$DBPNAM7= <>
##$DBPOAL= (0..7)
0.5 0.5 0.5 0.5 0.5 0.5 0.5 0.5 
##$DBPOFFS= (0..7)
0 0 0 0 0 0 0 0 
##$DE= 6
##$DECBNUC= <off>
##$DECIM= 32
##$DECNUC= <off>
##$DECSTAT= 4
##$DIGMOD= 1
##$DIGTYP= 9
##$DL= (0..7)
0 120 120 120 120 120 120 120 
##$DP= (0..7)
150 150 150 150 150 150 150 150 
##$DP07= 0
##$DPNAME0= <>
##$DPNAME1= <>
##$DPNAME2= <>
##$DPNAME3= <>
##$DPNAME4= <>
##$DPNAME5= <>
##$DPNAME6= <>
##$DPNAME7= <>
##$DPOAL= (0..7)
0.5 0.5 0.5 0.5 0.5 0.5 0.5 0.5 
##$DPOFFS= (0..7)
0 0 0 0 0 0 0 0 
##$DQDMODE= 0
##$DR= 18
##$DS= 0
##$DSLIST= <SSSSSSSSSSSSSSS>
$$ [...]
##$SUBNAM2= <"">
##$SUBNAM3= <"">
##$SUBNAM4= <"">
##$SUBNAM5= <"">
##$SUBNAM6= <"">
##$SUBNAM7= <"">
##$SUBNAM8= <"">
##$SUBNAM9= <"">
##$SW= 18.0517283424941
##$SWIBOX= (0..15)
0 0 2 0 0 0 0 0 0 0 0 0 0 0 0 0 
##$SW_h= 3612.71676300578
##$TD= 16384
##$TD0= 1
##$TE= 0
##$TE2= 300
##$TE3= 300
##$TEG= 300
##$TL= (0..7)
0 120 120 120 120 120 120 120 
##$TP= (0..7)
150 150 150 150 150 150 150 150 
##$TP07= 0
##$TPNAME0= <>
##$TPNAME1= <>
##$TPNAME2= <>
##$TPNAME3= <>
##$TPNAME4= <>
##$TPNAME5= <>
##$TPNAME6= <>
##$TPNAME7= <>
##$TPOAL= (0..7)
0.5 0.5 0.5 0.5 0.5 0.5 0.5 0.5 
##$TPOFFS= (0..7)
0 0 0 0 0 0 0 0 
##$TUNHIN= 0
##$TUNHOUT= 0
##$TUNXOUT= 0
##$USERA1= <user>
##$USERA2= <user>
##$USERA3= <user>
##$USERA4= <user>
##$USERA5= <user>
##$V9= 5
##$VALIST= <valist>
##$VCLIST= <CCCCCCCCCCCCCCC>
##$VD= 0
##$VDLIST= <DDDDDDDDDDDDDDD>
##$VPLIST= <PPPPPPPPPPPPPPP>
##$VTLIST= <TTTTTTTTTTTTTTT>
##$WBST= 1024
##$WBSW= 4
##$XGAIN= (0..3)
0 0 0 0 
##$XL= 0
##$YL= 0
##$YMAX_a= 358841
##$YMIN_a= -427210
##$ZGOPTNS= <>
##$ZL1= 120
##$ZL2= 120
##$ZL3= 120
##$ZL4= 120
##$ABSF1= 10
##$ABSF2= 0
##$ABSG= 5
##$ABSL= 3
##$ALPHA= 0
##$AQORDER= 0
##$ASSFAC= 0
##$ASSFACI= 0
##$ASSFACX= 0
##$ASSWID= 0
##$AUNMP= <proc_1d>
##$AZFE= 0.1
##$AZFW= 0.1
##$BCFW= 1
##$BC_mod= 2
##$BYTORDP= 1
##$COROFFS= 0
##$CY= 11.3945322036743
##$DATMOD= 1
##$DC= 2
##$DFILT= <>
##$DTYPP= 0
##$F1P= 2.36226072786647
##$F2P= -0.459571619588291
##$FCOR= 0.5
##$FTSIZE= 0
##$FT_mod= 4
##$GAMMA= 1
##$GB= 0.15
##$INTBC= 1
##$INTSCL= 1
##$ISEN= 128
##$LB= 0.24
##$LEV0= 0
##$LPBIN= 0
##$MAXI= 10000
##$MC2= 0
##$MEAN= 0
##$ME_mod= 0
##$MI= 1.114404
##$NCOEF= 0
##$NC_proc= 0
##$NLEV= 6
##$NOISF1= 3.799351
##$NOISF2= 2.8
##$NSP= 1
##$NTH_PI= 0
##$NZP= 0
##$OFFSET= 15.70392
##$PC= 1
##$PHC0= -18045.01
##$PHC1= 25.2007
##$PH_mod= 1
##$PKNL= yes
##$PPARMOD= 0
##$PSCAL= 0
##$PSIGN= 0
##$REVERSE= no
##$SF= 200.130013532006
##$SI= 16384
##$SIGF1= 3
##$SIGF2= 2
##$SINO= 400
##$SIOLD= 16384
##$SREGLST= <1H.CDCl3>
##$SSB= 0
##$STSI= 0
##$STSR= 0
##$SW_p= 3612.71676300578
##$SYMM= 0
##$S_DEV= 0
##$TDeff= 0
##$TDoff= 0
##$TI= <>
##$TILT= no
##$TM1= 0
##$TM2= 0
##$TOPLEV= 0
##$USERP1= <user>
##$USERP2= <user>
##$USERP3= <user>
##$USERP4= <user>
##$USERP5= <user>
##$WDW= 1
##$XDIM= 8192
##$YMAX_p= 0
##$YMIN_p= 0
$$ End of Bruker specific parameters
$$ ---------------------------------
##NTUPLES= NMR FID
##VAR_NAME=  TIME,          FID/REAL,        FID/IMAG
##SYMBOL=    X,             R,               I
##VAR_TYPE=  INDEPENDENT,   DEPENDENT,       DEPENDENT
##VAR_FORM=  AFFN,          ASDF,            ASDF
##VAR_DIM=   8192,          8192,            8192
##UNITS=     SECONDS,       ARBITRARY UNITS, ARBITRARY UNITS
##FACTOR=    0.0002768,     1,               1
##FIRST=     0,             0,               0
##LAST=      2.2672688,     0,               0
##MIN=       0,             -427210,         0
##MAX=       2.2672688,     358841,          0
$$ Real data points
##PAGE= N=1
##DATA TABLE= (X++(R..R)), XYDATA
0@%%%%%%%%%Qj6J6j6K4l2M0n4O3p3Q8j11J35j60J92k24K62l08L58m14M76n44O24
32C34p11Q04r08J024j157J300j452J622j808K013k236K477k741L030l348L695
48A938m073M485m940N444o000O614p300Q072q943R934j1075J2407j3986J5890
62H467j8238K1221k5156L0618l8754N2311q0341K36512l81971j22400O76572l65742
74f901k76162M12661Q6874m65858J73912M32843m07911l27662N84554k4125m47598
85b65373L07823J75245l94104N3567L25381j59455l14317L00730K38856m07838
95a39485J8785L58836l27821j15554M07623j14711l06944K16992K17787k40954
105b5446j45318K88818n3969k71535L00166R6570l82459J17425K70134j90215
$$ y = [0, 0, 0, 0, 0, 0, 0, 0, 0, 0, 8, -8, 8, -8, 16, -16, 24, -30, 33, -40, 48, -63, 72, -88, 104, -120, 142, -166, 192, -222, 254, -290, 334, -377, 427, -481, 543, -614, 686, -766, 856, -952, 1061, -1175, 1302, -1439, 1591, -1757, 1938, -2135, 2350, -2590, 2854, -3146, 3468, -3832, 4240, -4703, 5231, -5844, 6563, -7423, 8467, -9771, 11450, -13706, 16912, -21842, 30469, -49872, 186640, -195331, -317731, 358841, -6901, -283063, 129598, 216472, -249386, -75474, 357369, -50542, -378204, 206350, 182225, -265373, 42450, 217695, -176409, -122842, 202539, 43084, -271233, 29497, 268353, -139485, -120700, 238136, -89685, -205239, 202384, 87673, -219271, -2279, 215508, -25446, -170764, 118054, 64085, -207450, 92716, 189286, -193173, -75748, 194386, 4171]
115D171j55921J58794J03057j84187Q399K39464k09547j63107L33531k9014k76954
126a71314J45085J52063j34779p4728J54557j023k29862J52384K02257k88443
136i3803k3395K66908j26462j25276J38999K2213j33694J5514J94114j00107k07339
147a72328K27271O9331k55474J03724J35994j67699q093J62384l7581j89130R0828
158d0773J99057k07174p9943K65277j13915j57008K21524m647k02009P6784J65282
169A22455j01075j47054J76037N9627k39432J13636J63178k38764j324K18956
179A26240r2864j40540J04840R7277j45905l9589K08965j03478j68936K39684
189H5694J5953k33021J08492J24565j28551m5322J31412L205j66821R3888J51815
$$ y = [4171, -151750, 7044, 110101, -74086, -65687, 173777, -35770, -198877, 134654, 105640, -171314, -26229, 125834, -8945, -83673, 70884, 69861, -160001, -7617, 194640, -93803, -117198, 149710, 23248, -102028, 36971, 59184, -74510, -58996, 135118, 35011, -172328, 54943, 124274, -131200, -27476, 108518, -59181, -67274, 95110, 57529, -131601, -40773, 158284, -48890, -128833, 136444, 22529, -134479, 87045, 82398, -119611, -42827, 122455, 21380, -125674, 50363, 109990, -129442, -15806, 147372, -91392, -92716, 126240, 33376, -107164, -2324, 94953, -50952, -90541, 118424, 14946, -153990, 85694, 101647, -131374, -22882, 101683, -26868, -72190, 59222, 62427, -104394, -10506, 141309]
200A41309k14887k4218K24694j13615j11650J48332R538j24711K3418J31796p8620
211A1386j34355J79333M0450k15511J05210J21793j72560j120J44852n0208j18640
222h9370Q1863J15085j55837m4169K05441r9828j33339J93966k091j67721P9258
233a6742J07191r6391q3504J36441L4524j84832R0375J39284k00087l946J86854
244A09167j01869j02559J20793M8870j28739j0563J61189q6403j34548J94539
254F9877Q272j96270J19214R7944j47935j1266J25332k5245j25673Q4039J11461
265A09750j71877j0105J88436j20223r4926J63509j3930j24337N6248R3719q3116
276f852q2478J43091J1760j72217J08796R7057j69454K1615J28773p8953p1373
$$ y = [141309, -73578, -97796, 126898, 13283, -98367, 49965, 59503, -65208, -41790, 90006, 11386, -122969, 56364, 96814, -118697, -13487, 108306, -64254, -65374, 79478, 29270, -89370, -7507, 107578, -48259, -92428, 113013, 13185, -120154, 73812, 71721, -96000, -16742, 90449, -5942, -89446, 46995, 81519, -103313, -12938, 126346, -73741, -77687, 109167, 7298, -95261, 25532, 74402, -54337, -64900, 96289, 9886, -124662, 69877, 78149, -118121, 1093, 99037, -48898, -60164, 65168, 39923, -85750, -1711, 109750, -62127, -72232, 116204, -4019, -98945, 64564, 50634, -73703, -17455, 76264, -6852, -89330, 53761, 65521, -106696, 2100, 99157, -70297, -48682, 80091, 1138, -70235]
287g0235Q6275N2003j14631r632J47796q8512r9781J62045j4792j33862Q9520
298F194O1115r0777k7342R2426O129j22004O4649J02053j45992k686J41341q9235
310d129o5692J00222J2412q3670J654R9718m7006j00171J26955K2078j47058Q1030
322c657P9649j13039o002Q9813j7379q4782M3951R0827j11134l3916J49961p2665
334A1627r6472J28928N004j07468L9174P7349n6659p1996J01958L0972j44319
345h1902O6241J06347j39781o108J25754o2123p2346P5792M7110r4554j7331J27904
357G5003o0588j04491J40193P413j36237P8602O8747r4850k0104Q7509k461j02910
369f4174N4708R1420j27090j0497J35953q3055o7489J06810K56q2684K1954P6027
$$ y = [-70235, 16040, 68043, -46588, -56220, 91576, 3064, -96717, 65328, 50536, -83326, 6194, 67309, -23468, -50810, 41616, 47745, -74259, -9610, 92443, -53549, -56235, 85106, -4129, -69821, 30401, 42813, -40857, -39203, 60515, 13509, -86662, 40293, 62371, -84687, -3657, 75992, -37047, -43049, 46764, 29385, -55397, -11446, 79381, -31753, -65669, 84292, 11627, -84845, 44083, 49087, -58381, -19207, 58142, 1483, -70513, 31445, 62417, -81902, -15661, 90686, -49095, -55203, 70551, 8428, -63918, 11874, 58984, -35570, -52901, 75003, 14415, -90076, 50117, 57530, -78707, -105, 68642, -26208, -46312, 41197, 38736, -64174, -9466, 81954, -45136, -55633, 80320, -2735, -70224, 36586, 36842, -45842, -23888, 52139]
381E2139m8002p3002J04978J5693j27460P5380P1137j12505P024Q4830l7569n7917
393d5274M6857N4604q3646k0018J15075o0502p8049J12596l223r3034M8678N1085
405D5149n2582l9084O9970K0056j02797M4769Q4991j07988q126J03990n4487n3612
417d9751O3755K6173o4897j3697R0469l4318q7745J02193J9856j13818N7665O1825
429E7710p9798j4466O9064k031p8048L3018Q1210r4053k7006J18561n8091p1408
441f5338R5674O172p9316K1764O6342l9593o5434Q5164K5313j15637N7132P8225
453G0468j08180m81R1782m2685n6932N2437M3199p5674j5280J02758n4092p7061
465f9741J10589qr9936N6372M9636o3577k0846O5070K138q3178M6267P1722j02759
$$ y = [52139, 4137, -68865, 36113, 51806, -75654, -274, 70863, -41642, -34618, 50212, 12643, -45274, 1583, 56187, -27459, -47477, 67598, 7096, -70953, 41643, 38420, -54614, -5936, 45149, -7433, -46517, 23453, 43509, -59288, -14519, 70472, -37516, -45642, 58348, 3861, -49751, 14004, 40177, -24720, -38417, 52052, 17734, -70011, 32182, 52038, -61780, -4115, 57710, -22088, -36554, 32510, 30479, -47569, -14551, 66659, -27394, -54400, 64161, 6070, -65338, 30336, 36508, -42808, -21044, 45298, 5705, -59729, 25435, 50748, -64889, -7757, 70468, -37712, -38193, 53589, 10904, -46028, 6409, 49608, -26066, -41346, 61412, 7320, -69741, 40848, 40840, -59096, -2724, 46912, -16665, -37511, 27559, 29697, -53481, -7214, 64508, -38251]
478c8251m236J02004o0735m6960P2050M220n8036J0268O4124l7914o3009Q7346
490C0871J1867r8764N7467M9255p9759N165N8567k1610n0343L2163N3350o9818
502b1589j9916R2371m8790n5933Q5406n264o8243L2089M6081l4912m3535N7949
514A5714K2986q5720L9908O4756r0296p68Q3243m2306m7040M5546L1105n3787
526a6659j5738P7094l5177o7948R0297P831r3261M8299M8687n8544j5581N2666
538B1966J357o5790L3705O5021q5038j4871R6979m9482n0727P0429J665n6089
550c0875J7317N4400l6381n5838P6401J8385r3823M7731N2066p9390Q079O1695
562C9767l5456m1739L9909L9598o2961j6426Q2149m1529n3117Q1891r156o8331
$$ y = [-38251, -42487, 59517, -1218, -48178, 23872, 28092, -29944, -19676, 44448, 6534, -56475, 30871, 42738, -56026, 1441, 50696, -29063, -23898, 34669, 13059, -37284, -5121, 48229, -21589, -41505, 50866, 2076, -53857, 31549, 26285, -41958, -9869, 36212, 1300, -42235, 15714, 38700, -47020, -7112, 57644, -32652, -33420, 49823, 7517, -39523, 6023, 37128, -16659, -32397, 44697, 9520, -58428, 31869, 39700, -53561, -5262, 43425, -15119, -30700, 21966, 23323, -42467, -8762, 56259, -28779, -43650, 53329, 3847, -46880, 23549, 25214, -30875, -13558, 40842, 4461, -51377, 25024, 43409, -50414, -2683, 49383, -30007, -21928, 39767, 4311, -37428, 2481, 42079, -20882, -37308, 44841, 3312, -49805, 32086, 22930, -45401]
574d5401M4943L5137m2876k4317M9200J2144o7447L4531N3326q0123K854P6002
586D7973m6337l6551M7577J2265l9993m099N1558k6928n0912P2099P056q0231
598d6523M2047M1339n2001n362L7047l657m0763K0942M8684o1900j8712Q1880
610D3021l4929m9476N9015M004m5424J4548L8176k3489m4241N4179K4521p9397
622c9492K9712N5790o7720k631N8666k8336l7672L1627L4700m7423k3436P1289
634C5074k4640n7831P0694M538p0729L8134M0629m3224k4138M5154J5093o0926
646c2172K2599N5601o9952o953P7927m3781m2216N4521J0318m3612N40M6233k2824
659F229m6935O2306J0633p6618M0690M2611n9022m55M2279j3629l4098K2472L8232
$$ y = [-45401, -458, 34679, -8197, -32514, 16686, 28830, -38617, -4086, 49240, -30883, -28029, 47973, 1636, -34915, 12662, 24927, -15066, -19165, 32393, 5465, -45447, 26652, 33708, -46523, -4476, 36863, -15138, -20500, 16547, 12890, -27873, -6931, 41753, -20147, -38859, 43021, 8092, -41384, 17631, 21635, -23789, -9241, 28935, 5446, -38795, 15384, 39905, -39492, -9780, 46010, -21710, -24341, 34325, 5989, -31683, -56, 34644, -12779, -36215, 35074, 10434, -47397, 23297, 27835, -42894, -4760, 35869, -7355, -31493, 13661, 28754, -32172, -9573, 46028, -23924, -30877, 47050, 3269, -38947, 15574, 25892, -17720, -17180, 29053, 6229, -40706, 21600, 32233, -44385, -3695, 38916, -20106, -20561, 21718, 8089, -26009, -3537, 34695]
672C4695n1982j5818P2425l3157m6527O1821k217m7018K6327K7516k7857k6736
684b8528M3306J6040o3788K4976M8117o0554K06N2638l2867k5486L2341J6531
696B2932l4981j3564N2264j6640m9361N6471P519o0122L3560L0741l9124j0394
708b0699L3038P180m2728J3369M7169n2341j3419O6081l3131l7320M7708M756
720A9663l5425M130L3082j4641l8742M5301J6487o6172K9756M3121n4252k655
732b0347M1389j5106k7909J9297K9913l9824j6160O2033k5764m6479N8919J301
744B1263n0033K7645K5343k8471j7163L4237J0980n1506K1005M4119n6601k055
756b1237N3962l3991k3912L5552O284k9647m039L9024j5164l9968M8126P277n5401
$$ y = [34695, -17287, -33105, 39320, 6163, -40364, 21457, 19240, -27778, -1451, 26065, -1792, -28528, 14778, 30818, -32970, -7994, 40123, -20431, -20225, 32413, -454, -25940, 6401, 22932, -12049, -25613, 26651, 10011, -39350, 17121, 24640, -35482, -1922, 28819, -10305, -20699, 12339, 19519, -23209, -9840, 37329, -15012, -28431, 37650, 4519, -32801, 14907, 19663, -15762, -11632, 21450, 6809, -31933, 13368, 29855, -36317, -6561, 36560, -17692, -20347, 21042, 5936, -21973, -2676, 27237, -12587, -28747, 33286, 7522, -38957, 19962, 21263, -28770, -1125, 24218, -4253, -21416, 12821, 23801, -27705, -6700, 37419, -19182, -21237, 32725, -1266, -25178, 10374, 16658, -12989, -17028, 21996, 6832, -33136, 14990, 22267, -33134]
769c3134L3228K6553m1149K04K8814m128k8109J2061L4125l9574j1500N3685k8646
782B430l0438M5014l110l0607J1738K0831j1722k6360L0094J5494n0467K0792
794f311L6449m6635O0L6725j8604j8722J6061J9496k5544j5788M6293j4547m1355
807c2422M7450N296m5295K3961K1627k4789j1409K4305J0294l9020J0887M1382
819C2267m4573j0337N0799k6396k5696L3325M784k5922k072L1159r589l7139L9029
832I639J4321n3356K5943L0768m1236n61L0310q260k3815J1863K8822l2737j4310
845b2609N0394k2939l3523M5454j425l5238J7903J8123j6358j8250K5813J2383
857A9728m3688J7606L4809m5042o8L9237k3670j6254K1484Q988k0730q709L4773
$$ y = [-33134, 94, 26647, -14502, -14298, 14516, 10388, -17721, -5660, 28465, -11109, -22609, 31076, 2430, -28008, 17006, 13896, -16711, -4973, 15858, 4136, -22224, 7870, 23364, -27103, -6311, 30138, -16497, -16437, 20288, 1684, -17038, -977, 18519, -7025, -22813, 23480, 8933, -32422, 15028, 20324, -24971, -1010, 20617, -4172, -15581, 8724, 19018, -20002, -9115, 32267, -12306, -22643, 28156, 1760, -23936, 9389, 14173, -11749, -13821, 17338, 7749, -29390, 9639, 23960, -29396, -3453, 27315, -13921, -14482, 15828, 7568, -16247, -4384, 24438, -8299, -22609, 27785, 4846, -28677, 16777, 15352, -19886, -1983, 16140, -218, -18468, 7345, 19728, -23960, -6354, 28455, -16587, -16655, 22582, -1088, -17342, 4142, 13130, -7600, -16309, 18464]
870A8464j1201l4617M0536N067m2061K5049J7946k7104j987J8831K886k5673O719
883g145L1780l3260j1237M3768k2332k2975L1780n03k0496K542J9368n052k7398
896b1160K6196J5448m3277J7562K9274l5936o55K7097r727j6924Q822K1595k2247
909c932j6316M1434j3205l4053L8457L344l4219J6447J6653j5614j3740J9687
921D943J2565l6046R429L5770l8802o636M0894k1489j8953K3622O769j9541n932
934a3407K8982p503l3212L5017R969m3232K3163K1542l1086l38K1288k838k0948
947a2603P341K6585k8629j1550M1510k0609k4706L4926k362k4413J0696J4809
959A0995r293j8426K1691J1934l6842J5576K7452l5997J423K8326j6180j1904
$$ y = [18464, 7263, -27354, 13182, 18249, -23812, 1237, 19183, -7921, -9908, 8923, 11809, -13864, -7145, 24635, -8625, -19862, 23906, 1574, -21401, 10379, 9876, -10620, -8078, 11290, 6238, -21160, 5036, 20484, -22793, -5231, 24043, -11893, -12548, 14549, 4822, -12102, -3280, 18315, -3932, -20248, 21186, 7981, -26072, 12385, 15729, -18490, -2043, 14610, -1004, -14744, 4943, 17508, -18538, -9109, 26661, -12141, -18777, 22117, 628, -18325, 5297, 12066, -7475, -13407, 15575, 8072, -25140, 9877, 19846, -23386, -223, 21319, -9767, -10105, 11183, 8345, -12603, -5262, 21323, -7306, -18856, 22654, 2045, -22661, 12265, 9903, -14510, -3814, 10995, 1702, -16724, 4967, 16901, -19941, -4365, 23087, -12910, -11487, 16839, 659, -11245]
971a1245J2959J0669j6444j0064L1168j0508k8828L4065K130l2187J9358J2021
983A3094j7775m247J3218O878k4090N011K8734k9657p612L5004j8455j6258K2658
996F503J283j4484j369J8340l388k5443K4440J1752l6436J6708K1390k7981J74
1009h511J8839m926j4432M819K0051j9763j3183L4932j3180k5923L1037N88k4211
1022a3863J1071J2136q633j3780J6043J2021l1204J0061K7749l2023k289K9784
1034A7073j6563j2566J5348P119j4150p640K4852o613k6640K9277M875l2592J8835
1047F15J3822k1294j275J3584K306j8067L611K3942k4333q134L2855j7205j6988
1060a6561K5027j442j5520M009J2728l548j8807J8552J1206l1605J3238K1109
$$ y = [-11245, 1714, 12383, -4061, -14125, 17043, 6535, -22293, 11772, 13902, -18285, 1073, 13094, -4681, -8928, 4290, 11168, -12922, -7911, 20823, -8834, -16446, 18558, 103, -16155, 6503, 7786, -6698, -8067, 10273, 6885, -18558, 5882, 17634, -18802, -2094, 19296, -8685, -8511, 10328, 5402, -9030, -4211, 15840, -3923, -17106, 17826, 4646, -21277, 9760, 10348, -13863, -2792, 9344, 711, -13069, 2974, 14995, -16209, -6148, 21601, -10422, -12711, 17073, 510, -12056, 3292, 10411, -3739, -11379, 13473, 6860, -19780, 9497, 14372, -18220, 615, 14437, -6857, -8132, 5452, 7758, -10309, -6698, 17244, -7089, -15223, 17632, 427, -16561, 8466, 7024, -8496, -4487, 8241, 4693, -14114, 4438, 15644, -15961, -2723, 18386]
1072A8386k7371J162J9412r488j0122O651J2728j3990j1464K7841q367k4255K7060
1085H183J571k3509J3034R554j0787p768J2363R321k4363N135K5839k6332m621
1098a2380K8024j5326j1995J6798L274j2507m536J9307l734k3897K3656P778l1086
1111a6624J5783J5787k2425p1J4388j588j4097L726J9304j9295r886L1141j4182
1124A961j9469K6119p26j7894P597J0378o338j2558J5511Q895k8256J1755K1362
1137A8337k7118N11K1140j2813q396J0206O573j2015p098K2511p536k1589K5136
1150G849J606k4142J5146Q804j4017j838R974M049j6483M128K0009k1288m652
1163a0855K5841j5655j0694J8569j380j0536J2J1754j940j7255J6075P945k5405
$$ y = [18386, -8985, -7823, 11589, 2101, -8021, -1370, 11358, -2632, -14096, 13745, 5378, -18877, 8183, 9754, -13755, -721, 8833, -1954, -9722, 2641, 11962, -12401, -7266, 18573, -7759, -12380, 15644, 318, -11677, 5121, 8395, -4112, -8648, 10659, 6925, -16972, 6684, 14462, -16624, -841, 14946, -7479, -7550, 6838, 5250, -8847, -5121, 14183, -5112, -14998, 16143, 1961, -17508, 8611, 7885, -10009, -2412, 7966, 1628, -10930, 4581, 13476, -14780, -3025, 18337, -8781, -8270, 12870, 57, -8339, 1867, 8440, -3575, -10673, 11838, 4302, -17287, 7849, 9455, -14687, 459, 9263, -4754, -6592, 3382, 7431, -9052, -4924, 15085, -6203, -10855, 14986, -669, -11363, 7206, 5826, -4710, -4698, 7056, 5116, -12139, 3936, 11881, -13524]
1176a3524J2716J4343k1243J771J2734m279q617K120J3877j2524r806K4421r030
1189B959j8276K2656L4j7508R003Q165o242q858J0363Q705k1398O040K0596k2869
1203f630k125K1173j1807q787J0879M124r766n818J7796l688k0830K0718N128
1216A0367k3964J3100J0574j5699m38J0431J219j3344K847J8379j7643p304K4823
1229A3348j2197j3111J9458j575j2239L972Q842l291j3232J2828Q338k3246R944
1242b161J5743k1055J066J4645p689o847N329Q121r597p491J9860o643j7389K0772
1256F664P98j7757J0559O864q573l852P534N668j5652L673J7369j8126l960K0124
1270A1333j1098q395J1725J161p648k963J1966j515j6908J5689O698k1767J0342
$$ y = [-13524, -808, 13535, -7708, -5937, 6797, 2518, -6099, -3979, 9898, -2626, -12432, 11989, 2959, -15317, 7339, 7373, -10135, -1132, 7033, 791, -8067, 2296, 11001, -10397, -4357, 16239, -6630, -8755, 12418, 611, -8176, 2703, 6827, -2939, -8757, 9039, 5351, -15479, 5239, 10367, -13597, -497, 10077, -5622, -6060, 4371, 5590, -7754, -4907, 13472, -4171, -11475, 13348, 1151, -11960, 7498, 5923, -6316, -2344, 6498, 3207, -10025, 2803, 11141, -12105, -2161, 13582, -7473, -6407, 8238, 549, -6298, -969, 7152, -2445, -9936, 9924, 3281, -14108, 6664, 7462, -10295, 264, 7128, -1445, -5297, 2237, 7905, -7747, -4074, 13295, -4831, -8791, 11333, 235, -8160, 3565, 4726, -2922, -5885, 6081, 4566, -12342, 3347, 10045, -11722, -1380]
1283a380J1272j5504L65R837j024r159J672J4186j2358q315K1745q816j4466J8564
1297F619n58j2880N387P377l658j0156R672Q283j9947O624J6290j9523q94J6455
1311I091r006o730P127N477q587n808J6520m512j6445J8674K424j9076J1136P931
1325H216j1564j344Q408K237j2342K968J5126j5811m314J9877j1459r076J4515
1338E437j556q150J018Q086k224j2116J2210N715j9223R549J1003j6093J947J0050
1352E653m604n567K537R127q845o533J7219o341j2758J6202p96j2345P103M803
1366D855m581n470O646O081j4829L758J4329j5795j818J5144q803n635P729K392
1380D003n917m450J1793j520j4446J3763M761j7454Q943Q205j0950p78P321J158
$$ y = [-1380, 9892, -5612, -5247, 4590, 3566, -5593, -3921, 10265, -2093, -10408, 11337, 2521, -11945, 6619, 6061, -6819, -1432, 5945, 2287, -7869, 1803, 10086, -9861, -3237, 13053, -6470, -7364, 9091, 85, -6645, 482, 5959, -2628, -8436, 8084, 3572, -12873, 5801, 8225, -10851, 285, 8216, -3348, -4692, 3716, 5953, -6389, -3421, 11705, -4106, -8420, 11457, -2, -9078, 5437, 3881, -4269, -3251, 4835, 2611, -9505, 2705, 8420, -10803, -1254, 9749, -6344, -4397, 5653, 1049, -4518, -1981, 7146, -1699, -8232, 8987, 2646, -10112, 6090, 5294, -7051, 52, 4855, 274, -5196, 1450, 7531, -7298, -3540, 10789, -5006, -6824, 8320, -483, -6118, 1611, 4003, -1914, -6364, 5429, 3909, -10537, 3226, 7987, -9467, -524, 7681, -3269, -4047, 3274, 4432]
1394D432q964J360J2864j1851o226J8107q109j0616J3779o14r003K788O371j905
1408B413j0236R465O633j7438O682J2677j5954P25J1254n817n171M584O175p327
1422a335n634J4738m765j3134J5668P40j3963Q230M961o847k825N929L820j1387
1436e804K614J2624j3576k595J5022q812o295R597m9n393j224P999j228j1216
1450h336J1123M414j5798Q266Q002j1547P90P004j444n826J388Q937q217o151
1464g395J5223n979j0108J2811o37q978M073M429k381o890O432O006j3480L714
1478c160J2049j3444p64J1931o434m716M926L985n429m653J1707k680j2420J3117
1492D015K376j3931P726N673p747j397N307K516r093J348J1497j1222m188J5226
$$ y = [4432, -4532, -3172, 9692, -2159, -8385, 9722, 1613, -9003, 4776, 4162, -4841, -2053, 4318, 2413, -7823, 1642, 8275, -9163, -2481, 10196, -5758, -5033, 6221, 404, -4767, -183, 5992, -1335, -6969, 7769, 3004, -10130, 5538, 6278, -7685, 545, 5506, -1341, -4166, 1763, 5583, -5804, -3190, 9434, -4142, -6737, 8285, -527, -6822, 2775, 2726, -2667, -3891, 4108, 2880, -8336, 2787, 7201, -8597, -331, 7671, -3876, -3086, 3918, 2474, -3352, -1964, 6973, -1244, -7395, 7828, 1849, -8259, 4552, 3915, -5063, -990, 3439, 1058, -5832, 600, 6606, -6874, -3160, 8889, -4555, -5319, 6612, 178, -4538, 388, 4373, -1056, -5709, 5998, 3318, -9102, 4015, 6391, -7540, 186, 5859, -1888, -3285, 2022, 4538, -4555, -3207, 8290, -2932, -7120, 8106]
1506H106q107p237J0468m33o260P80O418j567r326Q996M866j4448O747Q776j2179
1521d400J429P800l625m587K684O280o757n010J2908m767j0072J2649m19r925
1535e812N852L310l865l505M614M500j0722K905J0162j1439j115J1665o941m140
1549d531O138J060l641k873P897j002j0168J0064L141j2768O864N542q432L47
1563b362M648J21n378L64Q865p990m488J2738n877p375J0115q70o097J794M502
1578B710q74p305O103N639j2548M753R023j1263K52Q612m523l578K899M626n053
1593e27n041J0819k738j0162J1286O81j0588O403L781n164k122M296L077q285
1607d284J258J0126j0057k361J1731o490m919P784l71m196m74N570o96q801Q462
$$ y = [8106, -1, -7238, 3230, 2797, -3463, -2683, 3735, 2168, -7158, 1838, 6704, -7744, -997, 7779, -4400, -2971, 4829, 1204, -3383, -699, 5581, -1176, -6186, 6722, 1955, -8117, 4532, 4113, -5812, 40, 3350, -515, -4020, 594, 5094, -5628, -2723, 7439, -4000, -5115, 6550, -391, -4531, 1607, 2667, -974, -3847, 4050, 3048, -7120, 2944, 6085, -6683, 181, 5723, -2709, -2362, 2286, 2407, -2971, -2607, 6258, -1732, -6220, 6518, 641, -6734, 3381, 2511, -3586, -1792, 2710, 1836, -5469, 634, 6273, -6275, -1522, 7501, -3762, -3510, 5102, 579, -2999, -100, 4526, -527, -5568, 5251, 2513, -7649, 3637, 4318, -6270, 133, 3914, -1250, -3372, 924, 4001, -4284, -3026, 7100, -2957, -5318, 6413, -77, -4996, 2788, 2417, -1779, -2253, 3317, 2621, -6180, 2282]
1622B282L597j1933N759O311r360J224N160j690l909Q12O585n968m528J0997m275
1637A064p488R459o66o320L633K653j745m212M174M574j0141L102Q759r592p36
1652c482Q133m475l074L548K284l298l580P700j427q968R237J899j0115N441L803
1667C626n197j039L364J859n519L85Q176p597l366J1088n500n262P808m62m272
1682a908M02M211n65o965O269M141j0960M534O823q940N54N683k457l385J605
1697i58M735m413m742R895l064q098R764k53p363M380K932l047k726L653L448
1712D143q049K059Q230r173p26R028n810k742N036J32k929j900N528o86p747P394
1728A788K124r155N398L762o497N57L336n1l510L36O291n700l228R458m328n213
$$ y = [2282, 5879, -6054, -295, 6016, -3344, -2120, 3040, 1350, -2559, -1747, 4838, -1130, -5658, 5339, 1064, -6424, 3035, 2369, -3951, -318, 2335, 590, -3622, 552, 5126, -5015, -1913, 6846, -2746, -3482, 4651, 176, -2898, 650, 2934, -364, -3944, 3756, 2329, -6639, 2598, 4497, -5618, -177, 3626, -1571, -2610, 754, 2613, -2906, -2521, 5655, -1942, -5308, 5780, 280, -4982, 2826, 2364, -1908, -1506, 2705, 2140, -4825, 1444, 5585, -5375, -841, 5982, -2958, -2404, 3279, 822, -2563, -958, 3777, -636, -5378, 4517, 1453, -6645, 3119, 2866, -4497, -117, 2815, -232, -2958, 695, 4143, -3906, -1847, 6383, -2790, -3516, 5512, -298, -3040, 1996, 2128, -801, -2701, 2827, 2141, -5606, 1788, 3912, -5243, 155, 3917, -2580, -2023, 1313, 1262, -2248, -1912, 4379, -1321, -4549, 4909, 581, -4632]
1744d632P755j175m275K041K256p99m404L641M162q619K758O620q113O46N550
1759C412l441k127J566L032k882l827P338j374p690Q221P10p358M446K583l635
1774a026r59K307K827n667K70P555p076j803Q586m872l660N503j11k820j218M221
1790B057J15o906N586L236q987M327M673o883R92L663j370k413J82N109m232l494
1806d345Q416k876n957P534n67n155K967J885j176l118K798L639p311J891O293
1821D918p289j05O491m124k161K658J253j899k894N401m34o660O569J437p424
1836d263M535K450m337J66J900J660l664j96N978n069k922Q052l939l791N668
1851B228q13k594l2K455K80m845L478L921q095L059N255o728N45L993j873j908
$$ y = [-4632, 3123, 1948, -2327, -286, 1970, 1171, -3233, 408, 4570, -4049, -1291, 5329, -2784, -2138, 3412, -29, -2156, -590, 2442, -440, -4267, 3071, 1697, -5993, 2228, 2938, -4420, 26, 2609, -1026, -1985, 322, 3149, -2518, -2248, 5307, -1769, -3572, 5014, 142, -3518, 1985, 1874, -946, -2164, 2057, 2172, -4734, 852, 4088, -4899, -572, 4101, -2782, -1790, 1873, 503, -1910, -1728, 3381, -851, -4345, 4071, 1195, -4762, 2772, 2205, -2950, 17, 1902, 726, -2392, 406, 4045, -3266, -1375, 4918, -2371, -2476, 4015, -109, -2270, 388, 1641, -258, -3152, 2249, 1815, -4845, 1724, 3161, -4263, 272, 2722, -1615, -1449, 451, 2111, -1553, -1749, 4229, -840, -3762, 4290, 351, -3440, 2228, 1415, -1179, -1211, 1244, 1524, -3321, 157, 4078, -4017, -958, 4297, -2431, -1886, 2107, 234, -1674]
1867a674P95L178k408l873P323j950o031P052q1n158L012J871k068j723J981K839
1883C085n529O30O490o433j456O754l800k418L768J22j784j584L643jn994N576
1899A069K017p148L749L556n154Q60K309q7k332k00M553l684k725P000l298m021
1915c536O053j308l219J655J374j48l321K375L342o347J719N164n958K41M504
1930B590l100q57J238J450j325k987M990k30n673N460R04n268L078J778k597l38
1946h87J228J632l249q18N823m958j574O305l530k684L696q2k009l08K426P55
1962A766n147L835K558o510K847M154n222L65K925q82j664l19L859k328l592O749
1978C394k104m856N560n03l848K583Q06q07j905J281L033n082P99N299n714j74
$$ y = [-1674, -879, 2299, -109, -3982, 3341, 1391, -4640, 2412, 2331, -2827, 185, 2056, -12, -1735, 246, 3085, -2444, -1814, 4676, -1757, -3213, 3541, -259, -2677, 1091, 1213, -571, -2155, 1488, 1487, -4507, 1069, 3086, -4062, -313, 3243, -1911, -1051, 1258, 1171, -1161, -1361, 3192, -492, -3217, 3783, 485, -3536, 2517, 1209, -2010, -355, 1019, 871, -2450, -75, 3267, -3080, -1361, 3803, -2155, -1914, 2590, -510, -1367, -129, 1321, -4, -2991, 1999, 1769, -3904, 1556, 2460, -2808, 270, 2048, -549, -887, 341, 1973, -1276, -2094, 3729, -1229, -2803, 3502, -28, -2712, 984, 902, -1107, -1415, 1011, 1766, -3381, 454, 3012, -3498, -651, 3503, -1719, -1354, 1571, 689, -975, -1294, 2565, 237, -3355, 3394, 1290, -3566, 1994, 1491, -2357, 226, 1032, 225, -1680, -399, 2634, -2448, -1649, 3650, -2064, -2238]
1994b238M698k975j013J846O55j056k192L827K40n158M653J411n719L336J897
2009B212l285L31J283Q34k280o36M422l690k089N842k888k994M512q60j961N59
2025f88J190P04l765K506K974n670J879L841m786L68L126j478p87L7K387j366
2041D72l054M770q54m620M653N24m144K468Q49j050j132P30K587l859j17M940
2057C163m177j550M762k546j680K971J36j520j111K656P53m813L780K034n393
2072b535K493K640l842L08J843o6j525k41L067k020k974N449k012l614M531p59
2088G43k471J388R18j6k241J311K942m760R94M048m502N3L737k149q22R53N88
2105G14m01k220L554j98m331M211P05m562K920J024k100J09M51J529k445n28M091
$$ y = [-2238, 2460, -515, -1528, 318, 973, -83, -2275, 1552, 1792, -3366, 1287, 2698, -3021, 315, 2212, -1073, -742, 541, 1375, -905, -1541, 2881, -809, -2898, 2944, 56, -2938, 1574, 714, -1247, -688, 502, 1206, -2559, -53, 2921, -2749, -870, 2971, -1815, -1447, 1679, 201, -586, -549, 1838, 472, -2582, 2188, 1334, -3286, 1367, 1891, -2253, 215, 1064, 14, -1118, -388, 2199, -1660, -1777, 3163, -1014, -2564, 2198, -348, -2028, 943, 1079, -441, -1552, 1104, 1857, -2956, 824, 2858, -2535, -42, 2598, -1244, -936, 907, 841, -684, -925, 2142, 122, -2852, 2597, 585, -3029, 1502, 743, -1728, -340, 578, 562, -1679, -368, 2574, -2186, -1192, 2856, -1646, -1593, 2144, -5, -827, 126, 714, 313, -1907, 1647, 1449, -2882, 1329, 2034, -2528, 392, 1416, -684, -575, -124, 1405, -1040, -1568, 2523]
2122B523l165j672M593k587j522K953o61q03k97J057J027l443K304K237m646J745
2138c57K833l482K13J847o29r15n99K739j253k950M350j033l499M058k61k551
2154a489J476O20m89j324P88K776m033L72M251l763o83L851k554p30J529R3o70
2171B1j341K448O9l575K935J467m473K561J450k723P64O87L36j359o54L471k389
2188c05j932M442k150k463L619q32j378P65O79O45k686J567K290m131J270L125
2204B525m046Q12K285j605l29J24J293q04k162K954q3l523L393N63l184K009K61
2221D83o72m64K51J882k598j74L583l084q59L753k018j251K007l77m52p88J526
2238G48N94l055K007J712m053J620K067k514K82R42j31o95n29K448j283k424L995
$$ y = [2523, -642, -2314, 2279, -308, -1830, 1123, 462, -341, -638, 419, 1446, -1997, 307, 2544, -2102, -357, 2476, -1006, -793, 1054, 425, -490, -1089, 1650, 397, -2553, 1797, 764, -2735, 1323, 1062, -1489, -13, 607, 118, -1206, -418, 2358, -1675, -1303, 2948, -815, -1498, 2353, -201, -931, 598, 691, 21, -1320, 1128, 1197, -2378, 557, 2024, -2449, 112, 1562, -1161, -397, 290, 626, -733, -1387, 2084, -305, -2237, 2205, 55, -2408, 1211, 379, -999, -234, 445, 1090, -1596, -29, 2261, -1870, -600, 2525, -1521, -709, 1576, -29, -358, -234, 1059, 255, -1907, 1047, 964, -2559, 834, 1397, -1787, 222, 483, -189, -653, -402, 1480, -1118, -1292, 2291, -793, -1652, 2101, 83, -1168, 839, 462, 10, -778, 748, 1342, -1713, 294, 2006, -2047, -427, 1640, -874, -592, 350, 219, -476, -1005, 1443, 160, -2264, 1731]
2255A731r82l159L641m91j988J282N13K67j828Q69J975l066K77L347l369rK704
2272A714j868k61N90N66n38j713K510k24l221L020O82l013K101N94j683L40N32
2289A28Q73j399q01K975k375j043L487j680j520K401o30o65j33O30P00k386J561
2306A23J698l511J113K280k944M86J445p39k24m05J665p37k142L326o94k606K833
2323I67k44j927J337K74j34n73J23J952k822K54K686k519n50K441j144q56J075
2340C40n9j20j131J492M55k802K221J222l521J549J770j805j19N05N86j086l37
2357h40K367j346j690L245j299j885K650n71j068K19N04N16j702Q44J582k815
2373a289O75K504k612P5K013j575k76K76P63j59j825K733k26k965K530M17k560
$$ y = [1731, 749, -2410, 1231, 740, -1248, 34, 547, 814, -1014, -145, 1830, -1236, -959, 2388, -981, -990, 1714, -154, -415, 175, 741, 203, -1510, 1000, 776, -2445, 575, 1257, -1756, 345, 939, -744, -404, 128, 1001, -398, -1199, 1776, -599, -1642, 1845, 165, -1355, 1046, 416, -249, -382, 248, 948, -1438, 123, 1821, -1690, -577, 1703, -1241, -755, 690, -49, -273, -678, 987, 250, -1892, 1434, 740, -1866, 967, 723, -1204, 133, 407, 273, -300, -177, 1775, -1047, -793, 1893, -626, -1176, 1265, 121, -735, 340, 281, 161, -970, 522, 977, -1825, 396, 1618, -1903, -354, 1416, -389, -508, -3, 583, -503, -840, 1527, 181, -1509, 1736, 437, -1448, 1202, 631, -437, -218, 286, 802, -900, -56, 1526, -1289, -614, 1890, -722, -647, 1366, -209, -485, -209, 554, 395, -1430, 1303, 1077, -1888, 642, 1059, -1501]
2390a501J871K16p28r9J93J076j522m63K776k392n73K786j742q31J535m33k50
2407h1l95Q16M53k221J417J250k845J305J477k223O62O34%k91r62J980r21j479
2425a424K713o70k138K435m53j234P77M49l1j018M07J796k632J82K420k285k29
2442i35K109j370l03K10N99l72j179J915J11k508J868J191k776J693N36j292R6
2459d07O10N42q77p75K186j628r62K659j294j276J961j53j033J42L90N82j607
2476i40R17J444k655Q89J777k242J80J069l20l09n4Q69m58j298K053k11j991K036
2494G56n2j535J027K64j17p35L00R60j465k40K307j969m87K253j527l80J052m58
2512d6m2p22J229L24j920J476Q72k670J500J098j572M53L94J58q53l09J601p65
$$ y = [-1501, 370, 586, -142, -241, -48, 1028, -494, -957, 1819, -573, -1146, 1640, -102, -933, 602, 169, -81, -476, 340, 793, -1428, -11, 1239, -1606, -301, 1176, -1047, -385, 249, 249, -42, -1004, 976, 55, -1424, 1289, 619, -1519, 916, 463, -771, 6, 455, 424, -594, -187, 1609, -1023, -841, 1579, -706, -935, 1174, -196, -499, -289, 310, -62, -1241, 674, 785, -1723, 145, 1336, -1440, 253, 789, -503, -407, 203, 745, -132, -907, 1279, -349, -1311, 1348, 54, -1222, 739, 586, -447, -305, 85, 667, -940, -23, 1421, -1234, -345, 1432, -810, -630, 439, 119, -190, -244, 625, 167, -1131, 922, 711, -1280, 756, 704, -831, 196, 460, 343, -392, -92, 868, -597, -837, 1470, -499, -986, 1267, -260, -640, 412, -46, -88, -810, 419, 743, -1177, 299, 1171, -1499, 1, 1099, -473, -20, 374, 532, -321, -630, 971, 206]
2530B06j473K409q66j434J574J5q28K85J05N41j326Q05J041k101M02J945k059
2547g59J34J162q82Q7J08M75J31j409J643P7j957J618M68j990J538m8o53J14j43
2566b86R67j107k94J975j612n07J866j216n84J137k09l53m55P55N98j784J166
2583E7J077k119O88J335j743O61N67k10n64k44J078n22j104J990l79j672J649
2600E45k9j076M51m4K68p31J95J172j377j91J714j484j78J684q26k63J87L28r6
2619B49r82J300J79j786J393O27j833R31M90o72P4P9M36o91l96J700j128j088
2637a118K037j072j112J664l35l56J06L66L73j278P59Q98j800O54J438j585J80
2654a81R52r06o2j0P54k52j363J925k03j915J969j30j251P98J61l09l15K39N49
$$ y = [206, -1267, 1142, 276, -1158, 416, 431, -397, -112, -7, 534, -792, 13, 1054, -1047, -645, 1300, -759, -625, 537, -345, -258, -150, 325, 456, -953, 690, 767, -1190, 428, 896, -1094, 444, 396, -257, -143, -286, 681, -426, -720, 1255, -357, -864, 1002, -214, -798, 339, 130, -223, -678, 77, 675, -1109, 57, 1134, -985, -297, 1038, -705, -44, 523, 313, -251, -495, 583, 61, -1043, 947, 568, -1104, 545, 516, -560, -109, -153, 115, -616, -421, 751, -626, -817, 897, -587, -765, 919, 93, -170, 17, 345, 249, -733, 567, 746, -1040, 353, 980, -853, 78, 568, -104, -30, 49, 485, -206, -602, 1098, -30, -1118, 919, -153, -1265, 399, 64, -292, -186, 180, 553, -725, 34, 932, -868, -214, 1224, -361, -181, 771, -135, -197, -207, 547, 295, -1068, 857, 654, -1261, 708, 578, -673, 125, 286, -23, -338, -99, 450]
2673D50r98p1J615j468k44J501p60l23P17o16L23m55O65K64j516J009J006k058
2691i59P81Q71j152M06K62J69k23p72J178n61r15J699o21j055J243j84m04K83
2709D6O1K11p47j28J482j320k22J568j387N2J132r39K09m3K42M47j684J407K07
2728E94j441J013N72j746J177K26r11K42O6Q96r54n66J767j127p06J787q80p37
2746g28J268n02k6j76N64J22j342P34R19j466M92J219j347j22O98k67r3l24Q79
2765E02l81j109J707l68j303J378j30r78P82O1o5k07K31O82j125j01J297j273
2783d00l1J245j000Q2K39j63N02r55R59L36j910J337L77j613J265J02q52M93k15
2802b02M27q6p62J370o94p16J442n93p87J039m62M3j68J98M68q58J39Q84j073
$$ y = [450, -548, -619, 996, -472, -716, 785, 25, -298, 419, -197, 126, -329, 336, 600, -916, 93, 1099, -959, -178, 693, -459, -53, 209, 378, 155, -617, 561, 0, -915, 784, 163, -892, 351, 167, -237, 46, 107, 318, -429, -557, 925, -395, -617, 951, -436, -384, 748, -191, 18, -25, 217, 664, -1020, 387, 594, -847, 166, 738, -1008, 169, 395, -516, -274, -208, 688, -266, -832, 935, -192, -898, 889, 9, -728, 540, 38, 12, -164, 400, 522, -820, -86, 833, -633, -141, 1078, -269, -391, 307, 40, -53, -377, 502, 121, -988, 719, 351, -952, 426, 296, -682, 100, 161, 96, -111, 120, 802, -323, -424, 873, -400, -431, 814, -186, -104, 135, -28, 474, -481, 478, 814, -1096, 241, 618, -995, 270, 372, -480, 13, -202, 225, 139, -623, 747, 53, -663, 779, 186, -601, 438, -24, 19, -149, 49, 517, -341, -202, 682, -391]
2821c91J18J068j353L07N74m98M41o17O41k18q54J268k39j030J032J27j085Q28
2839A19Pq0k40r0Q14p58j23J392j255j83J010p12l50N40J64k89oj0L20j145Q74
2860aQ12j553N40Q86j301M59J23J86l96l42J247m61r95J507m76r57J239m54k01
2879a38K90K8K27q20M99P71j316K20J090j363M31N96p53J85L3J08J35p75R14p6
2899B86j076J231Jr97O55k1j73J40QL83m54l38J172p06q21J285l67m30P35o25
2919a12l4o1JN71r57L87J038j521N86Q45j056J32M66l98R9k12N67k44p87J096
2939D06o6j057J287k54p27M96K24j18l77j68R00p30k75J000q48q2P83o52J03K48
2959I3k02K55m06N32N9r88Q36M52j322P05M37p02L49L0J01k59j76Q62p14o89J464
$$ y = [-391, -273, 795, -558, -251, 323, -175, 266, -351, 290, 72, -782, 486, 247, -783, 249, 376, -709, 119, 126, 46, -194, -284, 530, -228, -351, 1041, -214, -397, 613, -99, -449, 91, 255, -34, -40, -50, 270, -875, -1, 811, -742, -202, 684, -617, -158, -35, 151, -245, -587, 660, 199, -796, 711, 235, -722, 517, 63, -138, 152, 180, 407, -413, 86, 857, -459, -239, 851, -512, -81, 515, -238, -53, -20, 88, 223, -552, 362, 286, -790, 441, 442, -555, 100, 79, -94, 46, 54, 437, -17, -355, 817, 111, -710, 575, 208, -222, 513, -112, -146, -207, -206, 365, -592, -205, 833, -688, -102, 743, -313, -181, 285, -113, -14, -226, 341, 97, -690, 406, 340, -717, 570, 316, -411, 85, 309, 191, -186, -354, 546, -184, -459, 541, -307, -389, 394, -258, -155, 93, -109, 146, -260, 272, 331, -657, 179, 631, -691, 14, 451, -251, 98, 128, 229, -30, -206, 656, -58, -747, 717]
2980G17n72p01J068o39Q6K30k28M78q97L03Q16j161J67R33j162M13K16k72L10
2999A05l99N39j42p10P53J8r13J104j55p92R31l45m0Q0m67P21o34L3R05q28l38
3020e74J122n83j84J94k0K17p26P63K10j196R31J91p96M44L70q24L57L54j82J1
3040G9m37Q48l82o73J056m74m89P22l44k18M47j61J03m07K03N59r00P8R34q04
3060b60J10O70r75M32JK72q0o95P56j27p54J142L0r10P03Om33L5j52O58m50n32
3082e53R57m55m61J144r70q4P29m87J52M1q6N50q88K05O89r98L94Q09r70L20L03
3103C41l84R2n07P31J97j143J049j15r58J181k74m69N05j85m5o1m55R75p87j57
3123d69R24p35L0O33m91k69P55m02J15n29K99N09q79O94K75q50N88J04l46O3j6
$$ y = [717, 145, -556, 512, -127, -41, 189, -39, 439, -458, -155, 661, -500, -333, 600, -562, -149, 67, -205, 105, -294, 245, 103, -607, 146, 164, -749, 355, 200, -592, 339, -6, -46, 34, -433, 288, -346, -313, 592, -236, -574, 548, -35, -219, -25, -45, 172, -554, 209, 419, -777, 154, 345, -451, -7, 363, -461, -104, 250, 68, 79, -358, 490, 108, -565, 491, 17, -472, 250, -94, -312, 135, -26, 77, -330, -127, 432, -468, -390, 544, -260, -150, 520, -455, -23, -22, 250, 170, -525, 231, 104, -650, 492, 522, -388, 315, 321, -112, -77, -229, 429, -21, -553, 404, -51, -512, 632, -338, -422, 307, -180, -28, 13, -73, 477, -411, -206, 483, -515, -121, 688, -282, 38, 341, -43, 49, -458, 273, 470, -673, 376, 261, -697, 484, 210, -259, 246, 61, 16, -45, -500, 475, -312, -469, 455, -280, -250, 383, -108, -377, 378, -24, 91, -438, -139, 370, -509, 185, 460, -390, 198, 302, -44, 19, 3]
3144CK41p1l66N81k29o22Q32l31o46R78n92K81j00l8J84n33J75Q71q55r1R96j131
3166d63M12M58l15j10o8K39j27l33R37l39r22J063q2n28M11j63o9r0j12L30l63
3187b34k37J208o80q07J267r40R7O37m61K93m44J14N68q04M43L72r05N26M16o97
3207b68M45j34Q1j01m38P96j50p15R42p15l23R01l98q7K51k73J54j64J5Q20j352
3228g13M07P33q07M02K39n61L96J7k16J4N8K53K27j072R30J91j027N48K1k10J34
3249c6kJ1K5k46Q43o39j69N67m39j9K80k30K00k77J89M31p22J67O32p32mO00o08
3272a78l1N56m14P9j90N35k17l55N38k44l82M88m3l65R2J4P8N6l07M62n35K10
3294a53O96n36k86O33n71K02J5J21j13N3j38N00o83L15K40n05l1L85l43L10j26
$$ y = [3, 244, 173, -193, 388, 159, -463, 369, 38, -608, 370, -222, 59, -41, -79, 105, -428, -253, 618, -237, -328, 668, -463, -51, 407, 92, -18, -86, 153, 26, -307, 630, 291, -631, 432, 350, -178, 233, 70, 1, -89, -201, 129, -234, -471, 737, 57, -750, 517, -423, -326, 311, -150, 143, -301, -187, 381, -423, 20, 392, -513, 13, 429, -268, 177, 43, 124, 23, -415, 381, 231, -484, 458, -257, -580, 321, -77, -164, 87, -186, -32, -196, -181, 639, -713, -306, 427, -380, 22, 261, -300, 96, 113, -103, -89, -31, 222, 449, -623, 307, 498, -529, 19, 40, -170, -36, -38, -27, -2, -248, 595, -44, -213, 354, -85, -104, 176, -54, 146, -131, 58, 489, -233, -66, 566, -166, -170, 430, -178, -209, 347, -67, 12, -178, 357, 140, -215, 323, 79, -303, 185, 142, -223, -131, -117, -39, 17, -290, 172, -363, -153, 543, 7, -279, 354, -217, -15, 0, 121, 8, 61, -77, 423, -260, 55, 295, -210, -241, 144, -199, 111, -15]
3315a5L47l47l15P89m11m03L82j68k33O90k79k37L59j07J16l03N0L97o46K81L37
3336B84o55M63J29m33L22m51L83L6l01M99n4q90P07K92p71N96j59j58K1k01N29
3357A88k13j26O90m30n07P83l84k11N85n16L41l09O8K00j46r8O14j203P57K38
3377C21n41K75j18K77l85M0N04k31n15O05k73n34Q99m03j94L96p1O2j21j50K66
3398A09J0m34O21l81j58N60k86k27J59R3K5m68N24J63p38Q56l07n41L35J60j35
3419f0J82l43M10j82m38R76n01l42N97k47p5k6j13L25m7j76L04n22K17N14p84
3440c31J91L84n10L29j58J08j2k55M85k23l36P37m79l58Q02o2n97K49Ol37J52
3461b15J02M51n03LN68p07J81L10l80J28O3K12j49l23M97j91m51N84k43k36K19
$$ y = [-15, 332, -15, -330, 459, 48, -355, 27, -141, -374, 316, 37, -200, 159, 52, 168, -135, -85, 312, -334, -53, 284, -371, 92, 221, -212, 110, -341, 42, 78, -223, 276, 222, -668, 39, 331, -440, 156, -3, -161, -140, -341, 188, -25, -151, 539, 109, -398, 385, 1, -210, 375, -141, 200, -109, -41, 159, 13, -85, 529, -674, 83, 321, -220, 55, -63, 214, -171, -131, 373, 142, -373, 232, -41, -575, 324, -79, -273, 123, 52, 114, -7, -157, 109, 119, -315, 306, -75, -233, 327, 41, -186, -27, 66, 91, -377, 147, 310, -428, 428, 121, -420, -85, 75, -60, 122, -221, 189, 7, -431, 545, 44, -298, 299, 52, -23, -49, -162, 163, 116, -60, 244, -278, -61, 453, -331, -140, 244, -266, 63, -95, 13, 1, -254, 231, 8, -328, 409, -70, -428, 374, 312, -285, -36, -30, -367, -215, -113, 338, -165, -162, 406, -301, -120, 190, -190, -62, 1, 213, 64, -259, 238, 47, -404, 180, -63, -299, -80]
3482h0L32j75j79j10J35j4j29M96k87m31Q36l60j70L64j32r6R9j79L92l17j14
3503a19K94n20J66O93p56p5O83o44J06q4K75O5l69K34L97m43M20l17j89K97j36
3524b2l91N23j43M23m38j17N75n65j2M98l34pJ47j66J25m5k0N8n48L37L44o08
3546c86M38K84m56j25J95N1K4l87O14j54l73N87k49m68O51j64k45N31k59j9k78
3567a88o8N40m40L0N50q96K19M01m00J58k7J16J28l57L66K56o86N61R3o63O26
3588C19j41k17m5K3R8Q5l73O47n89j1N49k65k14R4j35K61p9j65M19m68J29M19
3610C41o82K92J52j29J41j39J53M3k80P6J67l14M15l29j14M52l64k06N50k00M6
3631G1o2J25J79o98L14M00l27m20P44m48J21qj0K4j57M4M37n33J21L63n94O22
$$ y = [-80, 252, 77, -102, -212, -77, -91, -220, 276, -11, -442, 394, 34, -136, 228, 96, 0, 99, -80, 312, -5, -119, 175, -345, -179, 514, -242, -317, 366, -278, -172, -256, 19, 84, -285, -51, 346, -97, 323, 6, -183, 114, -22, -413, 110, -33, 390, -48, -165, 410, -155, -167, 331, -3, -10, 137, -29, 96, 51, 31, 89, -459, -122, 222, -386, 52, 336, -120, -245, -50, 1, 25, -362, 252, 98, -275, 312, 63, -405, 246, 82, -163, 368, 109, 90, -188, -256, 284, -156, -126, 424, -472, -253, 148, -252, -94, -121, -5, 123, -234, 132, 388, -298, 263, 356, -307, 319, 178, -39, -84, -61, 37, 122, -251, 396, -193, -204, 345, 80, -134, -40, -175, 86, 7, -158, 261, -207, -78, 341, -341, -49, 103, -26, 115, -24, 129, 172, -108, -32, 135, -179, 236, -93, -207, 245, -119, -325, 225, 25, 71, 9, 134, 313, -385, -71, 329, 2, -418, 326, -122, -1, -9, -19, 5, -152, -108, 329, -204, -83, 280, -314, 308]
3653C08k7n54L33M4k10L83m75P01n60k33M94m21J47K90j15j00k8P7J78m66J0M22
3675A98l98q9O71o66J45L17k50Q9j78L17p0k92N66j58p64Q02K6n88O46k43j20
3696c9n9O5O6l29J44M62n34K11J07J08j93N8j60l1NK09J14j60P4R3m42K80L00
3719C49n52M15q7m7o0m1J87k1p4K73k40n21L72J26p0p1k46M50m15J55K81m24O1
3742b00M17j81k41M94n10J90J09N4N8j95p4J49k69L18J32m81M69j10l46J30p2
3763a59L10Q4m55L67k66j94N85j71l33L55K3k73K16K4k5k96L41J97p64J96O62
3784D24n24J68j41j79K93k32M23l24l28O54j33o04O91j67k63J71j43K57R2m38
3804c03L24r2J16J11l59J63K98k31MJ3k69L54k80L19J49m77M34j30n18M75J13
$$ y = [308, 281, -273, 60, 104, -106, 277, -198, 503, -57, -290, 204, -217, -70, 220, 105, 5, -23, 54, 232, -234, -224, 198, -200, -289, 382, -284, -139, 178, -72, 17, -161, 156, 86, -206, 360, 202, -562, 240, 266, -322, 324, 81, -39, -98, -33, 33, -296, -152, 310, -224, -13, 94, 202, 9, 67, -93, -124, -119, 90, 204, 44, 118, 211, -231, 49, 349, -203, 212, 125, 78, 18, -23, 164, 143, 69, 342, 102, -419, -47, 79, 9, -62, -308, 142, -273, -118, 163, -261, -200, 217, 36, -205, 289, -221, -31, 78, 132, 190, -5, -79, 70, -199, 119, 251, -230, 239, 129, -217, -87, -159, 151, 235, -220, 147, -119, -313, 272, 101, -232, 123, 146, -127, 89, 113, 88, -208, 133, 330, -434, -238, 424, -100, 68, -73, -252, 41, -191, 232, -92, -420, 234, 101, -503, 188, 21, -242, -71, -214, 43, 135, -303, 21, -71, 45, 156, -203, -40, 258, 27, 31, 44, -225, 129, -151, 168, 317, -160, 274, 144, -374, 101, 214]
3825B14m37L36L2l33J61l9K89j47l66P42k25l75J01J72r1M2k68L98k78k7M54k77
3847G8J9Q6k27l6L06m83K50J96k12J20k69L98k06l16L34j46j30L65n5n00L19p2
3869a81M55j58l90N81m80j56K36J06k40N09l83L72k66j61K28k73K38J43l37J76
3889A9K59l70k3l0K08r9q7l3O89q85O34l21j51L15Kl87L03J16j28m8q6K05n2k57
3913b07M72l94QK14k79K94j74K09k59P1R0J42l21K30pl56M1J37J96o8Kj82M9k43
3937c35L44jj23M90k20l52K69k04K66p6j36J29n7J19R4j48k42L44m23M17j49k24
3959b18K31R0l18L37l88M32j71l25O67k35j25J98j72J14m0l57P25m98k02M37k21
3980c9k3K62m60L38p6J7K25k26M4J00l63J77K7k73J91J26m57J87N8J46k5o0K49
$$ y = [214, -223, 113, 145, -188, -27, -66, 223, 76, -290, 452, 227, -148, -47, 125, 34, 76, -192, 206, -72, -99, 355, 78, 97, 183, -44, -80, 226, -257, -7, 189, -23, 97, -172, 226, 20, -296, 38, -108, -238, 127, 72, -428, -109, -181, 274, 116, -274, 307, -173, -329, -93, 13, -227, 282, -101, 271, 5, -156, 72, -201, 37, 180, -157, 19, 278, -92, -115, -145, 63, -36, -123, -156, 533, -352, 282, -39, -190, 125, 127, -260, 43, 159, 31, -17, -103, 102, 50, -207, 265, -129, -121, 93, -186, 108, -66, 143, -116, -45, 45, 187, -134, 96, 89, -267, -226, -89, 107, 39, 41, -141, -92, -335, 9, 8, -115, 375, 155, -197, 72, -132, 134, 58, -78, 51, -6, 113, 207, 59, -183, 161, -262, 155, 6, -218, 13, 103, -215, 122, -266, 166, -5, -330, 337, 102, -23, 175, 3, 117, 77, -280, 445, -53, -255, 182, -39, -62, 200, -260, 78, 2, 19, 244, 18, 62, 162, -201, -24, 3, -270, -79, 47, -410, -223, -165, -19, -44, -104, 145]
4003A45j35l47O21l18k02M72o0k51O1j17J96q2J6M10k38l79L44m36M09j42o5K46
4025A48j29o2p9l91M13K02o10M41K02j94J0j54K82K7k75K17k03j69M13j07o5L35
4047B52j87q6N0j52L2K04l77L69l49K19J77l70R5k7k0K63N6k83K47n47M88J2l63
4070b97K94j1k20M07J94n00J19Q0P8l52K99L15m95r4M70n52m3L72k00J89j36l5
4092a18J16n7J11J41m94M11j78k70M74m0j40L2J7K14k65j65L40O1m28L99k02k76
4114c17L91j87J24j89kK38kj04L51n23K99l0j81N2J75j15l7J44j48J4k16L55J30
4137B22k87M92k64k71L11k59j51L7n4K51k07K46J41l15j59M76n92N51q4l05q5
4158c06K82j32K45j07J61j22j18J22K05n86N74p8l70K20j46K85k9l86K72J00o6
$$ y = [145, 10, -337, 284, -34, -236, 236, 176, -75, -14, -131, 65, -17, -1, 409, 171, -208, 136, -300, 109, -33, -98, 148, 19, -43, -122, -513, -100, 102, -508, -67, 135, -59, -49, -203, 79, 106, -169, 48, -155, -324, 89, -18, -83, 252, 65, -21, 29, -123, -91, 113, -264, 105, -244, -25, 152, -218, -123, -150, -170, 93, 149, -134, 113, -434, 54, 66, -297, -3, -14, -234, 173, 367, -133, -14, 66, 144, -208, 91, 406, -89, -183, 287, -265, -308, 64, -136, 53, -83, -118, -2, -59, 52, 193, -301, 110, -68, -338, 136, 96, -44, -12, 5, 219, -46, -211, 129, 190, -238, 161, -41, -317, 74, -113, 11, -178, -180, 58, 56, -48, 303, -220, 79, 49, -132, -80, 95, -20, -57, 87, -61, -47, -263, 92, 222, -65, 427, 163, -108, 203, -56, -207, -170, -224, 27, -180, 66, 207, -108, -267, 209, -383, 168, 84, -221, -306, -24, -156, 89, -18, 143, 21, -97, 25, 230, -356, 218, 140, -230, -10, -156, 129, 100, -286, -14, 86, 20]
4179B0k1J07l23K51j20Q8k11j2K17p6q2P8L7k73M65j16k8j54J70j4o3K12k34k37
4203c19L43K74m11L71j68j54J82j22ql13P4M21j53J09k7j68J47J14j56j07R7M4
4225G0K76k16j75J61k15p5K42r0p1J66l73L45p6K92j24r9j33o4J28O3o7p0J35
4248C0L2q9L5j67M93k66l90L30K1k80M52j97NR3k46K74k14K73L4j94%L62m89M1
4272e7RO3NP9k21K49k30L39l08j97L01p2oK51k50O8K30l61J68j49m7L54l67M18
4296B69k38j99K3K65j36L02l01J11j19k67M41j0n54N39r7j05L96l44k88K27L1
4317e4J20O0m41M75k0k56M0R9k0o1L7Mn2j45N61k96k97M63l03L00Ok93J88j33
4341a8l3l6P9j43K00k16L64l35J50P3j22q3J16k8K86l28j56L60j44o3L66m18O7
$$ y = [20, -1, 106, -217, 34, -86, 2, -209, -221, -4, -80, -162, -84, -47, -320, 145, 29, 1, -153, 17, 3, -60, 152, -82, -319, 24, 298, -113, 258, 90, -64, 118, -4, -12, -325, -251, 170, 17, 126, 99, -69, 78, 192, 36, -71, 26, 70, 346, 130, -45, 116, -99, -174, 68, -22, -93, 73, -300, 45, -31, 261, 137, 38, -95, -159, -31, 32, -35, -105, 30, 62, -27, 8, -159, 334, 68, -322, 8, 29, -251, 201, 4, 9, 102, -144, 130, -84, 189, 223, 29, 29, 391, -98, -57, -48, 15, 20, 99, -122, 127, -103, 236, -72, -269, 32, -40, -46, 205, -45, 23, 253, -108, 60, -89, -136, 218, -149, 269, 31, -168, -145, 120, -16, 286, -15, 96, -23, -290, 151, 141, -413, 126, 29, -76, 320, -24, -312, -85, -54, 66, 126, -315, 160, 140, -116, -76, 23, 3, -58, -21, -17, -69, -214, 347, 51, -246, 217, -86, 214, 220, -73, 115, -18, -51, -87, -8, -151, 49, -167, 197, -138, 12, 85, -37, -120, -4, -32, 254, -74, -230, 130, -14, -77, 289, -129, -62]
4364f2O4m0N7j45J64J54j61J02l9n1J73n9k08J81j84N9Q8o7j82K09l11J33j53
4387b78K88K27j75L6r6Q6j52J48K9O6r4k65K69k27J08J34j59K47j73k16K4K15
4409D2q8L0k91K04J38LP8j8j60Mr6m4J96Q2P1n6j92K80k24P3k4J37Q3j89J04l08
4435a65K40j75L66l56L2J71j69k2J39k92M00j61O7l2M9j29n2j05J84jK02M3l36
4458a02k6M4rK22j71j51L78j75N1o3J30R2j81j49o6J55nL15m72M7J52m32K47J70
4482Aq1K05k85K36o2l03L13K3N3j36J51k88K99k63N95l80k19J48K8l07L21j72
4504a23j12N45n20Q8K75m73M69p0r9L40l84J26k1l4P2j50KJ86j43j71M63k01j84
4527a19K17j10J33l32m4K05J56j32J70k44K82j80k4l9k7rJ38k95L19J04l27J59
$$ y = [-62, 2, -38, 19, -126, 38, 192, 31, 133, 94, 43, 216, 157, -51, 130, -54, 5, 93, 26, -156, 53, -258, -125, -278, 10, 237, 62, 98, 2, 88, -64, 84, 113, 179, 85, -180, 89, -138, -30, 104, -55, 192, 19, -197, -173, 42, -46, -16, -307, -103, 35, 38, 116, 98, -62, -58, -154, -198, -2, 80, 151, 95, -97, 183, -41, 32, 8, 145, 228, 39, 143, -165, 75, -100, 266, -90, -58, 113, -56, -78, 61, -231, 169, 8, 75, 43, 92, -37, -89, -194, -10, -11, 191, 234, -102, -128, -84, -93, 129, -42, -193, 185, 10, 61, -2, 128, 220, 39, -110, -176, -21, -26, 289, -183, -136, 16, -416, -169, 1, -80, 125, -160, 76, 14, -289, 24, 47, 100, -36, 115, -173, 126, -137, 458, 78, -141, 7, 35, -272, 49, -123, -235, 310, -210, -122, 153, -320, 149, 79, -20, 320, -64, 62, 41, 7, 79, -71, -69, 117, -26, -197, 266, 65, -119, 98, -12, 121, -211, -255, -50, 106, -26, 144, -100, 182, 2, -22, -61, -88, -97, 41, -254, 65, 169, -158, 1]
4549Aj78J05R7j54J66J11m3O5j5k88M54n02J90nJ0J32j98M04j71k16K5N4j77Q2
4573e1K20j93r5L23k95r9Q3J72J14j37J6k14Q0L11n1l47J20m6O0J1o9J93m08K91
4597a1P4k86P8M8j1j72N89l61K12m00J26K92l44K22k60J33J28L0K9Jl8j57R7l23
4621c04M12J33j55K8R7l20O1J90j02P8j84J91l70K88Q5j36j37L11l19L27K26l31
4643F9L1j0r7l5q2K99j7l73M74q3k53J88j37jJ94l36J07L37l80J10r9k1J94n1
4667B8j65L80q4R0j51lJ60l19P6J98m85M14rJ42r6j64K06k66Q1q8K14l75L72k56
4691a00R8J85J05l14j13M1M20k74k11K20j28K2J52k43L84p1k06j39R8K95j84J0
4713D7j34K35j26N0K2p6Q2R2k57K94k72J00J25Q9j09j00j44J20l7k75N16k96O7
$$ y = [1, -177, -72, 25, -129, 37, 148, 105, 170, 155, -133, 321, -181, 9, 4, 14, 146, -52, 352, 181, -35, -10, 44, -133, -51, 169, -24, -119, 204, -91, -190, -107, 65, 179, 42, 58, -156, -76, 235, 184, -163, -43, -89, -29, -18, -87, 106, -302, -11, 63, -223, -145, -97, -108, -280, 309, -52, 160, -240, -114, 178, -166, 56, -204, -71, 57, 87, 116, 117, 79, -78, 19, -304, 108, 241, 86, 114, 211, -109, -48, 142, 40, 118, -66, 125, -245, 43, 128, -8, -145, 166, -153, 174, 400, 69, 100, 90, -7, -42, -124, 175, 158, -215, 259, 176, -77, 111, -26, -27, 167, -169, -62, 275, -105, 5, -94, -115, 79, 28, -137, 243, 159, 249, 98, 95, 255, -64, 12, 210, -275, 139, 130, 272, 176, 12, 218, -48, 33, -55, 159, -216, 156, -100, -2, 183, 288, -26, -139, -98, 322, 48, -163, 57, -71, -49, 103, -140, 244, 173, -33, -172, -74, 221, 37, 47, -87, 148, 22, 72, 94, 18, 100, 192, -65, 229, -43, 57, 182, 271, 162, 62, -82, 38, 1, -274, 242, -54, 13]
4736A3l7k26M00j86m6J99m12k1M12j60R8j11K55o0n2j71M41o03L99q7l27L94L3
4759A45l21K64q3j36J8L9J49p3k35L48j47j74J04L68m69q9L90Q3j09K5L9l33K84
4782H7J49m41J79L4j55L08j29j67J33J16j45m0k98M30n8k64K71o8O2m2j98K35
4804aO6j7Q8k48J35J7M9k26K93j92q1Nk17M46j88K50r7j64O7K44l28O4J45O1j86
4829a5n5J39l7K3o0m7K32J62m60j14M44k17j49K12j63L55j71j89K71k3j30p7m5
4852a14L69k96J11j09K67m20J69j97P7K59l35L07m3o4m1K29j50O7k90J29N0O8
4874D3J29m12J77K63j79j6J27L4k12k20J24K14j62R7j9k6L19k77J92k8k13L5l7
4897d7J17Q5j32k57N10o34J21J62k5J02P0k1R4j10k28M46n06K00N8Q0r7K76l80
$$ y = [13, -24, -250, 150, -36, -82, 117, -295, -316, 96, -64, 34, -77, 178, 118, 66, -105, 336, -267, 132, 45, -282, 112, 145, -176, 88, 5, -131, -113, -74, 75, 2, -233, 115, -32, -206, -102, 266, -203, -292, 98, 181, 72, 97, 136, -197, 87, 236, -205, -26, 8, -147, 161, 32, -135, -2, 114, -31, -71, -369, 61, 3, -261, 10, -58, 4, -38, -236, -1, 65, 48, 136, -112, 23, 40, 89, -137, 156, -36, -117, -112, -329, 117, -71, 179, 82, -82, -15, 229, -99, -35, 110, 171, -15, -70, 69, 32, 55, -5, -52, 180, 342, -118, -232, 212, -5, -154, 58, -105, 250, 79, -110, 161, 138, 8, -69, -114, 255, -41, 70, -39, 228, -192, -23, -220, -143, 116, -219, 88, 45, -19, -60, 169, 19, 86, -204, -75, -25, 43, 172, -240, -63, 200, 21, 5, 132, 166, -46, -266, -142, 72, -90, 7, -12, -38, 281, 4, 196, 168, -45, -10, -47, 70, 155, 23, -234, 276, -358, -237, -75, -100, 2, 72, 51, 145, 35, -193, 253, -253, -53, 5, 85, -12, 264, -116]
4920a16P4p0M1NM4Q6k12QK08j08P5p6j13K64n2Lj21o5J60J21k54q3K19O5k81J11
4946f7j77M64l21K20j28j26J01q2N0k54M27R5m61j6J62K40k16J68k20M6J54j17
4968e8J27K88k92P6Qk10L2K2k9R7J94k68K92l71J14L5k1n3J47j5o2k33J91k3k97
4993c09J77J66k09J38M9j20J48n3P5k04l6L84j62j22J71j09j79K45n4k53J54Q7
5015a6K10k8j38l1k53K46N5j01O9j92R9J03j3k55L01J50j43M1l94M00j76p2J53
5038A5q1O0K62l01L7r7O6R7q2P9OL4M7r0J2j14k2j8K16n1l2K15n65M07q1P3M0
5065A32q7r5N6J62J00n09J48n3K67k64K05J06p8m7j21J73k27K65Qk78K98k60j27
5088b26J72K76j77k70K34KpJ44M0j27l56K70j53J65q9J27j6p5m2J30k4J33j9k14
$$ y = [-116, -42, -112, -71, -66, -22, 64, -148, -140, 68, -40, 35, -41, -154, 110, 58, 61, -60, -125, 35, 156, -98, -181, 38, 103, -178, -67, -244, 220, -101, 119, -9, -135, -34, -116, -66, -320, 107, 202, -259, -275, -113, 127, -89, 79, -141, -95, 59, -58, 69, 357, 65, 141, 149, -61, -29, -7, -36, 61, 255, -13, 279, -92, 22, 57, 36, -17, 130, 115, 53, -180, 11, -12, -309, -132, 34, -175, -37, 12, -108, 40, -13, 62, -142, -178, 206, 44, -78, 93, -16, -195, 50, -4, -257, -103, -16, 194, 166, 28, -3, -256, -10, 45, -56, 13, -179, -80, 23, 10, -245, 56, 206, 63, 104, -290, 110, -66, -138, 15, -66, -6, 256, -45, -8, -105, -39, 58, -24, 55, 61, 95, 142, 52, 64, -50, -72, -90, 126, 75, 43, 258, -307, 100, 19, 92, 132, 45, -50, 6, 168, 268, -241, -93, -146, 121, -143, 62, 168, 90, 43, -78, 95, -132, 133, 141, -137, 161, -99, -226, -54, 222, 45, -225, 9, 11, 4, 148, 188, 61, -295, -25, -178, -13, -102, 25, 9, -66, -108, 22, -2, 131, 112, -102]
5112a02N8J38k51J52j7j31J95k27RK41r7k19L60k8r9J38l52J98J2J23k67Q7K93
5135B14l19K2j3K94j93J45J58l59k2K75l56J50k28L00k38K08Oj55l9L94l81j5
5157a52J88j00M50n14J22r7K61j08N3j23r6k2J36j25J22K5k56L1M86k69nJ02k11
5180a02J18o6K13j63n2j0J75L8j13k22J65J3J67j11Q8J31l85J79l65K89j62J96
5202B1m9J17q6L0j8j48K29j45K30k24J80j28J6j47K60j01j51J49k13j0K38Qj11
5225e3Q5m3L80n38L3N4m71M26L30m66M31j19m7mk99K58Q2l85M32q2R4k20J76M4
5249I8n9o8R9l3M6n1N1Lj7l07K15L32m88K57j21J81j18j62J51p0J51j57N3j15
5273a29Q5R9oj39J09K29p0q1m4j76N9M20n06J47J26j84q9o9K22r1M5l79N02j35
$$ y = [-102, -44, 94, -157, -5, -22, -153, 42, -185, -176, 65, -32, -251, 109, 81, -18, 120, -232, -34, -22, 101, -166, -79, 214, -105, -83, -96, 198, 5, 150, 308, -51, -73, 202, -154, -4, -232, 68, -170, 38, 44, -111, -150, 244, -137, -152, 36, -64, 386, -128, -6, -103, 158, 50, 103, -20, -116, -138, -2, -127, -5, 20, -236, -205, 281, 12, 7, 109, -102, 16, -50, 163, 0, -52, -62, 113, 151, 38, -184, -19, -6, 161, 50, 138, 269, -116, 63, -302, -13, -175, 21, -28, 89, 3, 33, 15, -133, 96, -49, 181, -43, 137, 9, 25, -122, 138, 37, -114, 35, -178, -188, 50, 58, -53, 32, -11, 369, -169, -136, -82, -553, -127, 203, -263, 168, 49, 2, -2, -301, -43, 39, -346, 86, 4, 98, -122, 54, 98, 39, -29, 70, 37, 83, 32, 83, 86, 69, -238, -23, 309, -179, 78, -43, 138, 20, -142, 9, -61, 90, -67, -14, -129, -44, 55, 49, -90, 19, 248, 178, 97, 53, -123, -64, 356, -150, -3, 123, -61, -150, -219, 3, -88, -43, -422, 80, -55]
5297e5q4K26j26K00j70n9J01l0K47l83l02O60m19J45j19o6J46j15L65N2n02K25
5319f3O4j87K95o8k56K94k0j58J14O5N2j4j56M0P8m0m2j39j39J22jn3K32O7k22
5344a35L05l89N89m19L9N3pj67L02J1q1O7j87J61k77K21mr3K30k84%N8J8j03J82
5369I0l48L23Mk87J43L58k94J5pn2j32L05j08o4N0J39k31K1m1L70k97J50j85J83
5393A05m18M38n9R4k49P7K0q3K1n0J31N9j67M9J66r9j31P9J00j71k2L13j32k58
5417a87K35P7n1m6j14o2K07j18K64l38J27MJ07j62J57j41r6L9M1N5J5J08J0m53
5441c22J90PJ08K30m44J86J9L5pJ72l46K52m0k45R5K21k29j8M1M4J5K80L2k43
5465C3j24J67J7j17M6oj05K28l37L58j92k26J84K91k66J63j67J00n2j49L24j9
$$ y = [-55, -139, 87, -39, 161, -9, -68, 33, 3, 250, -133, -435, 225, -194, -49, -168, -234, -88, -203, 162, 214, -288, -63, 1, -186, 109, 41, -215, 79, 59, -99, 15, 80, 132, 118, -38, 2, 80, 40, -2, -141, -280, -158, -159, -212, 20, 87, -135, 170, -219, 370, -49, -10, 43, 36, -131, 171, 182, 101, 168, -19, 142, -135, 86, 82, -11, 219, -65, -65, -7, 11, -92, 90, -258, 65, 69, -218, -75, 283, -11, 4, -3, -55, -187, 118, 10, -54, -4, 135, -96, -75, -116, 254, -43, 107, -78, 105, -313, 125, 66, 160, -89, -12, 8, -75, -54, -104, 27, 86, -81, -32, 134, 35, -96, -17, 83, -88, -110, 203, 71, -187, 48, 125, 74, 28, -86, -148, 59, -59, 205, -133, -6, -2, 105, -57, 100, -41, -137, -98, -57, -2, 13, 121, 131, -322, -132, -125, -17, 213, -231, -45, -26, 9, 2, 174, -172, 80, 40, -205, -110, 111, -118, -136, -95, -51, -36, 244, 276, 33, -91, 76, 93, -24, 22, 16, -89, 139, -198, 160, -32, -258, -74, 217, -49, 114, -53, 47, -5, -154, 170, 151]
5487A51l1L2J6k64N4P5J22k54OK10M4j06L5l30J21K22k06J06m5J07k15J16J59
5510A25j91j26JJ8L68r1j34J01j82K12k56J52n6j53K18R1k5k24J53K1lmnN7mk3
5536D0L4J94k77J14j26J25k10R6k1M2j28J95J13k33l9J8L20k69j04J09m4m7Q3
5559a5j3P1j6k61J08K64q3nO5j92K3L6l6P9j32J42j24J52jj31J3j00J00L98k71
5584G1l09K56o8K52k08K25j31k55L25M5L9j32k65J12K47J50m10J18j32Q9o6l1
5606g8o1K61k83O6M11l02K8j21j18K28Q3j10R8k31O5J49j81J35j67L17m5j12j31
5629i9J11j57J00J75j06N1j0J1n7%J29j35O6p8L05l90J49J26k12P5j83J64jq2
5653d8K29k15J91J03l86K29j52Q9Nj16M8P8J2k28K60k77L28r2j34Q8k48L48k53
$$ y = [151, 120, 152, 168, -96, -42, 33, 155, -99, -93, 117, 161, 55, 90, -240, -119, 103, -103, 3, -42, 65, -150, -34, 125, -66, -192, -191, -173, 195, 104, -30, 71, -111, 101, -155, -3, -59, -212, 6, 97, 72, -152, 1, 22, 19, 15, 10, 67, 63, 40, 74, 268, -9, 105, -21, 104, -106, -10, -31, 11, -117, 78, 191, -42, -81, -63, 257, -12, -116, -7, -51, -98, -15, -28, 43, 27, -234, -126, 138, 55, 50, 115, -77, -54, -18, -54, 25, -107, 35, -89, 63, 62, -69, -56, -156, -56, 342, 71, -238, 18, -50, 202, -6, 219, 88, -167, 158, 203, 242, 110, -155, -43, 204, 354, -56, 62, -70, 19, -47, -78, -139, 122, -161, -95, 316, 14, 42, -79, -197, 31, 114, 4, 102, -129, -64, 85, -96, 39, -128, 189, 144, 32, -99, 12, -145, -45, 130, 24, 75, 65, 76, 19, 19, 148, 13, 79, 1, 306, -84, 65, 191, -21, 54, -129, 35, 34, -48, 181, -34, 157, 260, -126, 103, -49, 40, 45, -71, -23, 55, 67, -161, 99, -178, 150, 58, -76, 12, -236, 112, -141]
5676a41P0J05n5K24k70K1j24M00k46j97K76l22L29J5j74K10k68J44N7j26J45j04
5698c1K75l09Lo5p1K43R4j79n0j4K7J03K03k08Q9J1k65Q7l1J03N3K3l06L36j87
5723f6K38k27o2n6R6J35M7L4n4o0nM2Q5j16J65k7j77L59m39J32j02N1ok10L17
5748I4j96J83j6j80J74j47j3J38j12j53K18q8J95j47J59j18p6J53L6O6l38L08
5770A40q8k55L37j02nJ29k75K44m6o9J8j05J74P6k30N4J61k70P5K7l5M1K12k89
5794h1K50k55K16j12j67K24N5j60P8P1n8N9l45K4O7J82l1k12L66k64K50p6j43
5817f2l51K38K87j13L3J55k04J24j39M8L49k32k60K68j7k76J56J73l0o5k1K9j55
5840f5J59q0k04O2j1j3J79j39J73J00j45J54j68k1M7JL34j76j70J96l05J45Q2
$$ y = [-141, -71, 34, -21, 203, -67, -46, -170, 230, -16, -213, 63, -259, 70, 85, -89, 121, -147, -3, 54, -72, 73, -31, 244, -65, -62, -127, -198, 45, 139, -40, -90, -104, -77, 26, 229, 21, 110, 121, -144, -57, -88, 15, 68, 91, -215, 121, -66, 172, -55, -117, -173, -77, 58, 105, 139, 85, 25, 20, 62, 147, 31, 196, 169, -8, 351, -88, 44, -58, -7, -13, -223, 94, -102, 81, 65, -115, 59, -88, -101, 37, -75, -228, -10, -98, 97, -50, 109, -9, -85, 68, 104, 170, -168, 140, 52, -203, 134, 32, 27, 156, -119, 125, 79, 10, 28, -77, 97, 173, -57, -3, 158, -112, -37, -10, -45, -4, 208, -81, 169, -86, 130, 18, -149, 75, 130, -30, 48, 119, 61, 120, -225, -201, -134, 48, 17, -195, 171, -93, 157, 81, -62, -413, -175, 112, -1, 32, 187, -17, 107, -32, 16, 365, 133, -127, 141, 124, -152, 4, 177, 147, 82, 61, 90, -65, 94, 14, -190, -128, -139, -152, 27, -112, 61, 161, 16, 170, 2, -19, 28, 29, 363, 187, 17, 213, -92, 53, 135]
5863A35j11m2R6j83L1K72l89M46k69M9j28M0N0Q5j56N1lj17R8o4J57q0L9j12J47
5888D2K7N8K1j45J23k82J12L47l52j75K59n4j09Q7J22j65L9J53k60L1J44j02J50
5911G1J73j65Qj79p2J87kl2L1M2Q4J1l14L8J59R2k75KJ22o8k2r0K28J30j64j83
5937a88K01K22J6k98J45n4k03K13k71K07k5J26rn4k35J89J82j77j44P8q8O2J4
5960i1J61P9j45J00l25K25Q2J0k27L08r8Q8P1k59l22K25K26L6k13J10k54J90j12
5983a35J64J00j09j36N1K09k05K55o8j83K04j75j39K08k3R8O1Pp6j56j00K27N7
6006A36J2k31L2J28R1j25l9J14J71l53n1J26l7R8j30j7O7n1J46j00L19l96L61
6029B71j62N6j91m2r0p0L02m5j14K4J02Q8j12J65k73J86j1j60J64J6q5KN5l82
$$ y = [135, 24, -18, 78, -105, -74, 198, -191, 255, -14, 35, -93, -53, -3, 82, -74, -23, -26, -143, -45, -109, 48, -32, 7, -105, 42, 69, 127, 148, 3, 126, -156, -44, 303, -49, -224, 35, -19, -128, -41, 81, -84, -45, 108, -152, -121, 23, -79, 71, 244, 79, 87, -92, -164, 23, 21, -11, 20, 62, 146, 157, -157, -119, 40, 132, -143, -141, -19, -87, -109, -199, 29, 159, -5, -188, 13, 235, 251, -47, 98, 44, -159, 54, -217, -10, -35, 91, 82, 28, -207, -18, 164, -13, -157, -79, -167, -105, -91, 70, 149, 4, 104, -221, 4, 86, 96, -131, 177, 79, 167, 238, -21, -343, -118, 108, 144, -69, 41, -213, -23, -135, 29, 129, 20, -116, -65, 144, -61, 194, 126, -57, 147, -28, -167, 41, 18, 116, 177, 184, 108, -48, -148, 79, 136, 148, -83, -51, 77, 168, 43, 4, 118, 289, -64, -115, 11, -26, 72, -58, -75, -8, -59, 87, -13, 306, -90, 271, 109, 165, -26, -68, -158, -228, 74, 29, -85, -61, 41, 129, 17, 182, -91, 95, 84, -76, 88, 104, 19, 21, 76, -306]
6053c06K87K95j38j00O2k8p8k8J2J36l41K28L6k16L06j93J01j74J47J65j5j58
6075@P7J49j11jN5k76j1L27O5j70Lk20n4J58J7m4r1M01P0o44L87j85J97j17J2
6100fm3j10K28O8j62l5K08k74K19k30J51p4J34j58J61p5r6Q0K02j82j34K3L03
6123A98k34o6J69j02j29Q1j00K34M9M9k36M30n84M90k95q5K96k23K13k47P4O5
6145D7j90J1N23l73j25K62l9k87J68l7l3m9K55k50J54p6j49L52k00L04q8k16k47
6168b83L43J33j32J02K5k38o1J14J52k37j82K97k02L17L3k50L6j0J10j7j21k9
6190a00ll4qL46r8p0o1J16o3J9q4J91l15m8M43k74N8k00J84j01J21p2J88j54p2
6215i1r5J64R4o3Q7k63K5N6K57q2p7R9j59J10q7k03L32J67k69j78K06J52k71L4
$$ y = [-306, -19, 276, 138, 38, 100, 72, -6, -34, -22, 114, -227, 1, 37, -179, 127, -66, 35, -139, 8, 173, 158, 0, 77, 226, 115, 114, 169, -107, -118, 209, 274, 104, 107, -113, -167, -9, 8, -36, -127, 274, 344, -300, 87, -98, 99, -18, -6, -49, -159, 69, 137, -25, -60, 148, -126, 93, -137, 14, -60, 74, -84, 77, 2, -94, -14, 188, 6, -128, -105, 198, -36, -102, 67, -35, -164, -83, -183, 51, 100, 149, -87, 343, -241, 249, -46, -131, 165, -58, 155, -92, -18, 47, -143, -132, 391, 18, -107, 155, 116, -171, -3, -40, -73, -122, 133, -117, 37, -39, -188, 164, -36, 268, 180, -36, -283, 60, 193, 61, 163, 188, -50, -111, 3, 155, -82, -264, 33, -169, 148, 181, -69, -33, -43, 67, 50, -71, -100, -103, -137, -145, 201, 103, 33, -28, 88, 25, 44, -40, 151, -164, -212, 231, -43, 15, -185, -1, -102, 19, -53, 135, -19, -91, -186, -22, 72, 9, 96, -167, -142, -86, 171, 89, 12, 111, -48, 62, -25, -228, 104, 271, 2, -176, 30, 182, -89, -55]
6239e5L6k48M62j63K1Oj40J55m0J77j49k13J07j2K4kl2J30k02K10k8J29l27L96
6263B42k04J03l5Mk54K89j80K17k28K49j94n2J23k61j03K98r4L3J09J14p7j89
6285i0L3K63m30J50K60j43N0k96J95J37o9P6k43K5L19l15J49j51m1P0k7O9M8N8
6309I7P1m1j02N6k36J46K8J74n1k7k68K07R7j05J11q7N4o2m3nj9q2M57l53J6J43
6335A76r2j52LJ28j53N9pr5K64j38k3L8m5J6Qj58K3K72j10q0RJ53R9j14J22j93
6361A0K37n6l4k25K43j49k9N2j22K22j2O2k11J52k9M8j52k15K81q2K4N7N3k19
6385i4J10j2P9K3L4j73N2J18O0n3N3j55j38J81j01j28J12N0k49J74J88j4n7j02
6409d2k7O6M4Nm5J74j06j34k5O7J18o5j37K93J28j99o4r5n7N0J26j36%L5j3J02
$$ y = [-55, -19, -267, 195, 32, 53, 59, -81, 74, 34, 211, 62, -151, -44, -56, -32, -34, -66, 64, -138, 72, 44, 173, -154, 242, 38, 141, 106, 110, -144, 145, -35, 182, -46, 203, 9, -43, 80, -181, -284, 14, -80, -47, 62, 176, 99, -90, -57, 206, -224, -74, 186, 43, 93, -203, -8, 129, 60, 136, -107, -82, 237, -78, 71, -80, -121, -51, -78, -9, 39, 97, 168, 127, 25, 81, -155, -9, 19, 193, 142, 115, -153, 54, 151, 46, 157, 70, 124, 62, 19, 14, -5, -87, 370, 17, 33, 176, 84, -68, -65, 63, -90, -31, -38, -133, 131, -7, -30, 8, -37, -21, -13, -171, -148, 124, 14, -66, -57, 96, 195, 81, 203, 10, 247, 191, 157, -68, 175, 26, -3, 49, -73, 149, 137, 199, -12, 140, 111, 159, 7, -208, 73, -9, 15, 72, 125, -94, 16, 4, 83, 106, 140, -33, 19, 137, 197, 144, 197, 42, -96, 85, -16, -144, -32, 18, -231, -57, 131, 117, 60, -42, -69, -3, 41, 46, 1, 175, 69, -65, -90, -23, 95, 30, -107, 186, 314, 115, 51, -44, -101, -51, 75, -61, -61, -26, -39, 63]
6435F3j42J67nJ4j00J9M2ll4j57m5J56n7l1M19l49J7Rm7l76M84N3k36n5L34j87
6461d7KNp2J06Q2j42n4k5p0J39K56r1n7m4p9J97j57K46l85L06o3l44N98m29N3
6486f9r8J14K45r0l00M39k55j63L76k59J18l4k3j27K46k6K27l50qJ38R0k7J4k78
6510a00K03q1L4l50N21m6m83L38J37j70k95K23rm1N3MoO5o4m4J24j3k33K60j2
6535A5R7r5j98L0J69j14J16L9o4j18l4L82q2L9k52J96k91j6M43l68k1K00n6j68
6559a51J64j65K26j52J71j76P7l9N1K45J24m33J86L5k72L58j95j36K28j23J14
6580A37%j13J97q2l08J54j74K41n9L7J17l59J34J39J17%j05l1M1j15k58J89J85
6603H4r7N7k00J5J27l03M06j14j09K2L06j92J53J66l79l8J30R1q0j62J62j86M0
$$ y = [63, -79, 88, 83, 97, -3, 16, 58, 55, 21, -136, -181, -25, -82, -113, 306, -43, -26, -17, -64, -440, 44, 97, -139, -194, 140, -47, -45, -40, -112, -6, 76, -66, -120, -145, -215, -76, 180, 89, 32, -12, -91, 106, -51, 195, -190, 116, 53, -291, 307, -122, -69, -167, -53, 192, 102, -198, 241, -14, -177, 199, -60, 58, 24, 1, -126, 120, 94, 321, -29, -37, 101, 191, 164, 178, -100, 103, 22, 56, -294, 227, 181, -302, 36, 173, 3, -292, -69, -78, -119, -66, -62, -68, -3, -67, -111, 13, 0, -233, 27, 15, 112, 17, -181, -151, 18, -96, 20, 59, -5, -123, -157, 225, 143, 182, -70, 126, -165, -181, 262, -106, -127, 73, 17, -151, 13, -152, 74, -78, 93, -83, -6, -45, 6, 251, 375, -58, 128, 163, -109, 249, 54, -82, 146, 23, 137, 137, 24, 221, 139, -169, -15, -189, 52, -7, 30, 147, -212, -78, 61, 178, 178, 73, 42, 83, -32, -290, -101, 84, -13, 44, -156, -141, -14, -317, 89, -25, -134, -112, 194, 2, 155, 321, -58, -96, 34, 125, 45, -117, 45, -141, -101]
6626a01l2P1K40n3P2k58J05r7K45j17J65j51k32P7p6M02k37o1k22M05r2j27K7
6649d7K25l47M24l88j4J41J23n6K0j59K50l62K26k90J47J9M3l7j69L76j43n0J38
6672G0j54L2j19J84K55j10k09K52j64j11N1ok7J68k1j09k08J97L9r2Q4j86J54
6695c0Q1j13O5O9R3l1R6j82r1Q7j8M9j95K58j93J8Rj42J30j10j18M82k24j3n7
6720h0L47l54M4J41k51K1J1K11j67J75lj47k37O71l34j64J87O9j16l4R6m5O4j29
6744b4p5J59j52R1K09l89K83n5J00l35J67q1J86k27L23l70P1J16J33p2r9J99j45
6767A3jrN6l32P2J93k2k64K73j7J09m82N95l17L02j53j29O7J64K1j14K08j72n2
6791Ik5J05o1mr7J74R9l42L58r6k33K69j44j34K49J9l55J42N3J78j57Jp0J43J98
$$ y = [-101, -133, -62, 178, 125, 197, -61, 44, -53, 192, 75, 240, 89, -143, -66, -142, 260, 23, -38, -260, 145, 53, -74, -47, 178, -169, 255, -133, -147, -6, 117, 61, 81, -78, 172, -190, 36, -254, -107, -88, -45, -82, -251, 125, -18, -68, 70, -84, -52, -171, 13, 268, 158, -51, 201, 37, -74, -23, -29, -56, 112, 91, -18, -226, -29, 10, -82, 2, -184, -30, 51, -62, 3, 72, 165, 134, 230, 48, -43, 44, 26, 75, -120, 138, -55, -37, -28, -170, -40, -150, -268, 214, -10, -23, -80, 267, -87, -43, 98, -153, -132, -121, 90, -77, 98, 95, -52, -289, 382, 48, -116, 71, 140, 24, -10, 86, 41, 105, -24, -99, 60, -92, -1, 208, -181, 102, 47, 147, -188, -21, -102, 84, -143, 180, -190, -119, -3, 130, 58, -41, 158, 13, 12, 3, 59, -273, -201, -8, -30, -294, -21, -38, 71, -411, 184, -133, 169, 16, -113, -46, 118, 139, 25, 233, 61, 9, -16, 89, 28, 24, -73, 101, 200, -142, 216, 120, -113, 156, 12, -122, 127, 146, -209, -67, -14, 164, 7, 8, -62, 81, 279]
6816B79k93j36J44qJ15l6r3P5l05L09Q3M5j84R8o8Q2m9k82J14K25j09q6K12o7
6840F5k63J06J03J08J62k96J78J7l05M8j39J73PJ21j38J95l4j3j99k0K01n9m5
6863b7P2j19K03k53Q6n8l7O7L32K0l04j00L69j63K5J1j89J81l03L5K20j00j54
6886a86K57j89n9N4J87n9j7k15K73r1j67L79k34K15j9j16kJ21r0k4R2j23ml0M
6911d3J48p6n1J27j56J61m00J77M9Q7k6J69k17j72Q1M2J86l5j15J05j20P0J07
6934I8L5k78K30M6k54J72L1q4l6J7Nr5K45j34J85j30qr0J68j59M4j67J23K25k87
6959i8O2R6k0K2J16k84N7Kn2J63Q9k05J48Q4j82L7q7K03k57J8P5R0j08M7J8o5
6985c1K93k76J4q7K44k99M3P8l31M67j35j0j25J53j24J86j6P7k62K68j46j5n1
$$ y = [279, -14, -150, -6, -14, 101, 65, -28, 47, -258, 51, 134, 179, -5, 93, 25, 107, 58, -224, -110, 115, 6, -80, 132, 65, -198, -92, 11, 119, 281, -15, 163, 180, -125, -77, -216, -43, -36, 85, -53, 142, 108, 95, -104, -124, 77, 18, -27, 45, -74, 129, -124, -38, -96, -133, -66, 266, 286, -18, -118, 251, 88, 113, 124, -65, 116, -187, -152, 68, -32, -186, 71, -118, -177, -123, 64, 5, -12, -227, 46, -45, -212, 167, -67, 148, 129, 13, 11, 132, 42, 18, 110, -13, -17, -47, -43, 105, 29, -22, 105, -51, 110, -290, -113, -64, 23, -3, 166, -51, -223, -142, -100, 86, 51, -64, 41, -79, -9, 98, 133, -145, 85, 131, -123, 49, 80, -4, -40, -23, -18, -113, 132, -2, 183, 53, 45, -45, 123, -36, 8, -159, -36, 189, -98, -36, 60, 40, 62, 178, -106, -49, -47, -99, 64, 153, -52, 96, 180, -2, 35, -52, 151, -106, -88, -13, 77, -31, 16, 34, -31, 262, -14, 0, -87, 157, -142, -99, -21, -352, 115, -20, -30, -155, -2, -126, 60, 44, 121, -141, 127, -19, -34, -85]
7008h5K35l18k9J25J22o6J04j57K8K4J00L0m5j00PR9q8J4k8j3j45J79m5J43PJ53
7034B51j82l26K80j21j1J49L4n21K97K44j35K55j65j91L42k28J33k6K8N8j34k5
7056Fj0k3n0l29L43M8R4k05j13L79J90m12n3J0K07l26K54q7J29j43R2j38M2L9
7080e6oo7K91M6k73K67q9q8j78K64k00j1K45n7o4n9J46j37j7J64j19L8k04N4O1
7105d9L50j60k98Q6K2n3K2M8Lj22K34j82J32K7j33j00L14O2k07L00m02J33q2N4
7129aJ35l83L24p9k4J66j39j4j6lk2n5j20J68M7n9J0L60k64j52J4k9K63q6L7j18
7155d0O5N3j04L94n72J99P6J89l31J56j47l0L24j27R6k00o0nJ78p9k2J03m43M09
7179H2J79m40L00j76N0O6J3k73J66J30J34k69lJ50j46J06J7M3o0j8J69j67L4k01
$$ y = [-85, 150, -168, -197, -72, 50, -16, 88, -69, -41, -17, 83, 113, 68, -32, -25, 74, -14, 0, -28, -41, -186, -7, -52, 91, 98, 251, 69, -257, 23, -98, -109, 40, 74, -447, -150, 94, -41, 214, 49, -142, 200, -28, 105, 79, 107, 165, 31, 6, -4, -27, -77, -406, -63, -15, 79, -126, -239, 140, 330, -82, -135, -125, 82, -244, 10, -77, 52, -91, 1, -137, -95, -56, -62, -129, 162, 208, -65, 202, 113, 25, -153, 111, -89, -100, 145, 88, 24, -35, 111, -26, -43, 121, 2, 40, -164, -110, -49, 301, 141, -157, -71, -49, -102, -80, -32, -29, -151, 83, -99, 33, 60, -73, -173, 141, 203, -4, 296, -106, 27, -55, -1, 134, -249, 75, -4, -28, 138, -1, -15, -31, -34, -56, -111, -231, -63, -16, -75, -65, 295, 31, -121, -107, -136, 127, 41, 78, -40, 25, 78, -26, 368, -204, -5, 71, 260, -71, 85, -62, -92, 232, 105, 201, 1, -59, -64, 114, 35, 13, 116, -327, 82, 261, -179, 121, -55, -5, 61, 74, -199, -33, 97, 231, -38, -41, 109, -37, 69, 86, 129, 69, 51, 220, 53, 87, -114]
7203a14K52k11K31l52N81l87k43L22R2l84P8K03l56L00Mj52k10K86K16j85J63
7224A34k42O6j3J80k71Q2%o5J24nQ6q5lQ6J5l0L7j4k20J35N1JjL6ON8l39J24l1
7253i8J59m6K9j24J00p7r2j00K60l9O4k15L73q4j00R7l14Q2j87P8K44jr7K29l6
7278A05nk66L03l27J08J21j20P6M7q7N6J6R3j50j6O8j07K46j73J39j52lJ00J12
7302A84l29L9r8n2R6Q4J46k11N1N6l2R2J16k86L31q1O6M9j21j13k7J9m5L45l52
7327g3M7M2O7j33J15o7Rj68M66k09l28R4M04m20K40O9l33K45P2k26R7k0l1M0L0
7352B9q1OK79j56k21K53J8q6l2n6J20j58j94pK72o4o0J63Q6j85K5K35k96L84l69
7377i5K93l21k61L70j68L86j61K78j90m0p4j13l3Q0n1K98k32l6K76m24L8M13p8
$$ y = [-114, 138, -73, 158, -194, 387, 0, -243, 79, 171, -213, -135, 68, -288, 12, 16, -136, -346, -60, 156, -29, 134, -108, -42, -55, 125, -146, -64, -64, -129, -5, -10, 76, -9, -12, 74, 89, 59, 96, 82, -138, -3, 48, 49, 48, 84, 90, 148, -191, -67, -98, 61, 15, 44, -80, 20, -57, -149, -249, 11, -28, 36, -179, 194, 110, 10, 107, -207, -125, -312, -234, 10, 9, -88, 141, 105, 100, -166, 137, -190, -82, 39, -81, -5, 42, -45, 11, 27, 120, -30, -46, 22, -85, 161, -12, 127, -25, -28, 72, 184, -145, -106, -204, -256, -160, -76, 70, -141, -90, -34, -66, 26, 142, -144, 187, 106, 172, 221, 100, -13, -40, -21, -66, 279, -73, -26, 16, 83, -50, 65, -2, 7, -161, 305, 96, -232, -138, 266, -154, 86, 155, -178, 67, 139, -87, 10, -10, -41, -1, 29, -52, -46, 233, 77, -144, 109, 127, 41, 9, -47, 73, -85, -279, -286, -14, -78, -138, 25, 111, -74, -49, 186, -110, 274, -95, 198, -123, -384, -14, -182, 204, 43, 321, 131, 91, 17, -96, -129, -49, -100, 198, -34, -70, 206, -218, -180, 233, 155]
7400A55l00O6J36j88K03j67j21K33lJ36Q0j77M3j66P6Rj4l7M7k7l3M9j68L0J79
7425D1o1j24O6K77j00j32M1P4N3k30j0j3P3J82m25L77j61Q4M4K57k68J0J1k68
7449b02M51k47L4%M4j47j41J28K04P4k42K82j86m2j8J3K00n1J7k56l2Q6K47k9
7473A87k30j60J36J59Jn3j16k3P3J49K6l69K53l33K77j12K39O1q7k0qm8p2K79
7497B09l6r9k04R0K71j15j35j32L9N1M8O0O5j87P1j13K55p6K2r1J81k25J79j76
7521d8Q1j28P2J7j6m4Q8J32N0j00j12jn6J09L29j76j55J77j10K9k31jJ95j57L
7546e3j04J87J83j67M9j59J92l64L28j44Q4L5q6j23J00k7R4M1q9J00J20K1m54
7569b36L66j65q7P6o1J46r1L3k51M06j07rJ47j70K43l84K54L0k95J03P3j5n6L81
$$ y = [155, -145, -79, 57, -131, 72, -95, -216, 17, 14, 150, 230, 53, 96, -70, 6, 15, 1, -36, 11, -16, -49, 0, -168, -138, 41, -20, -144, -78, 199, 99, -33, 8, 82, 135, -95, -105, -118, -45, 137, -288, 89, -72, 12, 56, 313, 45, 55, 66, -202, 249, 2, 36, 36, 80, -67, -208, -80, 124, 198, -44, 238, 52, 10, -8, 5, 205, 154, 171, -85, -117, -31, 216, 187, -43, -203, -67, 92, 93, 40, -76, -99, -26, 123, 149, -220, 33, -300, -23, -135, 104, 165, 78, 58, 50, 2, -70, 209, 173, 74, -130, -40, 231, 116, -19, -151, -112, -61, -13, 47, 112, -75, -4, -117, 138, 62, 84, -7, 174, -51, 128, -48, 33, -95, -23, -6, -22, -66, 22, 154, 204, 104, -8, -9, -65, 44, 373, 197, 42, 219, 109, 138, -93, -94, 101, -56, -53, -157, 30, 213, 46, 95, -64, 128, -236, 92, -52, 32, 67, -19, -142, -42, -69, 25, 66, -23, 77, 197, 218, -236, 130, -35, -122, -46, -107, 39, -52, -19, -270, 136, 29, 20, 167, -3, 240, -144, 110, 140, -155, -52, 21, 6, -50, 331]
7593C31m81K62j47K43n6k32R9l8L9j54J25R0m4M9k15P4Q4K43l28L36n83L65l8
7616B4qj07o4L03k3j88oK52r1J62r9j51L0K22l59J52m4n4J26j60L00P1j12k18
7640d2P9L8m8N6k69K94j05j26J01P3p7J63j91O0l3J03K6j26J86j75j32J73J13
7663A41o5j32L6P6j98M02k79j69J56J49l03K56o5J10k69J87J4Qk36K98K5k67J8
7686a07J60J19k14J95p8J18l66K90j0j87L9K9n1l7R1j20K30j12K68k52j8Kn8N0
7710a9m0M8P1m4r8K93j27j44q2J43K3r1kj07O9N9m6J20k12L69k53J69j37J71m30
7735b97L58k33OJ32o8P2R2L0J0j88L21k01j72L27m68J42K33j65K38l20O5M2K59
7758B15q2K8j92J15J4q2j69M0K06j25p0R2j77J69KR7r0r1P5j65K62J59k77J45
$$ y = [331, -150, 112, -35, 208, 152, -80, 19, -19, 20, -134, -9, 81, 37, 86, -129, -55, 29, 272, -56, 280, -303, 62, 24, 16, -91, -155, 148, 125, -63, -69, 183, 92, 254, 155, 4, 34, 256, -103, 49, 5, -49, 77, -83, 217, 288, 176, -42, 37, 75, 27, 83, -186, 108, 3, -123, -22, 51, -26, 137, -54, 6, -27, 76, 102, -24, 162, -13, -145, 28, 141, 76, -56, -20, 56, -142, 260, -19, -188, -32, 117, -186, 70, 5, 115, -154, 33, 47, 55, -181, 117, 142, -125, -107, 53, 172, -42, 153, 75, 193, -173, 117, 107, -80, -41, -12, -63, -100, -9, -129, 101, -11, 257, 5, -13, -11, -69, -19, -59, -11, 60, 16, -82, 211, 84, -60, -142, 1, 24, -67, -69, -176, -107, -48, -94, 26, -186, 183, -70, 99, -38, 133, -297, 61, -172, -166, -34, -102, -30, 62, 92, 102, -86, 235, 34, -138, 189, -279, -137, 96, -69, 169, -151, -86, -44, 215, 133, 161, -31, 84, 98, 16, -153, -113, 93, -32, -102, -10, -187, -18, -16, 81, -9, -100, -25, -190, 72, 231, -46, 99]
7782I9j73L17k78Pk48J61Q7K3J02k2k22Q0L5K88m36L07j51j94J01j8M20m95L42
7805A32j51J65j03j35N3pj24L41k23J13j72J68J2j62K68j73K62l32R2mk9j2K33
7828B12l15J30p8L1K1l3N5j06O6J13M9q5J72j10j78J29j44J6L03j36oj2n55L77
7852h4J94j74N7N2l2J9J3J18L5l08J90k68J20K54j62J86j31m8j12N8j05K06l2
7875D6k22L74j59j62K25lk82M80n75j14M05k09L29l70K93J30k75N0J09j39k02
7896b71J85J31k92K86nj22K59k69R7j98J5K49k27L41n0j02J31l0o8J94j92j97
7918a35K29n4j78Q0K02k33J33J57l6j94l7R1J37k66J95j34k1J86n5q6L01m56r7
7941b71L44j56P7k3j2k5P1J61k56Q7K3K5L2j11K14j09r7l4K38O9k22jJ12l31M37
$$ y = [99, -74, 243, -35, -28, -276, -115, -28, -5, 97, 75, -147, -67, -32, 256, -180, 127, -24, -218, -117, -135, 285, -210, 132, -19, 146, 43, -92, -39, -46, -170, 171, -52, 61, -111, 57, 69, -93, 175, 2, 264, -68, 24, 20, -9, -21, 212, -103, 27, -51, -20, 1, -32, 23, -83, -17, 96, 145, 60, 232, 122, -56, 73, -71, -55, 248, 112, 106, 94, -461, -84, 110, -64, -7, 45, 13, 32, 45, 163, 198, -110, 80, -188, -68, 186, 24, 210, 79, 31, -81, -23, -128, 78, 46, -176, 198, 39, -123, 102, 99, -183, 297, -278, -392, 13, -196, 133, -237, 56, 186, -89, -39, 70, -69, -271, -86, 45, -247, 39, 34, -88, 171, -98, -1, -199, -184, 65, -162, 179, 129, 27, 158, 128, 60, 254, 62, -135, 94, 40, -138, -58, 144, -89, 44, 201, 165, -29, -66, 25, 162, -104, 91, -43, -64, 122, 67, -19, 282, -174, -271, 73, -83, -6, -29, -41, -66, 5, 166, -90, -3, 20, 45, 77, -34, 180, 71, -26, -60, 178, 247, 25, 24, 136, -195, 242]
7966B42m11J94OK8j11K5J20k62J25q2L9j1R2L2K42l2k18J3J50M2j58j65P1j33
7990a62L35j6m5k48J59K59l9k62q8J13KR1k17J80r2j42K28n6Lk9k68L29K2k00
8014a43J98L0j62J81k45j4K45j03J01j38R3J13M5j13j22P1K3j47O1J2K37n7o5
8037A01j79K99j43n6N9J60k78P8L6j46J3n5R9J28k47j01K66P7q0q2j36K4M9Ko2
8062a74K81Nq0j2q7J42L1O2k19K05j94r5J96k8J9k54K45O3j48K20Nj84kR9N8m36
8088b82L03k57K62n8O3Qj37j8J50Pj5J73k70J27K02j6k87R9r6k01J34J71mQ6k03
8113e9J21j78K95k44J32l6P9k22J25K20k12j61L21j61K7k75K66K39l41Q3j36L85
8135B68l19K04j31Lp6J43l32N11l44l1m0L00k19K4l4j6j2J34j02M9J15P2k58K09
$$ y = [242, -169, 25, 31, 59, -52, -27, 93, -169, -44, -126, -87, -98, -6, 26, 268, 236, 18, 31, 181, 223, 65, -100, -29, -162, 173, 157, 112, -136, 23, 282, 243, -19, -107, 6, 8, 99, -118, 62, -30, -172, 56, 0, 3, -26, -294, 35, 57, -143, 55, 85, -77, 104, -141, -155, 90, -13, 88, -50, 43, 156, 201, 88, -34, 37, 60, -87, -26, -14, 223, 166, 101, -78, 221, 78, 22, 81, 241, -37, 41, 77, -69, -56, -111, -12, 116, -131, -232, 34, 111, 31, -51, -187, -163, -114, -112, -174, 107, 112, 32, 20, -67, 75, 106, 168, -51, 154, -40, -135, 61, 33, 52, -202, 43, 106, -42, 178, 183, -1, -3, 96, 154, -282, 21, -236, 26, -32, 31, 39, -98, -116, 34, 41, 26, 199, -71, 56, 258, 242, -45, 54, -42, -243, -109, 62, 58, 144, -59, 62, -116, 179, -65, 67, 31, 110, -112, 13, 233, 21, -140, 181, 20, 47, -228, 38, 277, -64, 19, -117, 268, -51, 153, 22, 25, -51, 92, -240, 271, -73, -104, -144, 156, -63, -39, -73, -89, -101, 33, -69, -20, 95, 167, -91, 118]
8159A18m3j58J53m37N57k13l73L92m0O3k60K20kp3Q6J05j07k0j8J36k74L61k20
8182d7K94l5l37J23K20m4k55p4M
$$ y = [118, 75, -83, 70, -367, 190, -23, -396, -4, -44, 19, -241, -21, -23, -96, -10, 95, -12, -32, -50, 86, -188, 173, -47, 247, 212, -125, -2, 218, 174, -81, -155, -151]
8191a51
$$ Imaginary data points
##PAGE= N=2
##DATA TABLE= (X++(I..I)), XYDATA
0@%%%%%%%%%%%qJ6j6J6k4L2l2M0m8N6p2Q6r9J15j34J53j75K03k34K67l02L41l86
34b05M35m89N49o13O83p62Q46r36J038j149J270j403J546j702J874k063K274k507
52a314K765l052L375l742M161m645N212n888O705p716R008j0721J3098j6606K2294
67A2934l2939N8988k26000k40193P41167j83239m52176M00570J84891m50990M7994
78a38993M46805k83912m13609N29108J62428n47278J83483L18667l84070m1581
88a68952L58546j09994l16438K25805K94152l65407j34469M12113j88957k49841
98b43442M01659j1857l66532J84530K53236k27711j89946K64920O3278k96264
108a68129J85297K02000l71170K0535L39589j75404k03956J76162J26782j60100
$$ y = [0, 0, 0, 0, 0, 0, 0, 0, 0, 0, 0, 0, -8, 8, -8, 8, -16, 16, -16, 24, -24, 32, -40, 46, -53, 62, -72, 81, -94, 109, -125, 142, -160, 181, -205, 230, -259, 290, -323, 360, -402, 444, -492, 546, -603, 667, -736, 810, -892, 982, -1081, 1193, -1314, 1451, -1601, 1774, -1968, 2193, -2452, 2760, -3128, 3577, -4139, 4869, -5852, 7246, -9360, 12934, -20005, 38983, -187017, -427210, 313957, 130718, -321458, 79112, 264003, -186987, -138993, 307812, 23900, -389709, 139399, 301827, -245451, -61968, 256699, -127371, -168952, 189594, 79600, -236838, -11033, 283119, -82288, -216757, 195356, 6399, -243442, 158217, 146360, -220172, -35642, 217594, -10117, -200063, 64857, 128135, -168129, 17168, 219168, -152002, -131467, 208122, 32718, -171238, 4924, 131706, -28394]
118b8394o3287K17983j06083k24374K92018O9795l25471J06016K12269j46946
128C526j06589J32778M4592j93410O9377K38901k32567j22842L01145o6695k00531
139a32315J46744O2527j28552j275J59224m7292k17737J65891J54173k62521K4413
150g6720K07657j52184o3443J64673k2935j70690N4922K04636j45702j57345K54368
161I7237j7964k29261J86162P1703k21722N4714J80429q6412j57578J32740J17381
172A27429k18979K3110K20497j92074q2375K45048o0547j78624J01889J13507
182I8881j17979p7703J81535k3322k07917J82553R8937k57206N8464J82521j28364
193i600p6412J25696K6440j47757L6301J73561j59652r8332K39867n2449j76018
$$ y = [-28394, -91681, 126302, 20219, -204155, 87863, 157658, -167813, -61797, 150472, 3526, -103063, 29715, 74307, -119103, -49726, 189175, -43392, -166234, 134911, 68216, -132315, 14429, 76956, -51596, -52871, 106353, 59061, -158676, 7215, 161388, -101133, -76720, 130937, -21247, -84690, 79983, 57048, -113642, -58720, 145916, 214, -157131, 97237, 79273, -149988, 36174, 107877, -113845, -59131, 121298, 34886, -122692, 10048, 127429, -91550, -68440, 152057, -40017, -122392, 122656, 62109, -116515, -14626, 98881, -19098, -96801, 84734, 61412, -146505, 36048, 134985, -122221, -63757, 118764, -9600, -86012, 39684, 66124, -81633, -45332, 128229, -31423, -129755, 110112, 57663, -118355]
204a18355J45159N1566j36063J1808J22739m2996j40833J28150J00501k14017
214i2341L4441J80911j54958n6369J64980l3846j26401O1657J18436j14681r2503
225a10674J92258k5142j84324J61790O4839j92389N2252J34823q9494r1649J11508
236B3798O8482j66155K1627J78024j56511p6497K09593o0308j45908J18746O9388
247H4279j21698l4118J44806l0175j61491J46746Q0408k12978O3896J53083j46083
258c3325m6868J36424q943j21737M7966J27150j28802p1354J95404n9258j51072
269a14415J56940L4613j48367M2777J03682o6458r0293J09978N7056j68265M8057
280c4695J46577j53087l5686J57832o1565r5725Q3526N8437r5623l8581J36582
$$ y = [-118355, 26804, 78370, -57693, -45885, 76854, 33858, -106975, 21175, 121676, -92341, -57900, 123011, -31947, -88316, 76664, 42818, -83583, -21926, 96510, -18171, -110674, 81584, 56442, -127882, 33908, 98747, -93642, -41390, 93433, 3939, -87710, 23798, 92280, -73875, -52248, 125776, -30735, -107232, 102361, 42053, -103855, 14891, 84279, -37419, -71537, 73269, 43094, -118397, 28349, 108757, -104221, -40325, 112758, -33325, -80193, 56231, 47288, -74449, -26483, 100667, -28135, -99489, 95915, 36657, -114415, 42525, 77138, -71229, -28452, 75230, 8772, -81521, 28457, 85513, -82752, -34695, 111882, -41205, -76891, 80941, 19376, -76349, 7177, 65614, -30009, -68590, 67992]
291F7992l5150j36065J36086M4484j59771O3457R6238r5430l7510Q7060K1101
302E2492j07205K2365J23496j11098n9011J56639n1221j06549J03428L1365q9924
313c5223m691Q7768j7477j08048Q7343P0344j49536L3530J20589j08183l7363
324f0947J03625j0487q2150K6100R1307p4170p1785J40570j9051j33442J11822
335B1392M9432j24696K4418Q8760m7024p4210P4734N9544j29627J3762J37274
346I3759j13072n8794J43023l6681r8121P2203N5605q1108l6992J13318j5947
357C7193j26774J06924O1642j50516M3674J05456r4353l8444Q9822R446r3565
368d9495K2711J05181r3425n8269J43300m1807j07910J05164K7977r6289J4045
$$ y = [67992, 32842, -103223, 32863, 77347, -82424, -18967, 77271, -18159, -55669, 31391, 52492, -54713, -32348, 91148, -19950, -78961, 77678, 26457, -80092, 23336, 54701, -35223, -39914, 47854, 30377, -77671, 9672, 80016, -69520, -35990, 84599, -23584, -60947, 42678, 32191, -49959, -23859, 67448, -6722, -78507, 62063, 43012, -90430, 21392, 70824, -53872, -29454, 59306, 12282, -61928, 12806, 72350, -57277, -43515, 93759, -19313, -78107, 64916, 28235, -69886, 2317, 57922, -23186, -60178, 53140, 37193, -89581, 17343, 78985, -71531, -27857, 77599, -16754, -55198, 34624, 44070, -49495, -26784, 78397, -15028, -73297, 70003, 28196, -79714, 25450, 53427, -42862, -28817]
379b8817P5344l0795p8402P4695N2267j25401L1145J07717j03918k9160J03583
390D8258k8830o6810M0987N6293o1610m4020J05598j7939j06067R5496L7669j10584
402e1559L3753O9600n2571m1923N6726L4223q8409P144J02775q2545n0526J15323
414E2011k9858p9854O4331L5006o1441k1395P6699m399r6644P0753O0683j17754
426e1862K3654R2407p6210l3342P4519M627p0239J2159Q4511o2459o2381J15353
438E0737j7100j02727Q5277L5549r0738J2052O9462k8430o7920N9480N3086j07352
450d8624J4761J05754r1051l9098J07010k7072p2433M8632M8886o0408l4299R3006
462D5064j5904r8805Q9291M0935j14095L4666P5126o4411l1546O1421J3179p3919
$$ y = [-28817, 46527, 15732, -62670, 12025, 64292, -61109, -29964, 77753, -26165, -55325, 48258, 19428, -47382, -6395, 49898, -11712, -55732, 49866, 31927, -74140, 21356, 59025, -51559, -17806, 51794, -777, -42700, 14026, 48249, -40160, -33016, 69759, -12786, -63312, 52011, 22153, -57701, 6630, 41636, -19805, -41200, 35499, 31100, -65544, 5209, 65892, -51862, -28208, 64199, -12011, -45353, 29166, 33793, -36446, -24287, 60224, -2235, -64616, 50737, 33637, -69090, 16187, 51736, -39002, -26950, 42512, 14082, -53838, 5642, 58728, -48624, -33863, 71891, -19160, -58258, 48752, 21680, -50753, -2121, 46765, -13643, -47942, 45064, 29160, -69645, 19646, 60581, -53514, -18848, 56278, -8133, -39679, 21742, 34921, -38998]
474c8998J7413Q4036p8296m3078J11443l3678p7567P3417K0921o4554M736N8512
486C4307j9703o8132O3333M4076j01197K5765P9861p6554j8227P1575j7581n0915
498c3392K4387N3492m8818m3673Q7299j4055q1780P4524K3604q1937K4289N3762
510C7702l3058m3803M2565L8774p5137N321Q2987p0835l3934R3687k6204o4381
522d6316M6881L6448m6457k6070O6086n346p9284O6546M1884r9986K4921P3074
534E2381n9054k8160N4056Q116n8032J1644P0550o0894m5687R8737k0151p8581
546e5075O6421K2981o4170J0851N2239k3387n7389N5652M3054r1372J4891Q0418
558E5114p0911j9740P4347k6395m9257L7030M0426m8931l3135P6170j0859p4769
$$ y = [-38998, -21585, 62451, -15845, -58923, 52520, 18842, -58725, 14692, 35613, -28941, -24205, 34307, 14604, -53528, 9805, 53881, -47316, -21551, 58310, -18244, -36471, 35104, 17523, -33392, -9005, 44487, -4331, -48004, 39295, 25240, -56540, 17984, 41588, -40349, -16060, 37702, 4644, -39159, 3406, 42180, -32957, -27636, 55351, -15484, -49418, 44269, 18065, -46316, 565, 37013, -9444, -35514, 30572, 25226, -54058, 12488, 54372, -45614, -20693, 52381, -6673, -34833, 19223, 27339, -30693, -19049, 51501, -9393, -55080, 43657, 23506, -55075, 11346, 34327, -29843, -18992, 33247, 9860, -47529, 8123, 51177, -40195, -25304, 55114, -15797, -35537, 38810, 12415, -36842, 188, 40614, -8317, -41452, 34718, 23859, -50910]
570e0910O7792K1469q1154L2466N0408m5927k7392M2897K1106n9215P646O6511
582D5697o0502k8077Q5357k9132n7116N1515K1163m1673q753M4658p363n5940
594d0166N1214L3663q3479K0440O4162n3048j9365M3428j192l6019Q720M7080
606C5438m0704l9800P7772q752p1118N3195K4627n4393R105L8920j6922m1405
618c4037L6242M0159p0818R18P4750n4274k9214O8255j7522m6541L1102L4518
630C3538l6944l3051O0609L197p1402N1227L3381p7555K1296N5888m4222k9544
642c3582M1935K0898n2094l60O3709m8106l5441Q1352k1371o2910N4601K3225
654C1856m8632l503M2828p870m9610M2342L3841p5946J6766O3947n5894j9293
$$ y = [-50910, 16882, 38351, -42803, -10337, 40071, -5856, -33248, 9649, 30755, -28460, -20814, 45697, -14805, -42882, 42475, 13343, -43773, 7742, 28905, -12768, -21521, 23137, 15774, -40166, 11048, 44711, -38768, -18328, 45834, -7214, -26579, 16849, 15657, -20362, -11642, 35438, -5266, -45066, 32706, 23954, -47164, 6031, 30658, -23735, -14630, 24290, 7368, -34037, 2205, 42364, -28454, -27536, 47214, -7060, -36274, 31981, 14459, -32082, -980, 33538, -3406, -36457, 24152, 27349, -44053, 7174, 40555, -37000, -15704, 40184, -4038, -33582, 8353, 29251, -22843, -23203, 40506, -7600, -43041, 38311, 16940, -45970, 8631, 31856, -16776, -20279, 22549, 14679, -34931, 7411, 41252, -34694, -17928, 46019, -9875, -29168]
666b9168N2135j0281l5776J6673L6513l5571l2382O6250p373o5710N3049K1476
678B9835n8210J8910L5326k7120k5694L2920K5668n5292K034O2160m6758k5585
690c1806O2391k1314l8112L5080J7802l1129j7082M2918K566n6375L8103L1801
702C4843o4130J6071M6954m0821j7682L5090Q614l6283l40M8275l2750l4521O4970
715B8290j1508n5284M5999J8964m2489K339L1971o894l7352K8199L2686o0178
727b5257O171N9295m7024k1892N0664j0141l2647J6231K7925k7018k7109N3141
739B2339k521o0414M7159K4552n9206J7628L6642k9765j8536K9399J6239m3142
751a9626K139N3143m1119k5686O0784j9435l9452L7939J2064l1183n796L3018
$$ y = [-29168, 22967, 12686, -23090, -6417, 30096, -5475, -37857, 28393, 21020, -44690, 8359, 29835, -28375, -9465, 25861, -1259, -26953, 5967, 31635, -23657, -21623, 40537, -6221, -31806, 30585, 9271, -28841, 6239, 24041, -7088, -24170, 18748, 21314, -35061, 3042, 34843, -29287, -13216, 33738, -7083, -24765, 10325, 18939, -17344, -17684, 30591, -2159, -36680, 28290, 16782, -38502, 7497, 26461, -16028, -13689, 18282, 11388, -25964, 2235, 34921, -25257, -19086, 40209, -6815, -28707, 21957, 11816, -20831, -4600, 23325, -3693, -30802, 22339, 19818, -40596, 6563, 31115, -28091, -10463, 26179, -3586, -22122, 7277, 23516, -19626, -17487, 35656, -5463, -31149, 29635, 10200, -29252, 8687, 20751, -10432, -16228, 16790]
763A6790k604m3023L2206K7105n7475J5444M3243m2185j0477L5595m026k6511
775a5918N961L2565k4352k6995N1021q665m6156M1986J1947l9334J0717K3240
787A6017j0672k2823J8509K4847m2853J014M8073l8042j8319M5314j3283k6291
799a8509J7734J7051j8216k0556L6887K908m8664L3857K5326n1081J2856L3487
811B3080k6621j3571K2680J1969l0418l331M4572k8695k8988N2907j0457m0342
823b7215L3714J2842k9531k479K6228j010l6677K3695K9799n1149O606M5676l8359
836g860j4183L7630o645k5195Q916K6786k0233k5430M4575l320m6212L8838J5882
849B3549m3186J3222K4887j6985j6917J8633J8174l6006J06M3878l4619j9150
$$ y = [16790, 14186, -28837, 3369, 30474, -27001, -11557, 31686, -10499, -20976, 14619, 10593, -15918, -9957, 22608, -1744, -28739, 22282, 13617, -32539, 9447, 21394, -17940, -7223, 16017, 5345, -17478, 1031, 25878, -16975, -15961, 32112, -5930, -24249, 21065, 7782, -18509, -775, 16276, -1940, -22496, 14391, 17299, -31365, 2492, 27818, -23263, -10407, 23080, -3541, -17112, 5568, 17537, -12881, -16212, 28360, -335, -29323, 23584, 13127, -27215, 6499, 19341, -10190, -12669, 13559, 12549, -24128, -433, 29366, -21783, -15177, 30499, -7860, -22043, 15587, 8942, -16253, -7337, 19449, -784, -26214, 18361, 15041, -31171, 7667, 23549, -19637, -6415, 18472, 1487, -15430, 3203, 21377, -14629, -14523, 29355, -5264, -24414]
861b4414M6631j5557k7782K4879R797j9145r815K6870J512l8545K7304K2946m6326
874b1645J2878L1627k9509p109K1791K769k0611q18L1151j9498k4997M2650o670
887A2009l6044L0846R490k7291L912J7680k433k4576J3931K5557l8220L52M0306
900B5519l0902j4430L3834p376k0007R203J7682j2701k1757L3197L661m2089K9438
913C272J9957m0604R845K5259j7402j3081J5134J5196k7906m389L9826k6049k3757
926b4699M3898j0145l0641K5170J0442k1029n934K2851K009l3964K1314K4884
938B4156m3134P569L5340l0518q773K6521k599j9233L456K4977j7047k2212L8221
951A6724m397l6671L1723R839l1575R408J7417r622j6186J3168J8198l1112M14
$$ y = [-24414, 22217, 6660, -21122, 3757, 13554, -5591, -15406, 11464, 12976, -25569, 1735, 24681, -21645, -8767, 22860, -6649, -13758, 8033, 10802, -9809, -10627, 20524, 1026, -23971, 18679, 12009, -24035, 6811, 16301, -10990, -7078, 10602, 8169, -16407, -2476, 23081, -15139, -14787, 25519, -5383, -19813, 14021, 6645, -13362, -4159, 13523, 822, -20935, 12262, 15923, -26166, 3272, 23229, -17375, -7530, 17729, 327, -12754, 2380, 17576, -10330, -14719, 25107, -942, -24699, 19199, 9054, -21587, 3583, 14025, -7004, -12938, 9913, 11922, -22042, -728, 24156, -18978, -11409, 23931, -6587, -15360, 11161, 8562, -10671, -7215, 17762, 715, -21497, 16724, 12327, -24344, 7379, 17218, -14357, -4949, 12468, 2846, -13340, -172, 18026, -13086, -12672]
964a2672L5831k8562j3440L4758j1815j8935J5714R245j2286j2106K4060K639
976A2431l3575K3760J7363l6707J1344K2646k0805n781J4165N815j7655l550K8772
989A8223j7723k0986L6122p151k7757K3800O576j8557m49J4385J597k3381J2701
1002b600K2298l3426K298L2095k5461r289K4945n146j4011L402J7504j0435j9639
1015a7465K9288J002l3970K5239J2923l0210Q236J6915j0606j2234J0836J4642
1027A4596k4034l620L3023k2790j6428L4171r856k0826J7896P803j3467p952J9146
1040G662L167k8536J8881J8141l4311R077K4405k3142n139J6676J141j4441j334
1053g753K2381j3704j9096L1478m902k7633K4195O203k0789M242J2329k519j6190
$$ y = [-12672, 23159, -5403, -18843, 15915, 4100, -14835, 879, 10124, -2162, -14268, 9792, 12431, -21144, 2616, 19979, -16728, -5384, 17262, -3543, -9324, 4841, 10656, -6999, -10549, 18223, 500, -20486, 15636, 8485, -19272, 4528, 11104, -7453, -7902, 6483, 8080, -15301, -2600, 19698, -13728, -11430, 20665, -4796, -14085, 10860, 5714, -8297, -4895, 12609, 2174, -17465, 11823, 12825, -21145, 4094, 17017, -13193, -4957, 11958, 1352, -10882, -46, 14596, -9438, -13058, 19965, -2825, -19253, 14918, 5062, -15764, 2132, 9935, -3532, -11484, 7662, 10829, -17707, 1174, 19315, -14996, -5919, 18486, -4656, -9795, 6881, 8022, -6419, -7753, 14628, 924, -18172, 13306, 8404, -19229, 4966, 11169, -9620, -5378, 6951, 4432, -11758]
1066a1758J0107J7564k7204P03K9539k3216r316K5380q034j2655Q098J0187q467
1079I28j4092K1556L349k9352J9946J3681k8327Q063J6003j3121p095R461R951
1092A0951j7816m367K7469j6686j7216L0630p449k0779J8542N553j3589l546J4588
1105F285K687k3206J3487J8416l0048M856K5203k1766o171J8228k020j2404Q61
1118e592J7455j0541j7393K7569k195k8411K2981Q773k3729O700J2507o788j0801
1131i465R064J3198k2779J92K7607k1531j0716K7170r103j4008J2249O183r567
1144a506p709J6924J604k4883J7848J2911k7755Q641J6791j7017l115J0950K924
1157F608j2467k378K0481j2729j4610K6267o537j9392J9546L043j4566K061R998
$$ y = [-11758, -1651, 15913, -11291, -10588, 18951, -4265, -13581, 11799, 3765, -8890, -792, 9395, 928, -13164, 8392, 11741, -17611, 2335, 16016, -12311, -4248, 11755, -1366, -8461, 1000, 10951, -6865, -11232, 16237, -449, -17665, 12965, 5516, -15263, 3279, 8832, -4757, -8303, 6285, 8972, -14234, -747, 17669, -12379, -7523, 17680, -4086, -10257, 7971, 5951, -6453, -5592, 11863, 1322, -16071, 11498, 9303, -19108, 3873, 12646, -11083, -4383, 8124, 1336, -9465, -401, 12797, -9982, -9790, 17817, -3714, -14430, 12740, 3637, -10371, 1878, 8061, -1506, -9215, 7709, 9313, -15570, 2278, 15189, -12566, -3925, 12866, -4151, -7266, 3684, 6608, -5859, -8237, 12244, -485, -15095, 11172, 4635, -14757, 4789, 7832, -6734, -4673, 5325]
1170E325M62j5191Q306J4991k3335K903K2280j9625n798J8517m805r747K903J0433
1184G619n777j3961J9290J428k4023J7597R422k1765O324J1637p772p129O452
1197f58J0483j5993l211K3753j5595j2563K4681o444j4829J2765M779r313n126
1210g271J3143K642k1097J2407J4927k5319N564J7943j6666l776J2397K58j0777
1223e625j009J6793r223j5252K3647k866k1168J8576M742j6647M630R425k620
1236C403j1134O699J2965j9382K90K1922j7825o701J9357o506r932O503O742o118
1250B83r530J5238J761k1201J5101R621k1317O499J1983j0347l901O965N279j1126
1264d692k559J8594j1529j2258K2073n056j4902J3558L061r046j584Q668K160
$$ y = [5325, 5787, -9404, -1098, 13893, -9442, -6539, 15741, -3884, -9682, 8835, 4030, -5717, -2814, 7619, 1842, -12119, 7171, 8599, -15424, 2173, 11595, -10170, -3846, 7791, 19, -7110, -658, 9825, -6168, -9379, 14374, -1221, -13784, 10897, 4453, -10376, 2389, 7168, -2145, -7271, 5872, 8514, -12583, -176, 14751, -10568, -5004, 12939, -3727, -7503, 4894, 5152, -5625, -6634, 10159, 936, -14316, 9331, 6465, -14703, 3873, 8615, -8032, -3402, 6023, 3403, -7731, -1032, 11933, -7449, -7159, 14763, -3062, -9763, 9594, 3088, -6844, -341, 6401, 283, -9247, 5991, 7752, -13449, 1652, 11273, -10044, -3545, 8438, -1909, -5810, 1155, 6434, -4692, -7251, 11343, -186, -12444, 9629, 4573, -10329, 3229, 6290, -2756, -4340, 4328, 6488]
1277F488j5594Q001J3606k0649K142J8116j5131m441J2520j533q167J09J1963
1290G430o258j3157J8800O8j9961J5493O764j6875M800Q972m052q184N376J0941
1304A0157j5761j414J9955j4612q706J9771o042j1344R180M925o970o832J2378
1317D685K404j8991J2603J0577k0979N623J3870j2661l282R087J938r649q27J4969
1331I367r418j1080K0068m232j5251J4444K702j1329K151P157o52j0720O325J0808
1345A0340j7407J839J6447j4592m176J3834m628o781L306O879m814r192J3952
1358E007Q52j6826J3396N837j6098N958P809o055m216M416O766j0203k567J5842
1372I918j0296q905J7294m783j0594R121K874o027l951Q426K702j4638P978J0731
$$ y = [6488, -9106, -1105, 12501, -8148, -6006, 12110, -3021, -7462, 5058, 3525, -4642, -4533, 7430, 1172, -11985, 6815, 6883, -13078, 2415, 9179, -7696, -2896, 6076, 2024, -6160, -784, 10157, -5604, -7018, 12937, -1675, -10381, 9390, 3348, -7996, 1184, 6109, -861, -7693, 4685, 7089, -11902, 701, 11278, -9701, -4078, 9792, -2869, -6151, 2936, 4874, -4775, -5602, 9367, -51, -11131, 8937, 4705, -10546, 3898, 6600, -4729, -2578, 4579, 3927, -6793, -468, 10340, -7067, -5228, 11219, -3373, -7549, 6285, 1657, -5124, -1818, 5061, 247, -8945, 5007, 5859, -10967, 2429, 8266, -7832, -1874, 5935, -120, -4336, 80, 6846, -3357, -5924, 9918, -378, -9283, 8011, 3228, -7366, 1755, 4629, -1398, -5349, 3077, 5779, -8859, -881, 9850]
1386I850j7799L585J3328j1646l141R119Q0o886r80J1685n905j1291J6829j261
1400E567j5762J3292L927j2086K878O816j770q486M795J0059j4667r01J6975j3083
1414b446n626J4679m464p845N126M764m454p035J1782J461j6130J1329P559j6297
1428g597N243R659q722k659N713L528q340j742J3503q536q734J6323m233j1235
1442g829J0242K034p287m20N983R86j0529N912R447j4617J636J2920j1297k610
1456e429R693k378n269J026P508l949q884J2863J94j4377J1259M599j2157L716
1470a585N782k815n287L512P123j0397j893J4510j0024o962J4298m443p719O205
1484C05L535m473m819Q320K311j3309Q136Q402j5200L970J0113q774k823O857
$$ y = [9850, -7949, -4364, 8964, -2682, -5823, 3296, 3376, -3510, -4490, 7195, 1290, -10001, 6828, 5567, -10195, 3097, 7024, -5062, -2184, 4632, 2862, -5624, -829, 9230, -5437, -6338, 10637, -2446, -8072, 6607, 2143, -5702, -576, 4188, -266, -7301, 4481, 5942, -10188, 1141, 8700, -7597, -2354, 7305, -1417, -4076, 1637, 5165, -3175, -4917, 8586, 50, -8684, 7639, 3406, -7829, 2413, 4447, -2840, -3260, 2723, 3709, -6820, -908, 8539, -6078, -4442, 8478, -2819, -5429, 4264, 1886, -3383, -2357, 5151, 1202, -7682, 5181, 5375, -9002, 2257, 6856, -5301, -1585, 4197, 1382, -3905, -393, 6730, -3667, -5560, 8950, -1074, -8036, 6262, 1819, -5900, 305, 3840, -633, -5452, 2868, 5179, -8130, 6, 8408, -6792, -2822, 7291, -1483, -4306, 2551]
1498B551J330o288j557J1049o335r240J4897k491j2113J0539K565q742J396N339
1512B900n19q014M868Q470j3234J022J2745j0865l233J0726l588n055L243M615
1526D081l741o223J0191O00j2814R935M932j2643M695N985n341k786L446M485
1540D802p410k066J2071q244o245J2808m112p743P335J496m290j872N375J829
1554C734r986N739P741j2564K526R733q772j822O226j07m417p60P529l382p911
1569f493J1024l48j1523R396K637q674K363M021r35n352K545P159r868r30J2368
1584G390q885m666J0774k845n685L549L816k858n685Q021K098j1934P606O197
1598F893j2173L755O856o357k055L887K993n851k022J0252o225p224J2462k868
$$ y = [2551, 3881, -2407, -3964, 7085, 750, -8490, 6407, 3916, -8197, 2342, 4907, -3835, -2439, 2900, 2381, -5633, -765, 7705, -5529, -4507, 8238, -2627, -5860, 4866, 1278, -3777, -534, 4081, 340, -5883, 4308, 4908, -7906, 2029, 6961, -5682, -987, 4998, -343, -3129, 317, 4802, -2608, -4674, 7397, -847, -7092, 5716, 1604, -6139, 1196, 2692, -1598, -3470, 1905, 3734, -6252, -513, 7228, -5336, -2810, 6923, -1849, -3671, 2555, 2448, -1969, -2729, 4800, 1418, -6493, 4531, 4183, -7340, 2056, 4693, -3981, -1618, 2403, 1468, -3884, -1339, 5820, -4048, -4978, 7390, -1495, -6161, 4613, 1768, -3917, -368, 3448, 590, -5095, 2926, 5024, -6910, 696, 6893, -5280, -1525, 5331, -1026, -3081, 806, 3799, -2052, -4074, 6178, -47, -7271, 5191, 2323]
1612B323q730Q230J330n635J1M638N91p357L732P479j1172J524R502q339j663
1627c536P328k374l524Q97N018k537o790R314N2j0428Q099L270r260L534L684
1642B747k733l071K250M885o792j459J0225p070m812J0434l144n180M465J862
1656B607k653l347N505J976r359N553N989j0568K478O803o288j235L858J046l828
1671a463j897P973l921p210J0648j435q941P708J807o077P82L742L84n994L027
1686h67O546r195P8R895p651k955Q289k747l851J874L646k116n693P426J410j0412
1702f323P237M432j0120L672M622m032k124K475L502n781j366Q946n825m763J0192
1717D744l192o237O337P01l496r59L708J531p403M296N757r734J961O874o629
$$ y = [2323, -6407, 1823, 3153, -2482, -2471, 2167, 2758, -4599, -867, 6612, -4560, -3036, 6466, -1873, -3536, 3792, 1418, -2106, -1209, 3809, 1272, -5518, 3796, 3848, -6580, 1519, 4789, -4471, -937, 2747, 14, -3057, -807, 4078, -2714, -4173, 6052, -1018, -5830, 4604, 1460, -3720, 745, 2607, -46, -3393, 2112, 4088, -5271, 282, 6271, -4297, -1819, 4984, -1304, -2539, 1319, 2365, -1463, -3360, 4613, 692, -6518, 4130, 2695, -6246, 1462, 3269, -2808, -2026, 1716, 2100, -3894, -867, 5679, -3516, -3438, 6457, -1194, -4149, 4140, 1393, -2458, -584, 3062, 946, -4747, 2679, 4089, -6323, 914, 5346, -4774, -1102, 3520, -512, -2636, -161, 3341, -2440, -3806, 5140, -685, -5448, 4744, 1552, -4685, 1652, 2353, -1143, -2102, 1606, 3137, -4266, 30, 5787, -3947, -1986, 4888, -1741]
1732a741q10M584p83k808l83N275k727n960Q411l43q485P128J655o320K473K458
1748A624n76l604J731N325o793j024Q904o306l119P597k542l882K864J822j398
1763F23l863M912J880q603N442M190q558K553M900m635j092K479J781l445j916
1778c352P632l943n531R246j906o722O012R74l880K85K744J017n648K538N720
1793E186q116O18P521o698j678N549j574k356K07L696j394n696P005N19q269O479
1809I99K512p224K774K844j769j979J301L890n118j170P675m830l846P931k964
1824A026l775L639P59j770k020L253J951o951L709M585p849J972N159n113m67
1839a892K836K34k396j019N261k418n087P320p02o262N652Q08m214J066K062L68
$$ y = [-1741, -2551, 2033, 1250, -1558, -1941, 3334, 607, -5353, 3058, 2715, -5770, 1358, 3013, -3307, -834, 1624, 1048, -2556, -825, 4500, -2293, -3317, 5587, -719, -3838, 3759, 1217, -2665, 199, 2021, 623, -3240, 1672, 3552, -5051, 391, 4581, -3977, -1424, 3476, -1159, -2251, 228, 2009, -1436, -3352, 4280, 337, -5194, 4052, 2146, -4576, 1436, 2410, -1470, -1185, 1559, 2576, -3072, -534, 5186, -2930, -2312, 5209, -1489, -3167, 2382, 808, -1548, -1341, 2355, 961, -4735, 2270, 2789, -5480, 999, 3511, -3713, -939, 1905, 136, -1843, -542, 3348, -1770, -2940, 4735, -95, -3941, 3990, 1026, -2749, 890, 1649, -121, -2141, 1112, 3063, -3888, -179, 4406, -3443, -1471, 3688, -1425, -1892, 944, 1178, -1218, -2237, 3024, 606, -4481, 2839, 2137, -4125, 1527, 2335, -1879, -813, 1249, 1617]
1855A617l750J127N346o498o46P517n818k161N985j889k768J108K364p25m549
1870c740N238J556p964N030L450o798K253L625l126j052J262K893l714j567O646
1885C992l775m217P697k208m808M789K99k349p29K245J458n352K326M906p487
1900c213J416N713n244p10L561j094j502m46L669j490m606O289n0o278N165J109
1916B289m666K224J547n41j930N34L615m270j130O379m412k583N729k256k766
1931b237K585N72o46k808L373J818o232L427L593o392J877L823l713j10J463J338
1947A731j887j974N162k112m615O391r13m765M543J59k680J07J410J218l978J166
$$ y = [1617, -2133, -1006, 4340, -2158, -2804, 4713, -1105, -3266, 2719, 830, -1938, -830, 1534, 809, -3740, 1498, 3054, -4910, 120, 3570, -3228, -975, 2650, -476, -1528, -266, 2627, -1087, -2654, 3992, 217, -4000, 3697, 1489, -3319, 1470, 1769, -580, -1309, 936, 2394, -2958, -632, 4274, -3213, -1797, 3916, -1328, -2038, 1523, 429, -1073, -1519, 2150, 660, -3946, 2343, 2293, -3985, 1180, 2289, -2377, -153, 1394, 853, -1077, -543, 3072, -1198, -2328, 4051, -361, -2944, 2785, 529, -2237, 348, 920, 274, -2534, 839, 2657, -3575, -148, 3445, -2947, -1070, 2753, -960, -1070, 393, 1731, -156, -2130, 3032, 920, -3695, 2696, 1783, -2982, 1561, 1720, -960, -853, 557, 1775, -2203, -1037]
$$ [...]
8191a52
##END NTUPLES=NMR FID
##END=
