##TITLE=1H_Pr 54-Eth
 CDCl3
 8 sc, 
 25.10.2022
##JCAMPDX= 6.0         $$ Bruker NMR JCAMP-DX V2.0
##DATA TYPE= NMR FID
##DATA CLASS= NTUPLES
##ORIGIN= UXNMR, Bruker Analytische Messtechnik GmbH
##OWNER= root
$$ XWIN-NMR		Version 3.5
$$ Tue Oct 25 14:48:47 2022 Russian Standard Time (UT+4h)  she@DPX200
##.OBSERVE FREQUENCY= 200.1313499994
##.OBSERVE NUCLEUS= ^1H
##.DELAY= (6, 6)
##.ACQUISITION MODE= SIMULTANEOUS
##.ACQUISITION SCHEME= undefined
##.AVERAGES= 8
##.DIGITISER RES= 18
##SPECTROMETER/DATA SYSTEM= spect
##.PULSE SEQUENCE= zg30
##.SOLVENT NAME= CDCl3
##.SHIFT REFERENCE= (INTERNAL, CDCl3, 0, 15.7039)
##AUDIT TRAIL= $$ (NUMBER, WHEN, WHO, WHERE, WHAT)
$$ ##TITLE= Audit trail, XWIN-NMR		Version 3.5
$$ ##JCAMPDX= 5.01
$$ ##ORIGIN= Bruker BioSpin GmbH
$$ ##OWNER= she
$$ F:/spectra/data/she/nmr/H-F/1/audita.txt
$$ ##AUDIT TRAIL=  $$ (NUMBER, WHEN, WHO, WHERE, WHAT)
(   1,<2022-10-25 14:47:54.40 +0400>,<she>,<DPX200>,
      <created by zg, POWCHK disabled, PULCHK disabled
       configuration hash MD5:
       00 E9 B6 7A A2 85 ED C7 34 08 36 98 17 FE 4E 26
       data hash MD5: 16K
       3B CB 29 66 83 D7 1E 6B 4B 05 83 7A F0 87 90 BA>)
$$ ##END=
$$ 
$$ hash MD5
$$ 80 47 0B 9C 8F 9C BC 7E 80 20 DC 0F D2 6E 2F C3
##$RELAX= 
##$RELAX= 
##$RELAX= 
##$RELAX= 
##$RELAX= 
##$RELAX= 
$$ Bruker specific parameters
$$ --------------------------
##$DU= <F:/spectra>
##$EXPNO= 1
##$NAME= <H-F>
##$PROCNO= 1
##$TYPE= <nmr>
##$USER= <she>
##$AMP= (0..31)
100 100 100 100 100 100 100 100 100 100 100 100 100 100 100 100 100 100 
100 100 100 100 100 100 100 100 100 100 100 100 100 100 
##$AQSEQ= 0
##$AQ_mod= 1
##$AUNM= <au_zg>
##$AUTOPOS= <>
##$BF1= 200.13
##$BF2= 200.13
##$BF3= 200.13
##$BF4= 200.13
##$BF5= 200.13
##$BF6= 200.13
##$BF7= 200.13
##$BF8= 200.13
##$BYTORDA= 1
##$CFDGTYP= 0
##$CFRGTYP= 5
##$CHEMSTR= <none>
##$CNST= (0..31)
1 1 145 1 1 1 1 1 1 1 1 1 1 1 1 1 1 1 1 1 1 1 1 1 1 1 1 1 1 1 1 1 
##$CPDPRG= <>
##$CPDPRG1= <>
##$CPDPRG2= <>
##$CPDPRG3= <>
##$CPDPRG4= <mlev>
##$CPDPRG5= <mlev>
##$CPDPRG6= <mlev>
##$CPDPRG7= <mlev>
##$CPDPRG8= <mlev>
##$CPDPRGB= <>
##$CPDPRGT= <>
##$D= (0..31)
0 1.2 0 0 0 0 0 0 0 0.06 0 0.03 0 0 0 0 0.0002 0 0 0 0 0 0 0 0 0 0 0 0 
0 0 0 
##$DATE= 1666694873
##$DBL= (0..7)
120 120 120 120 120 120 120 120 
##$DBP= (0..7)
150 150 150 150 150 150 150 150 
##$DBP07= 0
##$DBPNAM0= <>
##$DBPNAM1= <>
##$DBPNAM2= <>
##$DBPNAM3= <>
##$DBPNAM4= <>
##$DBPNAM5= <>
##$DBPNAM6= <>
##$DBPNAM7= <>
##$DBPOAL= (0..7)
0.5 0.5 0.5 0.5 0.5 0.5 0.5 0.5 
##$DBPOFFS= (0..7)
0 0 0 0 0 0 0 0 
##$DE= 6
##$DECBNUC= <off>
##$DECIM= 32
##$DECNUC= <off>
##$DECSTAT= 4
##$DIGMOD= 1
##$DIGTYP= 9
##$DL= (0..7)
0 120 120 120 120 120 120 120 
##$DP= (0..7)
150 150 150 150 150 150 150 150 
##$DP07= 0
##$DPNAME0= <>
##$DPNAME1= <>
##$DPNAME2= <>
##$DPNAME3= <>
##$DPNAME4= <>
##$DPNAME5= <>
##$DPNAME6= <>
##$DPNAME7= <>
##$DPOAL= (0..7)
0.5 0.5 0.5 0.5 0.5 0.5 0.5 0.5 
##$DPOFFS= (0..7)
0 0 0 0 0 0 0 0 
##$DQDMODE= 0
##$DR= 18
##$DS= 0
##$DSLIST= <SSSSSSSSSSSSSSS>
$$ [...]
##$SUBNAM2= <"">
##$SUBNAM3= <"">
##$SUBNAM4= <"">
##$SUBNAM5= <"">
##$SUBNAM6= <"">
##$SUBNAM7= <"">
##$SUBNAM8= <"">
##$SUBNAM9= <"">
##$SW= 18.0517283424941
##$SWIBOX= (0..15)
0 0 2 0 0 0 0 0 0 0 0 0 0 0 0 0 
##$SW_h= 3612.71676300578
##$TD= 16384
##$TD0= 1
##$TE= 0
##$TE2= 300
##$TE3= 300
##$TEG= 300
##$TL= (0..7)
0 120 120 120 120 120 120 120 
##$TP= (0..7)
150 150 150 150 150 150 150 150 
##$TP07= 0
##$TPNAME0= <>
##$TPNAME1= <>
##$TPNAME2= <>
##$TPNAME3= <>
##$TPNAME4= <>
##$TPNAME5= <>
##$TPNAME6= <>
##$TPNAME7= <>
##$TPOAL= (0..7)
0.5 0.5 0.5 0.5 0.5 0.5 0.5 0.5 
##$TPOFFS= (0..7)
0 0 0 0 0 0 0 0 
##$TUNHIN= 0
##$TUNHOUT= 0
##$TUNXOUT= 0
##$USERA1= <user>
##$USERA2= <user>
##$USERA3= <user>
##$USERA4= <user>
##$USERA5= <user>
##$V9= 5
##$VALIST= <valist>
##$VCLIST= <CCCCCCCCCCCCCCC>
##$VD= 0
##$VDLIST= <DDDDDDDDDDDDDDD>
##$VPLIST= <PPPPPPPPPPPPPPP>
##$VTLIST= <TTTTTTTTTTTTTTT>
##$WBST= 1024
##$WBSW= 4
##$XGAIN= (0..3)
0 0 0 0 
##$XL= 0
##$YL= 0
##$YMAX_a= 184176
##$YMIN_a= -220621
##$ZGOPTNS= <>
##$ZL1= 120
##$ZL2= 120
##$ZL3= 120
##$ZL4= 120
##$ABSF1= 10
##$ABSF2= 0
##$ABSG= 5
##$ABSL= 3
##$ALPHA= 0
##$AQORDER= 0
##$ASSFAC= 0
##$ASSFACI= 0
##$ASSFACX= 0
##$ASSWID= 0
##$AUNMP= <proc_1d>
##$AZFE= 0.1
##$AZFW= 0.1
##$BCFW= 1
##$BC_mod= 2
##$BYTORDP= 1
##$COROFFS= 0
##$CY= 11.3945322036743
##$DATMOD= 1
##$DC= 2
##$DFILT= <>
##$DTYPP= 0
##$F1P= 2.36226072786647
##$F2P= -0.459571619588291
##$FCOR= 0.5
##$FTSIZE= 0
##$FT_mod= 4
##$GAMMA= 1
##$GB= 0.15
##$INTBC= 1
##$INTSCL= 1
##$ISEN= 128
##$LB= 0.24
##$LEV0= 0
##$LPBIN= 0
##$MAXI= 10000
##$MC2= 0
##$MEAN= 0
##$ME_mod= 0
##$MI= 1.114404
##$NCOEF= 0
##$NC_proc= 0
##$NLEV= 6
##$NOISF1= 3.799351
##$NOISF2= 2.8
##$NSP= 1
##$NTH_PI= 0
##$NZP= 0
##$OFFSET= 15.70392
##$PC= 1
##$PHC0= -18029.9
##$PHC1= 6.000701
##$PH_mod= 1
##$PKNL= yes
##$PPARMOD= 0
##$PSCAL= 0
##$PSIGN= 0
##$REVERSE= no
##$SF= 200.130013532006
##$SI= 16384
##$SIGF1= 3
##$SIGF2= 2
##$SINO= 400
##$SIOLD= 16384
##$SREGLST= <1H.CDCl3>
##$SSB= 0
##$STSI= 0
##$STSR= 0
##$SW_p= 3612.71676300578
##$SYMM= 0
##$S_DEV= 0
##$TDeff= 0
##$TDoff= 0
##$TI= <>
##$TILT= no
##$TM1= 0
##$TM2= 0
##$TOPLEV= 0
##$USERP1= <user>
##$USERP2= <user>
##$USERP3= <user>
##$USERP4= <user>
##$USERP5= <user>
##$WDW= 1
##$XDIM= 8192
##$YMAX_p= 0
##$YMIN_p= 0
$$ End of Bruker specific parameters
$$ ---------------------------------
##NTUPLES= NMR FID
##VAR_NAME=  TIME,          FID/REAL,        FID/IMAG
##SYMBOL=    X,             R,               I
##VAR_TYPE=  INDEPENDENT,   DEPENDENT,       DEPENDENT
##VAR_FORM=  AFFN,          ASDF,            ASDF
##VAR_DIM=   8192,          8192,            8192
##UNITS=     SECONDS,       ARBITRARY UNITS, ARBITRARY UNITS
##FACTOR=    0.0002768,     1,               1
##FIRST=     0,             0,               0
##LAST=      2.2672688,     0,               0
##MIN=       0,             -220621,         0
##MAX=       2.2672688,     184176,          0
$$ Real data points
##PAGE= N=1
##DATA TABLE= (X++(R..R)), XYDATA
$$ [...]
1848E07j330J241R47j845J63J591j147q66J131M91j972N90J431j305p05J621k30
$$ 507 -823 418 1365 -480 -317 1274 127 -739 392 883 -1089 -499 932 -373 -1078 543 313
1865C13j255L23J464j461k92J515n86r92J143O46j480K67J454q98o59J297r0j224
$$ 313 -942 -619 845 -616 -908 607 21 -971 172 818 -662 -395 1059 161 -498 799 709 -515
1883e15N99J068j096n32J403l66j470J132N60j076l63J088l00j362J304N02j330
$$ -515 84 1152 56 -476 927 561 -909 223 783 -293 -656 432 132 -1230 74 576 -754
1900g54K76R42o71n76J244J02j162M43R25j149r4J416k94j104O96P59j144o3J091
$$ -754 -478 464 -207 -783 461 563 -599 -156 769 -380 -474 942 648 -456 240 999 -145 -208 883
1919H83n86p87O28M55j045j13J337j049n69J152q8r53M92Q99r22o74J289l33o10
$$ 883 297 -490 138 593 -452 -565 772 -277 -846 306 218 -735 -243 656 -266 -940 349 16 -594
1938e94O82L45q27r5J322o01o60O84N88j271N88P30p79p21J160J00j412N59O85
$$ -594 88 433 -394 -489 833 232 -428 256 844 -427 161 891 112 -609 551 651 -761 -202 483
1957D83q83j43R58n91p01P63M81r58m7J148n30q90J109K65p61J11R32o86o17J171
$$ 483 -400 -543 415 -176 -877 -114 367 -591 -638 510 -20 -910 199 464 -297 -186 746 60 -557 614
1977F14j08q06N49R29j269l82J154l90p91P32L28p61m21J038k49q16Q01L06j066
$$ 614 506 -300 249 1178 -91 -473 681 291 -500 232 560 -201 -622 416 167 -649 152 458 -608
1996f08j13R99m10p42J124qr09R46L89q08m34J248k18q12N66M85r30Q7Q16n22
$$ -608 -721 278 -132 -874 250 242 -667 279 668 -140 -574 674 456 -356 210 695 -235 -148 668 146
2016A46o43R97q6q46M00Q30j083l10J126l76q94M65O56r52K31P29l49p44N93O05
$$ 146 -497 500 414 -432 -32 798 -285 -595 531 155 -739 -274 382 -570 -339 390 41 -703 -110 495
2036D95o96k8J055q96l73P62L05r44N29L90m90o44J198j29j002L33M91n59l96
$$ 495 -201 -229 826 -70 -443 319 624 -320 209 599 109 -535 663 534 -468 -135 356 -203 -599
2055e99R44l48n45N10M34p53Q3M79k54o99J002K19r15K86P15p48l9P43k60r27
$$ -599 345 -3 -548 -38 396 -357 -274 205 -49 -748 254 473 -442 -156 559 -189 -228 515 255 -672
2075f72Q32N53j048N28N25o80l05N78J57q84Q4R63p37o55Q22O2q30P15K26p04
$$ -672 160 713 -335 193 718 38 -267 311 468 -416 -332 631 -106 -761 61 123 -707 8 234 -470
2095d70j26Q93k56m38J88O12p69O1R97o67l63P64k51n41L47P35o60n46J039j19
$$ -470 -596 297 41 -397 -209 403 -366 -305 692 25 -338 426 175 -366 -19 716 56 -490 549 430
2115D30p77L46K25m04k15M78j79k50J59M02p28J0Q65o31k38N29J91n57J67P16
$$ 430 -347 -1 224 -180 -395 83 -96 -346 -187 215 -513 -503 362 -269 -507 22 213 -344 -177 539
2135E39n43n3M92l59j02L16M98p89k56P62j2p89M46K48m29j62K52J4o14O05Q9
$$ 539 -4 -57 435 76 -26 290 788 -1 -257 505 493 -296 150 398 -31 -193 59 73 -541 64 153
2156A53n11qP81o31j67N09j06m03J65N27l00r4M45j87n72M69N64p01j30O49j01
$$ 153 -358 -366 415 -216 -383 126 20 -383 -218 309 9 -85 360 173 -399 70 634 -67 -197 452 351
2177C51n75M45J66m32J23K48k39m19P82k88p68K42O68o52j01K14K06m39K85J99
$$ 351 -224 221 387 -45 78 326 87 -332 450 162 -606 -364 304 -348 -449 -235 -29 -468 -183 16
2197A6l12L62J84R5n28M20J21n34m8Q54l00m50N90m73k97L86K72m18j97M77o6
$$ 16 -296 66 250 345 -183 237 358 -176 -224 630 330 -120 470 -3 -300 86 358 -60 -257 220 154
2218A54m45J33L91o21L34j72K48n05N45J5l64K47L07n60L12L77j80n63M54L73
$$ 154 -291 -158 233 -388 -54 -226 22 -483 62 77 -287 -40 267 -293 19 396 216 -347 107 480
2238D80o48Q3N24j12n15K23L87o26O3K70k08k53K75J86p01M03L25n13n8M06P6
$$ 480 -168 -85 439 327 -188 35 422 -204 -141 129 -79 -332 -57 129 -572 -169 156 -357 -415 -9 67
2259F7m51M99K51p71P0O13P0o53L53L12j10j46J56m1k47K24K49n97J4L82k07l94
$$ 67 -384 115 366 -405 -335 278 348 -305 48 360 250 104 260 219 -28 196 445 -152 -138 244 37 -357
2281c57M72L4p46N07J41k94J19M37o35o0K78M9k23R3L09k0l57M36L3k34O9L64
$$ -357 115 149 -597 -90 51 -243 -124 313 -322 -382 -104 -55 -278 -185 124 104 -253 183 216 -18 51 415
2303D15m90jK00L18n83K37M45m64l70L68rl64L06J32m74J37J39n9l43N24o4k55
$$ 415 -75 -76 124 442 -141 96 541 77 -293 75 66 -298 8 140 -334 -197 -58 -117 -460 64 0 -255
2325b55K20J70k05k83P37k38k07M25m9m58J49J86J90m80J21M42o89J96J82j24
$$ -255 -35 135 -70 -353 384 146 -61 364 315 -143 6 192 382 -98 23 465 -224 -28 154 30
2345C0k37L37j3j42k22M76m46j36N29j99l66J35O10o03J34O05m86k0J28P11j023
$$ 30 -207 130 117 -25 -247 229 -217 -353 176 -23 -389 -254 356 -247 -113 492 6 -14 114 825 -198
2366a98K73K77l08k49O22j34o15K89L9j40j51L54j70j27j83M70k5m02M60j20m02
$$ -198 75 352 44 -205 417 283 -332 -43 -4 -144 -295 59 -111 -238 -421 49 24 -378 82 -38 -440
2387d40N07L28n99j34L40J12k99K56M0n4m2J73j3k28M83m33L8J36K02n13k08O32
$$ -440 67 395 -204 -338 2 114 -185 71 111 57 15 188 175 -53 430 -3 35 171 373 -140 -348 284
2409B84l60j58K41O6k60n0O11m14k34K89o0j75pL95k90k4J80m8K2L09k99J04j61
$$ 284 -76 -234 7 73 -187 -237 374 -40 -274 15 -45 -220 -227 168 -122 -146 34 -14 8 317 18 122 -39
2432c9K62J35l78n9L23k76M2J31j57n5L23l20j09J23j50j17O8L42k03n44N73J36
$$ -39 223 358 -20 -79 244 -32 10 141 -16 -71 252 -68 -177 -54 -204 -321 -253 89 -114 -658 -85 51
2454E1m16K48K07J35k56J4K05j55L57k4m86Q6J92L3k34P6K93k18k69L27l24k2
$$ 51 -365 -117 90 225 -31 -17 188 33 390 366 -120 -34 158 191 -43 33 326 108 -161 166 -158 -180
2476a80J71k25J47j46M43j51l50K77K75n44P8K35K8k09l8L69k30J60K48k43j82
$$ -180 -9 -234 -87 -233 210 59 -291 -14 261 -283 -205 30 58 -151 -189 180 -50 110 358 115 -67
2497f7M10k87k94M38M66p30Q8O4j44q7J13j16Q0r9J32m9k07L73l19J14k29L37
$$ -67 343 56 -238 200 666 -64 24 88 -56 -143 -30 -146 -66 -165 -33 -82 -289 84 -235 -121 -350 -13
2519a3k3r1K94r0k16J59K15l87J72J85j76k0K45J40k03l01N59k98j12j34J87N4
$$ -13 -36 -127 167 77 -139 20 235 -152 20 205 29 9 254 394 191 -110 449 151 39 -95 92 146
2541A46j23k76R7j75N53k23k31p9L63j83K7j3J83m6O3K50l07k56M88m2k65M01
$$ 146 23 -253 -156 -331 222 -1 -232 -311 52 -131 -104 -117 66 20 83 333 26 -230 258 216 -49 352
2563C52l37l1J18N2r1j5K50k82k54J72J46k87p0R2J80k68m7M10l52O1L95l86k73
$$ 352 15 -16 102 154 63 48 298 16 -238 -66 80 -207 -277 -185 -5 -273 -320 90 -262 -201 194 -192 -465
2586d65N22J87k46j36L09J3l73J66r9P4L65k08Jj34Q2J41l95J98L00l06l19M09
$$ -465 57 244 -2 -138 171 184 -189 -23 -122 -48 317 109 110 -24 58 199 -196 2 302 -4 -323 86
2608H6r1l63L63N5k14J00J71j92j76K09J52j99P8J95j21j50N23n17L27j25J66
$$ 86 -5 -368 -5 50 -164 -64 107 -85 -261 -52 100 -99 -21 174 53 -97 426 -91 236 111 277
2629B77o2k26J56r3n7P9R2l65k22N48k54N2j46L18k15K57j84Nl8O9m2o3K33m2
$$ 277 215 -11 145 52 -5 74 166 -199 -421 127 -127 -75 -221 97 -118 139 -45 -40 -78 -9 -51 -114 119 77
2653G7rl08N00l1l83L00L53m77Q7L7k04M3J28j0m59L87K89k35m46M45j34k8j0
$$ 77 68 -240 260 229 -154 146 499 22 109 146 -58 -15 113 103 -356 31 320 85 -361 84 -50 -78 -88
2676h8k28K04j8K43k39R3J18J21l23Q0L19l10n2n3L52k67M4K31k47m6K21j84M3
$$ -88 -316 -112 -130 113 -126 -33 85 206 -117 -37 282 -28 -80 -133 219 -48 -4 227 -20 -66 155 -29 14
2699A4p3L85o42K15O2R2o00P00j85M7k70L77k01j59K34L21m32q2M67r9q1j6P7
$$ 14 -59 326 -316 -101 -39 53 -547 153 -32 15 -255 122 -79 -238 -4 317 -115 -197 270 171 90 74 151
2722A51k59L08O4l99j44M63j89j90K55J92l45J4rj58R9M9j4j50M96o9l75K74k5
$$ 151 -108 200 264 -135 -279 184 -5 -195 60 252 -93 -79 -88 -246 -147 -98 -112 -262 234 165 -210 64 39
2745C9m8j47J17J56j10k79J20o6l4M22M6k47J45J55j68r6K4J57k24J32J83j71
$$ 39 -9 -156 -39 117 7 -272 -152 -218 -252 170 216 -31 114 269 101 5 29 186 -38 94 277 106
2767A06l00L26k68m8L12m6m7j42Q2j23J0J06P1l04K22P3j27K4K82j04k43K10J07
$$ 106 -194 132 -136 -184 128 82 35 -107 -25 -148 -138 -32 39 -265 -43 30 -97 -73 209 105 -138 72 179
2790A79j25N6l2O6l08K40K51k55r2R0O9l33J85R5k89j29J47L2K1jQN4K87j41j14
$$ 179 54 110 78 144 -164 76 327 72 -20 70 139 -194 -9 86 -203 -332 -185 -153 -132 -133 -125 -71 216 75 -39
2815c9j77K84K79n20M52k68J0m0J52j16r7J2K77k83O3Lq4j06L60k86l1J09J52
$$ -39 -216 68 347 -173 279 11 21 -19 133 17 -80 -68 209 -74 -11 -8 -92 -198 162 -124 -155 -46 106
2838A06l26J20K61J27l77rK53k46l13L39N8j92J69J95l87K34J46k3j14r3R4j57
$$ 106 -220 -100 161 288 -89 -98 155 -91 -404 -65 -7 -199 -30 165 -222 12 158 135 21 -72 22 -135
2860a35K33J88j18q8L3k13j62J43K16k29N7J28J68k95j0J37l08L11j32l9j04M91
$$ -135 98 286 168 80 113 -100 -262 -119 97 -132 -75 53 221 -74 -84 53 -255 56 -76 -115 -219 272
2882B72P4m68L77O8l20Q2J26l02K56j10ll83K20L04L7m80L19M9j59J6N3J09j81
$$ 272 346 -122 255 323 3 85 211 -91 165 55 52 -331 -111 193 230 -250 69 118 -41 -25 28 137 -44
2905d4K58k03l17Q1L49l7j62K10L8k47L07j50M3j71N45m44l49L38K19k86r9K7
$$ -44 214 11 -306 -225 124 87 -75 135 173 -74 233 83 126 -45 500 56 -293 45 264 -22 -121 -94
2927i4JL3J81j79j54K66J58k05j11N5K32l49P4J21k20J81J41l51J76J62J98k15
$$ -94 -93 -60 121 -58 -212 54 212 7 -104 -49 183 -166 -92 29 -191 -10 131 -220 -44 118 316 101
2949A01LJ73j57q9n0K86l04J07K85j98j38P2j74L1j05L21m37K16L82k65l56L32
$$ 101 104 277 120 31 -19 267 -37 70 355 157 19 91 -83 -52 -157 164 -273 -57 325 60 -296 36
2971C6p1j10l8pL3p5N95j89k54K99j29m5j00K78j73j49q9L64l27K86q4M7j90K02
$$ 36 -35 -145 -183 -190 -157 -232 363 174 -80 219 90 45 -55 223 50 -99 -188 176 -151 135 51 98 -92 110
2995A10m0l4l02K70j61O2K89j06j97Q7N2j53p0K94j13j4J80l9l32J18L20j13n1
$$ 110 70 36 -266 4 -157 -95 194 88 -109 -22 30 -123 -193 101 -12 -26 154 115 -217 -99 221 108 57
3018E7J96j43k01j2M24j77k26K41r1j94J80N9k69j9P3J14l46N1J25K11L7j8k03
$$ 57 253 110 -91 -103 321 144 -82 159 68 -126 54 113 -156 -175 -102 12 -334 -283 -158 53 90 72 -131
3041a31k32N11K25m47J72J13kj60J84m9l52J45K23j56M8J81k00k60K05jj9k5P8
$$ -131 -363 148 373 -74 98 211 209 49 233 184 -168 -23 200 44 92 273 73 -187 18 17 -2 -27 51
3064E1r1k30N9RJ22j36J5L04j58o9R8p9K45J79n19Q0L40k67k12L71J29k67j4J98
$$ 51 -40 -270 -211 -202 -80 -216 -201 103 -55 -124 -26 -105 140 319 -200 -120 220 -47 -259 112 241 -26 -40 158
3088A58j03q7K29j25j60L1J31j40l80M11L2Q5j68J11k77K98j06j34o3K68J08j68
$$ 158 55 -32 197 72 -88 -57 74 -66 -446 -35 -3 82 -86 25 -252 46 -60 -194 -257 11 119 -49
3110d9K38O1l70L08j59o6j10J12K63j12j70K71j22k62K92j04m2k58L87j98K2P7
$$ -49 189 250 -120 188 29 -37 -147 -35 228 116 -54 217 95 -167 125 21 -21 -279 108 -90 -68 9
3132Ij52L9J05j09j8J40P0O9k09M9L82j74k05M72k80m94K98K99l44J3K50k06r6
$$ 9 -143 -104 1 -108 -126 14 84 153 -56 -7 375 201 -4 468 188 -306 -8 291 -53 -40 210 4 -92
3155i2K41qk29J23J9j84k08K89j71K67r3J99k68k32N22j67j83M00km08L05j16
$$ -92 149 141 -88 35 54 -130 -338 -49 -220 47 -46 153 -115 -347 175 8 -175 225 223 -185 120 4
3177Dj32r1L93J5j6j89l5J51k82M37m71J82n4J94k39m5K73l82pJ75J81j30k00
$$ 4 -128 -219 174 189 173 -16 -51 100 -182 255 -216 -34 -88 106 -133 -178 95 -287 -294 -119 62 -68 -268
3200b68L85k06N1J81k68K2J47p5J59j35K55l03M0L82l18j18j0L58l81n3L67j28
$$ -268 117 -89 -38 143 -125 -103 44 -31 128 -7 248 -55 -15 367 49 -69 -79 279 -102 -155 212 84
3222H4j38q6J76K4O3O6J11l77L6J9J04j16L03k18k48n1M85k63N8J80j15k60L06
$$ 84 -54 -140 36 60 123 189 300 -77 -41 -22 82 -34 269 51 -197 -248 237 -26 32 212 97 -163 143
3245A43j86k62K88L0Q7m23M72J62n17K33r5J02l56L12j10lJ39J55j32j31J53j36
$$ 143 -43 -305 -17 13 100 -323 149 311 -206 27 -68 34 -322 -10 -120 -123 16 171 39 -92 61 -75
3267g5p3k6K93l23J84n9Nk1L59j77j23J64L3q1j40K39p3n04L78J38j36J31J72
$$ -75 -148 -174 119 -204 -20 -79 -74 -95 264 87 -36 128 161 80 -60 179 106 -398 -20 118 -18 113 285
3290B85k65j47K02j20l33N41j28n4k05J22K72m66L67J8r0N6J88ok76J32Rj68K17
$$ 285 20 -127 75 -45 -378 163 35 -19 -224 -102 170 -296 71 89 -1 55 243 237 -39 93 102 -66 151
3313A51O7m41M9J89m5j11j24K52k43O0J95K9k63L83K22n38m0M50n9m18L60L8l01
$$ 151 218 -223 -174 15 -30 -141 -265 -13 -256 -196 -1 28 -235 148 370 -168 -208 242 183 -235 125 163 -138
3336a38K53o0j55J35j1K61l10K4K12r8N1k46J35j94J7J89j35M9M4r8n1J9L78m87
$$ -138 115 55 -100 35 24 285 -25 -1 211 113 164 -82 53 -141 -124 65 -70 -21 23 -75 -126 -107 271 -216
3360b16J37J25q8%m5K04m3M4J56k37k54L31j05R2J1J55j09k93K18k11j04K58k4
$$ -216 -79 46 -42 -42 -87 117 74 118 274 37 -217 114 9 101 112 267 158 -135 83 -128 -232 26 2
3383Bj8j42K15l73K11K56p9j84k1P0m0k31K65J12n01M98N3l52N1L58km59M10K
$$ 2 -16 -158 57 -316 -105 151 72 -112 -133 -63 -103 -334 -69 43 -458 40 93 -259 -208 150 148 -311 99 101
3407A01k68j5L86m48mM50k5l88L96j00k38K1J20k09L43JJ03m89K71q5J81l39J59
$$ 101 -167 -182 204 -244 -248 202 177 -211 185 85 -153 -132 -12 -221 122 123 226 -263 8 -77 104 -235 -76
3430g6K19k90J2OM8J29J1N5j89J90M3j37j45J13j01M3L34m41J42j95J03J94j89
$$ -76 143 -147 -135 -129 -81 48 59 114 -75 115 158 21 -124 -11 -112 -69 265 -176 -34 -229 -126 68 -121
3453a21p0L1L30n77N24r2m12N30j42q1K24J71l39n8L77m29J75j44L14k04p3N08
$$ -121 -191 -160 170 -407 117 25 -387 143 1 -80 144 315 -24 -82 295 -134 41 -103 211 7 -66 442
3475D42m14J14k6l2l09J08J05J09k14J08j00j38J93L28m93K6Q3j18r8L53J99o69
$$ 442 28 142 116 84 -225 -117 -12 97 -117 -9 -109 -247 -54 274 -219 -193 -110 -228 -326 27 226 -443
3497d43K07L39K23l47L14j81l74L62J05k83j30K24n9j82K98j93R3j08L32k81p9
$$ -443 -236 103 326 -21 293 112 -262 100 205 -78 -208 16 -43 -225 73 -120 -27 -135 197 -84 -163
3518a63L95l81K09M5j04q0j14j1M07l05J10l7q6L1J51j37J08p7L55m19K28M1l91
$$ -163 232 -149 60 105 1 -79 -193 -204 203 -102 8 -29 -115 -84 67 -70 38 -39 316 -103 125 166 -225
3541b25J49L73m29Q1J43j01j45J38P7j48j15J58q1M4k00K62N3j33K60Q5k01j88
$$ -225 -76 297 -132 -51 92 -9 -154 -16 61 -87 -202 -44 -125 -81 -281 -19 34 -99 161 246 45 -143
3563a43K21Qj91K82j08k98L48j92m0K30J23j27m37L86Q6l39P0J32k3k63L9M14
$$ -143 78 86 -105 177 69 -229 119 -73 -113 117 240 113 -324 62 148 -191 -121 11 -12 -275 -236 178
3585A78j89j79M32m57J95K17l63J83q5%L5r7L71l65j8L20L1l64K70q7l3j69K37
$$ 178 -11 -190 242 -215 -20 197 -166 17 -68 -68 -33 -130 241 -124 -142 178 209 -155 115 28 -5 -174 63
3608F3%k04L19N3j51n39N49k24p3K44n2Q5k00K19l31K06N8J12j05M6n7k24J52
$$ 63 63 -141 178 231 80 -459 90 -134 -207 37 -15 70 -130 89 -242 -36 22 134 29 75 18 -206 -54
3631e4K25l1j90O7lq2J77JJ74l70K03N4j7k61J76k29K70q0l33J88j19M90k78k2
$$ -54 171 140 -50 17 14 -68 109 110 284 -86 117 171 154 -107 69 -160 110 30 -303 -115 -234 256 -22 -44
3655d4R6r2J54J0J31l31L09K8l73K70o3J18n92K58M22l72j28L05l18P1J21m9P7
$$ -44 52 -40 114 124 255 -76 233 261 -112 158 95 213 -379 -121 301 -71 -199 106 -212 -141 -20 -69 8
3678Hk89L16pk44K82K12n14J90K69j13k35K16M8l33J64K36j53j16J70j3n1m7K85
$$ 8 -281 35 28 -216 66 278 -236 -46 223 110 -125 91 139 -194 -30 206 53 -63 107 94 43 -4 281
3701B81k54k21L19j03l1K3O4j13M9o8J29k78J94P5j14j27L72j62j95N84m65j48
$$ 281 27 -194 125 22 -9 14 78 -35 14 -54 75 -203 -9 66 -48 -175 197 35 -160 424 -41 -189
3723a89j84N55j63J27K99n3m75K50m4j44K61j64j87R3k0O2j09J42nj13k32L06
$$ -189 -373 182 19 146 445 392 -83 167 123 -21 240 76 -111 -18 -38 24 -85 57 52 -61 -293 13
3745A3J09j21n6Km0r6M36j12k62K8K90j90j53K55K37j24j54J30n12J03K76J37
$$ 13 122 1 -55 -53 -93 -189 247 135 -127 -99 191 1 -152 103 340 216 62 192 -320 -217 59 196
3767A96j64P4j6j12J32J47p08M84J25j62m0j62K88r6k13M25k46l1R0P8k00j19
$$ 196 32 106 90 -22 110 257 -451 33 158 -4 -44 -206 82 -14 -227 198 -48 -79 11 89 -111 -230
3789b30N84l06k10N56k71l39K15M0j35j4K21k83L32P5j53k70J48J91m98J56K10
$$ -230 354 48 -162 394 123 -216 -1 39 -96 -110 111 -172 160 235 82 -188 -40 151 -347 -191 19
3810A9r2m7P9J53l76j91M37Oj68K25K74l31j60J09o5K68N2k94M0j25N06n19Q8
$$ 19 -73 -120 -41 112 -264 -455 -18 -12 -180 45 319 -12 -172 -63 -128 140 192 -102 -62 -187 319 -200 -112
3833a12r0K00lL3J60k72mJ18j06j18K62L04m58K17O0k69j24K40J5r9J77n6J21
$$ -112 -202 -2 -5 28 188 -84 -88 30 -76 -194 68 372 -86 131 191 -78 -202 38 53 -46 131 75 196
3856A96k13R9J11l29M9M05j98m12M16j30j71N13m18R7j68K08p4j21q5J86q3J09
$$ 196 -17 82 193 -136 -87 318 120 -292 124 -6 -177 336 -82 15 -153 55 -19 -140 -225 -39 -122 -13
3878a3j58K86k66J70K91k92j01J59j12n6M66m97J41Qj91p2K86M5j68k71L01J66
$$ -13 -171 115 -151 19 310 18 -83 76 -36 -92 374 -123 18 26 -165 -237 49 94 -74 -345 -44 122
3900A22j68K82k06L6k22J13Mk59J89R2Q5l24L42k10J37j03J42l0j11J97k01J46
$$ 122 -46 236 30 66 -156 -43 -39 -298 -109 -17 68 -256 86 -124 13 -90 52 22 -89 108 -93 53
3922E3K29k33Kj30K23r7J89j27p0j15p5J20p2oJ06J29k53R9Q1J8j28J88q9j19
$$ 53 282 49 51 -79 144 47 236 109 39 -76 -151 -31 -103 -109 -3 126 -127 -28 53 71 -57 131 42 -77
3946g7j01K06j98K14pk71K36J63k44r3K75J48j62k17J84j00j16K39N9m49K53Q3
$$ -77 -178 28 -170 44 37 -234 2 165 -79 -172 103 251 89 -128 56 -44 -160 79 138 -311 -58 25
3968B5j59K34l7j27MJ45j65O5QK87j62k04L77k24j21m9L50j21j13K03p5k40K47
$$ 25 -134 100 63 -64 -60 85 -80 -15 -7 280 118 -86 291 67 -54 -103 247 126 13 216 141 -99 148
3991A48p2j17j2L01l5k70j46J27J47O4k83J8K8j33M39m04j75Q47n33j44J39M0
$$ 148 76 -41 -53 248 213 -57 -203 -76 71 135 -148 -130 -102 -235 204 -200 -375 472 -61 -205 -66 -26
4013b6J39p2p8j41J1O62m72j20J56J12k51K4R9j11K16j22J06l11K30K04r6k37
$$ -26 113 41 -37 -178 -167 495 23 -97 59 171 -80 -56 43 -68 148 26 132 -179 51 255 159 -78
4035g8Q6r9q4l6L63j14k66J17m6Q8j52J05J52L9j16n9J81K6k79J47r6K48j54o2
$$ -78 8 -91 -175 -211 152 38 -228 -111 -157 -69 -221 -116 36 75 -41 -100 81 107 -172 -25 -121 127 -27 -89
4059h9J83q1J5O6N8m24K55K09j54j97J3n6p1M73k97K10l46J78o1J73p0J66jl64
$$ -89 94 13 28 94 152 -272 -17 192 38 -159 -146 -202 -273 200 -97 113 -233 -55 -116 57 -13 153 152 -212
4083b12L23k41K30Q0k51o9K60m7P7j30l6O7l8m3L03l83L2r9K26k60L52L9r8j79
$$ -212 111 -130 100 180 -71 -140 120 73 150 20 -16 51 13 -30 273 -110 -78 -177 49 -211 141 180 82 -97
4107i7K21J4l62o2M90j2l71J89J39j49N4q6O4J04j76J19l21K96M4j5k06J50n2
$$ -97 124 138 -224 -286 204 192 -179 10 149 0 54 -32 32 136 -40 79 -242 54 98 83 -123 27 -25
4130b5%L07l56Rl4R4j50pK87p5j33J58k17p6J44J19q5P4J86k43k54N0L05j8m6
$$ -25 -25 282 -74 -65 -99 -5 -155 -162 125 50 -83 75 -142 -218 -74 45 -40 34 220 -23 -277 -227 78 60 14
4155A4Mr5R6J84j56j60Q8q1R8j54P5J38j45m8N4N0j58L11o1N0o1j64N22n02J32
$$ 14 18 -77 19 203 47 -113 -25 -106 -8 -162 -87 51 -94 -142 -88 -38 -196 115 54 104 43 -121 401 -101 31
4180C1K31k30m33M33m1O4R8k00j15J21L53l30L14j53l04Q6P0j14J28L1n3m1j56
$$ 31 262 32 -401 32 -9 55 153 -47 -162 -41 312 -18 296 143 -161 -75 -5 -119 9 40 -13 -54 -210
4203b10K19J03l48L26J37k37o9m9J50r1J73l0p5kP8J4l73J93j07j2K14j0N2m7
$$ -210 9 112 -236 90 227 -10 -79 -128 22 -69 104 74 -1 -3 75 89 -284 -91 -198 -210 4 -6 46 -1
4227al6Q3p7J19J3k63J12K96j95j95L70j0k54j3M18m64L7J2k3J02j55K79l00N9
$$ -1 -37 46 -31 88 101 -162 -50 246 51 -144 226 216 -38 -51 367 -97 -60 -48 -71 31 -124 155 -145 -86
4251h6K22p2l27J55j24L0K9J87k7l75N22P3j19M6j5n5p3K78l14j55K51R2j21j90
$$ -86 136 64 -263 -108 -232 -202 -173 14 -13 -388 134 207 88 134 119 64 -9 269 -45 -200 51 143 22 -168
4275a68L92l05Q9M7J18k86O7K44l38j77M04M1M8p8j06ok87M20j02j11O5N3k9j8
$$ -168 224 -81 8 55 173 -113 -46 198 -140 -317 87 128 176 98 -8 -14 -301 119 17 -94 -29 24 -5 -23
4299b3l3q5R4N0K89m44L55o9J63q1j21m7j35K78j49mq7K39q0l2o0K51k06R1J07
$$ -23 -56 -141 -47 3 292 -152 203 134 297 216 95 48 -87 191 42 38 -49 190 110 78 18 269 63 154 261
4324B61k85j62J83j7j21J52M15m68K69j79J65m77K51Nj80oQ7o7K65o4K0N1o5L97
$$ 261 -24 -186 -3 -20 -141 11 426 -42 227 48 213 -264 -13 -8 -188 -194 -107 -174 91 27 47 98 33 430
4348D30n03m1J28rj30L4k5K14k74K19j67J31l04K34p8lL24L0k43K68K3k91o1K20
$$ 430 -73 -114 14 5 -125 -91 -116 98 -176 43 -124 7 -297 -63 -141 -144 180 210 -33 235 258 -33 -94 126
4372A26k61K50o8M2m7o0J44j40j57J63L01m90K24q5J43l02J94K42m21K17j65N4
$$ 126 -135 115 47 89 42 -18 126 -14 -171 -8 293 -197 27 -58 85 -217 -23 219 -202 15 -150 -96
4394i6L6J82l08L32J7R0Jm14L69m20J19L5k0qK02J44l97L36j28r5m1K30j88m0
$$ -96 -60 122 -186 146 163 253 254 -160 209 -211 -92 -57 -77 -85 117 261 -136 200 72 -23 -64 166 -22 -62
4418f2m3J98k70q5L51J24k71J44j46J6k41L93j0m6M4j75Km5M2K3J97j99JK60k11
$$ -62 -105 93 -177 -262 89 213 -58 86 -60 -44 -285 108 98 52 96 -79 -77 -122 -80 -57 140 -59 -58 202 -9
4443iJ82j40m7J82kj91j1J02k8j38J57j6o7K30l61P6J61Km6k2J58j46q8N8j44
$$ -9 173 33 -14 168 166 -25 -36 66 38 -100 57 41 -26 204 -157 -81 80 82 36 14 172 26 -62 -4 -148
4468a48R4l4P6R9N6J0j01j81J31O6k1j17J35J3k55K30L43k76j30J11k13M4L03
$$ -148 -54 -88 -12 87 143 153 52 -129 2 68 47 -70 65 78 -177 53 396 120 -10 101 -112 -68 235
4491B35l82N4Q1J36k40J63l21K22k28M24j92m7J87N4k17n8j06K00N1j48M01m52
$$ 235 -147 -93 -12 124 -116 47 -274 -52 -280 144 -48 -95 92 146 -71 -129 -235 -35 16 -132 269 -183
4513a83n1J64K8j09j4K76PL0K7k52J02k14J28J52j93K55l86K72m2J18o4O9j16
$$ -183 -234 -70 -42 -151 -165 111 118 148 175 -77 25 -189 -61 91 -102 153 -233 39 -3 115 51 120 4
4536Dj22K76l20M12l30J41j24Rj45O4K71l64L39l6m06L26K58nk06n9K90l89o6
$$ 4 -118 158 -162 250 -80 61 -63 -54 -199 -135 136 -228 111 75 -331 -5 253 248 42 -17 273 -116 -182
4559a82L12l29P5n8K09K22j94J97j99j21K4J56l73J37L01m01%J89J09j03J69n8
$$ -182 130 -199 -124 -182 27 249 55 252 53 -68 -44 112 -261 -124 177 -224 -224 -35 74 -29 140 82
4581H2L8k03L9J43k57Q8L9m42K38J92O2j69J74P9k76K09k2l1j28L29k07l1L1R0
$$ 82 120 -83 -44 99 -158 -70 -31 -473 -235 -43 19 -150 24 103 -173 36 14 -17 -145 184 -23 -54 -23 67
4605F7o7l1k08J25J12J02L4l26J39J35o9k34Q2M10m51L27m4m07O04j50l7m7j10
$$ 67 0 -31 -239 -114 -2 100 134 -192 -53 82 13 -221 -139 271 -180 147 103 -304 300 150 113 66 -44
4628d4J53k57L45j90M4K60m43j5j33M01j11O9k07L82m09LJ6J26j39K77j22j07
$$ -44 109 -148 197 7 51 311 -132 -147 -280 121 10 79 -128 254 -155 -152 -136 -10 -149 128 6 -101
4650a01R4JJ42l41J14K08j66JP4n2J9J07m8j02J71O9r1j17L48m43K75j61N0o3
$$ -101 -7 -6 136 -205 -91 117 -49 -48 26 -26 -7 100 52 -50 121 190 99 -18 330 -113 162 1 51 -12
4674a2J5k20L69k83mJ17j97J79J24j21l4k4j80J87M4j98L20j23rJ50j89J03N4
$$ -12 3 -217 152 -131 -135 -18 -215 -36 88 -33 -67 -91 -271 -84 -40 -238 82 -41 -50 100 -89 14 68
4697F8j73M5O9J48p4O9J43l82%P6j27K3L22m08N5J85p2k9k9l6K32r0K7K80m23
$$ 68 -105 -60 9 157 83 152 295 -87 -87 -11 -138 -115 207 -201 -146 39 -33 -62 -91 -127 105 15 42 322 -101
4722a01J96n0K9k32J91j3j03j18q8O00k60k08L75j82k05K55JK7n1K29j80m40O81
$$ -101 95 45 74 -158 33 20 -83 -201 -289 311 51 -157 218 36 -169 86 87 114 63 292 112 -328 353
4745C53o17J70n4K40r3j76M75m54J36KN8M8P9k09P6k66L38m7j89J70J72l04J21
$$ 353 -264 -94 -148 92 -1 -177 298 -156 -20 -18 40 88 167 -42 34 -232 106 59 -130 40 212 -92 29
4768B9k04K93l29K22p6J37l6J9j50k17K42n6p8K34J56j86j02J18q4L2K72j99j04
$$ 29 -175 118 -211 11 -65 72 36 55 -95 -312 -70 -126 -204 30 186 0 -102 16 -68 -36 236 37 -67
4791f7J2K95l80j14L82j61j10L63k59O1k45L5L50j96j52P2q0K27p6K31m12J38
$$ -67 -55 240 -140 -254 128 -33 -143 220 -39 22 -223 -188 162 -34 -186 -114 -194 33 -43 188 -224 -86
4813h6M22m95r1L54j00o4K9l7k54L04K18k36J65J38j47l61M85k22j54J91J7J9
$$ -86 336 -159 -250 104 4 -60 -31 -68 -322 -18 200 -36 129 267 120 -241 244 22 -132 59 76 95
4835I5k38K59J49n27K38P9l2j40K35q6j44J07l3J89m90L03J50q6K25kl06k44J86
$$ 95 -143 116 265 -262 -24 55 23 -117 118 32 -112 -5 -38 151 -339 -36 114 28 253 251 -55 -299 -113
4858a13K02j16j12K92N7k41J04j34j39M36l01n6J67J73l32J22J63j17r2J25n7
$$ -113 89 -27 -139 153 210 -31 73 -61 -200 236 -65 -121 46 219 -113 9 172 55 -37 88 31
4879C1j68K72k09m6K74j82m4K3OL88k35j33p9L40j50q0K82l51J24K35l49R9r8
$$ 31 -137 135 -74 -120 154 -28 -72 -49 -43 345 110 -23 -102 238 88 8 290 -61 63 298 -51 48 -50
4902e0Q5k32J16J19j00J27J35l24K4K74j92O1j76j44K98J29J00k80o3K3n8K76
$$ -50 35 -197 -81 38 -62 65 200 -124 -100 174 -18 43 -133 -277 21 150 250 -30 -93 -70 -128 148
4924A48j15J08Q6j60j28r0r1K44qO8r3J31M5j80L0j08L57l93J05o3M5K4p8K17
$$ 148 33 141 227 67 -61 -151 -242 2 -6 62 -31 100 145 -35 -5 -113 244 -149 -44 -107 -62 -38 -116 101
4948A01j02o5J84j91K15J3l96K73j7j3J98l91K58m7J7pR8k61J45K08l52J04P3
$$ 101 -1 -66 118 -73 142 155 -241 32 15 2 200 -191 67 20 37 30 128 -133 12 220 -132 -28 45
4971D5Q3j18k11J37j06J59J48L3k42P7J15l98L42j53J50j21oK01j57J91k51M0
$$ 45 128 10 -201 -64 -170 -11 137 170 -72 5 120 -278 64 -89 61 -60 -66 135 -22 169 -82 -42
4993d2J55o7j2j90K61%l41L1L54j48j7PoK4j28j55N0j3L60j20q0K77J09k84n1
$$ -42 113 46 34 -156 105 105 -236 -205 149 1 -16 -9 -15 9 -119 -274 -224 -237 123 3 -77 200 309 25 -26
5018b6P9j49n6J33K07l54J41J83l65J56K9Q3R3k83L30m35J71K0J22j03M8r5O4
$$ -26 53 -96 -152 -19 188 -166 -25 158 -207 -51 -22 61 154 -129 201 -234 -63 -43 79 -24 24 -71 -7
5041gm3M9J7m09L00J38P6N2j08kR6q1L28m84j41M18j99O9R4l01J09j28k7K24P6
$$ -7 -50 -1 16 -393 -93 45 121 173 65 63 159 78 406 -78 -219 199 0 69 163 -138 -29 -157 -184 40 116
5066A16o3k92J88R2J29j85l8J01K4k07O9J06j85K70R3l7l00KK87j83O8Q2k55R7
$$ 116 53 -239 -51 41 170 -15 -53 48 72 -135 -66 40 -145 125 218 181 -119 -117 170 -13 55 137 -118 -21
5090b1J49j23R9l7j07j25R0K73n83J99JK79M6j49N8k99O3J37r7N2J22K5r3O6k5
$$ -21 128 5 104 67 -40 -165 -75 198 -385 -186 -185 94 140 -9 49 -250 -187 -50 -147 -95 27 52 -41 25 0
5115@K03k50J01J8q2j17J59J38l43J17O8r4JJ64m3l14L64kk5J03k03j33J91J98
$$ 0 203 -47 54 72 -10 -127 32 170 -173 -56 12 -82 -81 83 40 -274 90 88 63 166 -37 -170 21 219
5139B19j27l5Q1pj33J03j70J56O4k17L04l57J34J48j25l0n1j22L25p7j45J33k17
$$ 219 92 57 138 131 -2 101 -69 87 151 -66 238 -119 15 163 38 8 -43 -165 160 83 -62 71 -146
5162a46M90m90J2K84K01m22J08m3j99J13l9j52M70k08K32j95N2q9m5J41k6N1J44
$$ -146 344 -146 -134 150 351 -71 37 -6 -205 -92 -131 -283 187 -21 211 16 68 -21 -66 75 49 100 244
5185B44m75M07j79o3J74j42K15l32J10J71k94O4K6J46L0j84J04p6L27j48J7n7
$$ 244 -231 176 -3 -66 108 -34 181 -151 -41 130 -164 -100 -74 72 102 -82 22 -54 273 125 142 85
5207H5j02N1K38j72q6N6N7j19J80k63K3M0k26L49j68n3J44p2p1J89J6j47r9K23
$$ 85 -17 34 272 100 14 70 127 8 188 -75 -52 -12 -238 111 -57 -110 34 -38 -109 80 96 -51 -150 73
5231G3K05l23j7m9m9KK49j62l3P0j03K09j62J77J81m94k0K44J34j02l09L31l16
$$ 73 278 -45 -62 -111 -160 -158 91 -71 -104 -34 -137 72 -90 87 268 -226 -246 -2 132 30 -279 52 -264
5254b64M07k25L6K17l79J95q2J79j0q4q6J45j29K80J10j48k50J81J61j93j12J96
$$ -264 143 -82 -46 171 -208 -13 -95 84 74 -10 -96 49 -80 200 310 162 -88 93 254 61 -51 145
5276A45j91K18j92k1J05o6j50L00K0m68K45j37j99K44J63J18L4k80N2j53J94O5
$$ 145 -46 172 -20 -41 64 -2 -152 148 168 -300 -55 -192 -391 -147 16 134 168 -112 -60 -213 -19 46
5298D6M6k01M35l50J5l0J84k40M76k03l24J58J46k40J46k4n1J7k3m3k9L77l39
$$ 46 92 -109 326 -24 -9 -39 145 -95 381 178 -146 12 158 -82 64 40 -11 6 -17 -60 -89 288 -51
5321e1J27j21j6J75n8J66l88K16j04j73J56N9J50j08J08o6kj36p4J46j33K19j87
$$ -51 76 -45 -61 114 56 222 -166 50 -54 -227 -71 -12 138 30 138 72 70 -66 -140 6 -127 92 -95
5344i5k03K9K61J00j17k6J31L6k21K2k10M60j69J29Nj95K44j79M9Q2J8j41o3o1
$$ -95 -298 -269 -8 92 -25 -51 80 116 -105 -83 -293 167 -2 127 132 -63 181 2 51 133 151 10 -53 -114
5368a14Q1n3k1L96k43k7NJ20k46J43Lj27J17j25j2J72L4L6j69J24j88K02j48l4
$$ -114 -33 -86 -107 289 46 19 24 144 -102 41 44 -83 34 -91 -103 69 103 139 -30 94 -94 108 -40 -74
5392g4j01M3J12J74j27j5j65K61k22j2L62m39M74k72P3j84J22j43J2K58l17J27
$$ -74 -175 -132 -20 154 27 12 -153 108 -114 -126 236 -203 271 -1 72 -112 10 -133 -121 137 -180 -53
5414e3M8o4P2j85m6J19J17j72K18j1J81m31J58r7K60oj06R6j93K32M4j56J6P0
$$ -53 -5 -69 3 -182 -228 -109 8 -164 54 43 224 -207 -49 -146 114 108 2 98 -95 137 181 25 41 111
5438A11l56K37j17L1J58k93rL13o7K23l23k8J36J62l50J48k32K42k65R8J1J74
$$ 111 -245 -8 -125 -94 64 -229 -238 75 8 231 -92 -120 16 178 -172 -24 -256 -14 -279 -181 -170 4
5460Dj10K5O9lj0P0K22m08J75k3k15K75k85J69K40l46P0kP3K21k44J86m90P32
$$ 4 -106 -81 -12 -15 -25 45 267 -141 34 11 -204 71 -214 -45 195 -151 -81 -83 -10 211 -33 153 -337 395
5484C95k95Q8k10M15n29N2P6km6J52j50n2R3L37k62J4j22K59k25K60k47Q5p8j40
$$ 395 100 188 -22 393 -136 -84 -8 -10 -56 96 -54 -106 -13 324 62 76 -46 213 -12 248 1 86 8 -132
5508a32K30j58l7J70m0j88MJ89J65k42o1j83M37j27l9L33k75m5j89J16J0N8K8
$$ -132 98 -60 -97 73 33 -155 -151 38 203 -39 -100 -283 154 27 -12 321 46 1 -188 -72 -62 -4 24
5531B4n9j48O3K8L47l00j29R3P5j29l0L61j84J07l15J42j70L14k17lj65L81l1
$$ 24 -35 -183 -120 -92 255 -45 -174 -81 -6 -135 -165 196 12 119 -196 -54 -224 90 -127 -130 -295 86 55
5554E5k84L42l5l8L4j8o6J15j89L20l41J92J92k70N7j6k26L33k13K04j57k6L02
$$ 55 -229 113 78 40 74 56 -10 105 -84 236 -105 87 279 9 66 50 -176 157 -56 148 -9 -35 267
5577B67m06k1j59L3K12r3K1R0j72K79L5n7k00K48k32R1J62j14J02j76m6J37j02
$$ 267 -139 -160 -319 -286 -74 -167 -146 -56 -228 51 86 29 -171 77 -155 -64 98 -16 86 -90 -136 1 -101
5600a01J9L25j69q4p3m7J16j49L13k18N0P6L3j32J30k38J63m6K58j51K9j61K28
$$ -101 -82 243 74 -10 -83 -130 -14 -163 150 -68 -18 58 91 -41 89 -149 14 -32 226 75 104 -57 171
5623A71r0N2j82r8L18K3j50K7J77m22K70l5k98L35k15J47J46j83j8m4r9K15J86
$$ 171 81 133 -49 -147 171 194 44 71 248 -174 96 61 -237 98 -117 30 176 -7 -25 -69 -168 47 233
5646B33m01M3J06r1J29Rj89J59o9J3p1L1l4M98o02K99M4Q3J09k85Q2p1K0r2J69
$$ 233 -168 -125 -19 -110 19 28 -161 -2 -71 -58 -129 -98 -132 366 -236 63 107 190 299 14 96 25 45 -47 122
5671A22k45R2J0j9J35j45J41k45R6N4j76M27j09j02R7k13K05k57K14q7j96K37
$$ 122 -123 -31 -21 -40 95 -50 91 -154 -58 -4 -180 247 138 36 133 -80 125 -132 82 -5 -201 36
5693C6k3j62K6P6K05k86Q9jO0j68j7L5J71LmP2q7k81K17mJ76j96K3m1J02j45n1
$$ 36 13 -149 -123 -47 158 -128 -39 -40 20 -148 -165 -130 41 44 40 112 25 -256 -39 -43 133 -63 -40 -81 21 -124 -175
5720a75kP1K20n7Mk81J66Q4N6N9J4l30J53J76M4l25rL45n58L82J39k3j39%l68
$$ -175 -177 -106 114 57 61 -220 -54 30 86 145 159 -171 -18 158 202 -123 -132 213 -345 37 176 153 14 14 -354
5745c54K16J49J43ok82L06k28J00j7j71L18k37n6L4J12j10K29K1k71LN2K64j52
$$ -354 -138 11 154 148 -134 172 -56 44 27 -144 174 -63 -119 -85 27 -83 146 167 -104 -101 -49 215 63
5768F3m2J38j78m6O2j01J06J87n8k23K70j19l8j66K78k28L23k14j51RR6M3j10
$$ 63 21 159 -19 -65 -3 -104 2 189 131 -92 178 59 21 -145 133 -95 228 14 -137 -128 -32 11 -99
5791i9N5K03m6j62k1K3M7j84L00m0l9j4J38k89OK80k99J84j6k2J38j76L2L7j28
$$ -99 -44 159 113 -49 -70 -47 0 -184 116 76 37 23 161 -128 -122 158 -141 43 27 5 143 -33 -1 36 -92
5816i2k04L51M3j82L1J15k7j5j49L5K02qj66l8J84O2k81J55j27L32k71l7K18l71
$$ -92 -296 55 98 -84 -53 62 35 20 -129 -94 108 100 -66 -104 80 142 -139 16 -111 221 -50 -87 131 -240
5840b40m5L00M6J10q4r0J24k10J52k09K73j55L2o0j83M55m76J45J73l1j97K34
$$ -240 -285 15 61 171 87 -3 121 -89 63 -146 127 -28 4 -56 -239 216 -260 -115 58 27 -170 64
5862F4M5k18J98r3J40n7j63K68k39J07q6j72J95J13o5p4k08K37K5j60J36m0J66
$$ 64 109 -109 89 -4 136 79 -84 184 -55 52 -34 -206 -11 102 37 -37 -245 -8 17 -143 -7 -47 119
5885A19J04k77L22j93M5Ok31M6j70J41J93Q7j45Q4l25J44J85j29M5j13J53k16
$$ 119 223 -54 268 75 120 126 -105 -59 -229 -88 105 192 47 131 -194 -50 135 6 51 -62 91 -125
5907a25K47l77K42J15Pj08j01k9P5J08o8R9j08JK08K1j57l00L26j45m4J20J15
$$ -125 122 -255 -13 102 109 1 -100 -129 -54 54 -14 85 -23 -22 186 207 50 -250 76 -69 -113 7 122
5930A22k03j50M41k67K29k14m5J97j50O5k29L5K22K37p40M82n8N0j43J95M2j21
$$ 122 -81 -231 210 -57 172 -42 -87 110 -40 25 -204 -169 53 290 -450 32 -26 24 -119 76 118 -3
5952cL5M1o9m2J09l2l1J7R4j3q8j79J73J94j74k57K07k66K80k29K74l8J40k17
$$ -3 32 73 4 -38 71 39 8 25 119 106 18 -161 12 206 32 -225 -18 -284 -4 -233 41 3 143 -74
5976g4pR7m0l8M4p4J16J51k42P8K42k91j96J5K44m1o7L23mj80M6M5R8k09R8j74
$$ -74 -81 16 -24 -62 -18 -92 24 175 -67 11 253 -38 -234 -219 25 -16 -83 240 236 56 102 147 245 36 134 -40
6002d0J15Qj53k9P1j00K9q4J28l0k6J68K81l54O9O0M5k17J89j74N6K25j78K85
$$ -40 75 83 -70 -99 -28 -128 -99 -183 -55 -85 -111 57 338 -16 53 113 158 -59 130 -44 12 237 59 344
6026C44j70k31r2K24k9N0k42J45pO2J07l69L79j68j20Q3K3J11J49l85J74k0R7
$$ 344 174 -57 -149 75 46 96 -146 -1 -8 54 161 -208 171 3 -117 -34 -11 100 249 -136 38 18 115
6049A15L7j5J7q6j42L1K15m13J00P9l3L03j95l01K58J8k84J92K63l50L09J4k36
$$ 115 152 137 154 68 -74 -43 172 -241 -141 -62 -95 208 13 -288 -30 -12 -296 -104 159 -191 118 132 -104
6072a04J35Qj69j27K11J15q2J72k30K86l85J66J38K1k24L86n10K56nJ02j29l9
$$ -104 31 39 -130 -257 -46 69 -13 159 -71 215 -170 -4 134 155 -69 317 -193 63 58 160 31 -8
6094hj92K98k70K04j61k2J43M9Qp9p2LQ7j61J38N9m5O9j81R2M5J50j81j79K99
$$ -8 -200 98 -172 32 -129 -151 -8 41 49 -30 -102 -99 -12 -173 -35 24 -21 48 -133 -41 4 154 -27 -206 93
6119I3p9J37k20J12K75m48J5q7J89kn5J5J51k92J55j9N0p4Q6m5j86L18n9Oj72
$$ 93 14 151 -69 43 318 -130 -115 -202 -13 -15 -70 -55 96 -196 -41 -60 -10 -84 2 -43 -229 89 30 36 -136
6144a36J19K30k75J74q2j36J8M3m2o4K98qM5k31J0k2L2k7J45k95L92k36O1j93
$$ -136 -17 213 -62 112 30 -106 -88 -45 -87 -151 147 139 184 -47 -37 -59 -27 -54 91 -204 188 -48 13 -180
6168a80K61r9j05K38j19N3j21r9J39l1J92o8m3o6P3m6k4k3J64j07j96Q3j38J74
$$ -180 81 -18 -123 115 -4 49 -72 -171 -32 -63 129 61 18 -48 25 -21 -45 -68 96 -11 -207 -124 -262 -88
6192h8N4M9j21n8N9j42M70j33j55L09k84L1Q2k9m7o0N4L2j15M2K19q3j39J66n5
$$ -88 -34 15 -106 -164 -105 -247 223 90 -65 244 -40 -9 73 44 -3 -63 -9 23 -92 -50 169 86 -53 113 58
6217E8k64J28Q8k33L38j62k3J27k98K28J6Lm6M2k05J67Oj36J69K0k14J0K65j05
$$ 58 -206 -78 10 -223 115 -47 -70 57 -241 -13 3 6 -40 2 -203 -36 -30 -166 3 23 -191 -181 84 -21
6241b1NJ69j51O9n4q7L84l89K65k54N9P9j06q5J12j51j00L52j44J81j69O4j50
$$ -21 -16 153 2 71 17 -70 314 -75 190 -64 -5 74 -32 -117 -5 -156 -256 96 -48 133 -36 28 -122
6264a22p3K7J12J32N9l02K26j72M7O7J16k57n1J96N8P7j51j08J44j41L9J18l16
$$ -122 -195 -168 -56 76 135 -167 59 -113 -66 1 117 -140 -191 5 63 140 -11 -119 25 -116 -77 41 -275
6287b75L67k63l3K99k86J45l4K88j93K96m01o4J52K11k50J75j47l4J06o4m7j04
$$ -275 92 -171 -204 95 -191 -46 -80 208 15 311 -90 -154 -2 209 -41 134 -13 -47 59 -5 -52 -156
6309a56K11n6J10n1K38m85L55j35q8J97J77j85j96n4L7J83J25m23P7N3k0R4J60
$$ -156 55 -1 109 58 296 -189 166 31 -57 140 317 132 -64 -118 -81 102 227 -196 -119 -66 -86 8 168
6332A68j88L4k1J38j71J44m7j78K30j92J39J7k74J61J40k41j1j31J71J4J36p1
$$ 168 -20 14 -7 131 -40 104 57 -121 109 -83 56 73 -201 -40 100 -141 -152 -283 -112 -98 38 -33
6354c3r6K3J40N5o9j81L37l12J29J4J07l2r0J91r7n3j31J42L4m0J68K8k45Q6l87
$$ -33 -129 -106 34 89 20 -161 176 -136 -7 7 114 82 -8 183 86 33 -98 44 78 38 206 234 -11 75 -312
6379c12M16L3j36J0N1N6l4Q9k13q6K72l62K39N6n7P0L4j27r0Q5o2J61l43L17K9
$$ -312 104 137 1 11 62 118 84 173 -40 -126 146 -216 23 79 22 92 126 -1 -91 -6 -68 93 -250 67 96
6404I6j44K8K95j8j34K4p7k97K58J04j64J48J7q4P6j05k40M49o2J18j86N9k59
$$ 96 -48 -20 275 257 123 147 70 -227 31 135 -29 119 136 52 128 23 -217 232 170 288 102 161 -98
6427i8N2J42l10O1J84n4J11j28n1P1M8k20J76L54k87k57J38r8KK45p6j73R7j13
$$ -98 -46 96 -214 -153 31 -23 88 -40 -91 -20 28 -192 -16 338 51 -206 -68 -166 -164 81 5 -168 -71 -184
6451a84J44j4K05k35J96l41L74l7j00J2k93K56R9l7j9j81O6J56M1j07m6j17M00
$$ -184 -40 -54 151 -84 112 -229 145 108 8 20 -273 -17 82 45 26 -155 -89 67 108 1 -45 -162 238
6474B38k12M4n6j08J57J29j20j08r9j05K35l57L93J17j85N2K00j82j59j6J59k73
$$ 238 26 70 14 -94 63 192 72 -36 -135 -240 -5 -362 31 148 -37 15 215 33 -126 -142 17 -256
6496b56K02j72K34K4J20p2J04J3l10O1rK19O1k33k46K59p6O0N0J12j55J38j18
$$ -256 -54 -226 8 32 152 80 184 197 -113 -52 -61 158 219 -14 -260 -1 -77 -17 33 145 -10 128 10
6519A0K8RJ14j68m00K19J04J16QK61n62J33J64R8j70J30j65J29J30j74M6q7K26
$$ 10 38 47 161 -7 -407 -188 -84 32 40 301 -261 -128 36 134 -36 94 -71 58 188 14 60 -27 199
6542A99k58K52LO8k76k19J49J81n9q2J27K8R8l4k14j38mL38R5j98j55K15k20K8
$$ 199 -59 193 196 264 -12 -231 -82 99 40 -42 85 113 211 177 -37 -175 -179 159 254 56 -99 116 -104 -76
6566g6j03K84q0Q9n6k21K34l28R9L76n1k66K48J5j40K18l16J51q3n8K98j61j10
$$ -76 -179 105 25 114 58 -163 71 -257 -158 218 167 -99 149 164 24 242 -74 77 -6 -64 234 73 -37
6589c7j23K15k0o0o3K3l2L2K53l41K25j9j39O0L2K64l09J67j77j6p9L12l07r0
$$ -37 -160 55 35 -25 -88 -65 -97 -65 188 -153 72 53 -86 -26 6 270 -39 128 -49 -65 -144 168 -139 -229
6613b29M51j06k11J50L6Ok84K52J67o4J38l26K64j66p1j84L85k16l7j04M70k35
$$ -229 222 116 -95 55 91 97 -187 65 232 168 306 -20 244 78 7 -177 208 -8 -45 -149 321 86
6635H6k09j67Q8K30j10j49J64o7j02J81P4J13j32J8Q5j84M8P1j29K73k46jk1K41
$$ 86 -123 -290 -202 28 -82 -231 -67 -134 -236 -55 19 132 0 18 103 -81 -33 38 -91 182 -64 -65 -86 155
6659A55m46N93k96m2j43L41k23k1J34p2R3O0nj68P3Q4Pm2J1L8l54J70M04k75O5
$$ 155 -291 302 6 -36 -179 162 -61 -82 52 -20 73 133 128 -40 33 117 124 82 93 131 -223 -53 351 76 141
6684A41m4K21k18k10R4J85j02r3J09N4J39k66p6J3j84J09J12J80j32j3N1k56N3
$$ 141 97 318 100 -110 -16 169 67 -26 83 137 276 10 -66 -53 -237 -128 -16 164 32 19 70 -186 -133
6707a33K07m6J23j86J37J02o33P81l78N2k44L23j6j5K1p3r8R6J02k18J25K7J23
$$ -133 74 28 151 -35 102 204 -429 352 -26 26 -218 105 89 74 95 22 -76 20 122 -96 29 56 179
6730A79k25NK16j13L9j28Q3j58R8j14o2J18j78L37j37m1J43k84L10j37J65p2R
$$ 179 -46 -41 175 62 101 -27 56 -102 -4 -118 -180 -62 -240 97 -40 -81 62 -222 88 -49 116 44 53
6753E3j29l9L9J9J33P7j27p6J35j10K11q6K03k06o7j63M91n94Q9J56K5k32M91
$$ 53 -76 -115 -76 -57 76 153 26 -50 85 -25 186 100 303 97 30 -133 358 -236 -147 9 34 -198 293
6776B93l48K7L37k07j5m98L19k4%K1J04K2R0N9l67J32P2j15j5J29J14k64L03k87
$$ 293 -55 -28 309 102 87 -411 -92 -116 -116 -95 9 31 121 180 -187 -55 17 -98 -113 16 130 -134 169 -118
6800a18J10k1J13k3N3j23K72l53J62n5j74J40PM2k00J34p5R1Q3l3q0o7P6J15j02
$$ -118 -8 -29 84 61 114 -9 263 -90 72 17 -157 -17 -10 32 -168 -34 -109 -18 65 32 -48 -115 -39 76 -26
6825b6P2K7k23K12j98J73m5j52L22q4j6J9k47m7J35k4P7J18j03J1r6R9j28L66
$$ -26 46 73 -150 62 -136 37 -8 -160 162 78 62 81 -166 -213 -78 -102 -25 93 -10 1 -95 4 -124 242
6849B42l67MK27M1P7j29k02J11Q3j69J47j37K50l3p0j59k1nj02J01K8K09k15j71
$$ 242 -125 -121 106 147 224 95 -107 4 87 -82 65 -72 178 145 75 -84 -105 -110 -212 -111 -83 126 -89 -260
6873b60J64o9J26r7K99j50m5J37j48n1J62J42o9j87o0N5K34r0k72P2%L00q8pL4
$$ -260 -96 -165 -39 -136 163 13 -32 105 -43 -94 68 210 141 -46 -106 -51 183 93 -179 -107 -107 193 105 98 132
6898A32k66J93p2J8J0k79J92J30j2k83L50k8r1r3n5M7K81j32j3oj91P9O7Q0k87
$$ 132 -134 59 -13 5 15 -264 -72 58 46 -237 113 85 -6 -99 -154 -107 174 42 29 23 -168 -89 -22 58 -229
6923b29J26N9o6J24J01l09J44rO3J61m93N04%j70r7J97o7L4r6j09J26J9J6J35
$$ -229 -103 -44 -110 14 115 -194 -50 -59 4 165 -328 176 176 6 -91 106 39 73 -23 -132 -6 13 29 164
6947A64j17o3j10r7K95o9k79M16j09J11m3J0J4N3j15j44J82m2QK4K03j81J6m3
$$ 164 47 -16 -126 -223 72 3 -276 140 31 142 99 109 123 176 61 -83 99 57 65 89 292 111 127 84
6971H4p1pm5j08K27j26J71k0j54p6J35j24J40j87J81K97m08N4P2J1k3k31M45n70
$$ 84 13 6 -39 -147 80 -46 125 105 -49 -125 10 -114 26 -161 20 317 -91 -37 35 46 23 -208 237 -333
6995c33K11P4J19r8J3q6N1j68O3K53k46l8J32o6M9J46j47J24kK7Ok4J03j69O9
$$ -333 -122 -48 71 -27 -14 -100 -49 -217 -154 99 -147 -185 -53 -119 -70 76 -71 53 51 78 84 60 163 -6 63
7020F3N3q4R1j97r3R6P6P0k53J78m8K90k09l33N65k74k9L32k44L1k1r0Q8j02k8
$$ 63 116 32 123 -74 -167 -71 5 75 -178 0 -48 242 33 -300 265 -9 -38 294 50 81 60 -30 58 -44 -72
7045g2N7q4K4J59mk57N1L0Q5k1kk1Q3l20L50R5k62K31j82R0k4M6O3j56LJ73k43
$$ -72 -15 -99 -75 84 80 -177 -126 -96 -11 -32 -34 -55 28 -292 58 153 -109 122 -60 30 6 52 115 -41 -38 135 -108
7072a08K99k10M1m14L14M4r6J11M6mn5R8j62K62q9K0j81J37j8L5j85K9K49m4k25
$$ -108 191 -19 22 -392 -78 -34 -130 -19 27 23 -32 66 -96 166 77 97 -84 53 35 70 -115 -86 163 119 -106
7097a06O2J7J1J29m90N47J52k02j0j08K2k18N03r3m14J15O1j06nj67J15L09j72
$$ -106 -44 -27 -16 113 -377 170 322 120 110 2 24 -194 309 216 -198 -83 -22 -128 -133 -300 -185 124 -48
7120d8M1j59J69R4r9J42l30J60l39M42k44J14j4n8K87j79%j48K87k54k7K00J2
$$ -48 -7 -166 3 97 -2 140 -190 -30 -369 73 -171 -57 -71 -129 158 -21 -21 -169 118 -136 -163 37 49
7143D9j24K09k47K96j44p7R3k07j63L63J44j65j18R1N0Q6k02N4J5k16J29K08k28
$$ 49 -75 134 -113 183 39 -38 55 -152 -315 48 192 27 -91 0 50 136 -66 -12 3 -213 -84 124 -104
7166a04J83l30K48J40n1k92L03j65R1r5J02k12K65P1j04N5K05k56J11qk4L6j77
$$ -104 79 -251 -3 137 86 -206 97 -68 23 -72 30 -182 83 154 50 105 310 54 165 157 133 169 -8
7189hJ12j05k88M29m5l31M30j72l36J96K09j09N0r2O1j7r3K50j10j81J98K5r9
$$ -8 104 -1 -289 140 95 -236 194 22 -314 -118 91 -18 32 -60 1 -16 -109 141 31 -150 48 73 -26
7212b6N5N3j30l8K02m5k1m5N6O1j67Q5l9J85l2l6K4r4q1r5PK16o6k38K87Jq6p8
$$ -26 29 82 -48 -86 116 71 50 5 61 122 -45 40 1 186 154 118 142 48 -33 -128 -121 95 29 -209 78 79 -7 -85
7240h5J21k7O1k66R7J41j11J24O9j19j51K06k9J04k03K52j03k44J62j22j2J63
$$ -85 36 9 70 -196 -99 42 -69 55 124 5 -146 60 31 135 -68 184 81 -163 -1 -123 -135 28
7262B8pj99q1J20Q4L09q0m2j37j35J27LN1k46K49l92M60j32m5J99M5k32M6J19
$$ 28 21 -178 -259 -139 -55 254 174 132 -5 -140 -13 -10 41 -205 44 -348 112 -20 -65 134 179 -53 -7 112
7286A12J92k27j19N1j44pJ23R3q7Q2l12K23j3nK21j65j63J2j64K52N9N5L3q7j44
$$ 112 304 77 -42 9 -135 -142 -19 74 -13 69 -243 -20 -33 -38 183 18 -145 -133 -297 -45 14 69 102 15 -129
7311a29Q0J40Q8k03j2J63k14P5J02J10p5j88n6m0L22r5KQ4k3p5K0m8R6l10K71
$$ -129 -49 91 179 -24 -36 127 -87 -12 90 200 125 -63 -119 -159 163 68 70 154 131 56 76 28 124 -186 85
7336H5j07j3%J37l6pPQ2k05P1J24Kj04J3k48J59Q1k95J70K55j59l64L68P6j0M4
$$ 85 -22 -35 -35 102 66 59 66 148 -57 14 138 140 36 49 -199 -40 41 -254 -84 171 12 -352 16 92 82 126
7362A26j97K02Jp5k74K93j37m1j2m0K47J4J05o8J51m71P0L3j33J32J87j50M2n3
$$ 126 -71 131 132 57 -217 76 -61 -102 -114 -154 93 107 212 144 295 -176 -106 -73 -206 -74 113 -37 5 -48
7386d8k9J41k5j23p2J37M8n7j70J81q9q2K39m46K39J92k01J29N6J05j4K26m74
$$ -48 -77 64 39 -84 -156 -19 29 -28 -198 -17 -106 -188 51 -395 -156 36 -165 -36 20 125 111 337 -137
7409a37L63l54O2J53p7J66k53M27m1m58n2L34r1KO7j22K22l20M6j47L01j84j2
$$ -137 226 -128 -66 87 10 176 -77 350 309 -149 -201 133 42 44 111 -11 211 -109 -63 -210 91 -93 -105
7432a05J34o3q4J46L2n5O8m2K2P5l7j25n1J1J83ko7j10k29L84J77k30o5L0K39
$$ -105 29 -34 -118 28 60 5 73 31 53 128 91 -34 -85 -74 109 107 40 -70 -299 85 262 32 -33 -3 236
7457B36j54k29J49p2J4j02K51o2r0J45k04K50k19L2K3l9P6J16R4j00j17M5r1J75
$$ 236 82 -147 2 -70 -56 -158 93 31 -59 86 -118 132 -87 -55 -32 -71 5 121 215 115 -2 43 -48 127
7481A27j35j76K59J51k52p8J05j8j02Q2j21o7J46Q8O5r2K04k77j18L61j26p8J50
$$ 127 -8 -184 75 226 -26 -104 1 -17 -119 -37 -158 -225 -79 9 74 -18 186 -91 -209 152 26 -52 98
7504I8J30k26O4k74J64K24k89M78m00K09r2k99K54J23j00j15P0J71k82L31l07
$$ 98 228 2 66 -208 -44 180 -109 369 -31 178 86 -213 41 164 64 -51 19 190 -92 239 -68
7525f8J02r1j72J40K0n1P1N2k36K23kN9j84K68j95Q9J95j99J29M7o3j69p0O0j16
$$ -68 34 -57 -229 -89 -69 -120 -49 3 -233 -10 -12 47 -137 131 -64 25 220 21 150 197 134 -35 -105 -45 -161
7550a61PJ87p6K13l06J05K9O6J0k75J45P4j14QJ54o1R6K08j00k58N6j37k2K18
$$ -161 -154 33 -43 170 -136 -31 -2 64 74 -201 -56 18 -96 -88 66 5 101 309 209 -49 7 -130 -152 66
7574F6k37J61K6j9n2K31k89J09j57J03j77J68N29m85j45L4J06L25k50J07k05R4
$$ 66 -171 -10 16 -3 -55 176 -113 -4 -161 -58 -235 -67 462 -23 -168 -134 -28 297 47 154 -51 43
7596D3o6k5j69J83j03M61j57l03O4L40j40N7k64N1M1L1n1J18k93J12J62l02Q1
$$ 43 -23 -48 -217 -34 -137 324 167 -136 -72 268 128 185 -79 -28 13 44 -7 111 -182 -70 92 -210 -129
7619a29J95O8m60K12K29q0l36N31l44K77K6j0l74J7K39j55r9L21q9j91K12O4k07
$$ -129 66 134 -326 -114 115 35 -301 230 -114 163 189 179 -195 -178 61 -94 -193 128 39 -152 60 124 -83
7642h3J17M4k3j83K00k69K85j62L8J61l10J81L2j57j89M34l15O6K16jj09q3J66
$$ -83 34 78 55 -128 72 -197 88 -74 -36 125 -185 -4 28 -129 -318 116 -199 -133 83 82 -27 -110 56
7665E6j5j48J10j01J87lq4K98j89j19l84L57m1k55L48mj89J89KK7k54J47J61k83
$$ 56 41 -107 3 -98 89 86 2 300 111 -8 -392 -35 -76 -331 17 13 -176 13 15 42 -212 -65 96 -187
7689a87K16p6L43k95K05j2k22K23j58K7j38O2L5J2j8k20L05m7QJ44q9k63J42Q8
$$ -187 29 -47 296 1 206 194 -28 195 37 64 -74 -12 23 35 17 -203 102 55 63 207 118 -145 -3 85
7713H5J05q0j50N9J3N4j26K01k62J87M4l26J94J54j14J09m8j24n8J75k27K20k6
$$ 85 190 110 -40 19 32 86 -40 161 -101 86 130 -196 -2 152 38 147 99 -25 -83 92 -135 85 59
7736E9k92L84j81K12k84l0M5R6k18K68j44l2O8j36J41R2j20K69k87L2L4J15n5
$$ 59 -233 151 -30 182 -102 -132 -87 9 -209 59 -85 -117 -49 -185 -44 48 -72 197 -90 -58 -24 91 36
7759C6m23L67o1K8J78J26j99J17k07K25k56K70l81O4j3Q6J76O6k04k9j93M2P8
$$ 36 -387 -20 -81 -53 125 251 52 169 -38 187 -69 201 -180 -116 -129 -43 133 199 -5 -34 -227 -185 -107
7782a07m8J7K48k81K06J0j76m2J33P6n4J20j49R4N8lJ8Nj46J23L5k50j81K38K37
$$ -107 -155 -138 110 -171 35 45 -131 -173 -40 36 -18 102 -47 47 105 102 120 125 -21 102 137 -113 -294 -56 181
7807A81r3m4n6q9J80J34l87J80M2l40K47P9M0P8k75q1M11l19K91q3J70j83m2R4
$$ 181 88 44 -12 -101 79 213 -174 6 48 -292 -45 34 74 152 -123 -204 207 -112 179 96 266 83 41 135
7831A35J15m23J25J80l6j05O0O8r2r0J95m9q5m0n1L95m42J75q9n2k40L78k0j50
$$ 135 250 -173 -48 132 96 -9 51 119 27 -63 132 83 -2 -42 -93 302 -140 35 -54 -106 -346 32 12 -138
7855a38K34j55K5O2j28J9k9O8O8K51l13l5N0k50M14k09j3k13O34k17k37K44j00
$$ -138 96 -59 -34 28 -100 -81 -110 -42 26 277 -36 -71 -21 -271 143 -66 -79 -292 342 125 -112 132 32
7878C2j76L75l46mJ80j93J1J21j58K16j11J03L4k86J13J0j31K85N0Rq7r1J50O
$$ 32 -144 231 -115 -119 61 -132 -121 0 -158 58 -53 50 84 -202 -89 -79 -210 75 125 134 47 -44 106 112
7902A12O8r0j62O2o1p1L03k10l9K4k04N24m21L48j78n6J32j29p7K67M8j04Q5j77
$$ 112 180 90 -72 -10 -71 -142 161 -49 -88 -64 -268 256 -165 183 5 -51 81 -48 -125 142 190 86 171 -6
7926fK01J15j98l9l3J00j37j05J79j11M50n34J72J8j47J6N6o3J01j59j22Q%K48
$$ -6 195 310 112 73 40 140 3 -102 77 -34 416 -118 54 72 -75 -59 -3 -66 35 -124 -246 -238 -238 10
7950A0J61k62R4j44O1J74Ok90L04r1k21K16k2K0RL1k6L24l17j01q7J58p7J6K3
$$ 10 171 -91 3 -141 -80 94 100 -190 114 23 -198 18 -4 16 25 56 30 354 37 -64 -151 7 -70 -54 -31
7975c1Jk37K30R7k49J52QJ36j62K06k95K9k6J29R0k59L72m29O7J73p0J16k04R0
$$ -31 -30 -267 -37 60 -189 -37 -29 107 -55 151 -144 -115 -141 -12 78 -181 191 -238 -171 2 -68 48 -156 -66
7999f6J58K2P2p9j50RQ5M2o5J92j41N3nm3Ml41J06l5K11L6J6l4j3L6K62l03K02
$$ -66 92 114 186 107 -43 -34 51 93 28 220 79 132 127 84 88 -253 -147 -182 29 65 81 47 34 70 332 29 231
8026B31l29K7J29O0L8k56K27j25p9k39K95o7J15J27r9j78O4j35K19L0j43P7N2
$$ 231 -98 -71 58 118 156 -100 127 2 -77 -316 -21 -88 27 154 55 -123 -59 -194 25 55 -88 -11 41
8049D1o3J2J64j22j66L30l52J46L4j36J06K38l6p1o2k33L93k82K72k1j29j54K70
$$ 41 -22 -10 154 32 -134 196 -156 -10 24 -112 -6 232 196 125 63 -170 223 -59 213 192 63 -91 179
8072A79l80K31N1k99K44n6k51K29L38n12N39k66k84J79J7O6j74J04J21j5O5p4
$$ 179 -201 30 81 -218 26 -30 -281 -52 286 -226 313 47 -237 -58 -41 25 -149 -45 76 61 126 52
8094E2k59K19K43k36M1j12J61q6N0m3j52m8K06lQ5j76J34j71K8K16j03M2m2n6
$$ 52 -207 12 255 19 60 -52 109 23 73 30 -122 -170 36 33 118 -58 76 -95 -67 149 46 88 46 -10
8118a0l5J44j22j18K80K8j58j98J34K54j30m1N7l00K53J63m69K71K00k05K93n21
$$ -10 -45 99 -23 -141 139 167 9 -189 -55 199 69 28 85 -215 38 201 -268 3 203 -2 291 -230
8140b30K94k15J26k41L55k07K76p6l42M18NJ12m85J54kM5J67m7j66L4L54l66J27
$$ -230 64 -151 -25 -266 89 -118 158 82 -260 158 163 275 -210 -56 -58 -13 154 107 -59 -25 329 -37 90
8163I0k30J60j00N9O8N5q7j26o2K66J33p6k15R4J85l85L11m9r2P8k08J61J40k14
$$ 90 -140 20 -80 -21 47 102 15 -111 -173 93 226 150 -65 29 214 -171 140 91 -1 77 -131 30 170 -44
8187d4L35l98K64q3
$$ -44 291 -107 157 74
8191G4
$$ Imaginary data points
##PAGE= N=2
##DATA TABLE= (X++(I..I)), XYDATA
0@%%%%%%%%%%%%%%Qj6J6j6J6k4L2l2M0m8N6o4P2q5R6j10J26j43J63j84K06k32
$$ 0 0 0 0 0 0 0 0 0 0 0 0 0 0 0 8 -8 8 -8 8 -16 16 -16 24 -24 32 -32 40 -45 51 -59 67 -76 87 -97 109 -123
36a23K62k94L26l63M05m49M97n50O09o73P41q16Q99r92J092j201J324j463J619
$$ -123 139 -155 171 -192 213 -236 261 -289 320 -353 388 -428 471 -521 571 -630 694 -769 850
55H50j792J994k226K494k816L205l684M296n108O231p890J0581j5629K8085j10114
$$ 850 -942 1052 -1174 1320 -1496 1709 -1975 2321 -2787 3444 -4446 6135 -9494 18591 -91523
70i1523j29098L66862l8054k72875J75458J43465k58628L5964K41606j89005j70234
$$ -91523 -220621 146241 108187 -164688 10770 154235 -104393 -68429 173177 -15828 -186062
81a86062K80350M9503k70192P8370J94600j82851q2285K11015l7316j80000J35700
$$ -186062 94288 143791 -126401 -48031 146569 -36282 -118567 92448 55132 -124868 10832
92A0832J02268j77802o864J62295r3196j10727J60850M6928j77588K3820J51024
$$ 10832 113100 -64702 -71566 90729 -2467 -113194 47656 94584 -83004 -59184 91840
103I1840p7265r3322J02034J7142r4893O5641P2575j25679l5301J50371j2300
$$ 91840 14575 -78747 23287 40429 -54464 11177 83752 -41927 -77228 73143 60843
114F0843j41376N6211J01119q3193l6835Q7387l8353p5018R5884L8285j24845
$$ 60843 -80533 -24322 76797 -6396 -43231 44156 5803 -69215 26669 64954 -59891
125e9891J3610J19659o4669q5449R7177K6949j04813L6965Q7593p9858m3179R5790
$$ -59891 -46281 73378 8709 -76740 20437 47386 -57427 -20462 67131 -12727 -55906 39884
137C9884j4172q1594O7160M6054r6475L663J02357m7490q2395O9344M1911o9169
$$ 39884 25712 -55882 11278 57332 -39143 -35480 66877 19387 -63008 6336 48247 -20922
149b0922O121M9281m7316j9089O8975j6524p5702M2412O4444n4895l9305N3400
$$ -20922 -14801 34480 -12836 -31925 37050 20526 -55176 -12764 51680 -3215 -42520 10880
161A0880P499m3585K1385K6429m1297l520N4427j7205n3575L6999M0552n1733
$$ 10880 18379 -25206 -3821 22608 -18689 -22209 32218 15013 -38562 -1563 38989 -12744
173a2744j5501O0787j2293n5803L8871L6256n7526o932N9781k8711m3796N9717
$$ -12744 -28245 32542 20249 -35554 3317 39573 -17953 -24885 34896 6185 -37611 22106
185B2106J1262p9172K4876P4540n8488m9392P7253Q400p2644L5789M4020o9378
$$ 22106 33368 -45804 -20928 53612 -4876 -54268 22985 31385 -41259 -5470 38550 -30828
197c0828r19Q2993m2625o8456P7103L3884q7520J1186P3250n0258l6750P3568
$$ -30828 -31747 51246 8621 -59835 17268 51152 -36368 -25182 48068 -2190 -38940 34628
209C4628p988p2637M8429M7955p5091j0256P8694l0285o1359N9340K6860p1573
$$ 34628 26640 -45997 2432 50387 -24704 -34960 43734 13449 -47910 11430 38290 -33283
221c3283J0113O1297m2257l4271O0130l76o1718L4230M7364n7684k0398O6487
$$ -33283 -23170 38127 -4130 -38401 21729 21353 -40365 -6135 41229 -16455 -36853 29634
233B9634p594n7031L3879L5245n0072l940N3979k6862m2760N0579K1163o3054
$$ 29634 22040 -34991 -1112 34133 -15939 -19879 34100 7238 -35522 15057 36220 -26834
245b6834O479N7975l3911l9664N2090R542n7579K1739M5815m8857k1649O1691
$$ -26834 -20355 37620 3709 -35955 16135 25677 -31902 -10163 35652 -13205 -34854 26837
257B6837r991n7843M0572L7565n9679o003O2782k6342m6116N2018J7499o0568
$$ 26837 16846 -40997 -425 37140 -22539 -28542 34240 7898 -38218 13800 31299 -29269
269b9269J7392N2160m6025k7875O1641l463n9407L3525L8822n3035r697N5787
$$ -29269 -11877 40283 -5742 -33617 28024 24561 -34846 -1321 37501 -15534 -25231 30556
281C0556k2291m3168M5003J7629n5244J0116M9226l4690l0490M8558M636m8497
$$ 30556 8265 -34903 10100 27729 -27515 -17399 31827 -2863 -33353 15205 19841 -28656
293b8656K1092L6202l8492j4739M6201q133m0501K8995K6676m0986n879M3334
$$ -28656 -7564 28638 -9854 -24593 21608 13475 -27026 1969 28645 -12341 -18220 25114
305B5114j5033l5029L2394J7889m1519K815L9163k4054k8328L7990Q952m3533
$$ 25114 10081 -24948 7446 25335 -16184 -13369 25794 1740 -26588 11402 20354 -23179
317b3179J2143L6817l1590k0883M2081j311m1575K3994L0147m0369q389M5703
$$ -23179 -11036 25781 -5809 -26692 15389 14078 -27497 -3503 26644 -13725 -22114 23589
329B3589j4643l7479L5222J9763m4950N104M2555k7891k7022M2513M107m5111
$$ 23589 8946 -28533 6689 26452 -18498 -13394 29161 1270 -25752 16761 20868 -24243
341b4243J9753L4127l8105j4619M4612r939l8819K9238K1675m0972K8L9916k1614
$$ -24243 -4490 29637 -8468 -23087 21525 11586 -27233 2005 23680 -17292 -17264 22652 1038
354A038k7983L5973R508m0156J1338L4045k7458j8713L6421M38l4357J7872K5261
$$ 1038 -26945 9028 18536 -21620 -10282 23763 -3695 -22408 14013 14451 -19906 -2034 23227
367B3227l0260q961L4986q355l1033K3570J9333l3305l054L3155j4101k6427K6794
$$ 23227 -7033 -15994 18992 10637 -20396 3174 22507 -10798 -13852 19303 5202 -21225 5569
380E569J1816l4043N578L1059k2492k0664L3656M346l6667J4438K9605k8920j3858
$$ 5569 17385 -16658 -11080 19979 -2513 -23177 10479 14825 -21842 -7404 22201 -6719 -20577
393b0577L7047n451l3415K4468K1284l5942j983L8438j8295k8734L3349J1550
$$ -20577 16470 11019 -22396 2072 23356 -12586 -14569 23869 5574 -23160 10189 21739
405B1739l9290Q844L3653k7088j9455L6671j720l6368K0670K4552l4231p117L8043
$$ 21739 -17551 -8707 24946 -2142 -21597 15074 13354 -23014 -2344 22208 -12023 -19140 18903
418A8903j2643l1653K8247J6664l5075K205L2944j9115k1047L0852N145l3496
$$ 18903 6260 -25393 2854 19518 -15557 -13352 19592 477 -20570 10282 15427 -18069
430a8069J3344K8083k7052j4756L3769j146l1954J7117K1138k7867o379L0715
$$ -18069 -4725 23358 -3694 -18450 15319 14173 -17781 -664 20474 -7393 -13772 16943
442A6943j0947k6657K4786J4217l3413J550L2618j8151k3530K9159Q865l3504
$$ 16943 5996 -20661 4125 18342 -15071 -13521 19097 946 -22584 6575 15440 -18064
454a8064R341K8169k3931j4174L2871l130l2237K1750K2890l3378o950L7230j0653
$$ -18064 -8723 19446 -4485 -18659 14212 11082 -21155 595 23485 -9893 -16843 20387 9734
467I734k9876K5012J4262l2258N237K9246k3582j8892L4854J721l6920J4540K8342
$$ 9734 -20142 4870 19132 -13126 -7889 21357 -2225 -21117 13737 15458 -21462 -6922 21420
480B1420k7674j2886L2149o199k7710K2772J5500l1671J323L2220j7086k3392
$$ 21420 -6254 -19140 13009 6810 -20900 1872 17372 -14299 -12976 19244 2158 -21234
492b1234K9682Q728l2399P506K8287k0103j6610K7597K75k6752J5482J8280k7780
$$ -21234 8448 17176 -15223 -7717 20570 467 -16143 11454 11729 -15023 459 18739 -9041
505i041n653L2653r587k9622K1003J8627k7539m019K6240j2402j7887K4866M635
$$ -9041 -14694 17959 8372 -21250 -247 18380 -9159 -13178 13062 660 -17227 7639 12274
518A2274l1190J1155K8828k3461j8178L0728L388k9111J3052K0845k4773o059
$$ 12274 -18916 -7761 21067 -2394 -20572 10156 13544 -15567 -2515 18330 -6443 -12502
530a2502K9399r940k5438K4019J3485l1584J694L1037j7361k3214K7205Q288k9422
$$ -12502 16897 6957 -18481 5538 19023 -12561 -10867 20170 2809 -20405 6800 15088 -14334
543a4334P146K2156k0615r463K8348p105k8093K1698K0627k9622q234L0552n343
$$ -14334 -7188 14968 -5647 -15110 13238 6133 -21960 -262 20365 -9257 -17491 13061 7718
556G718k2089J7648R041k3737O957K3721k0815j6111K8783M780k9402P494K2848
$$ 7718 -14371 3277 12318 -11419 -4462 19259 -1556 -17667 11116 15896 -13506 -6012 16836
569A6836j8336j1431K3172k933k2467J4833J4637k3788k484K5747j1074k1877
$$ 16836 -1500 -12931 10241 7308 -15159 -326 14311 -9477 -11961 13786 2712 -19165
581a9165K1937J2669k7352j23K5412j0684j6268J9134L232k1292J1962J8482k3721
$$ -19165 2772 15441 -11911 -12034 13378 2694 -13574 5560 8792 -12500 -538 17944 -5777
594e777r962L0105j080k7853J1035J8941j8547n424K0155j0115j6385K1300P203
$$ -5777 -15739 14366 13286 -14567 -3532 15409 -3138 -8562 11593 1478 -14907 6393 13596
607A3596k7720L883K5942j5066j7447K1737N109k2891P848J8033j7613p295K2081
$$ 13596 -14124 -10241 15701 635 -16812 4925 10034 -12857 -5009 13024 -4589 -11884 10197
620A0197m621j9761J6707J2748k4010j474K5413q461k0707J6396J0388j9270K335
$$ 10197 5576 -14185 2522 15270 -8740 -10214 15199 6738 -13969 2427 12815 -6455 -4120
633d120J6191j4597r040K2574j540k5302J0462K1100j8053j1741J9771j43j7032
$$ -4120 12071 -2526 -11566 11008 9468 -15834 -5372 15728 -2325 -14066 5705 5562 -11470
646a1470J1745R886j9832R28K2288j0749j8465J9404R508k2032J941K0322j2081
$$ -11470 275 10161 -9671 -8743 13545 2796 -15669 3735 13243 -8789 -6848 13474 1393
659A393j2728J8508K359j9579R139J4145j8021n443K2469n798k1860J4970J4555
$$ 1393 -11335 7173 9532 -10047 -908 13237 -4784 -10227 12242 6444 -15416 -446 14109
672A4109k0557m368J9740p241j3409J6413K889k0553Q442J9293j7262j2684K2546
$$ 14109 -6448 -10816 8924 1683 -11726 4687 7576 -12977 -4535 14758 -2504 -15188 7358
685G358K627k0563Q130J4159j5508l528J8773p639j6173J6707Q826k1549J217
$$ 7358 9985 -10578 -2448 11711 -3797 -7325 11448 3809 -12364 4343 13169 -8380 -7163
698g163K0293j1075j4459J7321M628j9354N119J5283j3949p326J8404l218j7947
$$ -7163 13130 2055 -12404 4917 9545 -9809 -4690 10593 -3356 -10682 7722 4504 -13443
711a3443J2766J2737j8676m485K0400m561j5607J2481P623j6141L078J5624j2330
$$ -13443 -677 12060 -6616 -11101 9299 4738 -10869 1612 9235 -6906 -3828 11796 -534
724e34j0308J8991J904j9907O643J5505j3468q234J6842k454j5670J1540R161
$$ -534 -10842 8149 10053 -9854 -3211 12294 -1174 -9408 7434 4980 -10690 850 10011
737A0011j7548l36J7838q667j4114J5467O290j8084L147J5754j0634r134J5857
$$ 10011 -7537 -7873 9965 1298 -12816 2651 8941 -9143 -5996 9758 -876 -10010 5847
750E847M38j5807R172J1579j5181m043J7760m112j5394J1017R054j4641p14J3876
$$ 5847 6285 -9522 -350 11229 -3952 -7995 9765 5653 -9741 1276 10330 -4311 -5025 8851
764H851p531j0489J3681K708j6057M722J3718j1575q117J4712M49j3949O480J0457
$$ 8851 1320 -9169 4512 7220 -8837 -4115 9603 -1972 -10089 4623 5072 -8877 -2397 8060
778H060j2251l142J4333l820j2176J0278P653j3813m78J4552o449j1071J1974
$$ 8060 -4191 -7333 7000 3180 -8996 1282 8935 -4878 -5356 9196 2747 -8324 3650
791C650M462j3904L125J2066j0216p106J3417J26j4218O720J0878j2796m296J4196
$$ 3650 8112 -5792 -2667 9399 -817 -7923 5494 5620 -8598 -1878 9000 -3796 -8092 6104
805F104l198j2466R894O857j3834P31J3639o848j0035J2785L777j4353M037J2385
$$ 6104 2906 -9560 334 7191 -6643 -5912 7727 879 -9156 3629 7406 -6947 -2910 9475
819I475j0019o940J3760k36j3520P730R258j2835k803J3995m824j1909J0193O346
$$ 9475 -544 -7484 6276 6040 -7480 250 9508 -3327 -6130 7865 3041 -8868 1325 7671
833G671j3947P77J2867p644q906J2153K860j3887M524J1591j0178n875J3459r51
$$ 7671 -6276 -5499 7368 -276 -9182 2971 5831 -8056 -3532 8059 -2119 -7994 5465 4514
847D514j2574P948Q721j2090k265J3793m839j0542J0139N192j3222J643J2074
$$ 4514 -8060 -112 8609 -3481 -5746 8047 3208 -7334 2805 7997 -5225 -3582 8492
860H492p832q675J2289J736j3755N163J0487j0525n306J3296k262j1742Q070P784
$$ 8492 660 -8015 4274 6010 -7745 -2582 7905 -2620 -7926 5370 3108 -8634 -564 7220
874G220j2440p52J3036n899r499J1042M185j2856K910J1545q428o974J2230N79
$$ 7220 -5220 -5972 7064 1165 -8334 2708 6893 -5963 -3053 8492 64 -6910 5320 5899
888E899j2070N569Q915j0563l457J1810k852j0972Q483O002j1586m60J1459n556
$$ 5899 -6171 -602 8313 -2250 -5707 6103 3251 -7721 762 6764 -4822 -5282 6177 621
902F21q438R591L358j1599K946J0322q005n903J1399L04j1295N923Q673j0149
$$ 621 -7817 1774 5132 -6467 -3521 6801 -1204 -7107 4292 4596 -6699 -776 7897 -2252
916b252l101J1656k703j0128P862O053j1312l9J1223o068q172R841L139j1908
$$ -2252 -5353 6303 3600 -6528 1334 7387 -3925 -3964 7259 1191 -6981 2860 5999 -5909
930e909K599J0064q399n643J1036k27j0954O107P588r954k222J1464l162r586
$$ -5909 -3310 6754 -1645 -7288 3748 3521 -7433 -1326 6262 -3692 -5914 5550 2388 -7198
944g198Q496N363j0994O92J0749o006p421J0081K037j0816L372R218q495n118
$$ -7198 1298 6661 -4333 -3641 7108 1102 -6319 3762 5799 -5017 -1645 7573 -922 -6040
958f040J0840q91j0616O237O846r860k045J0662m038q307Q558L861j0835J912
$$ -6040 4800 3909 -6707 -470 6376 -3484 -5529 5133 1095 -7212 1346 5207 -5628 -3716
972c716J0080o696o378R930J679j0579M287Q208q215l287R861j748q875O662N896
$$ -3716 6364 -332 -6710 3220 4899 -5680 -1393 6815 -1400 -4687 5174 3426 -5449 1213 7109
987G109j0213o39R907m353p993P993L331r593J326Q604o574n259R478J93r839
$$ 7109 -3104 -3743 6164 1811 -6182 1811 5142 -4451 -3125 5479 -1095 -6354 3124 3317 -6522
1002f522M694P643q283l122J0041j907q294O194M893q518J19R200n182o413Q455
$$ -6522 -1828 5815 -2468 -5590 4451 2544 -5750 444 5337 -3181 -3062 6138 956 -5457 2998
1017B998K471r531J968Q511o307m810P993K97q360L951N883q030j540Q827k933
$$ 2998 5469 -4062 -2094 6417 110 -4700 3293 3590 -4770 -819 5064 -2966 -4506 4321 1388
1032A388q064O962M787q792m61Q407l602n807P096J845p908K693P267o426m122
$$ 1388 -6676 286 5073 -3719 -4180 4227 625 -5182 1914 3759 -4149 -1456 5811 -615 -4737
1047d737Q771K78q725L870O331p163k325P993k313o960N812L650q407M23Q213
$$ -4737 4034 4312 -4413 -543 5788 -1375 -3700 4293 1980 -4980 832 4482 -3925 -3502 4711
1062D711m622o302P503K558q136J323O989n128l588P538l03p677N151N737p977
$$ 4711 89 -6213 1290 3848 -4288 -2965 4024 -1104 -4692 2846 2543 -5134 17 5754 -2223
1077b223k193R299j911p487N487L982p004j59P080m909m711P679J056q891K588
$$ -2223 -4416 4883 2972 -4515 972 4954 -2050 -2209 4871 -38 -4749 2930 3986 -4905 -2317
1092b317P618o296m313P845r8p733M552M571o684q30P744l235o334P029L372q424
$$ -2317 5301 -995 -5308 2537 2439 -5294 -742 3829 -2855 -3685 4059 824 -5510 1519 4891 -3533
1108c533R00P854m188n036O630J300p079K926N264o390k514Q050j395q146N006
$$ -3533 -2633 5221 1033 -4003 2627 3927 -3152 -226 5038 -1352 -3866 4184 2789 -5357 -351
1123c51N232p043j790O905k033n569N478K005p481K178P090n416m513P431J596
$$ -351 4881 -2162 -3952 2953 920 -4649 829 2834 -4647 -2469 4621 -795 -5308 2123 3719
1138C719p514K366O168n424k383O588j159n905M677L686p533K8P826l573o483
$$ 3719 -3795 -1429 4739 -685 -3068 3520 2361 -3544 1133 4819 -2714 -2686 5140 1567 -4916
1153d916O023L087p145P47N726m429l139O508n76o828L856N535o750k175P393
$$ -4916 1107 4194 -2951 -2204 3522 -907 -4046 2462 1886 -4942 -1086 4449 -2301 -4476 2917
1168B917j161n827M282L257n852N09O239m057l973O067J709p309J786O163m479
$$ 2917 1756 -4071 211 3468 -2384 -1875 4364 307 -3666 2401 4110 -3199 -1413 4750 271
1183B71l909O482j41o191L254L763n544j008O227k598n409N299L037o681j43O448
$$ 271 -3638 2844 2703 -3488 -234 3529 -2015 -3023 3204 606 -4803 496 3533 -3148 -3291 3157
1199C157k598m287N314R01n580K800M492n214k360O643l80o351L687M270n582
$$ 3157 559 -3728 1586 2487 -3093 -293 4199 -1015 -3375 3268 2888 -3463 224 4494 -1088
1214a088j567N919k235m429M868J700o353J008N972m001m194N717J092o131J977
$$ -1088 -2655 3264 1029 -3400 1468 3168 -3185 -2177 3795 -206 -4400 1317 2409 -3722 -1745
1229a745M802m453j774N496r88m794L688L577n658o71O199j911m999M305K420
$$ -1745 3057 -1396 -3170 2326 1338 -3456 232 3809 -1849 -2520 3679 1768 -3231 1074 3494
1244C494n337O28M636l377k895N025K61n793K509M647m968k187N301o86m845L199
$$ 3494 -1843 -1215 3421 44 -2851 2174 2435 -3358 -849 3798 -1170 -3357 1944 1258 -3587 -388
1260c88L311n260l40N386k449l935M779J862n607J325M917l373l060N006M28n164
$$ -388 2923 -2337 -2677 2709 260 -3675 1104 2966 -2641 -1316 3601 228 -2832 2174 2602 -2562
1276b562K336L811m552j377N319j283m972L504K943m906p21M935k173l947M248
$$ -2562 -226 3585 -967 -2344 2975 1692 -3280 224 3167 -1739 -2460 2475 302 -3645 603
1291F03J365n059J386M524l577k763N319N52n433K424M144m321j279M749j006
$$ 603 1968 -3091 -1705 2819 -758 -3521 1798 2350 -3083 -659 3485 -836 -2115 2634 1628
1306A628m480L785K305m862K01M985k949l864M551J350n279J219M435l829k643
$$ 1628 -2852 933 3238 -1624 -1423 3562 613 -3251 1300 2650 -2629 -1410 3025 -804 -3447
1321c447N252p55m642K974L411m613q80N379j614m361L689K234m794O31M961l090
$$ -3447 1805 1050 -3592 -618 2793 -1820 -2700 2679 1065 -3296 393 2627 -2167 -1536 3425 335
1337C35k920M268P25m477J545M110m246j868M663l64m312K436K865m495m49M570
$$ 335 -2585 1683 2408 -2069 -524 3586 -660 -2528 2135 1771 -2541 -105 2760 -1735 -2184 2386
1353B386j813l960L643K023n114J104M250l141k454M478L38m247J830L745l665
$$ 2386 573 -3387 256 2279 -2835 -1731 2519 -622 -3076 1402 1740 -2507 -677 3068 -597
1368e97j686M673r83l887L173K480m599P3M543k320l568M069J003m468P79M076
$$ -597 -2283 2390 1407 -2480 693 3173 -1426 -1353 3190 870 -2698 1371 2374 -2094 -1315 2761
1384B761l503k114M112J07m310K092L348l817j303M477r74l806L265J988l739
$$ 2761 -742 -2856 1256 1363 -2947 -855 2493 -1324 -2627 1850 876 -2930 335 2323 -1416
1399a416J1M048j948k728L469J029m230J300L420l043k112L784ml679J834K597
$$ -1416 -1405 2643 695 -2033 1436 2465 -1765 -465 2955 -88 -2200 1584 1580 -2099 -265 2332
1415B332l342j162L739j018l339K871J736l776J36L672j874k680L560R02l522
$$ 2332 -1010 -2172 1567 549 -2790 81 1817 -1959 -1823 1849 -25 -2705 855 1757 -1765
1430a765J238L228k979j550L901l14l854K199K585l370o23L381r15l221K650J477
$$ -1765 -527 2701 -278 -1828 2073 1759 -2095 104 2689 -681 -1304 2077 1162 -2059 591 2068
1446B068l614j11L798k155k544K891J000l838J237L170k594j600L577m55l159
$$ 2068 -1546 -1657 2141 -14 -2558 333 1333 -2505 -1268 1902 -692 -2292 1285 830 -2329
1461b329K153K506l182n21L437j214k749K474J704l509J58L303j771k359L025
$$ -2329 -176 2330 -852 -1373 2064 850 -1899 575 2279 -1230 -1072 2231 460 -1899 1126
1476A126P17l581J129K700k792j587L429k57l402K088J991k862n19L242j158k571
$$ 1126 1843 -1738 -609 2091 -701 -2288 1141 884 -2518 -430 1561 -1301 -1820 1422 264 -2307
1492b307K817J232l487Q08L432k370k125L379O58l454R91K737k545j124L142o98
$$ -2307 510 1742 -1745 -937 2495 125 -2000 1379 2037 -1417 -426 2311 -234 -1358 1784 1086
1508A086l060K293J631l205k37L274j819k436K713Q54k992O82K590j859j646K875
$$ 1086 -1974 319 1950 -1255 -1492 1782 -37 -2473 240 1094 -1898 -1216 1374 -485 -2131 744
1524G44L35k906J491K553k887p47L162p78k488K037J680l042j68L093j495k417
$$ 744 1079 -1827 -336 2217 -670 -1417 1745 967 -1521 516 2196 -846 -1014 2079 584 -1833
1540a833K951M67l213P89K837k386j821K880J50k692J371K003k591q21L412r70
$$ -1833 1118 1585 -1628 -839 1998 -388 -2209 671 821 -1871 -500 1503 -1088 -1909 1503 533
1556E33k475K002J867l237L16K907j107k179K305M80k742J301K059k210j209K862
$$ 533 -1942 60 1927 -1310 -994 1913 806 -1373 932 1412 -1330 -29 2030 -180 -1389 1473
1572A473l42k873J486K201k697r44K873q32k205J903J158k797N79K422j522j992
$$ 1473 1131 -1742 -256 1945 -752 -1696 1177 345 -1860 43 1201 -1596 -1017 1405 -117 -2109
1588b109K659O49k620Q41K467j938j030K283j68k602J979J738k800m57K922j041
$$ -2109 550 1199 -1421 -580 1887 -51 -1081 1202 1034 -1568 411 2149 -651 -1108 1814 773
1604G73k490K201Q25k336J82K055j159j872K446K15k658J263J879j877j222K692
$$ 773 -1717 484 1309 -1027 -845 1210 51 -1821 625 840 -1818 -555 1324 -553 -1775 917
1620I17l15k051J330J707k307q4K193p44j742J928Q38k727O30K223j562j612K189
$$ 917 602 -1449 -119 1588 -719 -803 1390 646 -1096 832 1670 -1057 -427 1796 234 -1378 811
1637H11M22k595J230J541j979p67K364o33k307K012J095k378n7K149o09j608J289
$$ 811 1233 -1362 -132 1409 -570 -1337 1027 394 -1913 99 1194 -1184 -1241 908 299 -1309 -20
1654b0J169k420O71K305j668j356K575J83k665J040K170k209o26K077n13j852
$$ -20 1149 -1271 -600 1705 37 -1319 1256 1439 -1226 -186 1984 -225 -851 1226 713 -1139
1670a139J417P86j998L6K245j355j846J984Q67k383M08K096j495j026K104o9k112
$$ -1139 278 1064 -934 -898 1347 -8 -1854 130 997 -1386 -978 1118 -377 -1403 701 632 -1480
1687a480J262J641j989m98K469m79k041J663J005k013k20K209j274j261J768K36
$$ -1480 -218 1423 -566 -1064 1405 926 -1115 548 1553 -460 -680 1529 255 -1006 762 998
1703I98k079O79J920k091j018K022K64k187Q68J596j849l09K111o37j556J599
$$ 998 -1081 -402 1518 -573 -1591 431 695 -1492 -624 972 -877 -1186 925 288 -1268 331
1719C31P09k004K06K002r88j286J657L93j839R45J331j667n05J918n68j903J042
$$ 331 1040 -964 -758 1244 256 -1030 627 1020 -819 126 1457 -210 -715 1203 635 -1268 -226
1736b26J567j762n89J987p61j795J606N40j542L50J798j561r86J919J83j720O40
$$ -226 1341 -421 -1010 977 216 -1579 27 567 -975 -625 1173 -388 -1374 545 728 -992 -352
1753c52J461j175r07J976m07j368J360P74j880L5J747p83j303J358N35j913M07
$$ -352 1109 -66 -973 1003 596 -772 588 1362 -518 -483 1264 481 -822 536 1071 -842 -435
1770d35J245j134p42J568Q5j692Q91J037j560n55K138o07j401J082J003j437J26
$$ -435 810 -324 -1066 502 587 -1105 -214 823 -737 -1292 846 239 -1162 -80 923 -514 -388
1787c88J247q35o21J236M81j734M70J618j330j070J633R6j609O19J507j730l36
$$ -388 859 24 -597 639 1120 -614 -144 1474 144 -926 707 803 -806 -187 1320 -410 -746
1804g46J399k92j515J016P21j719K90J494o83j099J482M85j861P03J427j141p90
$$ -746 653 361 -1154 -138 583 -1136 -846 648 -35 -1134 348 833 -1028 -325 1102 -39 -829
1821h29J734n1j573R75P39j235l44J698o10j393J175N75j258r2J475r99j014J349
$$ -829 905 854 -719 256 995 -240 -584 1114 504 -889 286 861 -397 -489 986 -13 -1027 322
1839C22J72j471J74J711r81j106J667o5j403Q55R61j098m98J616m93j074J154
$$ 322 494 -977 -803 908 -73 -1179 488 423 -980 -125 836 -262 -760 856 363 -711 443
1856D43P70j449J46J421j110j218J804l4j587Q15R05j218m11J350k90j476P86
$$ 443 1213 -236 -90 1331 221 -997 807 773 -814 1 906 -312 -723 627 337 -1139 -353
1873c53J067j271m62J521m92r07J077N77j431L24J264r39q06J301K19r68J95J002
$$ -353 714 -557 -1019 502 10 -897 180 757 -674 -350 914 -25 -831 470 689 -279 -84 918
1891I18q11o54J286O3j515Q30Q52j408J8J081o07q73Q82L46r55j08R92o13o91
$$ 918 107 -547 739 802 -713 117 969 -439 -421 660 53 -820 62 408 -547 -655 337 -276 -967
1910i67J173L5j142P43P52j128j72J508m43q35O45M25o16j88J117o37r65J165
$$ -967 206 241 -901 -158 594 -534 -706 802 359 -476 169 594 -22 -210 907 270 -695 470
1928D70K26r69K8Q96r71o33J143K26j188N70N88o72k61Q23l76o57N80Q65j204
$$ 470 696 -273 -245 651 -320 -953 190 416 -772 -202 386 -286 -547 276 -100 -757 -177 688 -516
1947e16J84Q78j45j028R97K83j164M49J108r97m82J127k65r58P11M56q05r4O22
$$ -516 -332 546 401 -627 370 653 -511 -62 1046 49 -433 694 429 -529 182 638 -167 -261 361
1966C61r7j178Q35M19j138L5J049m40p40J066K56r41K99P79l88o69J125J43r84
$$ 361 264 -914 -79 340 -798 -763 286 -154 -894 172 428 -513 -214 565 177 -492 633 776 -208
1985b08N63N01j108r8J127k47j187R47L79r69p6J142p84n01O73M67j098K98O30
$$ -208 355 856 -252 -350 777 530 -657 290 669 -300 -376 766 -18 -519 154 621 -477 -179 451
2004D51q89l47J064r6p88O10O76q44l49R00r2q17R74L23j111R8R40l85q23Q48
$$ 451 -438 -785 279 183 -605 5 681 -163 -512 388 296 -521 453 776 -335 -237 703 318 -505 343
2024C43J06j043P27M35q93q6P42j56q39K66O44p08R7N38k19o03M65N66p60j03
$$ 343 449 -594 133 568 -325 -411 331 175 -664 -398 246 -462 -365 173 -46 -649 -184 382 -378 -481
2044d81J001m83l56Q09Kp21K62P12o16k85N93N4q91O05M02p67j97P13k54p32N24
$$ -481 520 37 -319 490 492 -229 33 745 129 -156 437 491 -400 205 607 -160 -357 356 102 -630 -106
2065a06K11o28K34N26n60m88Q61L59j039M53N43n88q3Q69m21p10R07M48j024P1
$$ -106 105 -523 -289 237 -323 -811 50 409 -630 -177 366 -222 -305 564 143 -567 340 788 -236 -165
2085a65O78k50n08O57l0n58J57N34n46m01Q21k29p55N55M10q32n7N33J33p77K39
$$ -165 513 263 -245 412 382 -176 -19 515 -31 -432 389 160 -595 -40 370 -462 -519 14 147 -630 -391
2106c91O34p78K76N39r8n19N66J05q73O18M47k67n95R40j99o81J98M15m49l76
$$ -391 243 -535 -259 280 182 -337 229 334 -539 79 526 259 -336 604 405 -276 -78 337 -112 -488
2126d88R06j89p49L76M12n84j29N36o1n27O58j90m60J15N57o25P1P79j46m92L25
$$ -488 418 229 -520 -144 268 -316 -445 91 30 -497 161 -29 -489 -374 183 -442 -371 408 262 -230 95
2147I5L43n51K89K80j30n31M50J07n61j08Q34m06o45P76o4m39R8N37o35k10L83
$$ 95 438 -113 176 456 326 -205 245 352 -209 -317 517 111 -534 242 178 -261 -163 374 -261 -471 -88
2168h8K48p25O13J82o05m5R16r4o14L38K57m25p8O01k04l98L17J38m10J5K24l42
$$ -88 160 -565 48 230 -375 -420 496 402 -212 126 383 -42 -120 481 277 -121 196 334 -76 -61 163 -179
2190a79k27O55j11k17j01L98l59j77O03n22k57N13J43k92r9M70j50k77N16J08
$$ -179 -406 249 138 -79 -180 218 -141 -318 285 -237 -494 19 162 -130 -229 241 91 -186 330 438
2210D38q06O51M38q03J8L99Q2o04M35J27o57Q6L51N1n30K92K69o37K32J93k05
$$ 438 -368 283 721 -82 -64 335 417 -187 248 375 -282 -196 155 206 -324 -32 237 -400 -168 25 -180
2231a80m21N01L46o02J34N29l10j08L33j83m58L35N68p43LP31j74l73K64J34n01
$$ -180 -601 -100 246 -356 -222 307 -3 -111 222 39 -419 -84 484 -259 -256 475 301 -72 192 326 -175
2252a75j3N99l91k7J07J41l98l32P71n25l72O79%n02M39K02m60P7L99k21p7J45
$$ -175 -188 411 20 -7 100 241 -157 -489 282 -243 -615 64 64 -438 1 203 -257 -180 219 -2 -79 66
2274F6q4j58J25O34k18n47M22Mj78J59P7n74K33K43j92k09n5L74l85k40M78j7
$$ 66 -18 -176 -51 583 365 -182 240 244 66 225 302 -272 -39 204 12 -197 -252 122 -263 -503 -25 -42
2296d2l31L40N4j97M42N0n96M9N07J94k85k22M33l41k94O66m63j04N34j73l19
$$ -42 -373 -33 21 -176 266 316 -280 -231 276 470 185 -37 396 55 -239 427 -36 -140 394 221 -98
2317i8Q3M71k83k97O7M03q21K01L51j27m58P90o9n83L73J86k81j77O07k90j23
$$ -98 -15 456 173 -124 -57 346 -475 -274 77 -50 -508 282 213 -370 3 189 -92 -269 338 48 -75
2338g5K5L84k83q3K64O9m78M50R3o59M54K20l48k41L54o4m43M02j45q3QR1o2m1
$$ -75 -50 334 51 -32 232 301 -177 273 366 -293 161 381 33 -208 146 82 -361 41 -104 -187 -179 -88 -150 -191
2362a91RL68m24J29K59j3o01O41J3k52M6O67m99k30L76j77n8j41L32k30j86J82
$$ -191 -182 186 -238 -109 150 137 -464 177 190 -62 -16 651 152 -78 298 121 63 -78 254 24 -162 20
2384B0K40m45K40m4j08m2L12k71m95N55Nj95J31P9L5j74L34m1m26K44O5J41l75
$$ 20 260 -185 55 11 -97 -139 173 -98 -593 -38 -33 -228 -97 -18 17 -157 177 136 -290 -46 19 160 -215
2407b15M96R3l86L52r8J5k98J95L4n62N50Q2m11k6K83m2l30R9L87m40R2J24J8
$$ -215 281 374 -12 340 242 257 -41 154 188 -374 176 258 -153 -179 104 62 -268 -169 218 -222 -130 -6 12
2430A2k22K15P3n33O48J46jl65L17n3o2m1K8k84J20k7P2j78O1J95o3j73M54l87
$$ 12 -210 5 78 -455 193 339 338 -27 290 237 175 134 162 -122 -2 -29 43 -135 -74 121 58 -115 339 -48
2454d8l80M36k76r3L94j75k65K52L23m52p4M29K98m58PL43m0k50J13J67l88ML13
$$ -48 -428 8 -268 -361 33 -142 -407 -155 168 -284 -358 71 369 -89 -82 261 221 -29 84 251 -137 -133 180
2477A80j76P0m3l0j39K8L40n08J69j90K86j95J15J45k29N7L00m69J51J75J45k00
$$ 180 4 74 31 1 -138 -110 230 -278 -109 -299 -13 -208 -93 52 -177 -120 180 -289 -138 37 182 -18
2499a8l7J43j3J10k31R4j91K69m7k03K43J46l83j19J90Q7k0k98J19J56k20J95
$$ -18 -55 88 75 185 -46 48 -143 126 79 -124 119 265 -118 -237 -47 40 20 -278 -159 -3 -223 -28
2521b8J3j00Q9K00k99l4J47R6j70J25L42n86J26K56K30m42M3J42o0m5L38n36J14
$$ -28 -15 -115 -26 174 -125 -159 -12 84 -86 39 381 -205 -79 177 407 -35 8 150 90 45 383 -153 -39
2544c9K39m1j41l07K90j83K3K26J56n25L95kj15J8KK31k42J24J11l05l9M46j54
$$ -39 200 159 18 -289 1 -182 -159 67 223 -302 93 91 -24 -6 -4 227 -15 109 220 -85 -124 322 168
2567A68j19K75j70k66P2K01j3l46M17J98o23J34L44m21L9J65j5j45J34q3j37Q6
$$ 168 49 324 154 -112 -40 161 148 -198 219 417 -206 -72 272 -149 -110 55 40 -105 29 -54 -191 -105
2589a05J56R0l67L99J16n55j8M30j57nm0P2J72k42L07j03P3k08M3j15J88o0j50
$$ -105 51 141 -226 173 289 -266 -284 146 -11 -16 -56 16 188 -54 253 150 223 15 58 -57 131 71 -79
2612g9j08j04R7J28K07j77k41J50J99k33k58J67K52j95J72J31J86m24J61n1l3
$$ -79 -187 -291 -194 -66 141 -36 -277 -127 72 -161 -419 -252 0 -195 -23 108 294 -130 31 -20 -53
2633e3pR9n0j88N07l61O3j17K93l7l59K04j4m2J47j36j85L35J09k57l68M56n9
$$ -53 -60 39 -11 -199 308 -53 10 -107 186 149 -210 -6 -20 -62 85 -51 -236 99 208 -49 -417 39 -20
2656b0k44M34k33j78K85LJ04j67J07L20n56J48L45k53j54L21r7j22J10Lj50l8
$$ -20 -264 170 -63 -241 44 47 151 -16 91 411 -145 3 348 95 -59 262 165 43 153 156 6 -32
2678c2q7j31J82k80N43j76k77L85j28k81M13R6k80J92K71n49L9M63k60k45J32
$$ -32 -119 -250 -68 -348 195 19 -258 127 -1 -282 131 227 -53 139 410 -139 -100 363 103 -142 -10
2699a0L10j40q9J90q1l21K27k06J10j12M19n35J61j88L99k89n9L22k85j19R4K29
$$ -10 300 160 71 261 180 -141 86 -120 -10 -122 297 -238 -77 -265 134 -155 -214 108 -177 -296 -202 27
2721B7k55j40N28q8j02K65j96p3J08j5LNq9J60j2k17M84m63K7L94m56n0J10K54
$$ 27 -228 -368 160 72 -30 235 39 -34 74 59 62 67 -22 138 126 -91 393 -70 -43 351 -105 -155 -45 209
2745B09k33n9M7k26O7J35k8r8J10P4l40K70O1K8n7K56O9n4k30J80j64J22q7J63
$$ 209 -24 -83 -36 -262 -195 -60 -88 -186 -76 -2 -342 -72 -11 17 -40 216 285 231 1 181 17 139 52 215
2769B15J8m07O20l12k05L04j91M6j39P7k87K96m39M44j98J04j5j30Q6K26j71j06
$$ 215 233 -174 446 134 -71 233 42 88 -51 26 -261 35 -404 40 -158 -54 -69 -199 -113 113 -58 -164
2791a64L97j96PKK89k57l08M12j08m10L27J07n4rK19j45k43K41n4j38J4Q5J6m67
$$ -164 233 37 44 46 335 78 -230 182 74 -336 -9 98 44 35 254 109 -134 107 53 -85 -71 14 30 -437
2815d37M65j47K3J36R0k82J70kP0k43K47M4J27j35P9j45L3L1j1j73O9L6q3K00
$$ -437 28 -119 -96 40 130 -152 18 16 86 -157 90 134 261 126 205 60 93 124 113 -60 9 45 -38 162
2839A62k60L4j19j46K78r5j95L37mj06K84j47n1l0L01l04j28J99K27o3j95J71
$$ 162 -98 -64 -183 -329 -51 -146 -341 -4 -8 -114 170 23 -28 -58 243 -61 -189 10 237 174 -21 150
2861A50k62J7L18j77k79N94p5l84K9J43Om09L08O4l48R1L87j29m18M19j27m8J33
$$ 150 -112 -95 223 46 -233 361 286 -98 -69 74 80 -329 -21 43 -305 -214 173 44 -374 45 -82 -130 3
2884CJ21l4m31M83k01j9Q5j22J58j44P8N6R8j09PJ10J0l63L5L55r2r6j05JJ43
$$ 3 124 90 -341 142 -59 -78 7 -115 43 -101 -23 33 131 22 29 139 149 -214 -179 176 84 -12 -117 -116 27
2909B7j19j97L06p3p1J06J89k81P3R0Q2k24l4L9K19k2J48k88j53L57J48o00K43
$$ 27 -92 -289 17 -56 -127 -21 168 -113 -40 50 132 -92 -126 -87 132 110 258 -30 -183 174 322 -278 -35
2932c5L22l27p6O8R4k51M01r7k22k75M47j45N8K03q3J2m4J08k40P7P3K37n35k4
$$ -35 287 -40 -116 -48 46 -205 196 99 -123 -398 49 -96 -38 165 82 94 50 158 -82 -5 68 305 -230 -254
2956b54L20l7k4J87q5j20l5K68j79l82M09r7j3K42l78J02nK17M8m37J71L6j63
$$ -254 66 29 5 192 107 -13 -48 220 41 -341 68 -29 -42 200 -178 -76 -81 136 184 -253 -82 -46 -209
2979b09L32J95n72O6L22K4j57O1J02j65KJ49k21P7j6N6j56Q6J44q5j87L40J66
$$ -209 123 318 -254 -188 134 158 1 62 164 -1 1 150 -71 6 -10 46 -110 -24 120 35 -152 188 354
3002C54m30M4L20o02J40p3L51j52N0r5O5j73K94k82K27p7J97j31r4J0q8J5K28
$$ 354 -76 -32 288 -314 -174 -247 104 -48 2 -93 -28 -201 93 -189 38 -39 158 27 -67 -57 -145 -130 98
3025I8o6k71K27L46o60M02k5k02K21o7l7p4N1J91m0l42J82K50n33M31N1j66O3
$$ 98 32 -239 -12 334 -326 76 51 -151 70 3 -34 -108 -57 134 94 -248 -66 184 -349 82 133 -33 30
3048C0P5j3j20m2K25p3j39L26k02j34L61j05l73j2M82M3m08m1J41qm1J62k41k4
$$ 30 105 92 -28 -70 155 82 -57 269 67 -67 294 189 -184 -196 286 329 -79 -120 21 13 -28 134 -107 -131
3072a31j6R8k10J70P0j33M1J34J47k72K48k36M3J66j23P7k06L39J20j71k31J46
$$ -131 -147 -49 -259 -89 -19 -152 -111 23 170 -102 146 -90 -47 119 -4 73 -133 206 326 155 -76 70
3094G0j47kJ55m5m32K61K83k30p6K04ln57M33K46j65q0K0j01N0J67m0j40k4J83
$$ 70 -77 -79 76 31 -401 -140 143 -87 -163 41 38 -519 -86 160 -5 -85 -65 -166 -116 51 11 -129 -153 30
3118C0j9j10L47L4n97M11P6j83j41M24l05j21L10N8l31K3p5L4j67N02k2m05K73
$$ 30 11 -99 248 282 -315 96 172 -11 -152 272 -33 -154 156 214 -117 -94 -169 -135 -302 200 178 -227 46
3141D6P3j68N9Ok26J21K22K17l67J92j61J64l43M65m49J8K58Q4k18J40jJ5l55
$$ 46 119 -49 10 16 -210 -89 133 350 -17 175 14 178 -165 300 -149 -131 127 211 -7 133 132 147 -208
3164b08K69J01m58P6K03J23k34JQ8m12M79J24j31k50K03J10k84Q5R0J67r2J01
$$ -208 61 162 -296 -220 -17 106 -128 -127 -39 -451 28 152 21 -229 -26 84 -200 -115 -25 142 50 151
3186A51j2j34j67L60r6j50K94o0m19R2J36J7j09L6j46N0L0J55j22J70l42J84o3
$$ 151 139 5 -162 198 102 -48 246 186 -233 -141 -5 12 -97 -61 -207 -157 -127 28 -94 76 -266 -82 -145
3209a45L33k3m75J27K57l31K59N8q2r2Q1K69k65j1L08k28k76M24k81j18O2K31
$$ -145 188 165 -310 -183 74 -257 2 60 -22 -114 -33 236 -29 -40 268 40 -236 188 -93 -211 -149 82
3231H2j52m1K87j09k49L2L68j83k24L69K5j50k59L27j93J27l3j76k24N95j04R6
$$ 82 -70 -111 176 67 -182 -150 218 35 -189 180 205 55 -204 123 -70 57 24 -152 -376 219 115 211
3253B11j78K65k20n2J3J73n2m11M64k81j16J10ml55M21K68n64K20P8m2J80j63
$$ 211 33 298 78 26 39 212 160 -251 213 -68 -184 -74 -78 -433 -12 256 -308 -88 -10 -52 128 -35
3275c5J20m15M97n9j2k25K86J07m47K90M30o91Q0J0n3N7M6k18m4L95k57K40l81
$$ -35 85 -330 167 108 96 -129 157 264 -183 107 537 -154 -74 -64 -117 -60 -14 -232 -276 119 -138 102 -279
3298b79J77j01N0L85l27j64J32K08J71l93K09L6k57J04J1J64j64J63K59o08L80
$$ -279 -102 -203 -153 232 -95 -259 -127 81 252 -141 68 104 -153 -49 -38 126 -38 125 384 -224 156
3319A56q5k86J72K17j6k21l3K87l01K17k88K64j60J31o3j39J98J39j35j43Q2R5
$$ 156 71 -215 -43 174 158 -63 -96 191 -110 107 -181 83 -77 54 -9 -148 50 189 54 -89 -7 88
3341H8o8j29L19j77k35K08Q2j21J21M8l00J35J20j6k66L20j8Q2n38L75l16M64
$$ 88 20 -109 210 33 -202 6 88 -33 88 136 -164 -29 91 75 -191 129 111 193 -345 30 -286 178
3363A78l6j66r2K8J53j9k57J63J25p1K09J0k38J47j11n0j18K25Q6j24Q1o6j79
$$ 178 142 -24 -116 -88 65 46 -211 -48 77 6 215 225 -13 134 23 -27 -145 80 166 42 123 57 -122
3386a22J55J31j40l23L31K52l81N2K56l87L2L8o5J63p3K82k13l43N09nj65l2J12
$$ -122 33 164 24 -299 32 284 -97 -45 211 -176 -144 -106 -171 -8 -81 201 -12 -355 154 149 -16 -48 64
3409F4j36M2K03J11k68l08M70j50j73K73M6l67J76nRj52J37jl86O49j85l56J64
$$ 64 -72 -30 173 284 16 -292 178 28 -145 128 174 -193 -17 -22 -13 -165 -28 -29 -415 234 49 -307 -143
3432a43J52J17m16L10p2j23O9J65k33J10N9qk17K84K67k97L5J69k92mM0J07j11
$$ -143 9 126 -290 20 -52 -175 -106 59 -174 -64 -5 -13 -230 54 321 24 59 228 -64 -68 -28 79 -32
3455c2j75L01k10P8L15l24k57J35M03m8k19n3q4J95m6M3J6j12P4J0j92M47k06
$$ -32 -207 94 -116 -38 277 -47 -304 -169 234 186 -33 -86 -170 25 -21 22 38 -74 0 10 -182 265 59
3478E9l27J68L14k24m3K22J0k64n5L79r8k47Q9l8N8l16M43l01N0Q7r4j7J46K24
$$ 59 -268 -100 214 -10 -53 169 179 -85 -140 239 141 -106 -17 -55 3 -313 130 -171 -121 -34 -128 -145 1 225
3502B25m82K91J60j91j35M41j74j63j4K48k57j83J82K05p6J55j81m22L69J60k82
$$ 225 -257 34 194 3 -132 309 135 -28 -42 206 -51 -234 -52 153 77 232 51 -371 -2 158 -124
3523a24%k80L27j74J55K2L0j73K94j82J35L3M1j39L1NL6j50K21o4k12k9M42j44
$$ -124 -124 -404 -77 -251 -96 -74 -44 -217 77 -105 30 63 104 -35 -4 1 37 -113 108 44 -168 -197 245 101
3547A01j48Q5n5j03J33k3j91K54J90p1l10K85m14Q8J89J80l18L3L02k37j46R2
$$ 101 -47 38 -17 -120 13 -10 -201 53 243 172 -138 147 -267 -179 10 190 -128 -95 207 -30 -176 -84
3569h4L03k49RK98l1l42R4J39r4M6P9j96k36J49J15j2K3N5K6l87L62m6l1P8Kk70
$$ -84 219 -30 -21 277 246 -96 -2 137 43 89 168 -28 -264 -115 0 -12 11 66 92 -295 67 21 -10 68 70 -200
3595b00n7M34l61J92O4Nk31j6L27lk16M02kl33k31O07j25m16M49m02J87j21K96
$$ -200 -257 177 -184 8 72 77 -154 -170 157 154 -62 340 338 5 -226 381 256 -160 289 -113 74 -47 249
3618B49l88K07Jj18q2J89qj18j09M25k36p4J82k70Q0p0J00J0j33N63j95k76J56
$$ 249 -139 68 69 -49 -131 58 50 -68 -177 248 12 -62 120 -150 -70 -140 -40 -30 -163 400 205 -71 85
3641H5N8j51j46J04K46k93o0N30o27P7J58O6L5j59K15r9o4J45k77L2J27J02l60
$$ 85 143 -8 -154 -50 196 -97 -157 373 -254 -177 -19 47 82 -77 138 39 -25 120 -157 -125 2 104 -256
3664b56K31Ml2j0Q2R9k31L84j92%l73M86j37n7O9L4j62O9N0k63kL09k48RJ81N3
$$ -256 -25 -21 -53 -63 19 118 -113 271 79 79 -294 192 55 -2 67 101 -61 8 58 -205 -207 102 -146 -137 44 97
3690I7j12o2J53k95j21L04N94p09O3K38r7j13J5M8j28K67j23J1j6L8j7o1j3J36
$$ 97 -15 -77 76 -219 -340 -36 558 -151 -88 150 53 -60 -45 3 -125 142 19 30 14 52 35 -26 -39 97
3714I7L0k36j7K94l97J55K54r1k44K68k24j19L08m04K78K19j55J66l09J79J34
$$ 97 127 -109 -126 168 -229 -74 180 89 -155 113 -111 -230 78 -326 -48 171 16 182 -127 52 186
3735A86j10qR1o7k04j75K91j60M14j57k21K05N6Q5m87O6J69k24m3L41k19O3L45
$$ 186 76 68 159 92 -112 -287 4 -156 258 101 -120 85 141 226 -261 -195 -26 -250 -293 48 -171 -108 237
3758B37k36n8K0J12J6l65M40k31L14r0LJ34k90J79k55n2J77J21n03O3K43J78k55
$$ 237 1 -57 -37 75 91 -274 166 -65 249 159 162 296 6 185 -70 -122 55 176 -327 -264 -21 157 -98
3781i8J27N8r7n9J41k95Q5J52l64L81j27Q7k6M0J02j91K25K19p9m45J74K64k08
$$ -98 29 87 -10 -69 72 -223 -138 14 -350 31 -96 -9 -35 5 107 -84 141 360 281 -164 10 274 66
3804F6J9J35k94j28K27J91l58o1N24m91K13l4M2k73J57J11m8j87N4J17r8k33N20
$$ 66 85 220 -74 -202 25 216 -142 -203 321 -170 43 9 51 -222 -65 46 -2 -189 -135 -18 -116 -349 171
3827A71l75q8K88n6P9J67o9k10k6O6L21l90J75M5k47K00J69l56J27J41k6j25k2
$$ 171 -204 -292 -4 -60 19 186 117 -93 -119 -53 268 -122 53 98 -149 51 220 -136 -9 132 106 -19 -41
3850d1K71k89j9P9l1j23L59j21r2K16j59o4L0P2J0j83K03r4j4R7q8K90l89m2J45
$$ -41 230 -59 -78 1 -30 -153 206 85 -7 209 50 -14 16 88 98 -85 118 24 10 107 19 309 -80 -122 23
3875B3k10R6K43l5k98K34J83l10N4J91k92M3K6N7j94K09K13n01J76J53k2p9ON3
$$ 23 -187 -91 152 117 -181 53 236 -74 -20 171 -121 -78 -52 5 -189 20 233 -268 -92 61 39 -40 -34 19
3899A9J9j62J69j0J57l35K13j00k76N20j82J83k22o2J6q6K76l62p9M26J7l08L55
$$ 19 38 -124 45 35 192 -143 70 -30 -306 214 32 215 -7 -69 -53 -139 137 -225 -304 122 139 -169 186
3922A86R9n25mL55r1j13N06j81m13L11k08J49j5P8oj73J33P6k75Q4lP4j99L77
$$ 186 285 -240 -244 111 20 -93 413 232 -181 130 -78 71 56 134 128 -45 88 164 -111 -27 -30 44 -155 222
3946B22k48k7O0J26J0j10L0j7j06j5K48l19M35l36N4M2K76j85r0M7O9j56l5J67
$$ 222 -26 -53 7 133 143 33 63 46 -60 -75 173 -146 289 -47 7 49 325 140 50 97 166 10 -25 142
3970A42j70l95O20j51mJ22p0J1n8l00L37k3k07PJ19O4N2J84l92J98P7j71p9J39
$$ 142 -28 -423 197 46 42 164 94 105 47 -253 84 61 -146 -139 -20 44 96 280 -112 86 163 -8 -87 52
3994E2q4l12J47L73oj40q9J41l16J88n9O0J38k0k34J3K32j06k2l19K64l2r2K02
$$ 52 -32 -344 -197 176 170 30 -59 82 -234 -46 -105 -45 93 73 -161 -148 84 -22 -44 -363 -99 -131 -223 -21
4018b1J36k81J33k9O6j32J02K78n59J83K60j5j52J44k8k14P4j54J28k5K67j90
$$ -21 115 -166 -33 -62 4 -128 -26 252 -307 -124 136 121 -31 113 85 -129 -55 -209 -81 -106 161 -29
4040b9r8j62L99l31L94j46p5k78K31J79j32rJ76J92n05L87r8J06j02j21L2j48
$$ -29 -127 -289 110 -221 173 27 -48 -326 -95 84 -48 -57 119 311 -194 193 95 201 99 -22 10 -138
4062a38K02q9L31j41k95J56j96O07m51J27m1p8L2p6P0q9K69k25r8J24J60j26j97
$$ -138 64 -25 306 165 -130 26 -170 437 -14 113 72 -6 26 -50 20 -69 200 -25 -123 1 161 35 -162
4085a62R7J38j03K89Q3j27k61m5J7K75k57J34L4k19q0L21k19p8K89K0j14L1l1
$$ -162 -65 73 -30 259 342 215 -46 -91 -74 201 -56 78 112 -107 -187 134 -85 -163 126 146 32 63 32
4108C2j0L8J8m9k82L61k22m0K12J43k1l05J06P7n3P5k0j44L3J80k08j69M37l3
$$ 32 22 60 78 29 -253 108 -114 -154 58 201 180 -125 -19 58 5 80 60 -84 -51 129 -79 -248 189 156
4132A56k85l2J57j71J47J38p1k38M85j57j48n4PJ17k70K37j2n2j9J15J74l06K61
$$ 156 -129 -161 -4 -175 -28 110 39 -199 286 129 -19 -73 -66 51 -219 18 6 -46 -65 50 224 -82 179
4155A79J19l94L13m2k16j98L52k06N0J62J4o5k03L9l8K0K44m0k29K32o8k0l3j6
$$ 179 298 -96 217 175 -41 -239 113 -93 -43 119 133 68 -135 -96 -134 -114 130 90 -139 93 25 5 -28 -44
4179d4K4k24L71oj64k64K44N3J16k22j8K53J09L1j83r7K58r3k03KK55j18o6N2
$$ -44 -20 -244 127 121 -43 -307 -63 -10 106 -116 -134 119 228 259 76 -21 237 144 -59 -57 198 80 14 66
4203F6n3j46M3J35r3j56K17R3k28J76J7l9l9K1j36J48J41Ll09K18K12n12J89l7
$$ 66 13 -133 -90 45 -48 -204 13 106 -122 54 71 32 -7 14 -122 26 167 170 -139 79 291 -221 -32 -69
4227f9K44j69K3R4l3k54o1J62N6J38n8l35N7K35j55J69l4k3j29N4J45j62Q6K08
$$ -69 175 6 29 123 90 -164 -225 -63 -7 131 73 -262 -205 30 -125 44 10 -13 -142 -88 57 -105 -19 189
4251A89k25k49J41J66n1j17pK40j66L6L09n8k42J50j72J00l4j01J2pK45k98N8
$$ 189 -36 -285 -144 22 -29 -146 -153 87 -79 -43 266 208 -34 116 -56 44 10 -91 -79 -86 159 -139 -81
4274h1J17ll25J76M58k42j78K98k1l23K92q2j50Q3J81k39M21j18P8m81L78J39
$$ -81 36 33 -292 -116 342 100 -78 220 199 -124 168 86 -64 19 200 -39 382 264 342 -139 239 378
4296C78n09O2L95l24j27K24k59J23k0J45j81J40q0n5n3K29l2j17P6J43J9j90m1
$$ 378 -131 -69 326 2 -125 99 -160 -37 -57 88 -93 47 -33 -88 -141 88 56 -61 15 158 177 -13 -54
4319e4O5J5l85K88O2r3p4L74j71j74J24k59K47J16m4j16J19K0k21J9k6R1k06J50
$$ -54 11 26 -359 -71 -9 -102 -176 198 27 -147 -23 -282 -35 81 37 -79 40 60 -161 -142 -168 -77 -283 -133
4343a33L50k6k10qqj85L35n7J73m15K30j5n2R8K54k48j37J85k50J24J05J19p02
$$ -133 217 191 -19 -27 -35 -220 115 58 231 -184 46 31 -21 77 331 83 -54 131 -119 5 110 229 -473
4366d73M53K04l48J31q9L16l05O8k7M1m1J16j71K11m9J63l04L8K77j76k27K08
$$ -473 -20 184 -164 -33 -122 194 -111 -43 -70 -29 -70 46 -125 86 37 200 -104 -66 211 35 -192 16
4388A6k53m7L04j63J46j62L84m31O2kJ10L0k31K37k30R9K00Ok19K12J29k57L0
$$ 16 -237 -284 20 -143 3 -159 225 -206 -144 -146 -36 -6 -237 0 -230 -131 69 75 -144 68 197 -60 -30
4411c0J97j3n8j11L3Q4o3P3o7j18J79j87J34r9K24k69n4K04m5p4j9R8M8o6J19
$$ -30 167 154 96 -15 18 102 39 112 45 -73 106 -81 53 -46 178 -91 -145 59 14 -60 -79 19 67 1 120
4436A20o5k36J42K69j25j84n6L14l05J84p0O6J8L1j70q2K98j11J64j45n9k84k
$$ 120 55 -181 -39 230 105 -79 -135 179 -126 58 -12 54 72 103 -67 -149 149 38 202 57 -2 -286 -288
4459b88O25l08j63N4mj47k8M13j42n6K23j62o7J03M5j03j95L44k93N2J25O2j2
$$ -288 337 29 -134 -80 -84 -231 -259 154 12 -44 179 17 -50 53 98 -5 -200 144 -149 -97 28 90 78
4482G8k29L67j22m0O0Nj07L3r0Oj23K74j94j17R6L14j54j99K14q2k4Oj0M23m67
$$ 78 -151 216 94 54 114 119 12 45 -45 -39 -162 112 -82 -199 -103 211 57 -142 72 -10 -34 -28 -38 385 -82
4507h2n1k66J85j91L01J7J27P9r4n1m3R9Pp6j0R2j5k33O5m1j9R7k0K94j50m3m
$$ -82 -133 -399 -214 -405 -104 -87 40 119 25 -26 -69 30 37 -39 -49 43 28 -205 -140 -181 -200 -103 -123 171 21 -22 -26
4534b6q8L82m44J92p4l7M0j20J69p6Q5K51o0l41J13j6k7j8L38l35%L5j9m7K3J52
$$ -26 -114 268 -176 16 -58 -95 -55 -175 -6 -82 3 254 194 -147 -34 -50 -77 -95 243 -92 -92 -57 -76 -123 -100 52
4560E2p4J65o2k65J57L3J8j93L5J50l0r3J48k68M5L84k56no9N33m20j17K67j22
$$ 52 -22 143 81 -184 -27 6 24 -169 -134 16 -14 -107 41 -227 -182 202 -54 -59 -128 405 -15 -132 135 13
4584A3j77J70J38j55j26J86p5N7O5j76o6K2N8r2K4l8J88n7L9R1k23K95m0k56j98
$$ 13 -164 6 144 -11 -137 49 -26 31 96 -80 -146 -124 -66 -158 -134 -172 16 -41 -2 89 -134 161 121 -135 -333
4609c33L73R0j60L2L7j07J9J08%j18j26K74k94K18L31k99oj61K04j47k1M9p6L07
$$ -333 40 130 -30 2 39 -68 -49 59 59 -59 -185 89 -205 13 344 45 39 -122 82 -65 -86 -37 -113 194
4633A94l34J91L0n3j48L27n8k05J47k01J62m1M9J2j61J1M7l26L21Q2n4O4k7J0
$$ 194 -140 51 81 28 -120 207 149 -56 91 -110 52 11 60 72 -89 -78 -31 -357 -36 46 -8 56 29 39
4657C9r9K10l71K06Q1J99l7j4j66j30K27J5r0k80K72J33p1R5p9k50L2L15m00J01
$$ 39 -60 150 -221 -15 66 265 228 214 48 -82 145 160 70 -210 62 195 124 219 140 -110 -78 237 -163 -62
4681f2J22J40n01K64lK8M1o5K87l73J60j45J08M%N2k01L17k25J08j68J55p8O4
$$ -62 60 200 -301 -37 -40 -12 29 -36 251 -122 38 -107 1 5 5 57 -144 173 -52 56 -112 43 -35 29
4705B9q1L9j33J98K8L6p7J1K94l93J90J27l27m7L11j39r5k55J43j20K21n1j27
$$ 29 -52 -13 -146 52 80 116 39 50 344 -49 141 268 -59 -106 205 66 -29 -284 -141 -261 -40 -91 -218
4728b18j27M11J1l2k42K86r6K9k81K54J26p5K51j57k27J87p6k86q3N47k48L4K57
$$ -218 -345 66 77 45 -197 89 -7 22 -259 -5 121 46 297 140 -87 100 24 -262 -345 202 -46 -12 245
4751B45j25J7lN8l37L57m62L97m43L0L14L51l60o9o1J37j09j10K25q5r1J20L2
$$ 245 120 137 134 192 -145 212 -250 147 -296 -266 48 399 39 -30 -91 46 -63 -173 52 -33 -124 -4 28
4774B8J05j27N2J44j74j54R8J16mk24NJ87oJ70k20J7J7MK0M4j23K7K5m1k0l02
$$ 28 133 6 58 202 28 -126 -28 88 84 -140 -135 52 46 216 -4 13 30 34 54 98 -25 2 27 -14 -34 -336
4800c36O9J97L12l08o0L51k31j35Q4L39m44J64K53m6l36K72j85O5J21k15K25k76
$$ -336 -267 -70 242 -66 -126 225 -6 -141 -57 282 -162 2 255 209 -127 145 -40 25 146 -69 156 -120
4822a20K94l33j32M41j21j16K44l7r3p7K08J6k04M0K8R0k78J02J59J1j3o0j89
$$ -120 174 -159 -291 150 29 -87 157 120 27 -50 158 174 -30 10 38 128 -150 -48 111 122 109 49 -140
4845a40K07k05J8K75n4Qj05j20J87n5j23K58j15j10K08l9j50M3J36k27j4L06j19
$$ -140 67 -138 -120 155 101 109 4 -116 71 16 -107 151 36 -74 134 95 -55 -12 124 -103 -117 189 70
4868G0p2L8j59m2K08k26K4K54j24J49rk79K86k58OM27k08M5Q4O5m36P1P6j28J88
$$ 70 -2 36 -123 -165 43 -183 -159 95 -29 120 111 -168 118 -140 -134 293 85 130 214 279 -157 -86 -10 -138 50
4893E0j95K55j18j81L79k61J51j47R9Q4o5K6k15qK01R2k67l0J50N0k50J70K11
$$ 50 -145 110 -8 -189 190 -71 80 -67 32 116 51 77 -138 -146 55 147 -120 -150 0 50 -200 -30 181
4916A81l14K19k8lk80L15l12L24l5K3R7r8K5l42L17q5J02q3P0o9J35j62J43K0
$$ 181 -133 86 58 55 -225 90 -222 102 67 90 187 89 114 -228 89 4 106 23 93 24 159 -3 140 160
4940A60j15m5j52K44k05K0J22o9R6J22n71J83L51k15j5K62l41J09m4L78j68q1
$$ 160 45 0 -152 92 -113 -93 29 -40 56 178 -393 -210 141 -74 -89 173 -168 -59 -103 275 107 26
4962B6j13J23o3K48k39j16M2K33o7j96R0nJ41L7j13J21j5p4J6n9r9K7j28Q1n4
$$ 26 -87 36 -27 221 -18 -134 -92 141 74 -122 -32 -37 104 141 28 149 134 60 76 17 -82 -55 -183 -102 -156
4987a56N6OJ15J14n3p0r6K54l90J30J03n2J08Q4k36O9Q3J02k16J39j92p1QK28
$$ -156 -100 -94 21 135 82 12 -84 170 -220 -90 13 -39 69 153 -83 -14 69 171 -45 94 -98 -169 -161 67
5011F7N1j59J4J35q2J26k1J85m84J24M0J15O5j49jk13K77k06p6K27j53J19j1P1
$$ 67 118 -41 -27 108 26 152 131 316 -168 -44 -4 111 176 27 26 -187 90 -116 -192 35 -118 1 -10 61
5035F1j5Km1j4j05M6P7Q3m6P1o4j27R3m3r4J98p1Q6k3r7k4L0L1J56j72l4K77j71
$$ 61 46 48 7 -7 -112 -66 11 94 48 119 55 -72 21 -22 -116 82 11 97 74 -23 -47 -17 14 170 -2 -36 241 70
5063G0j94K62j2Lj93k3J40P0m50L61J94k46j38j14L17r3J45J76m23K82P4j26j4
$$ 70 -124 138 126 129 -64 -87 53 123 -327 34 228 -18 -156 -270 47 -46 99 275 -148 134 208 82 68
5086F8J11k04p1J89M8m32M44L1l28Q6K46k10NJ17J53l15P6Q2k34%K15l2k3n3O1
$$ 68 179 -25 -96 93 141 -291 153 184 -144 -58 188 -22 -17 100 253 -62 14 96 -138 -138 77 45 22 -31 30
5111C0q6j1K26l50k7K83p7o0k4K34J44m79K14L7p2K3O9j00J9J20qj28O7p3m2L5
$$ 30 -56 -67 159 -191 -218 65 -12 -72 -96 138 282 -197 17 54 -18 5 74 -26 -7 113 105 -23 44 -29 -71 -36
5137c6o2K04j41J5K13l46N9J65j04rj1J14M1j72K90j22j45K86k13l4K03k23M0
$$ -36 -98 106 -35 -20 193 -153 -94 71 -33 -42 -53 61 102 -70 220 98 -47 239 26 -8 195 -28 12
5160A2o7J50r9P0o1m5L20j67n8l20J96J56j1k32J89j22j8J79N0j75J15j20k20
$$ 12 -55 95 -4 66 5 -40 280 113 55 -265 -69 87 76 -156 33 -89 -107 72 122 -53 62 -58 -278
5183b78K78K16k58l5J42j82J83j18o3J50M1j84K64q0k16J29K40l2j70kj51P3k89
$$ -278 0 216 -42 -77 65 -117 66 -52 -115 35 76 -108 156 76 -140 -11 229 197 27 25 -126 -53 -342
5206c42M62j88M26k09j92M8j39J62J48k77L4J85l9r4P1K47j48jj90m9R2MlM0J20
$$ -342 120 -68 358 149 -43 5 -134 28 176 -101 -67 118 79 -15 56 303 155 154 -36 -85 7 11 8 48 168
5231A68k80j71N47j93o0M7o8J18l2j2j48K6j79K19j37J07R5J65k22J62j03K2k48
$$ 168 -112 -283 264 71 11 58 -10 108 76 64 -84 -58 -237 -18 -155 -48 47 212 -10 152 49 71 -177
5254a77mN6J41K97l29J78k07nQj87K48j05Q7j68N1j07L90m5l27K57l9k50J7J32
$$ -177 -181 -125 16 313 -16 162 -45 -50 -42 -229 19 -86 1 -167 -116 -223 167 122 -205 52 13 -237 -220 -88
5278h8R1l2nJ9NQJ27k69K15J73r8j30K0l7J82j90N4o5K14k27M9o9p5J55k04R8
$$ -88 3 -29 -34 -15 -10 -2 125 -144 71 244 146 16 36 -1 181 -9 45 -20 194 -33 16 -53 -128 27 -177 -79
5304g9J90N4l13p3L02j56K9N2M1J18k50R2J69k3k38K97k37J07k31j12N33j82j44
$$ -79 111 165 -148 -221 81 -75 -46 6 47 165 -85 7 176 153 -85 212 -25 82 -149 -261 272 90 -54
5327e4p0j1K53p4Q1k1J7j24l14M16k62R4K43j17k42Q0J83pm4L8r7J71k97J20j9
$$ -54 -124 -135 118 44 125 104 121 -3 -317 99 -163 -69 174 57 -185 -105 78 71 27 65 -32 139 -158 -38 -57
5352e7J76j80K82k03j27K37j56lJ44l29L21l7k91L34l1j55j6R9PJ26j62lR0j64
$$ -57 119 -61 221 18 -109 128 -28 -31 113 -216 105 68 -223 111 80 -75 -91 8 15 141 -21 -24 66 -98
5376i8L09k55M3K08l38o4J33K72J11j97j40J36r0n3k87J43K44p2J04m6k23J06
$$ -98 211 -44 -1 207 -131 -195 -62 210 321 124 -16 120 30 -23 -310 -167 77 5 109 63 -160 -54
5398e4J74j77K8r9M4p4J86Mo3K0j77M8j1J21J68j56K44l56K54M2K4k05K42j88
$$ -54 120 -57 -29 -128 -84 -158 28 32 -31 -11 -188 -140 -151 -30 138 -18 226 -130 124 166 190 -15 227 39
5422C9L0q7J14q6P5k38K28q0K29l37J57J68m51L97o1j67p1L45k25M9Nk22O3J7
$$ 39 69 -18 96 10 85 -153 75 -5 224 -113 44 212 -239 158 97 -70 -141 204 -21 28 33 -189 -126 -109
5446a09Q5k06L57J34j34j54J86l85L45l07L72m62j5K98j89J9L48l63j1J64j74
$$ -109 -24 -230 127 261 127 -27 159 -226 119 -188 184 -278 -293 5 -184 -165 183 -180 -191 -27 -201
5467b01L9L58k67k48L96k84J4K93J48j00o9j77K63k22J2J59KRk40J0M78m64Q1
$$ -201 -162 196 -71 -319 77 -207 -193 100 248 148 79 -98 165 -57 -45 114 116 125 -115 -105 373 -91 -10
5490a0j18r8R0K5Q6J06J4l06J78KR1k84K52n9n8j1Q3OR5j20P9J21r8K5N9k71o
$$ -10 -128 -226 -136 -111 -25 81 95 -211 -33 -31 60 -224 28 -31 -89 -100 -17 -11 84 -36 43 164 66 91 150 -121 -127
5517a27J97kj75K73j22J96k43L8R5j60j5N2o0K60k07J79l80K99j36r4J33M6L3
$$ -127 70 68 -107 166 44 240 -3 35 130 -30 -45 7 -53 207 0 179 -201 98 -38 -132 1 47 80
$$ [...]
8191b96
##END NTUPLES=NMR FID
##END=
