##TITLE=1H_Pr 54-Eth-2
 CDCl3
 8 sc, 
 25.10.2022
##JCAMPDX= 6.0         $$ Bruker NMR JCAMP-DX V2.0
##DATA TYPE= NMR FID
##DATA CLASS= NTUPLES
##ORIGIN= UXNMR, Bruker Analytische Messtechnik GmbH
##OWNER= root
$$ XWIN-NMR		Version 3.5
$$ Tue Oct 25 14:43:17 2022 Russian Standard Time (UT+4h)  she@DPX200
##.OBSERVE FREQUENCY= 200.1313499994
##.OBSERVE NUCLEUS= ^1H
##.DELAY= (6, 6)
##.ACQUISITION MODE= SIMULTANEOUS
##.ACQUISITION SCHEME= undefined
##.AVERAGES= 8
##.DIGITISER RES= 18
##SPECTROMETER/DATA SYSTEM= spect
##.PULSE SEQUENCE= zg30
##.SOLVENT NAME= CDCl3
##.SHIFT REFERENCE= (INTERNAL, CDCl3, 0, 15.7039)
##AUDIT TRAIL= $$ (NUMBER, WHEN, WHO, WHERE, WHAT)
$$ ##TITLE= Audit trail, XWIN-NMR		Version 3.5
$$ ##JCAMPDX= 5.01
$$ ##ORIGIN= Bruker BioSpin GmbH
$$ ##OWNER= she
$$ F:/spectra/data/she/nmr/H-F/1/audita.txt
$$ ##AUDIT TRAIL=  $$ (NUMBER, WHEN, WHO, WHERE, WHAT)
(   1,<2022-10-25 14:42:21.92 +0400>,<she>,<DPX200>,
      <created by zg, POWCHK disabled, PULCHK disabled
       configuration hash MD5:
       00 E9 B6 7A A2 85 ED C7 34 08 36 98 17 FE 4E 26
       data hash MD5: 16K
       85 6B 89 87 36 7C 40 28 CF B2 FA 68 14 5A 0B 24>)
$$ ##END=
$$ 
$$ hash MD5
$$ AD DB 5D E6 37 13 B4 C2 65 77 B8 AB AC 26 74 D3
##$RELAX= 
##$RELAX= 
##$RELAX= 
##$RELAX= 
##$RELAX= 
##$RELAX= 
$$ Bruker specific parameters
$$ --------------------------
##$DU= <F:/spectra>
##$EXPNO= 1
##$NAME= <H-F>
##$PROCNO= 1
##$TYPE= <nmr>
##$USER= <she>
##$AMP= (0..31)
100 100 100 100 100 100 100 100 100 100 100 100 100 100 100 100 100 100 
100 100 100 100 100 100 100 100 100 100 100 100 100 100 
##$AQSEQ= 0
##$AQ_mod= 1
##$AUNM= <au_zg>
##$AUTOPOS= <>
##$BF1= 200.13
##$BF2= 200.13
##$BF3= 200.13
##$BF4= 200.13
##$BF5= 200.13
##$BF6= 200.13
##$BF7= 200.13
##$BF8= 200.13
##$BYTORDA= 1
##$CFDGTYP= 0
##$CFRGTYP= 5
##$CHEMSTR= <none>
##$CNST= (0..31)
1 1 145 1 1 1 1 1 1 1 1 1 1 1 1 1 1 1 1 1 1 1 1 1 1 1 1 1 1 1 1 1 
##$CPDPRG= <>
##$CPDPRG1= <>
##$CPDPRG2= <>
##$CPDPRG3= <>
##$CPDPRG4= <mlev>
##$CPDPRG5= <mlev>
##$CPDPRG6= <mlev>
##$CPDPRG7= <mlev>
##$CPDPRG8= <mlev>
##$CPDPRGB= <>
##$CPDPRGT= <>
##$D= (0..31)
0 1.2 0 0 0 0 0 0 0 0.06 0 0.03 0 0 0 0 0.0002 0 0 0 0 0 0 0 0 0 0 0 0 
0 0 0 
##$DATE= 1666694541
##$DBL= (0..7)
120 120 120 120 120 120 120 120 
##$DBP= (0..7)
150 150 150 150 150 150 150 150 
##$DBP07= 0
##$DBPNAM0= <>
##$DBPNAM1= <>
##$DBPNAM2= <>
##$DBPNAM3= <>
##$DBPNAM4= <>
##$DBPNAM5= <>
##$DBPNAM6= <>
##$DBPNAM7= <>
##$DBPOAL= (0..7)
0.5 0.5 0.5 0.5 0.5 0.5 0.5 0.5 
##$DBPOFFS= (0..7)
0 0 0 0 0 0 0 0 
##$DE= 6
##$DECBNUC= <off>
##$DECIM= 32
##$DECNUC= <off>
##$DECSTAT= 4
##$DIGMOD= 1
##$DIGTYP= 9
##$DL= (0..7)
0 120 120 120 120 120 120 120 
##$DP= (0..7)
150 150 150 150 150 150 150 150 
##$DP07= 0
##$DPNAME0= <>
##$DPNAME1= <>
##$DPNAME2= <>
##$DPNAME3= <>
##$DPNAME4= <>
##$DPNAME5= <>
##$DPNAME6= <>
##$DPNAME7= <>
##$DPOAL= (0..7)
0.5 0.5 0.5 0.5 0.5 0.5 0.5 0.5 
##$DPOFFS= (0..7)
0 0 0 0 0 0 0 0 
##$DQDMODE= 0
##$DR= 18
##$DS= 0
##$DSLIST= <SSSSSSSSSSSSSSS>
$$ [...]
##$SUBNAM2= <"">
##$SUBNAM3= <"">
##$SUBNAM4= <"">
##$SUBNAM5= <"">
##$SUBNAM6= <"">
##$SUBNAM7= <"">
##$SUBNAM8= <"">
##$SUBNAM9= <"">
##$SW= 18.0517283424941
##$SWIBOX= (0..15)
0 0 2 0 0 0 0 0 0 0 0 0 0 0 0 0 
##$SW_h= 3612.71676300578
##$TD= 16384
##$TD0= 1
##$TE= 0
##$TE2= 300
##$TE3= 300
##$TEG= 300
##$TL= (0..7)
0 120 120 120 120 120 120 120 
##$TP= (0..7)
150 150 150 150 150 150 150 150 
##$TP07= 0
##$TPNAME0= <>
##$TPNAME1= <>
##$TPNAME2= <>
##$TPNAME3= <>
##$TPNAME4= <>
##$TPNAME5= <>
##$TPNAME6= <>
##$TPNAME7= <>
##$TPOAL= (0..7)
0.5 0.5 0.5 0.5 0.5 0.5 0.5 0.5 
##$TPOFFS= (0..7)
0 0 0 0 0 0 0 0 
##$TUNHIN= 0
##$TUNHOUT= 0
##$TUNXOUT= 0
##$USERA1= <user>
##$USERA2= <user>
##$USERA3= <user>
##$USERA4= <user>
##$USERA5= <user>
##$V9= 5
##$VALIST= <valist>
##$VCLIST= <CCCCCCCCCCCCCCC>
##$VD= 0
##$VDLIST= <DDDDDDDDDDDDDDD>
##$VPLIST= <PPPPPPPPPPPPPPP>
##$VTLIST= <TTTTTTTTTTTTTTT>
##$WBST= 1024
##$WBSW= 4
##$XGAIN= (0..3)
0 0 0 0 
##$XL= 0
##$YL= 0
##$YMAX_a= 461274
##$YMIN_a= -536957
##$ZGOPTNS= <>
##$ZL1= 120
##$ZL2= 120
##$ZL3= 120
##$ZL4= 120
##$ABSF1= 10
##$ABSF2= 0
##$ABSG= 5
##$ABSL= 3
##$ALPHA= 0
##$AQORDER= 0
##$ASSFAC= 0
##$ASSFACI= 0
##$ASSFACX= 0
##$ASSWID= 0
##$AUNMP= <proc_1d>
##$AZFE= 0.1
##$AZFW= 0.1
##$BCFW= 1
##$BC_mod= 2
##$BYTORDP= 1
##$COROFFS= 0
##$CY= 11.3945322036743
##$DATMOD= 1
##$DC= 2
##$DFILT= <>
##$DTYPP= 0
##$F1P= 2.36226072786647
##$F2P= -0.459571619588291
##$FCOR= 0.5
##$FTSIZE= 0
##$FT_mod= 4
##$GAMMA= 1
##$GB= 0.15
##$INTBC= 1
##$INTSCL= 1
##$ISEN= 128
##$LB= 0.24
##$LEV0= 0
##$LPBIN= 0
##$MAXI= 10000
##$MC2= 0
##$MEAN= 0
##$ME_mod= 0
##$MI= 1.114404
##$NCOEF= 0
##$NC_proc= 0
##$NLEV= 6
##$NOISF1= 3.799351
##$NOISF2= 2.8
##$NSP= 1
##$NTH_PI= 0
##$NZP= 0
##$OFFSET= 15.70392
##$PC= 1
##$PHC0= -18037.12
##$PHC1= 14.6007
##$PH_mod= 1
##$PKNL= yes
##$PPARMOD= 0
##$PSCAL= 0
##$PSIGN= 0
##$REVERSE= no
##$SF= 200.130013532006
##$SI= 16384
##$SIGF1= 3
##$SIGF2= 2
##$SINO= 400
##$SIOLD= 16384
##$SREGLST= <1H.CDCl3>
##$SSB= 0
##$STSI= 0
##$STSR= 0
##$SW_p= 3612.71676300578
##$SYMM= 0
##$S_DEV= 0
##$TDeff= 0
##$TDoff= 0
##$TI= <>
##$TILT= no
##$TM1= 0
##$TM2= 0
##$TOPLEV= 0
##$USERP1= <user>
##$USERP2= <user>
##$USERP3= <user>
##$USERP4= <user>
##$USERP5= <user>
##$WDW= 1
##$XDIM= 8192
##$YMAX_p= 0
##$YMIN_p= 0
$$ End of Bruker specific parameters
$$ ---------------------------------
##NTUPLES= NMR FID
##VAR_NAME=  TIME,          FID/REAL,        FID/IMAG
##SYMBOL=    X,             R,               I
##VAR_TYPE=  INDEPENDENT,   DEPENDENT,       DEPENDENT
##VAR_FORM=  AFFN,          ASDF,            ASDF
##VAR_DIM=   8192,          8192,            8192
##UNITS=     SECONDS,       ARBITRARY UNITS, ARBITRARY UNITS
##FACTOR=    0.0002768,     1,               1
##FIRST=     0,             0,               0
##LAST=      2.2672688,     0,               0
##MIN=       0,             -536957,         0
##MAX=       2.2672688,     461274,          0
$$ Real data points
##PAGE= N=1
##DATA TABLE= (X++(R..R)), XYDATA
0@%%%%%%%%qJ6j6J6k4L2m0M8n6P2q8J04j28J60j92K24k61L05l56M16m81N51o32
31c38P23q22R33j055J190j342J506j683J877k092K329k586K868l176L512l879
47b035M280m717N195n722O305o951P663q456R349j0360J1513j2839J4384j6217
61h608J8435k1173K4656k9261L5667m5251O1294r4680K80668m58684k09913Q96606
73D49756l73673m71218N72289Q6756o55055M26883M25536p16497j43365P92425
83C93837k41437n75429N07652K65002o14853J12209M80973l98385k45768N35096
93B18897n6838m49667L28868K58441n05369j7526N09600j92750l91248L32412
103C4820K00811l34267J5640K32996k23433q4577L47971p1226l75674K11912L22449
$$ y = [0, 0, 0, 0, 0, 0, 0, 0, 0, -8, 8, -8, 8, -16, 16, -24, 24, -32, 40, -48, 56, -72, 88, -104, 120, -141, 164, -192, 224, -257, 294, -338, 385, -437, 496, -559, 631, -711, 795, -888, 989, -1103, 1226, -1360, 1508, -1668, 1844, -2035, 2245, -2472, 2723, -2999, 3306, -3645, 4018, -4438, 4911, -5449, 6064, -6775, 7609, -8608, 9827, -11346, 13310, -15951, 19716, -25535, 35759, -58921, 221747, -236937, -446850, 449756, 76083, -395135, 177154, 263910, -391145, 35738, 461274, -255223, -398588, 393837, 152400, -423029, 84623, 349625, -265228, -153019, 327954, -70431, -316199, 218897, 162059, -287608, 41260, 299701, -205668, -223194, 286406, 93656, -297592, 34820, 235631, -98636, -82996, 150000, -73433, -158010, 189961, 118735, -256939, -45027, 277422]
114B77422k92700k11266K88016M5323k21653J22502J15822k38133K6842K80918
124A93093j75216k51929K79624J48538l12403J2173K82349j62128j85313K50764
134G9552L3193k57876J25847J82994k34821l5649K74574j36666k45585K60527
144D6090J45900l01619r904K55797j09954j35643J72764l1652j77082J82968J27906
155A65571k67375l7428K75418n6414k15563J18513J06545j33654J9508J15002
165I0123j16810o4506J68317m102j76583O7075J48368j10120r0787J32037K1998
176F5010j34952L5718J07024q2546n2134J11856j8921j14602R3519Q3542j61596
187f8082k6845J98494m1817j81380J10555J12429j51831o481J45587j09327q3032
$$ y = [277422, -15278, -226544, 61472, 106795, -114858, 7644, 123466, -114667, -87825, 193093, 17877, -234052, 45572, 194110, -118293, -106120, 176229, 14101, -171212, 79552, 112745, -145131, -19284, 163710, -71111, -106760, 167814, 31148, -214437, 46090, 191990, -109629, -119533, 136264, 26310, -109333, 63431, 31779, -145303, 37665, 165571, -101804, -139232, 136186, 79772, -135791, -17278, 89267, -44387, -24879, 90123, -26687, -91193, 77124, 73022, -103561, -36486, 111882, 1762, -89025, 43012, 65010, -69942, -34224, 72800, -9746, -61880, 49976, 31055, -83547, 9972, 93514, -68082, -94927, 103567, 61750, -119630, -9075, 103354, -48477, -54958, 90629, -18698, -101730]
198a01730K01300j3243k32780J20493J87274k03413q2094K27097n0243j76148
208a23487J65477O3282k25005P1900K01243j91891j04929K53381k8294k33990
218a52313J51919J40209k23984o465K18351j22010j33349K06225O457k18973J21456
229a2477J60593k07793n3944K28113n9431j75872J43514P3500j76820M1998J50195
240A11576j37102p9639J85004j0438j78638Q8892J22642j37489m1870J45459m0815
251B7582j13696J05912N4257j38692J6466J35322p9944r6905J25829L8211j41343
262f7001L0307J22685r0326p3190J28958K474j32252P1725R7758j32088l3526
273g4476J56263m5967j37194J16167P4638j55328J2228J45721r8729r0050J57119
$$ y = [-101730, 99570, 86327, -146453, -25960, 161314, -42099, -124193, 102904, 52661, -123487, 41990, 105272, -119733, -47833, 153410, -38481, -143410, 109971, 81677, -152313, -394, 139815, -84169, -90634, 127717, 5707, -127642, 78583, 85040, -133933, -12477, 148116, -59677, -113621, 114492, 55061, -120811, 22703, 96203, -80617, -38619, 111576, -25526, -105165, 79839, 69401, -109237, -20345, 102297, -35192, -77062, 68397, 27582, -86114, 19798, 74055, -64637, -48171, 87151, 7207, -89698, 36131, 74342, -67001, -36694, 85991, -4335, -77525, 51433, 53907, -78345, -6620, 91138, -40950, -74476, 81787, 35820, -101374, 14793, 89431, -65897, -53669, 92052, -6677, -96727, 60392]
284F0392J778j65169R2113J19827j58089l3988J76637o3052j37119J40684N5380
295H9394j71614M4665J46565j28513p4323J68598j9153j55380J02546R3844j51387
306e4758p901J48969p6103j01695J30432K6109j42316N0912J10514j06929n0048
317g2814J28141j8426j10694P5511O6348j06228p237J07782m7634q1203Q7879
328B1425L6953j03373J4259R3233n9576o1678Q8954J4762r7359L5505P9912p9045
340a6028m2453J03209r770j01622O1746P1487j00615j9072J12142m1572r0624
351g3172R3845M1223j20019K5749J11274q7424o6237J25647J4j25297O8622Q6513
363H0738j16255k0395J26842n3243r6719J08209L6104j30542L5525J09515r5419
$$ y = [60392, 62170, -102999, -10886, 108941, -49148, -83136, 93501, 30449, -106670, 34014, 89394, -82220, -37555, 109010, -19503, -93826, 74772, 55619, -99761, 2785, 96629, -54758, -62659, 86310, 10207, -91488, 38944, 65053, -77263, -26351, 84163, -22766, -72814, 55327, 36901, -73793, 1718, 68066, -38162, -45399, 62383, 14749, -66454, 21425, 58378, -44995, -30736, 62497, 2921, -58757, 30197, 44959, -52400, -16895, 63017, -16028, -58481, 44728, 34958, -66664, -4918, 66569, -34046, -53118, 59024, 17452, -73172, 20673, 61896, -58123, -32374, 78900, -8524, -74761, 50886, 50900, -74397, -5775, 80738, -35517, -55912, 70930, 17687, -79032, 29177, 65281, -65261, -29736, 79779, -15640]
374a5640n6294J22764j3009j11285P4823O5223j09720j482J10007o0303p5620
385g0536J01859K1500j10678L6664Q8888p9871m2808R8354j1155q7541N8307N3781
397E6764q7489o858R0955m0034p1938P3731L5034q9584Q708Q1706m9793n4113
409e2911P6916J2030q4229L3790O9088p2180l3437R3385j2623q9842N8898O2729
421F1614r0393j4952R6998l7238p4751Q0836K8450j00834K9358R0341q1874n1503
433f3948J11082n606j07993O0831P0290r8142j1207J03170n2524p4508R9582K0558
445E1585j15493M1186R6173r0853m6411J12930j5097r8920P0143N5464r9593M441
457c4445R7325o1094o4520R8833J2875j06956L9550Q4862p8518m0716R0427j1445
$$ y = [-15640, -71934, 50830, 37821, -73464, 1359, 66582, -43138, -44620, 65387, 5084, -70536, 31323, 52823, -57855, -21191, 67697, -12174, -54982, 43372, 32217, -55324, 2983, 56764, -30725, -37583, 53372, 13338, -58600, 15131, 50165, -39419, -30711, 50995, 1202, -52911, 24005, 36035, -48194, -14404, 54684, -17496, -50933, 42452, 29829, -60013, -1115, 61614, -28779, -43731, 53267, 16029, -58722, 22114, 50564, -50270, -20912, 69429, -12445, -63948, 47134, 41528, -66465, -5634, 64656, -33486, -44693, 58477, 5953, -68555, 31027, 51585, -63908, -22722, 73451, -17402, -63813, 49117, 34020, -64900, 5243, 60707, -38886, -34445, 62880, 1786, -62734, 36099, 48974, -57982, -18432, 66430, -12088, -52804, 37623, 26178]
469B6178p6559N6699L8748q3709Q411Q6258n2930o6241Q2692K9420q9649J3370
481b7312P3883m9605l8664P2886n755p4223M9997N4550q1200j8129R2705k5018
493B4115q0458O3052M6614q4907p18Q1160m5688n3318P8833N170q9060M7440P1513
506F3748r0149l2801J08421j6115r5219O0163N3901q3993N333Q0392o2988m8630
518e7937J03249J3j11202M9553Q7719q4796l8714R3743j9007p3372O7072K9707
530D6028r2365K2638Q6057o8732n4786R4895O933r4256L8447O8946o9930k6715
542d2840P7821j9516o0834N8861K5082p9722J8732P9780n5795o0230P8724K8039
554D8102p9081Q933N8681m1164k2024O0036k1327o1282N8837M5068q3926j5956
$$ y = [26178, -50381, 6318, 45066, -38643, -30232, 56026, 3096, -63145, 19547, 48967, -40682, -27312, 46571, -3034, -41698, 31188, 25433, -48790, 1207, 55757, -25443, -43572, 49133, 24115, -56343, 6709, 53323, -31584, -32302, 48858, 3170, -50148, 28685, 33855, -55205, -7765, 63748, -26401, -59202, 49219, 33104, -62115, -1952, 51949, -32044, -26711, 53681, -9307, -57937, 45312, 45325, -65877, -16324, 71395, -13401, -52115, 41628, 22621, -50751, 16321, 46028, -46337, -23699, 62358, -6374, -61160, 33735, 40668, -53588, -15141, 53805, -16125, -42840, 34981, 15465, -45369, 13492, 38574, -41148, -22416, 57364, 1569, -58661, 20063, 48102, -30979, -22046, 36635, -4529, -26553, 33483, 12156, -49126, 9711, 54779, -29147, -45103]
566d5103Q6399j8543o8027M7677L1484o3361J2881N8563n3043l4073P8979l911
578B9922q1796M5214O2101p5345k4796Q6047j7512p0977N3348L4012o9523J3991
590a5314O3408o0595l6049Q9518k667r4609L9471P2917o4009l2031O5952j5848
602A0144m7518N6608J2452p8105K6883P6224n8868n2352P4681J6223o9672K2143
614a1157M7023m9727j1886O0581k4896n0857N4408K5942o9407O420O6970l7293
626F121m9166N6214K0173n9306J1473M3784l8739j5847N4251j8709n6072N0469
638D646M2800p0164j7573P1860j0988n4681L6950K2455m9970J6859M8537n2202
650a1471l0056P3948J487p5952K9949N7127n3948k3225O1126j6003n0019M8153
$$ y = [-45103, 41296, 22753, -45274, 2403, 33887, -29474, -16593, 41970, -11073, -45146, 33833, 29922, -51874, -6660, 55441, -19904, -44700, 41347, 23835, -47142, 6206, 40218, -29305, -15314, 48094, -12501, -48550, 40968, 38301, -56308, -16837, 56080, -7929, -39960, 25992, 10144, -37374, 19234, 31686, -46419, -19536, 56688, -2180, -54532, 20149, 36372, -33300, -11157, 35866, -13861, -25747, 34834, 9938, -40919, 13489, 39431, -29976, -23556, 43414, 6121, -43045, 13169, 33342, -25964, -14491, 29293, -9446, -25293, 28958, 10249, -45823, 4646, 47446, -22718, -40291, 31569, 20581, -34100, 2850, 25305, -24665, -7806, 40731, -11471, -41527, 32421, 33908, -42044, -12095, 45032, -8916, -32141, 28985, 12982, -37037, 11116]
662A1116K1689o5287J4889O0859m9863l8476P1391M163p3046L0517N3214n3307
674a2141j7652N7985k1272m3288N4823J4267p1319K0662O7991m9131m5014O3311
686A9222J0902n8343K3256L6534m9404m569N8992k9845n0567N4843K6653o5123
698b7449L129N7995l1595l5982M8838N988n1406K5341L8350m8464j2269N8189
710C0665j6844n2203M3036L3157n7395n088N5744k2815l7898M3371Q566n0646
722b8350K3187M3030n0858k1958O3618o572n9514L2934L8020n0214n891N1559
734B8991k7784l6591N3080R455o1645K1816N2714m7489k7052N9716n274n3157
746c3220L4926L1543n2289k52N2856l0540l7096N1943R534n8220J9527M6910m2054
$$ y = [11116, 32805, -32482, -17593, 43266, -6597, -45073, 26318, 30481, -42565, -12048, 41166, -12141, -29793, 28192, 6920, -36368, 18455, 32722, -38597, -17935, 50056, 925, -44089, 19222, 30124, -28219, -4963, 31571, -17833, -22402, 36590, 6745, -43822, 11021, 37674, -27449, -24320, 33675, 2080, -33902, 14936, 20924, -30482, -5141, 33209, -15255, -27524, 30665, 13821, -38382, 4654, 37811, -19584, -24672, 31072, 8257, -29641, 13730, 22296, -28350, -5163, 37867, -12991, -34949, 28669, 22097, -37417, -4483, 33537, -16677, -22568, 28991, 1207, -35384, 17696, 27151, -34494, -12678, 40036, -7453, -34505, 25211, 19937, -33220, 1706, 33249, -19040, -19292, 33564, 3024, -34072, 17871, 27405, -30815, -11288, 35622, -6432]
759f432k3502N0777o068m4349L1528K4446m7102J987M8141k7345l5274M4781J3346
772B4934m8405J1491L9455l0953k0136M1903l797m0131K6603K7565m1645p179
784b0295M5289j5192l7065L3043J8979m2258L234L9089k5243k5289L8998M276
796A7566m3206J9155L4220l7737j5280M6113q352m0781K9977K4634m2877j39M3707
809B7000k4368l0761M2487Q635m7589J6863L8644l7512j8474M6706p325m2294
821b7988L0219K4854m4445m71M4198k4129l1693M1610R127m6596J5485L8042l5529
834g316j8239M5226o281m0522K8240K5558m1841j969M2550j9966l1472L6503J1410
847B1881m2216J1772L5383l0692j9479M0826k544l9429K3272K5635l7189n973
$$ y = [-6432, -29934, 20843, 14775, -29574, 1954, 26400, -20702, -18715, 29426, 2081, -33193, 11588, 24934, -23471, -11980, 27475, -3478, -23614, 18289, 14492, -25639, 964, 28529, -13116, -20295, 24994, 9802, -27263, 5780, 24759, -17499, -14265, 24824, -419, -25708, 13290, 17566, -25640, -6485, 27735, -10002, -25282, 20831, 12479, -28302, 1675, 26309, -16568, -16707, 27000, 2632, -28129, 14358, 22993, -24596, -7733, 30911, -6601, -25075, 21631, 14306, -27988, 2231, 27085, -17360, -17831, 26367, 2238, -29455, 12155, 21282, -25314, -9829, 28213, -7316, -25555, 19671, 13390, -27132, 1108, 26666, -15175, -17144, 25406, 5440, -26032, 10471, 21881, -20335, -8563, 26820, -3872, -23351, 17475, 14931, -24498, -1226, 24409, -12780, -18753]
859a8753M0287j6164l2081L3676J4139m1109P259L7387k6936k2400L9265J421
871A5991l9517K0624K9101l6447r143M1727j3059l5038L2079J7630m1171M050
883a3173L8993k5400k5357L8802L425m0583J8609K9891l5686j0985M1628j1920
895H244l4595L0131J8726m0135L303L7928k3675k4073L7554K886l7891J7908K9049
908B5360l3457j1134L9406r986l3301K7154J8134l6780K231L4526k1518k2974
920b2339L3665M868l6603J4373K8504k9769j3013L6372o339l2425K3306K0130
932B0730l3285k041L4562j6557k5263L0358R630l5275R340L0908k5529j7278L4467
945A4767j258l3664J9388K2482l1835n309L4755j4007k8375K9376J2313l6500
$$ y = [-18753, 21534, 5370, -26711, 6965, 21104, -20005, -12746, 24641, -2295, -24695, 14570, 15991, -23526, -2902, 26199, -10248, -19391, 22336, 9277, -25761, 6318, 23948, -17223, -13173, 25820, 420, -24937, 13865, 17290, -23293, -4684, 25207, -10479, -21464, 20164, 8244, -26351, 3780, 22506, -17629, -14326, 23602, -73, -24146, 13408, 16294, -21597, -3689, 25360, -8097, -19231, 20175, 10189, -23112, 4042, 22176, -14604, -12373, 22153, 635, -22339, 11326, 16194, -20409, -6036, 22468, -7301, -20314, 16058, 9719, -22706, 600, 20730, -12555, -14596, 19966, 3409, -21854, 8504, 18134, -17141, -7801, 23107, -2422, -19700, 14767, 13509, -20155, -767, 21715, -10120, -15429, 19326, 5319, -23056, 6320, 18633, -17867]
957a7867P256L2469k4655j9385L5278O4l5086J9714K4376l3071n654L6857j4350
970E946k9065L0599J2929l7041O900L3424k4788j9281L4462l17l3940J9236K2985
983B2049l2456n693L5442j3974k8410K8370J2681l3987N358L0311k1673j7756
995a9738L1137Q8l0941J7443K2205k9323o673L3095r720k7079K3473J4024k9887
1008a1896K647K7854j8665j7240K8492J900l0419J3625K3575k6281j0489L0988
1020A4091o005k7152K0134J5429k8467J6K9189j6753j9860K8176N491l1501J1185
1033f027K6290k3967j3070L0039k811k7273J8229J6006k7722k48K9284j6468k1506
1046a9244K7564P481l1290P749K5854k0966j3297K7201l130k5844J8351J5982
$$ y = [-17867, -10611, 21858, -2797, -22182, 13096, 13160, -21926, -2212, 22164, -10907, -16561, 20296, 5946, -23119, 7480, 20409, -16632, -9732, 23692, -1096, -20377, 14085, 13768, -20172, -936, 22049, -10407, -16100, 19342, 5368, -23042, 5328, 18009, -15978, -10620, 19691, -1982, -19738, 11399, 11487, -19454, -2011, 20194, -9129, -15802, 17293, 7573, -19506, 3967, 17991, -11896, -9249, 18605, -60, -17300, 11192, 13092, -17327, -3702, 19873, -6408, -16897, 14091, 8086, -19066, 1068, 16497, -11970, -11954, 17235, 482, -19378, 8798, 14289, -17212, -6027, 20263, -3704, -16774, 13265, 10454, -16819, 1410, 17416, -10306, -10554, 18730, 2262, -19244, 8320, 15801, -15489, -7740, 18114, -2852, -16149, 11052, 7922, -17922, 429, 16411]
1058A6411k7534j780K9425j3131k2492K4513J0143k8745N901K4503j8870j3163
1070a4819K6403j546k5794J6088J7789k6375n300K9689r485k4285K0370J2366
1082A5101k5502K285K2581j6422j4052K5929M48k8081J3554K2391k4256r541K7547
1095A1982m724k3418J8149J2628k5407K537K5589j6742j7538K6770M146k9028
1107a5056J0360K3230k2273j1128K7320m425k4144J7742J3263k6356J787K6453
1119A6773j6774j9436K7106O349k9338Q164K3127j9318j0540K5248n006k2784
1131a6429J9399J3814k7369l47K7935j2834k0569K2403P168k4962P349K0067j9307
1144c682r316K4904m835k3280J7387J4191k4968k082K5747j0931j9461K0071Q067
$$ y = [16411, -11123, -12903, 16522, 3391, -19101, 5412, 15555, -13190, -7289, 17214, -1656, -14819, 11584, 10038, -15756, 332, 18121, -8254, -13554, 16135, 6650, -17635, 2735, 15101, -10401, -8116, 14465, -1957, -16009, 9920, 10368, -17713, -4159, 18232, -6024, -15565, 11982, 7258, -16160, 1989, 14617, -10790, -8253, 17336, 594, -16944, 9826, 13972, -15056, -4696, 18534, -3739, -14867, 12453, 8028, -16116, 1626, 14889, -11467, -9680, 16773, -1, -19437, 7669, 14018, -15320, -7156, 15971, -3347, -13887, 11361, 6355, -16429, 2970, 16784, -10585, -10932, 17003, 4169, -16400, 6003, 13171, -11791, -4442, 15625, -3682, -12998, 11906, 7071, -16209, 1178, 15369, -9599, -11681, 14066, 3135, -16326, 3745, 11812]
1157A1812k3422N895K0042j8209r280K4508k407k4697J4907J7877k2616o526K4657
1170A2541o978j8895J7935P517k3414N449K1852j7758j3957K4443K168k4869R957
1183d009J8447j9969o322K2928p114j9091J8205R372k4029M322K2435j5767j4643
1196a5235K3849K702k4162J0060J7654j9008o107K2263p304j9146J8835R746k5106
1209a0959K444K3627j4031j5551K0399L773k1767R137J5976j8823n938K2921o049
1222E159k0599J6919J2007k2109j75K1331j0611j4611J8672L992k0135P422J6460
1235A3722j6778q089K1779l767k0123J3775J2889k0257k060J9769r120j4247J6993
1248D486M494k0619P005J7887j6420j0085K1610n31k0697J1285J3916j8358k713
$$ y = [11812, -11610, -5715, 14327, -3882, -13162, 11346, 8939, -15758, -851, 17026, -5590, -12116, 12541, 5563, -13332, 4603, 12120, -11294, -5845, 16007, -1751, -15708, 8735, 10903, -13966, -4009, 14438, -5531, -11853, 11075, 3961, -15130, 3075, 12447, -11582, -7260, 15175, -592, -15235, 8614, 11316, -12846, -2786, 14868, -4140, -10247, 12016, 4712, -14434, 4401, 14147, -10959, -8515, 15112, 1081, -14470, 5929, 9702, -12065, -2928, 13048, -5775, -11713, 11208, 5159, -15440, 1479, 13486, -8623, -8798, 12533, 1922, -12689, 5983, 9975, -10160, -2738, 13722, -3056, -11145, 10634, 6867, -13256, 519, 13408, -6849, -8909, 10860, 1740, -12507, 4486, 8980, -11639, -4634, 13253, -3167, -13252, 8358, 7827, -12870, -1585, 12331, -6027, -8740]
1261h740K0058q192j5999J7646O746k1565M887J8923j4597j1408K0017O26j9975
1274a1573J0172J3751j8016l781J9844p364j6584J6457Q136k0998K815J9233j2235
1287a43j2385J8871J661j8884R297J3614j6796m447K0268o174j7283J5271R562
1300A2432j9793O97J8422j0431j2756J7065K827j9035P869J4886j6246o932K0072
1313I077m050j8249J3730J0738j8907l84J8899r648j3538J7450M118j9554O562
1326c756J6549j5159q233J9598k158j8328J2157J1567j8367j424J8891r322j4172
1339a2157J6980M809j9922N845J6450j4836q917J9731j765j8188J1142J1924j7695
1352f599j887J9185q397j4504J6685N391j9054M600J6834j3626q755J8336j145
$$ y = [-8740, 11318, 3126, -12873, 4773, 11519, -10046, -5159, 13764, -833, -12241, 7776, 8402, -11573, -1401, 12350, -5666, -9447, 10397, 3033, -13551, 2906, 11042, -9956, -7141, 12092, -143, -12528, 6343, 8004, -10880, -1583, 12031, -4765, -9212, 11056, 4882, -12401, 2870, 12432, -7361, -6664, 11758, 1327, -11429, 5636, 8463, -10572, -2703, 12183, -4063, -10995, 9077, 5027, -13222, 508, 11246, -7661, -8045, 10854, 1206, -12332, 5118, 9236, -10318, -3756, 12793, -2366, -10599, 8999, 6841, -11487, 670, 12237, -6130, -7554, 11337, 2015, -12157, 4823, 9632, -10290, -4445, 12005, -2831, -11748, 7983, 6218, -11970, -828, 11096, -6599, -8486, 10699, 2302, -12202, 4483, 9874, -9180, -4580, 12254, -1372, -10127, 8209, 7064]
1365G064j7996J0850J1978j7179k590J8071p241j4538J4965N783j8152L754J6108
1378A0877j2691r195J6894M98j7008Q973J2227j5707l214J7722o554j3752J3796
1391B866P155j7427K373J6055j0697r965J5859J309j6980P807J2509j4791m553
1404h480J7066m843j4641J2284P858j6876J326J5762r677j0365J5322J962j5859
1417i161O774J2545j3807n001J6623l613j4385J1404Q658j5736M5J5631q548j0573
1431i144J4169K694j6124N972J2774j2979o105J5722l028j3959J0235Q397j4450
1444e826q01J4961p400j1009J3694L594j5216M524J3020j1394o745J5057r61j4112
1458h614Q743R126j3141k096J4736o285j1423J2277M577j4687K338J3477r921
$$ y = [7064, -10932, -82, 11896, -5283, -7873, 10198, 2957, -11581, 3384, 9167, -8985, -5231, 10877, -1814, -11009, 5885, 6383, -10625, -1652, 10575, -5132, -8346, 9376, 2822, -10930, 2866, 10021, -7406, -5033, 11022, 325, -9640, 6219, 7528, -9452, -1645, 10864, -3927, -8480, 8586, 3743, -10898, 1386, 9244, -7632, -6306, 9456, -221, -10586, 4736, 6698, -9161, -2387, 10158, -3649, -8650, 7973, 4360, -10025, 1379, 10037, -5699, -5654, 9977, 1429, -9144, 5025, 7719, -8405, -2433, 10341, -2638, -8743, 6979, 3951, -10008, 227, 8624, -5826, -6627, 8334, 934, -10075, 3619, 7213, -8003, -3479, 9541, -1853, -8598, 6459, 5498, -8614, 129, 9255, -3886, -5982, 8754, 2469, -8954, 3323, 7900, -6787, -4449, 9028, -893]
1471h93q146J4192J96j4143P247J0032j2855l062J4612m684j1972J1349O096j4298
1485f329J765J3768r376q358J3824J285j4336O584J0751j2454l988J4663m085
1498C714j2683J0669P116j4899O58J3953q260r201J2900J528j3566N672J0893
1511H494j2135m187J4530l077j2704R701P854j3688L0J3727p574q877J2304K141
1525F539j3596N199J0891j1031n368J4316k646j2941Q732Q036j2668j169J2901
1538G195o664r008J1736K854j3839M788J1647j0854o241J3928p88j2638P521Q412
1552H049j1676j435J3098o408r716J1715L862j4066L271J2137r358p243J2692
1565D922l1j2275O730P958j1626j662J3057n655j0624J1521M833j3598K026J2091
$$ y = [-893, -9039, 5153, 5349, -8794, -1547, 8485, -4370, -7432, 7180, 2496, -9476, 1873, 7969, -6329, -4564, 9204, -172, -8530, 5294, 6579, -7757, -1173, 9578, -2876, -6864, 7799, 3714, -8969, 1700, 8816, -6083, -5425, 8528, 268, -8933, 3967, 5495, -8071, -2399, 8494, -3641, -7828, 6702, 3625, -9079, 622, 8476, -5212, -5182, 8545, 971, -7906, 4398, 6539, -7057, -1858, 9033, -1998, -7366, 6950, 4304, -8637, 95, 8131, -4537, -5706, 7195, 531, -8477, 3259, 6113, -7726, -2938, 8709, -2145, -8386, 5542, 4754, -7884, -363, 8049, -3627, -5062, 8036, 1628, -8088, 3627, 7489, -6577, -3306, 8831, -527, -7770, 4922, 4891, -7384, -654, 7304, -4322, -5984, 7073, 1418, -9206, 2315, 7148, -6450, -4424, 7667]
1579G667q129p078J1650N01j1568O829Q113j1771k086J3512m317j1452R753O227
1593G851j2590O78J1244p234o848J1131K55j2160O447R269j1642l791J3476k731
1607C355j1414Q182O252j0567L15J0520p037o729J1688P54j2351N424J0647j0620
1621a581m858J1826j341j0129O774N752j0578M27J0834p120p886J1490K338j2978
1635g030L452J0753q347n612J0702j101r332P131N437j0902N26J1744o133r237
1649g949J0607M195j1762J920R529p015m613R478j160r679P115O577j1149j415
1663e321J2029m542r398Q134M543j0182J260Q687o660m464J0453j162j0700O716
1677f07Q018r994l530J1550k419q811O626M733r324J507Q812p158n534J0936L84
$$ y = [7667, -462, -7540, 4110, 4611, -6957, -128, 7985, -3786, -5872, 7640, 3323, -8129, 1624, 7851, -4739, -4061, 7183, -51, -6899, 4232, 4487, -7673, -1226, 8043, -3599, -7390, 6086, 3355, -8059, 123, 6375, -4192, -3877, 6643, -394, -7123, 4565, 5319, -7032, -1608, 9039, -1581, -6439, 5387, 4046, -6083, 691, 6443, -4135, -3708, 7126, 6, -7880, 3610, 5948, -7030, -3578, 7175, -1172, -6784, 3918, 2817, -6515, 616, 6053, -4849, -4323, 7421, 1288, -7949, 2658, 6853, -4909, -2989, 6540, -475, -5088, 4390, 3230, -6449, 666, 7243, -3906, -5321, 6708, 2166, -7232, 902, 5445, -4737, -3477, 5210, -1450, -5914, 4539, 3377, -7323, -607, 7411, -2583, -6113, 5437, 3018, -5793, 833, 5566, -3758, -2251, 6561, -597, -6131, 4805, 5189]
1692E189j1885M883R222q917m321R798j405q356O561M176j0085J640J0199o986
1706b87p457J0910K158j0880K984Q864p481l601R356j956q474P696M748j1121
1720d541N75J1336n833q574R257L291j0038K195Q165p795l182R769k550r211P634
1735D98O206j1060q47J0970m018q219Q022L045r349K996P734p738l295J0328j538
1750C735j0154O364P216r541k198R776l446p211P529K275r155K871Q011p676m685
1765f289J0367n16r991N008P125q105k170Q946l174o798P657K993r874K404Q977
1780F560o867n301R114R44r072L935O350p653j820Q660l354p261P100L887r592
1795d370R29Q814n292n982Q063J544q615L474O323p099k340R014k405p815O670
$$ y = [5189, -6696, -1813, 7409, -1508, -5829, 3969, 2564, -5792, 769, 4945, -5140, -3500, 6699, -287, -7744, 3166, 5324, -5556, -2572, 6292, -1189, -4790, 4566, 2610, -5864, 1832, 6580, -4541, -3966, 7370, 1537, -7037, 2220, 5511, -4527, -2332, 5833, -1962, -5144, 4625, 2075, -7136, 498, 6704, -4356, -5203, 5767, 1749, -6470, 1552, 4597, -4752, -1756, 5978, -1760, -5055, 5273, 3735, -6419, -55, 7161, -2380, -4578, 5198, 1752, -5459, 2070, 4345, -4810, -1939, 6072, -1604, -6289, 4078, 3562, -6429, -1421, 5704, -2401, -4571, 4375, 1201, -5597, 2060, 5053, -4821, -2417, 6560, -307, -5608, 3506, 4450, -4622, -687, 5663, -1990, -3810, 4850, 1496, -5765, 1335, 5222, -4370, -3441, 5373, 81, -5901, 2162, 3706, -4909, -1435, 4888, -2211, -4551, 4463, 2058, -5757, 913]
1810I13M547q727J2Q583m473n935P518J951q681L119O992p048l592Q940j310q350
1826e541N475N068p910r14Q333l911o077P281J888q294K627P325o662l589Q888
1841C987q24q272M969N707p714j238Q578l487o696O906K631q364J940P499o232
1856f10m406Q331j34q550M443N984p692j518Q318l290o391O847K920q570J775
1871b543P799n639m526P955N38q102L967N902p305j442P842k377o900O130L628
1886D927q542J075P867n642m802P403J078p978L397N862o710j895P613k390o373
1901e110N934L300p623O27P610m409m934P180J040p298L085N654o227k379P689
1916D139k160o695N245M072p563L3P103l734n055O468J170o921K761N322n864
$$ y = [913, 5460, -3267, -3255, 5328, 855, -5080, 2438, 4389, -4292, -1173, 5819, -1229, -4821, 4119, 2809, -5541, -66, 5002, -2908, -3822, 4511, 600, -5477, 1804, 3692, -4602, -1975, 5350, -1312, -4901, 3987, 3163, -5109, -140, 5567, -2147, -3385, 5193, 1706, -4990, 1916, 4547, -3817, -1877, 5622, -610, -5016, 3315, 3181, -5369, -926, 5058, -2634, -4152, 4166, 876, -5515, 1332, 4252, -4318, -2543, 5256, -383, -4909, 3046, 3584, -4518, -551, 5351, -1954, -3396, 4446, 2069, -4831, 1299, 4927, -3615, -2540, 5327, -315, -5117, 2286, 3364, -4614, -1217, 4645, -2065, -3960, 3653, 1263, -5110, 824, 4124, -3499, -2872, 4738, 329, -4605, 2575, 3615, -3683, -598, 5056, -1171, -3550, 4139, 1979, -4716, 529, 4601, -2962, -2929, 4174, 440, -4615, 1853, 3023, -3898, -1137, 4185, -1679]
1931a679k690P824j501o754M703M744o803q33P130l251m755O085J457o980K067
1946a236O110n442l302P119m28o991L975M439o529n72O474k949m983N705K113
1961C503p467J641O534m932l701P000N8o400L548M269o037q59O586k435n410N490
1977A388K799p207J164O379m305m114O447J75o356L168M374o016j509P081k429
1992A039n952N613L068p059O97O610m117l733N887N51o309L406M512n598k022
2007c407P145j731n863M648L398o251k12O259l535m117N761Q44o665K922M781
2022C977n624k088O519j231n706M017L698n936k20O195l265m008N444J263o248
2037c213K075N679n340k704O615n53o004L795L494n645o99O082l019m502N622
$$ y = [-1679, -4369, 3455, 1954, -4800, -97, 4647, -2156, -2989, 4141, 890, -3865, 2220, 3677, -3303, -1236, 4874, -568, -3870, 3249, 2821, -4170, -195, 4244, -2285, -2857, 3617, 668, -4315, 1390, 3503, -3964, -2323, 4211, -721, -4422, 2578, 2636, -3764, -216, 4053, -1984, -2843, 3743, 1308, -4102, 1388, 4187, -3020, -1856, 4523, 218, -3896, 2551, 2726, -3630, -462, 3912, -2104, -3613, 3468, 1039, -4913, 700, 3768, -3291, -2594, 4016, -101, -3834, 2053, 2604, -3705, -299, 4213, -1385, -3407, 3738, 2007, -3856, 792, 4190, -2061, -2273, 3986, 451, -3666, 2095, 2939, -3726, -804, 3977, -1647, -3735, 2784, 1553, -4153, -136, 3562, -2374, -2594, 3601, 336, -3672, 1772, 3035, -3213, -1138, 4541, -799, -3503, 3112, 2559, -3445, 350, 3844, -1801, -2500, 3582, 563, -3939, 1683]
2052A683J134o367J831N724m828l297O197K47o105L334L870n251p28N822k827
2067D39m211N082K066o064J107N707l825l582N645j4n317L058L586n669o65O176
2083C519k380n354N129K517o220O61N120l206l289N231J37n479L174L873n366
2098a933j145O245j650n380M452L074n317k50M911k792k899N105l28n375K984
2113b98M203m995k405O325j004n287L328K768m537K28M473l400k953N262O55n719
2129c356J990N014m141k548N143j10m659L015K629m883O48M637k917l844N071
2144A689J435n855J066M826l266k391L727j16m257L406K577n468K22N783k767
2159F11m348M124K667n221N59M178k739j977M297p64m280L340L161m967j275N576
$$ y = [1683, 2817, -3550, -1719, 4005, -823, -4120, 2077, 2324, -3781, -447, 3423, -1828, -2556, 3266, 439, -3772, 1310, 3376, -2688, -1581, 4126, 301, -3281, 2364, 2350, -2967, 91, 3677, -1992, -2657, 3519, 1139, -4215, 914, 3431, -2789, -2128, 2992, -214, -3503, 1728, 1865, -3614, -440, 3433, -1933, -3078, 3167, 1517, -3863, 589, 3663, -1654, -1904, 3007, 215, -2684, 2421, 2093, -3282, -298, 3905, -1090, -3495, 2830, 1826, -3461, -133, 2635, -1902, -1674, 2799, -601, -3554, 1708, 2363, -3356, -1366, 3648, -493, -3041, 2102, 1992, -2667, 348, 2977, -1906, -1258, 3379, 462, -3382, 1689, 3124, -2731, -1665, 3161, -105, -2496, 1231, 1115, -3142, 264, 2841, -2627, -2405, 3378, 611, -3737, 387, 3054, -2167, -1608, 2570, -169, -2146, 2151, 1387, -2893, 447, 3608, -1359, -2634, 2942]
2175B942j583m431L320K397m187K61L731l423j877M993m38n518L051M106m596
2190a252k098N182n44l962K991J543l652P43M438l712k526M766P71n350J413M754
2206C505l877j898M066m82l719L199J448m577P35M664l132l697M723J519n027
2221b550J091L774k836j756M019j191l342L249K393m894K8N449k335l926L536
2236G09J903m125P25L256l090j252M418j485m103L326K735m723n18M334j316l766
2252b972L321J129l536J459K773l093j681M597l81m536K612L510l767j405M232
2267B262j246k969L153P96l847R21L779l050k560M343L77m354J559K999k903j279
2283b019L619j058l104L171J411m259N90M124k302k951L989Q06l712J221K737
$$ y = [2942, 1359, -3072, 248, 2645, -1542, -1281, 2450, -973, -2850, 2143, 1705, -3813, -762, 3344, -1252, -3350, 1832, 1288, -2674, 317, 1860, -1792, -1049, 3389, -323, -2849, 1917, 2688, -2662, -1249, 3505, -372, -2270, 1796, 1314, -2405, 794, 2242, -2335, -1600, 3064, -68, -3765, 958, 2477, -2550, -1459, 2315, -521, -2277, 1742, 551, -2791, 458, 2851, -2043, -2015, 3434, 1099, -2827, 709, 2612, -1513, -788, 2468, -622, -1874, 2544, 1059, -3044, 282, 3017, -1706, -2224, 2110, 794, -2972, 349, 1478, -2058, -599, 2174, -919, -2600, 1997, 1616, -2920, -308, 3202, -565, -1970, 2262, 1016, -1953, 1200, 1996, -1851, -930, 2849, -201, -2761, 1582, 1959, -2395, -836, 2163, -740, -2019, 1600, 542, -2562, 609, 2020, -2239, -1649, 2475, 173, -2778, 1211, 2017, -1695, -474, 2263]
2298B263k885q99L390q21l417L254J646m218J58M064j899l137L284R50l785J428
2314f24K746l418q76L774o06l824K788K854m120o05L868j306k676L115O28l422
2330a704J097L544l519j518L857k26l881K161K776l477p49L263j195k435K888
2345H82O92l712J127L336l082j753L867J18m140K430K554l264o57L735j630k482
2361a979K913J345l803O98L270k339k142L241N26l750J733K547l274o98L496j324
2377D60k872K913J237l646P11L421k420k161L401L41l275J561K459k771r98L355
2393A716o44l058K722J418l596K91L463j980k332L246L85l229J161K350k532j071
2409a690L347r73k949K251K064l662l0L599j865k092K750P84k931Q48K599k677
$$ y = [2263, -622, -1521, 1869, 1048, -2369, 885, 2531, -1687, -1529, 2535, 636, -2501, 783, 1733, -2052, -624, 2122, -1296, -2172, 1602, 996, -2828, -40, 2814, -1306, -1911, 1957, 651, -2025, 1090, 1718, -1704, -607, 2937, -582, -2100, 1757, 1531, -2350, -189, 2587, -890, -1639, 1624, 429, -2006, 882, 1574, -2138, -1011, 2325, -757, -2510, 1357, 1475, -2665, -235, 2319, -945, -1602, 2133, 503, -1979, 934, 2279, -1524, -826, 2444, 105, -2037, 1204, 1730, -2020, -287, 2260, -1014, -1712, 1784, 460, -2412, 501, 1738, -1908, -1197, 2224, -196, -2357, 1044, 1385, -1890, -329, 2130, -641, -1639, 1716, 1072, -1986, 736, 2154, -1442, -1151, 2312, 332, -2000, 1246, 1631, -1598, -437, 1913, -619, -1690, 1657, 684, -2265, -14, 2050, -1612, -1642, 1957, 92, -2000, 750, 1534, -1397, -549, 2050, -627]
2425f27q46L322n12l231K085K049l013k53K946j252k611K832N61l115J002K868
2441B205k614j312K915j21l187J727K061k517q67K996j121k083K466J115l198
2456a535R16K932k357j761L097R4k931J559J927k767k10K919j323k290K390J169
2472A829l507O18K802j924j740K629O6k543J340K348l032m12L190j152k376K144
2488B80J576l140K46K908j585j965K582L34k686J655J758k582p88K875p07k688
2504a927J945J570k706l30K991j281k201K769J12k744J201K568k442j156K897
2519A266l06k502J854J564k643q4K442j287j995K786L17k793Q69K320k027j340
2535a559K600Q0k646J563J427k716MK839j379k221K718N19k951R58K459k049j249
$$ y = [-627, -1473, 1849, 1337, -1894, 191, 2240, -773, -1026, 1920, 668, -1943, 889, 1450, -1665, -663, 2205, -409, -1721, 1194, 1073, -2114, -387, 1674, -843, -1710, 1286, 165, -1918, 548, 1663, -1535, -619, 2313, -44, -1805, 1292, 1386, -1545, 14, 1941, -826, -1036, 1883, 560, -1730, 660, 1829, -1678, -1060, 1742, -182, -1922, 707, 773, -1770, -430, 1918, -1114, -1526, 1664, 512, -1864, 280, 1856, -1284, -1038, 1870, 285, -1680, 902, 1236, -1450, 205, 1963, -619, -1407, 1468, 761, -1927, 18, 1588, -1118, -1448, 1543, 262, -1939, 830, 942, -1802, -601, 1967, -475, -1631, 1266, 960, -1542, 312, 1876, -767, -851, 1591, 304, -1691, 1095, 1412, -1381, -512, 1808, -219, -1559, 1041, 1121, -1525, 38, 1465, -1251, -1247, 1592, 213, -2008, 710, 1229, -1722, -764, 1695, -354, -1603]
2552a603K693j59k236J519J730k232m94K452r65k172J834J243k626K26K285j580
2568h5j399K382k02k141J005K000k615m33K613m39k567K164J223k504j56K723
2584A569j360j372K085L14k570J144J922k155o17K472n35k449J883J059k345l10
2600a265K702j492j539K266K51k444J086J691j607j320K515j2k437J657J469k278
2616g57j7K132q65j941K290M68k585R88K044j771j054K128j66j998R52J368k169
2633i53L1K249j395j606K182O79k555O24K083j545j257K346l69j814J307J381
2649A388k364J34K403j276j919K234Q86k108J78J881j416j221J980j0k150J118
2665b62J478j874p01K392p87j999J890P93k032J36K048j537q71J926R1k009J053
$$ y = [-1603, 1090, 931, -1305, 214, 1944, -288, -782, 1670, 705, -1467, 367, 1610, -1016, -790, 1495, -85, -1484, 898, 696, -1445, -440, 1560, -1055, -1488, 1125, 686, -1881, 283, 1506, -998, -1154, 1569, 209, -1163, 922, 1236, -1334, -190, 1732, -423, -1040, 1432, 897, -1552, 331, 1390, -955, -1265, 1437, -55, -1594, 672, 923, -1521, -435, 1256, -351, -1671, 844, 832, -1605, 52, 1521, -757, -774, 1358, 493, -1448, 842, 1310, -1275, -287, 1757, -14, -1068, 1060, 894, -1104, -152, 1216, -953, -922, 1327, -68, -1674, 508, 1187, -1368, -744, 1339, -206, -1463, 883, 514, -1300, 7, 1388, -976, -842, 1561, 285, -1634, 600, 1486, -622, -444, 1437, 21, -1200, 780, 770, -1380, -262, 1216, -658, -1359, 1033, 246, -1753, 137, 930, -1102, -966, 1082, -455, -1326, 600, 691, -1318, -265]
2682b65J809k136o48K647p17j786J241J165j875J88J593j102j304K166K9k327
2698a322P86K020j880j107J990K29k013J250Q56j792M04J803j293j330K351K67
2714A219k363Q06J478j124p77J511j19j506J298Q33k060J76K333j362j866K033
2730E10N77k037L69J371j170p33J848m35j749J468J394k211k24K206o33j721J656
2747D86N56j756M92J328j404n67J959m23j981J463R46j602m05J817m53j499J016
2764b7P22j623N69J372j312r99J999j70j648P44J445j261p41J626k79j546J514
2781C85P28j906N08J367o20j611K032J23j841O51J325j389n93J718p98j178J277
2798A78P51j934J30J717r93j064J646L56j939P33J591j326q16J863m40j277J181
$$ y = [-265, 1544, -592, -1240, 1407, 690, -1096, 145, 1310, -565, -377, 1216, 114, -1190, 976, 1005, -1322, -536, 1484, -396, -1503, 487, 716, -1297, -47, 809, -983, -579, 1224, -69, -1399, 952, 1219, -1144, -338, 1140, 16, -761, 750, 631, -875, 423, 1256, -804, -628, 1705, 343, -1523, 510, 1087, -950, -581, 790, -380, -1113, 735, 300, -1449, 19, 1413, -798, -1022, 1184, 551, -1170, 486, 1042, -714, -222, 1106, -298, -865, 1094, 671, -1310, 153, 1099, -503, -908, 909, 456, -1043, -27, 695, -928, -359, 1013, -299, -1298, 701, 531, -1117, -373, 1072, -189, -930, 696, 417, -1129, 385, 1113, -793, -285, 1082, 462, -1149, 883, 1006, -835, -184, 1141, -248, -841, 877, 79, -1099, 178, 929, -1005, -875, 842, -151, -1215, 431, 787, -1152, -419, 1172, -154, -970, 893, 453, -824, 357]
2815C57O16j353j33J802q49j181J210M10j695M75J273j082p55J693n65j361J180
2832D2R76j561m08J651o53j205J565J66j437P93J155j303o15J495j6j381O49J135
2850A048j153o56J663m64j393J289N64j682N48J274j065q16J090L77j723Q61R50
2867G12j267k21J307m09j224J445M92j492K60J510j139p52J539L2j383N36J160
2884A106j575J72J124n54j267J290M36j560K60J441j055p57J183L09j200L76R47
2901F76r24n58J233j61r92R84O21j228k00J721j045p57J079K87j530O64J019j298
2919d09l19J706o28j345J160N95j347j17J501q46r69J245N32j658P39J018j415
2936e57l95J514m0j600J146R36j504q0J384m50j262J423R3j527O96J298j172n86
$$ y = [357, 973, -380, -513, 1289, 440, -741, 469, 879, -816, -341, 932, -150, -905, 788, 223, -1138, 42, 1018, -543, -951, 700, 47, -1158, 407, 573, -864, -71, 1084, -219, -834, 661, 645, -736, -87, 1048, -105, -761, 902, 438, -955, 334, 898, -784, -236, 1038, -27, -843, 247, 624, -1099, -238, 712, -555, -776, 531, 122, -1102, 343, 835, -657, -397, 1113, -26, -778, 761, 793, -590, -54, 1106, -469, -297, 827, 273, -994, 296, 732, -828, -568, 873, -182, -939, 244, 553, -647, -271, 676, -248, -806, 427, 266, -726, 258, 879, -349, -549, 1172, 127, -630, 449, 736, -794, -130, 889, -409, -728, 978, 350, -995, 165, 760, -587, -704, 797, -49, -1018, 227, 759, -899, -160, 858, -557, -952, 562, 522, -1078, 68, 1004, -500, -580, 804, 354, -908, 515, 608, -919, -223, 1075, -97, -683]
2954f83J253J92j507L68J159j088j77J115o04r19J249L01j661O95J060n57j159
2971i63J408O3r02M56R08j235k62J590q39j141J325L29j098J01J054q97n23J216
2989E90k96j176P64P17j101l52J320k1j667J169O32j240J40Q65k84r28J403R5
3007F30j233L78R85q10o29J317R9j609J104N16j151R3J077p90o01J162Q2j632
3025a012Q61Q34j068k68R61j40q44N48O27r43j30J341p42p37J273K58j198R3J065
3044G79r35m48J306jj217Q48L51j082m8J322o45q23N95N33j411O02Q48p56p82
3063i64J586j38j111N54Q12j091k43J338n80q66R36O04j405M73Q02o81l19R26
3081F33k68r66M79Q49j265J18R27l47r13P90M96j213J65J240q77n37J086J24r58
$$ y = [-683, 570, 762, -745, -377, 782, -306, -483, 632, 28, -891, 358, 659, -1002, -307, 753, 196, -963, 445, 508, -394, 62, 970, -265, -527, 1063, 224, -917, 408, 737, -361, -260, 794, -103, -626, 590, 294, -882, -118, 599, -502, -854, 466, 445, -1222, -53, 579, -661, -521, 344, 60, -868, 535, 630, -603, -225, 760, -50, -679, 638, 737, -872, 232, 748, -403, -310, 767, -23, -624, 538, 620, -1012, -151, 683, -385, -653, 308, 168, -676, -128, 499, -444, -574, 767, 25, -712, 561, 819, -379, -286, 779, -156, -604, 702, 701, -516, 332, 683, -399, -447, 875, 230, -593, 2, 535, -876, -274, 574, -182, -964, 622, 484, -627, -73, 739, -352, -595, 743, 163, -703, 233, 837, -568, -95, 707, 26, -293, 633, 365, -601, -122, 727, -538, -420, 507, 160, -753, 37, 533, -680, -515, 725, -152, -689, 397, 521, -437]
3100d37L2R52r00l17R74J10r94Q09O66j100m3Q23m42p58J117K86j175K43M59n10
3120b05m71J222k18r65N56N17j063J9Q95k07p43Q15K23q51J13J159j009j03Q29
3139E13l01o25P83M98j183j76R15l81o28P83J77j045N15Q09o59o37J122m76n21
3158e17K86Q02j069pJ231p06n80O52N13j260M64P63m44n17P51k3p74O56M84r81
3178b76j82J107j93r75P23J32r98K20P52n08n56J009j58q56O22M98n79k05P69
3197C46m2j006J072L88j018n7J027o51p44R88K71j013M40Q30r29m47J111k60j019
3216g13Q26M09p97n5Q67o05q04Q96J78q03M42N37m17l69Q73r2r87Q28J81m75k74
3237c54J059n07q84J067K99j186M23P69j090K8O25J77p85M52N98j244K13Q07l88
$$ y = [-437, -405, 547, -353, -670, 304, 414, -580, 229, 895, -205, -248, 575, 133, -625, 492, 778, -397, -154, 305, -205, -676, 546, 328, -637, -81, 436, -627, -608, 287, 80, -663, 152, 375, -476, -363, 796, -213, -316, 513, 212, -413, 370, 868, -315, -491, 424, 43, -585, 198, 375, -670, -155, 654, -5, -642, 480, 4, -517, -231, 571, -498, -505, 726, 20, -560, 92, 605, -655, -191, 572, 128, -389, 362, 339, -435, 221, 705, -276, -458, 649, 456, -519, 204, 336, -662, -442, 310, -198, -754, 255, 97, -759, -137, 361, -218, -423, 346, 304, -702, 370, 758, -260, -317, 710, 59, -685, 303, 574, -439, 1, 831, -98, -545, 566, 306, -713, 113, 522, -275, -330, 537, -68, -872, 24, 202, -601, -159, 378, -39, -408, 465, 373, -614, 214, 395, -80, -354, 705, 198, -686, 381, 680, -506, -83, 686, -404, -376, 249, 426, -359, 93, 691, -553, -340, 467, 79]
3256G9p10M57M19n33k6P68n07j82P64m86o01Q30M70q51n7O87l62l99L82M07j013
3277d64N08L09l10l20O67R9j143M12M97p51r4Q25l33m39M51N42q58L60N66m49
3297G5l63N17J59o23L03L85o36l17Q24p1o26O17K01p07J91M29j24j030P42M13
3317C59q41M69M46o83j10O42j36o05M58K34n28K38N42l45l33M62Q0p46M72L42
3337D17k84l86P03p9q93N33L52q41L5P45l44o33Q27M7q22L57N58k95m90N21J49
3358A77m98K67N15n07k74P29l26n00N99K73q00L32N07o13l70P31K7o86L72N01
3378D56q89J49P32l30o92N56L29p94J31O11l26l87P16p6l98j71P95o60j66O88
3398B74k26n58N96L25o30R8M56m81j50N46j63m44L41J88l68k52P35l26m06M88
$$ y = [79, -631, -174, 245, -288, -314, 454, -53, -235, 529, 43, -558, 272, 742, -109, -166, 521, 159, -240, 142, 549, -464, 44, 353, 43, -277, 390, 489, -654, -242, 255, -496, -590, 235, -98, -537, -86, 456, -402, -42, 524, 75, -288, 229, 388, -235, 68, 453, -183, -500, 324, 253, -373, 244, 445, -262, -71, 358, 234, -796, -54, 359, -482, -13, 433, -250, -360, 282, 146, -459, -1, 233, -295, -57, 485, 140, -193, 269, 349, -397, 75, 417, 133, -253, 450, 371, -522, 11, 363, -478, -443, 302, -42, -675, 152, 199, -623, -266, 292, -3, -493, 28, 177, -321, -54, 461, -46, -320, 409, 83, -417, 182, 455, -345, -13, 494, -119, -489, 242, 269, -417, -45, 456, -433, -284, 448, 118, -574, -18, 311, -483, -352, 259, -67, -454, 262, 186, -212, -383, 412, -248, -414, 274, 48, -510, 86, 411, -219, -121, 335, -146, -296, 250, 87, -357, -16, 172, -196, -448, 287, -39, -445, 43]
3418D3J18q19K95O59m92l35R28j07p53M95M24m42k02O05k66n13O81m7o09K56O84
3439F03o23k57M04J03o89K24N11l12n9M70k19p37M28M92n77j39R01k53l99M10
3459B82pn43O5L95j35m30Q26k28k47r3N71p08j18P49m80k70L23J11m27Q4O63p63
3481c80k13Q44p3o93O83Q4m92O9N72k19m94M35J58l26%L37p4k61M66l08m58N23
3503A80M1l49p6M62Oo35M46j47k40m4N39m03j09N73J86p27J92N61o51q4M24J06
3525B51n74O09J40l61n4N40j43p51O78q8p81L14O92o49k5L12r9l15J37L96o24
3546c95N5N66M8r07Q18M0m26L42J81n7n43L37q2l57K97N31q63K84O47k44o32N77
3568B17N5n91J20N07k14l80L26%k64J09J94m06j1N25k71m17O32M6j61k67P40m28
$$ y = [43, 161, -658, -363, 296, -196, -531, 397, 290, -463, 32, 456, 14, -188, 417, 151, -362, 319, 272, -337, -81, 603, -20, -277, 127, 230, -459, -235, 276, -36, -95, 375, 156, -581, -153, 339, -238, -377, 524, 271, -128, 282, 275, -268, -203, 192, 57, -373, 453, 225, -22, -115, 456, -252, -370, 379, -101, -371, -48, 63, -364, -280, 383, -380, -593, 251, 178, -515, 168, 252, -240, -171, 401, 182, -312, 123, 281, -45, -45, 292, 218, -43, 423, 115, -343, 180, 221, -128, -204, 258, 264, -371, 75, -72, -312, -356, 183, -220, -329, 244, 430, -297, -105, 456, -195, -279, 145, 251, -323, 286, 426, 65, 11, 551, 408, -343, 335, 247, -534, -220, 472, -177, -202, 110, 11, -304, -167, 229, -395, -340, 226, 274, -633, 185, 225, -201, 141, 322, 265, -278, 59, -23, -380, -83, 448, -415, -131, 516, 272, -360, 217, 272, -319, -199, 308, 94, -286, 40, 40, -224, -115, 79, -327, -338, 187, -84, -501, 131, 177, 16, -251, 489, 61]
3590F1l72O15J85p39L99M63p66LM20r5n38K77L02l33J58K75n06k6N10n7o71K50
3612a85M23m96LM93j82l01J59M95n05j8L19n6m60M89M64q62K95L3j11j86O33k77
3634A67l52L80Q7n36j49O12j14m31J04L51m07J62M24m47j54M69j10l32K63L13
3654C00m71J55M09l95k85L95J28l72J49M90m49k82L98j27m92M28M86p00j61M96
3674A00j22k76M41K35q63K73L96p3l89O62l04k08J13J71k71q4N26k24l54L76J96
3695C21m58N7L69j82k41K27pj82K59j48k41K1K18m9k98M98J09m70l8O79n90J06
3717d0L28n1l53O5O61o55o6K58k8m64M49K54n97J63J94j39r2J01r6k84O1N86m77
3740b22k8L25q6l19N13K23o51K00J45P9m40L67J88m29q1L23J0N0K38m56j59K88
$$ y = [61, -311, 304, 489, -250, 149, 612, -154, -151, 269, 174, -364, -87, 215, -118, 40, 315, -191, -217, 293, 236, -435, -185, 238, -258, -255, 238, 56, -245, -86, 409, -96, -114, 205, 149, -311, 178, 642, -220, 75, 108, -3, -189, 444, 167, -185, 195, 282, -254, -403, 209, 95, -336, -232, 119, -288, -126, 298, -149, -303, 166, 56, -276, -13, 300, -171, -16, 393, -2, -287, 108, 236, -136, 13, 503, 54, -228, 170, 43, -449, -21, 465, -235, -396, 100, -22, -298, 143, 378, -485, -212, 184, 111, -278, 384, 80, -128, -15, 156, -115, -199, 327, 103, -251, 125, 321, -137, -80, 289, 107, -134, 93, 86, -96, 163, 15, -226, -205, 13, -36, -334, 164, 273, -197, -235, 444, -146, -40, 288, 237, -116, -51, 610, -45, -111, 147, 119, -345, 104, 358, -239, -76, 118, -21, -113, -12, -108, -392, -331, 255, -222, -250, 75, -11, -330, 183, 406, -245, -45, 100, 179, -261, 106, 294, -135, -216, 107, 117, 167, 405, -51, -210, 78]
3762G8L09k93m27O15j27n88N21J79m21M3M31m62j03M07j97k77M11K59n18R8K11
3783A49j67j50jN69o91L92J22m85P0N12l76K8K46O7m62j76M59N6l28J38J47m77
3805c58J97J98j52l01O59k49m24M38Q7p9j76K62J50k07o5K5j20J1M78m96J55P5
3827A08n1m72L55P5j43k09L56k7k53L13K40l22n17P88k05l14K66J93k19r4L77
3848B45m70Q2N53n15l6K83J88j79k16L76j75l92L02K60n97J57K43J92m99L56j09
3869D9k31K32P2l13q4K33J33k61K69L77n36l4N18l10l66L86k8l80K86J94k86k87
3891c67O05k26k06L25Qm19j13P29l86k60L14J48n74J88K33j75J34m3K49l96K49
3912A7r7j5k75M86p8j88L15Q1k91j41K84l77M19K09l24K7J04j5l40m1N18j39n56
$$ y = [78, 387, 94, -333, 282, 155, -433, 88, 267, -154, -111, 320, -142, -245, 162, -35, -312, 99, 358, -160, -62, 149, -18, -168, -169, 400, -291, 101, 223, -262, -192, 320, -56, -28, 218, 285, -177, -353, 106, 162, -166, -28, 119, -358, -161, 37, -115, -416, 243, -6, -430, 8, 95, 16, -160, 102, 252, 45, -20, 5, -115, -104, 374, -122, 33, 108, 57, -415, -60, 15, -128, -337, 19, -8, -261, 52, 292, -30, -547, 241, 36, -278, -12, 181, -38, -132, 245, -225, -143, 410, -105, -141, 142, 330, 151, -65, 311, 136, -256, 46, 306, -291, -134, 109, 301, -198, 158, 49, -182, 50, 122, -191, -275, -42, 91, -170, 99, 476, -60, -94, 424, 114, -252, 134, 106, -274, 12, 206, -80, -367, 238, 12, -194, 131, 139, -280, -393, 336, -50, -310, 4, 152, -422, -234, -1, -176, -42, -85, 164, -232, 17, -80, -95, -370, 116, 38, -150, 165, 246, -45, -186, 98, -279, 140, 349, 25, 52, 156, 141, -199, -240, 278, 139, -417]
3935d17L56J59l35K82K10j88k06L39Q2o83M14J39k59J14L80k20j22L9j31J67J48
3956B68j00j43k6J44q7l43K72J52l49J68r4L48l88j30L77k97L54J47l47j57M02
3977A71r7p2R1J93j18l93J68J27j97L71k68j03%M3K00l24J48J79j85NJ6K81m15
4000a79J93m7k89L72K04m66L24J6q7rL17r2k33N6N6J6j39j00j3J30k28L33o1m1
4024C3j00k7J32R5l8j73K10j60ok5J49K18n04J05J73k22m5N11l15m99P52k54j12
4047a02M40j63k61J90K23k95j67J47P2k78J05K33j48l2J58k3l58J24J93mk3r6
4069f5K50l35K54K04k48k95N46k06p8n4P3k08K79K75o32L16j68J98l88J77J22
4090A7J71q7L6j94l7l8J78j25j8L88l20l1K79l31j6Q3J41m41J67K53l04J56K6
$$ y = [-417, -61, 98, -237, 45, 255, 67, -139, 200, 282, -401, 13, 152, -107, 7, 387, 167, 45, 84, -47, 120, 268, 168, 25, -1, 143, 56, -287, -15, 137, -212, -44, -138, 210, -178, -308, 69, -228, 126, 273, -74, -231, 171, 74, 2, 93, 286, 168, -225, -57, 70, -127, 244, -24, -127, -127, -84, 116, -208, -60, 119, -66, -61, -45, 236, -179, 14, -33, -322, 50, 254, -212, 112, 128, 41, 32, 349, 257, 24, 80, 136, 152, 13, -87, -100, 30, -198, 135, 74, 33, -67, -94, 38, 133, 95, -78, 132, -28, -34, -59, 90, 308, -196, -91, 82, -140, -185, 326, 11, -488, 264, 10, -102, 338, 175, -86, 104, 327, 32, -135, 12, 84, -194, -89, 144, -4, -36, 122, 99, -259, -135, 58, 54, 31, -65, 185, -150, 104, 308, 60, -235, 311, 105, 27, -27, 46, -162, 117, 392, -240, 76, -92, 106, -282, -105, 17, 188, 101, 137, -57, -94, -132, 46, -79, -97, 291, -29, -60, 219, -112, -128, -45, 96, -345, -178, 75, -229, -73, -47]
4113d7M7j36j00M85k74j1M16m69m6m8L60m86L2O08n19P6R4O0j05r4J78j93j66
4136c38K81J49l53K05K5k09J06M84j62l53J13J26l79N1L62n2l73J85J30j00K10
4157A08P9j98j86L66j46l27K40j68j30K69K11k17k77M88M9m15O6L29k27n5J83
4178D2Q4k55J50M0l27J48K39l8k17K44P3k54J92L9k86K16r0P5j47j14J46j94J27
4201a07K82n9k76Q2K10j94J89L3Jj21K73m5m77L04L00l41k84L29p4k01K85o6n33
4224d90L42K48j62j40K18q5j96K62J43j13RJ19L7k61K4L01k79j34J64k2k24M07
4246A68j74J01k43N51l77n6K56m29K6K66m1l00Q3K94j37k31N58k49qo3K26k94
4268g3j13L76o7k35J06L16m58J89k7j36J53j30J32k35K85Mq6l5K21k16j51P6O24
$$ y = [-47, 0, -136, -236, 249, -25, -36, 380, -89, -135, -183, 177, -309, -277, 331, -188, -112, -18, 42, -63, -157, 21, -172, -338, -57, 92, -261, -56, -31, -240, -134, 350, 188, -165, -52, 74, -305, -254, 108, 56, -317, -132, -2, -102, 108, 187, -11, -197, 169, 23, -304, -64, -232, -362, -93, 118, -99, -376, 112, 161, -254, -188, 141, -86, -141, 42, 126, -129, 21, 61, -266, -118, 121, 83, -134, 110, 183, -71, 121, 160, -126, 90, 0, 75, -72, -186, -40, -234, -107, 175, 116, -160, -78, 132, -62, 127, 160, 161, 40, 313, 268, -209, 95, 395, 54, -230, 99, 25, -176, 109, 43, -490, -148, 100, -62, -202, 16, -69, -265, -3, 140, 27, 36, 155, 192, -69, -45, 256, -23, -157, 7, -15, -239, 168, -6, 95, -148, 403, 26, -30, 226, -203, -177, 89, 48, -252, -169, 125, -12, -243, 315, 66, 58, -5, 221, -73, -186, 190, 123, -112, -6, 310, -148, 41, 14, -122, 31, -99, 33, -202, 83, 87, 1, -34, 187, -29, -180, -104, 520]
4291E20p54K00Q8j24N2L1n7J61n6L3p8R9n5rj13N4K41k14Q0p6J46k31k4M05l99
4316h0o9J58J7m7k51M23p4k78J88j53J83L4j27k06K94N3k28K96N8j27l24N10l1
4339B19m32K65J44k83j67N24l50J43J2K63o13K57J34j84l2K07j54p6M0J75k72
4360a80K72o5j2j64QK70J0o9K72j26m38M45j92j33J25J17l76K68N2k82L3M2J42
4383A9p0p4N3J66k06L9Q1P8mj61K09j78k7K62J08m17L32P9m08J21ro9Q1M31m41
4408ej98J13J87P1j51N6j12K27k04J42o0n3m16R5L96k7l72J35L08m8k63L45p3
4431I3j75J0M6J14k85K39K5l11L32K58l64J82j38l8j42J70L1M1j93P2j56J83j35
4454a41J04J12l61Q6J81K03k09q8L8K66n1k32J72P6k2m93M35Q8k53J81j44o6J11
$$ y = [520, -234, -34, 54, -70, -18, 13, -44, 117, 61, 94, 16, 115, 60, 51, -62, -8, 233, 19, 99, 23, 169, -62, -86, 319, -80, -149, 9, 26, -21, -272, 151, 77, -201, -13, -166, 17, 51, -76, -282, 12, 65, -163, 133, 191, 64, -260, 250, 219, -213, 52, 196, -87, -254, 270, -80, 63, 75, 338, -275, -18, 116, -68, -100, 107, -47, -123, -83, 92, -180, 92, 27, 15, -149, -141, 129, 139, 70, 342, 216, -222, 223, 31, -102, 23, 140, -236, 32, 84, -198, -165, -123, 19, -51, -125, -72, 94, -112, -73, 8, 86, 82, -79, 130, -48, -75, 187, 295, -122, 210, 289, -119, 2, -7, -76, 5, 436, -5, -203, -90, 97, 168, 17, 73, -39, 188, -16, 126, 66, 13, -403, -308, 88, 61, -311, -176, 132, 84, -179, 166, 93, -82, -72, -26, 88, -197, 42, 67, -244, 88, 346, -18, 164, 26, -12, -154, 16, 47, 88, -105, -33, -189, -6, -141, -37, 75, -286, -200, -19, 184, -25, -113, -75, 191, 140, -92, 80, 156, 134, -359, 76, 164, -89, 92, -52, -118, -7]
4477gK76o7l02M2K2k92K35m3n7J70j72J81M3O1j24r9j49N31k78K15j68pO3k19
4501a45J89J11j59j5P1m3j83K63k21K16k25K04j12k3K48m33K44K85k60N7o9r9
4523i9%l5K67r5N7j12j18L12k87L16k82J42j31j85K15J2J4m7K76r9j17j24L92
4546B72l49l7N9K04k47J0R4o1J76p7L4k01k1J98j19n4Q2kQ3j78M38k23j93J01
4570a1j7l7L9N1j24Q4M8J3k20M07j54q6q7K20k97J14J74j28j33L5P4j27L08q9
4594E7k88L03ml05J48J45J23l5l10L11J7k81P8o4J9j71L43j94k8l0L9N4j14Q7
4618a00j42L3N00k87j75P4P7l16L18N5l20N62k06K34l15J51K2p0K1j46o1k38M19
4641I0k49J75N3n5R4j92L61l91j68J90O7J86Om8N7k88J29Qj44O9N4R0l73M23k63
$$ y = [-7, 269, 202, -100, -58, -36, -328, -93, -136, -193, -23, -195, -14, 29, 90, -34, -133, -282, 249, -29, 186, 18, 11, 74, -145, 44, 155, -4, -19, 52, 9, -174, 89, -132, 84, -141, 63, -49, -72, 176, -257, -13, 272, 12, 69, 0, -99, -99, -134, 133, 38, 95, -17, -135, 177, -110, 206, -76, 66, -65, -250, -35, -23, -9, -56, 220, 121, 4, -120, 272, -77, -114, -55, 149, -98, -88, 6, -55, 121, 44, 78, -123, -144, 54, -65, -119, -37, -39, 44, -134, 304, 81, -112, -11, -28, -65, -26, 25, -99, -15, 33, 46, -174, 233, 79, -7, -94, 126, -171, -57, 117, -11, -144, -109, -35, -162, 146, 57, -231, 72, 68, -237, -89, 56, 179, 144, -166, 145, 162, -119, -41, -105, -86, -257, 86, -108, -136, -166, -127, -73, -187, -100, -242, -209, 291, 4, -171, -97, -20, -336, -18, 37, -283, 279, 73, 307, -8, 143, 165, 95, 116, -30, -91, -329, 90, -159, 16, 69, 14, 108, -84, 277, -114, -282, -92, -25, 161, 167, 119, 176, -112, 17, 25, -119, -50, 4, 94, -279, 144, -119]
4666a19k2L16j28l49M17L0k13r8J98k74J5J6K63p9j06K62j83o1KK20o3j09o2L17
4690A90k91J66p0k3N2k73N61l07P0p5N0j0o3j04KL23j95j34K81l60M9PJ81J32
4714A59k46K5j35L45j94J93m74M40P3j87J07j72J28J14k88J38k06J83j02q3J61
4735b1j11L19l61R0K81j51k10O7K19j4j37J10r9j59J2L46l11J36j42J99j32K9
4757d0p5J58J12Pj51j44K90l92L42j23J5J47p9Ml7j33K04j10o3l1K33m23K75Q6
4781G2k12R5Q9l1%M0o3j84K51j38J19j56N9L16m23m5J69K24l07j32M06j94L1K3
4805Ik5o4o7K97k09N1J21m4J68k63J9k26L04M2k67J94l2K22l15n2K71j5n7k9O4
4830I7j61J38J24k8k59Q5n7L5J8N6m2p6j8J35r1M0n9o6J51q2Q3J11j58k71K27
$$ y = [-119, -141, 175, 47, -302, 115, 145, -68, -166, 32, -242, -227, -211, 52, -27, -133, 129, -54, -115, -113, 107, 44, -65, -127, 190, -101, 65, -5, -28, 24, -249, 312, 5, 75, 0, 50, 40, -23, -127, -125, 198, 3, -131, 150, -210, -161, -154, 27, 159, -87, -62, -197, 148, -46, 147, -327, 113, 186, -1, 106, -66, 62, 176, -112, 26, -180, 3, -99, -182, -21, -132, 187, -174, -84, 197, 46, -164, -97, 122, 108, -29, 81, -18, -177, -165, 181, -130, 6, -136, 63, -69, -40, -115, 43, 155, 162, 11, -133, 157, -235, 107, -16, -1, 146, 67, 71, 34, -99, 105, -5, -68, -99, 134, -289, -14, 72, -140, -45, 44, 13, 13, 53, -10, -194, 57, -81, 38, -118, -59, 257, -166, -211, -42, 182, -125, -257, 149, -45, -14, 9, -16, -80, -147, 150, -59, -8, 113, 69, 237, -26, -7, -233, 71, 113, -154, 40, 8, 230, -85, -137, 134, 119, 62, 33, 97, -64, 74, 198, 170, -89, -4, -61, -26, -8, 48, 6, -70, -88, 47, -44, -4, -63, -129, 22, -60, 23, 134, -24, -295, -68]
4855f8n9J95N9L9o0n9j39J90J14l0m6m5Nl03J59m4Q7Q0Q3k91P8K00l63L25r0k11
4881a94K02L3P9j83K14q0q4P5J44k12l24L71Q6k18L1J87j83k18L40K5k49K29p9
4904hR4n3R1j36k07L96l00J6L07j60j30n0O9K22j22k49J51J95p9M43m19K6j43
4927d6m7K18m4J15j82nj55N9p8Q3J18J22k45j30J33k9m7NO9J54j6J5K5P3j60l17
4953c12K06R9q1J31K98l29N4mJ6J6n8o6K09n58O31k98k3J21j16O3P0J68l32m5
4977a40L34l3k51J66j83k05K95Q4J21j2l21lJ35M0j38J96j3O3R8m30P6r0M05j45
5001D9k0m8j85R1J14q0r8J05O8O5K55m99J42o2J13Q6k8r7K4L0K1J08m4o6J55p4
5027A25j22J23m04K39J72j29J10k62K28j37L8j99K55n7O1k37M5Q8j4J69p7K5q7
$$ y = [-68, -127, 68, 127, 166, 106, 47, -92, 98, 212, 182, 136, 91, 96, -207, -48, -92, -5, 75, 158, -133, -55, 145, -218, 107, 17, -194, 8, 41, 120, -63, 151, 71, -13, 62, 206, -6, -330, 41, 127, -91, -60, 127, -56, -274, 66, 91, -158, 71, -8, 86, 33, 124, -12, -219, 177, -123, -107, 200, 40, -90, -140, -71, 151, 29, -220, -69, 126, 47, 490, 71, 97, -46, -93, 125, 81, 196, 14, 9, -146, -87, -165, -82, 36, 158, -87, -217, -84, -113, -160, -155, -86, 68, 52, 67, 92, 165, 5, -312, -106, -7, -88, 43, 341, 12, 66, 62, 78, 94, 36, -30, 179, -379, 252, -46, -69, 52, -64, -1, 69, 237, -95, -140, 194, 161, -90, 76, -107, -312, -17, 67, 188, 176, -145, -148, -13, 27, -111, 85, 72, 135, 233, -197, -121, -211, 194, 49, 29, -19, -204, -113, 1, -79, -177, -72, -4, 61, 316, -183, -41, -103, 10, 96, 68, -29, -5, 25, 46, 154, 110, 44, 199, 125, 3, 126, -278, -39, 133, 4, 114, -148, 80, -57, -19, -218, 37, -20, 41, -196, -151, -63, -77, 92, 15, 40, -47]
5050d7k73K18J75k57O3K41j38j64J88Q3j36k21K92n2N2k93K35O4O2j00l2J53l75
5073b62K17J53j4J94m63J19k14L41o5J4R4j4k53J57K45k87O3K0j68J3J38R9jl20
5097a94Q3j45K10J73k00J13OJ91q9j6j90nO0kQ3k48J52K23j70nN1R5k64J19J30
5122A61Oj45r7oN4n8J71k57L40l14J09J34k27K81j81J32k47K77o1m7rK19m45N33
5146C23k73k34K50j16K19r3R9j44o6m9j08K46L9M9l04P7n5P1p5Q3l8j15J69k68
5170c13L3M01o8j59l1OJ82k51N58l20p8o1J79J8j74J89O4m57K27K89l20J4J59
5193H7k8j14p4J31k05K68m3j7J23K3k40J02PJ76ok82J43k36K14r3nj87J67J47
5217E8j31J14j68L50o47M29P3J11p3m31L42J05j58k8K14l54K60J69j71j9J80j36
$$ y = [-47, -320, -102, 73, -184, -121, 120, -18, -182, 6, 89, -47, -268, 24, -28, 24, -269, -34, 30, 92, -8, -40, 113, -262, -45, 108, 94, 288, -175, -56, -270, 71, 6, 20, 114, 100, -153, 4, 249, -38, 25, 45, -123, -110, 28, 127, 126, -194, -111, -256, -46, 127, -73, 40, 46, 237, 148, 132, -58, -63, -3, -5, 78, -170, -18, 205, 35, 30, 81, 176, -88, 31, 161, 167, 22, -75, -81, -27, -85, 86, -171, 169, -145, -36, 98, -129, 152, -29, 103, -144, 133, 72, 25, 16, 235, -210, 323, 50, -184, 66, -50, 169, 76, 175, 31, -35, -84, -192, 54, 93, 142, -162, -85, -140, -69, -144, -61, -99, -214, -45, -313, -280, 121, 53, -106, -137, -131, 51, -200, 358, 38, -40, -101, 78, 96, -78, 111, 175, -282, -55, 234, -86, -72, 87, 59, -55, -129, 2, -203, 65, 22, 5, 128, 151, -89, 13, 20, 196, 190, -92, 51, -185, 29, -64, -69, -256, -89, 58, -73, 41, -127, 223, -424, 5, 78, 189, 116, -315, 27, 132, -26, -54, 160, -194, 66, 235, 64, 45, 225, 89]
5239H9J5J28k34k83L83k65L00k95M13j71j12K4J29n05M26j39N8J18j54K95m13
5260a93J23N0k11K10Q4J9k38L16l81K01M9J47k89K5n2J34j74J33j01K92k49J0
5282i5L3o2l6J75j77K91l01j08J81O1j12P3L61j89k33L08j87K3n1J8q2R6N4r2
5306e1J2J8O1j41M7J43j10j57K40m8J46j93k31K15q1K04m5j72P5J45r3k23J90
5329d9N6j45L87l57NJ96J17k6k73M1J6jn0K01n1l82K85J20k81K61Jj2l32K62j05
5354a16J35k15Q7R8r0J12L46m73o0K08l25L49j92O8J06N8k63p9L83J20l46J37
5376D8J30j9k15q2L1L27j75J75r9k61J23j30K26j51m0J53J7K15k03j3k2j8k04
5399a87L58Ml99J82K00k05J16J16Jj36o7o1L82l15J10o9J08j62O8k07K2L52p0
$$ y = [89, 104, 232, -2, -285, 98, -167, 133, -162, 251, 80, -32, -8, 121, -384, 42, -97, -39, 79, -75, 220, -193, -70, -20, -231, -21, 63, 82, -156, 160, -221, -20, 29, 176, -113, -88, -140, -6, -180, -47, -148, 144, -105, -95, -62, -124, -160, 15, -162, 129, -172, -280, -99, -38, -150, -77, 284, 95, -138, 170, -17, 6, -45, -27, -109, -13, 41, -51, -39, -21, 40, -101, -54, 89, -21, -178, 62, 14, 160, -33, -264, -49, -130, 74, 29, -143, -68, 77, -16, -239, -49, 7, -138, 249, -108, -103, 93, 210, 184, -89, -48, -32, -33, -83, 118, 67, -315, -30, 90, -191, 70, 71, 59, -273, -11, -116, 19, -196, -109, -11, -101, 11, 357, -116, -176, 32, -293, 56, -136, -68, 38, 96, -167, -246, 137, 257, -89, 48, 178, 159, -56, -138, -107, 220, 45, 220, 121, -140, -17, -147, 79, -72, -112, 41, 58, 273, 70, 57, 35, 17, -187, 171, 175, -224, -42, 158, -47, 69, 185, 186, 50, -17, -78, 304, -11, 99, 30, 138, -24, 44, -163, -141, 211, 141]
5422A41k84R0j6K3J17j08M3o6J43k9k48P6L12l62J24k7P7J81j84q3j70J17J81
5445D8N4j54m9m2O4LQ6j46j59K98k24R0j00M97r2j56j24K67j0K0l0k92L30k99
5469a20L36r8j00m1r3O0K42k95N4L3J35J2n3N8p5j73L7Q5K9m2k7P1P8Ll16K06
5495Fo7P6j27J49M2J5r0o6M5O9J21m27K21MK14j21k0j45J24k81L58m1j09r2K18
5520G6p3mj0n8L5r8L15l10P2k45J42q8K70j1P0n7j91K69pL5j71J9p6M7J83j06
5546B8m2K1M5J6k4p0K3j70K55P2k57J46j17j01qJ13K12J44j91k17N6L14q6p9l36
5571b53N78p2m82J05J42j77L33j61p8j7j6j72K4L77j51j51o1j01L58j44m7Q7J68
5594H9j23l3L36L9r2l39K58O1p9l04J24O9k38ML05l22K63oL1j52K89l70J45O5
$$ y = [141, -143, -53, -69, -46, 71, -37, 6, -60, 83, 54, -194, -118, 194, -168, -44, -71, 6, 187, 3, -80, -250, -133, 48, 102, -52, -101, -143, -79, -76, 10, -136, -295, 3, -221, -131, -231, 266, 174, 18, -106, 161, 151, 171, 141, -151, 179, -120, 216, 118, 18, -23, -116, -56, 186, -109, -55, -22, 113, 125, 72, 130, 55, -118, -81, 4, 33, -9, -36, 35, 113, 116, -200, 6, -61, 15, -112, 37, 79, 94, 4, -62, -17, 52, 173, -254, -33, -29, 185, 64, 44, -101, 23, -258, 100, 59, -50, -142, 76, 3, -1, -11, -69, -34, -132, 183, -127, -55, -300, -158, -246, 24, 13, 83, 26, -165, 104, 97, 132, -39, -20, -96, -49, 134, 28, -14, 7, 52, 68, 44, -26, -3, -173, 82, 154, -103, 43, -74, -175, -183, -70, 142, 286, 95, -122, -66, 248, 162, 83, -253, 325, 253, -229, -124, 18, -159, 174, 13, -65, -82, -98, -270, -246, 131, -20, -171, -232, -333, 25, -119, -166, -79, 89, -34, -67, 269, 308, 216, -123, 135, 196, 117, -187, -63, 6, -232, -228, 77, -245, 18, 12, 43, -109, 180, -190, -45, 20]
5618B0N5O0m29J31M30j95R0o9J2Or7j5J59j47J45p8q8J29o2j23K79k18oJ39j43
5643a5R6j41j38m5j6K73O3k01J53j62K34l91L00J43p4j55J52j47K75k89R7p8M
5666f2K96k51j97P8K48k10J8K7O2l1K16k33J73r6j38j0J82k02N8N4j90K68j92
5689a32J99j32K38j7k74o2O9J13J20j86j8q0R0r7J59K24k34J77k34Q8J18j59q3
5712a13l2J14O0j33K15n6j49J44lJ38k96p4J48q2N0R9K4Qp4J6J39j39l6j9n5J9
5738h7J1k5o1j44J59J01j8l9j2R7k9j4Qj48J63j04J38q6n2J54n1j03K03j09K4
5763b4K34k47M6k21M02j62J18j88J43j87j31K32K0m1p5K66l81K60k28K16j19K59
5785A92l41K0m7R5J87q6j85K32k46J21J04J0j28J02m4j45K18J76k07K0J66mk61
$$ y = [20, 75, 135, -294, -163, 267, 72, 162, 93, 105, 111, 14, -1, 158, 11, 156, 78, -10, 119, 57, -66, 213, -5, -11, 128, -15, 81, -60, -198, -243, -259, 14, 77, -124, 29, -133, 101, -290, 10, 153, 79, -76, 76, -71, 204, -85, 12, -66, -62, 234, -17, -214, -136, 112, -98, -80, -53, 9, -22, 194, -39, 134, 38, -100, -110, 72, -130, -72, -18, -208, 60, -132, 67, -65, 173, 156, -118, -180, -111, 2, 122, -64, -82, -162, -72, -169, -10, 214, -20, 157, -77, 11, 129, -30, -113, -145, -31, 29, -104, 111, 55, -94, 50, 47, 185, -111, -185, -37, -119, -69, 30, 54, 62, -12, 4, 143, 4, -32, -51, -106, -87, -76, -101, -162, -306, -147, -46, -64, -103, -115, -18, -47, -61, -53, -201, -38, -142, -4, -90, -142, 12, -39, -142, 61, -48, -24, 210, -37, 9, -212, 190, 28, 146, -42, 101, -86, -217, 15, 35, -6, -81, 185, -196, 64, -164, 52, -67, 192, -149, -129, -176, -81, 106, 20, -165, 67, -179, -58, 46, 56, -72, 30, -14, -159, 59, 235, 28, 48, 214, 210, -51]
5808e1p4n2K72n7J22m12N4N6J59L6N1J31k33K1j9K28l67K63j99k42K82J07k19
5831a43K01j35K06m7P4l5j77r2R2J14Q7j28k2k1r0K63o1j16k8n7J82m7k55K26
5855iJ52j39O7K8K2j58L7Q2l5L80l64j70K23l61J88P2q6j13K50k43j34L19Q9R1
5879A88p8o4m2J11O6m22N9J87r7K83j54j23N5r3q3J73j3K3p3lNK48j09R4L4j66
5905Fj19L9J61j66n4p0M8K40j77J65J78k88j11K85j07K0J42l29J22j29N1O1j99
5928b31K20J7L7j57J66k44J51M2j69K24k5j1K3j03J75k86K84q7k80K48N1j04j49
5951b08J20L05l3k44K38n61M71J16k30Q0l1k54J02Q1J03j30Q9J9n3k32j11K93
5973g0j5L62k66J39k43l8j83K65k87N74j23k2J4O6K0l5J18m87K91k21K55j14j63
$$ y = [-51, -125, -177, 95, 38, 160, -252, -198, -142, 17, 53, 104, 235, 2, 23, 4, 232, -135, 128, -71, -313, -31, 76, -143, 58, -77, 129, 82, 156, 121, -56, -148, -56, 58, 145, 17, -5, -26, -116, 147, 86, -30, -58, -115, 67, 20, -235, -9, 143, 4, 71, 99, 121, -37, 0, 82, 47, 427, 63, -107, 116, -245, -57, 15, -71, -184, 66, -177, -311, 8, 97, 188, 110, 46, 4, 115, 181, -241, -182, 5, -92, 191, 37, -86, -31, -124, -207, -34, -47, -24, -97, -100, -95, 153, 44, 138, 172, 6, -113, -74, 87, -79, -133, -203, -155, 85, -92, 73, 251, -37, -148, 137, 30, 50, 192, -137, -15, -144, -93, -32, -231, -11, 6, 43, -114, 52, -192, -41, 1, -168, 56, 31, 20, 43, -60, 115, -171, 113, 26, -254, -6, 45, -59, -208, -88, 217, 184, -60, 178, -383, 88, 204, -26, 54, 23, -231, -129, -48, 55, -75, 14, 33, -20, -252, -363, -70, -85, 277, 11, 150, -93, -131, -314, -49, -336, 238, 115, 93, 107, 173, 193, 158, 276, -211, 80, -141, 114, 0, -163]
5996a63R3J35j65r0L35j47K7j00J75k1j1l1j00l9R4N6m7N1J4j13J41ql4O3l51
6021b36J72Q9J29j48j37KK42j2k68K65k6l17J73K59j34L5j41J48j99K14j0k7J
6044G4j20R9j18j7J88K7k38M6N6jJ16J1j84J77j62j17k2J63k3J05p5Q1j04L0M1
6069C3P1M0k16O7o9J73P1l8j0r5k19j84J00L50l49J22M7K82l13q8N0J49J22M5
6093A41K0k19J78j77k14L80k10J03K89l76O5lJ0m2K73j75j9R1K35m22j49L69k55
6116a07K57j54R8j8l33J17M2J76k74L21j34N6Ln1P7p0M2M4r2r1R9j9r3R0J04l0
6142F0R4J26l60J12J31l99L87l50N60l82J1j8L0J0j02K4p5P4J09k33J02K59m14
6165b44M08Nr1j34j01K44Mk78K10J6J3r1J2R5K09q5j50j59N3J02k61P9L73m01
$$ y = [-163, -70, 65, -100, -190, 145, -2, 25, -75, 100, 79, 68, 37, -63, -102, -8, 48, 1, 52, 66, -47, 94, 86, 52, 115, -236, -64, 25, 154, 6, -131, -129, 113, 101, -167, 98, 72, -245, -72, 187, 53, 88, -53, 95, -104, 110, 100, 73, 74, -46, 53, -65, -82, 106, 133, -105, -59, -3, -4, 112, 123, -61, 116, -46, -163, -185, -22, -45, 60, -15, 66, -38, -8, 33, 104, 144, -72, -5, -74, 99, 170, 132, 122, 27, -192, -376, -276, 74, -275, -153, -106, 176, -137, -225, -175, -26, 96, 141, 161, -58, 120, -57, -271, 109, -101, 2, 291, -85, -20, -23, -13, -55, 218, 43, 24, 115, 350, -72, -221, 148, -107, 150, -4, 94, 76, -257, -140, -98, 78, -196, 125, -9, 47, 50, -1, 76, 6, 48, 92, 0, -91, 8, -11, -104, -14, 90, 60, 154, 280, -80, 32, 163, -236, 151, -199, 361, -21, -10, -28, 2, 12, -90, -66, -141, -67, 42, -191, -89, 170, -244, 164, 169, 78, -56, -157, 87, 91, -187, 23, 39, 52, -39, -27, 68, 277, 192, 42, -117, -64, 38, -223, -144, 229, -172]
6189a72L9K25M0O4k79L87o25K26M30m61OK77N0l66J62j49R7j27J95P9n2J12k07
6212d9J00L9L7k26L20r1l14O7K93K99n44rJ10J16j73L9O9j69L04l86J92j52R7
6235c1K8j60K38K70m17K14m8j41j50K85j06J99j54J12j0j98M5K09j63j19L55J66
6257D24n92L87m7l33L05j91j52J47m3R2j15K87m12P7J72K11k46r3O4j8O7J3J00
6280A04n2m6J66k42O1J28j52J7q8M7jk1J82p3J18l06J69k8k88L81J17m41J18N6
6304g4j13O06m82lk46N81j62Pk35K02m5l10M14p4N0n3j05j40J80j60K24p9J7K29
6328B29j85l5J64k50q4L51j42j42J42j47L53k55J44j53l0n0J74P3k47j7N4j01
6350a54J77j49R6M2N0j9j10K5J09l26K84m7m1J73k03qJ12Jj30M3K04k86J49j23
$$ y = [-172, -133, 92, 132, 196, -83, 304, -321, -95, 335, -126, -120, 157, 207, -159, 3, -146, -49, -176, 19, 98, 46, 158, -49, 51, 90, 127, -99, 221, 130, -184, -117, 176, 475, -69, -78, 32, 148, -25, 14, 83, -86, 218, -168, 24, -128, -31, -3, -163, 75, 345, -72, 142, 94, -47, -197, 88, -18, 181, 27, 139, 129, -69, -24, 185, 22, -97, 258, 424, -168, 219, 172, -161, 144, -47, -199, -52, -95, -3, -118, 169, -243, -166, 6, 217, -29, -122, -58, -76, -9, 4, 104, 52, 6, 172, -70, -9, 119, -33, -16, -104, -57, -58, -79, 103, 30, 148, -158, 11, -17, -305, 76, 193, -248, -130, -74, -187, 419, -63, -66, -312, 269, 107, 114, -121, 81, 36, -274, 140, 66, 116, 63, -42, -182, -2, -162, 62, -17, 0, 229, 44, 9, 173, -77, -161, 190, 48, -94, 48, -99, 254, -1, 143, -10, -40, -90, 84, 157, -90, -107, -53, -154, 23, -126, -30, 12, 62, 43, -67, -42, 67, -259, 25, -22, -63, 110, -93, -101, 11, 12, -118, -75, 129, -157, -8, -131]
6374a31K34q7p5K12n6k14K36k3l61J47j9K44j10J7J11o6j25R1Mm26L11J58j22
6397e0L4J77l51K33K3p4j91K12J5p8K35j32k6Q2p2k05K51k52J48o5j01K22j91
6420a56o8J68Q4n9j11Q8l3J28k70K03j06Q4J34n4j56K28j16qJ79p3q9J12p9m6
6444a6J07j38L19j77q8oj99M6L14N5l07jJ20N1n5mL2j03O1L4k35J36J57l52K22
6469b7J17kq0J79j12k3l5J7m0N3N6k46J48n5j47R0J51J37k39J45j07q1J62k27
6493a66J74R8j73%k2J7L43r8l09J30J99j17O7kk43R6Qj1L07l64K34l22L70J7j11
6518A22k04P5K95m13p7J59P5j32L84k40J12j59j59K12N0j65J37r1k72K48J22N6
6540A35N5k93J05j7R8k0l89K57Qj00J75J10o8J38o9j90M4j04L44k15l2J92k37
$$ y = [-131, 103, 16, -59, 153, 97, -117, 119, 96, -265, -118, -137, 107, -3, 14, 125, 59, -66, 25, 29, -397, -86, 72, -50, -16, 161, -190, 43, 66, -8, -199, 13, 28, -50, 185, 53, 27, 109, 37, -168, 83, -169, -21, -86, -187, 35, -156, -224, -56, 28, -31, -142, -54, -87, 41, -229, -26, -132, -48, 86, 32, -124, 104, -12, -20, 159, 86, -3, 109, 30, -16, 91, -47, 272, 95, 7, 1, -198, -152, 162, 217, -90, -91, 29, 80, 25, 21, 53, -50, 11, 45, -190, -54, 103, -249, -27, 90, 88, 8, 187, 75, 52, 17, 34, -6, 47, 103, -143, 5, -50, -197, -107, 44, 181, -58, 87, -20, -101, 61, -166, 8, 106, -67, -67, -89, -72, 271, 173, -136, -6, 193, 76, 143, 141, -102, -6, 2, -9, 298, -66, 168, -154, 216, 233, 122, -82, -7, 288, -125, -202, -43, 32, -100, 284, 44, 156, -3, -162, 50, 100, -65, 72, -19, -291, -43, 79, 135, 190, -103, 2, -15, 83, 63, -326, -69, -61, -161, 14, 124, 56, 194, 125, -65, -21, -125, 219, 4, -28, 164, -73]
6563g3J32J57j17j16J77p7J32J7K0j98L0k16j4N8j29K26K15r4J30k37J04m0J12
6586A99j99r9O8O1Q8k62P5j36P9R9o1J19k04k6K62m8K52q6j61l7k25N9J75J66
6610A58k34o3M2m5j00J16K28K7k99J9mJ9J32Kk1l05L77K17j74r8k15K23o8J58
6634I2j47o6j06J17r0R1J20L6j37K20L2J2o5m00L52n9p9jp5K28n1j05K97l19K64
6659A61k39Q5j93K83q2%n3J00j0q1LjK17J0l52l5K55M1j33O7q8O1J26j86k18M83
6685B21k92k2M6J14j83L00j65J19o1j71L50n26M75p9k14L2N1k06J81L02k49j71
6707a48q7J67J01p9L9J01j06R7k93L57q8L1p4m6L14l42L5j8J30j40kl8m2O0L67
6732B96n58L81l19l6L8M4K42P9k65m2O5L4r4L87k32k11K07m2j54J80k6p3N9j5
$$ y = [-73, 59, 216, 99, -17, 160, 83, 215, 232, 252, 54, 84, -132, -146, -88, -217, 9, 224, 130, 260, 23, 127, 87, 199, 0, -99, -31, 30, 118, -144, -69, -205, -126, -27, -88, 31, -173, -199, 63, 15, 267, 181, 20, -17, -242, -183, -8, 158, -76, -139, -97, -142, -242, -126, 102, 129, -170, -151, -155, -136, -4, -2, -23, -328, 49, 266, 92, -6, -221, 2, -66, 92, -55, -121, -227, -110, -200, -109, 11, 47, -90, 130, 162, 174, 109, -291, 61, 2, -77, -78, -153, 75, 24, -81, 216, -103, 161, -78, 7, -186, 97, 15, 15, -38, 62, 52, -29, -26, -27, 190, 200, -152, -187, 68, 109, -24, 43, -45, 16, 142, -44, -262, 221, -71, -93, -47, 67, -116, 184, 19, 138, 77, -94, 256, -270, 205, 126, -88, -56, -5, -211, -30, 272, 23, -148, -235, -68, 33, -46, -7, 94, -12, 85, -208, 149, 61, 92, 18, -28, 286, -56, -21, -39, 91, -49, -51, -89, -131, -71, 296, -262, 119, -200, -236, -198, -154, 88, 167, -98, -140, -75, -41, -135, 252, 20, -191, 16, -26, -180, 0, -26, -99, -40, -55]
6756e5j64L17Oj00j57L7l3J73N9j32j66M40j76j34RLJ94k06K10j57J34k39N1l1
6780a17L5J30j68J49J4J58k69K45l06j2L61k85k6M25m72L41rj03P8l31P1J26l38
6803c03J04L07O1j89K44j25j19r9J54l19K62j52K04k24nL72j41o2j21K72p4o6
6825a9m1J24j7M2p8N8o1r7N7L5Nj03j41M52j12k98L81k51J15L5j29N3j73J78m8
6850c3j84J96O0QJ6p1O1l0Q1j98k09L02J7P6J68N0m56J34j23J2j4kK64p8k76K60
6876C1O9k63K94j36j71J16J3j49J41J96p1o4j95L15N5p7P5j89r2J70k39pJ21j68
6900b25L4K08j02N9k44J26J66K4r5J38j44J50M9l87K18J92l38K77k92jL94p0J9
6923A56k90J60q7L09j80j53J86O4J9k12j60K58O2l45M37m71K77j77J43rM5M3l67
$$ y = [-55, -219, 98, 104, 4, -153, -116, -149, 24, 83, -49, -215, 225, 49, -85, -76, -73, 121, -85, 125, -32, 102, -137, -86, -117, -82, 48, -120, 29, 43, 201, -68, 177, -129, -141, 220, -65, -91, 334, -138, 203, 194, 91, 169, -162, -91, 35, -303, -199, 108, 169, -20, 224, 99, -20, -119, 35, -284, -22, -174, 30, -194, -199, 173, 32, -30, -151, 121, 47, -19, -60, 64, 47, 89, 11, 69, 8, -89, -32, 3, 8, -95, -236, 216, 104, -194, 187, -64, 51, 86, -43, 10, -163, 15, -33, -217, -21, 39, 47, 63, -8, 53, 23, 104, -94, -303, -1, 16, 92, 260, 310, -146, -12, -135, -123, -137, -139, 125, 47, -229, 31, 100, -163, 131, -5, -176, -60, -47, -196, -55, 141, 70, 6, -189, 126, 181, 104, 179, -10, -102, 68, -171, -178, -57, -225, -191, 17, -85, -26, -270, -144, 22, 46, -49, 89, -55, 95, 144, -243, -25, 167, -171, 106, -186, -187, 207, 137, 156, -134, 26, -61, 248, 68, -85, 101, 165, 184, -28, -188, 70, 132, -213, 224, -247, 30, -147, -4, -13, 32, 75, -292]
6946b92J32J88j2l8J26L8l35K55l2k11J54%N1q9P3j00K70j83j04J25J1j92J14
6969e1mK28k03O2J44J09r8p6K6k34J6o6K78k19M2l8l8pK06j8k09J99n7P3k55K47
6995E7l17M09k37K0J77j84P6r3%J54K8p1j91L71l15Q3j15O0O4j05K42k26K08j27
7019c2J64l22l3K24R8k09Q5M5j18j22P6O7O6J88k44J41r1L50m97j22J81J37r1
7042e9L0J83j41k1O3j0j09J21l4j07M3K07l99M68l91%K9k3K28j13n2n3J01RL85
7067C55l37K78j96j05k70K38l6n3P6k27K48j09M5j2J54l19J10K88j76K10l82L55
7089A35j49O5J25p9k49K60Lk44LJ75r9J47j77Q9N5r5J07L9j81p4J25j17J47j24
7113a13j91L96q2j19N8J44q9R0m8K61l36R4j0l5Qj26K39k2o2Ln1J80j16l3J35
$$ y = [-292, -160, 28, 16, -22, 104, 142, -193, 62, 30, -181, -27, -27, 24, -65, 8, -92, 178, -5, -109, 16, 27, -165, -51, -55, 173, -30, 32, 176, 285, 187, 111, 137, -97, -81, -147, 131, -88, -46, -84, -122, -129, 77, 59, -150, 49, -8, 65, -190, 57, -260, 149, -88, -68, 109, -75, 1, -92, -92, 62, 90, 19, -172, 199, -116, -33, -148, -88, -24, -129, 113, -113, 95, -32, 132, -190, -223, 1, 99, -110, -25, 20, -98, -220, -144, -77, -11, 177, -67, 74, -17, 333, -164, -286, -105, 32, -59, -29, 154, 13, -8, 55, 45, -64, 57, 23, -84, -41, 166, -233, 235, -156, -156, -127, -150, 78, -35, -87, -140, -39, -30, 355, 18, 296, 100, -5, -275, -37, -73, -126, -50, -277, -29, -138, -93, -105, 49, -270, -160, 128, -48, 162, -220, 135, -14, 51, 176, 97, -152, 108, 111, -133, -130, 45, -54, 93, -84, 5, 60, -35, 72, 111, -70, -144, -19, -136, 11, -113, -304, 92, 10, -109, -51, 93, 4, 94, 46, 307, -29, 65, 55, 20, 28, -98, 141, 119, 57, 60, 9, 189, 73, 40, 175]
7138A75j22l3R3p5N6P6l32J62N7Q8nk99K60k06K40j42J04o7r5L2p9K06k20QJ80
7163F2K10l04l9j73K56J85k06k26l0L46Q0k45J18m4j1J36k84K47r3l8K50k08J5
7186DK40k27o1k08M09j69N0j36J57j00o2Qm1J30J49p3J86k62j34M7n3OJ2J2K06
7211I0j61k3J52p7nN1j41J16n7K3l3J69k61Q1j88M04k11k6J45P8J9j03q9j31J09
7236f9J21n4J1j78K24j47L8j06K82l75K15o9M5L1l3n4K7R8P4k79o2K03J57k73
7260a73L16k42m8L31k68Q3J7J26n3m0N8l16L27R9l15J31J6j79L03j13m1J30l7
7283A12l47M32J5j0k05M8J53m94J19L0J94j00R4k54J41n8K46j14j73M24l63j09
7305b19L07l13K51o5p2K66p5O0j22p0Q5l3j9j09p9J7J24m3N3J19j67L18k04j01
$$ y = [175, 53, 20, 113, 38, 94, 170, -162, 0, 57, 145, 140, -159, 101, -105, 135, -7, 97, 30, -65, -33, -112, 94, -126, -118, 62, 272, -32, -71, -244, 12, 197, -9, -235, -265, 81, 161, -84, 34, -10, -21, 115, -169, 78, -15, -53, 197, -11, 4, 244, 17, -44, -252, 157, -12, 38, -98, 59, -41, -103, -95, -136, -6, 143, 70, 256, -6, -140, -93, -146, -140, -128, -116, 90, -71, -94, 58, -19, -24, 27, -114, 2, -55, -32, -65, 104, -157, -76, -264, 140, -71, -97, 48, 126, 145, 42, -47, -178, -69, 52, -2, 9, -169, 55, -92, -54, -160, 122, -253, -38, -107, -62, -31, -64, -118, -91, 7, 81, -198, -260, -57, 100, -173, 143, -99, -147, 184, -84, -1, 16, 142, 89, 49, 107, -209, 118, 217, -98, 33, 49, -130, 173, 60, 19, 149, 112, -235, 197, 212, 202, -3, 45, 198, -296, -177, -147, 47, -53, 41, -213, -72, -130, 116, 2, -171, 253, -110, -219, 88, -225, 26, -39, -111, 155, 80, 140, 18, -52, 33, 0, -19, -128, -207, -190, -66, -109, -56, 63, -104, 214, 10, -91]
7329i1L0k13L23K02l58K6p0K02j95J82j53L8J55m4P1r4N4k06M8p5L33j66k29K39
7353IJ14j89J12J36k97J93j9j10k4J09Q4l68L03M6o9j61K5J27m8j34J89P0o0K26
7377B64l14j73J01J42j81L58k17Q8M7o1j93J73k7K44n3k32m7J16m3K34r0j51k25
7400b40L4L45k18J66m3o0n3NJ20M7j18Q0j38K71j53j05L5m4j6K39j28j18j3L32
7424B27j34o0N0R2k13j14l2K38kpk17K36M0K1J89k15k20J94j52R8J24N8%q3q0
7449C8q6Q1j49K23j78L7J51k54K10j18M3j6K28j34k93K47r6J27m2j70L46j59R1
7472A27j4N1k99J82N0M8n5j67Q8J45j98k05L54o0J7k39J91r6J23q1j3Q7P2K9R9
7497B36j96n6P5k34q7L43k86K49o7K8LQ1j16j25K36l04K76L8m17M29K8m5n3j51
$$ y = [-91, -61, -274, 49, 251, -107, -81, -151, 51, -144, 38, -115, -77, 78, 34, 105, 11, 65, -141, -93, -168, 165, -1, -230, 9, 123, -66, 46, 182, -115, 78, 59, -51, -75, 34, 118, -250, 53, 99, 30, -131, -106, 21, -27, -161, 28, 98, 38, 264, -50, -223, -122, 20, -161, 197, -20, 68, 115, 54, -139, 34, 7, 251, 198, -34, -81, 35, -8, 226, 136, -15, -240, -206, 139, -79, 87, 44, -16, -69, -64, 56, 103, -15, 65, -73, 198, 45, -60, -25, -69, -85, 154, 26, -92, -105, 227, 93, 33, 83, 175, -38, -152, -184, 54, 52, 45, -172, 64, 104, 125, 314, 99, -121, 73, -79, 19, 143, 201, 201, 118, 38, -48, 33, -116, 107, -71, -34, 117, -137, 73, -45, -2, -18, 210, 76, -217, 30, -66, 61, 19, -151, 195, 36, 127, 113, 164, -135, 47, 97, 145, 90, -77, 11, 156, -42, -247, 107, 47, 64, -175, 16, -80, 43, -38, -51, 36, 108, 137, 236, 40, -16, 59, -175, -262, 81, -205, 44, -23, 5, 8, 89, -27, -152, 84, -220, 56, 94, -323, 106, 134, 89, 36, -115]
7521a15K80j91N9j24k33O9l4J6O6K61r9K9oJ29j20q3J29p2J29l31K73j32k0P9
7545d1J30j14j36K08nK5Q8l16K35j99J10k22K4J10pJ16J02o5k21Q0Nj00N9L45
7569B11k08O9q1l31N75j80j13K3m8n8J7l2J95k73R4M22l56pJ91n9O9j08k10O1
7593a37J91l13J90R7N2k89J79Q9M2J27l55J57o2Q8J9r6K14l6j74j67M36n47K70
7616b5p7k2k7n5K87k54M9L0N4J87k33J08J84o1qj49o9OK42p2l3j49J95j13k02
7641b07J38R3R9P1o8n2k70J35j6n1o9J62J43k32J91n0N9k05J5P8m9L10k23P6j39
7666f1O9j1O9j20j55K27j36J14o4K29p0j20N8R6L8k90L6r3K18k95M51j57j75N1
7690i1N8J27k22j28L10J05P9k83J62l2o3R8r8O8m2j05K11O9k31l0R3m1p4M12n01
$$ y = [-115, 165, -26, 33, -91, -324, -255, -289, -273, -207, 54, -45, -16, -22, 107, -13, -96, 33, -39, 90, -241, 32, -100, -120, -41, 89, -25, -161, 47, 42, 67, 155, -161, 74, -125, -15, -237, -213, -103, -110, 6, 108, 43, -178, -98, -93, -193, -134, 211, 3, 72, -9, -340, 235, 55, -58, -35, -83, -141, -124, -156, 39, -234, -140, 282, -74, -81, 110, 51, 120, 12, -198, -137, 54, -259, -69, 28, 80, -209, -30, 59, 101, 228, -127, 30, -32, 56, 75, -21, 193, 157, -17, -184, 252, -295, -25, -102, -124, -151, -206, 81, -173, -124, -94, -40, 147, -86, 22, 206, 145, 137, -12, -81, -75, 167, 95, 62, -87, 108, -5, -207, -69, 24, 123, 194, 126, 74, -196, -61, -77, -128, -197, -35, 108, -124, 67, 17, 76, -129, -114, -36, -85, 225, 2, 78, -61, 8, -3, 66, -54, -209, 18, -118, -4, -68, 161, 91, -29, 29, 125, 163, -127, -91, -184, 34, -261, 190, 33, -142, -91, -33, 94, -128, -256, 54, 159, 238, -45, 117, 85, 22, 120, 22, 90, 48, -57, 154, 223, -8, -38, 55, 14, -60, 352, -149]
7715a49K27j90J51l1k91M58j34r4j08j01J98k7q9J22J97j10J14j54n9L69k50n6
7737gJ56Q4k94RK71k16n1J5J60n3k98J87J40l20K54j69j68M29Mr1p3j09K83j04
7761C9pp3k56J26L83j10j85J39q9J73J6r7k33M0J5K39j97kJ92j75P3j47J87r4
7785d3p5R0j56L74L9l63J58j98J46J86j29n3J85k16p5J41l3N2K69M3k01k16N2
7808b3J18j97%j33K14J12j53k79J33JJ48k9L2J8j07J94n5K80m17K86k0j37O9r5
7832d0j61J29M9p8P4P3j66RJ48K03l04J57j64P3J23j28O7j44k8J10P1j09nKk1
7857f0K9J1%q5j90K54K55n11J77M9J15j28J53P7l45K34NrP2l27J58J60l43L28
7881G9j32p1Q5n0K3K08j83p3J15k41K50p4j20J51j03j30J52J45j09K52k55K17
$$ y = [-149, 78, -112, 39, 8, -283, 175, 41, -53, -161, -262, -64, -91, -180, -58, 139, 29, 143, -11, -70, 299, 49, -7, 149, 233, -61, -52, 219, 3, -48, -33, 127, 74, -224, -37, 103, -217, 37, -132, -300, 129, 133, 42, -31, -140, 143, 39, 32, -41, -297, -171, 212, 102, -83, 56, -33, 140, 156, 59, -174, -134, -119, 120, -77, -79, 113, -62, 11, -136, 51, -43, -118, -28, -184, 190, 229, -134, 24, -174, -28, 158, 29, -24, 161, -55, -130, 11, -22, 30, 299, 342, 141, -75, -23, 95, -102, -102, -235, -21, 91, -62, -341, -208, -207, -59, -88, -56, -38, -145, 49, -6, 274, -143, 143, 123, -14, 55, -40, -201, -72, -23, -101, -27, 46, -120, -111, 37, 240, -64, 93, -71, 2, 125, -3, 64, -80, -108, 2, 73, -36, -41, -39, -60, -31, -20, -20, -105, -295, -41, 214, -297, -120, -71, 44, -84, 69, 146, -199, 35, 40, 31, 103, -224, -66, 94, -249, 79, -53, -124, -39, -89, -66, 142, -41, -114, 1, -240, 10, -64, -184, -33, -136, -266, -114, 31, -78, 174, -81, 136]
7903A36j72P7j65L5J97M9l04J98j07J42k07J07k2J9N4l9j40o7M5K03j1L07p2n6
7927B07j6k05j2j53J75M2j54L26k07p5J5l5O2J06j84K12q2j91M84k14k07r0L04
7950A08n3kk15J01O2j39J69J8kK31k92j05J3n8jK21n9j63L35k3j84J74m6j17L3
7975FL9j64L5N0J26j07q9nm3m2R5K60p5l0N0j28J07j41J84m5j78r6qL31qj97L46
8002B73k48L4j00j43K28j51J21j81L71l9m40L28j41jK08j89K31j62J02j89J98
8023A10m07K30p8J08j4P0J4k74K63n5k04L13j76k6K18J08k22M0M9j88L36l40J17
8046hj00N50m90L1N2k24K13o0k24J1M23j6k07M9r0J04J98r1j88Rj29J15J04J7
8070D9p5j9N5Oo5K48j79j30J64J34j05Q1j15k01K90l85K95j51N2L7J71l17L02
$$ y = [136, -36, 41, -124, -89, 108, 157, -147, 51, -56, 86, -121, -14, -36, -17, 37, -2, -142, -209, -164, 39, 28, 335, 263, 207, 191, -14, -26, -179, -4, 38, -116, 210, 3, -72, -57, -92, -30, 76, -108, 104, 22, -169, 315, 101, -106, -196, 108, 55, 53, -162, -61, 1, -138, 31, 49, 47, 278, -14, -119, -106, -164, -165, 56, -3, -166, 169, 146, -38, 136, 90, -27, 6, 45, -119, -84, -34, 92, -15, -104, -109, -152, -194, -99, 161, 86, 56, 106, -22, 85, -56, 128, 83, -95, -191, -199, 132, 124, -73, 273, 25, 59, -41, -184, 44, -107, 14, -167, 204, 165, -275, 53, -88, -89, 119, -70, 161, -1, 101, -88, 110, -297, -67, -145, -37, -51, 19, 33, -241, 22, -33, -237, 76, -100, -126, 92, 200, -22, 18, 67, -121, 215, -125, -8, -108, 442, -48, -17, 35, -189, 24, -36, -260, -249, 174, 158, -49, 0, -90, 14, 212, 121, -67, -58, -187, -72, 32, 49, -26, -45, 10, 16, -49, 199, 20, -110, 54, 188, 83, 164, 49, -152, 138, -247, 48, -103, -51, -14, 157, -160, 142]
8093A42j44L6j62L07j8k13J60K2m5J20j40k06K42%Q6m32M64j26oj65l3J92k35
8116a54K48j22j3K28k69J90n9k3NJ82j33K42l57J73l8n7p4K2j0j04K11P6j68o9
8140g3J75k24J96l05J83k6J13j30J91QL5J56k62k68j28N45j19j01P7k38O1J05
8162b9j2L2j35M2j1L57m09K48K8K6k8j57j4P4m2m3K52l99J14K11j95J79j56J50
8186H3k17L37J5l68K42
$$ y = [142, -2, 34, -128, 179, 161, -52, 108, 130, 85, 205, 65, -141, 101, 101, 187, -245, 219, 93, 87, -78, -111, 81, -154, 94, -28, -41, 187, -82, 108, 49, 26, 31, 213, 80, 322, -35, 138, 100, 43, -31, -9, -19, -123, 88, 164, -4, -73, 102, -122, 74, -231, -48, -74, 39, -91, 100, 108, 143, 299, 37, -231, -359, 186, 67, -34, 43, -195, -134, -29, -41, -9, -144, -102, -113, 244, -165, 83, 111, 137, 109, -48, -62, 12, -30, -73, 179, -220, -106, 105, -90, 89, -67, 83, -134, 203, 218, -150, 92]
8191I2
$$ Imaginary data points
##PAGE= N=2
##DATA TABLE= (X++(I..I)), XYDATA
0@%%%%%%%%%%Qj6J6j6J6k4L2m0M8n6P2q7R9j12J32j53J77k06K35k67L06l52M00
33B12m48N03n68O38p13P95q86R86j093J210j338J481j637J803j984K183k407K655
51A392k926L223l555L933m360M846n408O067o852P801q975J0472j2454J5208j9280
66a0868K5888l8304O8939k69074l13538R20066j32592o77573M81799L05929o58582
77b97910J88021N52457n92966l01989P96577n5563p03179L87804M33099n94362
87a88011p2860N66117k68734l76591M95189R4121n12597J97677L64534m37215
97a38370j36864N26526r1958m62321K78411L01415l48982r4289K94268j25052
107B784j60223K98409P456l73369J46114L57011k62466k74549K99890J32062k61068
$$ y = [0, 0, 0, 0, 0, 0, 0, 0, 0, 0, 0, 8, -8, 8, -8, 8, -16, 16, -24, 24, -32, 40, -47, 52, -60, 72, -81, 96, -110, 125, -142, 164, -188, 212, -236, 267, -301, 337, -376, 419, -467, 519, -574, 636, -702, 779, -858, 945, -1039, 1144, -1263, 1392, -1534, 1689, -1866, 2067, -2293, 2553, -2855, 3212, -3640, 4161, -4814, 5658, -6796, 8412, -10868, 15020, -23284, 45655, -223419, -536957, 383109, 250517, -427056, 54743, 360672, -297910, -109889, 442568, -150398, -452387, 344190, 288627, -414552, -26748, 406351, -188011, -260871, 305246, 36512, -340079, 155110, 249231, -263366, -65689, 298845, -138370, -275234, 251292, 159334, -302987, -24576, 276839, -72143, -166432, 127836, 2784, -157439, 140970, 148426, -224943, -78829, 278182, 15716, -258833, 41057, 173119, -87949]
118h7949M1916J72535j90117m8544K67686j04000k76331K35101K09616l04582
128h4669p1692L05760r2773k42167K16986J14142k63742N0239K31396j87716j15923
139a40159K64206n2317k68435K08435K03163k91825p9370K88624n6364k04135
149a28177J48618N3742j82617J12904J57972k35422q6841K80370j1888k53462
159a44801R3219J65283j31028m2559J28893p3176r2953J49214L1628j76732L8492
170e4520J67219r0790j22002J23544N6441j36542Q506J25202o0974q2762R9324
181C2646J7489j17996N5517J02957j30425n7890J85037p303j97353P7490J52935
192A13104j36404o2909J56175n1774j20407J61608L8304k26035O8302K19553j66687
$$ y = [-87949, -46033, 126502, -63615, -112159, 155527, 51527, -224804, 10297, 219913, -84669, -156361, 149399, 56626, -185541, 31445, 145587, -118155, -67916, 163480, -24236, -140159, 124047, 71730, -196705, 11730, 214893, -76932, -156302, 132322, 75958, -128177, 20441, 74183, -108434, 4470, 162442, -72980, -159821, 120549, 108661, -144801, -51582, 113701, -17327, -59886, 69007, -4169, -97122, 52092, 83720, -93012, -54520, 112699, 21909, -100093, 23451, 79892, -56650, -48144, 77058, 16084, -66678, 32646, 50135, -67861, -12344, 90613, -39812, -97702, 87335, 80032, -117321, -39831, 113104, -23300, -86209, 69966, 18192, -102215, 59393, 97697, -128338, -60036, 159517, -7170]
203g170j39930K24666J7218k10221J12328J25408k04602L773K23624j37219j60725
214a52850K31365L9471k54467R3378J94303j96724p5918K30896o1194j84223J71698
225C5735P2868k22627O1044J98134j71722j10426K27569l118k10173J07114J29203
236A13601j67210j4119J70697r4206j18914J67733L4688j88733N2353J55187j18233
247g156q4655J46840j656j34243P6326Q5777j26849j9421J41026m9671j19663
258i3345J06178O9617j37634l753J36446o1543j01024J14310L9472j34994L5982
269c0288J19756j05023o8428J49582n950j52240Q3527J10323j41573l3339J56669
280H3016n8066j23292J32982M7728j68482M5900J48889j30514q0551J74241j4596
$$ y = [-7170, -147100, 77566, 94784, -115437, -3109, 122299, -82303, -78530, 145094, 7875, -152850, 78515, 117986, -136481, -43103, 151200, -45524, -121442, 109454, 48260, -135963, 35735, 108603, -114024, -52980, 145154, -26568, -136994, 90575, 87457, -122716, -15602, 113601, -53609, -67728, 102969, 8763, -110151, 57582, 92270, -96463, -44110, 111077, -7156, -91811, 55029, 53373, -80870, -4544, 81233, -45616, -65037, 75989, 26318, -93345, 12833, 82450, -55184, -58937, 77509, 15966, -85058, 29252, 68724, -66270, -30288, 89468, -15555, -83983, 65599, 59649, -92591, -9064, 101259, -40314, -73653, 83016, 24950, -98342, 34640, 82368, -86114, -40214, 108675, -21839, -102390, 71851, 57255]
291E7255j63669J06346J00527j62784m739J66263q9738j14639J55294K9073j68807
302h9618O4271J29667j32799n2341J56381l6172j30247J07710O5486j42117J3445
313d6334J30308q2897q3409J22180J5692j24623M9315R1420r4968l7584J11457
324E0557k1664r6925P0820O0427r8295j0698J01486l7846p9465P6931M0013r5882
336d0541J0432R1424n8498o3684R3721J6922j06309L6669Q9365q3878m8045J09928
348D7506j1761j05756P0211O8458j11262q813J20638n8024r2492J10430L5029
359F4164j30322L5899J10924r5980n5440J27192j6768j16659Q4692O9334j24668
370d7632J35J24773o8226q6307J13300K1675j21983M5815R1332r6802l4775J14456
$$ y = [57255, -106414, -68, 100459, -62325, -67064, 99199, 9461, -105178, 50116, 79189, -89618, -25347, 104320, -28479, -80820, 75561, 39389, -90858, 16852, 82338, -59779, -46334, 83974, 1077, -82332, 39848, 55540, -69083, -19768, 71652, -23316, -60900, 50557, 28893, -68032, 2788, 63215, -35080, -45778, 55708, 17862, -61603, 15328, 55341, -40541, -30109, 61315, 2817, -60867, 32854, 49776, -56533, -19864, 69501, -14377, -62422, 47506, 35745, -70011, 200, 68658, -42604, -51417, 69221, 11197, -81295, 29135, 64164, -66158, -30259, 80665, -15315, -70755, 56437, 39669, -76990, 7702, 77036, -47632, -47497, 77276, 9050, -77257, 36043, 57718, -64265, -18450, 72882, -23920, -58695, 55761]
382E5761l1691r6644Q4902M9860j10637Q833J03347o0924o7513R3028J5769r5674
394e1583L6548P3341p5129l0866R2141j6619q3920N8851N4985q4238j3652Q8296
406D8155l0417p0273O4833L4058q3683J0523P9526n4983n3650Q5432J0889r5166
418e4756L6555P9225p6880m0293R7403j1203q9244O1707N4318r4128Q22R9474
430F3000n7382p3536J00316K3881j13595L4311R2922q3011m2654J04688k1841
441B7099r2994P9003M9551j12676J0572J09993o8818p4466J05586J6321j10092
452f0921M4334Q0308q8240k6196J02861l3709q4182Q3775M0404j06536J4321R9786
464F6005o1506o5103Q8095J5111q6936L5642N9302p3050j5718Q7872l2276p9067
$$ y = [55761, 24070, -72574, 12328, 62188, -48449, -39616, 63731, 2807, -64706, 28322, 44091, -51583, -15035, 58306, -16823, -47689, 44452, 27833, -56087, 2764, 57749, -26489, -40141, 48155, 17738, -52535, 12298, 46356, -37327, -26804, 52722, -2261, -55911, 29521, 40410, -54756, -18201, 61024, -15856, -56149, 41254, 30051, -59193, 2514, 56832, -37296, -36474, 63000, 5618, -67918, 32398, 56279, -57316, -23005, 69917, -13094, -55748, 48940, 27099, -65895, 13108, 62659, -50017, -39445, 70548, 1730, -72736, 32850, 49171, -60921, -16587, 63721, -24519, -50715, 52146, 18437, -65745, 18030, 58434, -48102, -33781, 66005, 4499, -60604, 27491, 42602, -44334, -8692, 50610, -22440, -38158, 49714, 17438, -61629]
476f1629O9779M9177q9446q152Q4173l3198n8046O3422J7201p6304K8945O7008
488E2930o7701l7470R0478l126q9217M5543O6359p6742k4074Q6563k3363p0471
500e0291O4951L0639q7096K0955Q3537p1435n4625J02544Q447j06256L9572P7664
512E8606p5623k5790Q5842l5313o7456Q6307K5714j10549K5369J03491o9754o4938
524f4094R3114R848q6633M5771N3887q3191l822R3337m7694p3255Q4589L1892
536E3749r8118J6693Q4148n7730m9240P6961L144p2455M0707M4429p1696l488
548c2896Q2322l8474p2058O9841M5286q1478r042P1735k6358m1468N2876R87o2825
561d1552M1457N5418p3704l1730Q7604j103q0005L4258N1309n8140r948O3008
$$ y = [-61629, 8150, 57327, -32119, -40271, 43902, 10704, -47342, 16080, 33281, -43023, -14078, 52930, -14771, -52241, 38237, 35111, -54106, -8563, 57796, -18946, -43020, 43543, 20180, -50291, 14660, 45299, -41797, -20842, 62695, -8740, -63365, 39179, 47626, -58630, -19058, 58606, -17017, -42807, 43035, 7722, -59734, 26573, 52287, -58262, -32893, 70598, 844, -64094, 29020, 38868, -47765, -1994, 51893, -31298, -35120, 58217, 10523, -62732, 21857, 53749, -44369, -27676, 56472, -1258, -50498, 26463, 29607, -42848, -2141, 42288, -29408, -32896, 49426, 10952, -61106, 8735, 54021, -27457, -36499, 35236, 8878, -32590, 20286, 21273, -41552, -95, 55323, -18381, -50111, 37493, 36390, -43615, -9357, 41952, -16188, -26136, 36872]
573C6872l4246m8705O8090J5910q3335K4992P4171o2093m4904Q3966L626q1640
585d7296L7447N4946o4031j0236O9621l8037n1896P7974J7660r5142K2024Q6713
597E9747n4045n4157O7616P525n9299L7959L1212p0817P166P9961m4593o6933
609e8658O9212L5023p5061L576O0490l7601l0266N7800o578n7986M1396M0116
621D1463o3368r821P0173k2398n9537M8697L5375n9845m294N3804k6347l1273
633b7371M7819j272n7399L5445N0943o2708l1211P3153L244o6054K4863L9902
645B9354m4588l162N1210l5370m0968O5321J7029p6955J4241O9193m3007m0887
657c8589N9201L603n7846L4035L7381n9045m309O5921l3520n1933O2490K1611
$$ y = [36872, 2626, -46079, 22011, 37921, -45414, -20422, 53749, -8344, -53248, 30718, 34344, -47296, -9849, 45097, -18934, -29170, 40451, 2414, -49482, 28492, 46152, -48990, -26966, 59747, 5702, -48455, 19161, 26686, -32613, 5346, 36558, -34259, -27093, 52868, 8275, -58658, 10554, 45577, -29484, -25908, 34582, -3019, -33285, 24515, 17937, -40049, 1347, 41463, -21905, -31726, 38447, 16049, -43488, 5209, 40584, -19261, -23555, 30249, 3902, -27371, 20448, 19176, -38223, -2778, 48165, -14543, -45754, 27399, 30643, -35411, -10548, 29354, -15234, -18396, 32814, -2556, -43524, 21797, 38826, -38129, -23888, 45305, 2298, -38589, 20612, 24215, -33631, 404, 37785, -21260, -25569, 40352, 6832, -45101, 17389, 39000]
669C9000p4685J3480O4857m3294l7466N8150j740n3355M0079K9840o5680L472
681b7342P2411l5799n8047N7967K9223o2924P171M9298l8169k0763N6507j3353
693A6180n6397M3789L9612o2179j2440O3678j8102m9083M1768K1125n2488J0353
705a4184M6262l8228k6824N5485k337n7284L1339M4134n1896j9434N8636q678
717A6991m8540L4507K4564m8903P817M9211l8144l4034N9368P902o3759K0129
729a2891N0551m3484k2888N2965j2034m6122M1975K3881n9806O141N9425l6325
741A388m1019N5262J1506n8468K0936M4363m5419j6213N4822j5223m6869M3117
753H183K4556n6985N307N4521l2204l6359M8618Q684m9973J9699L5513m1187j1732
$$ y = [39000, -35685, -22205, 42652, -642, -38108, 20042, 18302, -35053, 5026, 34866, -30814, -27342, 45069, 9270, -48777, 9190, 38413, -24511, -17340, 31958, -6211, -26974, 29533, 16180, -40217, 3572, 43184, -18995, -31435, 32243, 14141, -34942, 6826, 27951, -24537, -14184, 32078, -6150, -32974, 22511, 20174, -37110, -5771, 38363, -13533, -32967, 25669, 16991, -31549, 2958, 27522, -21381, -13564, 35647, -2497, -36531, 22837, 30739, -33020, -12891, 37660, -5824, -28712, 24253, 12219, -33903, 8072, 31953, -27853, -21712, 37713, 1388, -39631, 15631, 27137, -31331, -10395, 33968, -11451, -27664, 27158, 11935, -34934, 8183, 32739, -24246, -18939, 35582, 3378, -32981, 15637, 24321, -25652, -5953, 29560, -11627, -23359]
766b3359M9192j5379m3548L7411K4862m9006l52M5595k2310l0942L8356Q395m2392
779b3477J5860L5143l4756j7663M5280m385m2666K5313K9435l8898q492M2511
791B3205j4755l4066L3765J5022m3011P786L9565k9385k5929M3075M049m5641
803b6320J9721L4128l8146j2630M4876j2520l8378L4362K0472m5885M363M4687
815B8730k7894k9223M3656N558m5877J9909L5132l9210j3233M6278j2424l9790
827b8388L4043K1117m6023L232M3521k6744k8812M1567N775m4775J8052L4230
839B6795l6319j4137M3757r048l8078K9654K2022m0906L10M0832k1855k8321L7006
852A1712R007m1340J3109L4071l1223j6608L9676n335l7495K5244K3936l8929
$$ y = [-23359, 25833, 10454, -33094, 4317, 29179, -19827, -20179, 25416, 3106, -27836, 10520, 18915, -23477, -7617, 27526, -7230, -24893, 20387, 16002, -26664, -1351, 28084, -10814, -19306, 23205, 8450, -25616, 8149, 23171, -19840, -12054, 27511, -1874, -27803, 15272, 19321, -26320, -6599, 27529, -10617, -23247, 21629, 9109, -29269, 5093, 25565, -20320, -15957, 28730, 836, -28387, 15269, 20827, -25050, -5141, 29991, -9219, -22452, 23826, 11402, -28388, 5655, 26772, -19251, -16019, 27502, 758, -28054, 13513, 19288, -25487, -7435, 26795, -9524, -23661, 20096, 11048, -27030, 2624, 24646, -16260, -15950, 24882, 3027, -25294, 11712, 20719, -20621, -7512, 26559, -4664, -21272, 18404, 13069, -24426, 818, 24754, -14175]
864a4175l820M0791j7942l1436L4260J2419m0627R546L5962k9860j9472M0603
876A6249j762l9505K3157K7837l7963p105M2269j5454l3180L3385J4908m1179
888a8343P847L6494k8091k1469L9733n70m0119K2287K7311l6562p851L9986j4346
901F307l1683L1345J4139l9356Q049L4996k6663k0537L7917N20l7327J9498K6698
914B3903l3036q039L7338j2532l0053K9021J4350l6656N063L3603k3118k1422
926b1578L3899L101l5880J5197K7152k9426j1406L5279q075l0964K4502J7955
938A9756l4079O5L4798j8385k4584L1598Q353l5181J0609K9486k6263j4797L4882
951A6258m701l2667K2650K0834l4353k761L5608j6369k7289L0674J0095l6529
$$ y = [-14175, -17995, 22796, 4854, -26582, 7678, 20097, -20530, -10984, 24978, -4882, -24354, 16249, 14487, -25018, -1861, 25976, -11987, -19092, 23177, 7723, -25457, 7928, 22836, -18343, -10496, 25998, -2093, -23562, 16171, 15601, -24518, -2231, 25080, -11482, -19333, 20653, 6307, -25376, 5969, 20108, -19248, -11199, 23797, -2866, -23403, 14514, 15034, -22293, -2795, 23903, -9133, -17172, 20166, 7634, -22419, 6602, 20952, -15704, -10641, 22962, -156, -21578, 12321, 15422, -20458, -5261, 21891, -7535, -18941, 16338, 8263, -22701, 1801, 19756, -14323, -14258, 20540, 2155, -22429, 9169, 17522, -17659, -7050, 22436, -3827, -18624, 16258, 11557, -21110, 1540, 22374, -11979, -14740, 20868, 4499, -22790, 7884, 17979, -18550]
963a8550R901L0659k7373j5644L6137m495l3996K3538K1735l5052k942L7364j7055
976D227k6885L0957J0215l6134J0592L0048k7190j4788L5362m177l3173K1665
988G19K1497l2881m257L3835j4401k5216K7271R037l2049Q597K7609k4458j5088
1001a9785L2603j819l1002J7678K1271k7624n745L0288j0662k3581K4422J0510
1013A6554l0657O248K8155k0947j7533K9678K323l0469J3870K1617k5432q065
1025a4658K9760r260k5219K2980J3231l1040K791K9984j7950k0743K8252N604
1037A3732k9782J1038K2676k3619q438K9479p982k6284K2918J5268l0634j2L0048
1050A8408j5042k0367K5076N033k7858J1021K1725k4444r263K9732n963k7235
$$ y = [-18550, -8649, 22010, -5363, -21007, 15130, 10635, -23361, 177, 21912, -13140, -16082, 21282, 4227, -22658, 8299, 18514, -17620, -7028, 23020, -4170, -18958, 16404, 12227, -20946, 719, 22216, -10665, -14922, 18913, 4512, -20704, 6567, 15604, -16445, -7848, 19761, -4697, -19785, 12818, 10999, -20003, -2325, 18946, -8678, -14423, 15865, 5203, -18378, 6044, 16554, -14103, -7855, 20300, -647, -18180, 11498, 13821, -16648, -2778, 18839, -6593, -14658, 15102, 5842, -19377, 3603, 16834, -14206, -11415, 18569, 619, -20124, 8128, 13732, -16050, -5012, 17664, -5955, -14393, 15086, 7104, -19180, 3738, 19006, -11628, -11640, 18408, 3366, -17001, 8075, 13108, -14750, -3729, 17996, -6448, -15711, 14021, 8058, -19177]
1062a9177J9197J6939k7389k139K7511j2679j9212K2982O445k6736R021K3210
1074A7973k2168j1824K9186k112k7419J5015J9269k3929n501K5486r981j9615
1086a5620K1998P407k7998O627K5675j9234j6885K6644K455k6519J2373J8337
1098A5260k2920n130K6964r696k2610K2573J1281k8664L696K7295j7268j7550
1110a6769K5943L538k6628J1651J8992k2942o169K7725r809k4063K2654J3280
1122A7403k9283M76K7256j4565j7325K3335K418k5001J2783J8892k4276p185K8910
1135A3838o416k4886J8730J4153k4678N70K3531j3918j5084K3047K424k5245J1195
1148b739K0002k2162q744K6320n052k3487J6126J4026k2451j578K2370j2279j5276
$$ y = [-19177, 20, 16959, -10430, -12569, 14942, 2263, -16949, 6033, 12478, -14258, -5237, 17973, -4195, -16019, 13167, 11055, -16364, -1349, 17920, -6009, -11510, 13976, 3995, -15620, 6378, 13785, -14213, -7586, 18089, -1145, -18030, 8614, 11069, -15450, -3077, 15260, -7660, -12790, 14174, 4478, -18132, 4441, 15722, -12942, -9246, 18049, 781, -16769, 9174, 12712, -13916, -2265, 16727, -6215, -12384, 15341, 5532, -18531, 4123, 17403, -11880, -11404, 15852, 1287, -16038, 7297, 9715, -15286, -2503, 16389, -7887, -15072, 13838, 7422, -17464, 1266, 15419, -9259, -8689, 14842, 924, -14160, 8887, 11311, -13934, -2739, 17263, -4899, -13643, 12677, 7625, -15862, 264, 14290, -8161, -9739, 12631, 352, -14924]
1161a4924K1915L667k5735R528K1965j9341j2528K4755l59k2187J2844J3906k1268
1174g762j060K3849j2250j8558K1971Q042k5182L696K2410j6024j2619K2500p11
1187H302k2239J2906J4728k1912k866K4173j0257j9317K0354R365k4649L509K1986
1200A4083j5059j2242K1822o17k1547J3940J4953k2749l857K5256q291k0446J8063
1213C309R701k1905K622J9591j4449j1637K1688m40k2663J1887J6540k0235o358
1226a2349K2659n719j8404J5416R731k0205J937J9316j2408j2597J9963K246k1489
1239a1903R100J7288j7598p817K0742l385j8055J3394R999j9458R58J9806j2626
1252D45j4476J9664M868k1965N972J7820j5575q559K0226k720j9035J4176J1541
$$ y = [-14924, 6991, 10658, -15077, -5549, 16416, -2925, -15453, 9302, 8943, -13244, -400, 13506, -7762, -8822, 15027, 2777, -15781, 6190, 14232, -10950, -7254, 15156, -868, -13487, 9013, 8302, -13937, -1031, 13697, -8215, -11081, 13092, 2835, -16482, 3872, 13237, -11412, -7903, 14083, -976, -13218, 8604, 7987, -13560, 380, 15333, -7416, -11273, 13983, 5692, -14754, 3309, 13010, -8895, -6273, 13318, -1131, -12768, 8920, 8480, -14183, -2296, 14244, -5991, -12349, 10310, 4591, -13813, 1603, 11334, -8871, -6934, 12382, -26, -12623, 7340, 9586, -11903, -2803, 14485, -3113, -10930, 9812, 6427, -11628, 1766, 11765, -7693, -6735, 13071, 445, -14031, 5633, 10501, -11464, -5492, 12328, -3247, -11806, 8420, 5700, -13335, 841, 12382]
1265A2382k0053j097K0987r435j6070J8192O451k1010N203J7560j4635r235J9823
1278I063k024j9194J2475J2568j9408k827K0422q118j5835J5905P052j9712M012
1291e621J6904j3730r456J9435n09j9628J1026J4255j7888m329J9681n655j6471
1304a1986J4980P987j8896K594J7957j2578j1781J9109J318j9664Q672J4435j6475
1317d328n738J9350n002j6714J3889R218j9526J661J8675j1507j2538J8204L154
1330H798j9936P940J5820j5871o412J9185l781j7413J3583J0068j9250N50J8881
1343A2162j0891j3260J7666L668j9838P268J5253j5621p217J9090l210j7457J2920
1356E33J0432j8573j76J8467r607j2706J6457M127j8817O209J5751j4356p591
$$ y = [12382, -7671, -8768, 12219, 2784, -13286, 4906, 11357, -9653, -4450, 13110, -1525, -10760, 9063, 7039, -12155, 320, 12888, -6520, -9347, 11075, 2957, -12878, 3027, 10079, -9633, -5621, 11283, -2447, -11903, 7532, 7023, -12605, -1579, 12676, -5212, -9541, 10140, 4485, -11986, 2994, 10981, -7915, -5321, 12636, 58, -11723, 7386, 8704, -10960, -2288, 12147, -4328, -10066, 9284, 4282, -12432, 1457, 10675, -8851, -7190, 11485, -22, -12560, 5644, 8798, -11138, -3198, 12622, -3249, -9661, 9524, 5743, -11670, 1913, 11981, -7269, -6719, 12162, 1271, -11989, 5677, 9345, -10493, -3225, 12028, -3593, -10810, 8280, 5070, -12387, 533, 10965, -7608, -7784, 10683, 1076, -11630, 4827, 8954, -9863, -3654, 12097, -2259, -9850]
1369i850J8498k508j6798J1522J0420j7262j011J7780q502j3763J5494N091j7944
1382h833M438J5174j2867q370J7382j548j6201R996J0916j5985k234J7178o348
1395B698j3394J3919N992j7009L618J5210j1829q533J6346N3j6692R056J1690
1408A1125j5237l735J6803n644j3659J2612O574j6502K475J4653j0712r317J5900
1421E336R02j6272Q094J1878j4082m190J6300m425j3332J2117O733j5667J790
1434d818J4704r486r688J4804J870j5712O667J1729j3041m775J5224l728j3246
1447i496J0436P618j5260O16J4697q467r926J3430L242j5221N143J2364j1400
1460b224o002J4938k207j3363R563Q655j4212p24J4447o536j1227J2508M366j4637
$$ y = [-9850, 8648, 6140, -10658, 864, 11284, -5978, -6989, 10791, 2289, -11474, 4020, 9111, -8833, -4395, 10779, -2088, -10458, 6924, 5376, -10825, -829, 10087, -5898, -8132, 9046, 2698, -10696, 3223, 9215, -7794, -4176, 11034, -795, -9328, 7018, 7071, -9621, -565, 11125, -4112, -7847, 8956, 3312, -10347, 2265, 8839, -7663, -5188, 9465, -1247, -10564, 5336, 6238, -10034, -1940, 9938, -4144, -8334, 7966, 3541, -9791, 2326, 9059, -6608, -4818, 9886, 400, -9288, 5516, 7386, -8326, -1659, 10070, -2971, -7746, 7478, 3750, -9496, 940, 8558, -6702, -6086, 8611, 144, -9782, 3648, 6890, -8331, -3188, 9176, -2224, -8226, 6712, 4505, -8858, 705, 9360, -4852, -5576, 8871, 2335, -8892, 3616, 7982, -6655]
1474f655L229J2516j0457p208J4304q63j3945Q184R498j3479k414J5053n990j1575
1488i802J2186M844j4111K831J3134r859p524J4147m09j3663P822J0081j3136
1501c459l318J4829m898j1983J1210N374j3684J715J2784r523p808J3714P58j4459
1515h748O989J0466j2268l938J3815l583j1461J0087O057j3143J442J2916q637
1528fp919J3138J354j3989N645J1133j1379m667J3208k845j1411R299N925j3108
1542e622Q48J2915p831r301J2483K703j3660M456J0652r916m476J2379k350j1711
1556h431R567O914j3214j26J3738o516j0292J1566L928j3034L665J0404r932m808
1570f571J2586j896j2597Q725Q158j3057j841J3512n205j0196J0651L366j2077
$$ y = [-6655, -3426, 9090, -1367, -8575, 5729, 4866, -9079, -895, 8603, -4876, -7290, 7763, 1773, -9802, 2384, 7228, -6883, -4052, 9082, -777, -8301, 5846, 5437, -8226, -404, 9677, -3459, -6777, 8052, 3154, -8829, 2381, 7755, -5929, -4214, 8570, -953, -8761, 4953, 5711, -8748, -1759, 8707, -3561, -7499, 6316, 2733, -8728, 1359, 7416, -5727, -4285, 8631, -6, -7925, 5213, 6567, -7422, -1777, 9356, -2023, -6690, 6518, 3673, -7738, 1561, 7486, -5622, -4774, 8141, 310, -8991, 3492, 6195, -7465, -3009, 7643, -2273, -6749, 5630, 3280, -8431, 1136, 8050, -5164, -5290, 8448, 1932, -8360, 3206, 7134, -5900, -2235, 8169, -1763, -6571, 6015, 4119, -8478, 247, 8405, -4652, -6493, 7019, 1814, -8382, 2269, 5635, -6442]
1583f442L684J0185r801n007J3293j420j2630P596R074j1765k452J2270m219q986
1597f620R448L515j2243L662J0596r330o590J2387Q26j3112N660R127r996k977
1611e647J1298m442q569R400M053j2548K342J2109q241p853J1643K011j1482M291
1625a635Q461r048k558J1127m191r556R767M880j2320Q09J1933o449q443R933
1639B710K218j0523M224P518r353k551J1781l393j1109Q728P030j1396j430J1359
1653E813m320q017R056K117j0190M626Q336r457m287J2529j834j1191O571P538
1667G290r869j854R828m443p111Q714K073j0885L730R760q750n997J1324O25j0733
1682f298M819P097q174j346R026m355p211R636L188j1864K279J0716o758p201
$$ y = [-6442, -2758, 7427, -2374, -7381, 5912, 4492, -8138, -542, 8532, -3233, -5685, 6585, 2366, -6620, 2828, 6343, -5900, -2238, 8358, -972, -7562, 4825, 5651, -7461, -1801, 7326, -2670, -5647, 5651, 1209, -7360, 2040, 6093, -6455, -4113, 7996, -245, -8098, 3545, 5556, -5926, -1635, 6826, -2222, -4780, 6347, 2156, -7400, 2367, 7247, -5073, -4264, 7669, 1220, -7223, 2710, 4928, -5595, -1371, 6147, -3206, -5757, 6024, 2631, -8478, 250, 7280, -4116, -5546, 5813, 1493, -6524, 2532, 4649, -5541, -915, 7421, -2036, -6323, 6206, 4372, -6819, -248, 7290, -2579, -4433, 5395, 952, -6159, 2555, 4628, -6257, -2527, 7233, -1517, -7514, 3810, 4435, -6298, -1479, 5618, -2556, -3902, 5124, 769, -6442, 3194, 6382, -5482, -3203, 7513, 755, -6446]
1696f446R834J323r602M074O683q881j473J0767m592r288Q879N273j1467J88J0500
1711E772n475o916R260J037r212M754O979r237k433J1612l116j0421Q606N836
1725G046j0515r9R352n036n901Q888M59r973N259P682r605l769J1210j614r855
1740f471O081N805r161P9Q815n674n861R825Q59j0477M217Q832p948m692R912
$$ y = [-6446, 3388, 4711, -4891, -817, 5866, -3015, -4488, 6279, 1687, -7601, 1278, 6551, -4916, -4728, 5772, 297, -6619, 2641, 3678, -5534, -780, 6199, -3038, -5471, 6141, 3025, -7396, 1210, 7046, -3469, -3568, 5784, 748, -5153, 3735, 4194, -5779, -520, 7162, -2443, -6212, 4998, 3384, -6471, -390, 5415, -3746, -3667, 5148, -526, -6387, 3438, 4297, -6180, -1963, 6869, -1079, -5771, 4141]
$$ [...]
8191f
##END NTUPLES=NMR FID
##END=
