##TITLE=1H_Pr 5378
 200.13Hz, CD3OD.
 8 sc
 27.7.2026
##JCAMPDX= 6.0         $$ Bruker NMR JCAMP-DX V2.0
##DATA TYPE= NMR FID
##DATA CLASS= NTUPLES
##ORIGIN= UXNMR, Bruker Analytische Messtechnik GmbH
##OWNER= pz
$$ XWIN-NMR		Version 3.5
$$ Mon Jul 27 13:27:59 2026 Russian Standard Time (UT+4h)  she@DPX200
##.OBSERVE FREQUENCY= 200.1313
##.OBSERVE NUCLEUS= ^1H
##.DELAY= (6, 6)
##.ACQUISITION MODE= SIMULTANEOUS
##.ACQUISITION SCHEME= undefined
##.AVERAGES= 8
##.DIGITISER RES= 18
##SPECTROMETER/DATA SYSTEM= spect
##.PULSE SEQUENCE= zg30
##.SOLVENT NAME= MeOD
##.SHIFT REFERENCE= (INTERNAL, MeOD, 0, 14.3821)
##AUDIT TRAIL= $$ (NUMBER, WHEN, WHO, WHERE, WHAT)
$$ ##TITLE= Audit trail, XWIN-NMR		Version 3.5
$$ ##JCAMPDX= 5.01
$$ ##ORIGIN= Bruker BioSpin GmbH
$$ ##OWNER= she
$$ F:/spectra/data/she/nmr/H-C/1/audita.txt
$$ ##AUDIT TRAIL=  $$ (NUMBER, WHEN, WHO, WHERE, WHAT)
(   1,<2026-07-27 13:26:23.81 +0400>,<she>,<DPX200>,
      <created by zg, POWCHK disabled, PULCHK disabled
       configuration hash MD5:
       00 E9 B6 7A A2 85 ED C7 34 08 36 98 17 FE 4E 26
       data hash MD5: 16K
       93 DB CC 61 57 DC AC 61 9D 1B 03 17 39 42 7E 5A>)
$$ ##END=
$$ 
$$ hash MD5
$$ F6 78 92 E6 E8 E6 8F 8E 50 1A 8E D1 72 1F E5 14
##$RELAX= 
##$RELAX= 
##$RELAX= 
##$RELAX= 
##$RELAX= 
##$RELAX= 
$$ Bruker specific parameters
$$ --------------------------
##$DU= <F:/spectra>
##$EXPNO= 1
##$NAME= <H-C>
##$PROCNO= 1
##$TYPE= <nmr>
##$USER= <she>
##$AMP= (0..31)
100 100 100 100 100 100 100 100 100 100 100 100 100 100 100 100 100 100 
100 100 100 100 100 100 100 100 100 100 100 100 100 100 
##$AQSEQ= 0
##$AQ_mod= 1
##$AUNM= <au_zg>
##$AUTOPOS= <>
##$BF1= 200.13
##$BF2= 200.13
##$BF3= 200.13
##$BF4= 200.13
##$BF5= 200.13
##$BF6= 200.13
##$BF7= 200.13
##$BF8= 200.13
##$BYTORDA= 1
##$CFDGTYP= 0
##$CFRGTYP= 5
##$CHEMSTR= <none>
##$CNST= (0..31)
1 1 145 1 1 1 1 1 1 1 1 1 1 1 1 1 1 1 1 1 1 1 1 1 1 1 1 1 1 1 1 1 
##$CPDPRG= <>
##$CPDPRG1= <>
##$CPDPRG2= <>
##$CPDPRG3= <>
##$CPDPRG4= <mlev>
##$CPDPRG5= <mlev>
##$CPDPRG6= <mlev>
##$CPDPRG7= <mlev>
##$CPDPRG8= <mlev>
##$CPDPRGB= <>
##$CPDPRGT= <>
##$D= (0..31)
0 0.7 0 0 0 0 0 0 0 0 0 0.03 0 0 0 0 0 0 0 0 0 0 0 0 0 0 0 0 0 0 0 0 
##$DATE= 1785144383
##$DBL= (0..7)
120 120 120 120 120 120 120 120 
##$DBP= (0..7)
150 150 150 150 150 150 150 150 
##$DBP07= 0
##$DBPNAM0= <>
##$DBPNAM1= <>
##$DBPNAM2= <>
##$DBPNAM3= <>
##$DBPNAM4= <>
##$DBPNAM5= <>
##$DBPNAM6= <>
##$DBPNAM7= <>
##$DBPOAL= (0..7)
0.5 0.5 0.5 0.5 0.5 0.5 0.5 0.5 
##$DBPOFFS= (0..7)
0 0 0 0 0 0 0 0 
##$DE= 6
##$DECBNUC= <off>
##$DECIM= 32
##$DECNUC= <off>
##$DECSTAT= 4
##$DIGMOD= 1
##$DIGTYP= 9
##$DL= (0..7)
0 120 120 120 120 120 120 120 
##$DP= (0..7)
150 150 150 150 150 150 150 150 
##$DP07= 0
##$DPNAME0= <>
##$DPNAME1= <>
##$DPNAME2= <>
##$DPNAME3= <>
##$DPNAME4= <>
##$DPNAME5= <>
##$DPNAME6= <>
##$DPNAME7= <>
##$DPOAL= (0..7)
0.5 0.5 0.5 0.5 0.5 0.5 0.5 0.5 
##$DPOFFS= (0..7)
0 0 0 0 0 0 0 0 
##$DQDMODE= 0
##$DR= 18
##$DS= 0
##$DSLIST= <SSSSSSSSSSSSSSS>
##$DSPFIRM= 0
$$ [...]
##$SUBNAM0= <"">
##$SUBNAM1= <"">
##$SUBNAM2= <"">
##$SUBNAM3= <"">
##$SUBNAM4= <"">
##$SUBNAM5= <"">
##$SUBNAM6= <"">
##$SUBNAM7= <"">
##$SUBNAM8= <"">
##$SUBNAM9= <"">
##$SW= 18.0517328524113
##$SWIBOX= (0..15)
0 0 2 0 0 0 0 0 0 0 0 0 0 0 0 0 
##$SW_h= 3612.71676300578
##$TD= 16384
##$TD0= 1
##$TE= 0
##$TE2= 300
##$TE3= 300
##$TEG= 300
##$TL= (0..7)
0 120 120 120 120 120 120 120 
##$TP= (0..7)
150 150 150 150 150 150 150 150 
##$TP07= 0
##$TPNAME0= <>
##$TPNAME1= <>
##$TPNAME2= <>
##$TPNAME3= <>
##$TPNAME4= <>
##$TPNAME5= <>
##$TPNAME6= <>
##$TPNAME7= <>
##$TPOAL= (0..7)
0.5 0.5 0.5 0.5 0.5 0.5 0.5 0.5 
##$TPOFFS= (0..7)
0 0 0 0 0 0 0 0 
##$TUNHIN= 0
##$TUNHOUT= 0
##$TUNXOUT= 0
##$USERA1= <user>
##$USERA2= <user>
##$USERA3= <user>
##$USERA4= <user>
##$USERA5= <user>
##$V9= 5
##$VALIST= <valist>
##$VCLIST= <CCCCCCCCCCCCCCC>
##$VD= 0
##$VDLIST= <DDDDDDDDDDDDDDD>
##$VPLIST= <PPPPPPPPPPPPPPP>
##$VTLIST= <TTTTTTTTTTTTTTT>
##$WBST= 1024
##$WBSW= 4
##$XGAIN= (0..3)
0 0 0 0 
##$XL= 0
##$YL= 0
##$YMAX_a= 304044
##$YMIN_a= -351096
##$ZGOPTNS= <>
##$ZL1= 120
##$ZL2= 120
##$ZL3= 120
##$ZL4= 120
##$ABSF1= 10
##$ABSF2= 0
##$ABSG= 5
##$ABSL= 3
##$ALPHA= 0
##$AQORDER= 0
##$ASSFAC= 0
##$ASSFACI= 0
##$ASSFACX= 0
##$ASSWID= 0
##$AUNMP= <proc_1d>
##$AZFE= 0.1
##$AZFW= 0.1
##$BCFW= 1
##$BC_mod= 2
##$BYTORDP= 1
##$COROFFS= 0
##$CY= -3
##$DATMOD= 1
##$DC= 2
##$DFILT= <>
##$DTYPP= 0
##$F1P= 0
##$F2P= 0
##$FCOR= 0.5
##$FTSIZE= 0
##$FT_mod= 4
##$GAMMA= 1
##$GB= 0.15
##$INTBC= 1
##$INTSCL= 1
##$ISEN= 128
##$LB= 0.25
##$LEV0= 0
##$LPBIN= 0
##$MAXI= 10000
##$MC2= 0
##$MEAN= 0
##$ME_mod= 0
##$MI= 1.114404
##$NCOEF= 0
##$NC_proc= 0
##$NLEV= 6
##$NOISF1= 3.799351
##$NOISF2= 2.8
##$NSP= 1
##$NTH_PI= 0
##$NZP= 0
##$OFFSET= 14.38212
##$PC= 1
##$PHC0= -4135.355
##$PHC1= 13.5923
##$PH_mod= 1
##$PKNL= yes
##$PPARMOD= 0
##$PSCAL= 0
##$PSIGN= 0
##$REVERSE= no
##$SF= 200.129724274929
##$SI= 16384
##$SIGF1= 3
##$SIGF2= 2
##$SINO= 400
##$SIOLD= 16384
##$SREGLST= <1H.CDCl3>
##$SSB= 0
##$STSI= 0
##$STSR= 0
##$SW_p= 3205.1282051282
##$SYMM= 0
##$S_DEV= 0
##$TDeff= 0
##$TDoff= 0
##$TI= <>
##$TILT= no
##$TM1= 0
##$TM2= 0
##$TOPLEV= 0
##$USERP1= <user>
##$USERP2= <user>
##$USERP3= <user>
##$USERP4= <user>
##$USERP5= <user>
##$WDW= 1
##$XDIM= 8192
##$YMAX_p= 0
##$YMIN_p= 0
$$ End of Bruker specific parameters
$$ ---------------------------------
##NTUPLES= NMR FID
##VAR_NAME=  TIME,          FID/REAL,        FID/IMAG
##SYMBOL=    X,             R,               I
##VAR_TYPE=  INDEPENDENT,   DEPENDENT,       DEPENDENT
##VAR_FORM=  AFFN,          ASDF,            ASDF
##VAR_DIM=   8192,          8192,            8192
##UNITS=     SECONDS,       ARBITRARY UNITS, ARBITRARY UNITS
##FACTOR=    0.0002768,     1,               1
##FIRST=     0,             0,               0
##LAST=      2.2672688,     0,               0
##MIN=       0,             -351096,         0
##MAX=       2.2672688,     304044,          0
$$ Real data points
##PAGE= N=1
##DATA TABLE= (X++(R..R)), XYDATA
$$ [...]
$$ plain form
481 9349 -1018 -10971 -17661 -19134 -15119 -6767 3450 12680 18156 18207 12928 4007 -5890 -13990 -18038
496 -18038 -16770 -10654 -1603 7875 15041 17739 15254 8332 -910 -9789 -15792 -17102 -13366 -5847 3225
511 3225 11261 16031 16131 11494 3583 -5305 -12646 -16202 -14944 -9348 -1207 7169 13440 15819 13582
526 13582 7406 -830 -8769 -14099 -15272 -11938 -5279 2817 10100 14478 14550 10277 3086 -4764 -11146
541 -11146 -14307 -13371 -8564 -1363 6259 12056 14266 12233 6598 -743 -7733 -12488 -13650 -10829 -4849
556 -4849 2434 8882 12760 12965 9359 3100 -4026 -9944 -12937 -12133 -7730 -1207 5499 10548 12566 11014
572 11014 6258 -318 -6758 -11138 -12255 -9787 -4522 1958 7797 11396 11626 8501 2903 -3469 -8699
587 -8699 -11356 -10801 -7178 -1432 4652 9368 11325 9921 5613 -204 -5855 -9717 -10807 -8833 -4295
$$ packed form
481I349j0367r953o690j473M015Q352J0217R230N476N1n279q921r897q100m048
496a8038J268O116R051R478P166K698k485o922r242q879o003j310L736P519R072
511C225Q036M770J00m637p911q888p341l556J258N596Q141Q376O271K379k237
526A3582o176q236p939n330j173L334O659Q096P283M378P2m273p191p850o382
541a1146l161R36M807P201P622N797K210k033n635p341o990m755j162K821N980
556d849P283O448L878K05l606o259p126n918k993Q04M403O523O706N049K018j552
572A1014m756o576o440m380j117K468N265O480N839L599K30l125n598o372n230
587h699k657N55L623N746O084M716J957j404m308n817n651l862j090J974M538
$$ plain form
602 -4295 1482 6747 10015 10354 7705 2864 -2809 -7553 -10035 -9644 -6475 -1411 3970 8104 9840 8800
618 8800 5233 144 -4986 -8601 -9682 -7945 -3862 1276 5914 8778 9115 6881 2667 -2373 -6626
633 -6626 -8883 -8543 -5786 -1383 3405 7146 8781 7842 4587 135 -4395 -7519 -8406 -6949 -3534 968
649 968 5180 7778 8087 6036 2345 -2066 -5827 -7820 -7512 -5076 -1219 3011 6271 7679 6832 4065
665 4065 123 -3846 -6661 -7461 -6057 -2976 960 4590 6802 6973 5225 1961 -1808 -5066 -6822 -6529
681 -6529 -4388 -993 2705 5529 6706 5967 3464 49 -3402 -5797 -6450 -5274 -2639 807 3976 5937
697 5937 6157 4573 1716 -1609 -4435 -5908 -5681 -3835 -915 2269 4739 5831 5211 3096 131 -2876
713 -2876 -4984 -5645 -4644 -2343 607 3326 5036 5273 4038 1682 -1192 -3682 -5080 -5008 -3496 -973
$$ packed form
602d295N777N265L268L39k649m841n673m744k482L91L169N064N381M134J736j040
618H800l567n089n130l615j081J737M083N138M638K864L37k234m214n040m253
633f626k257L40K757M403M788L741J635r39l255m452m530l124q87J457L415M502
649I68M212K598L09k051l691m411l761j993L08K436L857M230L260J408q47k767
665D065l942l969k815q00J404L081L936L630K212J71j748l264l769l258j756K93
681f529K141L395L698K824J177p39k503l415l451k395o53J176K635L446L169J961
697E937K20j584k857l325k826j473K27J846K920L184K470J092o20k115k965l007
713b876k108o61J001K301K950K719J710K37j235k356k874k490j398P2J512K523
$$ plain form
729 -973 1820 3980 4983 4569 2852 309 -2255 -4171 -4827 -4118 -2271 259 2688 4281 4606 3657 1618
746 1618 -849 -3011 -4306 -4305 -3134 -1118 1289 3269 4248 4022 2627 513 -1760 -3469 -4143 -3611 -2117
763 -2117 73 2153 3604 3944 3226 1591 -530 -2467 -3622 -3744 -2788 -1062 1001 2740 3633 3448 2353
780 2353 575 -1357 -2864 -3553 -3179 -1948 -129 1714 3005 3422 2834 1503 -293 -1980 -3011 -3215
796 -3215 -2535 -1112 658 2171 3025 2990 2167 662 -988 -2373 -2991 -2803 -1788 -293 1303 2477 2895
813 2895 2518 1429 -31 -1497 -2514 -2801 -2254 -1080 402 1697 2535 2593 1956 765 -662 -1865 -2504
830 -2504 -2452 -1697 -478 874 1948 2427 2242 1384 143 -1104 -2013 -2347 -2025 -1119 100 1253 2068 2261
848 2261 1778 840 -382 -1410 -2064 -2115 -1535 -550 561 1531 2029 1955 1303 304 -773 -1633 -1984 -1781 -1063
$$ packed form
729i73K793K160J003m14j717k543k564j916o56P09J847K530K429J593L25r49k039
746A618k467k162j295JJ171K016K407J980R79k26j395k114k273j709o74N32J494
763b117K190K080J451L40p18j635k121j937j155j22R56J726K063J739Q93j85j095
780B353j778j932j507o89L74J231J819J843J291M17n88j331j796j687j031k04
796c215O80J423J770J513Q54l5q23j505j650j385o18J88J015J495J596J174M18
813B895l77j089j460j466j017k87N47J174J482J295Q38N8o37j191j427j203o39
830b504N2P55J219J352J074M79j85q58j241j247r09l34L22R06J219J153Q15J93
848B261m83r38j222j028o54n1N80R85J111R70M98p4o52r99j077q60l51K03P18
$$ plain form
867 -1063 -50 945 1645 1911 1606 829 -187 -1117 -1695 -1802 -1377 -588 399 1241 1702 1656 1190 360 -557 -1304
887 -1304 -1665 -1592 -982 -151 731 1373 1602 1397 768 -72 -872 -1367 -1559 -1243 -565 224 957 1391 1419 1075 380
908 380 -375 -1060 -1382 -1355 -938 -235 506 1085 1370 1220 748 76 -603 -1114 -1304 -1077 -610 51 684 1140 1220
929 1220 993 461 -195 -753 -1128 -1178 -894 -332 287 801 1107 1069 766 202 -354 -857 -1090 -1017 -661 -116 451
950 451 886 1041 909 521 -18 -502 -903 -1023 -795 -464 55 545 882 971 766 362 -142 -595 -873 -918 -669
971 -669 -289 226 638 855 828 603 168 -252 -630 -869 -813 -557 -104 298 675 806 785 481 66 -397 -679
992 -679 -822 -707 -364 13 405 685 775 650 329 -57 -445 -682 -775 -591 -288 105 478 695 757 584 239
1013 239 -163 -533 -730 -738 -521 -191 226 569 741 720 475 148 -261 -591 -734 -683 -453 -112 337 589 729
$$ packed form
867a063J013R95P00K66l05p77j016r30n78j07M25P89R87Q42M61m6m66q30r17p47
887a304l61P3O10Q31Q82O42K29k05o29q40q00m95j92L16O78P89P33M34K8l44o95
908C80p55o85l22K7M17P03P41N79K85j50m72o72o79n11j90K27M67O61O33M56Q0
929A220k27n32o56n58l75n0K84N62O19N14L06l8l03n64n56n03k33P3L56N45N67
950D51M35J55j32l88n39m84m01j20K28L31N19M90L37Q9k05m04n04m53k78m5K49
971f69L80N15M12K17k7k25m35m20l78k39N6K56M53M02L77J31k1l04m15m63k82
992f79j43J15L43L77L92K80R0j25l21l86l88k37r3J84L03L93L73K17O2j73l45
1013B39m02l70j97qK17L30M17L43J72k1k45l27m09l30j43N1K30L41M49K52J40
$$ plain form
1034 729 658 409 42 -361 -625 -736 -648 -383 11 409 676 753 624 312 -93 -454 -741 -763 -580 -232 155
1055 155 517 756 763 559 208 -223 -622 -789 -764 -508 -153 281 635 833 735 455 56 -386 -733 -849 -704
1076 -704 -403 43 459 752 822 687 330 -108 -532 -809 -824 -649 -227 192 598 861 825 575 171 -300 -686
1097 -686 -882 -817 -548 -68 392 757 888 728 468 -24 -514 -857 -889 -757 -352 137 611 882 919 657 258
1118 258 -262 -696 -917 -879 -565 -136 385 754 931 847 515 10 -480 -846 -964 -812 -400 80 589 930 966
1139 966 757 300 -231 -704 -968 -936 -680 -199 325 768 960 892 580 106 -446 -835 -991 -868 -458 42 544
1160 544 908 997 791 352 -187 -675 -963 -990 -704 -265 303 758 961 921 615 99 -417 -827 -1043 -907 -524
1181 -524 16 514 874 978 815 399 -131 -671 -966 -1016 -730 -296 269 735 961 924 631 118 -383 -800 -1007
$$ packed form
1034G29p1k49l67m03k64j11Q8K65L94L98K67P7j29l12m05l61k87k2J83L48L87
1055A55L62K39Pk04l51m31l99j67K5K56L55M34L54J98r8k80l99m42l47j16J45
1076g04L01M46M16K93P0j35l57m38m24k77j5J75M22M19M06K63l6k50m04m71l86
1097f86j96O5K69M80M60L65J31j60k60m92m90l43l2J32M05M89M74K71L7k62l99
1118B58n20m34k21L8L14M29N21L69J77q4l32n05m90l66j18J52M12M80N09L41L6
1139I66k09m57n31m73k64L2K56M81N24M43J92o8l12m74n52l89j56J23M10N00N02
1160E44L64Q9k06m39n39m88k88k7K86M39N68M55K03m0l06n16n16m10k16J36L83
1181e24N40M98L60J04j63m16n30n40k95n0K86M34N65M66K26l7k93n13n01m17k07
$$ plain form
1202 -1007 -879 -523 -41 497 862 987 835 392 -94 -611 -912 -966 -758 -295 216 687 966 952 663 168
1222 168 -374 -803 -979 -908 -569 -58 470 841 985 834 445 -87 -581 -935 -986 -768 -356 214 703 958 946
1243 946 675 229 -326 -792 -972 -904 -574 -83 448 867 1005 850 440 -85 -583 -922 -994 -765 -345 189 686
1264 686 943 971 676 178 -354 -808 -992 -922 -548 -43 480 847 998 844 443 -111 -600 -919 -999 -766 -306
1285 -306 233 680 944 942 685 203 -372 -791 -984 -917 -557 -24 495 893 988 836 446 -99 -621 -956 -970 -737
1307 -737 -299 240 698 965 930 631 157 -404 -749 -992 -855 -521 -38 479 865 960 818 407 -126 -626 -926
1328 -926 -949 -723 -236 258 706 928 886 602 131 -400 -777 -962 -855 -491 -8 487 824 915 771 380 -131
1349 -131 -588 -873 -915 -702 -274 244 692 922 875 581 131 -354 -755 -922 -848 -503 -23 474 806 923 754
$$ packed form
1202a007J28L56M82N38L65J25j52m43m86n17l01n4K08M63N11M71K79j4k89m95
1222A68n42m29j76P1L39N11N28L71J44j51l89n32m94l54n1K18M12N70M89K55j2
1243I46k71m46n55m66j80O8L30M91N31M19J38j55m10n25m98l39p2K29M20N34M97
1264F86K57K8k95m98n32m54j84P0L74N05N23L67J51j54m01n54m89l19q0K33M60
1285c06N39M47K64kk57m82n75m19j93O7L60N33N19L98R5j52l90n45n22l35j4K33
1307g37M38N39M58K67l5k99m74n61l45k43J37L34M83N17L86R5j42m11n33n00l00
1328i26k3K26M87M94M48K22m2k84m71n31l77j85J07L64M83M95L37R1j44l91n11
1349a31m57k85m2K13M28N18M48K30m7k94m50m85m01j67P4L45M80M97L32J17j69
$$ plain form
1370 754 391 -101 -563 -846 -913 -671 -261 210 636 866 826 559 140 -340 -725 -878 -792 -490 -17 437 761
1391 761 862 741 359 -119 -540 -845 -859 -651 -254 222 621 847 806 507 123 -338 -678 -863 -764 -474 2
1412 2 410 759 817 671 370 -101 -513 -769 -821 -628 -236 192 579 770 778 521 108 -311 -653 -818 -734 -443
1434 -443 -23 412 726 814 656 331 -103 -474 -748 -767 -614 -240 180 570 743 753 503 132 -261 -613 -759
1455 -759 -699 -449 -14 381 649 768 651 307 -97 -420 -695 -744 -577 -239 156 518 733 693 477 149 -281
1476 -281 -577 -735 -637 -413 -56 343 637 725 624 309 -61 -425 -667 -720 -546 -220 155 475 678 657 482
1497 482 134 -226 -519 -694 -646 -397 -55 307 578 670 605 318 -36 -376 -597 -664 -530 -222 127 463 655
1518 655 630 451 142 -229 -505 -665 -599 -370 -56 294 551 633 550 302 -52 -372 -593 -625 -514 -210 141 437
$$ packed form
1370G54l63m92m62k83o7K42M10M71M26K30m0k67m19m80l85j53Q6L02M73M54L24
1391G61J01j21l82m78m21l05j4K08L97M76L99K26m1k99l84m61l40j85R9K90M76
1412BM08L49N8j46l01m71m12k56n2J93L92M28L87J91Qk57m13m19l42j65Q4K91
1434d43M20M35L14Q8j58l25m34l71k74j9J53L74M20L90J73J0k50l71l93l52j46
1455g59O0K50M35L95K68J19j17l44m04l23k75m9J67L38L95L62K15m0k16l28m30
1476b81k96j58R8K24L57L99K94Q8j01l15l70l64k42n3J74L26L75L20K03k1j75
1497D82l48l60k93j75M8K49L42L62K71R2o5k87l54l40k21o7J34L08L49L36J92
1518F55k5j79l09l71k76j60O6K29L14L50K57Q2q3k48l54l20k21l2J11L04L51K96
$$ plain form
1540 437 611 619 445 136 -222 -504 -630 -567 -353 -54 292 515 634 494 302 -26 -338 -561 -624 -486 -207
1561 -207 112 404 578 559 386 137 -175 -475 -606 -551 -353 -50 257 474 575 514 287 -40 -321 -504 -536
1582 -536 -444 -220 85 381 507 522 391 106 -158 -408 -536 -501 -315 -55 243 483 512 467 272 -42 -311 -492
1604 -492 -531 -418 -204 101 332 503 503 362 109 -184 -368 -489 -455 -294 -58 225 442 482 424 236 -2 -263
1626 -263 -438 -481 -415 -163 86 309 455 485 362 114 -149 -352 -452 -453 -307 -71 205 362 471 422 233 15
1648 15 -229 -407 -430 -367 -207 53 270 381 474 323 136 -89 -280 -422 -408 -295 -60 154 343 412 383 229
1670 229 31 -192 -352 -384 -335 -188 25 211 368 392 319 120 -85 -240 -404 -385 -266 -80 94 308 383 321
1692 321 218 61 -151 -278 -384 -357 -211 13 181 320 368 319 150 -27 -191 -359 -357 -286 -112 64 254 368
$$ packed form
1540D37J74Qj74l09l58k82j26O3K14K99L46K23J19j40j92l28l12k23o3J38K79
1561b07L19K92J74j9j73k49l12l00j31N5J98L03L07K17J01o1k27l27k81j83l2
1582e36R2K24L05K96J26J5j31k85k64k50j28L5J86K60K98K40K9m5j95l14k69j81
1604d92l9J13K14L05K31J71%j41k53k93j84j21L4J61K36K83K17M0n8j88k38k61
1626b63j75m3O6K52K49K23J46L0j23k48k63k03j00jJ46K36K76J57J09m9j89k18
1648A5k44j78k3O3J60K60K17J11R3j51j87k25j91j42J4J13K35K14J89O9k9j54
1670B29j98k23j60l2M9J47K13J86J57K4p3j99k05j55j64J9J19J86J74K14P5o2
1692C21j03j57k12j27j06K7J46K24J68J39M8m9j69j77j64j68KP1J74J76J90J14
$$ plain form
1714 368 327 246 57 -132 -264 -353 -335 -223 -29 124 288 336 317 158 3 -191 -295 -367 -289 -140 13 206 317
1737 317 309 263 88 -69 -215 -322 -326 -238 -70 102 235 299 295 153 17 -140 -268 -333 -278 -192 50 181 274 315 259
1762 259 87 -42 -224 -294 -293 -211 -71 77 214 297 311 203 49 -148 -276 -287 -255 -137 23 155 270 290 245
1785 245 124 -45 -169 -290 -326 -226 -114 42 214 268 278 190 38 -93 -223 -289 -290 -181 -34 142 262 305 254
1808 254 139 -11 -156 -276 -304 -215 -116 25 161 268 278 198 66 -88 -217 -288 -307 -186 -30 105 239 279 250
1831 250 147 -19 -146 -256 -290 -223 -101 51 189 269 270 206 70 -52 -192 -253 -250 -196 -43 106 216 262 260 151
1855 151 7 -132 -265 -252 -213 -136 -9 160 227 269 201 72 -80 -205 -261 -253 -213 -63 62 201 258 236 125 7
1879 7 -138 -252 -290 -222 -121 17 154 247 247 200 83 -54 -160 -252 -264 -191 -54 92 204 266 197 142 -6 -150 -236
$$ packed form
1714C68m1q1j89j89j32q9J8J12J94J53J64M8j9j59j55j94j04p2P8J49J53J93J11
1737C17qm6j75j57j46j07mQ8J68J72J33O4mj42j36j57j28o5N5Q6K42J31R3M1n6
1762B59j72j29j82p0JQ2J40J48J37Q3J4j08j54j97j28j1L2J18J60J32J15K0m5
1785B45j21j69j24j21l6J00J12J56J72N4J0q8j52j31j30o6jJ09J47J76J20M3n1
1808B54j15j50j45j20k8Q9R9J41J36J07J0q0j32j54j29p1j9J21J56J35J34M0k9
1831B50j03j66j27j10l4O7J22J52J38Q0Jo4j36j22j40o1LN4J53J49J10M6kj09
1855A51j44j39j33J3L9P7J27J69O7M2o8j29j52j25n6QM0J50J25J39N7k2j11j18
1879Gj45j14l8O8J01J38J37R3%m7j17j37j06r2j2P3J37J46J12O2o9n5j48j44q6
$$ plain form
1904 -236 -269 -220 -117 22 155 221 240 187 78 -70 -149 -236 -265 -187 -80 85 184 230 244 159 12 -125 -241 -272 -236
1929 -236 -114 7 136 213 216 179 97 -43 -147 -252 -241 -222 -81 66 172 260 204 141 21 -106 -178 -268 -220 -178 9
1954 9 129 197 238 200 103 -15 -176 -250 -262 -203 -89 13 161 201 205 177 49 -110 -187 -254 -233 -154 5 80 196 228
1980 228 179 79 -31 -125 -214 -243 -188 -107 62 117 218 231 166 62 -79 -162 -238 -230 -150 -40 86 160 223 204 101 -2
2006 -2 -91 -201 -219 -175 -104 25 139 192 233 166 80 -45 -170 -223 -210 -193 -34 75 209 213 218 141 36 -95 -185 -227 -243
2033 -243 -111 2 115 205 212 176 92 -43 -152 -220 -203 -202 -71 45 188 208 209 144 16 -84 -196 -238 -223 -117 -1
2058 -1 108 179 248 205 86 -47 -141 -238 -242 -200 -107 33 126 233 212 131 36 -64 -179 -263 -238 -160 -32 98 191 226 160
2085 160 110 -31 -124 -216 -253 -214 -53 55 137 216 222 144 46 -68 -188 -240 -238 -150 -37 81 182 179 211 134 0 -115
$$ packed form
1904b36l3M9J03J39J33O6J9n3j09j48p9q7k9P8J07J65R9M6J4q5j47j37j16l1L6
1929b36J22J21J29P7Ll7q2j40j04j05J1J9J41J47J06Q8n6o3j20j27p2r0M8M2J87
1954IJ20O8M1l8r7j18j61p4j2N9J14J02J48M0Mk8j28j59p7o7K1P9J59P5J16L2
1980B28m9j00j10r4q9k9N5Q1J69N5J01J3o5j04j41q3p6QQ0J10J26P4O3j9j03j03
2006bq9j10j8M4P1J29J14N3M1o7q6j25j25n3J3J7J59J09J34MNp7j05j31r0m2j6
2033b43J32J13J13R0Pl6q4j35j09o8J7JJ31J16J43K0Jo5j28j00j12m2J5J06J16
2058aJ09P1O9m3j19j33r4r7mM2R3J40R3J07k1q1r5j00j15q4K5P8J28J30R3L5o6
2085A60n0j41r3r2l7L9J61J08Q2P9Op8r8j14j20n2KQ8J13J18J01lL2p7j34j15
$$ plain form
2111 -115 -235 -259 -163 -110 28 150 217 208 176 31 -81 -187 -241 -220 -171 -53 72 186 223 220 136 10 -129 -254 -258
2136 -258 -187 -106 20 125 231 217 149 66 -44 -172 -222 -226 -196 -59 79 159 228 210 140 9 -108 -187 -240 -236 -93 -18
2162 -18 151 216 218 193 68 -62 -152 -242 -227 -167 -66 71 180 225 216 145 32 -111 -187 -232 -207 -123 6 96 194 222 191
2189 191 72 -33 -156 -208 -245 -192 -40 82 193 234 229 147 6 -76 -177 -263 -202 -107 21 109 211 215 191 99 -39
2214 -39 -172 -211 -266 -180 -65 45 159 194 221 150 45 -110 -159 -267 -215 -127 -25 111 212 212 185 108 -19 -122 -199
2239 -199 -246 -184 -81 35 178 220 220 140 46 -79 -184 -239 -227 -121 -22 75 184 231 177 79 -37 -148 -243 -232 -206 -80
2265 -80 58 139 200 210 163 86 -64 -193 -215 -218 -146 -14 92 192 194 198 117 -9 -120 -213 -250 -198 -76 24 125 227
2291 227 213 152 47 -78 -174 -274 -218 -107 -17 106 203 214 197 109 -6 -148 -199 -229 -181 -80 34 152 238 224 170
$$ packed form
2111a15j20k4R6N3J38J22O7rl2j45j12j06n4K1M9J18J25J14L7lq4j26j39j25m
2136b58P1Q1J26J05J06j4o8q3j10j28n0mL0J37J38Q0O9j8p0j31j17p9n3MJ43P5
2162a8J69O5Kk5j25j30r0r0J5O0J01J37J09M5rp1j13j43p6m5K5Q4J29R0R8K8l1
2189A91j19j05j23n2l7N3J52J22J11M1nq2j41q2j01q6O1R5J28Q8J02Mk4r2j38
2214c9j33l9n5Q6J15J10J14L5K7p1j05j55m9j08N2Q8J02J36J01%k7p7j27j03p7
2239a99m7O2J03J16J43M2%q0r4j25j05n5J2J06R9R7J09M7n4r8j16j11r5J1K6J26
2265h0J38Q1O1J0m7p7j50j29k2lP2J32J06J00KMq1j26j11r3l7N2J22J00J01J02
2291B27j4o1j05j25r6j00N6J11R0J23R7J1j7q8j15j42n1l0M8J01J14J18Q6j4n4
$$ plain form
2316 170 74 -86 -185 -243 -213 -128 -37 95 170 192 204 111 -16 -127 -216 -237 -172 -83 29 127 217 229 146 56 -57 -170
2342 -170 -249 -189 -122 -33 92 185 207 186 93 -1 -160 -218 -235 -185 -127 28 132 175 207 156 63 -57 -181 -203 -184 -129 -8
2369 -8 83 150 216 202 115 28 -124 -200 -237 -166 -66 47 128 204 208 157 39 -63 -138 -239 -186 -135 -36 79 194 211 172
2396 172 121 14 -135 -182 -209 -187 -96 35 144 179 193 140 55 -79 -163 -228 -194 -126 -24 74 182 205 182 104 -10 -116
2422 -116 -196 -229 -161 -69 45 122 205 189 154 46 -48 -167 -224 -179 -148 -24 66 166 213 188 105 -19 -105 -190 -231 -164 -91
2449 -91 16 133 190 173 145 68 -71 -124 -182 -174 -119 -47 74 119 170 180 115 -4 -113 -176 -211 -173 -81 21 92 183 212
2476 212 148 49 -53 -117 -208 -193 -98 -35 64 172 169 183 105 -14 -82 -178 -196 -178 -102 48 114 173 193 138 53 -33 -144 -193
2504 -193 -205 -160 -55 57 156 202 140 107 0 -116 -164 -188 -163 -75 -6 81 176 192 141 76 -44 -126 -188 -173 -111 -41 80
$$ packed form
2316A70r6j60r9n8L0Q5R1J32P5K2J2r3j27j11q9k1O5Q9J12R8R0J2q3r0j13j13
2342a70p9O0O7Q9J25R3K2k1r3r4j59n8j7N0N8J55J04M3L2n1r3j20j24k2J9N5J21
2369hR1O7O6j4q7q7j52p6l7P1J00J13Q1P6Mn1j18j02p5j01N3N1R9J15J15J7l9
2396A72n1j07j49m7k7K2R1J31J09L5J4n3q5j34q4o5L4O8J02R8J08K3k3p8j14j06
2422a16q0l3O8R2J14P7Q3j6l5j08r4j19n7M5L1J24R0J00M7k5q3j24q6q5m1O7P3
2449i1J07J17N7j7k8p7j39n3n8QN5P2J21M5N1J0o5j19j09o3l5L8R2J02P1R1K9
2476B12o4r9j02o4r1J5R5O3R9J08lJ4p8j19o8r6j8J8P6J50O6N9K0n5q5q6j11m9
2504a93j2M5J05J12R9M6o2l3j07j16m8k4K5Q8O9Q7R5J6n1o5j20q2o2J5O2P0J21
$$ plain form
2531 80 154 171 187 104 16 -82 -170 -180 -133 -86 9 126 144 180 113 59 -46 -120 -175 -203 -107 -41 80 131 218 147 132 0
2559 0 -106 -158 -183 -165 -92 30 68 155 183 118 66 -35 -103 -155 -171 -114 -44 51 151 148 154 104 18 -86 -134 -178 -160 -77 28
2588 28 72 182 151 130 41 -36 -139 -200 -157 -86 -51 41 90 149 161 94 22 -35 -169 -163 -134 -100 15 100 142 148 127 46 -41
2617 -41 -125 -170 -141 -88 -34 54 96 174 129 74 -8 -83 -151 -165 -152 -68 6 92 142 150 104 63 -49 -118 -130 -149 -97 -22 51 92
2647 92 140 162 61 -11 -89 -143 -157 -139 -79 8 106 146 151 87 32 -36 -113 -155 -129 -97 9 33 109 125 150 71 21 -66 -111 -147
2677 -147 -115 -60 9 108 149 163 111 35 -42 -109 -143 -129 -101 -20 46 99 158 113 82 31 -44 -138 -140 -123 -49 37 74 155 133 103
2707 103 26 -48 -132 -146 -144 -101 -35 49 87 134 101 48 -4 -62 -104 -148 -108 -53 30 83 128 127 87 46 -38 -97 -96 -139 -70 5 44
2738 44 124 129 103 64 -17 -77 -130 -101 -116 -62 9 88 122 101 87 34 -8 -99 -122 -116 -100 -11 13 106 134 111 27 0 -76 -98 -122
$$ packed form
2531H0P4J7J6q3q8r8q8j0M7M7R5J17J8L6o7n4j05p4n5k8R6O6J21N1Q7p1j5j32
2559@j06n2k5J8P3J22L8Q7K8o5n2j01o8n2j6N7P0R5J00lOn0q6j04m8m4J8Q3J05
2588B8M4J10l1k1q9p7j03o1M3P1L5R2M9N9J2o7p2n7j34OK9L4J15Q5M2Ok1q1q7
2617d1q4m5K9N3N4Q8M2P8m5n5q2p5o8j4J3Q4P4Q6N0Qm6m1j12o9j2j9N2P5P3M1
2647I2M8K2j01p2p8n4j4J8O0Q7R8M0No4n5o8p7m2K6L2J06K4P6J6K5p9n0q7m5l6
2677a47L2N5O9R9M1J4n2p6p7o7l4J4K8Q1O6N3N9m5l1n1p5r4kJ7P4Q6L7Q1k2l0
2707A03p7p4q4j4KM3O6Q4L8M7l3n3n2n8m2m4M0N5Q3N3M5jm0m1q4n9Jm3O9P5L9
2738D4Q0Nk6l9q1o0n3K9j5N4P1P9L4k1j4n3m2r1k3OJ6Q9K4R3K8k3q4k7p6k2k4
$$ plain form
2769 -122 -92 -49 9 82 109 95 75 38 -41 -98 -130 -99 -42 0 80 106 113 113 64 -14 -57 -108 -125 -99 -50 34 83 85 103 69 3
2800 3 -33 -90 -121 -95 -53 8 27 80 96 71 69 -18 -77 -102 -120 -94 -39 32 62 100 106 56 24 -22 -97 -98 -91 -34 -16 47 95 93 100 37
2834 37 -34 -70 -95 -117 -68 -49 44 61 71 84 44 11 -52 -80 -110 -75 -30 5 49 70 99 90 45 -8 -71 -56 -82 -78 -49 24 77
2865 77 101 102 48 16 -44 -74 -84 -72 -42 -8 21 81 59 56 31 -25 -52 -72 -80 -16 -25 38 40 82 72 47 -22 -34 -111 -98 -82 -35 10
2898 10 31 62 96 70 39 -8 -79 -84 -100 -77 -30 11 34 57 54 54 -1 -31 -52 -86 -84 -53 8 40 78 82 41 17 -2 -44 -80 -77 -85 1
2932 1 -4 65 71 57 40 0 -31 -58 -73 -76 -24 10 39 68 88 81 32 -13 -45 -75 -58 -30 -17 4 50 46 65 58 -5 -13 -44 -87 -41 -59
2966 -59 -6 11 23 62 51 32 -19 -50 -68 -61 -41 2 5 27 49 41 52 -19 -29 -65 -49 -57 -16 28 39 39 61 59 34 -15 -36 -32 -45 -45
3000 -45 -33 12 51 42 55 21 18 -33 -42 -77 -70 -39 -3 24 35 38 24 1 -10 -45 -71 -39 -66 -19 -1 6 48 51 35 40 -25 -33 -61 -51 -13
$$ packed form
2769a22L0M3N8P3K7j4k0l7p9n7l2L1N7M2Q0K6P%m9p8m3n1j7K6M9Q4M9KJ8l4o6
2800Cl6n7l1K6M2O1J9N3J6k5kq7n9k5j8K6N5P1L0L8On0l2m6p5jPN7J8O3M8kPo3
2834C7p1l6k5k2M9J9R3J7J0J3m0l3o3k8l0L5M5L5M4K1K9rm5n3o3J5k6MK9P3N3
2865G7K4Jn4l2o0l0j0J2L0L4K9O0k2lk5n6k7k0qO4rO3KM2j0k5o9j2p7J3J6M7M5
2898A0K1L1L4k6l1m7p1nj6K3M7M1K3K3l%n5l0k1l4KL1O1L2L8Mm1k4j9m2l6LqQ6
2932AnO9Oj4j7m0l1k7j5lN2L4K9K9K0pm9m5l2l0J7K8J3K1M6mJ9po3ql1m3M6j8
2966e9N3J7J2L9j1j9n1l1j8PK0M3LK2K2qJ1p1j0l6J6qM1M4J1%K2kk5m9k1Mj3%
3000d5J2M5L9rJ3l4ln1rl5PL1L6K7J1Lj4k3j1l5k6L2k7M7J8PM2Lj6No5qk8J0L8
$$ plain form
3035 -13 -3 11 35 41 17 19 -21 -16 -23 -57 -35 -11 1 39 42 25 23 -1 -23 -46 -29 -30 -42 -12 9 6 47 46 9 -40 -14 -53 -65 -62 -31
3070 -31 3 13 17 10 33 1 -10 -70 -52 -19 -30 -12 21 30 28 38 25 -10 -49 -37 -38 -9 -13 0 19 29 38 27 9 4 -29 -16 -23 -14 -19 21
3106 21 3 -9 38 0 -35 -55 -44 -41 -9 -23 14 19 22 16 32 -11 -26 -28 -30 -3 1 -12 18 12 38 45 12 -14 -10 -20 -43 -11 -27 21 12 24
3142 24 -11 30 -12 -41 -36 -35 -34 -32 13 22 4 1 10 -7 1 -12 -27 -42 -11 5 20 29 47 8 18 8 -17 -29 -32 -59 -29 -6 -19 22 23 4
3178 4 3 -6 -9 -8 -13 -23 -26 6 -1 14 17 9 -13 -16 -28 -24 -11 -12 -6 1 3 9 5 29 26 -6 -12 4 11 -20 9 -7 -16 -15 -8 -13 -7 -2 -9 -9 -20 -6 -20 -7 -1
3223 -1 2 20 13 -17 2 9 12 1 -5 -1 -13 -8 25 12 1 20 -9 -21 -1 18 -4 17 11 40 11 -7 3 -10 -17 30 -10 30 -16 12 -12
3258 -12 25 -19 -23 -19 4 -7 -2 -16 -40 -32 13 -17 -8 22 -19 -16 3 -12 -10 23 13 11 14 13 27 -10 -5 15 -7 12 -13 19 -3 -3 0 22 -7
3295 -7 -4 -8 -20 -20 6 3 11 -10 25 0 13 25 -9 8 -5 -4 -15 8 -5 -8 12 5 -1 6 3 -10 -7 3 2 8 -8 -15 -2 16 4 -3 7 0 -25
$$ packed form
3035a3J0J4K4Ok4Km0Npl4K2K4J2L8Lj7kk4k2k3J7jj2L0K1lM1jl7m9K6l9j2LL1
3070c1L4J0MpK3l2j1o0J8L3j1J8L3RkJ0j3l5l9J2jK9mJ3J9J0Rj1j8nl3J3pRnM0
3106B1j8j2M7l8l5k0J1LL2j4L7NLoJ6m3j5kkK7Mj3L0oK6Pl3k6Mj0k3L2j6M8rJ2
3142B4l5M1m2k9NJJKM5Rj8lRj7Qj3j5j5L1J6J5RJ8l9J0j0k5j2lk7L0K3j3M1Jj9
3178DjrlJnj0lL2pJ5Lqk2lj2MJ3jOPKOmK4ll2oJ6Pl1K9j6rJPnONp%j1J4j4J3O
3223aLJ8pl0J9PLj1oMj2NL3j3j1J9k9j2K0J9k2K1oK9k9j8J0j3pM7m0M0m6K8k4
3258a2L7m4mMK3j1Nj4k4QM5l0RL0m1LJ9j5KL3j0kLjJ4l7NK0k2J9k5L2k2%LK2k9
3295gLmj2%K6lQk1L5k5J3J2l4J7j3Jj1K3j3lK0poPlj3LJ0jOj6pJ3J8j2pJ0pk5
$$ plain form
3334 -25 -10 -9 -17 -14 6 24 28 6 19 -25 -14 -17 21 -17 -35 13 -2 3 -3 -15 -6 -26 -14 27 -18 -4 -32 5 5 14 7 11 3 -15 -14 -2 2 -6
3372 -6 -12 20 -5 11 13 2 -10 -12 -13 -1 -18 -3 -14 20 6 19 3 27 -3 10 -11 -25 -5 5 29 10 1 -24 -2 -11 4 9 -20 -16 -6
3407 -6 -12 -27 7 -47 16 7 -14 -26 3 -2 14 2 11 24 9 5 19 2 -30 -10 -11 -38 4 12 1 27 -4 33 24 2 12 6 12 -7 -11 -6 -39
3444 -39 10 -11 5 9 16 -16 -18 -16 -35 -11 -25 27 56 -26 16 18 -15 -4 -21 -15 -17 -15 23 27 34 5 28 -7 25 -18 -20 -2 41 16 -3 -15
3480 -15 -15 20 -8 1 -37 -25 9 -11 -1 18 24 44 33 -19 -21 -36 7 -27 17 15 -3 6 -19 1 26 -2 3 -53 -41 -14 18 10 -3 -2 27
3515 27 10 -16 -7 -21 -15 -12 -13 -11 15 -11 25 -11 25 -2 7 -3 -28 5 16 -17 7 -8 20 24 10 -2 -4 -19 -15 8 19 -8 -2 15 17 13
3551 13 5 -17 -7 -24 10 -6 18 -3 25 15 25 12 -22 -25 -6 -19 11 -8 24 1 15 21 25 8 2 13 -7 1 13 11 -13 34 17 9
3585 9 50 1 18 0 -15 -8 -6 19 6 21 0 -4 2 -10 1 -7 -20 6 -12 10 18 31 -7 -1 -21 -47 32 7 -35 -19 19 19 9 12 13 3
$$ packed form
3334b5J5JqLK0J8Mk2J3m4J1lL8l8j8M8j5Noj2Rk0J2M1m5J4k8L7%RpMqj8JJ2Mq
3372foL2k5J6Kj1j2kjJ2j7J5j1L4j4J3j6K4l0J3k1j4K0J0K4j9rk5K2rJ5Nk9MJ0
3407foj5L4n4O3rk1j2K9nJ6j2RJ3j5mJ4j7l2K0jk7M2Qj1K6l1L7rk2J0oOj9mNl3
3444c9M9k1J6MPl2kKj9K4j4N2K9q2M2Kl3J1j7OkKL8MPk9K3l5L2m3kJ8M3k5j9j2
3480a5%L5k8Rl8J2L4k0J0J9OK0j1n2kj5M3l4M4kj8Rk5K0K5k8Nn6J2K7L2qj3JK9
3515B7j7k6Rj4OLjKK6k6L6l6L6k7Rj0k5L3J1l3K4j5K8Mj4j2kj5MK3J1k7OJ7Km
3551A3qk2J0j7L4j6K4k1K8j0J0j3l4lJ9j3L0j9L2k3J4OMj7oJ1k0QJ2kk4M7j7q
3585IM1m9J7j8j5PKK5j3J5k1mOj2J1qj3K6j8K2QJ3l8Ok0k6P9k5m2J6L8%j0LJj0
$$ plain form
3621 3 22 18 -6 3 11 9 0 13 61 17 11 0 0 -9 -24 -6 -5 23 -1 29 6 15 20 -30 -45 -24 -5 -16 -15 -12 26 26 17 -39 15 -22 -14 -12 -14 3
3661 3 2 -7 15 21 26 -14 1 -25 -6 -28 14 6 19 1 40 10 -3 -6 25 -26 -43 -27 4 6 10 27 28 14 -5 -7 -28 -3 -12 -16 -4 1 30
3698 30 33 0 -14 2 -14 -34 -17 9 0 16 24 40 7 0 25 25 -11 -33 -7 -10 30 17 -10 22 12 6 -6 13 4 -31 -4 -6 32 5 17
3733 17 -25 18 -7 -26 -4 14 13 -17 11 2 7 -5 -10 -5 -4 10 -22 -54 3 -5 14 47 2 -15 15 1 -2 25 7 15 6 13 29 4 46 -1
3769 -1 11 -23 -11 -9 -9 -25 1 -16 23 37 0 1 -8 -9 -38 -6 -34 0 9 17 14 9 5 16 -18 -10 -11 -12 -27 7 18 3 8 19 11 -9 -4 -23 8
3808 8 -26 27 1 6 15 14 2 -35 -28 -55 -18 -16 -9 -8 19 -9 28 23 -4 8 -12 -27 -27 -19 3 -10 -3 9 16 -2 23 -2 -37 26 -4 13 -13
3845 -13 23 30 7 6 11 12 -17 -18 -7 -27 -25 9 10 14 25 -3 -3 -18 -7 -6 -25 -14 -1 -14 6 -13 33 30 20 -3 -17 -15 -2 0 29 -7 -14
3882 -14 37 11 5 -7 19 3 -18 4 -19 26 9 1 19 23 7 -24 -27 -12 -11 5 7 34 45 25 -16 0 -13 32 -18 -7 -9 9 0 15
$$ packed form
3621CJ9mk4RQkrJ3M8m4oj1%rj5J8JK8k4L0k3RNn0j5K1J9j1JLL8%rn6N4l7QKkJ7
3661CjrK2ONm0J5k6J9k2M2qJ3j8L9l0j3lL1n1j7J6L1KMJ7Jj4j9kk1K5rmJ2NK9
3698C0Ll3j4J6j6k0J7K6rJ6QJ6l3pK5%l6k2K6lM0j3k7L2j0oj2J9rl5K7kL8k7J2
3733A7m2M3k5j9K2J8jl0K8rNj2nNJJ4l2l2N7qJ9L3m5j7L0j4lK7j8QrPJ6k5M2m7
3769aJ2l4J2K%j6K6j7L9J4l7Jrjk9L2k8L4RQlnmJ1l4Qjjj5L4J1j5NJ1qk0Nj9L1
3808Hl4N3k6NRjj2l7Pk7L7KPJK7k8L7nk7J2k0j5%QK2j3PJ2Pj8K5k5l5O3l0J7k6
3845a3L6Pk3jNJk9jJ1k0KL4JMJ1k8%j5J1Jj9J1J3j3K0j9M6lj0k3j4KJ3KK9l6p
3882a4N1k6oj2K6j6k1K2k3M5j7qJ8Mj6l1lJ5JJ6KK7J1k0m1J6j3M5n0J1kJ8rJ5
$$ plain form
3916 15 26 19 -19 -14 -3 -15 -8 20 -3 -34 6 10 21 5 -22 0 -11 -22 -11 -2 20 17 -27 10 34 -21 7 -7 -9 -21 -12 -3 0 1 13 4
3952 4 39 -5 -26 -22 -25 -6 -3 0 16 16 20 3 20 22 -19 26 -12 -9 11 12 8 6 1 6 15 14 -25 1 -3 -12 2 -7 8 11 27 0 2 -15 -7 -28 -21 13
3994 13 -14 19 -26 -4 -4 -20 -3 -7 -32 -16 -27 -13 17 14 35 38 10 -4 -9 -9 8 -2 -14 13 2 23 14 -6 -9 3 15 -3 4 -24 -26
4029 -26 15 9 3 18 26 -23 -8 -1 -18 -29 -7 -19 6 -2 7 16 -22 -14 -19 -24 12 -22 2 13 5 21 30 -7 3 -31 17 -28 -16 3 14 22 9
4066 9 10 -24 -3 -5 1 -30 -6 13 9 12 12 16 4 17 17 -8 -7 -3 8 -19 -2 3 -13 9 1 -9 15 -8 -4 -12 30 -5 -20 24 12 -4 -2 5 20
4105 20 -9 -5 -19 8 -2 5 -9 -4 6 -15 -11 -9 2 -10 -1 -24 -9 29 12 -5 -5 -22 6 -10 4 -23 10 12 18 -6 44 28 6 -2 20
4140 20 1 -12 11 12 -4 -25 12 4 -11 -14 -11 -5 -17 -29 10 -34 -1 10 31 13 -30 -15 9 -18 -1 -10 -3 -35 14 -5 24 25 -9 -12 21
4175 21 10 33 15 6 7 6 7 12 17 -3 19 -23 17 -1 3 0 -4 3 -26 31 11 -6 10 9 -3 10 24 11 23 0 -14 3 14 -19 -18 -6
$$ packed form
3916A5J1pl8NJ1j2PK8k3l1M0MJ1j6k7K2j1j1J1RK2lm4L7K4n5K8j4kj2RRLJJ2r
3952DL5m4k1MlJ9LLJ6%Mj7J7Km1M5l8LK0JmknNRjl9K6mrJ4rJ5LJ6k7Kj7Qk1PL4
3994A3k7L3m5K2%j6J7mk5J6j1J4L0lK1Lk8j4n%J7j0j2K7j1K1rk0lJ2J2j8Pk8k
4029b6M1ooJ5Qm9J5Pj7j1K2j2K5qRRl8QnnL6l4K4J1qJ6Rl7J0l4M8m5J2J9J1Qj3
4066IJl4K1kOl1K4J9mL%Mj2J3%k5JMJ1k7J7Nj6K2qj0K4k3MqM2l5j5M4j2j6KPJ5
4105B0k9Mj4K7j0Pj4NJ0k1MKJ1j2Rk3J5L8j7j7%j7K8j6J4k7L3KOk4N0j6k2qK2
4140B0j9j3K3Jj6k1L7qj5lLOj2j2L9m4L3J1K1j8m3J5K4k7J7rPl2M9j9K9Jl4lL3
4175B1j1K3j8rJjJNNk0K2m2M0j8MlmPk9N7k0j7J6jj2J3J4j3J2k3j4J7J1l3JJ2
$$ plain form
4211 -6 -15 9 7 22 -13 21 18 3 27 4 -14 -19 -13 21 21 -17 -16 -7 28 -7 -13 3 -7 21 -8 -13 -2 1 11 -23 -12 -11 -23 -6 -2 -9 -14 24
4249 24 0 -11 8 7 -33 -23 -3 5 9 -2 -2 2 -8 6 -3 8 -15 -8 2 22 -14 -12 13 -12 2 -13 -7 -20 -9 23 -12 1 7 20 24 44
4285 44 14 -18 -13 -23 12 20 -3 0 -15 18 9 -2 -19 12 10 -2 -1 -12 8 9 29 -5 10 3 9 -11 0 -7 -2 0 -28 13 14 -21 10 -19 26
4322 26 4 20 -10 -7 3 -15 -16 -41 -2 -12 -37 -20 5 -34 -2 19 4 -4 -9 0 4 12 -11 -8 -7 11 26 -19 22 -5 -17 15 25 -25 13
4357 13 -12 -10 -3 -28 8 3 9 1 -3 -17 -8 -19 10 11 -17 -11 4 12 -7 -6 -31 -34 19 -7 31 -5 -26 19 -1 29 2 16 5 13 -4 -19 -11
4394 -11 5 -16 -23 8 -23 -17 -13 -22 -14 29 6 -28 -7 5 4 -18 -32 10 6 -17 5 15 14 14 -24 -2 -10 -16 16 7 2 -3 15 5 -6 14 -6
4431 -6 17 -2 0 26 -12 0 2 2 12 -1 9 -13 6 -12 4 -7 13 -7 -4 -7 0 13 -15 -11 -8 6 -13 3 -6 6 5 13 -15 5 17 -3
4467 -3 -9 2 -13 12 -2 -10 30 -1 14 15 10 14 10 18 -18 15 -10 -5 1 1 -14 -3 -16 -1 1 -10 25 29 -7 18 2 1 -26 14 1 8 13 -8
$$ packed form
4211frK4kJ5l5L4lj5K4k3j8nOL4%l8JRL5l5oJ6j0K8k9nJ1LJ0l4J1Jj2J7MpnL8
4249B4k4j1J9jm0J0K0QMj1%Mj0J4rJ1k3PJ0K0l6KK5k5J4j5Oj3J1L2l5J3OJ3MK0
4285D4l0l2Nj0L5Qk3Lj5L3rj1j7L1kj2Jj1K0JK0l4J5pOk0J1pNKk8M1Jl5L1k9M5
4322B6k2J6l0LJ0j8jk5L9j0k5J7K5l9L2K1j5qnRMQk3LJJ8J5m5M1k7j2L2J0n0L8
4357A3k5KPk5L6nOqmj4Rj1K9Jk8OJ5Qj9Jk5lN3k6L8l6k1M5k0L0k7J4j1Qj7j5Q
4394a1J6k1pL1l1OMrQM3k3l4K1J2jk2j4M2mk3K2J0j%l8K2qoL2rnnJ8j0j1K0k0
4431fK3j9KK6l8J2K%J0j3J0k2J9j8J6j1K0k0LlPJ3k8MLJ4j9J6rJ2jQk8K0J2k0
4467coJ1j5K5j4qM0l1J5JnMmQl6L3k5NO%j5J1j3J5Kj1L5Ml6K5j6jk7M0j3PNk1
$$ plain form
4505 -8 -14 -6 -33 -1 -15 20 34 2 -4 -12 18 36 12 18 21 -2 -30 -3 2 -9 16 -16 13 2 26 -1 -9 -10 -20 -31 -30 0 16 -9 -5 -13 -9
4542 -9 26 28 -7 -42 -14 -3 -23 24 -10 12 -18 10 9 -3 11 -9 -35 9 -17 -5 5 -2 13 0 9 -25 4 13 4 -15 11 1 -15 1
4576 1 -19 -26 -18 1 9 -20 -5 2 7 -23 -9 -37 -16 15 -4 -18 -8 26 -12 -8 -10 2 27 -22 27 22 2 -24 -12 0 13 10 -3 -9 1 35
4612 35 -35 9 -3 10 -5 36 9 12 -7 21 -11 2 0 -8 7 -16 -19 -20 8 5 10 -14 -15 10 5 -16 -18 12 -16 -29 -12 -9 -9 1 7 -3 5
4649 5 14 -35 7 -42 -8 18 32 6 -26 19 -12 -26 -7 -24 -27 -9 -41 10 -10 -9 -24 5 -10 -3 -4 -31 -28 19 -24 -35 -9 -25 38 -19
4683 -19 -13 -14 -8 -3 -10 12 -1 -4 -15 8 -5 13 -4 6 23 -23 7 -3 0 -7 1 -2 -5 -33 -3 -9 0 15 -24 -11 0 -3 19 23 -20 -15 13 0
4721 0 6 -4 27 -20 -2 10 -11 29 -14 13 -13 1 -7 8 4 -12 -2 10 -2 -11 0 3 15 -4 -16 11 -14 22 3 2 -7 12 -7 -23
4755 -23 21 4 2 -6 -1 9 9 4 -8 -24 3 21 -17 10 -1 -7 -8 3 19 -27 11 18 22 -1 6 11 46 -8 -4 -7 -9 24 5 8 0 -21 -22 -1 -1
$$ packed form
4505hoQk7L2j4L5J4l2oqL0J8k4OLk3k8K7Nj1K5l2K9j1K4k7qjj0j1JL0J6k5MqM
4542iL5Kl5l5K8J1k0M7l4K2l0K8jj2J4k0k6M4k6J2J0pJ5j3Rl4K9Rrj9K6j0j6J6
4576Ak0pQJ9Qk9J5PNl0J4k8K1L1j9j4J0L4l8MkJ2K5m9M9nk0k6J2J2J3lj3oJ0L4
4612C5p0M4j2J3j5M1k7Lj9K8l2J3kqJ5k3ljK8lNk4jK5nk1kL0k8j3J7L%J0Oj0Q
4649ERm9M2m9L4K6J4k6l2M5l1j4J9j7lJ8l2N1k0Jj5K9j5Pjk7LM7m3j1K6j6O3n7
4683a9OjONpK2j3lj1K3j3J8j7J0J7m6L0j0LpQllk8L0oRJ5l9J3J1lK2Mm3NK8j3
4721@Oj0L1m7J8J2k1M0m3K7k6J4qJ5mj6J0J2j2rJ1LJ2j9j2K7k5L6j9jrJ9j9j6
4755b3M4j7kqNJ0%nj2j6K7J8l8K7j1ojJ1J6m6L8PMk3PNL5n4MlkL3j9Lqk1jK1%
$$ plain form
4794 -1 23 1 22 -24 -5 0 6 -6 15 -8 6 5 4 -8 -22 7 -34 -14 -28 13 11 2 10 25 10 -6 -6 19 16 15 -17 13 1 10 5 -6 7
4831 7 11 -11 -12 6 22 5 11 6 -3 -1 1 -29 -18 2 -16 -19 35 0 -5 4 11 -33 1 25 -12 1 9 5 -2 3 3 11 19 1 9 9 -35 10 16 7 0 -9 -10
4874 -10 29 -33 -15 -2 -3 7 -19 1 -9 8 -16 -29 -1 -14 8 -33 28 0 -35 11 -1 -7 10 6 24 -12 3 3 12 -13 16 9 5 27
4908 27 -4 -4 22 16 0 21 -3 12 -17 0 14 -12 -7 -20 2 5 -6 4 1 4 30 -24 -27 0 -25 -30 18 -19 -7 -31 8 -13 12 4 16
4943 16 -8 -21 -8 -21 -9 6 -2 -7 11 -19 2 26 -1 -2 -30 -7 -2 -22 -7 7 3 3 -20 -6 13 -3 -52 13 11 -8 5 8 2 12 -8
4978 -8 19 19 -26 -17 33 11 -2 12 19 -3 -2 11 -3 12 -11 5 3 -12 0 -13 5 14 -10 -3 31 6 -36 -17 -4 -12 -17 1 9 4 12 11 -30
5015 -30 -3 8 -20 2 -6 -12 -3 -18 16 9 -7 -10 -7 1 1 14 -24 -20 -4 -21 -22 -9 7 12 1 -12 14 30 12 10 -3 6 -5 -18 -24 -10 10
5052 10 -11 -14 7 14 1 -6 -9 -4 -18 22 -10 10 -20 -17 0 -7 12 -16 12 2 21 -15 16 -16 4 10 15 -1 -14 7 3 2 6 -10 -13 -4 8
$$ packed form
4794aK4k2K1m6J9NOj2K1k3J4jjj2j4K9m1K0j4M1krQJ5j5j6%K5ljl2L0j2Rnj1J3
4831GMk2jJ8J6j7OnrKKl0J1K0j8lN4l5nRPm4L4K4l7J3QmpN%QQj8Q%m4M5Orprj
4874a0L9o2J8J3jJ0k6K0j0J7k4j3K8j3K2m1O1k8l5M6j2oJ7mJ8l6J5%Rk5K9pmK2
4908B7l1%K6oj6K1k4J5k9J7J4k6Nj3K2Lj1J0lLK6n4lK7k5nM8l7J2k4L9k1K5qJ2
4943A6k4j3J3j3J2J5qnJ8l0K1K4k7jk8K3Nk0J5J4m%k3J4J9j6m9O5kj9J3LoJ0k0
4978hK7%m5RN0k2j3J4Pk2JJ3j4J5k3J6kj5J2j3J8Rk4PL4k5m2J9J3qnJ8QnQjm1
5015c0K7J1k8K2qoRj5L4pj6lLQ%J3l8MJ6j7jJ3J6Nj1j3K6J6j8kj3Rj1j3oJ4K0
5052A0k1lK1Pj3plNj4M0l2K0l0LJ7pJ9k8K8j0J9l6L1l2K0ONj6j3K1mjMj6lRJ2
$$ plain form
5089 8 -14 24 -18 -4 -9 -4 -19 -21 -19 -31 6 -23 12 -5 1 -11 5 10 -4 -14 0 15 -2 2 5 -18 -13 19 2 -4 1 -4 8 7 5 6 -7 -4 -3
5128 -3 14 4 9 13 19 19 5 -9 32 12 0 1 4 5 -17 8 23 18 1 -14 3 -15 35 10 24 -25 7 -7 21 -4 -10 -7 -26 -8 -8 -16 11
5165 11 1 11 -16 -30 35 24 -2 -6 33 -10 -9 -6 -17 -1 -8 -27 -7 -5 -2 -5 -14 -2 -4 -21 8 0 15 -7 1 -21 4 16 2 21 1 -3
5201 -3 0 9 10 -11 -1 -15 39 -5 11 -7 16 2 21 13 6 -13 -6 31 -12 -18 24 7 5 2 -38 -3 9 -5 21 -10 -7 -2 10 -1 4 1 -2 26
5239 26 13 1 -20 17 0 -8 -1 -1 -25 -7 4 0 3 15 1 13 -20 -25 -7 19 7 -5 3 -19 -3 3 42 13 21 11 -11 5 -2 14 11 -3
5275 -3 27 13 12 0 -33 -14 27 -1 23 10 -16 -10 1 16 -4 -8 18 14 -16 21 -25 -20 16 12 4 -33 -17 -1 11 -9 -5 9 -1 12 -16
5310 -16 -24 -4 -5 3 -40 -19 23 0 1 -1 4 2 -4 -3 -17 -5 -3 -2 21 15 8 16 7 10 2 -21 -10 4 24 -18 27 -17 -13 3 -34 32 -21 1 -32
5349 -32 19 1 -26 25 -16 10 3 -7 -21 -3 -9 -12 -13 -5 6 -9 16 -22 -5 11 -10 -37 -2 -3 -14 -1 0 27 -22 -2 5 -10 21 -3
$$ packed form
5089Hk2L8m2J4nNj5kKj2L7k9L5j7Oj2J6Nj4j0J4J5j7MLk3NL2j7oNnJ2jkJj3LJ
5128cJ7j0NMO%j4j4M1k0j2JLJk2K5J5nj7j5J7j8N0k5J4m9L2j4K8k5oLj9J8%qK7
5165A1j0J0k7j4O5j1k6mL9m3JLj1J6pj9K0KLlrJ2kj7K9qJ5k2Qk2K5J2j4J9k0m
5201cLRJk1J0j4N4m4J6j8K3j4J9qpj9PL7m3oM2j7klm0L5J2j4K6l1LNJ2j1NllK8
5239B6j3j2k1L7j7qP%k4J8J1mLJ2j4J2l3nJ8K6j2j2Qk2J6OL9k9Qj0k2J6pJ6lj4
5275cL0j4jj2l3J9M1k8K4j3k6OJ1J5k0mK6ml0L7m6NL6mql7J6J6J2k0MJ4j0J3k8
5310a6qK0jQm3K1M2k3JkNkoJj4J2KJK3opQrLqk3J1J4K0m2M5m4MJ6l7O6n3K2l3
5349c2N1j8k7N1m1K6pj0j4J8oljQJ1j5K5l8J7J6k1k7L5jj1J3JK7m9K0Pj5L1k4
$$ plain form
5383 -3 -24 4 6 -11 20 4 -10 -23 8 5 -21 -16 -8 -22 -18 0 -5 -1 -7 -27 2 28 -1 23 18 -7 12 7 4 16 7 5 26 35 6 3 5 -17 15
5422 15 -11 -30 10 -40 -5 12 -33 -7 17 3 6 31 21 5 -10 -1 -8 -29 -21 -1 -26 13 0 6 1 4 2 -21 15 4 2 1 19 11 16 9 3
5459 3 -13 12 10 25 10 -5 9 -7 -15 4 -1 -4 5 0 4 -11 -24 -8 -26 -29 7 -9 -4 -15 -13 -12 -19 -17 -24 13 -6 -7 -2 0 -12 31 3 5 -4 -7 6
5500 6 -25 -1 14 9 12 15 -36 -10 -29 -10 -2 45 -11 -26 0 -24 8 3 -10 -9 -3 -9 2 -18 7 -23 -11 -7 -3 -2 -3 9 16 12 20 28 10 -26 6
5539 6 -18 -7 30 4 9 12 12 1 -20 3 -21 -5 -6 -3 18 -2 -9 0 -23 -7 -5 10 5 -7 -11 23 3 -17 15 -7 8 -10 -14 -14 2 16 -28
5576 -28 -4 3 -46 6 37 5 -4 -9 11 -6 28 -1 -6 5 0 -29 -31 -4 15 3 -4 -1 -8 -25 -21 16 -7 13 17 13 -2 -25 8 -3 -32 20
5612 20 -27 7 -13 -13 -19 3 15 14 8 1 23 5 11 15 6 -9 49 9 2 -7 15 -9 14 -16 7 6 7 -42 33 8 -21 -19 -10 21 -2 -11 0 -13
5650 -13 1 14 -11 24 -41 3 -20 -14 11 7 0 -6 -16 12 -21 -4 -1 -6 7 37 -24 13 -2 1 -5 0 -10 -7 4 2 -13 12 -13 -3 -31 18
$$ packed form
5383ck1K8Kj7L1j6j4j3L1lk6NQj4MJ8nMok0K9K6k9K4nk5J9nlJ2rkK1Rk9lKk2L2
5422A5k6j9M0n0L5J7m5K6K4j4LK5j0j6j5Rpk1QK0k5L9j3OnLkk3L6j1kjJ8qNpo
5459Cj6K5kJ5j5j5J4j6qJ9nlRnMj5j3J6j8lL6j6Nj1KJpKpL7j9jNKj2M3k8KrlJ3
5500Fl1K4J5nLLn1K6j9J9QM7n6j5K6k4L2nj3JOoJ1k0K5l0J2MMJjJ2PmQQj8l6L2
5539Fk4J1L7k6NL%j1k1K3k4J6jLK1k0pRk3J6KJ5nj2mL4k0k0L2k2J5j8m%J6J4m4
5576b8K4Pm9N2L1l2rnK0j7L4k9nJ1nk9kK7J9j2pLpj7ML7k3K0Mmj5k3L3j1k9N2
5612B0m7L4k0%oK2J2jopK2j8OMrj5N8m0prK2k4K3l0K3jJm9P5k5k9KRL1k3rJ1j3
5650a3J4J3k5L5o5M4k3OK5mpoj0K8l3J7LnJ3L0o1L7j5LoNj0LJ1kj5K5k5J0k8M9
$$ plain form
5686 18 -20 8 -14 -24 -20 -16 0 -1 14 -13 -8 -9 -17 -14 -21 -6 19 -15 15 11 14 -10 9 -9 -5 11 -6 24 36 -16 1 -8 9 -26 -17 13 12
5723 12 1 -33 -2 -12 -24 -9 17 -11 -21 1 -4 -13 -15 2 24 -8 12 -9 -29 15 18 4 20 6 10 18 32 -18 26 -15 1 10 3 0 24
5758 24 -10 -19 37 15 -7 -15 19 -18 -3 -22 15 -10 -24 -8 -8 -8 -11 -9 -18 -16 -3 -11 1 -12 -29 -29 -12 -8 6 2 -1 5 9 -23 10 13 -8 -17 10
5797 10 -2 8 -32 10 -1 -39 -7 -6 -29 0 26 4 -8 -21 -14 5 -18 11 -31 -20 4 -14 -15 19 -32 1 -8 -4 -5 -19 10 -19 -10 -28
5831 -28 20 -5 -1 13 15 -2 29 -3 36 7 -16 19 -28 -1 -26 21 -7 -7 -22 -14 20 31 17 16 -13 1 -5 -5 -9 15 -2 5 -15 -8 -5 -1
5867 -1 -39 2 -4 5 -5 18 27 -7 7 7 -26 5 -10 12 29 8 4 -5 23 -5 -7 -34 2 -5 9 25 0 9 5 18 -10 2 -1 4 -7 -30 1
5904 1 12 4 -7 8 -1 -17 -7 -7 -4 21 12 10 15 -10 18 -21 -5 13 0 5 -16 -12 -4 -16 41 -8 0 -24 -2 5 -5 2 6 -1 4 -23 -12 7 -16
5943 -16 28 -33 -7 -6 -18 15 -20 -53 -5 -14 2 11 17 -19 0 -4 25 -5 -19 -1 -16 28 -7 -8 5 16 18 35 14 9 12 -12 15 -9 -1
$$ packed form
5686A8l8K8k2j0MMJ6jJ5k7NjqLpJ5K5l4L0mLk4J9j8MJ6j7L0J2n2J7rJ7l5RL0j
5723A2j1l4L1j0j2J5K6k8j0K2nrkJ7K2l2K0k1k0M4Lj4J6j4MQJ4n0M4m1J6RplK4
5758B4l4rN6k2k2qL4l7J5j9L7k5j4J6%%lKrKJ3qJ2j3j7%J7MJ4mlOMl2L3Lk1rK7
5797A0j2J0m0M2j1l8L2Jk3K9K6k2j2j3PJ9k3K9m2J1K4j8jL4n1L3rMjj4K9k9Rj8
5831b8M8k5MJ4Kj7L1l2L9k9k3L5m7K7k5M7k8%j5QL4J1j4jk9J4o%mK4j7Pk0PLM
5867al8M1oRj0K3Rl4J4%l3L1j5K2J7k1mrK8k8kk7L6pJ4J6k5RmJ3k8J2lNj1k3L1
5904AJ1qj1J5rj6J0%LK5rkNk5K8l9J6J8j3Nk1MQj2N7m9Qk4K2Pj0PMpNk7J1J9k3
5943a6M4o1K6Jj2L3l5l3M8rJ6ROl6J9mK9l0j4J8j5M4l5jJ3J1KJ7k1nLk4K7k4Q
$$ plain form
5978 -1 -5 -17 10 7 -18 4 -5 6 0 5 17 2 -20 17 -21 11 1 25 -10 2 2 9 -14 -12 2 -8 5 1 -6 1 1 -15 17 -22 13 39 -11
6015 -11 6 6 0 5 17 -15 -22 -9 2 13 -7 17 -11 1 -17 7 -16 -10 1 16 -13 11 -2 -7 28 -5 -9 26 -16 -10 0 3 -14 2 7
6050 7 -27 5 22 29 -2 8 6 5 -9 13 1 -13 13 -13 8 -10 2 -21 -5 -15 -2 3 4 -9 11 8 -5 -17 -18 7 1 -13 -3 -4 4 13
6086 13 -7 13 -1 -4 12 -12 3 -1 10 33 7 -13 -5 -8 -1 10 -3 10 -3 -21 3 -21 -23 2 20 9 5 2 5 2 5 -3 -10 0 44 -40 -3
6123 -3 -2 5 20 -21 25 -8 -11 9 23 7 0 17 9 -5 -10 13 9 -6 14 -9 -15 11 -7 0 4 -15 9 -21 -7 3 4 4 -8 12 -9 10 -13
6160 -13 5 24 2 4 -27 3 6 23 -28 2 17 24 -34 10 4 5 -3 10 12 20 13 -20 8 5 -4 -4 -7 17 -15 -20 -24 1 10 1 19 11 -9 14 2
6199 2 -21 18 -9 18 -13 5 0 -5 -7 -22 15 21 2 -13 -21 9 30 -27 16 0 -11 12 6 -15 28 -12 12 2 -17 5 5 3 -15 6 -13
6234 -13 4 11 20 4 13 -16 -23 -20 12 0 -15 -19 14 16 11 7 -14 13 -17 4 7 -5 12 -15 14 -17 -12 -17 1 2 18 7 0 9 -6 15 -6 6
$$ packed form
5978amj2K7lk5K2rJ1oNJ2j5k2L7l8L2j0K4l5J2%Pk3KJ4j0J3mpP%j6L2l9L5K6n0
6015a1J7%oNJ2l2pJ3J1J1k0K4k8J2j8K4k3OJ1J5k9K4j3nL5l3mL5m2OJ0Lj7J6N
6050Gl4L2J7Pl1J0kjj4K2j2j4K6k6K1j8J2k3J6j0J3NJj3K0lj3j2jK5oj4J0jQR
6086A3k0K0j4lJ6k4J5mJ1K3k6k0QlPJ1j3J3j3j8K4k4kK5J8j1mlLlLqpJ0M4q4L7
6123cJPJ5m1M6l3lK0J4j6pJ7qj4nK3mj5K0k3oK6j8PMj9K4l0J4J0J%j2K0k1J9k3
6160a3J8J9k2Kl1L0LJ7n1L0J5Pn8M4oJqJ3KQpl3K8lr%lK4l2nmK5RrJ8qk0K3j2
6199Bk3L9k7K7l1J8nnkj5L7Oj9j5qL0K1n7M3j6j1K3ok1M3m0K4j0j9K2%kj8K1j9
6234a3J7PRj6Rk9pLL2j2j5mL3Knmk1K7l0K1Lj2J7k7K9l1NnJ8JJ6j1pRj5K1k1J2
$$ plain form
6272 6 -4 18 5 -27 -8 0 -22 -22 22 24 -3 0 -6 9 -3 -23 8 -4 16 21 14 1 -6 32 -2 26 -8 -27 17 8 -14 14 17 -1 14 18
6308 18 -2 3 9 10 -15 11 -10 19 11 3 11 -7 13 -10 -17 5 1 23 -4 -20 14 31 -3 -18 -6 -14 -1 -6 19 -9 1 -1 -10 20 8 6 8
6345 8 6 -1 7 4 -9 19 9 6 18 9 15 -6 -1 -1 -14 5 0 22 -17 19 17 -9 3 -4 -20 0 27 -7 14 -11 11 -8 -13 -10 -28 -9 -5 -1 7
6384 7 9 -23 22 34 -7 25 -13 19 21 0 -3 12 11 -27 6 7 2 -1 6 5 -8 13 -14 -12 -21 -26 -12 22 -9 9 -3 -10 -20 15 -10 -13 -5 11
6422 11 5 -6 36 5 7 -12 -21 3 0 8 8 19 16 -5 -7 -17 10 6 4 10 19 -28 10 24 37 -5 -7 -20 -13 -9 -10 16 -11 -6 1 16 -13 20 15 -21
6462 -21 -2 -17 14 9 27 -29 -4 19 4 4 15 30 2 3 -2 21 -5 1 20 -35 -11 -17 4 -11 11 -6 -9 9 31 14 16 -5 -12 -24 3
6497 3 -13 12 -35 5 -17 -6 12 -14 5 -29 2 8 17 21 23 -12 9 -1 -15 1 -16 4 -15 -15 -37 10 16 7 4 -6 10 8 23 11 -9
6532 -9 1 -7 -7 -14 7 -5 -20 7 -20 -16 8 13 -4 0 -17 -17 -12 -10 -2 2 1 17 -20 -1 9 8 -23 13 16 6 -8 -21 2 25 0 4 -5 22 -10
$$ packed form
6272Fj0K2j3l2J9Qk2%M4Kk7LoJ5j2k0L1j2K0Npj3pL8l4K8l4j9M4rk2K8Lj8J5M
6308A8k0NOJk5K6k1K9qqQj8K0k3pK2mK2k7j6L4J7l4j5J2qJ3nK5k8J0krL0j2kK
6345HkpQlj3K8j0lJ2rOk1N%j3J9nK2l9L6kk6J2pj6K0K7l4K1k5K2j9nLj8J9MMQ
6384GKl2M5J2m1L2l8L2Kk1lJ5jl8L3JnlPjj3K1k7KrnJ4L4l1J8j2pj0L5k5lQJ6
6422A1oj1M2l1Kj9rK4lQ%J1lk1kj0K7mkORm7L8J4J3m2kj3PMjK6k7NPJ5k9L3nl6
6462b1J9j5L1nJ8n6K5K3j5%J1J5k8JnK3k6OJ9n5K4oK1j5K2j7lJ8K2j7Kk1pj2K7
6497Cj6K5m7M0k2J1J8k6J9l4L1ORMKl5K1j0j4J6j7K0j9%k2M7Orlj0J6kJ5j2k0
6532iJ0q%pK1j2j5K7k7MK4Nj7Mj7%NKQMjJ6l7J9J0jl1L6Lj0j4j3K3K3k5MrK7l2
$$ plain form
6571 -10 -12 18 1 -7 -7 14 14 -19 -7 -1 -10 21 -21 -20 -9 22 -5 10 -11 1 2 4 12 10 6 0 -7 -4 -9 0 -8 -2 8 3 17 -10 13 -9 25 7
6611 7 -15 17 14 16 5 5 -12 2 -34 -7 20 15 -38 -24 26 -7 -24 -4 -8 -1 -6 19 16 -17 2 18 -22 0 0 -15 -21 10 11 3 -16 -18 37
6648 37 -15 -1 3 2 5 -3 23 -17 -10 -4 -9 -2 -10 -27 -25 -17 7 -17 13 1 11 -11 19 24 -16 6 -5 -7 6 0 -7 -11 -8 -14 1 -12 13 28 5
6687 5 15 3 11 22 -19 -6 -9 25 19 32 16 2 22 20 17 18 0 -6 -26 -16 18 20 33 -12 -39 -13 22 32 -28 -35 3 -16 -24 12 7 -4
6723 -4 -5 -12 -11 15 -18 10 1 0 24 9 3 -9 27 -7 6 32 2 19 -21 5 -19 -9 -4 -13 -2 -3 17 -10 -12 10 0 12 -7 10 -8 -13
6759 -13 -6 -9 -16 23 -7 -23 -1 3 6 10 4 -23 12 2 6 4 7 25 -15 4 -1 3 -13 -8 2 -26 6 -5 -12 -8 2 9 -19 -18 3 -11 14 -7 -2
6798 -2 7 1 5 7 21 -16 1 -19 -18 7 -14 17 -1 -22 -4 -8 7 -2 -4 14 2 -5 -16 15 28 13 -4 -1 40 13 -15 22 6 -11 5 -26
6834 -26 6 -11 -18 -13 17 -27 6 -12 19 6 8 -7 16 -19 7 4 4 15 2 6 -8 1 -12 0 2 1 8 -15 -13 3 26 -4 -26 -8 24 2
$$ packed form
6571a0kL0j7q%K1%l3J2OrL1m2JJ1L1k7J5k1J2JKQkmopLnRqOJ0nJ4k7K3k2L4j8
6611Gk2L2lKj1%j7J4l6K7K7nn3J4N0l3j7K0mPnK5ll3J9J6m0K2%j5oL1Jqj9kN5
6648C7n2J4MjLqK6m0POnPqj7KQK4k4L0j2J0k2L0Nm0K2j1kJ3opmLoJ5j3K5J5k3
6687EJ0j2QJ1m1J3lL4oJ3j6j4K0klJj8ok0J0L4KJ3m5k7K6L5J0o0pL8j9qL6nj1
6723djpJK6l3K8rjK4j5oj2L6l4J3K6l0J7m0K6k4J0NrJ1jK0k7kK2j0J2j9J7j8n
6759a3PlpL9l0j6K2MLMok7L5j0MkLJ8m0J9nMj6NJ0k8L2j1pMJ0Pk8JK1j4K5k1N
6798bRoMKJ4l7J7k0JK5k1L1j8k1J8mJ5rkJ8j2pj1L1J3j5j7LM1k7k8L7j6j7J6l1
6834b6L2j7pNL0m4L3j8L1j3Kj5K3l5K6l%J1j3Mj4Rj3J2KjPk3KJ6K3l0k2J8L2k2
$$ plain form
6870 2 -5 -10 -4 16 -12 19 -13 14 -10 -17 -28 2 6 -5 5 -14 0 5 9 -11 8 -1 3 -27 -7 7 -1 21 16 2 -2 11 20 -7 17 15 13 -3
6908 -3 -4 -10 -24 -6 -11 20 2 -15 13 -8 13 28 -30 -18 8 -15 7 4 -13 2 -8 -32 -7 -14 20 -4 -1 14 4 12 -24 5 10 13 31
6943 31 29 1 12 23 -18 11 1 -3 22 -25 43 18 -4 4 4 -17 5 0 -17 -2 1 -18 -7 -4 7 -14 -4 12 28 0 -12 14 1 -20
6977 -20 -1 12 13 2 11 -11 -3 2 -6 8 -6 14 -2 4 32 -6 -9 7 -26 14 1 -16 3 -4 11 20 -18 9 4 6 -2 -8 22 -5 29 2 -11
7014 -11 -25 -14 -29 -9 0 -8 39 -21 -5 19 -19 31 -31 8 14 3 -5 9 24 12 6 12 -2 10 -6 -5 -17 0 4 15 2 14 2 -17
7048 -17 -11 12 -7 4 -1 -3 -16 18 22 -3 -11 5 -1 -7 23 -11 -7 -9 8 15 20 -17 14 3 -6 -9 14 37 -19 1 1 -3 21 -17 -5 0 19 -13
7086 -13 30 -4 -7 -15 -29 -17 17 -17 -30 6 -23 -1 3 -6 -13 10 -27 4 -7 16 9 8 11 11 9 -6 -17 -8 -6 16 8 -3 2 -11 15 1 -15
7123 -15 -11 -13 4 0 -19 2 6 42 10 28 11 1 29 -12 -16 1 -22 15 1 -9 12 1 -2 6 -15 -6 0 -6 15 17 -2 17 -3 13 5 22
$$ packed form
6870BpnOK0k8L1l2K7k4pj1L0Mj1J0j9J4NMk0J9rMl0K0J4qK2nj4mJ3Rk7K4kkj6
6908cjoj4J8nL1j8j7K8k1K1J5n8J2K6k3K2lj7J5j0k4K5pL4k4LJ5j0Ql6K9NLJ8
6943C1kk8J1J1m1K9j0mK5m7O8k5k2Q%k1K2nj7J5Lj9J1LJ1k1J0J6J6k8j2K6j3k1
6977b0J9J3Jj1Rk2QNqJ4j4K0j6OK8l8lJ6l3M0j3j7J9pJ5Rl8K7nKqoL0k7L4k7j3
7014a1j4J1j5K0RqM7o0J6K4l8N0o2L9Oj1qJ4J5j2oOj4J2j6Jj2J7MJ1j3J2j2j9
7048a7OK3j9J1nkj3L4Mk5qJ6ooL0l4MkJ7PNl7L1j1rlK3K3n6K0%mK4l8J2NJ9l2
7086a3M3l4lqj4J2L4l4j3L6k9K2MrpK3l7L1j1K3pjL%kj5j1RKK2qj1Nj3K6j4j6
7123a5MkJ7mj9K1ML6l2J8j7j0K8m1mJ7k3L7j4j0K1j1lQk1ROoK1Kj9J9k0J6qJ7
$$ plain form
7159 22 10 -13 10 7 2 1 -1 -12 8 -27 -5 0 -1 -17 -11 -49 9 16 -16 9 4 12 -2 -11 6 0 7 -7 15 -9 -2 34 5 33 14 -16 15
7196 15 -36 5 19 12 -2 -4 11 17 25 -1 3 -12 6 -17 8 4 9 10 1 0 -4 3 -13 6 -12 13 -3 -2 19 16 -11 1 -6 18 9 -13 -8 22 31
7235 31 4 -19 -16 1 -11 3 13 -24 19 25 35 -3 -12 -13 11 22 4 7 15 7 -9 -14 -28 7 -4 -13 1 0 -4 -5 18 -36 -18 -2 -27 41
7271 41 -17 0 5 -30 6 26 -1 4 -25 -5 -4 -4 -16 -6 7 -7 14 -8 8 41 10 -26 -15 19 -8 -2 5 -12 -35 -3 5 -34 -22 -16
7305 -16 -18 -18 -24 -13 10 -11 14 -25 -10 13 -32 4 -1 11 16 14 -22 6 1 36 11 22 -4 32 -12 35 -5 -11 17 50 9 11 -10 -6 -9 -4
7341 -4 8 -11 -2 -13 -19 -17 -4 4 15 -8 12 15 -39 -20 -28 4 -26 6 -20 -1 10 14 3 -8 -3 -11 6 7 -1 28 19 12 23 19 15 5 14 -14 6
7380 6 12 38 -2 -6 -6 -14 9 26 3 17 -11 5 -20 9 7 -12 1 -15 -3 2 -3 13 23 5 4 -10 -13 -11 -22 39 13 3 -5 -12 23 -10 -12
7417 -12 -12 7 31 -1 21 19 34 -8 -19 -21 -16 -7 -30 7 10 -6 -2 5 -11 2 28 -48 6 -4 29 15 2 4 -17 12 18 -9 -30 9 9 11
$$ packed form
7159B2j2k3K3lnjkj1K0l5K2Njj6Ol8N8Pl2K5nQj4rJ7oPj4K2k4PL6k9K8j9l0L1
7196A5n1M1J4pj4kJ5OQk6Mj5J8k3K5mNJrjmPj6J9j8K5j6JK1lk7J2pK4rk2NL0R
7235C1k7k3LJ7j2J4J0l7M3OJ0l8rjK4J1j8LQqj6nj4L5j1rJ4jmjK3n4J8J6k5O8
7271D1n8J7Nl5L6K0k7Nk9K0J%j2J0J3j4K1k2J6L3l1l6J1L4k7OPj7k3L2Ql9J2O
7305a6k%oJ1K3k1K5l9J5K3m5L6nJ2Nkl6K8nL5k5J1k6L6m4M7m0oK8L3m1Kk1MlN
7341dJ2j9Rj1oKJ3QJ1k3K0Ln4J9qL2l0L2k6J9J1Mj1j1NqJ7JqK9rpJ1mmj0Rk8K0
7380FOK6m0m%qK3J7k3J4k8J6k5K9kj9J3j6J2NnJ6J0j8jj4lKj1O1k6j0qpL5l3k
7417a2%J9K4l2K2kJ5m2j1kNRk3L7Lj6MPj6J3K6p6N4j0L3j4j3Kk1K9Ok7k1L9%K
$$ plain form
7453 11 -12 26 -4 1 3 -8 4 11 22 27 20 -11 6 -14 -21 2 3 13 -41 4 -2 -30 9 -7 -25 31 -7 -42 16 -17 -34 13 -7 -32
7487 -32 16 13 12 14 13 -9 14 24 20 1 -2 28 12 10 18 -15 2 11 -4 13 -5 -24 2 5 10 2 12 -39 -45 -7 -1 -14 -1 2 -12 14 -28 1
7525 1 11 8 3 -3 2 8 13 -11 13 -4 0 -3 31 -13 -13 -6 -11 10 12 4 6 -18 15 -3 4 15 -1 -6 16 -22 14 26 -8 7 13 27 -30 7 15 -26
7565 -26 6 -3 2 -17 5 -3 3 19 5 9 -7 21 -53 13 33 -11 5 -23 35 -4 -1 -9 -22 4 -8 3 -8 -10 -35 -10 4 8 19 0 -15
7600 -15 -25 13 -26 -7 -7 16 -3 8 -1 -9 -11 -32 9 -2 0 -5 -19 4 10 -7 2 17 11 12 -9 5 4 -7 6 15 -19 2 11 -6 -19 6 21
7637 21 -20 -20 -13 13 -2 -32 -4 -20 -8 -13 -21 -19 -4 -11 3 7 0 -3 7 -2 -22 10 7 13 14 42 -23 8 -31 -4 6 -11 1 0 33 16 -6
7674 -6 -7 8 -14 3 -11 -6 -20 24 -1 10 -6 -15 9 -25 3 -23 7 16 -1 12 -4 15 -1 -5 -14 -2 12 10 -29 7 -4 9 6 26 7
7709 7 -5 15 15 7 2 29 25 -3 2 -11 4 -11 -9 6 -5 -28 -7 -5 4 -7 -8 2 -17 4 -9 15 5 -3 -23 7 -22 18 6 27 -16 1
$$ packed form
7453A1k3L8l0NKj1J2PJ1Npl1J7k0pK3JJ0n4M5ok8L9j6j8N6l8l5N8l3j7M7k0k5
7487c2M8ljKjk2K3J0mj9lL0j6kQl3J7Rj5J7j8j9K6LNqJ0n1oL8Oj3J3Lj4K6m2K9
7525AJ0lnoNONk4K4j7MlL4m4%PnK1KqKk4L3j8PJ1j6nK2l8L6J2l4J5OJ4n7L7Qm1
7565b6L2rNj9K2qOJ6j4Mj6K8p4O6K0m4J6k8N8l9Lqj3K6j2J1j1kk5K5J4MJ1j9j5
7600a5j0L8l9J9%K3j9J1rqkk1M1j1Knj4K3Oj7RJ5oJk1J4jj1J3Rl4K1Rj7j3K5J5
7637B1m1%PK6j5l0K8j6J2nqKJ5pJ4MplJ0rk0L2lOJK8o5L1l9K7J0j7J2jL3j7k2
7674fjJ5k2J7j4Nj4M4k5J1j6rK4l4K8k6L0Rj7J3j6J9j6mrJ2J4kl9L6j1J3lK0j9
7709Gj2K0%qnK7mk8Nj3J5j5KJ5j1k3K1KRj1jJ0j9K1j3K4j0qk0L0k9M0j2K1m3J7
$$ plain form
7745 1 0 -12 3 -8 -9 7 6 -16 26 19 19 19 28 8 -9 -2 4 9 -4 -3 18 -4 -2 0 18 -5 -17 0 16 1 -13 -10 -1 14 -7 -10 -2 18 -4
7784 -4 -9 1 24 8 9 15 25 10 -3 -4 17 9 -4 -6 15 8 8 6 -2 -4 8 22 5 -20 -21 -12 6 24 -1 -21 6 -17 -20 -5 15 9 2 -2 -2 -1
7824 -1 -14 17 -6 -2 -4 -1 3 31 -13 -6 34 -14 27 -4 21 10 -16 14 -6 15 15 -1 19 -1 -5 7 2 20 -9 -7 -3 -12 -30 13 12 9 -17
7861 -17 2 -14 16 21 7 -6 7 -24 10 3 -1 -42 22 5 7 25 -8 18 -15 -3 32 25 25 3 5 19 -7 -34 -11 -31 -17 1 -4 29
7895 29 -12 -8 -2 14 -15 -23 -6 13 -23 -1 -10 8 -13 10 -5 1 -1 -12 19 7 19 5 -5 21 -1 28 5 16 -17 18 14 -5 43 5
7929 5 -18 26 17 -2 11 -2 -17 -2 32 -19 -13 -9 5 -16 -6 -22 20 -13 -4 6 31 -35 -2 -2 13 14 -13 16 -4 25 19 14 -9 4 -10
7964 -10 3 8 1 5 -28 4 3 -35 -17 6 -23 18 23 7 -3 -4 15 20 -8 -34 7 19 -12 2 -11 21 10 -27 -25 23 10 6 -1 12 15 7
8000 7 -10 15 35 11 -19 -2 -14 14 9 -4 4 27 -18 -14 31 -25 7 -5 3 3 -19 -25 17 14 -15 -3 -16 13 7 15 5 13 23 -6 -11 -5 9
$$ packed form
7745Ajj2J5j1jJ6jk2M2p%%Rk0j7PONj3JK1k2KKJ8k3j2J7J6j5j4LRJ5k1lQK0k2
7784dnJ0K3j6JOJ0j5j3jK1qj3kK1p%kqkJ2J4j7k5jRJ8J8k5k0K7k3lJ5K0opm%J
7824aj3L1k3MkLMK8m4PM0m8M1l1K5j1k6L0k0K1%j6K0k0mJ2nJ8k9KMrj8M3jlk6
7861a7J9j6L0Nj4j3J3l1L4pmm1O4j7KJ8l3K6l3J2L5p%k2KJ4k6k7K3k0J4J8nL3
7895B9m1MOJ6k9qJ7J9l6K2rJ8k1K3j5Okj1L1j2J2j4j0K6k2K9k3J1l3L5mj9M8l8
7929Ek3M4rj9J3j3j5J5L4n1OMJ4k1J0j6M2l3RJ0K5o6L3%J5Jk7K9k0K9onk3J3j4
7964a0J3NpMl3L2jl8J8K3k9M1Nj6j0jJ9Nk8k6M1J2l1J4j3L2j1l7KM8j3mpJ3Lq
8000Gj7K5K0k4l0J7j2K8nj3QK3m5MM5n6L2j2Q%k2oM2lk9J2j3K9oQj0QJ0k9nOJ4
$$ plain form
8037 9 -23 -6 10 11 7 13 -10 -18 22 10 29 2 -4 36 -15 20 10 10 16 -25 20 17 16 -2 8 -5 28 -2 13 -10 -4 -7 6 -12 0 -1 3
8074 3 1 16 -1 -13 3 11 -5 23 -18 22 4 9 19 4 -15 3 6 11 34 -3 25 20 5 16 -5 20 12 -22 -17 -2 -15 -15 26 3 6 -30
8110 -30 5 -12 16 0 -21 -9 -14 -16 -1 -13 11 9 20 34 -26 19 10 -3 19 8 -6 -2 3 -4 13 20 -1 41 30 2 -2 7 -12 -12 -9 15
8146 15 -15 1 -15 24 11 9 10 -16 -25 -10 -8 -16 11 21 16 29 18 -13 -12 6 8 0 -18 21 20 -27 1 2 -16 26 5 13 19 -21 8 4 -9
8183 -9 -5 20 2 -9 4 -17 26 11
$$ packed form
8037Il2J7J6JmOk3qM0j2J9k7oM0n1L5j0%Om1M5ljj8J0j3L3l0J5k3OlJ3j8J2jM
8074CkJ5j7j2J6Qj6K8m1M0j8NJ0j5j9J8LNK3l7K8nj5J1k1K5ql4NJ5j3%M1k3Ll6
8110c0L5j7K8j6k1J2nkJ5j2K4kJ1J4o0M5rj3K2j1j4MNpJ7Pk1M2j1k8mRj9%LK4
8146A5l0J6j6L9j3kJk6rJ5KqK7J0nJ3j1l1JJ8Kqj8L9jm7K8Jj8M2k1QOm0K9mj3
8183iMK5j8j1J3k1M3j5
8191A1
$$ Imaginary data points
##PAGE= N=2
##DATA TABLE= (X++(I..I)), XYDATA
$$ plain form
0 0 0 0 0 0 0 0 0 0 0 0 0 0 0 0 0 0 3 -4 8 -8 8 -8 8 -12 16 -16 20 -24 25 -32 33 -40 44 -52 58 -65 76 -84 92
39 92 -101 116 -127 141 -158 172 -193 211 -232 257 -283 313 -344 379 -419 461 -511 566 -629 703
59 703 -790 892 -1016 1171 -1373 1642 -2026 2609 -3631 5889 -21335 79567 240468 303415
73 303415 298017 203860 60307 -104200 -229265 -291536 -268105 -170918 -22019 125488 232897
84 232897 270612 235463 131432 -9023 -143978 -230603 -251602 -202015 -96223 37625 156197
95 156197 226774 231414 171517 62061 -63237 -166909 -219634 -210201 -140724 -30763 86173
106 86173 173623 209124 185751 110355 3547 -102388 -176669 -199404 -164861 -81934 24191
117 24191 119814 177009 182913 138058 54608 -44044 -128386 -174214 -169733 -116535 -29151 65710
$$ packed form
0@%%%%%%%%%%%%%%%%LpJ2j6J6j6J6k0K8l2L6m4M9n7O5p3Q4r6J10j23J41j60J76
39I2j93K17k43K68k99L30l65M04m43M89n40N96o57P23p98Q80r72J077j195J332
59G03j493J682j908K187k544L015l668M635o240R520k7224J00902J60901O2947
73C03415n398r4157j43553j64507j25065o2271K3431R7187J48899J47507J07409
84B32897L7715l5149j04031j40455j34955q6625k0999M9587J05792J33848J18572
95A56197P0577M640n9897j09456j25298j03672n2725R433O9477J09961J16936
106H6173Q7450L5501k3373p5396j06808j05935p4281k2735L4543Q2927J06125
117B4191R5623N7195N904m4855q3450r8652q4342m5828M481N3198Q7384R4861
$$ plain form
129 65710 138329 168559 150856 91261 6058 -80044 -141348 -161016 -134602 -69578 15343 94097
141 94097 143202 150432 115772 48607 -32667 -103712 -142924 -139809 -97047 -27519 48750 109823
153 109823 138349 127177 79912 10027 -62115 -115168 -133819 -113844 -61653 7728 74037 117491
165 117491 125963 98586 44084 -22234 -81999 -117748 -118853 -85093 -26951 37935 90409 115653
177 115653 107535 69194 11740 -48543 -94457 -112557 -97940 -55145 2923 59231 97457 106986
189 106986 85866 40621 -15714 -67133 -98578 -100979 -73983 -26088 28485 73908 97415 92704
201 92704 61549 13028 -38954 -79163 -95783 -84279 -48504 646 48731 82010 91199 74194
213 74194 36097 -11987 -56291 -83840 -86659 -64069 -23185 23711 62976 83486 79574 52842
$$ packed form
129F5710P2619L0230j7703n9595q5203q6102o1304j9668K6414O5024Q4921P8754
141I4097M9105P230l4660o7165q1274p1045l9212L115M2762O9528P6269O1073
153A09823K8526j1172m7265o9885p2142n3053j8651J9975N2191O9381O6309M3454
165A17491Q472k7377n4502o6318n9765l5749j105L3760N8142O4886N2474K5244
177A15653q118l8341n7454o0283m5914j8100J4617M2795N8068N6308L8226R529
189A06986k1120m5245n6335n1419l1445k401K6996M7895N4573M5423K3507m711
201I2704l1155m8521n1982m0209j6620J1504L5775M9150M8085L3279R189j7005
213G4194l8097m8084m4304k7549k819K2590M0884M6896L9265K0510l912k6732
$$ plain form
225 52842 11325 -32944 -67380 -82003 -72646 -42253 187 41873 70681 78644 63986 31252
237 31252 -10009 -48180 -72179 -74899 -55711 -20458 20118 54112 71978 69019 46258 10314
249 10314 -28463 -58613 -71335 -63069 -36566 108 36156 61270 68399 55774 27257 -8900
261 -8900 -42250 -63076 -65186 -48183 -17346 18012 47632 62934 59898 39721 8343 -25244 -51324
274 -51324 -62144 -54679 -31359 753 32133 53748 59517 48024 22953 -8563 -37362 -55138
286 -55138 -56562 -41426 -14393 16372 41928 54993 52003 34091 6524 -22784 -45274 -54233 -47244
299 -47244 -26510 1555 28722 47246 51818 41398 19154 -8391 -33385 -48453 -49133 -35409 -11522
312 -11522 15265 37238 48121 45060 28949 4658 -20807 -40101 -47393 -40764 -22253 2391 25980
$$ packed form
225E2842m1517m4269l4436j4623R357L0393M2440M1686K8808P963j4658l2734
237C1252m1261l8171k3999k720J9188L5253M0576L3994J7866k959k2761l5944
249A0314l8777l0150j2722Q266K6503L6674L6048K5114P129j2625k8517l6157
261h900l3350k0826k110J7003L0837L5358K9620J5302l036k0177l1378l3587k6080
274e1324j0820P465K3320L2112L1380K1615N769j1493k5071l1516k8799j7776
286e5138j424J5136K7033L0765K5556J3065k990j7912k7567k9308k2490q959O989
299d7244K0734K8065K7167J8524M572j0420k2244k7545k4994j5068o80J3724K3887
312a1522K6787K1973J0883l061j6111k4291k5465j9294p292O629J8511K4644K3589
$$ plain form
325 25980 41720 45232 35637 15851 -8361 -29981 -42694 -42775 -30316 -9162 14274 33207 42323
338 42323 39138 24727 3267 -18947 -35548 -41614 -35436 -18969 2707 23316 36863 39671 31059
351 31059 13563 -7714 -26620 -37659 -37566 -26549 -7945 12624 29314 37287 34475 21771 2857
364 2857 -16687 -31376 -36676 -31205 -16729 2386 20514 32491 34942 27308 11859 -6952 -23573
377 -23573 -33222 -32966 -23136 -6724 11348 25970 32870 30195 18809 2081 -15106 -27770 -32178
390 -32178 -27142 -14293 2558 18371 28721 30647 23652 9907 -6536 -20977 -29194 -28855 -20042
403 -20042 -5475 10345 23019 28834 26299 16243 1581 -13456 -24524 -28288 -23709 -12225 2528
416 2528 16345 25255 26873 20684 8542 -5947 -18619 -25740 -25261 -17442 -4699 9189 20275 25427
$$ packed form
325B5980J5740L512r595j9786k4212k1620j2713q1J2459K1154K3436J8933R116
338D2323l185j4411k1460k2214j6601o066O178J6467K1676K0609J3547K808q612
351C1059j7496k1277j8906j1039R3J1017J8604K0569J6690P973k812j2704j8914
364B857j9544j4689n300N471J4476J9115J8128J1977K451p634j5449j8811j6621
377b3573r649K56R830J6412J8072J4622O900k675j1386j6728j7187j2664m408
390c2178N036J2849J6851J5813J0350J926o995j3745j6443j4441q217L39Q813
403b0042J4567J5820J2674N815k535j0056j4662j5037j1068l764M579J1484J4753
416B528J3817Q910J618o189j2142j4489j2672p121M79P819J2743J3888J1086N152
$$ plain form
430 25427 23192 14189 1144 -12103 -21697 -24835 -20712 -10629 2384 14530 22406 23703 18112 7318
444 7318 -5477 -16627 -22800 -22267 -15258 -3861 8488 18206 22574 20339 12257 710 -10977 -19380
458 -19380 -22134 -18327 -9159 2481 13204 20034 20980 15887 6245 -5154 -14976 -20393 -19758 -13370 -3135
473 -3135 7764 16303 20071 18073 10781 384 -10030 -17382 -19588 -16098 -8009 2295 11782 17858
487 17858 18734 14161 5435 -4804 -13449 -18097 -17469 -11813 -2767 6910 14514 17889 16050 9562 326
502 326 -8927 -15453 -17480 -14415 -7136 2139 10638 15933 16536 12398 4762 -4259 -11943 -16163 -15644 -10521
518 -10521 -2353 6372 13115 15959 14211 8402 210 -7996 -13798 -15591 -12836 -6332 1917 9470 14282
533 14282 14851 11231 4319 -3863 -10820 -14480 -13831 -9310 -2208 5461 11545 14322 12877 7703 233
$$ packed form
430B5427k235r003j3045j3247r594l138M123J0083J3013J2146P876J297n591j0794
444G318j2795j1150o173N33P009J1397J2349R718M368k235q082j1547j1687q403
458a9380k754L807R168J1640J0723O830R46n093r642j1399r822n417O35O388J0235
473c135J0899Q539L768j998p292j0397j0414p352k206L490Q089J0304R487O076
487A7858Q76m573q726j0239q645m648O28N656R046R677P604L375j839o488r236
502C26r253o526k027L065P279R275Q499N295O03m138p636r021p684m220N19N123
518a0521Q168Q725O743K844j748n809q192q206n802j793K755O504Q249P553M812
533A4282N69l620o912q182o957l660O49M521P102P669O084K777j445n174p470
$$ plain form
548 233 -7206 -12385 -13901 -11432 -5779 1498 8352 12731 13337 10045 3981 -3181 -9427 -12872 -12583 -8632
564 -8632 -2163 4831 10396 12811 11428 6898 526 -6038 -10899 -12539 -10447 -5366 1149 7294 11330
579 11330 11966 9143 3738 -2681 -8343 -11494 -11192 -7710 -2128 3942 8967 11387 10460 6441 607 -5340
595 -5340 -9630 -11104 -9293 -4907 748 6217 9903 10661 8295 3561 -2107 -7153 -10101 -10012 -7053 -2090
611 -2090 3404 7866 10050 9240 5746 758 -4407 -8315 -9842 -8458 -4540 576 5469 8759 9461 7306
627 7306 3179 -1797 -6213 -8855 -8927 -6298 -1928 2893 6834 8861 8279 5229 744 -3914 -7386 -8663
643 -8663 -7369 -3977 416 4668 7591 8362 6590 2922 -1570 -5484 -7794 -7831 -5575 -1704 2531 6012
659 6012 7750 7210 4563 607 -3390 -6435 -7599 -6516 -3503 471 4248 6728 7255 5659 2414 -1439
$$ packed form
548B33p439n179j516K469N653P277O854M379O06l292o064p162o246l445K89L951
564h632O469O994N565K415j383m530o372o564m861j640K092N081O515O145M036
579A1330O36k823n405o419n662l151L02L482N582O070N025K420r27m019n834n947
595e340m290j474J811M386N655N469L686P58k366m734n668n046k948Q9K959M963
611b090N494M462K184q10l494m988n165l908j527J384L918N116M893L290P02k155
627G306m127m976m416k642p2K629M370M821L941K027n82l050m485m658l472j277
643h663J294L392M393M252K923P71j772l668m492l914k310l7K256L871M235L481
659F012J738n40k647l956l997l045j164J083L013L974L777K480N27j596l245l853
$$ plain form
675 -1439 -4812 -6771 -6811 -4828 -1462 2295 5309 6789 6273 3946 491 -3058 -5642 -6639 -5642 -3013
691 -3013 395 3655 5827 6330 4991 2210 -1233 -4213 -5956 -5945 -4213 -1255 1952 4546 5844 5436
707 5436 3496 521 -2593 -4831 -5701 -4908 -2716 234 3114 5014 5463 4347 1965 -904 -3500 -5064
723 -5064 -5139 -3788 -1329 1495 3838 5033 4802 3166 650 -2018 -4089 -4926 -4330 -2533 -31 2483
739 2483 4192 4757 3914 1951 -592 -2883 -4306 -4471 -3390 -1311 1072 3133 4283 4189 2903 774
755 774 -1533 -3379 -4200 -3851 -2350 -210 1988 3527 4058 3431 1826 -317 -2317 -3605 -3853 -3018 -1302
772 -1302 812 2602 3652 3616 2587 756 -1221 -2813 -3581 -3337 -2125 -355 1537 2954 3461 3022 1706
789 1706 -77 -1826 -3030 -3325 -2670 -1295 476 2056 3044 3134 2327 909 -837 -2257 -3019 -2922 -1954 -494
$$ packed form
675a439l373j959m0J983L366L757L014J480n16k327l455l549k584r97R97K629
691c013L408L260K172N03j339k781l443k980j743J1J732K958L207K594J298m08
707E436j940k975l114k238q70P93K192K950K880J900M49j116k382k869k596j564
723e064p5J351K459K824K343J195k31j636k516k668k071q37N96J797K502K514
739B483J709N65q43j963k543k291j423j65J081K079K383K061J150r4j286k129
755G74k307j846q21L49J501K140K198J539N31o27j605k143k000j288k48Q35J716
772a302K114J790J050l6j029j831j977j592p68K44J212J770J892J417N07m39j316
789A706j783j749j204k95O55J375J771J580R88R0q07j418j746j420p62R7R68J460
$$ plain form
807 -494 1139 2409 2965 2638 1589 110 -1390 -2481 -2849 -2380 -1269 226 1643 2509 2698 2084 902
824 902 -525 -1780 -2497 -2536 -1832 -610 774 1885 2477 2352 1530 287 -1020 -1994 -2405 -2134 -1235 -33
842 -33 1172 2025 2281 1905 967 -266 -1336 -2062 -2185 -1657 -725 477 1489 2038 2051 1411 427 -691 -1604
861 -1604 -2015 -1859 -1204 -167 916 1660 1928 1691 957 -65 -1055 -1690 -1866 -1505 -701 250 1177 1699 1762
880 1762 1297 494 -482 -1269 -1662 -1622 -1096 -250 654 1342 1667 1467 880 55 -770 -1384 -1554 -1337 -670 143
900 143 907 1408 1492 1149 490 -276 -1004 -1399 -1405 -987 -317 465 1093 1407 1296 828 157 -555 -1104 -1297 -1171
921 -1171 -671 2 671 1144 1268 1053 539 -135 -745 -1117 -1208 -949 -422 207 788 1127 1139 797 259 -335 -851
942 -851 -1083 -1045 -709 -192 394 849 1037 968 592 107 -481 -864 -1031 -883 -502 46 538 883 1000 785 418
$$ packed form
807d94J633J270N56l27j049j479j500j091l68M69J111J495J417Q66J89o14j182
824I02j427j255p17l9P04J222J384J111N92j25q22j243j307r74m11K71Q99J202
842c3J205Q53K56l76r38j233j070p26j23N28R32J202J012N49J3o40r84j118r13
861a604m11J56O55J037J083P44K68k37p34j022r90o35j76L61Q04R51R27N22O3
880A762m65q03r76p87l93M0N26Q46R04O88L25k00n87q25q25o14j70K17O67Q13
900A43P64N01Q4l43o59p66p28l95oM18O70P82O28L14j11m68o71p12n49j93J26
921a171N00O73O69M73J24k15n14o74o10l72r1K59N27O29N81L39J2l42n38n94n16
942h51k32L8L36N17N86M55J88o9l76m85n88l83j67J48L81N48M92L45J17k15l67
$$ plain form
963 418 -106 -587 -864 -923 -704 -283 181 587 850 866 645 222 -279 -643 -849 -828 -586 -144 283 652 834
984 834 777 461 93 -372 -637 -816 -720 -443 -45 414 693 825 677 354 -37 -418 -693 -761 -618 -314 102
1005 102 491 701 783 581 253 -142 -494 -723 -730 -537 -176 210 527 701 718 510 158 -268 -549 -681 -702 -471
1027 -471 -109 276 587 751 656 406 49 -347 -618 -735 -652 -375 -39 396 666 754 631 323 -75 -450 -704
1048 -704 -773 -623 -266 137 482 741 771 611 226 -185 -560 -779 -769 -545 -163 254 611 799 761 517 91
1069 91 -383 -699 -847 -741 -434 9 447 763 846 706 381 -44 -486 -769 -836 -665 -314 167 584 830 835 594
1091 594 190 -266 -663 -849 -839 -587 -137 354 745 888 806 457 7 -459 -783 -906 -774 -415 94 543 852
1112 852 919 686 276 -199 -642 -886 -932 -601 -197 320 726 927 860 548 83 -435 -803 -937 -800 -454 49
$$ packed form
963D18n24m81k77n9K19M21M64M06K63J6k21m23n01l64k06K1K42M42M27L69J82
984H34n7l16l68m65k65j79R6K77L98M59K79J32j48l23l91l81k75o8J43L04M16
1005A02L89K10Q2k02l28l95l52k29pJ93L61L86L17J74J7k08l52m26k81j32k1K31
1027d71L62L85L11J64r5k50l57l96k71j17Q3K77L36M35K70Q8j23l08l98l75k54
1048g04o9J50L57M03L45K59L0j60l85m11l75k19J0K24L82M17L57J88l8k44m26
1069I1m74l16j48J06L07M43M38L16Q3j40l25m25m42k83o7J71L51M81M17K46Nk41
1091E94m04m56l97j86J0K52M50M91L91J43q2l49m50m66l24j23J32L59N09M49L09
1112H52O7k33m10m75m43k44m6L31M04N17M06K01o7l12m65n18l68j34J37L46N03
$$ plain form
1133 49 544 876 945 773 380 -165 -632 -935 -968 -719 -267 269 710 960 967 599 145 -399 -804 -972 -850 -502
1155 -502 -24 495 878 1023 813 409 -104 -592 -922 -1000 -728 -299 262 699 993 951 647 179 -367 -800 -1001
1176 -1001 -911 -551 -64 467 881 1026 812 421 -55 -577 -918 -1001 -784 -318 184 644 968 948 683 188 -327
1197 -327 -762 -963 -900 -593 -87 444 851 989 864 505 -70 -530 -894 -977 -785 -350 168 654 922 978 707
1218 707 240 -287 -755 -964 -938 -631 -121 377 827 963 873 519 -36 -532 -874 -942 -815 -375 146 615 950
1239 950 987 710 289 -273 -735 -982 -941 -621 -102 404 844 1011 880 518 8 -524 -906 -987 -818 -366 159
1260 159 663 936 987 720 252 -290 -746 -1004 -959 -635 -96 419 805 972 886 534 -38 -511 -872 -990 -809
1281 -809 -393 159 644 925 959 713 233 -295 -746 -980 -920 -595 -100 434 839 982 876 494 -28 -555 -890
$$ packed form
1133D9M95L32O9j72l93n45m67l03l3K49M52N36M41K50Pl68m54n44m05j68J22L48
1155e02M78N19L83J45k10m04n13m88l30p8K72M29N61M37K94m2l04m68n46m33k01
1176a001R0L60M87N31M14J45k14l91m76n22l41q3K17M66N02M60L24k0k65m95n15
1197c27m35k01O3L07N06N31M07J38j25l59n75m60l64q3J92M35N18M86K68N6k71
1218G07m67n27m68k09K6L07N10M98M50J36r0l54n55m96l42o8J27M40N21M69L35
1239I50L7k77m21n62m62k47M1L20N19N06M40J67j31l62n10n32l82q1J69M52N25
1260A59N04K73N1k67m68n42m56k58M5L24N39N15L86J67q6l52n72m73l61j18J81
1281h09M16N52M85K81L4k46m80n28m51k34O0L25M95N34M05J43j06l82n22n27l35
$$ plain form
1302 -890 -966 -774 -350 178 686 928 951 697 230 -315 -748 -960 -916 -608 -87 442 818 963 810 415 -75
1323 -75 -545 -906 -961 -749 -313 188 662 901 925 660 184 -332 -722 -952 -878 -547 -56 446 799 933 824
1344 824 439 -61 -549 -841 -940 -762 -313 178 606 897 862 650 192 -319 -719 -939 -878 -532 -81 385 744
1365 744 900 800 436 -67 -506 -804 -895 -715 -320 181 606 860 864 609 215 -282 -660 -880 -842 -516 -64
1386 -64 404 754 865 771 419 -30 -525 -812 -874 -678 -301 128 606 812 826 605 170 -285 -664 -826 -786 -487
1408 -487 -59 371 722 866 734 386 -57 -465 -756 -831 -649 -304 155 544 803 793 595 168 -254 -614 -803
1429 -803 -756 -510 -69 368 662 805 704 366 -28 -436 -718 -806 -617 -306 161 533 726 799 561 179 -224
1450 -224 -590 -748 -702 -484 -57 319 627 764 655 356 -37 -430 -690 -739 -602 -258 130 497 698 764 533
$$ packed form
1302h90p6J92M24N28N08K42K3k54m67n45m33k12M4L08N21N29L76J45j53l95m90
1323g5m70l61n5K12M36N01M74K39K4k65m76n16l90k30P4L31M91N02L53J34j09
1344H24l85n00m88k92r9J78M49M91M28K91l5k12m58n11m00k20O1L46M51M66L59
1365G44J56j00l64n03m39k98r1J80L95N01M25K54Mk55l94m97l78k20L8L26M52
1386f4M68L50J11r4l52m49m95k87o2J96L77M29M78K06J4k21m35m55l79j62M0K99
1408d87M28M30L51J44j32l48m43m08k91p5J82L45M59L89K59j0j98m27m22l60j89
1429h03M7K46M41M37K94J43j01l38l94m08k82q8J89L11M67L72J93P3k38l82m03
1450b24l66j58M6K18M27L76L08J37j09k99l93l93k60m9J37L44L88L67K01O6k31
$$ plain form
1471 533 153 -234 -562 -751 -702 -437 -70 301 572 720 639 356 4 -393 -641 -732 -571 -289 112 431 661
1492 661 692 511 184 -188 -503 -675 -656 -470 -88 288 571 698 623 374 30 -351 -595 -661 -524 -250 94
1513 94 425 622 654 488 137 -169 -459 -648 -640 -393 -89 258 509 667 576 326 -7 -329 -585 -660 -531 -270
1535 -270 80 409 563 648 492 162 -171 -469 -631 -617 -389 -71 257 517 623 537 301 -15 -307 -545 -627
1556 -627 -500 -245 108 379 532 595 454 128 -161 -448 -596 -544 -393 -78 228 470 575 533 315 1 -303
1577 -303 -526 -552 -475 -222 79 337 530 523 419 152 -136 -400 -535 -550 -391 -110 199 448 554 469 292 29
1599 29 -271 -487 -540 -439 -234 19 330 465 515 349 148 -123 -362 -516 -504 -335 -49 211 392 491 418 279
1621 279 0 -237 -432 -487 -419 -201 46 297 451 467 377 163 -119 -332 -487 -450 -349 -94 150 354 482 452
$$ packed form
1471E33l80l87l28j89M9K65L67L71K71J48q1k83l52l97k48r1J61K82M01L19K30
1492F61L1j81l27l72l15j72J9J86L82L76K83J27p5k49l44l81k44o6J37K74L44
1513I4L31J97L2j66l51l06k90j89QK47L04L47K51J58r1k50l33l22k56p5J29K61
1535b70L50L29J54Q5j56l30l33k98j62J4K28L18L28K60J06q6k36l16k92k38q2
1556f27J27K55L53K71J53O3j41l26k89k87j48N2J51L15L06K42J05m2k18l14l04
1577c03k23k6P7K53L01K58J93pj04k67k88k64j35j5J59K81L09K49J06q5j77k63
1599B9l00k16n3J01K05K53L11J35N0j66k01k71k39j54J2J69K86K60J81R9p3j39
1621B79k79k37j95n5O8K18K47K51J54J6r0k14k82k13j55L7J01K55K44K04J28l0
$$ plain form
1643 452 238 30 -201 -400 -455 -399 -218 9 236 395 455 340 150 -97 -293 -414 -455 -324 -109 133 289
1664 289 394 428 259 45 -186 -334 -431 -379 -204 -30 201 379 393 374 149 -54 -236 -357 -388 -316 -112 88
1686 88 269 404 354 259 62 -154 -296 -396 -376 -228 -48 163 309 375 327 180 -4 -222 -358 -370 -286 -134 43
1709 43 223 305 332 246 82 -90 -251 -330 -333 -215 -82 124 286 319 301 196 13 -185 -276 -340 -312 -171 2 176
1733 176 292 315 269 126 -58 -231 -310 -349 -256 -117 93 259 312 313 237 48 -141 -301 -324 -284 -167 1 150 276
1757 276 311 251 155 -19 -208 -285 -319 -230 -81 86 230 318 286 201 70 -111 -237 -293 -318 -187 -8 140 249 304
1781 304 273 118 -3 -188 -262 -273 -268 -86 44 180 274 288 187 70 -102 -200 -262 -248 -193 -36 120 266 293 247
1805 247 156 -18 -153 -249 -295 -229 -110 40 178 268 265 248 98 -54 -212 -286 -275 -191 -46 87 218 272 244 170 33
$$ packed form
1643D52k14k08k31j99n5N6J81K27K27J59O0j15j90k47j96j21m1J31K15K42J56
1664B89J05L4j69k14k31j48r7N2J75J74K31J78J4j9k25k03j82j21l1P2K04K00
1686H8J81J35n0r5j97k16j42j00K0J48J80K11J46O6m8j47j84k18j36j2Q4J52J77
1709D3J80Q2K7q6j64j72j61p9lJ18J33K06J62L3j8j05j83j98r1o4K8J41J73J74
1733A76J16K3m6j43j84j73p9l9R3J39K10J66N3Jp6j89j89j60k3M0J17J68J49J26
1757B76L5o0r6j74j89p7l4Q9J49J67J44Q8l2q5j31j81j26n6k5J31J79J48J09N5
1781C04l1j55j21j85p4j1NJ82J30J36R4J4j01j17j72r8o2J4N5J57J56J46K7m6
1805B47r1j74j35r6m6O6J19J50J38R0lj7j50j52j58p4J1Q4J45J33J31N4k8p4j37
$$ plain form
1830 33 -126 -223 -287 -249 -121 17 162 263 272 218 96 -51 -193 -271 -248 -208 -73 71 184 254 250 176 13 -116 -247
1855 -247 -301 -209 -135 3 183 254 253 223 101 -30 -182 -240 -279 -188 -45 72 198 260 235 168 31 -111 -213 -271 -250
1880 -250 -110 -4 161 230 273 187 103 -44 -166 -238 -256 -182 -75 77 218 253 259 158 20 -113 -231 -286 -246 -120
1904 -120 8 137 225 260 197 81 -34 -159 -237 -268 -181 -48 51 173 233 205 148 42 -111 -191 -239 -234 -134 -26 116
1929 116 217 246 195 113 -13 -158 -210 -232 -166 -70 30 154 240 231 168 54 -100 -169 -221 -226 -132 -40 90 182 249 210 109
1956 109 -34 -141 -219 -252 -165 -93 30 174 227 225 163 96 -52 -177 -231 -208 -121 -56 108 199 189 241 137 9 -110
1981 -110 -205 -239 -175 -118 11 137 209 229 164 71 -34 -191 -215 -222 -154 -46 73 167 225 210 134 20 -108 -205 -208 -206 -138
2008 -138 -12 124 187 225 200 102 -38 -142 -218 -210 -180 -67 70 157 220 219 166 29 -48 -182 -226 -234 -139 -29 111 166
$$ packed form
1830C3j59r7o4L8J28J38J45J01Rn4j22j47j42p8K3M0J35J44J13P0mp4j63j29j31
1855b47n4R2P4J38J80P1jl0j22j31j52n8l9R1J43J17J26O2k5o7j37j42j02n8K1
1880b50J40J06J65O9M3q6q4j47j22p2j8P4J07J52J41L5Oj01j38j33j18n5M0J26
1904a20J28J29Q8L5o3j16j15j25p8l1Q7J33R9J22O0k8n7j06j53q0m8NJ00J08J42
1929A16J01K9n1q2j26j45n2k2O6R6J00J24Q6ro3j14j54o9n2nR4R2J30R2O7l9j01
1956A09j43j07p8l3Q7P2J23J44N3ko2o7j48j25n4K3Q7O5J64R1j0N2j04j28j19
1981a10r5l4O4N7J29J26P2K0o5r3j05j57k4pO8J08J19R4N8j5p6j14j28r7lKO8
2008a38J26J36O3L8k5r8j40j04p6QL0J13J37Q7O3jn3j37p7j34m4qR5J10J40N5
$$ plain form
2034 166 206 200 91 -19 -127 -212 -230 -211 -88 33 150 237 216 153 38 -98 -195 -241 -221 -154 -33 93 226 248 207
2059 207 114 12 -101 -177 -268 -206 -77 -13 157 232 229 136 61 -106 -176 -233 -226 -153 -38 100 181 257 209 101 8 -113
2085 -113 -181 -233 -206 -104 41 148 198 240 196 56 -55 -159 -216 -230 -156 -35 96 214 237 208 162 23 -101 -234
2109 -234 -256 -217 -139 19 124 200 240 202 59 -21 -147 -205 -192 -211 -97 76 177 231 191 138 4 -125 -208 -227 -195
2134 -195 -146 25 131 208 217 175 93 -46 -154 -215 -212 -211 -71 90 184 266 225 125 25 -99 -158 -235 -212 -109 27 137
2160 137 212 209 172 72 -28 -121 -232 -255 -184 -79 80 170 230 233 128 30 -76 -186 -264 -237 -117 -8 118 206 204 196
2186 196 94 -5 -139 -213 -232 -184 -45 44 161 227 237 166 34 -100 -197 -216 -238 -144 -31 97 190 205 192 121 -8
2211 -8 -148 -249 -232 -186 -106 33 177 220 237 159 61 -84 -154 -237 -234 -152 -20 114 172 228 217 124 12 -118 -202 -244 -209
$$ packed form
2034A66M0oj09j10j08q5j8J9J23J21J17Q7k1o3j15j36r7m6K0O7J21J26J33K2m1
2059B07r3j02j13p6r1O2J29O4J70P5lr3p5j67p0n7PP3J15J38Q1P6m8j08r3j21
2085a13o8n2K7J02J45J07N0M2m4j40j11j04n7j4P4J21J31J18K3k9m6j39j24j33
2109b34k2L9P8J58J05P6M0l8j43q0j26n8J3j9J14J73J01N4m0n3j34j29q3j9L2
2134a95M9J71J06P7Rm2q2j39j08o1LJJ40J61R4Q2m1j00j00j24n9p7K3J03J36J10
2160A37P5ll7j00j00r3j11k3P1J05J59R0O0Lj05r8j06j10p8K7J20J09J26Q8kq
2186A96j02r9j34p4j9M8J39Q9J17O6J0p1j32j34r7j9k2R4J13J28R3J5j3p1j29
2211hj40j01J7M6Q0J39J44M3J7p8r8j45p0q3LQ2J32J34N8N6j1r3j12j30q4m2L5
$$ plain form
2238 -209 -71 26 165 196 236 136 79 -84 -182 -233 -238 -152 -17 67 195 242 201 111 -1 -119 -207 -238 -199 -99 50
2263 50 143 239 242 184 67 -78 -168 -214 -229 -160 -46 98 194 244 218 135 -18 -129 -217 -235 -220 -125 17 138 210 203 150
2290 150 66 -61 -135 -209 -237 -178 -60 84 157 224 208 126 -23 -119 -208 -233 -196 -99 25 122 235 218 174 61 -44 -163
2316 -163 -213 -213 -155 -49 81 154 199 203 132 21 -107 -182 -253 -210 -115 35 113 205 212 158 70 -66 -172 -222 -231 -157 -64 79
2344 79 187 214 199 123 33 -110 -212 -232 -165 -107 16 135 196 231 193 63 -49 -140 -205 -216 -136 -40 90 188 210 171
2370 171 107 13 -124 -189 -209 -191 -103 16 136 198 214 171 73 -73 -146 -211 -229 -157 -51 80 156 231 155 119 26 -120
2396 -120 -182 -209 -182 -106 17 118 189 203 168 69 -59 -160 -201 -209 -148 -39 62 162 180 181 111 21 -88 -172 -216 -195 -115
2423 -115 -7 135 193 190 144 58 -20 -157 -223 -203 -158 -48 72 145 190 192 140 0 -120 -189 -217 -205 -107 -22 123 171 171
$$ packed form
2238b09J38R7J39L1M0j00n7j63r8n1nQ6J35Q4J28M7m1r0j12j18q8l1L9J00J49
2263E0R3R6Ln8j17j45r0m6j5O9J14J44R6N0k6q3j53j11q8j8J5R5J42J21P2pn3
2290A50q4j27p4p4k8N9J18J44P3O7j6q2j49r6q9k5L7R7J24R7J13j7m4j13j05j19
2316a63n0%N8J06J30P3M5Mp1j11j28p5p1M3R5J50P8R2Pn4q8j36j06n0rP4R3J43
2344G9J08K7j5p6r0j43j02k0O7N8J23J19O1L5l8j30j12r1o5j1Q0R6J30R8K2l9
2370A71o4r4j37o5k0J8Q8J19J20O2J6m3r8j46p3o5j8P2J06J31P6P5p6l6r3j46
2396a20o2k7K7P6J23J01P1J4l5r9j28j01m1qO1J09J01J00J8Jp0r0j09q4m4K1Q0
2423a15J08J42N8lm6q6p8j37o6K0M5J10J20P3M5Kn2j40j20o9k8J2R8Q5J45M8%
$$ plain form
2450 171 159 70 -38 -126 -212 -197 -127 -57 57 131 177 158 133 19 -108 -188 -212 -165 -96 6 131 202 188 155 71 -9 -112
2477 -112 -180 -175 -132 -34 55 154 180 187 105 32 -76 -160 -217 -178 -101 5 77 165 207 148 78 -31 -146 -202 -203 -158 -51 51
2505 51 121 154 172 88 25 -101 -141 -234 -159 -103 -7 75 155 173 131 69 -46 -134 -204 -219 -141 -33 72 133 162 179 92 13
2533 13 -85 -136 -205 -194 -93 -16 100 155 176 149 67 -24 -150 -167 -188 -153 -56 82 109 177 159 104 12 -66 -147 -159 -178 -101
2561 -101 37 114 156 179 149 73 -52 -126 -169 -194 -100 -19 48 138 162 184 117 27 -72 -141 -192 -143 -89 13 103 137 182 119
2589 119 76 -41 -94 -166 -153 -113 -38 68 125 174 119 84 6 -53 -153 -154 -156 -94 -3 107 148 122 138 41 -21 -106 -167 -140 -87
2618 -87 -38 51 112 134 133 120 -1 -69 -141 -168 -139 -90 4 89 134 148 128 67 -27 -101 -181 -171 -136 -29 83 114 131 103 69
2647 69 25 -65 -121 -146 -142 -84 0 117 138 155 90 40 -31 -104 -153 -153 -92 -65 56 107 131 134 96 10 -83 -134 -145 -153 -83 34 75
$$ packed form
2450A71j2q9j08q8q6J5P0P0J14P4M6j9k5j14j27q0k4M7O9J02J25P1j4l3q4q0j03
2477a12o8NM3R8Q9R9K6Pq2p3j08q4n7L9P7J06P2Q8M2n9p0j09j15n6jM5J07J02
2505E1P0L3J8q4o3j26m0r3P5N6R6Q2Q0J8m2o2j15q8p0j5P8J08J05O1K9J7q7p9
2533A3r8n1o9J1J01P7J16N5K1k7q2r1j26j7k1L5R7J38K7O8j8n5r2p8q1j2j9P7
2561a01J38P7M2K3l0p6j25p4m3k5R4Q1O7R0K4K2o7r0r9o9n1M9N4J02R0L4M5o3
2589A19m3j17n3p2J3M0P5J06N7M9n5l5p8n9j00jkO2R1J10M1k6J6r7o2q5o1K7N3
2618h7M9Q9O1K2jj3j21o8p2k7K9M9R4Q5M5J4k0o1r4p4q0J0L5J07J12L1J7k8l4
2647F9m4r0n6k5MN8Q4J17K1J7o5n0p1p3m9%O1K7J21N1K4Ll8q6r3n1j1qP0J17M1
$$ plain form
2678 75 138 146 109 37 -52 -93 -159 -135 -95 -58 10 97 117 125 69 29 -44 -137 -147 -93 -31 17 80 114 141 107 52 -21 -80 -142 -147 -130
2710 -130 -24 52 123 105 108 98 7 -69 -118 -122 -116 -57 6 74 111 117 83 33 -16 -101 -117 -119 -102 -51 68 115 128 100 85 -20 -61
2741 -61 -113 -115 -106 -51 -2 40 128 108 91 61 -40 -116 -135 -134 -58 -7 41 95 136 98 60 -20 -90 -120 -118 -89 -54 16 67 81 120 83
2773 83 32 -66 -99 -107 -125 -68 8 39 87 119 91 81 -6 -72 -139 -122 -69 -49 -6 81 86 90 78 19 -54 -95 -100 -109 -73 5 70 82 102
2806 102 104 26 -30 -41 -123 -120 -111 -40 42 59 76 108 57 -1 -17 -52 -92 -80 -46 -21 40 116 102 68 50 -19 -64 -113 -113 -86 -43 25
2838 25 58 118 82 61 0 -40 -81 -91 -72 -58 -29 30 89 84 92 45 -25 -91 -73 -90 -92 -44 16 85 115 104 66 18 -9 -85 -92 -69
2870 -69 -40 -2 56 93 91 79 66 -4 -30 -96 -56 -58 -11 28 39 93 78 44 -1 -57 -80 -79 -68 -33 -7 46 56 59 67 56 -32 -75 -80
2903 -80 -102 -50 -24 18 46 66 62 47 25 -2 -62 -96 -47 -34 0 34 76 101 77 44 -8 -56 -77 -69 -61 -9 11 49 85 74 53 18
$$ packed form
2678G5O3Ql7p2q9m1o6K4M0L7O8Q7K0Qn6m0p3r3j0N4O2M8O3L4K7l4n5p3n9o2nJ7
2710a30J06P6P1j8Lj0r1p6m9mON9O3O8L7Ol4n0m9q5j6kJ7N1J19M7J3k8j5j05m1
2741f1n2kRN5M9M2Q8k0j7l0j01p6j9JP6N1M8N4M1l8l8q0p0l0KK9L5P0N1J4L9l7
2773H3n1r8l3qj8N7P6L1M8L2k8j0q7o6o7J7N3K0M3Q7NMj2n9p3m1nrL6P8O5J2K0
2806A02Kp8n6j1q2LRP1Q2J7J7L2n1n8j6l5m0J2L4K5O1P6j4l4j8o9m5m9%K7M3O8
2838B5L3O0l6k1o1m0m1j0J9J4K9N9N9nQm7p0o6J8j7kM8O0O9L0j1l8m8k7p6pK3
2870f9K9L8N8L7kj2j3p0k6o6M0kM7L9J1N4j5l4m5n6k3JJ1L5K6N3J0LQj1q8m3n
2903h0k2N2K6M2K8K0mj5k2k7o0l4M9J3L4L4M2K5k4l3n2m8k1QQN2K0L8L6j1k1l5
$$ plain form
2935 18 -26 -54 -57 -46 -52 -6 39 53 74 71 11 0 -21 -51 -86 -40 -39 -11 76 70 56 46 -1 -18 -38 -82 -62 -72 -49 15 55 52 60 8
2969 8 -19 -33 -63 -87 -54 -41 0 25 69 50 46 14 -19 -31 -63 -44 -73 -4 62 35 52 39 0 11 -33 -68 -45 -37 14 1 34 74
3001 74 39 36 12 -25 -31 -63 -49 -15 2 33 73 49 44 16 -6 -56 -69 -48 -63 -49 -1 8 50 51 65 19 -14 -30 -47 -65 -47 -1 21
3034 21 35 54 48 6 -5 -51 -66 -57 -29 -24 20 41 48 73 46 15 -14 -18 -30 -53 -13 -15 14 49 61 23 6 -4 -32 -20 -66 -48 -12
3067 -12 9 28 69 44 8 -1 -29 -37 -37 -38 -35 -2 27 52 50 22 9 -9 -12 -50 -52 -42 -36 -6 13 32 27 31 -3 -9 -36 -13 -40 15 -18 15
3103 15 32 24 27 3 17 4 -19 -25 -16 -9 4 18 25 42 17 10 -25 -34 -40 -51 0 6 -4 39 12 29 -6 -7 13 -35 -23 -14 1 -9 9 7 16
3140 16 19 16 -28 -25 -37 -24 -11 -20 32 2 41 43 7 -10 -11 0 -3 -13 38 29 9 0 10 18 1 -2 -30 -45 -19 -11 -21 30 4 39 25 -8
3176 -8 -12 -13 -8 2 -22 -44 5 6 -6 -1 3 -20 -15 -29 -20 -22 -9 -20 3 -10 -6 21 19 -12 -12 -6 0 15 -9 -6 19 22 5 -14 9 -15 -13 -20 19 -3
$$ packed form
2935A8m4k8lJ1oM6M5J4K1lo0j1k1l0l5M6JK8Q7oj4j0m7j7k0m4K0j0K3O4M0lQn2
2969Hk7j4l0k4L3J3M1K5M4j9ml2l3j2l2J9k9O9O6k7J7j3l9J1m4l5K3QN1j3L3M0
3001G4l5lk4l7ol2J4L4J7L1M0k4nk8k2n0j3K1j5J4M8RM2JJ4m6l3j6j7j8J8M6K2
3034B1J4J9om2j1m6j5RK8NM4K1PK5k7l1k9mj2k3M0kK9L5J2l8j7j0k8J2m6J8L6
3067a2K1J9M1k5l6rk8q%jLL3K9K5kk8j3j8ll8kJ0OL0J9J9nMl4ok7K3k7N5l3L3
3103A5J7qLk4J4j3k3oRPJ3J4PJ7k5pl5roj1N1Oj0M3k7J7l5jK0m8J2RJ5j0J8kR
3140A6Llm4Lj2J3J3rN2l0L9Kl6j7jJ1lj0N1rk0rJ0Qj7lk8j5K6Qj0N1k6L5j4l3
3176hmjNJ0k4k2M9Jj2NMk3Nj4RkJ3j1K3j3MK7kl1%OOJ5k4LK5Lj7j9K3k4KpL9k2
$$ plain form
3216 -3 -11 9 27 2 8 -15 5 -14 6 -5 -6 4 -9 -4 23 7 2 3 12 -18 -5 6 -1 -2 0 16 20 18 8 -16 -7 -22 -17 -1 5 -9 12 13 24
3255 24 -6 6 8 -16 10 -30 -17 8 -7 5 20 5 -7 -11 7 -26 -8 -22 -36 15 -20 -6 3 21 -15 -9 30 -7 1 -23 -7 -4 -19
3288 -19 -31 1 18 10 -31 -13 4 3 7 12 8 17 22 -3 -13 3 -1 11 -14 3 -30 -17 -14 19 14 15 6 -3 -16 -36 15 19 -16 -18 -29 13 22 -2
3326 -2 14 -3 -8 -11 -2 -21 -7 -20 3 -27 8 9 14 -9 7 -2 10 -11 5 22 22 9 10 12 19 14 11 -30 -21 4 -7 16 -1 3 12 5 -6 12 -9
3365 -9 -4 -27 -4 -2 2 7 11 7 8 26 -16 16 11 -22 3 6 26 -15 -19 -15 16 -7 -6 -7 -27 -2 -17 -17 12 -4 0 -11 -3 -7 -11 -5 -18 -16 -4 -23 9
3406 9 -13 -3 15 10 8 -1 -27 -1 5 17 -7 8 14 -1 2 7 14 -17 -26 21 -15 22 13 6 9 21 21 -4 10 -6 -16 2 0 0 -5 -7 -10 -1 -10 4 -17
3447 -17 -10 7 -24 -10 5 20 16 -8 12 -10 -22 -22 -35 -6 -4 7 2 -3 1 14 14 -11 -28 15 -9 -28 -7 -22 -5 22 -3 -6 3 -12 -33
3482 -33 19 -17 -27 -1 6 -7 -10 14 0 -2 -26 -1 -15 -40 -15 -12 17 7 15 21 -21 -7 -18 -29 -16 5 17 -6 15 0 10 8 -36 5
$$ packed form
3216cqK0J8k5Ok3K0j9K0j1jJ0j3NK7j6nJRl0J3J1pjKJ6Mkj0k4Rj5NJ6Oj4K1JJ1
3255B4l0J2Kk4K6m0J3K5j5J2J5j5j2mJ8l3J8j4j4N1l5J4RJ8l6OL9l7Qk4J6Lj5
3288a9j2L2J7qm1J8J7jMNmRNk5j0J6mJ2k5J7l3J3LL3nJrrj3k0N1Ml5kj1M2Rk4
3326bJ6j7nlRj9J4j3K3l0L5JNk3J6rJ2k1J6J7%j3JKPnlm1RK5j1K3j7MRpj1J8k1
3365iNk3K3KMNMmJJ8m2L2nl3K5LK0m1mML1k3Jjk0K5j5%K9j6Mj1QmmOj3KJ2j9L2
3406Ik2J0J8nkrk6K6OJ2k4J5Oj5LNPl1rM7l6L7rpLJ2%k5J4j6j0J8k%nklRrJ4k1
3447a7PJ7l1J4J5J5mk4K0k2j2%j3K9KJ1nnMJ3%k5j7M3k4j9K1j5J7K7k5lRj5k1
3482c3N2l6j0K6Pj3lK4j4kk4K5j4k5K5LK9j0QOm2J4j1j1J3K1J2k3K1j5J0km4M1
$$ plain form
3516 5 -10 -25 2 12 13 20 -26 11 24 10 4 -33 -19 -38 -13 -10 13 0 17 11 9 -6 -10 -25 -33 -21 3 32 16 30 -6 -11 -31 -11 -14 -27
3552 -27 -36 19 -20 20 23 11 12 22 12 -20 0 -12 -17 14 5 17 8 21 -4 3 -4 -21 -29 -24 11 13 14 5 18 22 -3 20 -8 4 -6 31 29 -12
3590 -12 22 27 43 14 0 33 -34 -37 -25 -22 -4 18 17 13 -12 -4 0 -16 -10 -8 17 5 -4 14 34 7 19 -2 -12 -33 -1 -11 -21 -2 33
3625 33 4 36 31 -19 7 -13 5 5 8 -15 17 5 31 6 17 -8 -11 -11 -27 22 -18 -1 0 7 42 22 -18 -12 -6 -33 -20 -12 -1 24 -4
3660 -4 32 12 -4 -5 19 -43 -19 -11 -17 11 2 29 10 17 17 -17 -28 -15 -3 -10 -10 3 3 25 14 4 1 -27 -16 1 -18 1 6 -13 18 33
3696 33 23 0 13 -26 -58 -1 13 3 0 15 3 50 8 14 14 -10 -21 -22 -27 -19 6 29 23 2 -8 -1 -5 -31 5 -8 5 32 13 -4 29
3731 29 -7 8 -31 -3 -13 -20 -17 -12 3 31 10 14 4 -17 -22 -26 -18 3 -2 13 17 11 3 -16 7 -5 -16 -45 -27 -6 9 25 6 -17 -21 -23 17
3768 17 -29 -18 -3 -7 0 5 13 11 45 1 -13 -17 -44 1 -22 -3 -10 3 5 10 5 10 0 -22 3 -24 5 24 -16 30 27 8 12 38 -5 -42 -34
$$ packed form
3516Ej5j5K7J0JPm6L7J3j4ol7J4j9K5LK3j3J7okj5mj5qJ2K4K9j6J4l6nk0K0lj3
3552b7rN5l9M0Lj2JJ0j0l2K0j2nL1rJ2rJ3k5Ppj7qNL5KJrJ3Mk5K3k8J2j0L7km1
3590a2L4NJ6k9j4L3o7lJ2LJ8K2jmk5QMj6OKK5j2rJ8K0k7J2k1j0k1L2j0j0J9L5
3625C3k9L2nn0K6k0J8%Lk3L2j2K6k5J1k5l%j6M9m0J7JPL5k0m0OOk7J3QJ1K5k8
3660dL6k0j6jK4o2K4QoK8rK7j9P%l4j1J3J2p%J3%K2j1j0lk8J1J7j9J9Nj9L1J5
3696C3j0k3J3l9l2N7J4j0lJ5j2M7m2O%k4j1jnQK5K3ok1j0Pmk6L6j3J3K7j9j7L3
3731B9l6J5l9K8j0pLNJ5K8k1Mj0k1nmQK1nJ5Moqj9K3j2j1k9J8K1J5J6j9k3mkM0
3768A7m6J1J5mPNQkL4m4j4mk7M5k3J9pJ3KNnNj0k2K5k7K9J9m0M6lj9MK6m3l7Q
$$ plain form
3805 -34 -3 -8 2 -11 -12 28 -4 2 13 -3 -2 -7 -25 -5 12 -2 24 30 4 0 -17 -29 -44 -41 -37 42 3 -8 9 15 -17 7 3 1 -5 7 -21
3842 -21 12 2 6 23 14 13 11 -13 -27 -40 -1 -2 -3 30 8 -10 -14 5 -2 -36 -23 -5 -7 14 -4 -1 22 2 -28 -3 0 -20 -27 5 -4 5 20
3879 20 3 18 15 -5 -21 -5 -21 -19 3 8 -17 16 22 -15 -7 -13 1 13 -35 -31 -9 15 30 23 -19 2 -16 -22 -44 -10 2 13 15 18 8 -20
3915 -20 1 22 -7 -1 -35 6 2 6 6 22 15 12 28 -4 5 -1 -10 -13 -34 -4 14 6 -9 -14 -5 -20 -9 20 -26 -1 0 8 19 -38 5 27 -20 -39
3953 -39 3 -11 -8 -12 -3 20 39 27 7 14 -6 6 -27 0 -16 -6 -9 25 25 8 32 -32 -13 -4 -57 -23 14 23 3 20 31 -1 -3 -28 -2
3988 -2 -9 43 15 -30 -15 -13 -20 23 15 -11 -2 -25 -6 -1 -7 -25 23 32 -21 -10 -27 -1 -10 -18 1 0 -11 5 13 26 -5 1 -29 -11 -20 9 -12 5
4026 5 -6 12 -3 -7 37 -6 -16 -15 -33 -8 -19 7 18 2 -7 -21 14 -6 22 -15 -16 0 -17 -31 -37 21 -4 19 5 -7 -17 -2 4 -55
4060 -55 2 -11 4 -21 -15 18 -3 -4 -5 -32 -9 -12 12 -14 7 -1 4 -4 -15 -1 -40 11 2 -3 -6 1 -7 0 28 5 -10 -14 -36 -10 -14 7 -3 1
$$ packed form
3805c4L1nJ0j3jM0l2OJ1j6Jnj8K0J7j4K6Ok6mj7j2j5LMP9l9j1J7Ol2K4mkoJ2k8
3842b1L3j0MJ7rjkk4j4j3L9jjL3k2j8mJ9pl4J3J8kK1j8LK3k0l0K5Lk0pL2rRJ5
3879B0j7J5lk0j6J6j6KK2Nk5L3Ol7QoJ4J2m8MK2K4J5pm2K1j8ok2L4J2J1KLj0k8
3915b0K1K1k9Ol4M1mM%J6plJ6l2Rorlk1L0J8qj5nRj5J1K9m6K5JQJ1n7M3K2m7j9
3953c9M2j4LmRK3J9j2k0Pk0J2l3K7j6J0lL4%j7K4o4J9Rn3L4L7Rk0J7J1l2kk5K6
3988bpN2k8m5J5KpM3qk6Rk3J9Noj8M8Rn3J1j7K6rqJ9jj1J6QJ3l1Ol0J8rK9k1J7
4026Ej1J8j5mM4m3j0Jj8K5j1K6J1j6rj4L5k0K8l7jJ6j7j4oN8k5K3j4j2j0J5On9
4060e5N7j3J5k5OL3k1jjk7K3lK4k6K1qNqj1J4l9N1rnlPqPK8k3j5mk2K6mK1j0M
$$ plain form
4098 1 -24 -15 9 -13 4 6 -22 -15 11 -8 -25 13 13 -4 -7 -37 -10 -20 -28 -31 9 29 -15 -5 1 -9 -22 -19 -5 -4 10 -20 2 -9 12 -2
4134 -2 9 0 -4 -9 -15 -21 -3 2 -16 5 -4 2 3 -47 -7 -9 -16 -8 -16 20 19 -4 -11 -8 -15 -1 -10 -12 11 -34 -26 -23 -6 -10 16 -23 -38 -16 6 -30 -13 15
4176 15 4 17 14 -6 -8 15 15 7 2 -16 -5 0 -1 0 -2 2 0 20 -2 -26 -20 -28 -28 -4 -10 -14 2 -18 -7 18 -8 -11 -13 -32 -16 17 7 -23 -5
4215 -5 3 1 -9 -21 -9 -32 -18 21 -12 0 29 -10 -3 9 3 -5 -5 -3 -16 -6 11 -12 -3 -6 -3 -32 -8 42 -28 10 -15 18 -9 4 18 -16
4251 -16 -41 -20 -14 -17 -19 -6 15 5 -12 -26 -8 19 -29 -4 -18 -5 26 -9 17 -5 2 -21 -20 9 -21 -23 -8 -11 1 -34 -12 -8 -4 -2 10
4286 10 3 13 -6 -13 -10 -13 -2 -14 -10 -14 5 8 4 -26 25 7 -6 5 2 13 7 3 -4 22 -19 -22 -18 -12 -17 -16 -17 -1 -12 -1 9 -2 1 4 -7 5
4326 5 -9 -7 -2 17 -10 -6 4 7 -9 -8 -12 -18 -16 14 4 -26 -11 7 9 16 -3 4 8 -2 -27 7 9 -17 -14 13 -22 -14 21 17 13 -18 11 -15 -6 -6
4366 -6 -3 -26 -4 3 -15 3 0 -18 -5 -8 -11 0 21 -21 2 -13 -3 -18 -21 -4 -3 22 -30 -15 11 1 3 6 -5 -35 4 5 -14 -2 9 -13
$$ packed form
4098Ak5RK4k2J7Kk8PK6j9j7L8%j7ll0K7j0qlM0K0m4J0Oj0j3LJ4JJ4l0K2j1K1j4
4134bJ1rmnooJ8Nj8K1rOJn0M0kpQqL6jk3pLpJ4rkK3m5QLJ7mK6l9j5K2K2l6J7K8
4176A5j1J3lk0kK3%qnj8J1NjJkMkK0k2k4Oq%K4omJ6k0J1K5k6lkj9J6L3j0l0J8
4215eQkj0j2J2k3J4L9l3J2K9l9PJ2oq%Kj3J0J7k3RlLk9K4N0p0L8k5L3k7J3J4l4
4251a6k5K1OlkJ3K1j0j7j4J8K7m8K5j4J3L1l5K6k2Pk3JK9l0kJ5lJ2l5K2MMKJ2
4286A0pJ0j9pLlJ1j2MmJ9Lml0N1j8j3J1lJ1ompK6m1lMOnJjJ6j1J1J0j1LLj1J2
4326Ej4KNJ9k7MJ0Lj6JmoKL0j0l0J5J8KPj9PMj0k5L4Kk6LK7l5QL5mml1K9k6R%
4366fLk3K2Pj8J8lj8J3llJ1K1m2K3j5J0j5lJ7JK5n2J5K6j0KLj1l0L9Jj9J2J1k2
$$ plain form
4402 -13 -26 -21 -4 -20 16 -8 -24 14 -20 -20 5 2 5 -16 -28 -24 -33 -7 -15 -17 11 4 -8 1 -7 -30 -35 -21 1 14 -30 -32 8 -1 4 1 -2 -5 -17
4441 -17 13 -2 16 -4 14 12 -10 -4 7 -7 -14 11 -16 9 -6 -2 1 -42 -7 -25 -3 -2 -3 -3 -2 -2 -5 9 17 6 -17 14 18 -4 -7 1 19 -7
4479 -7 10 1 -16 15 -16 -10 5 -31 -23 14 -6 3 -6 7 40 -8 -5 2 -7 7 -18 23 -5 5 8 -5 -21 -6 -12 29 3 -1 -30 5 3 2 20
4516 20 -7 16 -14 18 3 -9 9 -8 8 -28 -17 13 -14 -14 -10 -24 16 -10 11 -14 -2 -4 -24 -3 16 -15 6 -14 6 1 3 5 3 16
4550 16 -22 12 -15 -27 -10 -5 1 -6 8 -7 19 19 1 15 22 -9 -15 -6 13 -13 -21 -3 -6 22 -8 4 -4 -3 7 -17 1 0 13 -5 -8 5 -41
4587 -41 -20 -12 -9 -8 -17 -17 5 0 -19 -13 17 25 -3 -14 9 8 -5 -7 3 44 15 1 -27 -2 -11 34 13 -27 1 -8 -30 -4 3 -3 -15 -23 30 -9
4625 -9 -5 -21 -15 -19 -12 -43 17 3 3 10 -9 -17 -4 19 0 -4 -6 9 20 7 21 0 -4 5 1 20 14 15 8 28 -1 5 7 -3 17 -21 0 20 -6
4664 -6 5 -9 29 -35 -11 -20 -27 -1 -8 -14 -18 -36 -3 -4 -6 4 -11 -3 7 11 12 0 1 16 -39 -1 -1 -5 -1 7 -1 -13 7 3 0 -13 -22 -1 5 7 8 -14
$$ packed form
4402a3j3NJ7j6L6k4j6L8l4%K5lLk1j2MrK6qkK8pj2Rqk3nJ4K2J3m4kM0rNlllj2
4441a7L0j5J8k0J8kk2OJ1j4pK5k7K5j5MLm3L5j8K2Jj%J%lJ4Qj1k3L1Mk2lQJ8k6
4479gJ7rj7L1l1OJ5l6QL7k0RrJ3L3m8LPrJ4k5M1k8J0Lj3j6J5oM1k6mk9L5kjJ8
4516B0k7K3l0L2j5j2J8j7J6l6J1L0k7%Mj4M0k6K1k5J2kk0K1J9l1K1k0K0nKKkJ3
4550A6l8L4k7j2J7NOpJ4j5K6%j8J4Pl1oRJ9k6qJ8lK8l0J2qJJ0k4J8jJ3j8lJ3m6
4587d1K1QLJr%K2nj9OL0Qk8j1K3jj3kJ0M1k9j4k8K5rM5k1m0K8rk2K6Poj2qN3l9
4625iMj6OmPl1O0j4%Pj9qJ3K3j9mkJ5J1j3J4k1mRmJ9oJpK0k9OKj0K0l8K1K0k6
4664fJ1j4L8o4K4rpK6pomj8L3jkJ0j5QJ0MJj2JJ5n5L8%mMQqj2K0mlj3rK1OKJk2
$$ plain form
4706 -14 -13 -19 -17 -35 -34 6 17 8 -2 -10 -11 -1 -12 -4 12 28 2 -2 14 -4 14 33 -22 -28 -18 0 1 -3 10 -18 0 23 17 -22 17 -6 -30
4743 -30 -4 -10 19 16 7 6 5 -19 5 -7 4 -13 -6 -29 7 4 -6 -10 19 -39 -22 -4 -5 9 29 15 -5 -18 -17 4 -3 1 -21 5 -21 -2
4779 -2 17 -10 -34 6 -2 -6 -2 -22 26 -10 -7 5 -33 -9 -9 -9 4 -1 -26 -11 -11 -15 8 -29 6 -4 -14 -12 0 -15 -13 -1 4 -3 8 6 -16 14
4817 14 31 3 -1 6 -1 -1 -7 15 15 -27 -12 5 -10 -14 -18 -13 -12 -13 23 10 -14 11 -22 8 -27 -25 14 9 9 -10 -29 0 -4 -20 10 9 11 -13 -12
4856 -12 4 -20 -8 -13 -2 -2 31 -5 2 -8 -14 15 -6 4 -3 1 -9 -27 16 -19 -4 -18 2 -2 13 -19 -32 9 22 1 17 -3 15 5
4890 5 9 -9 -5 -27 -20 -9 -22 -6 -5 -3 5 10 -12 -6 -1 -18 -16 -10 3 -6 -22 3 24 20 -16 -19 6 -1 -12 18 9 -11 12 25 -6 -3 7 -5 -10 3
4930 3 15 7 10 2 -19 10 -9 -17 9 15 13 12 -4 -10 18 -2 -15 21 12 -26 -22 19 2 -15 -15 -4 6 -3 34 6 -11 13 4 13 22 26 8 -44 -1
4969 -1 -3 -13 -2 5 -12 -11 10 -1 13 -16 -5 4 -2 -8 -13 1 -26 12 14 7 -8 -22 -13 16 -3 -22 15 31 7 7 -14 5 -4 25 -15 -22 -3
$$ packed form
4706a4JoKj8JM0J1rj0qjJ0j1QJ6J6k6mJ6j8J8J9n5oJ0J8JmJ3k8J8K3ol9L9k3k4
4743c0K6oK9lrjjk4K4j2J1j7Pk3L6lj0mK9n8J7J8jJ4K0j4k0j3JK1pMk2K6k6J9
4779bJ9k7k4M0qmMk0M8l6LJ2l8K4%%J3nk5J5%mK3l7L5j0j0KJ2j5KJ2NpJ1kk2L0
4817A4J7k8mPp%oK2%m2J5J7j5mmNJjL6j3k4K5l3L0l5KL9n%j9j9K9mj6L0jKk4J
4856a2J6k4J2nJ1%L3l6Pj0oK9k1J0pMj0j8M3l5J5j4K0mJ5l2j3M1J3k1J6k0J8j0
4890EMj8Mk2PJ1j3J6JKQNk2ONj7KOJ3rj6K5K1ml6lK5pj1L0rk0K3J3l1LJ0j2nJ3
4930CJ2qLqk1K9j9qK6Okjj6oK8k0j3L6rl8MM1j7j7%J1J0rL7k8j7K4rRRMj8n2M3
4969akj0J1Pj7JK1j1J4k9J1RoonJ4k7L8Kpj5j4RK9j9j9L7J6k4%k1J9rK9m0pJ9
$$ plain form
5006 -3 -4 19 -20 8 -43 -10 -2 -17 -5 -5 -4 -2 -5 -42 4 -3 6 11 -26 -21 28 -8 -8 -10 -14 32 -44 -36 -14 -12 30 8 -13 7 -11 -9 -9 -23 7
5045 7 1 -14 1 -38 -10 -11 -8 -4 1 12 -2 -17 -22 -15 -2 2 -2 4 -17 -9 -4 -1 -8 1 -19 -33 6 -25 10 -14 9 10 1 -5 -15 -19 -29 -11 -6 -12 -16 -6
5087 -6 8 -8 -1 -10 -3 19 -36 -13 -5 13 -25 -11 1 -27 -10 5 18 -6 -15 17 -18 -3 -7 6 -21 22 -25 14 -24 8 21 16 -3 -2 2
5122 2 11 19 -8 -39 3 -22 -13 7 -9 -6 -9 16 5 -8 0 5 -11 -16 14 -8 -10 9 37 -10 21 23 9 6 11 11 -8 -19 10 11 -15 1 -30 1
5160 1 18 -19 -16 0 7 1 -16 -15 -18 -10 -20 37 33 -1 -37 -1 0 -5 11 0 11 -15 -14 3 22 21 -10 5 5 6 -27 25 1 6 -3 -1 12 23 -20
5199 -20 -23 18 -3 -19 11 10 4 -6 -14 10 -3 26 -12 -8 9 -22 18 -7 -19 12 6 -8 -23 0 -13 17 1 6 -18 13 -2 -20 18 -9
5233 -9 -12 6 6 -6 -33 -4 0 -8 5 -10 -2 -11 1 -25 29 23 15 1 -9 -34 -6 -4 17 7 -7 4 25 -3 1 -6 -33 -8 -3 8 8 0 -12 -4
5271 -4 -16 -3 -18 34 -3 -23 -24 15 -11 26 1 -7 8 -16 3 30 -21 7 3 -20 -5 -1 -21 -6 -22 -3 -18 -10 11 20 -38 -12 -43 -8
$$ packed form
5006cjK3l9K8n1L3Qj5J2%JKll7M6pRNl7NM9l6%kmM6p6QK2KM2k2k1K0j8K%j4L0
5045Goj5J5l9K8jLMNJ1j4j5nPJ3MmOk1QNLpRk0j4L9l1L5k4K3Jroj0mj0J8NomJ0
5087fJ4j6PrPK2n5K3QJ8l8J4J2k8J7J5J3k4rL2l5J5mJ3k7M3m7L9l8L2J3nj9JM
5122BRQk7l1M2k5RK0j6LlK5j1j3QNj6nL0k2kJ9K8m7L1Kj4lN%j9j1K9Jk6J6l1L1
5160AJ7l7LJ6Poj7JlQj0N7ml4l6L6JnJ6j1J1k6JJ7J9jl1J5%Jl3N2k4NrKJ3J1m3
5199b0lM1k1j6L0joj0qK4j3K9l8MJ7l1M0k5j2L1oj4j5K3j3L0j6Nk4L1j5j8L8k7
5233ilJ8%j2k7K9MqJ3j5QrJ2k6N4oqj4j0k5K8KK1j0j4J1K1k8Mpk7K5NJ1%qj2Q
5271dj2J3j5N2l7k0jL9k6L7k5qJ5k4J9K7n1K8mk3J5Mk0J5j6J9j5QK1Rn8K6l1L5
$$ plain form
5305 -8 -17 -28 -13 -19 -8 -18 -21 -28 12 7 -21 -29 8 -5 -10 -17 -19 -13 1 -10 1 -13 6 -6 -15 -10 3 -19 -7 5 -4 -9 -10 -25 11 -16 -14 -4 -11
5344 -11 16 -16 -6 -25 12 -9 -4 12 20 -11 7 -14 6 8 -20 4 15 -1 -22 -11 4 -12 -4 5 -46 1 1 16 7 15 -4 5 -28 -9 -39
5379 -39 -2 -2 10 -18 -5 -13 -16 13 -3 -3 -5 -14 7 -25 -20 -25 0 -8 -31 -5 4 -18 -20 -5 -9 -17 -15 -11 -2 -29 -11 4 2 -10 39 32 24 -28 -2 0
5419 0 -50 22 17 -11 22 19 2 -29 6 -16 -10 -22 18 -16 23 -29 -8 -12 -29 13 -28 -6 14 -1 -23 12 -29 10 6 -18 -16 2 15 13
5453 13 10 20 -14 1 1 -9 -10 14 -15 -12 3 23 -29 -25 -1 -18 -4 35 -5 0 7 -13 -21 -3 -5 4 -10 -13 22 -31 -14 -1 0 4 -3 16 -7
5490 -7 -19 -5 -20 -21 -21 -11 14 5 -29 22 23 -8 19 -5 9 13 -11 3 8 -1 7 -12 -34 20 3 -19 14 -8 -7 -1 14 -8 4 8 -15 12
5526 12 2 4 -14 -6 -4 -22 -4 4 9 -12 -11 10 8 3 -35 20 -19 2 21 -27 -8 22 24 -27 25 -7 4 11 -14 -18 -15 15 -14 -1 10 6 -17
5563 -17 -3 -13 -27 -14 -10 -7 -35 -21 -31 2 15 -20 2 5 -5 1 -13 6 -8 -6 -7 -14 42 9 -2 35 -7 6 0 7 11 -29 -17 -9 -15 -11 6
$$ packed form
5305hrj1J5oJ1j0lpM0nk8qL7j3npkOJ4j1J1j4J9j2rNJ3k2J2J2rnjj5L6k7KJ0p
5344a1K7l2J0j9L7k1NJ6Ql1J8k1K0Kk8K4J1j6k1J1J5j6QRn1M7%J5rQj9Rl3J9l0
5379c9L7%J2k8J3qlK9j6%krK1l2NnK5qk3K6Rk2kJ5mqKMRk7J8J5kj2M9pqn2K6K
5419@n0P2nk8L3lj7l1L5k2Oj2M0l4L9n2K1mj7M2m1K2K0j5k2L5m1L9mk4KJ8J3k
5453A3lJ0l4J5%j0jK4k9LJ5K0n2MK4j7J4L9m0NPk0qJ8kRj4lL5n3J7J3JMpJ9k3
5490gj2J4j5j%J0K5rl4N1Jl1K7k4J4Mk4J4NrQj9k2N4j7k2L3k2JOJ5k2J2Mk3K7
5526A2j0Kj8QKj8J8QNk1JK1knl8N5l9K1J9m8J9L0Kn1N2l2J1Pk5mLL0k9J3J1mk3
5563a7J4j0j4J3MLk8J4j0L3J3l5K2Lj0Oj4J9j4KjpN6l3j1L7m2J3oPMm0J2QoMJ7
$$ plain form
5600 6 -2 -15 -12 -3 -4 -2 11 -5 14 -7 -6 9 13 -1 -1 -11 2 -22 -16 -15 15 4 9 -11 -12 7 26 13 16 -24 -3 10 8 -8 -6 -29 -34 13 -23
5639 -23 -3 -1 -32 6 -12 -15 -6 -21 -13 3 -13 -4 8 0 7 27 -1 16 5 -17 7 -2 -3 -8 10 9 -2 5 1 -22 1 -17 0 -1 -19 11 -20
5676 -20 -17 -6 -9 -10 -12 2 18 -7 -8 -6 -15 -13 15 -28 5 -6 -9 -9 -10 -20 38 18 -5 -5 -27 -9 10 2 -10 30 -33 2 -11 4 1 11 -4
5713 -4 -36 -23 -11 3 -8 1 -11 -4 -12 -14 12 -2 -10 17 5 15 -6 -1 2 -1 4 -25 12 4 -9 11 -15 12 4 -5 -28 -2 31 27 -13 20 -7
5750 -7 -1 1 12 11 8 16 1 1 8 -26 26 -7 24 21 -17 -13 -4 5 -19 -6 -18 -17 -1 -4 -22 -15 -1 1 -15 1 -5 -16 -6 21 17 2 9 -8 11 -12
5790 -12 15 2 -4 -10 26 -8 7 8 -5 -13 -17 -7 11 -15 12 16 6 -14 -4 -10 0 -8 -21 19 2 1 11 15 -11 12 3 -3 -29 -26 -12 13 6
5827 6 17 -13 30 -3 19 8 27 1 0 28 7 12 -6 28 14 -9 2 6 -17 1 -9 5 15 -19 15 12 25 -5 -10 -6 16 -26 43 2
5861 2 -15 15 20 12 14 15 -11 -6 -12 -23 -8 7 4 6 -5 -5 -17 19 11 -13 19 5 19 -6 2 1 -2 5 -2 27 -16 26 3 -3 -8 -5 30 -11 4 26
$$ packed form
5600Fqj3LRjKJ3j6J9k1JJ5Mj4%j0J3k4OJL0j1Nk0jJ9J9j3Lm0K1J3kj6Kk3nM7l6
5639b3K0Kl1L8j8lRj5QJ6j6RJ2qPK0k8J7j1k2K4rjnJ8jj1Pmk3K3j8J7jj8L0l1
5676b0LJ1ljkJ4J6k5jKrKK8m3L3j1l%jj0N8k0k3%k2J8J9qj2M0o3L5j3J5lJ0j5
5713dl2J3J2J4j1Rj2PqkK6j4qK7j2J0k1NLlNk9L7qj3K0k6K7qrk3K6L3mm0L3k7
5750gOKJ1jlQj5%Pl4N2l3L1ll8MRRk4J3j2JJ6lj8PJ4Kj6J6oj1J0K7mj5Pj7J9k3
5790a2K7j3ooL6l4J5Jj3qmJ0J8k6K7Mj0k0J0oJ0qj3M0j7jJ0Mk6K3rok6LJ4K5p
5827FJ1l0M3l3K2j1J9k6jK8k1Nj8L4j4k3J1Mk3J8j0J4J0l4L4lJ3l0nMK2m2O9m1
5861Bj7L0NqKJk6Noj1J5J5lKj1%j2L6qk4L2j4J4k5QjlPpK9m3M2k3onLL5m1J5K2
$$ plain form
5901 26 11 3 -21 -17 -18 17 -12 17 0 4 27 -13 -27 -6 -9 -16 8 -3 -10 -6 29 10 -4 3 10 -6 -7 -8 -17 -3 -4 2 8 -14 -3 25 -2 -17
5939 -17 -30 -6 21 -20 -6 -12 13 -21 5 17 -32 7 -25 10 -6 -2 -9 -9 9 14 5 27 -27 17 -10 -13 3 -13 -25 -3 3 -9 11 9 -20
5974 -20 23 -7 7 7 -7 -3 -3 -15 -4 -7 -8 1 -16 14 -33 -12 7 -35 -26 -9 0 -4 -23 -9 -9 0 -31 -8 4 -8 -55 29 2 6 27 -17
6010 -17 6 3 -23 -17 -6 2 5 -14 3 6 9 -13 -19 4 15 0 -26 13 -7 -28 -6 3 -14 -1 -3 4 -7 -37 -10 6 26 -16 -25 17 6 13
6046 13 13 -14 -3 0 -6 -1 -13 11 -13 24 -6 -26 21 -13 1 -13 -3 -19 -28 -23 7 23 -39 -11 19 -14 10 -1 -24 -16 -1 -6 -3 3 -33
6081 -33 -12 -12 37 -2 -35 -23 3 3 13 7 3 8 16 -2 -2 48 0 -30 0 16 5 -26 15 0 8 23 17 10 -15 -13 -21 24 6 -18 14 -4
6117 -4 -8 1 -1 -11 -17 -4 5 15 -34 5 -27 14 4 17 5 -29 4 -8 -10 0 -10 10 -11 9 6 -4 -13 21 6 -38 2 3 -12 23 -4
6152 -4 19 -19 -14 -7 -24 10 -10 1 25 -16 19 -12 -3 -21 -1 -18 -19 8 -27 10 19 -4 6 -29 7 26 -24 -33 -16 6 18 5 -11 11
$$ packed form
5901B6j5qk4MjL5k9K9j7MK3m0j4K1lpK4j1pML5j9j4PPj6jjrJ4jOOk2J1K8k7j5
5939a7j3K4K7m1J4oK5l4K6J2m9L9l2L5j6Mp%J8NrK2n4M4k7lJ6j6j2K2Oj2K0kk9
5974b0M3l0J4%j4M%j2J1ljRj7L0m7K1J9m2RJ7Rmj9J4%Rl1K3J2j2m7Q4k7MK1m4
6010a7K3lk6OJ1QLj9J7LLk2oK3J1j5k6L9k0k1K2Rj7J3kPj1l0K7J6K0m2rM2j1P
6046A3%k7J1LoNj2K4k4L7l0k0M7l4J4j4J0j6rNL0J6o2K8L0l3K4j1k3QJ5nLOl6
6081c3K1%M9l9l3J2K6%J0omNQj8%N0m8l0L0J6j1l1M1j5QJ5opk5KqM5j8k4L2j8
6117dmRkj0oJ3RJ0m9L9l2M1j0J3j2l4L3j2kJ0j0K0k1K0lj0rL4j5m4M0Jj5L5k7
6152dK3l8NPj7L4k0J1K4m1L5l1Rj8K0j7jK7l5L7Rk3J0l5L6J9n0rJ7K2J2j3j6K2
$$ plain form
6186 11 -19 6 -28 -1 5 -26 -3 2 -7 -14 -25 3 -4 3 11 -23 -9 -22 -9 18 10 -9 -3 10 9 -19 7 6 9 -9 12 19 -7 18 -11 -8 -3 -7
6224 -7 39 -21 21 -12 24 -6 8 -18 7 9 -22 8 3 -11 -12 -18 -2 5 -1 14 7 10 5 -34 8 5 22 -6 8 23 21 0 -5 -1 -1 2 -1 33 -13
6263 -13 -9 0 1 27 16 18 -22 16 33 11 -4 25 -6 4 -2 12 2 -24 12 13 -17 13 -1 -22 18 -5 16 8 15 15 5 3 -27 8 -3
6298 -3 2 23 -20 -4 -2 -6 10 -18 7 12 1 8 19 10 16 8 -25 -29 -6 -29 -1 -12 -12 27 -3 -22 -20 14 -22 -14 14 5 3 1 -20 6 -1 -20 2
6337 2 -9 -10 16 10 -5 -28 31 14 6 10 10 -6 9 -1 4 16 30 8 -17 9 -20 -7 -8 -8 10 0 -26 11 -6 12 -22 11 -21 -24 -10
6372 -10 0 21 -4 13 24 -10 20 13 9 1 -8 11 -15 -5 27 -4 -12 -12 0 -12 9 -14 -8 13 6 -7 17 -24 -23 -3 0 11 3 1 15 11 11
6409 11 -15 -18 -14 -38 16 -3 -14 -12 -4 -21 -15 -24 -1 2 -3 6 -25 -4 -33 -6 13 -24 5 17 0 -10 15 19 -17 6 -14 17 -4 -22 -25 6
6445 6 4 7 -3 -24 -9 12 -6 -6 1 18 2 -10 6 -2 0 15 25 17 -13 3 11 -1 3 7 -28 -19 6 -9 3 -9 -8 5 -9 -14 19 -29 -9
$$ packed form
6186A1l0K5l4K7Ol1K3Nrpj1K8pPQl4J4j3J3K7qj9OJ3jk8K6jLj8K1Pk6K5k9LNm
6224gM6o0M2l3L6l0J4k6K5Kl1L0nj4joJ6PoJ5pLnl9M2lJ7k8J4J5kk1nM%LlL4m6
6263a3MRJK6j1Km0L8J7k2j5K9l1J0oJ4j0k6L6Jl0L0j4k1M0k3K1qP%j0kl0L5j1
6298cNK1m3J6KmJ6k8K5Nj1PJ1rOql3mK3k3K8j1%L9l0j9KL4l6QK8rkkk1K6pj9K2
6337Bj1jK6oj5k3N9j7qM%j6J5j0NJ2J4k2k5K6k9J3j%J8j0k6L7j7J8l4L3l2lJ4
6372a0J0K1k5J7J1l4L0pmqrJ9k6J0L2l1q%J2j2K1k3OK1pj3K4m1JK0LJ1qkJ4m%
6409A1k6lMk4N4j9j1KQj7OrK3LnRl1K1k9K7J9l7K9J2j7j0K5Ml6K3k0L1k1j8lL1
6445FkLj0k1J5K1j8%PJ7j6j2J6qKJ5J0ql0J6Qj2MMl5RK5j5J2j2JJ3j4nL3m8K0
$$ plain form
6482 -9 -7 -9 3 17 -9 7 7 2 -14 11 -2 0 2 10 -17 -25 2 -7 -9 14 12 -12 1 -25 7 14 -2 -26 -9 9 2 -18 4 -16 37 -4 -22
6519 -22 11 10 -9 -16 -6 -32 -3 4 2 2 4 -14 23 12 -4 -15 -6 0 9 13 -2 1 -8 -7 -9 -4 -18 3 -27 -1 3 -3 -13 -12 -2 30 11 8 0 3 11
6560 11 -12 -27 -8 -1 24 -11 -2 -4 9 21 -16 11 -12 4 -2 11 0 2 -30 -1 2 -2 -13 2 -1 43 -18 12 13 -11 -4 13 28 -7 2 -3
6596 -3 -4 7 -18 10 38 1 -19 25 -11 35 -31 -17 7 16 0 -26 -7 -15 -8 1 21 9 8 -28 2 3 -1 -22 3 14 -26 -17 -3 -6 -24 -11
6632 -11 3 -2 -11 10 42 -2 -11 18 -9 16 -5 10 4 14 4 8 11 10 -24 17 2 13 -12 0 -20 8 9 6 14 -14 -8 5 14 -24 -2 18
6668 18 -32 -22 0 0 -1 -12 -8 -10 2 -1 -15 4 18 -8 11 11 12 -7 12 -12 -12 3 0 13 -16 1 14 -15 6 -6 -9 -3 8 9 -8 -9 15
6705 15 -31 37 5 -23 9 -7 -3 0 -4 -26 0 7 -26 -31 -1 16 -3 -2 -17 -12 -11 0 -11 25 15 10 -5 -3 11 27 -18 7 7 -19 -8 0
6741 0 -20 11 -19 1 -8 10 -1 -11 25 -9 24 -22 -29 -12 -14 -5 -10 -19 -3 8 -8 0 11 -16 24 -6 -9 -13 2 -4 11 -14 -23 -11 -3 17 2
$$ packed form
6482iKkJ2J4k6J6%nj6K5j3KKQk7qK7rkK3kk4J3k6L2Pj6k4J7J8pk0K2k0N3m1j8
6519b2L3jj9pJ0k6K9Pk%Kj8L7j1j6j1RORMj5LrJkNj4K1l0K6Moj0JJ0L2j9lqLQ
6560A1k3j5J9PK5l5RkJ3J2l7K7k3J6oJ3j1Kl2K9Lmj1J5lM4o1L0Jk4PJ7J5l5Rn
6596cjJ1k5K8K8l7k0M4l6M6o6J4K4Rj6k6J9qPRK0j2jl6L0Jmk1K5J1m0RJ4lj8J3
6632a1J4nrK1L2m4rK9k7K5k1J5oJ0j0MLjl4M1j5J1k5J2k0K8JlQk8OJ3Rl8K2K0
6668A8n0J0K2%jj1MkJ2lj4J9J4k6J9%Jj9J9k4%J5lJ3k9J7J3k9K1j2lOJ1Jj7jK4
6705A5m6O8l2k8L2j6MLmk2K6Pl3nL0J7j9Jj5NJJ1j1L6j0nj5KJ4J6m5K5%k6J1Q
6741@k0L1l0K0rJ8j1j0L6l4L3m6pJ7kRnrJ6J1j6QJ1k7M0l0lmJ5oJ5k5rJ2QK0j5
$$ plain form
6778 2 -23 25 14 -25 -5 20 4 -6 -16 -4 -23 20 -8 -5 14 21 -13 -18 1 -10 -8 -9 12 -10 -14 -19 25 -15 16 -11 -6 2 -3 25 12 -1
6814 -1 5 -12 10 3 1 -9 10 15 -2 -3 -2 4 6 0 0 14 -16 -21 -12 -3 -8 2 -17 -46 -14 12 -23 -21 -3 -2 -24 9 -9 -9 -14 1 8 -26 -8 -2 -17
6855 -17 -30 14 5 -15 -18 -1 -4 29 14 -3 10 -21 -18 -1 5 -19 -5 12 13 18 -9 9 12 3 -36 -6 -12 6 -13 -2 -1 -10 34 3 -5 32 -2
6892 -2 26 15 -20 11 3 10 8 -17 24 -7 4 -10 -17 -4 2 8 7 39 15 14 23 21 -6 -6 11 -14 1 -29 -5 6 -28 -6 0 13 -29 -16 23
6929 23 -7 -10 -10 2 22 -8 10 6 1 -5 -5 8 -2 11 14 22 -5 4 4 5 -19 11 -8 -26 -10 -13 -10 24 -7 -13 -8 42 -21 7 30 -17 -21 15
6967 15 9 0 9 -22 -2 -10 -5 -19 -6 0 0 -4 14 11 -15 1 -20 9 -6 17 23 1 0 5 -9 3 -4 21 9 -6 16 -28 1 21 -10 1 3
7004 3 -13 -24 -14 2 -16 17 10 -10 9 -2 12 -11 -4 24 -42 -28 -21 16 14 22 -16 0 16 19 27 -9 5 30 -29 8 13 -3 27 16 -4
7039 -4 8 0 -3 -4 -17 12 -15 1 -22 20 -11 -22 4 6 8 -21 -1 3 1 2 -12 12 -7 -3 -10 -4 -18 7 3 12 6 3 -2 -3 -9 -20 5 34 43 -6
$$ packed form
6778Bk5M8j1l9K0K5j6j0j0J2j9M3k8LJ9Pl4nJ9j1KjK1k2mnM4m0L1k7NQnK8j3j3
6814aOj7K2pkj0J9Nj7jJOKo%J4l0nRRnJ0j9k9L2K6l5KJ8Jk2L3j8%nJ5Pl4J8Oj5
6855a7j3M4rk0lJ7lL3j5j7J3l1LJ7Ok4J4J7JNk7J8Lrl9L0oJ8j9J1JrM4l1qL7l4
6892bK8j1l5L1qPkk5M1l1J1j4pJ3OOjL2k4jRkk7%J7k5J5l0K4J1l4K2OJ3m2J3L9
6929B3l0l%J2K0l0J8mno%J3j0J3LQk7R%Jk4L0j9j8J6lLL4l1oNN0o3K8K3m7mL6
6967A5orRl1K0qNj4J3O%mJ8lk6J6k1K9j5K3Ok2jNj4J2pK5j2j5K2m4K9K0l1J1K
7004Cj6j1J0J6j8L3pk0J9j1J4k3PK8o6J4PL7kQl8J6J6LQl6J4K5n9L7Nj6L0j1k0
7039dJ2qljj3K9k7J6k3M2l1j1K6KKk9K0MkJj4K4j9MpOj4K5mRolnjoj1K5K9Rm9
$$ plain form
7079 -6 -34 9 -3 -12 2 6 -10 -9 7 -23 19 -15 -20 -22 -1 2 -5 1 -3 6 7 -10 -13 7 26 -7 -13 -7 21 25 10 -1 9 4 -6 -4 -9 4 2 -4 18
7120 18 -5 -16 -7 -32 19 7 -3 22 -21 2 -29 -13 -22 -14 5 18 -4 4 9 13 9 -3 6 22 -30 33 -3 -7 37 -14 0 -2 4 -3 -14 5
7156 5 -6 -28 -7 16 -8 11 -14 -24 11 -7 -15 -5 21 -13 -3 -7 11 3 -16 11 -1 -26 40 -16 11 16 0 2 12 2 -18 -14 -12 3
7190 3 -2 -9 30 5 -7 18 22 10 6 12 -10 -8 -23 -9 -21 5 10 -4 18 19 -23 -24 -25 4 0 29 -9 8 7 -14 3 15 -9 -5 12 5 21 17
7228 17 -39 24 0 11 -17 -24 -6 5 0 10 -3 -2 11 7 30 10 5 8 -4 7 -21 0 -17 16 2 -11 3 6 -25 -5 -8 0 6 6 -21 6
7264 6 -12 13 7 -1 5 -11 -10 -11 13 -4 6 3 7 12 24 6 -12 -1 31 -1 3 7 14 32 26 37 6 -1 0 5 -13 -2 1 -19 -1 -3 -5 4 -21 20
7304 20 15 -13 16 14 1 -16 4 -2 1 11 -11 -40 7 10 4 0 6 5 6 -2 12 2 28 -17 4 -3 -14 5 28 35 -18 3 -8 -3 16 -19 -9
7341 -9 10 -27 5 -5 -18 12 0 10 2 5 8 -4 2 -5 -7 24 17 17 -10 -13 2 -4 -38 22 -14 9 -2 1 32 44 22 -26 -1 25 5 1 -36
$$ packed form
7079fk8M3j2rJ4Mj6JJ6l0M2l4nkK1LpOmRJj7lK0J9l3oOK8Mj5j1J0nj0KnJ3koK2
7120A8k3j1Rk5N1j2j0K5m3K3l1J6rQJ9J3k2QNMmj2RJ6n2O3l6mM4n1J4kOpj1J9
7156Ej1k2K1K3k4J9k5j0L5j8qJ0K6l4J0mJ8qj9K7j2k5O6n6K7Nj6KJ0j0k0MKJ5
7190CnpL9k5j2K5Mj2mOk2Kj5J4j2K6Nj4K2Jm2jjK9mK9l8J7jk1J7J2k4MJ7pJ6m
7228A7n6O3k4J1k8pJ8J1nJ0j3JJ3mK3k0nLj2J1k8K1j7L3j4j3J4Ll1K0lQO%k7K7
7264Fj8K5oqOj6JjK4j7J0lMNJ2j8j8J1L2l2MMPJ8oJ1l1pJNj8J1Lk0J8kkRk5M1
7304B0nk8K9kj3j7K0oLJ0k2k9M7LomOjJqJ4j0K6m5K1pj1J9K3Pn3K1j1NJ9l5J0
7341iJ9l7L2j0j3L0j2J0qLLj2OpkL1p%k7lJ5ol4O0l6K3j1LL1J2k2m8K5K6k0ml7
$$ [...]
8191C9
##END NTUPLES=NMR FID
##END=
