##TITLE=1H_Pt 5338
 200.13Hz, CD3OD.
 8 sc
 
2.4.2026
##JCAMPDX= 6.0         $$ Bruker NMR JCAMP-DX V2.0
##DATA TYPE= NMR FID
##DATA CLASS= NTUPLES
##ORIGIN= UXNMR, Bruker Analytische Messtechnik GmbH
##OWNER= pz
$$ XWIN-NMR		Version 3.5
$$ Thu Apr  2 15:18:25 2026 Russian Standard Time (UT+4h)  she@DPX200
##.OBSERVE FREQUENCY= 200.1313
##.OBSERVE NUCLEUS= ^1H
##.DELAY= (6, 6)
##.ACQUISITION MODE= SIMULTANEOUS
##.ACQUISITION SCHEME= undefined
##.AVERAGES= 8
##.DIGITISER RES= 18
##SPECTROMETER/DATA SYSTEM= spect
##.PULSE SEQUENCE= zg30
##.SOLVENT NAME= MeOD
##.SHIFT REFERENCE= (INTERNAL, MeOD, 0, 14.3821)
##AUDIT TRAIL= $$ (NUMBER, WHEN, WHO, WHERE, WHAT)
$$ ##TITLE= Audit trail, XWIN-NMR		Version 3.5
$$ ##JCAMPDX= 5.01
$$ ##ORIGIN= Bruker BioSpin GmbH
$$ ##OWNER= she
$$ F:/spectra/data/she/nmr/H-C/1/audita.txt
$$ ##AUDIT TRAIL=  $$ (NUMBER, WHEN, WHO, WHERE, WHAT)
(   1,<2026-04-02 15:16:51.14 +0400>,<she>,<DPX200>,
      <created by zg, POWCHK disabled, PULCHK disabled
       configuration hash MD5:
       00 E9 B6 7A A2 85 ED C7 34 08 36 98 17 FE 4E 26
       data hash MD5: 16K
       AA 1C 32 96 CB B0 5A 39 01 E5 42 36 1D 03 FE 94>)
$$ ##END=
$$ 
$$ hash MD5
$$ BE BB BE 1B 7A 09 5E 6E D0 73 C7 06 05 6F 7C A0
##$RELAX= 
##$RELAX= 
##$RELAX= 
##$RELAX= 
##$RELAX= 
##$RELAX= 
$$ Bruker specific parameters
$$ --------------------------
##$DU= <F:/spectra>
##$EXPNO= 1
##$NAME= <H-C>
##$PROCNO= 1
##$TYPE= <nmr>
##$USER= <she>
##$AMP= (0..31)
100 100 100 100 100 100 100 100 100 100 100 100 100 100 100 100 100 100 
100 100 100 100 100 100 100 100 100 100 100 100 100 100 
##$AQSEQ= 0
##$AQ_mod= 1
##$AUNM= <au_zg>
##$AUTOPOS= <>
##$BF1= 200.13
##$BF2= 200.13
##$BF3= 200.13
##$BF4= 200.13
##$BF5= 200.13
##$BF6= 200.13
##$BF7= 200.13
##$BF8= 200.13
##$BYTORDA= 1
##$CFDGTYP= 0
##$CFRGTYP= 5
##$CHEMSTR= <none>
##$CNST= (0..31)
1 1 145 1 1 1 1 1 1 1 1 1 1 1 1 1 1 1 1 1 1 1 1 1 1 1 1 1 1 1 1 1 
##$CPDPRG= <>
##$CPDPRG1= <>
##$CPDPRG2= <>
##$CPDPRG3= <>
##$CPDPRG4= <mlev>
##$CPDPRG5= <mlev>
##$CPDPRG6= <mlev>
##$CPDPRG7= <mlev>
##$CPDPRG8= <mlev>
##$CPDPRGB= <>
##$CPDPRGT= <>
##$D= (0..31)
0 0.7 0 0 0 0 0 0 0 0 0 0.03 0 0 0 0 0 0 0 0 0 0 0 0 0 0 0 0 0 0 0 0 
##$DATE= 1775128610
##$DBL= (0..7)
120 120 120 120 120 120 120 120 
##$DBP= (0..7)
150 150 150 150 150 150 150 150 
##$DBP07= 0
##$DBPNAM0= <>
##$DBPNAM1= <>
##$DBPNAM2= <>
##$DBPNAM3= <>
##$DBPNAM4= <>
##$DBPNAM5= <>
##$DBPNAM6= <>
##$DBPNAM7= <>
##$DBPOAL= (0..7)
0.5 0.5 0.5 0.5 0.5 0.5 0.5 0.5 
##$DBPOFFS= (0..7)
0 0 0 0 0 0 0 0 
##$DE= 6
##$DECBNUC= <off>
##$DECIM= 32
##$DECNUC= <off>
##$DECSTAT= 4
##$DIGMOD= 1
##$DIGTYP= 9
##$DL= (0..7)
0 120 120 120 120 120 120 120 
##$DP= (0..7)
150 150 150 150 150 150 150 150 
##$DP07= 0
##$DPNAME0= <>
##$DPNAME1= <>
##$DPNAME2= <>
##$DPNAME3= <>
##$DPNAME4= <>
##$DPNAME5= <>
##$DPNAME6= <>
##$DPNAME7= <>
##$DPOAL= (0..7)
0.5 0.5 0.5 0.5 0.5 0.5 0.5 0.5 
##$DPOFFS= (0..7)
0 0 0 0 0 0 0 0 
##$DQDMODE= 0
##$DR= 18
##$DS= 0
##$DSLIST= <SSSSSSSSSSSSSSS>
##$DSPFIRM= 0
$$ [...]
##$SUBNAM0= <"">
##$SUBNAM1= <"">
##$SUBNAM2= <"">
##$SUBNAM3= <"">
##$SUBNAM4= <"">
##$SUBNAM5= <"">
##$SUBNAM6= <"">
##$SUBNAM7= <"">
##$SUBNAM8= <"">
##$SUBNAM9= <"">
##$SW= 18.0517328524113
##$SWIBOX= (0..15)
0 0 2 0 0 0 0 0 0 0 0 0 0 0 0 0 
##$SW_h= 3612.71676300578
##$TD= 16384
##$TD0= 1
##$TE= 0
##$TE2= 300
##$TE3= 300
##$TEG= 300
##$TL= (0..7)
0 120 120 120 120 120 120 120 
##$TP= (0..7)
150 150 150 150 150 150 150 150 
##$TP07= 0
##$TPNAME0= <>
##$TPNAME1= <>
##$TPNAME2= <>
##$TPNAME3= <>
##$TPNAME4= <>
##$TPNAME5= <>
##$TPNAME6= <>
##$TPNAME7= <>
##$TPOAL= (0..7)
0.5 0.5 0.5 0.5 0.5 0.5 0.5 0.5 
##$TPOFFS= (0..7)
0 0 0 0 0 0 0 0 
##$TUNHIN= 0
##$TUNHOUT= 0
##$TUNXOUT= 0
##$USERA1= <user>
##$USERA2= <user>
##$USERA3= <user>
##$USERA4= <user>
##$USERA5= <user>
##$V9= 5
##$VALIST= <valist>
##$VCLIST= <CCCCCCCCCCCCCCC>
##$VD= 0
##$VDLIST= <DDDDDDDDDDDDDDD>
##$VPLIST= <PPPPPPPPPPPPPPP>
##$VTLIST= <TTTTTTTTTTTTTTT>
##$WBST= 1024
##$WBSW= 4
##$XGAIN= (0..3)
0 0 0 0 
##$XL= 0
##$YL= 0
##$YMAX_a= 318488
##$YMIN_a= -200424
##$ZGOPTNS= <>
##$ZL1= 120
##$ZL2= 120
##$ZL3= 120
##$ZL4= 120
##$ABSF1= 10
##$ABSF2= 0
##$ABSG= 5
##$ABSL= 3
##$ALPHA= 0
##$AQORDER= 0
##$ASSFAC= 0
##$ASSFACI= 0
##$ASSFACX= 0
##$ASSWID= 0
##$AUNMP= <proc_1d>
##$AZFE= 0.1
##$AZFW= 0.1
##$BCFW= 1
##$BC_mod= 2
##$BYTORDP= 1
##$COROFFS= 0
##$CY= -3
##$DATMOD= 1
##$DC= 2
##$DFILT= <>
##$DTYPP= 0
##$F1P= 0
##$F2P= 0
##$FCOR= 0.5
##$FTSIZE= 0
##$FT_mod= 4
##$GAMMA= 1
##$GB= 0.15
##$INTBC= 1
##$INTSCL= 1
##$ISEN= 128
##$LB= 0.25
##$LEV0= 0
##$LPBIN= 0
##$MAXI= 10000
##$MC2= 0
##$MEAN= 0
##$ME_mod= 0
##$MI= 1.114404
##$NCOEF= 0
##$NC_proc= 0
##$NLEV= 6
##$NOISF1= 3.799351
##$NOISF2= 2.8
##$NSP= 1
##$NTH_PI= 0
##$NZP= 0
##$OFFSET= 14.38212
##$PC= 1
##$PHC0= -3871.839
##$PHC1= 13.9923
##$PH_mod= 1
##$PKNL= yes
##$PPARMOD= 0
##$PSCAL= 0
##$PSIGN= 0
##$REVERSE= no
##$SF= 200.129724274929
##$SI= 16384
##$SIGF1= 3
##$SIGF2= 2
##$SINO= 400
##$SIOLD= 16384
##$SREGLST= <1H.CDCl3>
##$SSB= 0
##$STSI= 0
##$STSR= 0
##$SW_p= 3205.1282051282
##$SYMM= 0
##$S_DEV= 0
##$TDeff= 0
##$TDoff= 0
##$TI= <>
##$TILT= no
##$TM1= 0
##$TM2= 0
##$TOPLEV= 0
##$USERP1= <user>
##$USERP2= <user>
##$USERP3= <user>
##$USERP4= <user>
##$USERP5= <user>
##$WDW= 1
##$XDIM= 8192
##$YMAX_p= 0
##$YMIN_p= 0
$$ End of Bruker specific parameters
$$ ---------------------------------
##NTUPLES= NMR FID
##VAR_NAME=  TIME,          FID/REAL,        FID/IMAG
##SYMBOL=    X,             R,               I
##VAR_TYPE=  INDEPENDENT,   DEPENDENT,       DEPENDENT
##VAR_FORM=  AFFN,          ASDF,            ASDF
##VAR_DIM=   8192,          8192,            8192
##UNITS=     SECONDS,       ARBITRARY UNITS, ARBITRARY UNITS
##FACTOR=    0.0002768,     1,               1
##FIRST=     0,             0,               0
##LAST=      2.2672688,     0,               0
##MIN=       0,             -200424,         0
##MAX=       2.2672688,     318488,          0
$$ Real data points
##PAGE= N=1
##DATA TABLE= (X++(R..R)), XYDATA
$$ [...]
1207B134o76k184k562l85K981K194k01j726r96P46J114M0p09r63p87q7J181K422
$$ 2134 1458 -726 -3288 -3673 -692 1502 1301 -425 -1421 -675 439 479 -230 -1193 -1980 -2067 -886 1536
1225A536K149M75j818k199Q4P98k01k029k111l03J410J683J044K76j31m76r2N78
$$ 1536 3685 4160 2342 143 227 1025 824 -1205 -3316 -3619 -2209 -526 518 794 663 187 95 673
1243F73L34o73j528p90J424K448J317q20j803r25J69L93m00j420j433n46R93K172
$$ 673 1007 334 -1194 -1984 -560 1888 3205 2385 582 -343 -174 219 -181 -1601 -3034 -3580 -2587 -415
1261d15K118Q91j011j222r9Q88N23q94j615p48N73J060P90L64j24o02j045q92
$$ -415 1703 2594 1583 361 262 1150 1673 779 -836 -1584 -1011 49 839 1203 1079 477 -568 -1460
1279a460l24K67L85J81J69N18R52J014P77K76m61j474j828r69N21J110L15q67
$$ -1460 -1784 -1517 -1132 -951 -782 -264 688 1702 2479 2755 2294 820 -1008 -1977 -1456 -346 -31 -898
1297h98r33N48J838J419m92j701j562j90J194J582Q46n52r42j77J218J623j2k359
$$ -898 -1831 -1283 555 1974 1482 -219 -1781 -1971 -777 805 1651 1099 157 -20 1198 2821 2809 450
1315D50l123j147J410K167O46j165j217O01K119J841K28j379j934j114M51J745
$$ 450 -2673 -3820 -2410 -243 403 -762 -1979 -1378 741 2582 2810 1431 -503 -1617 -1166 579
1331E79J368k85j657j178N94J688N35j478k256j221M02J108J168J073P69R2l46
$$ 579 1947 1662 5 -1173 -579 1109 1644 166 -2090 -3311 -2909 -1801 -633 440 1209 1301 955
1348I55OQ06Q94l13j832j835m74P31J027O86j40p11j410r86P44J756J056j171
$$ 955 961 1767 2661 2348 516 -1319 -1793 -1062 -35 651 511 -200 -1610 -2596 -1852 -96 960 -211
1366b11k369k20K777L793J440j765k706j494N50J395Q34j508k761k275r5L037
$$ -211 -2580 -2800 -23 3770 5210 3445 739 -755 -205 1190 2024 516 -2245 -4520 -4615 -1578
1382a578L670L69k964k929J06L385L110k3k454k115N82K477K597N44j693l387
$$ -1578 2092 2461 -503 -3432 -3326 59 3169 3146 692 -1423 -841 1636 4233 4777 3084 -303
1398c03k725l40K314J491j202l003j410J950L660K114q44j282j296M49J177J552
$$ -303 -3028 -3368 -1054 437 -765 -3768 -5178 -3228 432 2546 1702 420 -876 -427 750 2302
1414B302Q67n17j792j517o5K265J049j676k991k078O8J526J306QJ75k22N08J454
$$ 2302 3169 2652 860 -657 -722 1543 2592 916 -2075 -4153 -4085 -2559 -1253 -1245 -1070 -1292 -784 670
1432F70J893J489m37j784k068J08J602J009r92j883j706q0R93R00n27j277j093
$$ 670 2563 4052 3615 1831 -237 -129 1473 2482 1490 -393 -2099 -2179 -1186 -286 -813 -2090 -3183
1449c183j48J244K116J568M34n47k67R35J116M78j289k123j547j73O50L09o11
$$ -3183 -3331 -2087 29 1597 2031 1484 1217 2152 3268 3746 2457 334 -1213 -1386 -736 -427 -1038
1466a038r26m83L35O61M99J78M0m4L38R28J381J077J40o63n11p0j72r15j519j209
$$ -1038 -1964 -2447 -2112 -1451 -952 -774 -734 -778 -440 488 1869 2946 3086 2423 1912 1842 1670 755 -764 -1973
1486a973l11J60n4j81K98Q22O16L21J65O00N46K04K6K87O72L29m41q20n68r4o46
$$ -1973 -2284 -2124 -2178 -2359 -2061 -1239 -623 -302 -137 463 1009 1213 1239 1526 2198 2527 2086 1266 698 604 -42
1507d2j228j295l94M51L12J83M00Q72J001N77L43M97M39j9o98n69K42M63k15r37
$$ -42 -1270 -2565 -2959 -2508 -2196 -2013 -1613 -741 260 837 1180 1677 2116 2097 1399 830 1072 1535 1320 383
1527C83r72k60L2m22p92m42J24L33M07O42J222J170L93k09O7N29K26n48j241p42
$$ 383 -589 -849 -817 -1239 -2031 -2473 -2349 -2016 -1609 -967 255 1425 1818 1609 1676 2205 2431 1883 642 -100
1547a00j00Ol81n26j11j10l01l32J65O94M98O7O5P74J328Q91j19m46j88j27m87
$$ -100 -200 -194 -575 -1101 -1212 -1322 -1623 -1955 -1790 -1096 -598 -531 -466 308 1636 2527 2408 1962 1774 1647 1160
1568A160q99p84n37l17m52j49L78N95J56j49l9P77Q34K37j59J86O97L68q1l30
$$ 1160 261 -523 -1060 -1377 -1829 -1978 -1600 -1005 -849 -998 -1037 -260 574 811 652 838 1535 1903 1822 1492
1588A492j87k27o58j110p85k01J8k39j59K79Q24P22L34K95N18L44q8l78K00O29
$$ 1492 1305 1078 420 -690 -1475 -1676 -1658 -1897 -2056 -1777 -953 -231 103 398 916 1260 1172 794 994 1623
1608A623J85p33j036k51M61J18q76j238p05K66N53N01N27L19J34J12P66J340P93
$$ 1623 1808 1075 39 -212 249 367 -509 -1747 -2452 -2186 -1633 -1132 -605 -286 -152 -40 726 2066 2859
1627B859o49j603q54O18J109k6j472j473m22O11P89P9o37p59l96N01J459J610
$$ 2859 2210 607 -247 371 1480 1454 -18 -1491 -1913 -1302 -513 -434 -1071 -1830 -2226 -1725 -266 1344
1645A344N32p75q42M01J455Q99p78j804j419j98O12K73k71n30n02k65M00Q37Q13
$$ 1344 1876 1101 259 660 2115 3014 2236 432 -987 -1185 -573 -300 -571 -1101 -1603 -1868 -1468 -631 182
1664A82J34n35l75M90J260J022L5n93p40l84l2Qj57o10q92r14j37P71J131N38
$$ 182 316 -219 -594 -104 1156 2178 2213 1620 880 496 464 472 315 -295 -1187 -2101 -2238 -1467 -336 202
1684B02m48p82j27J076J525N98p18j264m28R62J239L10q68j610j144K0P71Q07
$$ 202 -246 -1028 -1155 -79 1446 2044 1326 62 -366 596 1835 2145 1277 -333 -1477 -1457 -686 121
1702A21j86j343j219K66J971K138L96j555j551L38J692J186m49j425j053r7N34
$$ 121 -65 -1408 -2627 -2361 -390 1748 2144 589 -962 -624 1068 2254 1805 380 -673 -770 -236
1719b36P20L20m75j294j074K35J410J104m30j205l07J205J477J96p83m83N7L1
$$ -236 484 804 329 -965 -2039 -1804 -394 710 280 -925 -1232 -27 1450 1646 863 380 437 468
1737D68m31l11J67K36l95o53L1Q12M52n38n64J96Q33J27n04k16P43P77k80r02
$$ 468 37 -274 -107 129 -266 -919 -888 -76 376 -162 -726 -530 303 430 -74 -290 453 1230 950 48
1757D8k62N86K95p19q88j31N66K53l13j66N26O17O7l64J02O33M7p04n30M23P96
$$ 48 -214 372 667 -52 -940 -1071 -505 -252 -565 -731 -205 412 479 115 217 850 897 193 -337 86 882
1778H82p5j095o32M02O33j64q54l10L56M83J17J74N80N22j29m74J01O40J65p57
$$ 882 807 -288 -920 -518 115 -49 -903 -1213 -857 -374 -257 -83 497 1019 890 416 517 1157 1322 565
1798E65j062l57N91L16m18n21j24L70Q2j49J38L85L42pp0N03O30N7m33k39O0J67
$$ 565 -497 -854 -263 53 -365 -886 -1010 -640 -558 -707 -569 -184 158 151 81 584 1214 1271 838 599 659 826
1820H26m62q32m73J57J73k74k17N9M31L09P3J65K88K69Q7l2K62L70k5l73l56k4
$$ 826 364 -468 -941 -784 -611 -885 -1102 -1043 -612 -303 -230 -65 223 492 579 547 809 1179 1154 781 425 401
1842D01N9m59p57m96M0L52j2k11P2M66O01K78K69J61J2j56N7L33J91k88p54o80
$$ 401 460 1 -756 -1252 -1212 -860 -872 -1083 -1011 -545 56 334 603 764 776 620 677 1010 1201 913 159 -521
1864e21Q7N06j3o22q28j88M55N89L53N0N5P8L33M53M93J56m65o46l33K72K65k55
$$ -521 -434 72 59 -563 -1391 -1579 -1124 -535 -182 -132 -77 1 334 787 1280 1436 971 325 -8 264 529 274
1886B74p67m81J18L01J0j46m7J31K14J18J92N03L71M8r7N5%j02k91l27j57j50
$$ 274 -493 -974 -856 -555 -545 -691 -738 -607 -393 -275 -83 420 791 839 742 797 797 695 404 77 -80 -230
1908b30l91m28K5N96L33k22m49l5O07O03L11q6k67j49J44L41M04m6p54j037l38
$$ -230 -621 -1049 -1024 -428 -95 -317 -766 -801 -194 409 720 634 367 218 362 703 1107 1061 307 -730 -1068
1929a068N23O99j69q01p13K75Q45Q48L08k92l73l30K06P60O96j27j052r93J08
$$ -1068 -545 154 -15 -816 -1529 -1254 -409 439 747 455 82 -248 -42 718 1414 1287 235 -758 -650
1948f50R17N73m83r86o89Q1M80N00L93N5m12m60K77J143R35j48j253q12K58P87
$$ -650 267 840 357 -629 -1318 -1237 -757 -257 136 191 -221 -681 -404 739 1674 1526 273 -539 -281 506
1968E06L15m17o97l82j67J4M66N09J00p87o87K19J270J009k13r17m23M50O32K26
$$ 506 821 404 -293 -675 -842 -828 -362 147 247 -540 -1227 -1008 262 1271 1058 141 -282 168 800 1026
1988A026l58m17n17n34j37O06P67q0j124p80M94J350Q19n28r13k67M65O57N19
$$ 1026 668 251 -266 -800 -937 -331 436 356 -768 -1548 -1054 296 1115 587 -326 -593 -128 529 1048
2007A048K7l58p31p49J71R45O57p54j418p16Q83J438N89p53j013m6N27Q46L60
$$ 1048 1075 717 -14 -763 -592 353 1010 256 -1162 -1878 -995 443 1032 279 -734 -780 -253 593 953
2026I53Jo27o79l22O83J002J73r65j289j65R33Q91j03q86o60L09O67M71J04q5
$$ 953 954 327 -352 -674 9 1011 1184 219 -1070 -1235 -302 589 486 -400 -1060 -751 -84 387 491 406
2046D06k10l10k7L46M89l7o12n25M4N71L06l48m45j21R9J44L7Q0K25O2k69j89
$$ 406 196 -114 -141 205 694 657 45 -480 -436 135 441 93 -352 -473 -374 -230 -193 -113 112 174 -95 -284
2068b84K37O13K29l58n60k51K25L63J17k82k96k25k9L05M47K13m35n96j88N64
$$ -284 -47 566 795 437 -123 -374 -149 214 331 49 -247 -472 -501 -196 251 464 29 -567 -755 -191
2088a91Q05Q4n17o84J11N26O56q9n56n44r6K53L77K39k12m75l24J85N86L69l30
$$ -191 614 698 181 -503 -392 134 790 701 145 -399 -495 -242 135 374 162 -313 -637 -452 134 503 173
2109A73n33k34L26N59J50k48k49J25P5Q3L8j3j23j79j34j36K10J68n0j26j31K8
$$ 173 -360 -594 -268 291 441 193 -56 69 144 227 265 252 129 -50 -184 -320 -110 58 8 -118 -249 -221
2131b21N3l2J71J85L1l00j99K65M75K68l45n65q5L15M33j41l98l54q0K54K87O3
$$ -221 -168 -200 -29 156 187 -113 -312 -47 428 696 351 -214 -299 16 449 308 -90 -444 -524 -270 17 80
2153H0o5k89k32J69M82L86j66n41j38M18N17Q9m37m69L5L32Q5k54l46q6R7N6Q0
$$ 80 15 -274 -506 -337 145 531 365 -176 -314 104 621 710 273 -196 -161 171 256 2 -344 -430 -333 -277 -197
2176a97J51m6j55L2K64L00O2l89j87K41N26J1m52m52N0L86J34l41m79n3K06K55
$$ -197 -46 -92 -247 -215 49 349 411 22 -165 76 602 613 161 -291 -241 145 279 -62 -541 -594 -388 -133
2198a33J1N1M6J2r9J51L74J90k08m64o0L52J77j72m20o7K43P8l65k52K11M95R
$$ -133 -122 -71 -25 -13 -112 39 413 603 395 -69 -129 223 400 228 -192 -259 -16 62 -303 -555 -344 151 160
2221A60m04l69L88N44K35j35l53j00MR6K07L07k65p39n16M37R16M63p19j074k36
$$ 160 -244 -613 -225 319 554 419 66 -34 -30 66 273 580 315 -424 -940 -503 413 876 157 -917 -1153
2242a153R08R41J71o70o65K4M29N89K85k43p80o21J32Q51O43m44j015n70M74J108
$$ -1153 -245 696 867 197 -468 -444 -15 574 859 616 -164 -785 -653 198 841 397 -618 -1188 -714 394
2262C94M18n11o85j63M22N21J95p6k93m44j13L50M22J8n03n00l2K88L15l7j53
$$ 394 812 301 -384 -547 -125 396 591 515 222 -222 -335 15 437 455 -48 -548 -580 -292 23 -14 -167
2283a67l0K6P6O0J77L15J02l57l78o7M19K96J1l48n44j64J73M56L76l02o31m36
$$ -167 -197 -171 -95 -35 142 457 559 202 -176 -243 176 472 483 135 -409 -573 -400 56 432 130 -501 -937
2305i37K54Q88O52j88p01m82L04P40L39j12p09n64p3N96M93q2o31p07ON88O60
$$ -937 -683 205 857 669 -32 -514 -210 530 869 757 48 -516 -589 7 500 418 -213 -920 -914 -326 334
2326C34M4n29m06J30N41M65K6k62l35j27J49L63N6k06m82k23J60K86J9j73k04
$$ 334 378 -151 -557 -427 114 579 605 343 8 -119 30 393 449 243 -239 -462 -302 -16 3 -170 -374
2347c74M7J76N0J09M3J14pl9m1N0K25Q7k69k08j0m0P9J15j54j12k79M7J30L40
$$ -374 -327 -151 -101 8 51 165 158 119 78 128 353 440 171 -37 -47 -87 -8 107 -47 -159 -438 -391 -261 79
2371G9J68k21l72R1M40K42J79m66j89PL49J49j68j91o9m47J51J70J98k21o2j03
$$ 79 247 26 -346 -255 185 427 606 140 -49 -42 307 456 288 97 28 -419 -268 -98 100 -121 -183 -286
2393b86J5K45K43J4m52n9L81j03J99k6k70K17k66o5N20j58k07po00J78M47J20
$$ -286 -271 -26 217 231 -221 -280 101 -2 197 171 -99 118 -148 -213 307 149 -58 -65 -665 -487 -40 80
2415H0no59j5L33K48r7j50N67j100L24N80K92M8m64m82J32M72M24j89k42p75N10
$$ 80 75 -584 -599 -266 -18 -115 -265 302 -798 -474 106 398 446 -18 -500 -368 104 528 339 97 -678 -168
2437a68ok0P5J82k78J3k02O40j82J82m27n1K7O38j36k08k11n8J65K01n3j17P0
$$ -168 -174 -194 -119 63 -215 -202 -404 236 54 236 -191 -242 -215 423 287 79 -132 -190 -25 176 123 6 76
2460G6m71K01l00J00K91K83p08M51K33J15m64P31l07J49n2k32q2K63l4K5l09j96
$$ 76 -395 -194 -494 -394 -103 180 -528 -77 156 271 -193 538 231 380 328 96 14 277 243 268 -41 -237
2482b37j1L20k02jl63j54L27L57k8o4j4n8J95Q4J86L9k34j97O7K74M6k23l46j05
$$ -237 -248 72 -130 -131 -494 -648 -321 36 8 -56 -70 -128 67 151 337 376 142 -55 12 286 332 109 -237 -342
2506c42J24J35n7p6k18J52J89J18K87j74j6j86K7J34J91j29l34l7K36k4n1k14
$$ -342 -218 -83 -140 -216 -434 -282 -93 25 312 138 122 -64 -37 97 288 159 -175 -212 24 0 -51 -265
2528b65j68K21J51P2j61j56j8J76L24J00q4k24m9J55K38N3k67p3j60K1J93R2j74
$$ -265 -433 -212 -61 11 -150 -306 -324 -148 176 276 192 -32 -81 74 312 365 98 25 -135 -114 79 171 -3
2551ck34j52J47K55J35j49k00oJ54K82j2k20L4j33O9J13m1P1o9k30k5J5J90Pj15
$$ -3 -237 -389 -242 13 148 -1 -201 -207 -53 229 217 -3 31 -102 -33 80 39 110 41 -189 -214 -199 -9 -2 -117
2576a17p7R7J10L0m5L1L6J26j26o1p0K61k5j74j83J5J61J26j50r4j2R7O8k8J02
$$ -117 -194 -97 13 43 -2 29 65 191 65 4 -66 195 170 -4 -187 -172 -11 115 -35 -129 -141 -44 24 -4 98
2601I8P9j37j23n5K01J65j40j96j29R7J23K44l41L9j02k8l8L47K82k89j85j18
$$ 98 177 40 -83 -138 63 228 88 -108 -237 -140 -17 227 -114 -75 -177 -205 -243 104 386 97 -88 -206
2623b06K09J72j57N0k48j57K92K29N1j50m64o6N99k55J26n2J26j93lJ51K37p3
$$ -206 3 175 18 68 -180 -337 -45 184 235 85 -379 -445 154 -101 25 -27 99 -94 -97 54 291 218
2645B18j23k28M0J79L4j20j39n0j5j9R6J61N5p1j61N3K29J69r5j64j40N9J69m2
$$ 218 95 -133 -93 86 120 0 -139 -189 -204 -223 -127 34 89 18 -143 -90 139 308 213 49 -91 -32 137 95
2669I5j3j04j35j7kR2K8P7j47j14N7L06Q7Rj80k5R6K7j1m5N8j45r6n4J01J12r6
$$ 95 82 -22 -157 -174 -176 -84 -56 21 -126 -240 -183 123 210 219 39 14 110 137 126 81 139 -6 -102 -156 -55 57 -39
2696c9j62r2Q4J73J32qK8j12m8J08J90N7n8k25k03k1J23L14j85k37k30P6J45K63
$$ -39 -201 -293 -209 -36 96 88 116 4 -44 64 254 311 253 28 -175 -196 -73 241 56 -181 -411 -335 -190 73
2720G3o9r9J8K6R6K33R1j46j29j34j21K11K88m59j2j61n1K1M98J22n69J89j60
$$ 73 4 -95 -77 -51 45 278 369 223 94 -40 -161 50 338 -121 -133 -294 -345 -324 174 296 -273 -84 -244
2743b44K49Q9jn06O82k44K7O35l28j18k90k2l90O61O6k08o44L39q5K88K63N5k79
$$ -244 5 94 93 -413 269 25 52 687 359 241 -49 -71 -461 200 266 58 -586 -247 -332 -44 219 274 -5
2766er4J28q3J74M8j81J06j35k21K05J74k38j22M6lR6J18j09N2j02K16L1R7R4
$$ -5 -99 29 -54 120 168 -13 93 -42 -263 -58 116 -122 -244 -198 -201 -105 13 -96 -44 -146 70 101 198 292
2790B92j21q1m0J91j25r1j37l4O2m8qj02J65n3R8K6n7R2J33p5L6L3J28j74r0K5
$$ 292 171 90 50 241 116 25 -112 -146 -84 -132 -140 -242 -77 -130 -32 -6 -63 29 162 87 123 156 284 110 20 45
2816D5OL9q9k33RM1Q0K9j4p3J42M8m9M2J56O6j09n2J1O1K3j11p3n4m3l0k9k2J36
$$ 45 51 90 1 -232 -223 -182 -102 -73 -87 -160 -18 30 -19 23 179 245 136 84 95 156 179 68 -5 -59 -102 -132 -161 -183 -47
2845d7k9j13p2J59K29J50p9k25MK28L3J5r1j48p8r0J18M0K9k25j94N7K72J59j0
$$ -47 -76 -189 -261 -102 127 277 198 -27 -23 205 238 253 162 14 -64 -154 -36 4 33 -192 -386 -329 -57 102 92
2870I2j82j41J69L02J06p4j20j40n8R6J03k0j57j63j17J39K16m0k29n7J17J81
$$ 92 -90 -231 -62 240 346 272 152 12 -46 50 153 133 -24 -187 -304 -165 51 11 -218 -275 -158 23
2892B3R7j0l3Pq6L72l21L8J75p4m5k39K57k55k66L06j49J1q7P6K4K98P0j30j31
$$ 23 120 110 77 84 -2 370 49 87 262 188 143 -96 161 -94 -360 -54 -203 -192 -279 -203 -179 119 189 59 -72
2917g2R8R8K28M5l24j41Q5j97M40p7k01j15n75Q3N49M69k46m02p5K18L46J46r4
$$ -72 26 124 352 397 73 -68 17 -180 260 183 -18 -133 -708 -625 -76 393 147 -255 -330 -112 234 380 286
2940B86k98m8N9J03K14k03k25j93J22J54J77J50m31j18L2J51K5K3o1l5J25J55
$$ 286 -12 -60 -1 102 316 113 -112 -305 -183 -29 148 298 -133 -251 -219 -68 -43 -20 -81 -116 9 164
2962A64J84j59k55M9r3O4J46K5k11l8j06J7J33pp1Q8j5O2M8L7R2J03l9r4o9m5
$$ 164 348 189 -66 -17 -110 -46 100 125 -86 -124 -230 -213 -80 -87 -158 -70 -85 -23 25 62 154 257 218 124 55 10
2988A0J65K9j94j42j18K1J53N1K0j84p6J7K32K12Q8j47j93j39K80K15p9K7l80
$$ 10 175 204 10 -132 -250 -229 -76 -25 -5 -189 -265 -248 -16 196 284 137 -56 -195 85 300 221 248 -132
3011a32o1J14J79q4r7j47j20K12J85O8j05j71M1J73K85m4j77j91R4J16P5j16j80
$$ -132 -193 -79 100 16 -81 -228 -348 -136 49 117 12 -159 -118 55 340 296 119 -72 22 138 213 97 -83
3034h3p2n3N9M5L3N7k01n9J01K87J55j33k04P3J51Q6r0m4l8oj17p1m7J22J6j61
$$ -83 -155 -208 -149 -104 -71 -14 -215 -274 -173 114 269 136 -68 5 156 242 152 108 70 64 -53 -124 -171 -49 -33 -194
3060a94j11P9J39J37o3lJ30nqo0K24Qp6j56j79J26M3p6j23j13P6R7N8j02N7J26
$$ -194 -305 -226 -87 50 -13 -16 114 109 101 41 265 273 197 41 -138 -12 31 -45 -168 -281 -205 -108 -50 -152 -95 31
3086C1K9p1k7J59J57j31j52L1L0J13n6k30r6J37J5k17N9J6J50M4o1rJ41P7L2p4
$$ 31 60 -11 -38 121 278 147 -5 26 56 169 113 -117 -213 -76 -61 -278 -219 -203 -53 -9 -70 -79 62 139 171 97
3112I7Q9R9j41j21%l2Q0r0j85n6R7j30J46m0K2J44j1J1J8J51J03n0n0J4j50N0
$$ 97 186 285 144 23 23 -9 71 -19 -204 -260 -163 -293 -147 -187 -165 -21 -32 -21 -3 148 251 201 151 165 15 65
3138F5O9j44j14P0nj82J42J16n0n5J1j5N1J69m0R1j0qK4K7l22R7J34p1o9j44k89
$$ 65 134 -10 -124 -54 -59 -241 -99 17 -33 -88 -77 -92 -41 128 88 179 169 161 185 212 -110 -13 121 50 -19 -163 -452
3165d52M55j90L0Q4L2Q3k62M35j14J08rj78J75j09J36k86o4R0k12K10k2j76k71
$$ -452 3 -187 -157 -73 -41 42 -220 215 101 209 200 22 197 88 224 -62 -126 -36 -248 -38 -60 -236 -507
3188e07M38K40k07j77M6J56N6J46K23l32J86j73n2M3m4m9k67J56k27L48n1J55
$$ -507 -69 171 -36 -213 -167 -11 45 191 414 82 268 95 43 86 42 -7 -274 -118 -345 3 -48 107
3210A07k98R9K55j86M01j50j95q4J39J50K79l12r9l88n2K74k89L35k72J89K12
$$ 107 -191 -92 163 -23 378 228 33 -51 88 238 517 205 106 -282 -334 -60 -349 -14 -286 -97 115
3231A15k88J80J23j85N8O3L3j08L01L9r7l77K35k12O5k05R6j85j10K04J28n1J04
$$ 115 -173 7 130 -55 3 66 99 -9 292 331 234 -143 92 -120 -55 -260 -164 -349 -459 -255 -127 -178 -74
3254g4J54L0l8K02j11j08J51k65j04K62k67Q6J7RO5l11K03J26k87J79R1j11L02
$$ -74 80 110 72 274 163 55 206 -59 -163 99 -168 -82 -65 -56 9 -302 -99 27 -260 -81 10 -101 201
3277B01l8P6p2J05k23P5m5L4Jl06L7j6L14l36M0J27k60r6K48L92k57n7J74J78
$$ 201 163 239 167 272 49 124 79 113 114 -192 -155 -171 143 -193 -153 -26 -286 -382 -134 258 1 -56 118 296
3301B96k36K38l65L95l64K63n24N2L49q5j28k63J58k7P3M52R6l61L82j20l04N12
$$ 296 60 298 -67 328 -36 227 -297 -245 104 19 -109 -372 -214 -241 -168 284 380 19 401 281 -23 489
3323D89m91J61k77j67M76j20M2j78J53l43J29L4J40k79J20J12Q0j25J89K8l0q7
$$ 489 -2 159 -118 -285 191 71 113 -65 88 -255 -126 -92 48 -231 -111 1 81 -44 145 173 143 56
3345E6J74j38q4N8Mr2j46J00j58L3J51N1j20L1RL5J65l9k1mP8k8q0qM6q1m9M8
$$ 56 230 92 8 66 70 -22 -168 -68 -226 -193 -42 9 -111 -80 -71 -36 129 90 69 65 143 115 35 27 73 -8 -57 -9
3373ipl5p0m8K5P7J2K8J5l1OJ47jK0j16L4l2L8n3J3o2l5p4M5R0K4p9LP1J03l7
$$ -9 -16 -51 -121 -169 -144 -67 -55 -27 -12 -43 -37 110 109 129 13 47 15 53 0 13 -49 -84 -158 -113 -23 1 -78 -75 -4 99 62
3404F2p8M9j4K4m0j2lK2K1r0k3K3K7j4jj8R7k7qqM0K5q4P3L5j5p7m4j7K5N1n4
$$ 62 -16 33 19 43 3 -9 -12 10 31 -59 -82 -59 -32 -46 -47 -65 32 5 -3 -11 29 54 -30 43 78 63 -14 -58 -75 -50 1 -53
3436e3j4l1L4kQ2l0J2K1P1L8Jm1m1KJ2km6m6l8l1NO7k0Ml9K4Q1J3lOL4MJMKq7
$$ -53 -67 -98 -64 -66 16 -14 -2 19 90 128 129 88 47 49 61 59 13 -33 -71 -102 -97 -30 -50 -46 -85 -61 20 33 30 36 70 74 75 79 81 -6
3472fk6k2nm8QJ6Qn9J00QJ0k1j7J35K4L4p7k4N4K7o6m4j9r4K3K5j6J5p9k3J35
$$ -6 -32 -54 -59 -107 -99 -83 -75 -134 -34 -26 -16 -37 -54 81 105 139 62 38 92 119 53 9 -10 -104 -81 -56 -72 -57 -136 -159 -24
3503b4Q1J5k6p9J0J03Q1j3o6j42Q0j6k6J1q2o9L5J17Njj2m6%R8O0L0j20n2Q4Q
$$ -24 57 72 46 -33 -23 80 161 148 82 -60 20 4 -22 -11 -93 -162 -127 -10 -5 -6 -18 -64 -64 34 94 124 4 -48 36 44
3533D4R9j07p1l1J9MJ4m5k6J0PR5k7ko5J01M4P2k4o1k5j7N9L5j60m8k3M3L2P4
$$ 44 143 36 -35 -66 -47 -43 -29 -74 -100 -90 -83 12 -15 -17 -82 19 63 135 111 50 25 8 67 102 -58 -106 -129 -86 -54 20
3563B0j06Qk5M2Q4J01j8j28NO2J65o7j09r1j5l1J21n1j0j38K7J41j0J1l0k6M1
$$ 20 -86 -78 -103 -61 23 124 106 -22 -17 45 210 143 34 -57 -72 -103 18 -33 -43 -181 -154 -13 -23 -12 -42 -68 -27
3590b7Q2R7l8q1J9j9K1Qo1l8n8k8J32Kp4l7K9J3J8P3k6J2M7N7j7l5j01K9K1L8
$$ -27 55 152 114 33 52 33 54 62 1 -37 -95 -123 9 11 -63 -100 -71 -58 -40 33 7 19 66 123 106 71 -30 -1 20 58
3620E8J4j06ll0l1J01l8Oj02Q3M3J15J3r7q0N0Q2K7l7j18M9k5L3rl2rp4jN0J55
$$ 58 72 -34 -37 -67 -98 3 -35 -29 -131 -48 -5 110 123 26 -54 -4 78 105 68 -50 -1 -26 7 -2 -34 -43 -117 -118 -68 87
3650H7j30J10o11L47K82P6l32j04M36j65J48J02r6r7r6J8pk14L31p8k29L98r9
$$ 87 -43 67 -544 -197 85 161 -171 -275 161 -4 144 246 150 53 -43 -25 -32 -246 85 7 -222 176 77
3673G7l03K30O5j45P1L1j0n1r7J07N8l0p7lM4N8Pm3m5J00j2j8K5j41J42K8j02
$$ 77 -226 4 69 -76 -5 26 16 -35 -132 -25 33 3 -74 -77 -33 25 32 -11 -56 44 32 14 39 -102 40 68 -34
3700c4J8J1L8n6j06J17K06k14NL2j4L4J7l1M2J5l9j8L8m6K8m5p9MJ4PK7n2k3J05
$$ -34 -16 -5 33 -23 -129 -12 194 -20 -15 17 3 37 54 23 65 80 41 23 61 15 43 -2 -81 -77 -63 -56 -29 -81 -104 1
3730AL3j5K5J9J1j6k1rOk1k3l8o2P8j8p4K4n0Q1L5R8l6O4j8j1L6k3N4n0n1k8O
$$ 1 34 19 44 63 74 58 37 28 34 13 -10 -48 -110 -32 -50 -124 -100 -150 -69 -34 64 28 92 74 63 99 76 130 80 29 1 7
3762Gj0M9r0m4n7O9k0P5K8m6O8nQ3j9k1Mj3J7K3p9M4j01j01R6m4m1mj4N9N5l2
$$ 7 -3 46 -44 -88 -145 -76 -96 -21 7 -39 29 24 107 88 67 71 58 75 98 19 63 -38 -139 -43 -87 -128 -132 -146 -87 -32 -64
3793f4J3R2L1L8j5k0M8m4k9Qm3q2j3PJ1K5q9l3K0P9O9O1Qn1N4JR2q2qR1j44l4
$$ -64 -51 41 72 110 95 75 123 79 50 58 15 -67 -80 -73 -62 -37 -126 -159 -139 -60 9 70 78 27 81 82 174 92 84 175 31 -3
3825cK4j6j02Ko4k3M7J01m1J3N1J5M4Q6l7J9l5O9k8o0Om3q3n0JJ8j8Pk3L5j2P7
$$ -3 21 5 -97 -95 -159 -182 -135 -34 -75 -62 -11 4 48 134 97 116 81 150 122 62 68 25 -58 -108 -107 -89 -107 -100 -123 -88 -100 -23
3857b3R9p9J12l7k6J4K7k5L6k3r2l1k0L4n4J2j7J9j3K9M5Q4rl2oO1kO9j30O4r5
$$ -23 76 -3 109 72 46 60 87 62 98 75 -17 -48 -68 -34 -88 -76 -93 -74 -87 -58 -13 71 62 30 24 85 83 152 22 86 -9
3888iJ7l0j7o8o8P2k4oJ94j03J97j83k48L86n2j00J08o5J82j61j90J81m01L20
$$ -9 8 -22 -39 -107 -175 -103 -127 -133 61 -42 155 -28 -276 110 58 -42 66 1 183 22 -168 13 -388 -68
3912f8Q1j3k29L15j11l97M48j65L09j21J68j63l0j5m7J74q9rl3j10N5N0k1o7r
$$ -68 13 0 -229 86 -25 -422 26 -139 170 49 217 54 24 9 -38 136 47 38 5 -105 -50 0 -21 -88 -97
3937i7MM6QK8N9l3J6o4J02J7L3p5j28M1M8M4o0o5rrj3M6J5O7n8N4l0L8MN5m3K5
$$ -97 -93 -47 -39 -11 48 15 31 -33 69 86 119 44 -84 -43 5 49 -11 -76 -85 -94 -107 -61 -46 21 -37 17 -13 25 29 84 41 66
3969F6p3lJ8j8K1k1k7n1j0O7L8ml2K9k2N6PJ2N4p6k8P0J3k4k5j54JQ1M8J6m9m2
$$ 66 -7 -10 8 -10 11 -10 -37 -88 -98 -31 7 3 -29 0 -22 34 41 53 107 31 3 73 86 62 37 -117 -116 -35 13 29 -20 -62
4001f2KJJ49l0l3o0OP9j9P6n8n1K7lK3o4j9o9j6Q7L3l5L7pjk0R2m3OpJ5j9j6l2
$$ -62 -60 -59 90 60 27 -33 -27 52 33 109 51 0 27 24 47 -17 -36 -105 -121 -34 -1 -36 1 -6 -7 -27 65 22 28 21 36 17 1 -31
4035c1L2jm0o9N5K9j8J9N8k5oj8j0L5P8n5n2N9q1lQ1J5j05K7rk2L7l3O2J2j08
$$ -31 1 0 -40 -109 -54 -25 -43 -24 34 9 3 -15 -25 10 88 33 -19 40 -41 -44 37 52 -53 -26 -35 -57 -20 -53 9 21 -87
4066h7N4Q6K5n9M5Lq9l7Q8n2k9L9m4M5J1n1K6N3j1l9N1N9m9M8r5L7K6m4q4J02
$$ -87 -33 53 78 19 64 67 -22 -59 29 -23 -52 -13 -57 -12 -1 -52 -26 27 16 -23 28 87 38 86 -9 28 54 10 -74 28
4096B8l9p6K8m3M4kM5Pk5mN5l4K7M9m5J5J7q6QL1Q4j39m7L8N3Mo6O9ql4L7nJ12
$$ 28 -11 -87 -59 -102 -58 -60 -15 -8 -33 -37 18 -16 11 60 15 30 47 -39 -31 0 84 -55 -102 -64 -11 -7 -73 -4 -12 -46 -9 -14 98
4129I8k1q1N1l5P6m2l1j36M3Q8ll3mj34NM4P6M4k7oLo2J40j2N6m6j00l7J31K3
$$ 98 77 -4 47 12 88 46 15 -121 -78 10 7 -26 -30 -164 -159 -115 -39 5 -22 -28 -25 -87 53 41 97 51 -49 -86 45 68
4159F8n1p6j8L0Nj3RKJ3n3K3N4L2P1o0j5jM8l4KL5K2o8j06o3R4J20o7m9m0nJ15
$$ 68 17 -59 -77 -47 -42 -55 -46 -44 -31 -84 -61 -7 25 96 36 21 20 68 34 36 71 93 25 -81 -144 -50 70 3 -46 -86 -91 24
4191B4M1K0n2j53P2O8L8N8j34l4KN5J2M2l2j65M2Q3L9LM7q5j2N2L6k7k1l3j8j3
$$ 24 65 85 33 -120 -48 20 58 116 -18 -52 -50 5 17 59 27 -138 -96 -13 26 29 76 -9 -21 31 67 40 19 -14 -32 -45
4221d5Q7j6l5j4jL5Rk0oJ7n4R9m3K1q0P3j9j3L1m0k7O9ko2j7J1L5l8P1K2o2l6
$$ -45 42 26 -9 -23 -24 11 20 0 -6 11 -43 56 13 34 -46 27 8 -5 26 -14 -41 28 26 -36 -53 -42 -7 -45 26 48 -14 -50
4253e0P5j9R5m8l4m8l5O9J9L6j11p7J5J04R5n6L7r9rR3J5NKq1m2R2L3k1r2k6n1
$$ -50 25 6 101 53 19 -29 -64 5 24 60 -51 -128 -113 -9 86 30 67 -32 -41 52 67 72 74 -7 -49 43 76 55 -37 -63 -114
4284a14N5j5J10j02LkL8O7p0O1J7j2l1O5K7o2n2L2j7K1p2k9N5k0L2n5JM6L3O0
$$ -114 -59 -74 36 -66 -63 -65 -27 40 -30 31 48 36 5 70 97 35 -17 15 -2 19 -53 -82 -27 -47 -15 -70 -69 -23 10 70
4314G0K7p8K5J4P6m5n0l9Ml0M0q4J9j14P8K2K4O5m7j3M2NR0l4J3j9p5J11m5K3
$$ 70 97 19 44 58 134 89 39 0 4 -26 14 -70 -51 -165 -87 -65 -41 24 -23 -36 6 11 101 67 80 61 -14 97 52 75
4344G5n4n5QoJ9n1poMO6Nl5O6n2P4j2M2o8%lm3M2l0Pk5M1m6l0QO2n1N7M1J8p2
$$ 75 21 -34 -26 -32 -13 -64 -71 -77 -73 -7 -2 -37 29 -23 51 39 81 13 13 10 -33 9 -21 -14 -39 2 -44 -74 -66 -4 -55 2 43 61 -11
4379a1O8K4j4K0K9m8o1O7m8l2J5q8J4j4P1l9J2l7R8J6k7M8Kp9P9k4M6q1Or0K3
$$ -11 57 81 67 87 116 68 7 74 26 -6 9 -79 -65 -79 -8 -47 -35 -72 26 42 15 63 65 -14 65 41 87 6 12 -78 -55
4410e5j2J6M8r6L8oK7M3jk6O9n2O8LL3m8m9m3L4kk0k1K3j2K6kl5L4l1M3P3j0l3
$$ -55 -67 -51 -3 -99 -61 -67 -40 3 2 -24 45 -7 61 64 97 49 0 -43 -9 -11 -31 -52 -29 -41 -15 -17 -52 -18 -49 -6 67 57 24
4443B4j5M0j3RO3j10j4Qj7l5k0ROJ2k5j2N8J7O6k8PJ8%K9m5jOp2j3LO9k1q5J0
$$ 24 9 49 36 45 108 -2 -16 -8 -25 -60 -80 -71 -65 -53 -78 -90 -32 -15 51 23 30 48 48 77 32 31 37 -35 -48 -45 24 3 -82 -72
4477g2M3rRO8l7J9kl1O0O3r5M3o4K9%k2l2n3J5LJK5ML3n9O1J3K5M2m4K3J0l3J4
$$ -72 -29 -38 -29 39 2 21 19 -12 48 111 16 59 -5 24 24 2 -30 -83 -68 -65 -64 -39 -35 -2 -61 0 13 38 80 36 59 69 36 50
4511E0k8Jp6RK6m8J1L0J7ml5P1n2J0O3J5oJ6m6K4K8m7q6Q5q1Q3l7k1j3n1M7o1
$$ 50 22 23 -53 -44 -18 -66 -55 -25 -8 -12 -47 24 -28 -18 45 60 54 70 24 48 76 29 -57 28 -53 30 -7 -28 -41 -92 -45 -106
4543a06Q3L4L1qlk3M4K7nk0m4j0k2pj1k4k6N0j4K5k7O5k4O4n1O4K9n6l4J1M1j2
$$ -106 -23 11 42 34 31 8 52 79 74 54 10 0 -22 -29 -40 -64 -90 -40 -54 -29 -56 9 -15 49 -2 62 91 35 1 12 53 41
4575D1j5m1rk5N0r6N5L1o1M4KK2J5k0PM4l3pN2j5J3o1M2j07N2l0m1L5M8J3jk0
$$ 41 26 -15 -24 -49 1 -95 -40 -9 -70 -26 -24 -2 13 -7 0 44 11 4 56 41 54 -7 35 -72 -20 -50 -91 -56 -8 5 4 -16
4607a6j7M0N6L6lJ1q6PM1nn2k1Jp2JM0O9j11kO9M9K3n4lrQ0k2P4r3k6j8K3L2m7
$$ -16 -33 7 63 99 96 107 21 28 69 64 12 -9 -8 -80 -79 -39 30 -81 -83 -14 35 58 4 1 -8 72 50 124 31 5 -13 10 42 -5
4641en0J8n4M2L2j0m2j9O8K4JL7L0q0N1PRQj15L5Qo1L0k1m4P2m5M0m1Q9k3N2l4
$$ -5 -55 -37 -91 -49 -17 -27 -69 -88 -20 4 5 42 72 -8 43 50 59 67 -48 -13 -5 -66 -36 -57 -101 -29 -74 -34 -75 14 -9 43 9
4674IL5j5K9Jk9M5p0J7n2p5J8N3L8l3Nn8L9j5Q2J5Pk5J8J7M0l4pl2m4LM1j8o1
$$ 9 44 29 58 59 30 75 5 22 -30 -105 -87 -34 4 -29 -24 -82 -43 -58 24 39 46 21 39 56 96 62 55 23 -21 -18 23 5 -56
4707e6J8J4J5Pn2K1k3O6L6PqqOM7m2O8j15L1o3L0K0m1o7K2M3o1N3jM2m5JQ7j8
$$ -56 -38 -24 -9 -2 -54 -33 -56 10 46 53 45 37 43 90 48 116 1 32 -31 -1 19 -22 -89 -67 -24 -85 -32 -33 9 -36 -35 52 34
4740C4K2n5Ok4Po4J25Pl4q5qLRj3K5K1mJ5L1j5kM0l0Lk0L7m9M4k3l3j1M5m6K8
$$ 34 56 1 7 -17 -10 -74 51 58 24 -61 -69 -66 -57 -70 -45 -24 -28 -13 18 3 1 41 11 14 -6 31 -18 26 3 -30 -41 4 -42 -14
4774a4OM7j8Lk7M3q0N1m1QO9l1k3M4j8j8k4J6P9k9o7l9J4O8K5m9n3N5l5J7J9r
$$ -14 -8 39 21 24 -3 40 -40 11 -30 -22 47 16 -7 37 19 1 -23 -7 72 43 -24 -63 -49 19 44 -5 -58 -3 -38 -21 -2 -11
4806a1l0L5Ql8K8no8J7N4qL4J6q7Lj0Q8k0oO7p6NOM2m8J6n8L6M9jo8j0m0Q3J5
$$ -11 -41 -6 2 -36 -8 -13 -81 -64 -10 -18 16 32 -55 -52 -62 26 6 0 67 -9 -4 2 44 -4 12 -46 -10 39 38 -30 -40 -80 3 18
4840A8K0j07R3j0k4K3J8J7lq4J4nL5L7q8L4k8J12r1M1j6j8j4N2m9K5k1j9J21q2
$$ 18 38 -69 24 14 -10 13 31 48 45 -39 -25 -30 5 42 -46 -12 -40 72 -19 22 6 -12 -26 26 -23 2 -19 -38 83 1
4870Alj8J7L6K8j09J5k0K2M1p6R1o6j0P3J1M4r8K8n8K8P5L5r4J7j6o5Q3j7l4M9
$$ 1 -2 -20 -3 33 61 -48 -33 -53 -31 10 -66 25 -41 -51 22 33 77 -21 7 -51 -23 52 87 -7 10 -6 -71 12 -5 -39 10
4901A0p6P2n4N5M9n2K6m3N1k6O4p0M6l4k5M8p2M3m6N0k2Pj2K7j1j4K4j8%O2j6
$$ 10 -66 6 -48 7 56 4 30 -13 38 12 76 6 52 18 -7 41 -31 12 -34 16 -6 1 -11 16 5 -9 15 -3 -3 59 43
4932D3n0J8l6P9l4j5jn1j1M6M6Pr1kk5O5K1K4l6J4m2O5k7M4o7p6n4J13J43j31
$$ 43 -7 11 -25 54 20 5 4 -47 -58 -12 34 41 -50 -52 -77 -12 9 33 -3 11 -31 34 7 51 -16 -92 -146 -33 110 -21
4962b1J72k32M1P3M6j50qJ7J3mJ0%k9K48j31k05R4P9N3K35l38N5J48o4K39l53
$$ -21 151 -81 -40 33 79 -71 -79 -62 -49 -53 -43 -43 -72 176 45 -160 -66 13 66 301 -37 18 166 102 341 -12
4988a2j5j3L1L1J6j8k5o0M8pN5Q9j00j0p3J00k6j3K4j22J62j47O4R1q4K5r2J27
$$ -12 -27 -40 -9 22 38 20 -5 -65 -17 -24 31 120 20 10 -63 37 11 -2 22 -100 62 -85 -21 70 -14 11 -81 46
5016D6L7k81M82Q8p44K93j8O1o7J32L0J27j45n9M5%j28K4R6l3O4o3Kj3J6J9N1
$$ 46 83 -198 284 372 -372 -79 -97 -36 -103 29 59 186 41 -18 27 27 -101 -77 19 -14 50 -13 -11 -24 -8 11 62
5043F2l6k2K1nj4kM2r3M8M8j00M4Kl5N5n3J0MJ3J1oN8o5J57k47k59L26J23j87
$$ 62 26 4 25 20 6 4 46 -47 1 49 -51 -7 -5 -40 15 -38 -28 -24 -11 0 -6 52 -13 144 -103 -362 -36 87 -100
5072a00J67j63J08J7L1j4p4n8N1o5K10n02K01J06l27N05k09J04j06O3l3P4rL1
$$ -100 67 -96 12 29 60 46 -28 -86 -35 -100 110 -392 -191 -85 -412 93 -116 -12 -118 -55 -88 -14 -23 8
5096Hj01R7m4P6j1l7l5L2l8P6j3K5k6m9O3L4o9P7r2M9n2%J5%lN1j20J21r5J45
$$ 8 -93 4 -40 36 25 -12 -47 -15 -53 23 10 35 9 -40 23 57 -12 65 -27 22 -30 -30 -15 -15 -18 33 -87 34 -61 84
5126H4j65R5K1M09o38OL96j27j2l27K59l30N83r4o5j23k80K40j23N6J08N7Om7
$$ 84 -81 14 35 444 -194 -188 208 81 69 -258 1 -329 254 160 95 -28 -308 -68 -191 -135 -27 30 36 -11
5150a1Mk2M4j9l7L1K2nM7k8qk2k5J7J5oLJJ1J5pnl4J9O7r9N6m4%MK0k9O4j13R2
$$ -11 -7 -29 15 -4 -41 -10 12 7 54 26 18 -4 -29 -12 3 -3 0 1 12 27 20 15 -19 0 67 -32 24 -20 -20 -16 4 -25 39 -74 18
5185A8q3Q5J7j1mP3k53L19k31M26k58l83R3L14j14k10J67o4J15rr3J5k14j79L99
$$ 18 -65 20 37 26 22 95 -158 161 -70 356 98 -285 -192 122 8 -202 -35 -99 16 7 -86 -71 -285 -464 -65
5210f5Q0j45L7r1M01o0K89m99L20J1j55n47L78L15l85k72M27o92P12p0M7M8o48
$$ -65 15 -130 -93 -184 217 157 446 -53 267 278 123 -424 -46 269 -116 -388 39 -653 59 -11 36 84 -564
5233e64M52Q8j30J14m1M66p66K77M71l89k1j34J06q1R6o0K34J34o9N5l54J42k20
$$ -564 -112 -24 -154 -40 -81 385 -381 -104 367 -22 -43 -177 -71 -152 -56 -116 118 252 183 238 -116 26 -194
5256a94J54LO2J9J80m20rO8p5O20o46J28K06J35n71K57R3j60N06m82P6J70N5k83
$$ -194 -40 -37 25 44 224 -196 -205 -137 -212 408 -238 -110 96 231 -340 -83 10 -150 356 -126 -50 120 175 -108
5280a08k43L20m7P9J40j71o6J61k6j36Q0mj6K6n4J64j52J14q6Q6P3k2j75J9R3
$$ -108 -351 -31 -78 1 141 -30 -96 65 39 -97 -17 -21 -37 -11 -65 99 -53 61 -25 61 134 112 -63 -44 49
5305D9j19K1M5m6L8On9J8P0l8Rk2L8J0j5j2J4J3J1k9%j7Oj4M%j2k7J19j36J60
$$ 49 -70 -49 -4 -50 -12 -6 -65 -47 23 -15 -6 -28 10 20 5 -7 7 20 31 2 2 -15 -9 -23 -19 -19 -31 -58 61 -75 85
5336H5k29j50M62j48K0R1j02j10L17J27l15p8N2K9k0o3m6M5K4Rm0K2L1l4lK4K8
$$ 85 -144 -294 168 20 40 131 29 -81 236 363 48 -30 22 51 31 -32 -78 -33 -9 0 -40 -18 13 -21 -24 0 28
5363B8k5J00j1p3n8L6N0j2n3l8N3q0Q4j0N0jl7j0k0Q0j1m9mjLj1O8n4K3l9N3l2
$$ 28 3 103 92 19 -39 -3 47 35 -18 -56 -3 -83 1 -9 41 40 3 -7 -27 53 42 -7 -11 -12 -9 -20 48 -6 17 -22 31 -1
5395aj9K6n8N3k0O2j4l3k1K0QN1j6ll6M0J2n5m7L7j6M4nn3N6m6L6mM2J2l5J3l4
$$ -1 -20 6 -52 1 -19 43 29 -4 -25 -5 3 54 38 35 -1 39 51 -4 -51 -14 -30 14 9 -44 12 -34 2 -2 40 52 17 30 -4
5428dK7M3n2k4k1N0m6j8M1M3q4M6l0J8K6n0j7N4N1j5n9l5N9O2p0N9m3nJ5Mn4K8
$$ -4 23 66 14 -10 -31 19 -27 -45 -4 39 -45 1 -29 -11 15 -35 -52 2 53 38 -21 -56 3 65 -5 54 11 6 21 25 -29 -1
5460aRk4M5o7M2QM6l7m2Q0o4jl3Q0l3J7J6r2O1km1L7J4m5O7j9k1nJ1K5J7l9l6
$$ -1 8 -16 29 -38 4 12 58 21 -21 59 -5 -6 -39 41 8 25 41 -51 10 8 -33 4 18 -27 40 21 0 -5 6 31 48 9 -27
5493b7MN0l2o7J3P0Jpm0J19j15R1m5L0o7J5K4m6P3k8m2O1q1R8o6k5K6j2K6p0N9
$$ -27 -23 27 -5 -72 -59 11 12 5 -35 84 -31 60 15 45 -22 -7 17 -29 44 16 -26 35 -46 52 -14 -39 -13 -25 1 -69 -10
5524a0j6j6O1kK4q5M7L6k0k7J9k9M5j2l0Lo5k3N7J4K2k8RJ07r6R0n6pN4m1k0P5
$$ -10 -26 -42 19 17 41 -44 3 39 19 -8 11 -18 27 15 -15 -12 -77 -100 -43 -29 -7 -35 -26 81 -15 75 19 12 66 25 5 80
5556H0p6o1L2L8l7jK1Kk3pK0J4opJ7Q4j08j2N9j4m9O3kk0m4R1p5J9j4O4m9kj6
$$ 80 4 -57 -25 13 -24 -25 -4 -2 -25 -32 -12 2 -4 -11 6 90 -18 -30 29 15 -34 29 27 7 -37 54 -21 -2 -16 48 -1 -3 -19
5589a9O5m4K7Pj9m0K0j2K7p9J02q9R4j70J66j82K34j80J67O2j60n4N6J79l55R0
$$ -19 46 2 29 36 17 -23 -3 -15 12 -67 35 -54 40 -130 36 -146 88 -92 75 137 -23 -77 -21 158 -197 -107
5615a07K10q9l8J35O6P3j47R1k94LP5j85L42N3k50r3n9M18k79j40K51o9k5J80
$$ -107 103 14 -24 111 177 250 103 194 -100 -97 -22 -207 135 188 -62 -155 -214 204 -75 -215 36 -33 -58 122
5639A22o5J77j73j00J8q5J12k09K6m6J57J18j73M36m63L6m3J96q9L62l39K6K81
$$ 122 57 234 61 -39 -21 -106 6 -203 -177 -223 -66 52 -121 315 -148 -112 -155 41 -48 314 -25 1 282
5662B82l03J22N1k18LL84l89rq4K84N3m22Q1L16j02OM0n1j42oK26q2L2j74J58
$$ 282 -21 101 152 -66 -63 321 -68 -77 -161 123 176 -246 -165 151 49 55 95 44 -98 -104 122 40 72 -102 56
5687E6j9o6j34K11j08M5l4j37L24j76n3L3j13J72j36j6K7J24r9K2r0l4K29N3L
$$ 56 37 -29 -163 48 -60 -15 -49 -186 138 -38 -91 -58 -171 1 -135 -151 -124 0 -99 -77 -167 -201 28 81 84
5712H4j19j22K64j80J70k07R1J4K9M7j14P4j43P5M7j4qO5j14m5J47M3r2n2J07
$$ 84 -35 -157 107 -73 97 -110 -19 -5 24 71 -43 31 -112 -37 10 -4 -12 53 -61 -106 41 84 -8 -60 47
5737D7j28M5K46r9p3j30j85J67J47J45j40k37P3J52j11q6J76j60j06M8P5J09K75
$$ 47 -81 -36 210 111 38 -92 -277 -110 37 182 42 -195 -122 30 -81 -167 9 -151 -257 -209 -134 -25 250
5760B50j91j27K43r8Kn8m48L79j09J25m1k9J37l1lj3%m4L6Q6m3l6j2RJ0M0k1n5
$$ 250 59 -68 175 77 79 21 -427 -48 -157 -32 -73 -102 35 4 1 -12 -12 -56 -20 66 23 -13 -25 -16 -6 34 13 -42
5788d2N6Nk4j6N5n1J4j6J9o4J11m8l3k0k4J88l00J16J41j4J04j15j50L63l89K02
$$ -42 14 19 -5 -21 34 -17 -3 -19 0 -64 47 -1 -34 -54 -78 110 -190 -74 67 53 157 42 -108 255 -134 68
5814F8j31J97j40j21J05K49k60k04M8J65j25o6j26M47j40l48M32rq8M6m4L8O8
$$ 68 -63 134 -6 -127 -22 227 -33 -237 -189 -24 -149 -215 -341 106 -34 -382 50 41 -47 -1 -45 -7 61
5837F1q5m4M9J8l4J4O4n9m3O1pj7j2LON0m2K1k3JK9J5o2P4ln9J9J0n6J0K2M9m3
$$ 61 -24 -68 -19 -1 -35 -21 43 -16 -59 2 -5 -22 -34 -31 -25 25 -17 4 -19 -18 11 26 -36 38 35 -24 -5 5 -51 -41 -19 30 -13
5870a3j5K1N6m9n5RL4L1l8k3O2Pj7n3J9M2n9R2j5j9nnk0l7O9l9oQk3L3k1rM7k
$$ -13 -28 -7 49 0 -55 -46 -12 19 -19 -42 20 27 10 -43 -24 18 -41 51 36 17 12 7 -13 -50 19 -20 -26 -18 -41 -8 -29 -38 9 7
5904GN1m3q2R4k9j9Lj2J4K5JOK0n1O0l9k9K7oj5L7pk7pM0Rk6K0l1Q7j31R4l8N0
$$ 7 58 15 -67 27 -2 -21 -18 -30 -16 9 10 16 36 -15 45 6 -23 4 -2 -17 20 13 -14 -21 19 28 2 22 -9 78 -53 41 3 53
5938E3p1l3N0m0Q2r3J05ok5k2O0o8L9k4l1K6O1j05N7l2M0k9M0k3l9K0oj1N5k1
$$ 53 -18 -51 -1 -41 41 -52 53 47 22 0 60 -8 31 7 -24 2 63 -42 15 -17 23 -6 34 11 -28 -8 -14 -25 30 9
5968Il7N6K7m9J3Rm0M5o2N1j0Jk8PJ9n5L6O4m3Km0JJ4l1K1JlJk7J7PKJk1L9kk0
$$ 9 -28 28 55 6 19 28 -12 33 -29 22 12 13 -15 -8 11 -44 -8 56 13 15 -25 -24 -10 -41 -20 -19 -22 -21 -48 -31 -24 -22 -21 -42 -3 -5 -25
6005b5K7L2o0L2N0Jo1p2J06l5l4N5k5L0J3l3K8q3L1L5J6m2o5P9Qk0O2n0Nln2P1
$$ -25 2 34 -26 6 56 57 -4 -76 30 -5 -39 16 -9 21 34 1 29 -54 -23 12 28 -14 -79 0 8 -12 50 0 5 2 -50 21
6037B1l6K7m0K2QJ9k3l4L2Oj5k5L0N8l8j9J8j1Q8q9qjNl4J3J8M2n4l4J5Q1l8J0
$$ 21 -15 12 -28 -6 2 21 -2 -36 -4 2 -13 -38 -8 50 12 -7 11 0 88 -1 -9 -10 -5 -39 -26 -8 34 -20 -54 -39 42 4 14
6070A4k0l0J5K0k7L3M3o2M4l8l2L0J3k2j3M8l9K7m6K9k9N4K1l0k6L5J2n0K5j0
$$ 14 -6 -36 -21 -1 -28 5 48 -14 30 -8 -40 -10 3 -19 -32 16 -23 4 -42 -13 -42 12 33 3 -23 12 24 -26 -1 -11
6100a1K5k1RK8l3K6l0L1n4J0l9J07Kn9J7J4J1o1NKL0k1K0m7k2J0O3m2J4nk0J6
$$ -11 14 -7 2 30 -3 23 -7 24 -30 -20 -59 48 50 -9 8 22 33 -28 -23 -21 9 -12 8 -39 -61 -51 12 -30 -16 -21 -41 -25
6132b5J8J6k6O3n0K8J2n4K5n2L1K7J4rM1l8q2J01l6pM1l5n9N0M4j4m1K7pjn6J9
$$ -25 -7 9 -17 46 -4 24 36 -18 7 -45 -14 13 27 18 59 21 -61 40 4 -3 38 3 -56 -6 38 24 -17 10 3 2 -54 -35
6164c5QnL6k9oJ2QL7q7P5l8P2m7k0J4nR2r0J4Mm5K1J5l0Q6p8J3j5N5pn0k3nN5
$$ -35 -27 -32 4 -25 -31 -19 -11 26 -61 14 -24 48 1 -19 -5 -10 82 -8 6 10 -35 -14 1 -29 57 -21 -8 -23 32 25 -25 -48 -53 2
6198BJk6M2ro6L3rJ4L4m1k5M6K5m5lM2l6R3r7LM5j4K3n2j2l4P4k0L5o5O1k6K2
$$ 2 3 -23 19 10 -56 -23 -32 -18 16 -25 -50 -4 21 -24 -27 15 -21 72 -25 -22 23 9 32 -20 -32 -66 8 -12 23 -42 19 -7 15
6231A5l7j9J8M9pj3mk0m4NJ41j04n3P6k0l8L1K8K8n6k8M7K4j1r9N0P0qk3J3k8
$$ 15 -22 -41 -23 26 19 6 2 -18 -62 -57 84 -20 -73 3 -17 -55 -24 4 32 -24 -52 -5 19 8 -91 -41 29 21 -2 11 -17
6262a7j4N9l8L6l3J5k1K0J9j1Kn8L3k0K6J2NJ9o7J18q0K5k2pM0n8L2k9j0PoL8
$$ -17 -31 28 -10 26 -7 8 -13 7 26 15 17 -41 -8 -28 -2 10 15 34 -33 85 5 30 8 1 41 -17 15 -14 -24 -17 -23 15
6294A5ln7M5j3K5L8Ln5j3m7J25j13Q7M0q1L9m6Rk5L2k5j0q6PQ2m6J25o7K4J5p1
$$ 15 12 -45 0 -13 12 50 53 -2 -15 -62 63 -50 37 77 -4 35 -11 -2 -27 5 -20 -30 -116 -109 -27 -73 52 -15 9 24 -47
6325d7K4J78l48N0K99k78J29l9k7NP3j8K0n0K6j3K8J5k7m1N5Ok8Lj2j4K9L3m4
$$ -47 -23 155 -193 -143 156 -122 7 -32 -59 -54 19 1 21 -29 -3 -16 12 27 0 -41 14 20 -8 -5 -17 -31 -2 31 -13
6354a3J5j4K6O8j04M1k5J1K3Qo8O2rj3j1N2j17J33j70J43j44M09K8l95J50j72
$$ -13 2 -12 14 82 -22 19 -6 5 28 36 -32 30 21 8 -3 49 -68 65 -105 38 -106 303 331 -64 86 -86
6380h6O7J9k3j5J06j6q9J08j38M3j7L3rm2P9j05K7J20j75M5j7j5P9M8N5q1o2j9
$$ -86 -19 0 -23 -38 68 52 -37 71 -67 -24 -41 -8 -17 -59 20 -85 -58 62 -113 -68 -85 -100 -21 27 82 1 -61 -80
6408h0N6O3n5o5j49K19J47p5l53L16J09k82J25m8r5M5K51r1N9j24o9Q7j0J24K9
$$ -80 -24 39 -16 -81 -230 -11 136 61 -292 24 133 -149 -24 -72 -167 -122 129 38 97 -27 -96 -9 -19 105 134
6433A34k09K94k25j33Q7K5J57m7j3Q0r4j79J60J00P5J6rj43j51J75j76K05n3j00
$$ 134 -75 219 -6 -139 -52 -27 130 83 70 150 56 -123 37 137 212 228 219 76 -75 100 -76 129 76 -24
6457b4J02j11J97j69J3j0M8J74Jk31q9j9j94M39l87P6K18J67K33j67k30j16KK3
$$ -24 78 -33 164 -5 8 -2 46 220 221 -10 -99 -118 -312 127 -260 -184 34 201 434 267 37 -79 -77 -54
6481e4j24q9L65k06K90k40J81K4j72K18k77N3J1Pr9M3L81m47M23k34r0k8o0M9
$$ -54 -178 -267 98 -108 182 -58 123 147 -25 193 -84 -31 -20 -13 -112 -69 312 -135 288 54 -36 -64 -124 -75
6505g5k11L2M46l93p4L20K45j80l03J48R0J52j60j01l13M75l64n7L50m8k54K75
$$ -75 -286 -254 192 -201 -275 45 290 110 -193 -45 45 197 37 -64 -377 98 -266 -323 27 -21 -275 0
6527@j02j54K97j60L44l25K29M5m84J04K29J45k66K57j70j1l03J80P4j52K14m8
$$ 0 -102 -256 41 -119 225 -100 129 174 -310 -206 23 168 -98 159 -11 -22 -325 -145 -71 -223 -9 -57
6549e7M8K0q2P1N3k06K21l19J20J80L4J90M6m42J8k69L99J5k07J90O9j06L3j32
$$ -57 -9 11 -71 0 53 -153 68 -251 -131 49 83 273 319 -123 -105 -374 25 40 -167 23 92 -14 19 -113
6573a13J6RL02j53k26N8M4l1J49k82K37L8o6l3Q3j15N3j14r1J77jJ37j27k3M1
$$ -113 -97 -88 214 61 -165 -107 -63 -94 55 -227 10 48 -18 -51 32 -83 -30 -144 -235 -58 -59 78 -49 -72 -31
6598c1J2j40LQ8J46j8j36K09j96J40j20p5J43J0rJ8k4j73J31R4Kk72Q3K06p7j6
$$ -31 -19 -159 -156 -68 78 60 -76 133 -63 77 -43 -118 25 35 26 44 20 -153 -22 72 74 -198 -115 91 14 -2
6624bJ13j50nJ12j16P3k03J68K5J4m9j89o4K48Q2p5O4J2j99J64o6J28n3j06r0
$$ -2 111 -39 -44 68 -48 25 -178 -10 15 29 -20 -209 -273 -25 57 -18 46 58 -141 23 -43 85 32 -74 -164
6649a64J28Q6l5L9r6L4mO4m5M8l2o6Q7K3%r0Q6j03Q6j14R4L5k29P8L32l29m9P7
$$ -164 -36 50 15 54 -42 -8 -12 52 7 55 23 -43 44 67 67 -23 63 -40 46 -68 26 61 -168 -90 242 -87 -136 -59
6677e9J6M0J8K06o3j84L7Q7l05R9L0J99q1j34J35l14K88j9m8j36M73l03j7Mm2
$$ -59 -43 -3 15 221 158 -26 11 98 -207 -108 -78 121 40 -94 41 -273 15 -4 -52 -188 285 -18 -35 -31 -73
6702g3K51j85K1j31L2J66k05O9J20j3l1R8k90J53K5j34O8j56M6J20o3K25K45n3
$$ -73 178 -7 14 -117 -85 81 -124 -55 65 52 21 119 -171 -18 7 -127 -59 -215 -169 -49 -112 113 358 305
6726C05l63j41p6K86m1Q7j79J67k27k6K55L9m1m05K08m0J03K71k36J58k92K46
$$ 305 -58 -199 -275 11 -30 57 -122 45 -182 -208 47 86 45 -360 -152 -192 -89 182 -54 104 -188 58
6748E8j59K33k62l1J84P3q3q3J20O7j18J84k03J01P3l44J68j90K31k87K43p2l2
$$ 58 -101 132 -130 -161 23 96 13 -70 50 117 -1 183 -20 81 154 -190 -22 -212 19 -268 -25 -97 -129
6771a29J31K27m39N3p1L95l14K79o79N06J07j22M5J87K23k25m50J17L95l76r9
$$ -129 2 229 -210 -157 -228 167 -147 132 -547 -41 66 -56 -11 176 399 174 -276 -159 236 -140 -239
6792b39K70Op9J27J24k34JJ16k59J20J06Mo5J0n1K4kL8p6K7k7N9%j5M9j9l2L8
$$ -239 31 37 -42 85 209 -25 -24 92 -167 -47 59 63 -2 8 -43 -19 -21 17 -59 -32 -59 0 0 -15 34 15 -17 21
6820B1m7n6O8L6O0k9j08J11J37k43O6n9J9K5QpO4q3j03K06l5L4m0o7l0J03nm3
$$ 21 -26 -82 -14 22 82 53 -55 56 193 -50 16 -43 -24 1 9 2 66 -17 -120 86 51 85 45 -22 -52 51 46 3
6848Cm6J6K3m9O1q2r1L1J15j82J62J37p0p3M65k59n77R80l19k47j16M3k02J64
$$ 3 -43 -27 -4 -53 8 -74 -165 -134 -19 -201 -39 98 28 -45 420 161 -416 564 245 -2 -118 -75 -277 -113
6872a13J40r2k19NK04Q3n6K78K42l49l55L61J63j40k23l7K83j01l66M74j99m0
$$ -113 27 -65 -284 -279 -75 8 -48 230 472 123 -232 129 292 152 -71 -108 175 74 -292 182 -17 -57
6894e7K8m9M1r5M10Nm08J76L36k54l8K07k95L5l36j83M10QQ4q2J61K7k71K57n9
$$ -57 -29 -78 -37 -132 278 283 -125 51 387 133 95 302 7 42 -294 -477 -67 -59 25 -57 104 131 -140 117 58
6919E8j8O3j86m26K97M27j66j51o2M39k20J59k39O5K36l35J17m8N4k31J46J40
$$ 58 40 103 -83 -509 -212 215 49 -102 -164 275 55 214 -25 40 276 -59 58 10 64 -167 -21 119
6941A19j86P8o9R2o1M7qrK0m6Qk1K1QK2JkM6l8qj7N3m9L4j9K1r8M2k6K7M0nk6
$$ 119 -67 11 -58 34 -27 20 12 3 23 -23 -15 -36 -15 -7 15 16 14 60 22 14 -3 50 1 35 16 37 -61 -19 -45 -18 22 17 -9
6974iR1q2K8j7l1o4J50j1O5m28K68K6j12p8J78N1o4M3OKM3qp6J04n5Ok6L6l1r
$$ -9 82 0 28 11 -20 -84 66 55 120 -308 -40 -14 -126 -204 -26 25 -39 4 10 12 55 47 -29 75 20 26 0 36 5 -4
7004dk7pM4J3m7j0L1K7j5m9oO1nq5P4J6M5op8L3JK4k6M8j0Pm4J7Mj3L1m4M5n0
$$ -4 -31 -38 6 19 -28 -38 -7 20 5 -44 -50 11 6 -79 -5 11 56 50 -28 5 6 30 4 52 42 49 5 22 26 13 44 0 45 -5
7038eo8O3LpNk4L4j0j6j7J13r0K4jK1p9L8j3j8lM7j2l3K7K6m9K9k5O0LJ3ok0R
$$ -5 -73 -10 -7 -14 -9 -33 1 -9 -25 -42 71 -19 5 4 25 -54 -16 -29 -47 -50 -3 -15 -48 -21 5 -44 -15 -40 20 23 36 30 10 19
7072A9k2K6j9j4K5p2Q9j6k0M1m4LK2j5l7N9m1J5o1N2J3k8P9r1L5QL3n7%J1j9m
$$ 19 -3 23 4 -10 15 -57 32 16 -4 37 -7 -4 18 3 -34 25 -16 -1 -62 -10 3 -25 54 -37 -2 6 39 -18 -18 -7 -26 -30
7104c0K2m0L8kK1o9M5J5lo3P2%j0N5p3K4qj1O0n5o1P8J0n3K9L5rk1K0Ml2L2l1
$$ -30 -8 -48 -10 -12 9 -60 -15 0 -3 -66 6 6 -4 51 -22 2 -6 -17 43 -12 -73 5 15 -38 -9 26 17 -4 16 20 -12 20 -11
7137a1k3N7pJ5m5K5J6k2l8k2M6n5Q4qm4nQ0n5k6N7k2O7o8KLn1L5L2j7J3m7L2N7
$$ -11 -34 23 16 31 -14 11 27 5 -33 -55 -9 -64 20 12 -32 -37 43 -12 -38 19 -3 64 -4 -2 1 -50 -15 17 0 13 -34 -2 55
7170E5Pn9N0l5m6J0O2j04N7M1o8k3Q3m3L9n0K1L4o1P8rp2k8L2M6j0l0mK6K5j3
$$ 55 62 3 53 18 -28 -18 44 -60 -3 38 -30 -53 30 -13 26 -24 -3 31 -30 48 39 -33 -61 -29 17 7 -23 -27 -1 24 11
7201A1J4l8kJ6j8OL7k7pL1Jm4Kj5L6K6l5L9m2L5m0L6jm3N5J0p7N0%m1Ll5J04m
$$ 11 25 -13 -15 1 -17 -11 26 -1 -8 23 24 -20 -18 -33 3 29 -6 33 -9 26 -14 22 21 -22 33 43 -34 16 16 -25 -22 -57 47 43
7235D3k7k3k3jK9J8l2N6o8Pj7K9j3NL3J3k9L9o4N7K0m7kk5L1J2o0J6N1j4j7m2
$$ 43 16 -7 -30 -31 -2 16 -16 40 -28 -21 -38 -9 -22 -17 16 29 0 39 -25 32 52 5 3 -22 9 21 -39 -23 28 14 -3 -45
7267d5QM6k2O1n6L6pj8J4kj4j5L3Nm1J1K1j8M0n1Lk4J6O2r6L9M8l5l1P1K6q9N5
$$ -45 -37 9 -13 48 -8 28 21 3 17 15 1 -14 19 24 -17 -6 15 -3 37 -14 -11 -35 -19 43 -53 -14 34 -1 -32 39 65 -24 31
7300C1Jq6N7M8r9N2m5P4m0l7J00o0R0p0o6M0J9K1j04pJ18p5j9MJ11k8j2l1R2r0
$$ 31 32 -54 3 51 -48 4 -41 33 -7 -44 56 -4 86 16 -50 -10 9 30 -74 -81 37 -38 -57 -53 58 30 18 -13 79 -11
7330a1K9m9KL1M4n1J2kJ9k4O0l8n2j9M6O2J1j23O5k1l5J21j31L9rK0L1j%rj0m
$$ -11 18 -31 -29 2 46 -5 7 5 24 0 60 22 -30 -49 -3 59 70 -53 12 -9 -44 77 -54 -15 -24 -4 27 26 26 17 7 3
7362CJ2m9PO3l8J1j3k1O0l7o0Q2K9%n0M0m9M3l5j3L0l1M3lk5J9o2O0n3P4l0K2
$$ 3 15 -34 -27 36 -2 9 -4 -25 35 -2 -62 20 49 49 -1 39 -10 33 -2 -15 15 -16 27 24 -1 18 -44 16 -37 37 7 29
7394B9j5k0L0j9kj5P1o4qk5L8MJ0o8L8K1n3P7j7MKJ6j0o5O0j8j3J9n6R0n4l1N2
$$ 29 14 -6 24 5 3 -12 59 -5 -13 -38 0 4 14 -54 -16 5 -48 29 12 16 18 34 24 -41 19 1 -12 7 -49 41 -13 -44 8
7427HJN8m7l6j4L4k5rL7n1Q2o1M6k3j9L7l9M0r4N4J5l0j4J5jj6O0j6Jk8O1m3K0
$$ 8 9 67 20 -16 -30 4 -21 -30 7 -44 38 -23 23 0 -19 18 -21 19 -75 -21 -6 -36 -50 -35 -36 -52 8 -8 -7 -35 26 -17 3
7460Cj4jJ7j7K2k0NM8o0j5P3l5L6q4J04p1J9j8N5m4J6K0m0J0Nl4L8k9J6m4OK6
$$ 3 -11 -12 5 -12 10 -10 -5 43 -17 -32 41 6 42 -42 62 -9 10 -8 47 3 19 39 -1 9 14 -20 18 -11 5 -39 -33 -7
7492gl1j0J0N2n6P1k8RmJ7m8ON3l6J0l9M5m5L1l3K3L2m5N6ll5J3m6L2R8j03l8
$$ -7 -38 -48 -38 14 -42 29 1 10 6 23 -25 -19 34 -2 8 -31 14 -31 0 -33 -10 22 -23 33 30 -5 8 -38 -6 92 -11 -49
7524d9O8K5k1j6j1n5O3k2M0ql5j6M7l1m3Q7l5R6j12K9L6k9j8Nj5l0PM1Pl9L8J5
$$ -49 19 44 23 7 -4 -59 4 -18 22 14 -21 -37 10 -21 -64 23 -12 84 -28 1 37 8 -10 -5 -20 -50 -43 -2 5 -34 4 19
7556A9l9j2J4J3M7j2ko5R9m3n3M8j5Rk7j8P6n4J9k4j4L2j1J2m0M5k3J2k2N6k0
$$ 19 -20 -32 -18 -5 42 30 28 -37 62 19 -34 14 -1 8 -19 -37 39 -15 4 -20 -34 -2 -13 -1 -41 4 -19 -7 -29 27 7
7587Gk0rLj0PL4J8j7oNlJ0o0O9J6j1l4J0mj2L1m4O2q6L9J8l2j6O3jm4L5lm3N5
$$ 7 -13 -22 -19 -29 -22 12 30 13 7 12 9 19 -41 28 44 33 -1 9 5 -7 24 -20 42 -44 -5 13 -19 -35 28 27 -17 18 15 -28 27
7622B7n5P9o1O8r9O6K2k2k8n2N0MpK2j7pJ3m1J4LnP3p1J1J4K1k1M2k1qj3n1O5
$$ 27 -28 51 -10 58 -41 25 47 25 -3 -55 -5 -1 -8 14 -3 -10 3 -38 -24 -21 -26 47 -24 -13 1 22 1 43 22 14 1 -50 15
7655A5j8Jj8L6m2P7j01LO9l0m5L0M9m8P0q5K1NL6oj4jk7J0L0j3Q8q3L0l5n1K8
$$ 15 -3 -2 -20 16 -26 51 -50 -47 22 -8 -53 -23 26 -22 48 -37 -16 -11 25 19 5 4 -23 -13 17 4 92 9 39 4 -47 -19
7687a9LK7k3j6oK1LLpol6L1L0j2jK1j10J02n8JJ5kJ%N0p2M0k0OK0K2k0O5ok3j4
$$ -19 -16 11 -12 -28 -34 -13 -10 -7 -14 -20 -56 -25 5 -7 -8 13 -97 5 -53 -52 -37 -39 -38 -38 12 -60 -20 -40 -34 -14 8 -12 53 47 24 10
7723A0j5j6J02k3p2JL3j7l7Q2pn0K8K5m3j3r1R3J9m8JK4k6JJJ1k9J02J1r9O1l3
$$ 10 -5 -21 81 58 -14 -13 20 3 -34 48 41 -9 19 44 1 -12 -103 -10 9 -39 -38 -14 -40 -39 -38 -27 -56 46 57 -42 19 -14
7755a4p9Q8K1Kl1K5J4l0K2l0Pj2J5rJ9J0m3J2LK1k6k2M1oMrPm8O7j4J6l6rRKO1
$$ -14 -93 -5 16 18 -13 12 26 -4 18 -12 -5 -17 -2 -11 8 18 -25 -13 -10 11 -15 -37 4 -2 2 -7 0 -48 19 5 21 -15 -24 -15 -13 48
7791D8l7l3K6o2O7k6lJ9jjk1L6m9K1lqN2k5k5N2J3k3j2L2m3L2K0j1m2LQ5q2j4
$$ 48 11 -22 4 -58 9 -17 -20 -1 -2 -3 -24 12 -37 -16 -19 -27 25 0 -25 27 40 17 5 37 -6 26 46 35 -7 -4 81 -1 -15
7824a5q3J08j27J50j18J96p5n0N8j24M6rM4k6k56L36n1j88O0R7J26k68J01J91
$$ -15 -98 10 -117 33 -85 111 36 -14 44 -80 -34 -43 1 -25 -281 55 4 -184 -124 -27 99 -169 -68 123
7848A23j12lj30J48l46L38J12k97J09rn3O0L88m37K36j00k28J42K1m4J83o7J68
$$ 123 11 8 -122 26 -320 18 130 -167 -58 -67 -120 -60 328 -109 127 27 -201 -59 -38 -82 101 34 202
7871B02j66J46k93nK75j39q5N1Q3r3j17K25q0k5P4j9Nl4k3l2O6m2P9k6q5M3K3
$$ 202 36 182 -111 -116 159 20 -65 -14 69 -24 -141 84 4 -21 53 34 39 5 -18 -50 16 -26 53 27 -58 -15 8
7898Hk8O0j44J52n3J3M2o5Q1p5M4r5R3kJ4n1j5LL4M7o0l1R2k6m7Ol6N6J5JpN4
$$ 8 -20 40 -104 48 -5 8 50 -15 66 -9 35 -60 33 31 45 -6 -21 -18 16 63 3 -28 64 38 -9 -3 -39 17 32 33 26 80
7930H0p6j6N1m7K8L8k7j8j7L0k7j4J8l2P7k7m2k4kR0qn3L2pNJ0Rj6Jj7QNk9O0
$$ 80 4 -12 39 -8 20 58 31 13 -4 26 -1 -15 3 -29 48 21 -21 -45 -47 43 35 -18 14 7 12 22 31 15 16 -1 7 12 -17 43
7964D3n7L3l6k0L1k3N0p5M2l3K4l3K9K7njK0J8n3k0J9O3q4J0JO2k5K7l6K6l3L2
$$ 43 -14 19 -17 -37 -6 -29 21 -54 -12 -45 -21 -54 -25 2 -3 -4 16 34 -19 -39 -20 43 -41 -31 -30 32 7 34 -2 24 -9 23
7996B3j4K9m2l8N1L8j1o1J3n1O6j5K3o3M1m3N8j4J2NL2o9l5O1N5n1M8j03MR4J5
$$ 23 9 38 -4 -42 9 47 36 -25 -12 -63 3 -12 11 -52 -11 -54 4 -10 2 7 39 -30 -65 -4 51 0 48 -55 -51 43 58
8027E8k3k0Jo2JN8J4l9K9ooL2mp7N7jm9O0k2J9p6nN8%Lk3M4l2J1L3n1k3L3M8n1
$$ 58 35 15 16 -46 -45 13 27 -12 17 11 5 37 33 -44 13 12 -37 23 1 20 -56 -61 -3 -3 0 -23 21 -11 0 33 -18 -41 -8 40 -11
8062a1K7l0J6K0j4n2M9k4nl3P5k2pk6N5o7N4j4MK4k6olk5L1%k8M5p0J12l6j7l2
$$ -11 16 -14 2 22 8 -44 5 -19 -24 -57 18 -4 -11 -37 18 -49 5 -9 -5 19 -7 -13 -16 -41 -10 -10 -38 7 -63 49 13 -4 -36
8095c6N4o5L4J9O8o6K1k8L6k4J3k5j0K2J8L2q5M0PrmJ8o6M4l4M1n5K5m2Q3q5P8
$$ -36 18 -47 -13 6 74 8 29 1 37 13 26 1 -9 13 31 63 -22 18 25 16 12 30 -36 8 -26 15 -40 -15 -57 26 -59 19
8127A9K8p7P1k6m5R8r2j6N1o3M1j1N5l5o5N8N3l9NnKn4P5r2N1J6K5Jj7k7P5m5
$$ 19 47 -30 41 15 -30 68 -24 -40 11 -52 -11 -22 33 -2 -67 -9 44 5 10 5 7 -47 28 -64 -13 3 28 29 12 -15 60 15
8159A5j8j4J7o4J12m2J3j8k7Oql0pP7j5L6l6MK2Pk7K5mo3pj9N0RK2J3j9j
$$ 15 -3 -17 0 -64 48 6 19 1 -26 -20 -28 -58 -65 12 -3 33 -3 1 23 30 3 28 24 -39 -46 -65 -15 -6 16 29 10 9
8191I
$$ Imaginary data points
##PAGE= N=2
##DATA TABLE= (X++(I..I)), XYDATA
0@%%%%%%%%%%%Qj6J6j6J7k5L2m0M8n6O7p6R0j07J25j48J72j97K28k62K97l37L84
$$ 0 0 0 0 0 0 0 0 0 0 0 0 8 -8 8 -8 9 -16 16 -24 24 -32 35 -41 49 -58 67 -81 91 -106 122 -140 157 -180 204
34B04m34M91n53O19o93P73q59R56j061J175j302J439j589J753j931K128k345K583
$$ 204 -230 261 -292 327 -366 407 -452 504 -557 618 -684 755 -834 919 -1012 1116 -1229 1354
52A354k848L142l470L839m255M735n289N938o715P659q841J0368j2422J5361j9949
$$ 1354 -1494 1648 -1822 2017 -2238 2497 -2792 3146 -3569 4090 -4751 5617 -6805 8556 -11393
67a1393K8178m7588J81932J67359j93331j14688j02107k3321m0109j1861l358
$$ -11393 16785 -30803 151129 318488 125157 10469 -91638 -114959 -155068 -166929 -170287
78a70287N7037P5111R3823O2433J9809o4463j03164q5377n549M1557M9035K6967
$$ -170287 -113250 -38139 55684 118117 137926 73463 -29701 -115078 -120627 -79070 -30035 -3068
90c068L9801O4401P0816K3592l3590p4998q5139q7404p2466l6151J9476N4319
$$ -3068 36733 101134 171950 195542 161952 86954 1815 -85589 -158055 -194206 -174730 -120411
102a20411N8810M9119N0900N0397K9795j2583m9283n8682m2213k0977L227L2977
$$ -120411 -61601 -12482 38418 88815 118610 106027 56744 -1938 -44151 -65128 -61901 -28924
114b8924N6574N0661K2750k372j2195k1723m8171q3375q9356m4293K4803P0073
$$ -28924 27650 78311 101061 98689 86494 64771 16600 -66775 -156131 -200424 -175621 -105548
126a05548P6547O2581M7714L5106J8731n945l6532o4198p5689n6972o906M8682
$$ -105548 -29001 33580 81294 116400 135131 129186 92654 28456 -47233 -104205 -111111 -62429
138f2429P1435M9478J0355j0840j0155j2734l4186n9281o0352k9390J8269N8241
$$ -62429 9006 58484 68839 57999 47844 35110 924 -58357 -118709 -148099 -129830 -71589
150g1589P5702O9785M6363J4418j3338k9427l9628n0725n5725m2290j0907K3177
$$ -71589 4113 73898 120261 134679 121341 91914 52286 1561 -54164 -96454 -107361 -84184
162h4184M3912M5673L5521K1250J113k3855m1220m0330k5377p024R072K3849L8749
$$ -84184 -40272 5401 40922 62172 63285 39430 -1790 -42120 -67497 -74521 -65449 -41600 -2851
175b851M9369M6550K5861n461l4921n3701n7320m5678k4458k398J6017L2095M6105
$$ -2851 46518 93068 118929 113468 78547 24846 -32474 -78152 -102610 -105008 -88991 -56896 -10791
188a0791N1242L9293J0296k2079m1055l9792k7222j4623k691J3115L1632M3619
$$ -10791 40451 79744 90040 67961 26906 -12886 -40108 -54731 -57422 -44307 -12675 30944
200C0944M0864K1094q684l5663m9188m7591l4160j5560K369J9122L7130N1458
$$ 30944 71808 92902 84218 48555 -633 -48224 -82384 -97944 -95575 -76453 -39323 12135
212A2135N1709L3078K708k4792l8722l9300l1873k1857p063J1871K8079L4733
$$ 12135 63844 96922 99630 74838 36116 -3184 -35057 -56914 -63977 -52106 -24027 10706
224A0706K9648J6627j097j9081l2305l7026l0933j5569M737K4790L8567M2267
$$ 10706 40354 56981 55884 36803 4498 -32528 -63461 -79030 -74293 -49503 -10936 31331
236C1331L4194J8038N12j4836k8944m0414m3026l1194p535J7325L2298L3026K6205
$$ 31331 65525 83563 84075 69239 40295 -119 -43145 -74339 -81874 -64549 -32251 775 26980
249B6980J7620P112o535k1462l2150l2641k0181J406K2560L4078L3689K5173J3848
$$ 26980 44600 51712 45177 23715 -8435 -41076 -61257 -59851 -37291 -3213 30476 55649 69497
262F9497J964j3275l0822m3433m1066k3434M10J9324K8697L0630K9011K4193J3057
$$ 69497 71461 58186 27364 -16069 -57135 -80569 -80159 -60835 -32138 -1508 27503 51696 64753
275F4753n145k4803l6354l2793j5783N150J8126K0333J8928J9312J8328Q267j1745
$$ 64753 59608 34805 -1549 -34342 -50125 -44975 -26849 -6516 12412 31724 50052 58319 46574
288D6574l2443m1044l2447j2864P515J9658K5080K5280K5210K3953J5552k887
$$ 46574 14131 -26913 -59360 -72224 -64709 -45051 -19971 5309 30519 54472 70024 67137
300F7137k5112l8915l5596j7927J336J3744J6854J7859J8655J6784P419n771j9590
$$ 67137 42025 3110 -32486 -50413 -49077 -35333 -18479 -620 18035 34819 42238 36467 16877
313A6877k8890k9053j7245L28J8674K9663K9669K2470J2498K958o775j7627k6964
$$ 16877 -12013 -41066 -58311 -57983 -39309 -9646 20023 42493 54991 57949 51174 33547 6583
326F583l1202k7154j3112Q015K6397L3331K5150Q976m666r013o743j0284j8390
$$ 6583 -24619 -51773 -64885 -56870 -30473 2858 28008 36984 32318 23305 16562 6278 -12112
339a2112k3904j5287P260K9252L8501K7853M933j1941j7902j5161j2717j7676
$$ -12112 -36016 -51303 -44043 -14791 23710 51563 56496 44555 26653 11492 -1225 -18901
351a8901k3139k0811k038K3976L9872L6586J4385o359j6337j2833p398r777j5648
$$ -18901 -42040 -62851 -64889 -40913 -1041 35545 49930 43571 27234 14401 7003 -2774 -18422
364a8422j7312n008J5183K9769K9503J5081n046j8702k3022j8497j1916q079o048
$$ -18422 -35734 -40742 -25559 4210 33713 48794 43748 25046 2024 -16473 -28389 -36468 -42516
377d2516j363J0565K6056L2782K5106O174j2906k2396k1950j6589r511l134K046
$$ -42516 -43879 -33314 -7258 25524 50630 56804 43898 21502 -448 -17037 -26548 -29682 -27636
390b7636N395J1356J8848K2353J3220o537k5138k9050j7374k152N462O752Q706
$$ -27636 -22241 -10885 7963 30316 43536 36999 11861 -17189 -34563 -36715 -31253 -24501 -15795
403a5795J3757J9490J9848J2724j840j8320k9371k7112j2312L215J0543Q115O446
$$ -15795 -2038 17452 37300 50024 48184 29864 493 -26619 -38931 -35716 -25173 -17058 -10612
416a0612J2682J8767J5020q16j6393k2614j9135r354K78R304J4279J5190J2786
$$ -10612 2070 20837 35857 35041 18648 -3966 -23101 -32455 -32177 -22873 -8594 6596 19382
429A9382J0491P085J78j2065k2983k4002j4970k460O474J1289J5147J7421J4344
$$ 19382 29873 36958 37136 25071 2088 -21914 -36884 -39344 -32870 -21581 -6434 10987 25331
442B5331N362l618q785j1656j4860j5852q890M337J6413J9127J3498O817J899
$$ 25331 30693 27075 18290 6634 -8226 -24078 -32968 -28631 -12218 6909 20407 27224 29123
455B9123l667r859j4773j5716j3562q734J40J2708K1978K1599J0019j577o152
$$ 29123 25456 15597 824 -14892 -28454 -37188 -37048 -24340 -2362 19237 29256 27679 21527
468B1527m984o233j2995j6541j1920J595J3743J7913J5662R075L65o946j0667
$$ 21527 16543 10310 -2685 -19226 -31146 -29551 -15808 2105 17767 26842 27207 20261 9594
481I594j0289r647j1139j1235k193J2009K1848J9572Q633k04m048n331r638j4045
$$ 9594 -695 -10342 -21481 -32716 -34909 -22900 -1052 18520 27153 26949 22901 17570 7932 -6113
495f113j2602o407J152O943J1855J5813J2640M066o710j1630r747r221j0142p806
$$ -6113 -18715 -25122 -23970 -17027 -5172 10641 23281 27347 20637 9007 -740 -9961 -20103 -27909
509b7909N1J0635J5185J3143R635P352N97q896j6378j5048o574j96M89J524Q150
$$ -27909 -27858 -17223 -2038 11105 20740 28092 28689 19793 3415 -11633 -18207 -18403 -17914 -16390 -8240
524h240J3771J3701N550l617r559j1974j3039j0075k324O258R399P496P659J1181
$$ -8240 5531 19232 24782 21165 11606 -368 -13407 -23482 -25806 -19548 -10149 -2653 5006 16187
538A6187J2344L304j1016j7561j4233o345j265K0L482Q559J0944P868L858J697
$$ 16187 28531 31835 20819 3258 -10975 -17320 -18585 -18565 -15083 -6524 4420 12288 16146 17843
552A7843l362j0570j5355j1154q01P042R176O863Q111J0288Q356o55r338j2079
$$ 17843 14481 3911 -11444 -22598 -23399 -16357 -7181 -318 7793 18081 26437 25782 16444 4365
566D365j0171r116p480k088O211J1483J0995O753L512J880l181q933j1500p147
$$ 4365 -5806 -14922 -22402 -24490 -18279 -6796 4199 10952 14464 16344 13163 4230 -7270 -14417
580a4417o67K804L385O749J0403J1241N372l344r323j1000j0589q293l775P42
$$ -14417 -15084 -12280 -8895 -2146 8257 19498 24870 21526 12203 1203 -9386 -17679 -21454 -20712
594b0712M906O204P546R977J0857L897n052j2448j2289n242Q92M516L335J873
$$ -20712 -15806 -9602 -2056 7921 18778 22675 17623 5175 -7114 -12356 -11464 -6948 -3613 -1740
608a740L197O457Q594M442n488j5075j6258r049K035O968P883M874L591O163Q775
$$ -1740 1457 7914 16508 20950 15462 387 -15871 -24920 -22885 -15917 -8034 -3160 431 6594 15369
623A5369Q390J514j0021j7412j4125j958P797Q604J824j271K044N714M909j081
$$ 15369 23759 25273 15252 -2160 -16285 -18243 -10446 -1842 -18 -1289 755 6469 11378 10297
637A0297o317j0956j0561n840L760J2018J3537O727l36Q23L716L393n487j3174
$$ 10297 3980 -6976 -17537 -23377 -19617 -7599 5938 12665 12329 13152 16868 20261 14774 1600
651A600j3123p562o51M066P536R827O564k27n169j604K794O95o997j1364m230
$$ 1600 -11523 -19085 -19736 -15670 -8134 1693 8257 8030 2861 1257 4051 4746 -2251 -13615 -17845
666a7845P421J4604J1259M227j716m695o744n518k988l170p694j1350l895J0866
$$ -17845 -10424 4180 15439 19666 17950 13255 6511 993 -1995 -5165 -12859 -24209 -28104 -17238
680a7238K0178J4042j225r637n417L055M133j531p624p243k203N002J1105J1254
$$ -17238 2940 16982 15757 6120 703 3758 7891 6360 -1264 -8507 -10710 -5708 5397 16651
694A6651M127q024j4996r429J102M313k907r104m341Q289J5959J3164M645j711
$$ 16651 20778 12754 -2242 -11671 -10569 -6256 -9163 -18267 -22608 -14319 1640 14804 19449 17738
708A7738m130n277o691k637o27j441l562k445L765R306O804k104p853o848l806
$$ 17738 13608 8331 1640 -997 -1624 -3065 -6627 -9072 -5307 3999 10803 8699 846 -6002 -9808
723i808k365j740J340N847P140M885M169N560N788Q7q289j2356q672k320J008
$$ -9808 -12173 -13913 -12573 -6726 414 5299 9468 15028 20816 20903 12614 258 -8414 -10734 -9726
738i726Q09O37J973K907L236L446K559j052o744q618l190O170J0599O170m40j613
$$ -9726 -8917 -8280 -6307 -3400 -164 3282 5841 4789 -1955 -10573 -13763 -7593 3006 9176 8736 7123
754G123K979N576J519o430j1919j1638o402M44O019P290L740o51k41M838Q082
$$ 7123 10102 15678 17197 10767 -1152 -12790 -19192 -18748 -12729 -5439 -1699 -2350 -2591 2247 10329
769A0329L413o116j0927o392K711Q229O644J670j639j621j353p94j102l766p985
$$ 10329 13742 7626 -3301 -9693 -6982 1247 7891 9561 7922 6301 4948 4154 3052 -714 -8699
784h699q925m059N458J1018R103L121o64J003K161J342k215m939n187m466j785
$$ -8699 -17624 -21683 -16225 -5207 3896 7017 6353 7356 9517 10859 8644 3705 -1482 -5948 -7733
799g733L328O745N089k40n476n575r72J445q82m351l926R92O050Q541Q061M568
$$ -7733 -4405 2340 7429 7189 1713 -3862 -4834 -3389 -4271 -8622 -12548 -11556 -5506 3035 11096 15664
815A5664o79m984n945k729K00j378n812o639p99O694Q791M477j607m685l882j186
$$ 15664 14985 10001 4056 1327 1527 149 -5663 -12302 -13101 -6407 2384 6861 5254 569 -3313 -4499
831d499R04J670O91j056p99L071P592P265R29o461q899n573j226j39j465k139
$$ -4499 -3595 -1925 -1234 -2290 -3089 -18 7574 14839 15768 9307 408 -5165 -6391 -6530 -7995 -10134
847a0134Q3K795N573O370M570R2m339n365k429J579J950j5j433O90K988L499Q09
$$ -10134 -10051 -7256 -1683 4687 9257 9349 5010 -355 -2784 -1205 745 730 -703 -13 2975 6474 7283
864G283k734m291n036m392k158J517K758K929K357L825M706M488J19l480m172
$$ 7283 4549 258 -4778 -9170 -11328 -9811 -7053 -4124 -1767 2058 6764 11252 11371 7891 3719
879C719l033k168j874j218P16J846J924Q77P91k35j886l515k798L09J674J262
$$ 3719 686 -1482 -3356 -4574 -3858 -2012 -88 789 1580 1345 -541 -4056 -6854 -6545 -4871 -3609
895c609J866K540N016N324J521k745m277l598l431l140k014p57M35N82J896L445
$$ -3609 -1743 797 5813 11137 12658 9913 5636 2038 -1393 -4533 -6547 -7304 -6869 -6287 -4391 -946
911i46M143J660l012m211j706K084K945M49l98J465K856K552J160j098l369n711
$$ -946 3197 4857 1845 -2366 -4072 -1988 957 1406 1008 2473 5329 7881 9041 7943 4574 -1137
927a137o006l307N98L469J221l14M37L959N736L300n23l764l521j235L41J564
$$ -1137 -7143 -10450 -9852 -6383 -5162 -5476 -5039 -1080 4656 7956 7433 3669 148 -1087 -746 818
943H18K135R24o41j433k50J395p8l185o431m781J39M095M281K634J923J613K332
$$ 818 2953 3877 3236 1803 1553 2948 2870 -315 -6746 -11527 -11388 -7293 -3012 -378 1545 3158 5490
960E490J422P72p19k632m472l810q60K984L450R07j772k218j16Q27m41k176k552
$$ 5490 6912 7684 6965 4333 -139 -3949 -4809 -1825 1625 2532 760 -1458 -1574 -747 -1188 -3364 -5916
977e916r93Q82K617M327M843K848p21k720j625j04j79l219m525k978R86K957L414
$$ -5916 -6909 -6027 -3410 917 5760 8608 7887 5167 3542 3438 3259 40 -4485 -7463 -6477 -3520 -106
994a06J231No78j547n83k45J264l44j379n33K469M957L461J10l538l242j357j260
$$ -106 1125 1130 452 -1095 -1678 -1923 -659 -1003 -2382 -2915 -446 4511 7972 8082 4544 1302 -55 -1315
1012a315r58k019j319m94P56K914M126K323J17k502k767l23J393O60j167p79Q16
$$ -1315 -2273 -4292 -5611 -6105 -5349 -2435 1691 4014 4131 1629 -1138 -1461 -68 592 -575 -1354 -538
1029e38K580K090O32j009j975k270k888j745r5J192J104P06R72K895K907O56j549
$$ -538 2042 4132 4764 3755 1780 -490 -3378 -5123 -5218 -4026 -2922 -2216 -1244 1651 4558 5214 3665
1046C665k041j449q78j030r27J231J485J008l36L02J059N60j921l460k288K09
$$ 3665 1624 175 -703 -1733 -2660 -1429 56 1064 728 1030 2089 2649 728 -2732 -5020 -4811
1062d811K231J901M65N05J394J765N66j18p61k445l808k359J801L541J963j499
$$ -4811 -2580 -679 -214 291 1685 3450 4016 3898 3137 692 -3116 -5475 -3674 -133 1830 331
1078C31k562R73L742K956j780m598l654n93J932L108K095J125j380k332M9L265
$$ 331 -2231 -1258 2484 5440 3660 -938 -4592 -5185 -3253 -145 1950 3075 1695 -637 -588 2677
1094B677K648k211o093m901K094N072L575n32j802j95J163Q04l07k07j475l239
$$ 2677 5325 3114 -2979 -7880 -5786 -714 2861 2329 527 332 1495 2299 1992 1785 310 -2929
1110b929k275K25M337M493n21k866j699K390J549j450l158j437J023J552j09O99
$$ -2929 -5204 -4979 -642 3851 3330 464 -1235 1155 2704 1254 -1904 -3341 -2318 -766 -875 -176
1126a76K913J981j080l588r86Q06J153k785l411K45L743K624j90q62J512J303
$$ -176 2737 4718 3638 50 -936 -130 1023 -1762 -5173 -4928 -1185 1439 1249 387 1899 3202
1142C202j281k795l15J972L8k223k500K868M562J960l601l664k96J161M48k635
$$ 3202 1921 -874 -1189 783 821 -1402 -3902 -1034 3528 5488 1887 -1777 -2073 -912 -464 -3099
1158c099o26J718O80R1R06L673K930j605m750k672J715K936p06k884j436J897
$$ -3099 -3725 -2007 -1327 -1236 -330 3343 6273 4668 -82 -2754 -1039 1897 1191 -1693 -3129 -1232
1174a232K363j22l50N9M78k136k888n54K431K526L85j483J178J870J496j060j786
$$ -1232 1131 1009 659 718 1196 -940 -3828 -4382 -1951 575 960 -523 655 2525 4021 2961 1175
1191A175l56j2j881k535j83K657K038K46j154r37Q12M23k86p52L81q6p76m75K217
$$ 1175 819 807 -1074 -3609 -3792 -1135 903 1149 -5 -942 -130 293 7 -745 -364 -450 -1226 -1701 516
1210E16L084J550j932k929j422N43M61q93j153q52l6Q45J566K624R56r60k149
$$ 516 3600 5150 3218 289 -1133 -590 -129 -1022 -2175 -3027 -3063 -2218 -652 1972 2928 1968 -181
1227a81j166R14J619j26j280r74R67J853J038m20j332j433j161l32K35J89n01
$$ -181 -1347 -433 1186 1060 -220 -1194 -227 1626 2664 2244 912 -521 -1682 -2014 -1779 -1590 -2091
1244b091n80P75K504K348N09j601j639l32P81M30p15j301p92L89J403J512N14
$$ -2091 -2671 -1896 608 2956 3465 1864 225 -107 674 1104 389 -912 -1704 -1315 88 1600 2114
1261B114j147k065j352L08J291N25n35n39O60J722J577M85m18r32j192j268o60
$$ 2114 967 -1098 -2450 -2142 -851 -326 -861 -1400 -740 982 2559 3044 2626 1694 502 -766 -1426
1278a426n2M04K22J6K0M19O40M70P8k73o89j016m79N74J704J603J9j216q39L91
$$ -1426 -1478 -1074 -852 -836 -816 -397 243 713 791 518 -171 -1187 -1666 -1092 612 2215 2234 1018 179 570
1298E70J056j96j852k293r18R12J853J444K92o86n23N65J509R44q23k487j809
$$ 570 1626 1430 -422 -2715 -3633 -2721 -868 576 868 182 -341 224 1733 2677 1854 -633 -2442
1315b442N48K484J836n19k063j330N87J532M12j169k135j162N11J952K385J099
$$ -2442 -1894 590 2426 1907 -156 -1486 -899 633 1045 -124 -2259 -3421 -2910 -958 1427 2526
1331B526n88j444l70J277J441m77k299k147k73J101J281L46j18n30n55o27J17
$$ 2526 1938 494 124 1401 2842 2365 66 -2081 -2354 -1253 28 374 256 -274 -829 -1456 -1339
1348a339Q05Q24k77r98l12J293K056J249L2r91j429j376q38M88R19l55k080j904
$$ -1339 -534 290 13 -985 -1297 -4 2052 3301 3333 2342 913 -463 -1301 -813 106 -249 -2329 -4233
1366d233Q02L234K665l04k535j827L54K470J915O78j607j873n32J075K974J280
$$ -4233 -3431 -197 2468 2164 -371 -2198 -1844 626 2541 3219 1612 -261 -793 282 3256 4536
1382D536k486m697k603J253L371J573j792k556o44K632L490J656p3k092k272o42
$$ 4536 2050 -2647 -5250 -3997 -626 947 -845 -3401 -4045 -1413 2077 3733 3660 1568 -704 -1346
1398a346K092K429N11k131l372p13K179K158q8k924k914n74J110K245J542N48
$$ -1346 746 3175 3686 1555 -1817 -2530 -351 1807 1719 -1205 -4119 -4693 -3583 -1338 204 752
1414G52j40o89J82J871K214L77j629l233j048R68J381J88j418j337q70P3O58R57
$$ 752 612 -77 105 1976 4190 4567 2938 -295 -1343 -375 1006 1194 -224 -1561 -2431 -2358 -1700 -743
1432g43J23p56j443j9K040L087J455o74j396m83Q73R96m02j752k372j415LJ038
$$ -743 -620 -1376 -2819 -2838 -798 2289 3744 3070 1674 1191 2064 3060 2658 906 -1466 -2881 -2878 -1840
1450a840J030Q2q03r41J43J390J474M85n85q20M26J747J584L44r14j381q61k58
$$ -1840 -810 -728 -1531 -2472 -2329 -939 535 1020 435 -385 41 1788 3372 3716 2802 1421 560 302
1468C02k70q62j079r29l09K38R02J123O97J28j51L39J027P65n8n19l2M96L44m64
$$ 302 32 -830 -1909 -2838 -3147 -2909 -2007 -884 -187 -59 -210 129 1156 1921 1863 1344 1312 1808 2152 1688
1488A688p46o41m81p17j084p48j17K56K77L42R25J311Q86K97N3L88N41j01p88
$$ 1688 942 301 -180 -897 -1981 -2729 -2846 -2590 -2313 -1971 -1046 265 1151 1448 1501 1889 2430 2329 1541
1507A541q79l2K18k39q67p04k39k31m53m38J34M79K28J68O88J429J382L59m31
$$ 1541 662 630 848 609 -258 -962 -1201 -1432 -1885 -2323 -2189 -1710 -1482 -1314 -626 803 2185 2544 2113
1526B113k80K27J11o77j234p49k61k05m65j13K93J54l53m41K20Q91Q31J66p9O01
$$ 2113 1833 2060 2171 1494 260 -489 -750 -955 -1420 -1533 -1240 -1086 -1439 -1880 -1660 -769 62 228 149 750
1546G50J122P65n9m63l81m64r17q24n60j56k88p49k38O30R65N34r5j45N41P95
$$ 750 1872 2637 2578 2115 1734 1270 353 -471 -1031 -1187 -1475 -2224 -2462 -1832 -867 -333 -428 -573 -32 763
1566G63M12J8Q9L77J37j83l23j66m10r09j142o27Q5J35j90j62M95J021R35K48
$$ 763 1175 1193 1282 1659 1796 1613 1290 1124 714 -195 -1337 -1964 -1879 -1744 -1934 -2096 -1601 -580 355 603
1586F03J47N39M26j15m41j65K00J2m75o44l41ml63o40n60o3K00nJ97P11J257O96
$$ 603 750 1289 1715 1600 1159 994 1194 1206 731 87 -254 -258 -621 -1261 -1821 -1884 -1684 -1689 -1492 -781 476 1172
1608A172j52o9N47Q41Q2j024j229m29K46J12k86m53n51n81j22N26Q18L52o88p15
$$ 1172 1020 951 1498 2339 2421 1397 168 -261 -15 97 -189 -642 -1193 -1774 -1896 -1370 -552 -200 -888 -1603
1628a603N50J915J649Q0j194q50M43Q63J43r30j545j201l99L81Q43O25m57j169
$$ -1603 -1053 862 2511 2591 1397 547 990 1853 1996 1066 -479 -1680 -2079 -1698 -855 -230 -687 -1856
1646a856l92J092J918P59o58j119l7J252J186L19o41r22o95m26q6K7k36q27q89
$$ -1856 -2248 -1156 762 1521 863 -256 -293 959 2145 2464 1823 901 206 -220 -306 -279 -515 -1342 -2231
1665b231k95Q26J270Q21j41m28q4N74P99M24P0m02o24l96K37N60J89o83j399j156
$$ -2231 -2526 -1700 -430 391 250 -178 -262 312 1111 1535 1605 1203 579 183 420 980 1169 486 -913 -2069
1685b069m7R42R58j31r54o23P15J759J516N5j018j114j07Q08R76J44j033j704
$$ -2069 -2116 -1174 -216 -347 -1301 -1924 -1209 550 2066 2121 1103 -11 -118 690 1666 1810 777 -927
1703i27q81O19J552Q43j116k121r41J196K102R87p87j164l4J033J182N18k45r56
$$ -927 -1808 -1189 363 1206 90 -2031 -2972 -1776 326 1313 526 -638 -672 361 1543 2061 1816 860
1721H60j212p69N96J150K21j225j433Q2J389J122m08r53l16O43N58m3J1M36L06
$$ 860 -352 -1121 -525 625 846 -379 -1812 -1730 -341 781 373 -580 -896 -253 305 262 273 709 1015
1740A015l88n16Q1M69k1r68p55K39O08n0n38n8R19P31l38p31J49Q98K53o23p75
$$ 1015 627 111 192 661 640 -328 -1083 -844 -236 -286 -824 -882 37 768 430 -301 -152 746 999 376 -399
1761c99K79O83K4p11m38L71K11l85n38J17N55Q7l68j3Q98R22j23q65k78O32M74
$$ -399 -120 563 587 -124 -562 -191 20 -365 -903 -786 -231 -144 -512 -525 373 1295 1172 307 29 661 1135
1782A135m53j119m24L31K76k57j91K60J12k49k59M61Q33K80n62l91M54R76L52
$$ 1135 682 -437 -861 -530 -254 -511 -702 -442 -330 -579 -838 -377 456 736 174 -217 237 1213 1565
1801A565n54p45r4O4k96n26k50K9M4k23j29M86O27J04k77R2O17M60j37l79K6M66
$$ 1565 1011 266 172 236 -60 -586 -836 -807 -763 -986 -1115 -629 -2 102 -175 -83 534 994 857 478 504 970
1823I70J69l99n54k81Oj42n22l76k8O7M6K13L95N37K66J1J05M71L98k31n19k35
$$ 970 1139 740 186 -95 -89 -231 -753 -1129 -1157 -1090 -1044 -831 -436 101 367 378 483 954 1352 1121 602 367
1845C67K20J37l46p03l67M1M7j89k40j13P1K30M42N42N83M2k28j9N03N58j06q93
$$ 367 587 724 378 -325 -692 -651 -604 -793 -1033 -1146 -1075 -845 -403 139 722 764 536 517 1020 1578 1472 579
1867E79r20j49L99K05l81m77l94pK26M19K89J29k56j32M13Q86N61k30n18j94J83
$$ 579 -341 -490 -91 114 -267 -744 -1138 -1145 -919 -500 -211 -82 -338 -470 -57 829 1390 1160 642 448 631
1888F31J80l81n16m15j85r3j32K5K47K12L9m3K56L30K86N6M1K03R2j99k54N0K60
$$ 631 811 430 -86 -501 -686 -779 -911 -886 -639 -427 -388 -431 -175 155 441 497 538 741 833 634 380 430 690
1911F90q8p80p58j09L56L72j23l52r5K31N01O23M79j02m65m74L08P86M34o15j100
$$ 690 602 -178 -936 -1045 -689 -317 -440 -792 -887 -656 -155 468 947 845 380 -94 214 1000 1434 819 -281
1932b81o30L49P21J85m89p39m44O5N74R14N55l30p21k73Q11J223K45q74j087l40
$$ -281 -911 -562 159 344 -145 -884 -1328 -1263 -689 225 780 450 -271 -544 267 1490 1735 861 -226 -566
1952e66M05M25J02l24m76n81k65L99J053M43n73r74j42J001J197K60o40n48j32
$$ -566 -161 264 366 42 -434 -1015 -1280 -881 172 615 42 -932 -1074 -73 1124 1384 744 196 64
1971F4K20J92J34j7m71r77o81O07J101L95o90j044O7R59Q77K3l03k93j53K2L06
$$ 64 284 476 610 593 122 -855 -1536 -929 172 567 -123 -1167 -1100 -141 736 759 456 163 10 32 338
1992C38N79L20o03j224o80P39J050Q8j148r41J14R48Q07J62k02l26l65K5O42R21
$$ 338 917 1237 634 -590 -1270 -531 519 607 -541 -1482 -1368 -420 387 549 347 21 -344 -319 323 1244
2012A244K24j068j300j23J127J087k65j387r60K72R18O18L8m65n06l12N16Q78
$$ 1244 1468 400 -900 -1023 104 1191 926 -461 -1421 -1149 -231 387 425 -40 -546 -858 -342 536
2030E36P95j57j204q59M02J178M84o26j199l34N14O94J16l28l65j99o8K30N08
$$ 536 1331 1174 -30 -889 -487 691 1175 549 -650 -984 -470 224 340 12 -353 -552 -620 -390 118
2049A18M01j64n26j54M09O52J16m92n67m1J79J13j05j22J10j17k54n1L14N61K2
$$ 118 519 355 -171 -325 84 736 852 360 -207 -248 -69 44 -61 -183 -73 -190 -444 -495 -181 380 402
2070D02m54m12J06N24M33m0l61k29r9J18K98J46j89n31m75Q4O33N91k79p02m06
$$ 402 -52 -464 -358 166 599 559 198 -31 -130 -12 286 432 243 -288 -763 -679 -46 545 266 -436 -842
2091h42M58P33L13k53o67k58K73M75L49p5l44m14j23L93M75On86n59l8O02L72
$$ -842 -384 349 662 409 -258 -516 -243 232 581 506 162 -252 -375 18 493 499 -87 -646 -684 -82 290
2112B90j33l35k14J76K56M6R0m3j7j35n8J15K42J57k35j76j87J07K2l0l6M0j22
$$ 290 157 -178 -392 -216 40 86 176 133 116 -19 -77 38 280 437 202 26 -161 -54 -32 -62 -98 -58 -180
2135a80k15p2L58L98P4l92l29J22N30L07j68m86k05K76L25J57j58l02l87r6J60
$$ -180 -395 -467 -109 289 363 -29 -358 -236 294 601 433 -53 -258 18 343 500 342 40 -347 -443 -283
2156b83L67N7l73m74J10N52N41n6m98k19L24M48L2l04k16nJ71k1m4r8j51j61j30
$$ -283 84 141 -232 -706 -596 -44 497 441 -57 -276 48 496 528 224 8 3 174 153 109 11 -140 -301 -431
2179d31J76J66k7l50l4M70M39km18j97L58N15nm42m79J75K67L3j20k52j19o0p4
$$ -431 -255 -89 -116 -466 -500 -30 409 407 -11 -208 150 665 660 218 -261 -86 181 214 94 -158 -277 -337 -411
2202d11J12L07J5j94k30J58M87L25k58l14J65K44rl75k22J29L31k07m96k55M43
$$ -411 -299 8 23 -171 -401 -243 244 569 311 -3 162 406 397 22 -200 -71 260 53 -443 -698 -255
2223b55M48M1l40l36Q3K80K38K86J09l21n46q2N54Q74j60j025r69L02R71O48l71
$$ -255 193 234 -106 -442 -359 -79 159 445 554 233 -313 -395 159 1033 873 -152 -1121 -819 152 800 429
2244D29j016m09L98P21N62l1n61n19j51O09P73L06p57j028j67P93Q51j24r67n96
$$ 429 -587 -996 -598 123 685 654 93 -426 -577 32 805 1111 354 -674 -841 -48 803 679 -288 -884
2264h84R7O48M88o6k44l08m6K30M62L00j38n07k93P2M58J32k67k78j95K7O7m9
$$ -884 -787 -139 349 283 39 -269 -315 -85 377 677 539 32 -261 -189 269 401 134 -144 -339 -312 -245 -294
2286b94K00J21n1k92j18K77M86L56k10m05l07J39L72L57j02n03o17j90M89O33
$$ -294 -94 27 -24 -316 -434 -157 329 685 475 70 -237 -98 274 631 529 26 -591 -781 -292 341
2306C41J63o21p35j47O68P90K74m77o43r1M14P48L53l16p86m83K16O78L61n12
$$ 341 504 -117 -852 -999 -331 459 733 256 -387 -478 -64 684 1037 721 -65 -548 -332 346 707 195
2326A95p18l78L20O02K50j72l87j89K58L12L78P4k99l50O8K73K99j35l38k44n5
$$ 195 -523 -901 -581 21 271 99 -288 -477 -219 93 471 545 246 -104 -36 237 536 401 63 -181 -236
2347b36J54k2p3n5l2JK0R1J20J81lj92n3J46K11P4J7j23j91p1j3J89J31j70l39
$$ -236 -82 -104 -177 -232 -264 -263 -243 -152 -32 149 146 -46 -99 47 258 332 349 226 35 -36 -49 140 271 101 -238
2372b38k96L2L96L18j12m02n8K56K34L38k46j97j09P5N9L48J48l41l45j44K97
$$ -238 -534 -502 -106 212 100 -302 -360 -104 130 468 222 25 -84 -9 50 398 546 205 -140 -284 13
2393A3K52j1l58m26L07j8L11K28l02k11J34K53j6J39K97n93k98m4L80J89l4k47
$$ 13 265 254 -104 -530 -223 -241 70 298 -4 -215 -81 172 156 295 592 -1 -299 -343 37 226 192 -55
2415e5K75k89j83L81k88M08m85k2j51O13l4J52n85j7l9N54M29o06j35k49K70K97
$$ -55 220 -69 -252 129 -159 249 -236 -258 -409 204 170 322 -263 -280 -319 235 664 58 -77 -326 -56 241
2437B41J09k6n87k63K04L08J14j12R9l07l11J64O83j30l90K24j93M15jj67K15
$$ 241 350 324 -263 -526 -322 -14 100 -12 87 -220 -531 -367 316 186 -204 20 -173 242 241 74 289
2458B89l40L49j87l45L2p9N28n34K22Q1j89j31p3r3P23m7l42k05J04R41n03N0
$$ 289 -51 298 111 -234 -202 -281 247 -287 -65 16 -173 -304 -377 -470 253 206 -136 -341 -237 704 201 251
2480B51k92K69K76k48l60l17M58L01n27K02k33j34O1J3J75K08o0k44M5K06L95
$$ 251 -41 228 504 256 -104 -421 37 338 -189 13 -220 -354 -293 -280 -105 103 43 -201 -156 50 445
2501D45K0j46m74K00K64O8k53j87j48N4j7J11M7l48m3N9K05J58N5J53k08J03R3
$$ 445 465 319 -155 45 309 377 124 -63 -211 -157 -174 -63 -16 -364 -407 -348 -143 15 70 223 15 118 211
2524B11O86l14n53k83O37J87l48l95j19M9J34K00l9k47j91R9K38K53n4j00j13
$$ 211 897 583 30 -253 384 571 223 -172 -291 -242 -108 92 53 -194 -385 -286 -48 205 151 51 -62
2545f2O2J48J84Nj43l02p3R9K13k9k32j94j6K09K61j92k52n0J39L33K45j69j91
$$ -62 0 148 332 337 194 -108 -181 -82 131 102 -130 -324 -340 -131 130 -62 -314 -364 -225 108 353 184 -7
2568gJ73k12M5L5J44J0j95k33J07J25kr2k4R2N5l9n2N4J91L2k48r6O7J56J43k52
$$ -7 166 -46 -1 34 178 188 -7 -240 -133 -8 -10 -102 -126 -34 21 -18 -70 -16 175 207 -41 -137 -70 86 229 -23
2594b3j24K9Q6J02r6J9P7j16j21M6K71O8j20k45l3K16K11j6j32k18J8K1L33j68
$$ -23 -147 -118 -32 70 -26 -7 70 -46 -167 -121 150 218 98 -147 -180 36 247 231 99 -119 -101 -80 253 85
2618H5N4k71k42L04l2M07m2k77l4J98J2J06m98R5j85K74k40J40j40L49km30K34
$$ 85 139 -132 -374 -70 -102 305 263 -14 -48 150 162 268 -230 -135 -320 -46 -286 -146 -286 63 61 -369 -135
2641a35N6K18l0r8j06J03K01K3r8j30k8J9l%N1p7j08o2NJ74J24q8j55k8J50K31
$$ -135 -79 139 109 11 -95 8 209 232 134 4 -24 -5 -8 -8 43 -34 -142 -204 -199 -25 99 11 -144 -172 -22 209
2667B09K2j18n6m2N0kL0L8o2k39o6N2J45P6o6k25M4J26J93K0pm2l5j7P2P5J23
$$ 209 231 113 57 15 65 63 93 131 69 -170 -236 -184 -39 37 -29 -254 -210 -84 109 129 122 80 45 28 100 175 298
2694B98j24k72j06N8J51M9j81j39M2J53R6K5J36j06o9j30K12J63R5l03j36j69
$$ 298 174 -98 -204 -146 5 54 -127 -266 -224 -71 25 50 186 80 11 -119 93 256 351 48 -88 -257
2716b57J66K10O6k44k79J3q3L86K89m8k35j48l4K42K13J51k01Q2n18J72L66M4
$$ -257 -91 119 185 -59 -338 -325 -408 -22 267 219 -16 -164 -198 44 257 408 207 289 -229 -57 309 353
2738C53m25r7K85l95J86Q6j92J59J09j10J89K96n9o08J22M34k0L7k15j78l84J15
$$ 353 -72 -169 116 -279 -93 -7 -199 -40 69 -41 148 444 385 -223 -101 333 313 350 135 -43 -427 -312
2760c12J01n2J01j18O2p9J01p4M05L0q4j15M8K54n0J26k19m9j26O9l9p0j7r9j28
$$ -312 -211 -263 -162 -280 -218 -297 -196 -270 135 165 81 -34 14 268 218 344 125 76 -50 19 -20 -90 -107 -206 -334
2785c34J45r5K77P4j12p4J47J82n3N3k6j4p3ln3mo6o5N7o1r1l4M3n5J19R2N6k7
$$ -334 -189 -284 -7 67 -45 -119 28 210 157 210 184 170 97 94 41 37 -29 -94 -37 -98 -189 -223 -180 -235 -116 -24 32 5
2813EMP9J23K6q9q7m3J36M1p1j19j60L1o4Lj9R3lJ3J0R8O9J34k1m0m7Q0lm2o9
$$ 5 9 88 211 237 148 61 18 154 195 124 5 -155 -124 -188 -185 -204 -111 -114 -101 -91 7 76 210 189 149 102 182 179 137 68
2843F8Q4j44j56l5P6J30o5j84j52J78J84J12N6q2p0RJ32J80Rj42k16j53O8J72
$$ 68 152 8 -148 -183 -107 23 -42 -226 -378 -200 -16 96 152 70 0 9 141 321 330 188 -28 -181 -113 59
2867E9O0j32l48k4J58K84K0j34p6JJ60J57J03p5j43p7pK13P0j63j77j58N1J58
$$ 59 119 -13 -361 -385 -227 57 77 -57 -133 -132 28 185 288 213 70 -7 -14 199 269 106 -71 -229 -178 -20
2891b0L4j36m8l5J36n6J29p6J69r5K46j67o2J85j18l6Lk9p0l4P0m5J1o8j76M1
$$ -20 14 -122 -170 -205 -69 -125 4 -72 97 2 248 81 19 204 86 50 53 24 -46 -80 -10 -55 -44 -112 -288 -247
2917b47K95O6M9k46k1K00Q9J76K1l12P9l08q3M71M5n42K8k06K78K16Q0k54j93
$$ -247 48 114 163 -83 -104 96 185 361 382 70 149 -159 -242 229 274 -268 -240 -446 -168 48 128 -126 -319
2940c19J81J26K68o6j00k19LR6K71O4k66k18j23J41K34Mk12k21J04J70m2K46q9
$$ -319 -138 -12 256 190 90 -129 -126 -30 241 305 39 -179 -302 -161 73 77 -135 -356 -252 -82 -124 122 33
2963C3j8J34j53K43L2Nj54j20J8J22q2J0r5o2r0MK0K6O1Oj5k8P9J16J63kp7k19
$$ 33 15 149 -4 239 271 276 122 2 20 142 60 70 -25 -87 -177 -173 -153 -127 -66 -60 -75 -103 -24 92 255 253 176 -43
2991d3nJ70J32k0j81k53p8J6K01J60r2k84q0J65L65R2j81O4k57J16K60J04j76
$$ -43 -48 122 254 234 53 -200 -278 -262 -61 99 7 -277 -357 -192 173 265 84 148 -109 7 267 371 195
3014A95j45j71M5Q3R6r3j70j26m7K22K07p0j65m1J85J70O3Jj87M2L7K0ML0j55
$$ 195 50 -121 -76 7 103 10 -160 -286 -333 -111 96 26 -139 -180 5 175 238 239 52 94 131 151 155 185 30
3039C0k19q0J37J35%j55j21P0K12J00n6l8R3K6j4jM5R1o3k29j62O7O9kj22k1J9
$$ 30 -189 -269 -132 3 3 -152 -273 -203 9 109 53 15 108 134 120 119 164 255 192 -37 -199 -132 -63 -65 -187 -208 -189
3066a89P9m9O5J26J69r6j39k8K15J50j4k88q0J12J07q9j05Ol1r0k6K9J46R8m0
$$ -189 -110 -159 -94 32 201 105 -34 -62 153 303 289 1 -79 33 140 51 -54 -48 -79 -169 -195 -166 -20 78 38
3091C8n8M2P6Q7L1j42Q0J6O3j74j53J6K7m9q0K7qN3n9q8K23J58om8n5J39L0N2
$$ 38 -20 22 98 185 216 74 154 170 233 59 -94 -78 -51 -100 -180 -153 -161 -108 -167 -255 -32 126 120 72 17 156 186 238
3119B38j07m2k0r1p6K6L7j2j71j00K8J88J70k01M1q2K00J95Q8r6j92R2q7Kk9M7
$$ 238 131 89 69 -22 -98 -72 -35 -47 -218 -318 -290 -102 68 -133 -92 -174 26 221 309 213 21 113 26 28 -1 46
3145D6n4j04k8lJ06o2K0l9L1J13M2rK6MJ15j68O6m4p2J67j07qj55l8P5k92J07
$$ 46 -8 -112 -140 -143 -37 -99 -79 -118 -87 26 68 59 85 89 204 36 102 58 -14 153 46 38 -117 -155 -80 -372 -265
3172b65K07j07J88k06K94L8j69q3L77j83K6K5j39K8j99O4J25k22P3j46Q7J03L34
$$ -265 -58 -165 23 -183 111 149 -20 -103 274 91 117 142 3 31 -168 -104 21 -201 -128 -274 -187 -84 250
3195B50k69l10N53k85L57j73J94j10k19j33K08k25L58k79j05j29J32L74j02l88
$$ 250 -19 -329 224 -61 296 123 317 207 -12 -145 63 -162 196 -83 -188 -317 -185 189 87 -301
3215c01J8M6K68P0Q3K0k17K27k19J17K76l39j10j27r6K02k20K82m9k65O8K20J93
$$ -301 -283 -237 31 101 184 204 -13 214 -5 112 388 49 -61 -188 -284 -82 -302 -20 -69 -334 -266 -46 147
3238A47P6l02J77O5k46M74q0j45l69K99k30l7k9J34n1j68J62j65K66n8J2J61m6
$$ 147 223 -79 98 163 -83 391 311 166 -203 96 -134 -171 -200 -66 -117 -285 -123 -288 -22 -80 -68 93 47
3261D7J0j3J44j18J79j09m0K2K4j85J90l58P9n8K59j4m8k73N5r1L56o9o1J48O5
$$ 47 57 44 188 70 249 140 100 122 146 -39 151 -207 -128 -186 73 59 11 -262 -207 -298 58 -11 -72 76 141
3286A41r5q5%L67l40K2j08K11l51k2J61q7K05k47P1o5K6J63J77k54J60k59N93
$$ 141 46 -39 -39 328 -12 10 -98 113 -238 -260 -99 -186 19 -228 -157 -222 -196 -33 144 -110 50 -209 384
3309C84k99Q6jJ5l42J49KJ29l95J41j86J7j00L46O0K16J03m24K71P8J2p7j9l85
$$ 384 85 171 170 185 -157 -8 -6 123 -272 -131 -317 -300 -400 -54 6 222 325 -99 172 250 262 185 166 -219
3333b19J89J05Q4k33j3j47l21M64j27J64R8r7r3J23N2R3P2J09j24j44M2j26K9
$$ -219 -30 75 159 -74 -87 -234 -555 -91 -218 -54 44 -53 -146 -23 29 122 194 303 179 35 77 -49 -20
3356b0k6j7p7L6N2m5m4N9M1M0J11r4J8L6n2P6k3jjp9k2Q1o3j4m5M2l1N5L4m5L2
$$ -20 -46 -63 -140 -104 -52 -97 -141 -82 -41 -1 110 16 34 70 18 94 71 70 69 -10 -32 49 -14 -28 -73 -31 -62 -7 27 -18 14
3387A4Nj6O1K0k4mk3kJ0Jj7n2n7K8L1rqMoJ08p2P7o2L7m4L4oK3k9n1l7K8Pk3k3
$$ 14 19 3 64 84 60 56 33 31 41 42 25 -27 -84 -56 -25 -34 -42 -38 -44 64 -8 69 7 44 0 34 28 51 22 -29 -66 -38 -31 -54 -77
3422g7JK2L1M3k1Q5q6P8Lj7N7l6m7p6M4o8L6l2o0J06j9L3j9L0j0NK4KQN2L3o8
$$ -77 -76 -54 -23 20 -1 84 -2 76 79 62 119 83 36 -40 4 -64 -28 -60 -120 -14 -33 0 -19 11 1 6 30 32 40 92 125 57
3454E7o3L4J9q8p0k5N4Ll5J8M1L3j8N9J1Q1ro7M0P3l3o2l3j18J13J5p1m5n8N8
$$ 57 -6 28 47 -41 -111 -136 -82 -79 -114 -96 -55 -22 -40 19 30 111 102 35 75 148 115 53 20 -98 15 30 -41 -86 -144 -86
3484h6L1j4OkO1rJ36m2qk7M6m4M8K0q7p3Jj1K5O1q9q7QJ18M5pomQJ70m0j5r6k7
$$ -86 -55 -69 -63 -65 -4 -13 123 81 73 46 92 48 96 116 29 -44 -43 -54 -29 32 -57 -144 -136 -18 27 20 14 10 18 188 148 133 37 10
3518A0N4n0L3l0j04j5J2Q9L2q5l0q2J67N9M6m3k8J0M2Kk7j8m0Oq7K7M0l5q3J1
$$ 10 64 14 47 17 -87 -102 -90 -1 31 -54 -84 -166 1 60 106 63 35 45 87 89 62 44 4 10 -77 -50 -10 -45 -128 -117
3548a17R5M4n0K4oJ8J74Jj59l9K7Q8J9p8n2j21L1L8L3on1m9K9Q6J33Pr9k8N0J38
$$ -117 -22 22 -28 -4 -10 8 182 183 24 -15 12 100 119 41 -11 -132 -101 -63 -30 -36 -87 -136 -107 -21 112 119 20 -8 42 180
3578A80K4k8k04n7L5N5Km7m7j1j7J4Q9J7m2k1K7J59pqq5k3M9O5m3p9l2K1Ll2k
$$ 180 204 176 -28 -85 -50 5 7 -40 -87 -98 -115 -101 -12 5 -37 -58 -31 128 121 113 28 5 54 119 76 -3 -35 -14 -11 -43 -45
3609d5p5J8J6P4L3q1K1N0J38j2p2k1o4K2K8N5m0o9r7N8K8K7m5m0PJ4R8J23n1j01
$$ -45 -120 -102 -86 -12 21 -60 -39 11 149 137 65 44 -20 2 30 85 45 -24 -121 -63 -35 -8 -53 -93 -86 -72 26 149 98 -3
3639cL7K7N1j9r1k0%ol9J93l27j96J06L76r7o8p7p6K29r2K04j74m95M65j04J23
$$ -3 34 61 112 93 2 -18 -18 -24 -63 130 -197 -393 -287 89 -8 -76 -153 -229 0 -92 112 -62 -557 -92 -196 -73
3665g3k23M07nl12J81Qoj60J52j0kO6P4q8J0l6P6ono4k1J8O8k2q2J1N7nNL0r0
$$ -73 -296 111 106 -206 -25 -17 -23 -183 -31 -41 -43 23 97 9 19 -17 59 53 48 -16 -37 -19 49 27 -55 -44 13 8 13 43 -47
3696d7L50l74J41o6N0N3r9j13O3N5K01l6l10O9L5j5L0LL1Kl8Q5l3O3n2l2L2Jk6
$$ -47 303 -71 70 4 54 107 8 -105 -42 13 214 178 -132 -63 -28 -43 -13 -10 21 23 -15 70 37 100 48 16 48 49 23
3725B3k8r7M6R1l0m2l6jP4qK0N2l2O8o1jK9L4K0j16q5P1J3r3K2l6j4K4L4l6N9
$$ 23 -5 -102 -56 35 5 -37 -73 -74 0 -8 12 64 32 100 39 38 67 101 121 5 -80 -9 4 -89 -67 -103 -117 -93 -59 -95 -36
3756c6J37r6J3J5Q2J5p7L1r1J5O1o2o3j6K4p0j5N3Q0lm4Q1Pj7J12m8m8L7K5k7
$$ -36 101 5 18 33 115 130 53 84 -7 8 69 7 -56 -72 -48 -118 -133 -80 0 -3 -47 34 41 24 136 88 40 77 102 75
3786G5k2l4q9Kj6l5k0P3k0rK4j0N1R9N7p7j7K8M6qm5M2r9j3o1M5k8k2j8m1M1N0
$$ 75 53 19 -70 -68 -84 -119 -139 -66 -86 -95 -71 -81 -30 69 126 49 32 60 106 98 53 95 -4 -17 -78 -33 -61 -83 -101 -142 -101 -51
3818e1N0M9K5pK1%J9N2k2q7m6kO9jq5j59kJ1J03L8n1l6N6J9J06K7mO9l9l9kk3
$$ -51 -1 48 73 66 87 87 106 158 136 49 3 1 70 69 -16 -175 -177 -166 -63 -25 -76 -112 -56 -37 69 96 92 161 122 83 81 58
3850E8L2q7m8o4K1O0r5K6j6K5pN8O2mN0j9RM6M8o8p1J2j9m5M8o6j0k6l4M2oR2
$$ 58 90 3 -45 -109 -88 -28 -123 -97 -113 -88 -95 -37 25 21 71 52 61 107 155 87 16 28 9 -36 12 -54 -64 -90 -124 -82 -88 4
3882Dl2k4J32o8P3k2M9m6Q6n6o7rmo8j09J44q8j07K77q7rJ54L0m09K27K1J85l61
$$ 4 -28 -52 80 12 85 63 112 66 152 96 29 20 16 -52 -161 -17 -105 -212 65 -22 -31 123 153 -256 -29 -8 177 -184
3910a84J87L46o49L62N1m86M13j28j16J30L8j04m2J48j44K39K1N8r4J4l0N0k8
$$ -184 3 349 -300 62 113 -373 40 -88 -204 -74 -36 -140 -182 -34 -178 61 82 140 46 60 30 80 52
3933E2O7j08m7o8M3P7Lr0j3l0P7M6L6p4O2j9N6J9l2J5qq2K9p3M7j4Lj3o1P3o0
$$ 52 119 11 -36 -104 -61 16 19 -71 -84 -114 -37 9 45 -29 33 14 70 89 57 72 64 -18 11 -62 -15 -29 -26 -39 -100 -27 -87
3964h7M4L3l7N8l5PJ03l3mj6k5k7L7Qk7l9k6Pn7J10L6l6ml3Q0J4M3k5p5%N6J1
$$ -87 -43 -10 -47 11 -24 -17 86 53 49 33 8 -19 18 26 -1 -40 -66 -59 -116 -6 30 -6 -10 -43 37 51 94 69 -6 -6 50 61
3996F1K6p8m3k3QJ2K0N9j14QLR1J0k0m7K4JQ8M6j40J0k3M2k2K2j6l0p9O3N4l7
$$ 61 87 9 -34 -57 -49 -37 -17 42 -72 -64 -61 30 40 20 -27 -3 -2 86 132 -8 2 -21 21 -1 21 5 -25 -104 -41 13 -24
4027b4O4r6PJ03k7j2M4n3K1k2P0j27N3N%k1%j3Oj1n1J13k9L8Lp9L2K6N4Mj14N0
$$ -24 40 -56 -49 54 27 15 59 6 27 5 75 -52 1 6 6 -15 -15 -28 -22 -33 -84 29 0 38 41 -38 -6 20 74 78 -36 14
4059A4L7Po8j9k9L8K7P2m9n4Q4p2oK5K8oJ9l3n9L8%%K3o6jKKO4J3l0n3R0m3pM8
$$ 14 51 58 -10 -29 -58 -20 7 79 30 -24 60 -12 -18 7 35 29 48 15 -44 -6 -6 -6 17 -49 -50 -48 -46 18 31 1 -52 38 -5 -12 36
4094C6O8j9m4k2o1K8J1Mk9j1n1K9RM2Rj2M7l9Rj2J11L1p1m7j8L8O8k3p0n6m5L
$$ 36 104 85 41 19 -42 -14 -3 1 -28 -39 -90 -61 -52 -10 -1 -13 34 -5 4 -8 103 134 63 16 -2 36 104 81 11 -45 -90 -87
4126h7N5o8R9k9lM4%M8p1Q5j02Q6M1Op5m9J3K7m7m5L7j0k0l3N6N1K6m2rn2J47
$$ -87 -32 -100 -1 -30 -33 11 11 59 -12 73 -29 57 98 104 29 -20 -7 20 -27 -72 -35 -45 -65 -98 -42 9 35 -7 -16 -68 79
4157G9K4nl5n2OP9j9j03mj1L8q1pN4N9p7L2lM8M2J2Rj00M9lk6L9P7o9j23o1P3
$$ 79 103 98 63 11 17 96 77 -26 -30 -41 -3 -84 -91 -37 22 -55 -23 -26 22 64 76 85 -15 34 31 5 44 121 52 -71 -132 -59
4189e9M6L8k5j15L0M8N7N2Pm2l3k5L1J11%n4j21J3R8Qk0j29mK7J01l0L4m7K6m3
$$ -59 -13 25 0 -115 -85 -37 20 72 79 37 4 -21 10 121 121 67 -54 -41 57 65 45 -84 -88 -61 40 10 44 -3 23 -20
4219b0P2N5q4k5m6O1K5Qo8j8l7O2N8l0k3M3k5M5m7N5m3J6L6m5J5o8J5JM9ll3j14
$$ -20 52 107 23 -2 -48 13 38 46 -22 -40 -77 -15 43 13 -10 33 8 53 6 61 18 34 70 25 40 -28 -13 -12 37 34 1 -113
4251a13P9mJ20n7On5m5J25J2L9k1q2r1Q1K3L9j09Po3L3J13M0p8l6PL0O3P4r9k6
$$ -113 -34 -38 82 25 31 -24 -69 56 68 107 86 4 -87 -6 17 56 -53 -46 -109 -76 37 77 -1 -37 -30 0 63 137 38 12
4281A2Jl0R1kNr9n8RQ9Ko2j5j8K1O2l6M9k4L7j9L3J6m0j4KN4l5l9o8O2p0L7K1
$$ 12 13 -17 74 72 77 -22 -80 -71 18 20 -42 -57 -75 -54 8 -28 21 -3 34 15 48 64 24 10 12 66 31 -8 -76 -14 -84 -47 -26
4314b6l7L3L5OO4k9oK8mJ0ll3o7O1M1Ko8p4q7O1JQ6j0p4j8R2P9L6l5j0Nnn5O3
$$ -26 -63 -30 5 11 75 46 40 68 64 74 71 38 -29 32 73 75 7 -67 -154 -93 -92 -6 -16 -90 -108 -16 63 99 64 54 59 54 -1 62
4348F2n9k1j1nK0Om0o2N4l8L1O9J6Jj0N7L3J3Mq7P5k7n0o0L2o0M2p8N2n8N7j9
$$ 62 3 -18 -29 -34 -14 -8 -48 -110 -56 -94 -63 6 22 23 13 70 103 116 120 33 108 81 31 -29 3 -57 -15 -93 -41 -99 -42 -61
4380f1K2O9l0J1L6Rj4j6M4j14O0o3R8j2p2Jn6M3j3j5K1Q0oJJ6N4o6QJ5m9P3o4
$$ -61 -39 30 0 11 47 56 42 26 70 -44 16 -47 51 39 -33 -32 -88 -45 -58 -73 -52 28 22 23 39 93 27 35 50 1 74 10
4412A0kJk6L8k3Jp9J3J8O9k5J7l8K4O9N0r4lJ7K0k8Mk9l2l8K6l3j3M0Jn5O3K0
$$ 10 8 9 -17 21 -2 -1 -80 -67 -49 20 -5 12 -26 -2 67 117 23 20 37 57 29 33 4 -28 -66 -40 -73 -86 -46 -45 -100 -37 -17
4445a7M8mK5j0J7l8M3k2K8m3k1m8L4k4k3J4KM6j04J24j6NL4j7L7m2M6K2l7rj16
$$ -17 31 27 52 42 59 21 64 42 70 27 6 -42 -8 -32 -55 -41 -39 7 -97 27 11 16 50 33 70 28 74 96 59 50 -66
4476f6J2N7o6J08q2p1M8P2l9O5l3MQL8j6K1J8m6O3l3n4N2m7p3j5L6k5J6K1j8L4
$$ -66 -54 3 -63 45 -37 -108 -60 12 -27 38 5 9 17 55 39 60 78 32 95 62 8 60 13 -60 -75 -39 -64 -48 -27 -45 -11
4507a1kJ2P7n2Q4pq8M1j6rj6K3kl8o9l3K9J3J0LPK4L9K1n5J06k0K0j5o0P6p3p
$$ -11 -13 -1 76 24 108 101 13 54 38 29 13 36 34 -4 -73 -106 -77 -64 -54 -51 -44 -20 19 40 -15 91 71 91 76 16 92 19 12
4540A2k4M3q4j8MpL8J4M3mNrR4n1J5l1K0J2m5m5l5O7p3RN4r3N6O4n3j3j5O7m7
$$ 12 -12 31 -53 -71 -67 -74 -36 -22 21 17 22 13 107 56 71 40 60 72 27 -18 -53 14 -59 -50 4 -89 -33 31 -22 -35 -50 17 -30
4573c0K5O3k5rNn9N7Rl3k6k1J1n8P5J4n4L7K1J0L5rk4N3nk1j2m1KJmJ2n7J7l5
$$ -30 -5 58 33 24 29 -30 27 36 3 -23 -44 -33 -91 -16 -2 -56 -19 2 12 47 38 14 67 62 41 29 -12 -10 -9 -13 -1 -58 -41 -76
4607g6K5M6n1K8Nk1M6N6MJ4r9nK9Q5j5n1m9NJ1n9N5on2M9j7P8J9l8ok5L6L6q6
$$ -76 -51 -5 -56 -28 -23 -44 2 58 62 76 -23 -28 1 86 71 20 -29 -24 -13 -72 -17 -23 -75 -26 -43 35 54 16 10 -15 21 57 -29
4640b9L1%L4k4J0k0o7J3Qn6M4K6m6J5Q0K8o8P4J6Ln8P6qk8m7K4o8N6j10J4P7m
$$ -29 2 2 36 12 22 2 -65 -52 -44 -100 -56 -30 -76 -61 19 47 -21 53 69 72 14 90 82 54 7 31 -37 19 -91 -77 0 -4
4672do3P3l0J4L6k5P0pl8J1J1J4L1jj28j1L7rj9J5J8r8P0o2J09l6j7J01p5Q6N
$$ -4 -67 6 -24 -10 26 1 71 64 26 37 48 62 93 92 -36 -47 -10 -19 -38 -23 -5 -103 -33 -95 14 -22 -39 62 -13 73 78
4703G8p2J00j07PM0o1O1n4m9QM4J9k5n1M9j2K1M2l8K1oK5k9N6m9qk6j1M2l4m8
$$ 78 6 106 -1 6 46 -15 46 -8 -57 -49 -5 14 -11 -62 -13 -25 -4 38 0 21 15 40 11 67 18 10 -16 -27 15 -19 -67
4734f7N8J9n8n8N5P0k1K2J7l3P8K3q9q1J40o9L7k2k5j4J4j0m6K6j5J8J3K7K6m2
$$ -67 -9 10 -48 -106 -51 19 -2 20 37 4 82 105 16 -65 75 6 43 21 -4 -18 -4 -14 -60 -34 -49 -31 -18 9 35 -7
4764gN0l9L1k9L4Mm0J0l0N1mm3pMpKL8k1o7N9L1OrJ0QJ9LMl9o2P5L5r0J2m1K5
$$ -7 43 4 35 6 40 44 4 14 -16 35 31 -12 -19 -15 -22 -20 18 -3 -70 -11 20 26 17 27 35 54 57 61 22 -40 35 70 -20 -8 -49 -24
4800b4P5l2Pj7l6J5M5k1L6j9m8J5J1j4O3m5J7q0J0mM6K4j00L6J9P1Qk4j1J4m6
$$ -24 51 19 26 9 -27 -12 33 12 48 29 -19 -4 7 -7 56 11 28 -52 -42 -46 0 24 -76 -40 -21 50 58 34 23 37 -9
4831im9J16m5J9o3J2N1lK5r6o9P7l2R4l5QJ4l8K3Rm1J9J5O1l0o9K8K4q8M5J0N9
$$ -9 -58 58 13 32 -31 -19 32 29 54 -42 -111 -34 -66 28 -7 1 15 -23 0 9 -32 -13 2 63 33 -36 -8 16 -72 -27 -17 42
4863D2q8j8K5K6M0o0%L6%Q2q4N3l5j7L4Jjl4k3J3K7j9J5o8nK8N9QJ5j02O9J1O
$$ 42 -46 -64 -39 -13 27 -33 -33 3 3 85 1 54 19 2 36 37 36 2 -21 -8 19 0 15 -53 -58 -30 29 37 52 -50 19 30 36
4896C6m0J8M4n2j3JP7q7N1l8k6N5k8j1L0JN7r2M7%pK0Pm2K7m8%J4Nm9M6m5J6O1
$$ 36 -4 14 58 6 -7 -6 71 -16 35 -3 -29 26 -2 -13 17 18 75 -17 30 30 23 43 50 8 35 -13 -13 1 6 -43 3 -42 -26 35
4930C5n6j2j6K1P8m7mk9L0l1P3k1rMk1o4J30p0J6j2l7J1j6P3j19J85j74N6K82
$$ 35 -21 -33 -49 -28 50 3 -1 -30 0 -31 42 21 12 16 -5 -69 61 -9 7 -5 -42 -31 -47 26 -93 92 -82 -26 256
4959B56m07K74j86MK1J00j69J05j18P3R5J54O7n12K22J90j46L9j60j28K79J13
$$ 256 -151 123 -63 -59 -38 62 -107 -2 -120 -47 48 202 269 -243 -21 169 23 62 -98 -226 53 166
4981A66j34j75K84j49r5Q7k1P7p4L7o8O9J1K1o4L3j04J28n8O8j36J42j9JM8O3
$$ 166 32 -143 141 -8 -103 -16 -37 40 -34 3 -65 4 15 36 -28 5 -99 29 -29 39 -97 45 26 27 75 138
5007A38j42P2%M8j46K30k04N1P1k89K58k28K70l64N13n42QL22l6M7j05K4L4Qr2
$$ 138 -4 68 68 116 -30 200 -4 47 118 -171 87 -141 129 -235 278 -264 -256 66 30 77 -28 -4 30 38 -54
5032e4N7k0n6J7J00p8J00q3l2K8M5K6r4M2Ql2K3P7q8L3M2p9N2k4l1J3l5O2j5m4
$$ -54 3 -17 -73 -56 44 -34 66 -17 -49 -21 24 50 -44 -2 6 -26 -3 74 -14 19 61 -18 34 10 -21 -8 -43 19 4 -40
5062d0Q9m6J7N9j37q7L3k26K17J64m4q4R6P2k50R1R9n0j09J32r0K12Q5k87K93
$$ -40 49 3 20 79 -58 -145 -112 -338 -121 43 -1 -85 11 83 -167 -76 23 -27 -136 -4 -94 118 203 -84 209
5087B09%l57J55K7K8m2oJ0j7l6L5L1r7J14r2J9J1N0l9j5JJ7L1Lm9j0L2l8K3K9
$$ 209 209 -148 7 34 62 20 14 24 7 -29 6 37 -60 54 -38 -19 -8 42 3 -12 -11 6 37 40 -9 -19 13 -25 -2 27
5117B7MK3j37O3N7m5O1l5l6O1m7N3k62M36k97L14J05o84N21j98J93l07L6L98K68
$$ 27 31 54 -83 -20 37 -8 53 18 -18 43 -4 49 -213 223 -74 240 345 -339 182 -16 177 -130 -94 304 572
5142E72k98l38k27Q0K38n1M2kl1L1M4r0R4o1O0n9j1J8K8p7K7J9n5M1LM2k2m6r
$$ 572 274 -64 -291 -211 27 -24 18 16 -15 16 60 -30 64 3 63 4 -7 11 39 -38 -11 8 -47 -6 -3 39 17 -29 -38
5171c8K0J7M2k7k9j3O8M8o1j4OJ3j4p1K5Nj1lN5r3J13J30j25K05j33l18P9J16
$$ -38 -18 -1 41 14 -15 -28 40 88 27 13 19 32 18 -53 -28 -23 -34 -37 18 -75 38 168 43 248 115 -203 -124 -8
5199hM95o42J96J72j43j20j50K92l19N15m58J60j95K98J49j56j70J77M75o68l83
$$ -8 487 -155 41 213 70 -50 -200 92 -227 288 -170 -10 -205 93 242 86 -84 93 568 -100 -483
5220d83K35N03l70k65L77j18k35O13l75J6R2L37l11l8J26m92M39l03L18j9K94
$$ -483 -248 255 -115 -380 -3 -121 -356 257 -118 -102 -10 327 16 -22 104 -388 51 -252 66 47 341
5241C41n70N84m51K97q3k32l4K91k62Q4J45o33R33l82L1j66J70k87Q0Q7j29M8
$$ 341 -229 355 -96 201 118 -114 -148 143 -119 -35 110 -523 410 28 59 -107 63 -224 -144 -57 -186 -138
5263a38K5K35K7m25M12n1K22n73k32M45l56L81Q5r5J9J23j7O9j20O3j48M8N8l0
$$ -138 -113 122 149 -276 136 85 307 -266 -498 -53 -409 -28 57 -38 -19 104 87 156 36 99 -49 -1 57 27
5287B7p3J42j51JN6R7l0r8j2P1o7O1o3J34j3l3m3J6J7j1O5r2O8p8Oj23R0K9rj7
$$ 27 -46 96 -55 -54 2 99 69 -29 -41 30 -37 24 -39 95 82 49 6 22 39 28 93 1 69 -9 -3 -126 -36 -7 -16 -33
5317c3PP4j5qm0L1j9LK2J7n2Q7r6KM9m0l0k4K99J5m56K94q1O9k24j03O38mo73
$$ -33 -26 48 33 25 -15 16 -3 0 22 39 -13 74 -22 -20 29 -11 -41 -65 234 249 -207 87 6 75 -149 -252 386 382 -291
5346b91K96M7m8J6m7N1k1N6k6Ok2o4j4Q5N3q0nOO5J0n7j4J8J3l7J9k4M5l2Kk0
$$ -291 5 52 4 20 -27 24 3 59 33 39 17 -47 -61 24 77 -3 -8 -2 63 73 16 2 20 33 -4 15 -9 36 4 6 -14
5377a4L8o2j2P3o4N5j4LkO3k5ql3J4J2j9J2Mj3j8K6M6m4o5N0L5n4M6l7J0k7M0
$$ -14 24 -38 -50 23 -41 14 0 3 1 64 39 31 -2 12 24 5 17 21 8 -10 16 62 18 -47 3 38 -16 30 -7 3 -24 16
5409A6Nj7K9l0L4q2N1Jm9J0j1j6Q2n2Kk1K1M4j2K5Jn7N6J0k5N1pp3k0N1k7j3J0
$$ 16 21 4 33 3 37 -45 6 7 -42 -32 -43 -59 23 -29 -27 -48 -27 17 5 30 31 -26 30 40 15 66 59 -14 -34 17 -10 -23 -13
5442a3lJK2k5N5l9K1m3K9P3j13nM4j3K2N3k1o7m7P3Qj0p1J05k5K1K5l3k0m5Q2
$$ -13 -16 -15 7 -18 37 -2 19 -24 5 78 -35 -40 4 -9 13 66 45 -22 -69 4 12 2 -69 36 11 32 57 24 4 -41 41
5473D1m0L6k3%l7J8J3kK5j2l5j6O2K6k8j5rO1n1L2r3R4m3pM5j03L6l0N2K8m1N8
$$ 41 1 37 14 14 -23 -5 8 6 31 19 -16 -32 30 56 28 13 4 65 14 46 -47 47 4 -3 42 -61 -25 -55 -3 25 -16 42
5505D2r3M5j2j1K7K6l6oL0mJ1L3o8J3NjJ6l0j3M3J2K4n8kL7j1l9N0L5m9Kn8J05
$$ 42 -51 -6 -18 -29 -2 24 -12 -18 12 8 19 52 -16 -3 2 1 17 -13 -26 17 29 53 -5 -7 30 19 -20 30 65 16 18 -40 65
5538F5m4N2o4l7O%n3N2Jn6P6K3m4K4J3J3pmJ2n3j0L5n8L1J1pL6j3jN6m7Lj12K6
$$ 65 21 73 9 -28 -22 -22 -75 -23 -22 -78 -2 21 -23 1 14 27 20 16 28 -25 -35 0 -58 -27 -16 -23 13 0 -1 55 8 11 -101 -75
5572g5J42o3o0N6j1Q7m3o5O1k4j5j3N8l2J6k5l8M3Lj5QNj1J4k3N8m1O9m0K5qO4
$$ -75 67 4 -56 0 -11 76 33 -32 29 5 -10 -23 35 3 19 -6 -44 -1 2 -13 -5 0 -11 3 -20 38 -3 66 26 51 43 107
5604A07j37J8J14j82J44j90J02p8k0P7J30J1j69L5J56j41l5L7j11J80N4K8Mr8
$$ 107 -30 -12 102 -80 64 -126 -24 -102 -122 -45 85 96 -73 -38 118 -23 -58 -21 -132 48 102 130 134 36
5628C6q2j22K95k22j50P6J93R7j46N1r8L13m54M24j71j65k19M9K14n4K82k48j00
$$ 36 -46 -168 127 -95 -245 -169 24 121 -25 26 -72 241 -213 211 40 -125 -344 -295 -81 -135 147 -101 -201
5651b01J88J8l43L94r7Ml01N31M8m61K07R1l50N49m30K70O7j74j09j4K19l1j82
$$ -201 -13 5 -338 56 -41 -37 -338 193 241 -220 -13 78 -272 277 -153 117 184 10 -99 -113 106 75 -107
5674a07P8J17j90O4j59L30k65j43L41K15l56j00K29k29L05k23P0Q0j4Q4m03K46
$$ -107 -29 88 -102 -38 -197 133 -132 -275 66 281 -75 -175 54 -175 130 -93 -23 57 43 127 -276 -30
5696c0J37j11j10m2J31j16J77k14J19J79k66J05k47L97j33RN2J70j42j0j1L2M7
$$ -30 107 -4 -114 -156 -25 -141 36 -178 -59 120 -146 -41 -288 109 -24 -15 37 207 65 55 44 76 123
5719A23j62J32L0lj25M5l6P6k9m2M4o6K33m5j12n5O9R0q9J96k16J32m25N21l83
$$ 123 -39 93 123 120 -5 40 4 80 51 9 53 -13 220 175 63 8 77 167 78 274 58 190 -235 286 -97
5744i7N72m96L7k56K36k22k7R3l44N66j52L9j0N5j20K19l20J0K47k8m62K88q0
$$ -97 475 -21 16 -240 -4 -226 -253 -160 -504 62 -90 -51 -61 -6 -126 93 -227 -217 30 2 -460 -172 -252
5767b52K89Pk9Q4mj69P2o5M8Ok1LJ5LP9l9k8k7R8p5O1o7J1mok6L1N5n2k1J2k0
$$ -252 37 44 15 99 95 -74 -2 -67 -19 -13 -34 -31 -16 -13 66 27 -1 -28 70 -5 56 -11 0 -4 -10 -36 -5 50 -2 -23 -11 -31
5799c1j69J88Q2p7o3J35K37m39P0J76j59J49K10k99k04m3K63%n5O2o0N9J16L7
$$ -31 -200 -12 70 -7 -70 65 302 -137 -67 109 -50 99 309 10 -194 -237 26 26 -29 33 -27 32 148 185
5823A85k16r1n2O85l16l64L32j95oM9j3j7P8J35k37j7J38j05J0Nn8M9kj9P6m3
$$ 185 -31 -122 -174 511 195 -169 163 -32 -38 11 -2 -19 59 194 -43 -60 78 -27 -17 -12 -70 -21 -23 -42 34 -9
5849il6R4n3K6p5M0M2p2lN6m0NK0pK2j9J2j3PO4J2n4k6mM2k4j1m6L0J9N5Nm7J1
$$ -9 -45 49 -4 22 -53 -13 29 -43 -46 10 -30 -25 -5 -12 10 -9 3 -10 -3 61 73 19 -7 -11 31 7 -4 -50 -20 -1 54 59 12 23
5883B3k6Q6j16J0K4k1M7m3MK3j7KKK0j7M5p8L4Pj2K7m5j3K2K9%J5%j8mPQm6L4
$$ 23 -3 83 -33 -23 1 -20 27 -16 -12 11 -6 -4 -2 18 1 46 -32 2 9 -3 24 -21 -34 -12 17 17 32 32 14 10 17 25 -21 13
5917A3k4j8k4O7M3r2Q2k1j0k8NQPL7m1%lJ5k4K6n8OJ5K5Ol5P1n8J0k6M7n5M8l7
$$ 13 -11 -29 -53 14 57 -35 47 26 16 -12 -7 1 8 45 4 4 1 16 -8 18 -40 -34 -19 6 12 -23 48 -10 0 -26 21 -34 14 -23
5951b3M3l2M9j7qQj1M0j6j00M4l0K2l3M0J3ML3Om6K2n9K7K8k7M2m1N1j0K4j03
$$ -23 20 -12 37 20 12 20 9 49 33 -67 -23 -53 -31 -64 -24 -11 -7 26 32 -14 8 -51 -24 4 -23 19 -22 29 19 43 -60
5982f0N1M8o0K2K8n0O3m2j4J1L0M1r5j7O2l0jl3L9qP7J6p6m2J4N4m4MK9M8j25
$$ -60 -9 39 -21 1 29 -21 42 0 -14 -3 27 68 -27 -44 18 -12 -13 -46 -7 -15 62 78 2 -40 -26 28 -16 -12 17 65 -60
6013f0P4k3Ql9N1ON0j11MP6p4N5QQj2L1o2lk6L9k1M9Lj2k1J8j9JrK6J2o4M9j5
$$ -60 14 -9 -1 -40 11 17 67 -44 -40 36 -38 17 25 33 21 52 -10 -13 -39 0 -21 28 31 19 -2 16 -3 -2 -11 15 27 -37 12 -3
6047cL7m5L2Ok1K5l9J2Ol0JN9n6kmL8Pp5J8j3M9J0J7kJ6p9M1m2Q8o9O6j0j6N4
$$ -3 34 -11 21 27 6 31 -8 4 10 -20 -19 40 -16 -18 -22 16 23 -52 -34 -47 2 12 29 27 43 -36 5 -37 51 -18 48 38 22 76
6081G6l7p3qO5j5Jk6J8l7K1R1p6J5L2l7qJ5Qjlk6m1P5l3K1k6m2K5L4k8JrkL1j
$$ 76 39 -34 -42 23 8 9 -17 1 -36 -15 76 0 15 47 10 2 17 25 24 21 -5 -46 29 -4 17 -9 -51 -26 8 -20 -19 -28 -30 1 0
6116@PK3Jk4M3o3N2K1r1K3M3m6K9j0N0j18J14j06K3J20p3mnm8O6n7M0m6Jk0M5
$$ 0 7 30 31 7 50 -13 39 60 -31 -8 35 -11 18 8 58 -60 54 -52 -29 91 18 14 9 -39 27 -30 10 -36 -35 -55 -10
$$ [...]
8191B
##END NTUPLES=NMR FID
##END=
