##TITLE=1H_Pr 5319
 200.13MHz, CDCl3,
 8 sc
 
 2.9.2025
##JCAMPDX= 6.0         $$ Bruker NMR JCAMP-DX V2.0
##DATA TYPE= NMR FID
##DATA CLASS= NTUPLES
##ORIGIN= UXNMR, Bruker Analytische Messtechnik GmbH
##OWNER= pz
$$ XWIN-NMR		Version 3.5
$$ Tue Sep  2 16:23:42 2025 Russian Standard Time (UT+4h)  she@DPX200
##.OBSERVE FREQUENCY= 200.1313
##.OBSERVE NUCLEUS= ^1H
##.DELAY= (6, 6)
##.ACQUISITION MODE= SIMULTANEOUS
##.ACQUISITION SCHEME= undefined
##.AVERAGES= 8
##.DIGITISER RES= 18
##SPECTROMETER/DATA SYSTEM= spect
##.PULSE SEQUENCE= zg30
##.SOLVENT NAME= CDCl3
##.SHIFT REFERENCE= (INTERNAL, CDCl3, 0, 14.3821)
##AUDIT TRAIL= $$ (NUMBER, WHEN, WHO, WHERE, WHAT)
$$ ##TITLE= Audit trail, XWIN-NMR		Version 3.5
$$ ##JCAMPDX= 5.01
$$ ##ORIGIN= Bruker BioSpin GmbH
$$ ##OWNER= she
$$ F:/spectra/data/she/nmr/H-C/1/audita.txt
$$ ##AUDIT TRAIL=  $$ (NUMBER, WHEN, WHO, WHERE, WHAT)
(   1,<2025-09-02 16:22:34.32 +0400>,<she>,<DPX200>,
      <created by zg, POWCHK disabled, PULCHK disabled
       configuration hash MD5:
       00 E9 B6 7A A2 85 ED C7 34 08 36 98 17 FE 4E 26
       data hash MD5: 16K
       9F AB 81 7F A3 4B 47 6D 46 F5 96 09 B1 9A 67 0B>)
$$ ##END=
$$ 
$$ hash MD5
$$ 03 97 49 3E EF 87 09 E0 B9 61 69 72 08 64 02 14
##$RELAX= 
##$RELAX= 
##$RELAX= 
##$RELAX= 
##$RELAX= 
##$RELAX= 
$$ Bruker specific parameters
$$ --------------------------
##$DU= <F:/spectra>
##$EXPNO= 1
##$NAME= <H-C>
##$PROCNO= 1
##$TYPE= <nmr>
##$USER= <she>
##$AMP= (0..31)
100 100 100 100 100 100 100 100 100 100 100 100 100 100 100 100 100 100 
100 100 100 100 100 100 100 100 100 100 100 100 100 100 
##$AQSEQ= 0
##$AQ_mod= 1
##$AUNM= <au_zg>
##$AUTOPOS= <>
##$BF1= 200.13
##$BF2= 200.13
##$BF3= 200.13
##$BF4= 200.13
##$BF5= 200.13
##$BF6= 200.13
##$BF7= 200.13
##$BF8= 200.13
##$BYTORDA= 1
##$CFDGTYP= 0
##$CFRGTYP= 5
##$CHEMSTR= <none>
##$CNST= (0..31)
1 1 145 1 1 1 1 1 1 1 1 1 1 1 1 1 1 1 1 1 1 1 1 1 1 1 1 1 1 1 1 1 
##$CPDPRG= <>
##$CPDPRG1= <>
##$CPDPRG2= <>
##$CPDPRG3= <>
##$CPDPRG4= <mlev>
##$CPDPRG5= <mlev>
##$CPDPRG6= <mlev>
##$CPDPRG7= <mlev>
##$CPDPRG8= <mlev>
##$CPDPRGB= <>
##$CPDPRGT= <>
##$D= (0..31)
0 0.7 0 0 0 0 0 0 0 0 0 0.03 0 0 0 0 0 0 0 0 0 0 0 0 0 0 0 0 0 0 0 0 
##$DATE= 1756815753
##$DBL= (0..7)
120 120 120 120 120 120 120 120 
##$DBP= (0..7)
150 150 150 150 150 150 150 150 
##$DBP07= 0
##$DBPNAM0= <>
##$DBPNAM1= <>
##$DBPNAM2= <>
##$DBPNAM3= <>
##$DBPNAM4= <>
##$DBPNAM5= <>
##$DBPNAM6= <>
##$DBPNAM7= <>
##$DBPOAL= (0..7)
0.5 0.5 0.5 0.5 0.5 0.5 0.5 0.5 
##$DBPOFFS= (0..7)
0 0 0 0 0 0 0 0 
##$DE= 6
##$DECBNUC= <off>
##$DECIM= 32
##$DECNUC= <off>
##$DECSTAT= 4
##$DIGMOD= 1
##$DIGTYP= 9
##$DL= (0..7)
0 120 120 120 120 120 120 120 
##$DP= (0..7)
150 150 150 150 150 150 150 150 
##$DP07= 0
##$DPNAME0= <>
##$DPNAME1= <>
##$DPNAME2= <>
##$DPNAME3= <>
##$DPNAME4= <>
##$DPNAME5= <>
##$DPNAME6= <>
##$DPNAME7= <>
##$DPOAL= (0..7)
0.5 0.5 0.5 0.5 0.5 0.5 0.5 0.5 
##$DPOFFS= (0..7)
0 0 0 0 0 0 0 0 
##$DQDMODE= 0
##$DR= 18
##$DS= 0
##$DSLIST= <SSSSSSSSSSSSSSS>
$$ [...]
##$SUBNAM0= <"">
##$SUBNAM1= <"">
##$SUBNAM2= <"">
##$SUBNAM3= <"">
##$SUBNAM4= <"">
##$SUBNAM5= <"">
##$SUBNAM6= <"">
##$SUBNAM7= <"">
##$SUBNAM8= <"">
##$SUBNAM9= <"">
##$SW= 18.0517328524113
##$SWIBOX= (0..15)
0 0 2 0 0 0 0 0 0 0 0 0 0 0 0 0 
##$SW_h= 3612.71676300578
##$TD= 16384
##$TD0= 1
##$TE= 0
##$TE2= 300
##$TE3= 300
##$TEG= 300
##$TL= (0..7)
0 120 120 120 120 120 120 120 
##$TP= (0..7)
150 150 150 150 150 150 150 150 
##$TP07= 0
##$TPNAME0= <>
##$TPNAME1= <>
##$TPNAME2= <>
##$TPNAME3= <>
##$TPNAME4= <>
##$TPNAME5= <>
##$TPNAME6= <>
##$TPNAME7= <>
##$TPOAL= (0..7)
0.5 0.5 0.5 0.5 0.5 0.5 0.5 0.5 
##$TPOFFS= (0..7)
0 0 0 0 0 0 0 0 
##$TUNHIN= 0
##$TUNHOUT= 0
##$TUNXOUT= 0
##$USERA1= <user>
##$USERA2= <user>
##$USERA3= <user>
##$USERA4= <user>
##$USERA5= <user>
##$V9= 5
##$VALIST= <valist>
##$VCLIST= <CCCCCCCCCCCCCCC>
##$VD= 0
##$VDLIST= <DDDDDDDDDDDDDDD>
##$VPLIST= <PPPPPPPPPPPPPPP>
##$VTLIST= <TTTTTTTTTTTTTTT>
##$WBST= 1024
##$WBSW= 4
##$XGAIN= (0..3)
0 0 0 0 
##$XL= 0
##$YL= 0
##$YMAX_a= 226560
##$YMIN_a= -258715
##$ZGOPTNS= <>
##$ZL1= 120
##$ZL2= 120
##$ZL3= 120
##$ZL4= 120
##$ABSF1= 10
##$ABSF2= 0
##$ABSG= 5
##$ABSL= 3
##$ALPHA= 0
##$AQORDER= 0
##$ASSFAC= 0
##$ASSFACI= 0
##$ASSFACX= 0
##$ASSWID= 0
##$AUNMP= <proc_1d>
##$AZFE= 0.1
##$AZFW= 0.1
##$BCFW= 1
##$BC_mod= 2
##$BYTORDP= 1
##$COROFFS= 0
##$CY= -3
##$DATMOD= 1
##$DC= 2
##$DFILT= <>
##$DTYPP= 0
##$F1P= 0
##$F2P= 0
##$FCOR= 0.5
##$FTSIZE= 0
##$FT_mod= 4
##$GAMMA= 1
##$GB= 0.15
##$INTBC= 1
##$INTSCL= 1
##$ISEN= 128
##$LB= 0.25
##$LEV0= 0
##$LPBIN= 0
##$MAXI= 10000
##$MC2= 0
##$MEAN= 0
##$ME_mod= 0
##$MI= 1.114404
##$NCOEF= 0
##$NC_proc= 0
##$NLEV= 6
##$NOISF1= 3.799351
##$NOISF2= 2.8
##$NSP= 1
##$NTH_PI= 0
##$NZP= 0
##$OFFSET= 14.38212
##$PC= 1
##$PHC0= -1568.414
##$PHC1= 19.39228
##$PH_mod= 1
##$PKNL= yes
##$PPARMOD= 0
##$PSCAL= 0
##$PSIGN= 0
##$REVERSE= no
##$SF= 200.129724274929
##$SI= 16384
##$SIGF1= 3
##$SIGF2= 2
##$SINO= 400
##$SIOLD= 16384
##$SREGLST= <1H.CDCl3>
##$SSB= 0
##$STSI= 0
##$STSR= 0
##$SW_p= 3205.1282051282
##$SYMM= 0
##$S_DEV= 0
##$TDeff= 0
##$TDoff= 0
##$TI= <>
##$TILT= no
##$TM1= 0
##$TM2= 0
##$TOPLEV= 0
##$USERP1= <user>
##$USERP2= <user>
##$USERP3= <user>
##$USERP4= <user>
##$USERP5= <user>
##$WDW= 1
##$XDIM= 8192
##$YMAX_p= 0
##$YMIN_p= 0
$$ End of Bruker specific parameters
$$ ---------------------------------
##NTUPLES= NMR FID
##VAR_NAME=  TIME,          FID/REAL,        FID/IMAG
##SYMBOL=    X,             R,               I
##VAR_TYPE=  INDEPENDENT,   DEPENDENT,       DEPENDENT
##VAR_FORM=  AFFN,          ASDF,            ASDF
##VAR_DIM=   8192,          8192,            8192
##UNITS=     SECONDS,       ARBITRARY UNITS, ARBITRARY UNITS
##FACTOR=    0.0002768,     1,               1
##FIRST=     0,             0,               0
##LAST=      2.2672688,     0,               0
##MIN=       0,             -258715,         0
##MAX=       2.2672688,     226560,          0
$$ Real data points
##PAGE= N=1
##DATA TABLE= (X++(R..R)), XYDATA
0@%%%%%%%%%%%%%%Lj1J6j6J6j6K4l2L2m0M8n2O0p2Q3r2J05j21J39j57J75j98K23
37A17k48K78l11L46l84M25m71N21n74O33o98P70q50R34j027J134j252J384j535
56h08J706j902K134k408K736l143L659m340N284o678Q944j3228K4033j03010j71694
71b58715K67855J65341j58885j11605J16474L9691p4816Q999N1834o5712m6028
82f5567R1034O6027q8974p7945O5161R1639l5177j01117j8591P6607M9952k1132
94C1917k6393o279k3682p426M6937K9000m7529l2715L8136K3463l0870r407J8784
107C936j0433j2144K6458J306m6085O235P3979J1274q5133m5089O4760O8157k4730
120C2491n5196M914L2953j1302k0509K8004J8474m3273j7975N4360Q302o9688
$$ y = [0, 0, 0, 0, 0, 0, 0, 0, 0, 0, 0, 0, 0, 0, 0, 3, -8, 8, -8, 8, -8, 16, -16, 16, -24, 24, -28, 32, -40, 43, -49, 56, -65, 74, -83, 92, -106, 117, -131, 147, -164, 182, -202, 223, -248, 273, -301, 332, -366, 404, -446, 488, -539, 595, -657, 727, -808, 898, -1004, 1130, -1278, 1458, -1685, 1974, -2366, 2918, -3760, 5184, -8044, 15989, -87021, -258715, 9140, 174481, 15596, -96009, 20465, 60156, -14660, -5661, 46173, -19539, -65567, 25467, 91494, 2520, -75425, -10264, 81375, 46198, -54919, -73510, 3097, 53049, 31917, 5524, -755, -24437, -31863, 15074, 44074, -3455, -36170, 1966, 25429, -5441, -14848, 3936, -6497, -18641, 7817, 9123, -36962, -30727, 43252, 54526, -30607, -75696, -10936, 57221, 32491, -22705, -17791, 15162, 3860, -16649, 11355, 29829, -13444, -31419, 22941, 31243, -38445]
132c8445K355R0753o689j06931j300J04037Q958p9953L194N8071k7012m9470M2102
145c30M9892m1140m3430L0807K5160k9294j0269L1238N075l2003q163K1105N903
158D551o536O964O271j7636j6119J5114K7475J480k2923j3455R280J2303J58o174
172G53j628K763r55o246l351L984J0520N783q751j7971l308K3044J9596j4326
186I907k4392M777J9320k722j2417Q443J0478j3488j3704J0473R677q604o12J0811
200G947p926j9066Q385K5151l030k0370J991J3901o420r610J2803J2752j2419
213D089j5006O061J0550k549m152L460l65q164k651P845N781k700l637p04n42
228b684p47M721O605j334q938l072P280N071n538m174N125K832r103o021Q576
$$ y = [-38445, -36090, 54663, 47974, -58957, -60257, 43780, 52738, -27215, -24021, 34050, 7038, -42432, -330, 49562, 8422, -35008, -4201, 20959, -8335, -18604, 12634, 17709, -14294, -22457, -1352, 4551, -1985, 4979, 11250, -6386, -22505, -7391, 20084, 21564, -1359, -14814, -5534, 6769, 6927, 753, -875, 1888, 933, -5313, -8664, -4680, 5840, 11623, 2872, -15099, -18407, 4637, 24233, 9907, -14485, -9708, 9612, 6890, -5527, 2916, 13394, -94, -13798, -3325, 6352, -2252, -2864, 7947, 21, -19045, -10660, 14491, 11461, -8909, -6918, 6983, 563, -9047, 3756, 16508, 4089, -10917, -4856, 5694, 3145, -1007, 2453, 2088, -6076, -8727, -882, 4899, 2199, -1438, -2142, -2684, -3431, 1290, 7895, 6561, -2377, -5449, 1831, 6902, 1364, -2810, 2315, 5147, -3956, -9977, -1401]
243a401Q975n907q015K359K303j647L908P120n470j0140N033J1273l874r233N703
258I87P809q390q729P555P683o431n625M420J617n907L60P393J603p449j392O067
274A571J466l957J543N926l401q277K677R428j991r646J658P044m407o691O603
289d54N772p888m785Q693L645q480r36R025N81p665K34O359j208l873K002L576
305D598m164n711K438P328m77r235k022Q487L035p201j463O929r85n431M925O061
321G112q075n540J0700N330j0893n560R333K866o661j104L605l392k520O036K634
336C871o757l253N801M207j570l620q14L204K845j536k406L37k21n62K578J297
352C401o385l518P732M258q263l841O527K501m452J501L536m349k681P245L933
$$ y = [-1401, 7574, 1667, -6348, -3989, -1686, -3333, 575, 7695, 2225, -7915, -2882, 8391, 4517, -4716, 987, 8796, 406, -8323, -768, 6915, 484, -5141, -721, 896, -5011, -4651, 2742, 4345, -3104, -4496, 1571, 3037, -920, 623, 6549, 3148, -5129, -2452, 6976, 4985, -4661, -3003, 4041, -366, -7057, -454, 5318, -2570, -7355, 1338, 4983, -3497, -4433, 4592, 5173, -2492, -2258, 4101, 2893, -980, 1022, 4598, 434, -5277, -2839, 4489, 4012, -5223, -7245, 1242, 4277, -2924, -4387, 2542, 1557, -3874, 1051, 7112, -963, -6503, 4197, 9527, -1366, -6926, 2407, 5273, -1388, -2492, 1113, -2279, -4799, 1237, 3871, -2886, -6139, -338, 3869, 2299, -1321, -2135, 1069, 3914, 2378, -28, 309, 88, -474, 2104, 3401, -2984, -6502, 1230, 5488, -2775, -6616, -89, 2412, -2040, -539, 2997, -1352, -4033, 3212, 7145]
367G145p994l791O685L374m764k734J546N91m28N53j51k162j254K375K687l16
383A362m105j185N449L240m074l343L076K857k246p62J603j511k131K591J228
398B049m599j637M485J964l503k131J817J594O92P14r50k001R73L292L08k706
414C61q52J624N01j691j393O43J432j01k038o68O33Q0J323K309j604m093J140
431b394N740J256m692j676L235J069k842m14K022n88j508J79L55k337M8L553J591
448B597l334l957J840M789K396k918l312M48L106J004j238j003J38j32p52m07
464g35P1N8K44Q91j25l336k072M422N881k148p134o35O099K944k367j446K60j205
482c33j062K119J559j728k072R50Q27j638j929J753L878J117n034m378L358P343
$$ y = [7145, -849, -4640, 2045, 5419, 655, -2079, -533, 58, -370, 183, 32, -2130, -3384, -1009, 1678, 1362, -2743, -3928, 1521, 4761, 687, -2656, 420, 3277, 1031, 269, 1872, 361, -1770, 821, 2049, -2550, -4187, 298, 2262, -1241, -3372, -1555, 39, 731, 1445, 495, -1506, -533, 2759, 3067, 361, -491, 1133, 1634, -57, -1450, -807, 625, 524, -1514, -2182, -1549, -1469, -146, 2163, 559, -3534, -2394, 3346, 4602, -90, -1766, 1469, 2538, -304, -718, 1304, 716, -792, -613, -258, -2595, -2547, 1006, 2597, -737, -4694, -2854, 1935, 4331, 1413, -1899, -1451, 1655, 2659, 1421, 418, 556, 424, -328, -735, -664, -606, -362, 529, 404, -2932, -5004, -582, 5299, 3151, -3983, -4618, 1481, 4425, 2058, 612, 872, -333, -1395, 724, 2283, 555, -1517, -567, 260, -1378, -3307, -1554, 2324, 3441, -1593, -5971, -2613, 4730]
498D730O26n605j657K274j01n32L381J142n237l142M121K901l920k533M250K745
514C443n356m158L772N820K47l508k203m21J918K942J743j567l589k223J217L746
530A823J715l135l317J494K650k721l212N123N255m433o629K496N402p67o66K644
546C722j577o629j32Q937K648p333m022L246J879j596P2J202K70j335j723k55
562b626J866L765N0k867j200k10p30K736O005j651r290k554P438M038m488k475
578b193K871j123l776J904M930k73l260N75J032k796n24N104K888k840n126r35
594c542K468L660J863k972m945l63L698J395j201L09N86l039j372L789J944k173
610A05Q3L135k608n695K344Q182L63o788k578K041N36Q57K878n73m941k002L580
$$ y = [4730, 5356, -249, -1906, 368, 267, -265, 3116, 4258, -979, -4121, 0, 2901, -1019, -3552, 698, 3443, -1913, -6071, -2299, 3521, 3768, 260, -1943, -2364, -446, 2496, 4239, 2672, -917, -3140, -1923, 1823, 3538, 403, -2914, -1420, 1230, -1491, -4703, 420, 5675, 1242, -5387, -2891, 2511, 1744, 1078, 3722, 2145, -4484, -4616, 4321, 6969, -364, -4386, -1140, 739, -857, -785, 417, 687, -648, -2371, -2626, -760, 3005, 3055, 188, -1012, -1222, -1952, 784, 6789, 5138, -4152, -6706, 732, 4770, 282, -2193, 678, -445, -4221, -2317, 2613, 2340, -920, -345, 687, -2109, -2633, 2471, 5359, 2519, -2607, -3542, -1074, 2586, 4449, 1477, -3468, -3831, -133, 1262, 61, 370, 956, -2083, -3455, 334, 2278, 105, 188, 3323, 715, -4980, -2636, 5546, 5909, -879, -3457, -1416, -880, -23, 2855, 2282, -2659, -4661, -1081]
627a081K216q61N35K39j355j264Q43O47J437K857j491n452k029N416L146k293
643A510j689o19k250j026N204L237m054l992K506K409k168K13L905l43l614j087
659a858J512N25J129J982j142n158j229L928K876j130j825p04j874O58L359J331
675B380k050r70J202o39j804K471L026j220l447n10R13N48R78J764k130l652J4
692c126K931J453q44L23q90j595M64K307P18p56L74o87k226J9L005J283k000j295
710e42q15n58L14K771J210k853k278J476J424m62O68J543j086k732Q23K269L19
727A491l16K16o91k362j92K808R75k000j321K19j50K03J739Q43j508j124Q18J94
745a58N91P96M95j146j407j9R24M28P50l50j751j504J122J396P6k62m00k72n77
$$ y = [-1081, 1135, 274, 809, 1048, -307, -1571, -728, -81, 1356, 4213, 2722, -2730, -4759, 657, 3803, 1510, -179, -798, -3048, -4074, 1130, 4367, 313, -3679, -1173, 1236, -932, -719, 3186, 2843, -771, -1858, -346, 179, 1308, 3290, 2148, -3010, -4239, -311, 2565, 1435, -390, -1094, -2968, -2310, 1049, 2380, 330, -640, 562, -77, -1881, 590, 3616, 2396, -1051, -1561, -648, -100, 878, 2642, 512, -3140, -3126, -195, 1258, 414, 737, -153, -1748, -1284, 1023, 1741, 985, 1359, 672, -1554, -1535, 1470, 2753, 753, -542, -1357, -1915, -1601, 1170, 2380, -473, -2751, -1275, 149, -313, 355, 1898, 812, -1920, -1097, 1172, 1491, 1175, 1391, 700, -1662, -1854, 954, 1929, -71, -1392, -1173, -1323, -1120, 619, 1462, -46, -1170, -352, -158, 433, 1229, 1724, 578, -829, -848, 76, 504, 1254, 904, -847, -2351, -1229, 167, 243, -19, -419, -691, -1268]
764a268P89J441j02j31n27k56m58N69J492l88j279n95l77O36J85Q11m55j099p77
783a789J186P24m6K98K77q17p36Q98J273j32n95K03o12n54p4J314Q7j422n32N78
803d71n7P6Q2P37o91l45J11P37Q52j84k58m78k46K38L85N3O9q91o53M11N53r8
825f8l65J75j22j99L2O77P62k78m34k21L34j02M05L90m94o04m74O53l6j37k57
846c63K41m39j68P2N34J29j60j55K76j27O09M39l13l78l01L38j15J34o6k29k01
867b43j28K13J15o61L67N3K30l85K21M74L00m19P6l7J95N8rj05k47j90K11p6l0
890a7k84n47P05Qk05k36O81RM8j66K4k19O04L63j46l46m14N61j06j8m95m9M2M7
914a56k9l67j88M39O94n75o6j57R07n2r0j23O7Mm9J47L28q65n27M01O08l10p28
$$ y = [-1268, -479, 962, 860, 729, 202, -54, -512, 57, 1549, 1161, -118, -713, -1090, -454, -269, 542, 87, -1012, -1789, -603, 121, 75, 373, 650, -167, -903, -5, 1268, 1136, 541, 744, 132, -422, -496, 818, 905, -517, -1049, -471, -528, -452, -370, 367, -324, -669, -558, 179, 1031, 847, 589, 111, -135, 103, 488, 541, 610, -281, -934, -523, 30, -68, -433, -258, -380, -579, -547, 130, 892, 614, 180, -41, 293, 191, 596, 986, 492, -112, -586, 67, 31, -106, -363, -122, -561, -729, -657, -123, 6, -154, -309, -33, -160, 449, 888, 575, 197, -104, 234, 119, 253, 187, -42, -243, -371, -158, -43, -704, -337, -284, -54, -439, -218, 256, 556, 137, 213, 176, 371, 429, 420, 315, 68, -122, 89, 13, -17, -301, -848, -143, -135, -340, -576, 105, 114, 162, -4, 20, -199, 405, 768, 622, 276, -138, 423, 317, 299, -196, -245, -203, -156, -185, -552, -740, -301, 393, -182, -248, -405, 502, 450, 360, 237, 304, 308, 259, 406, 734, -131, -658, -257, 351, 41, -687]
937f87J81L42L80n03j63L51K99J82l64L10k26k4L95J39m28p71M21N86K59j130
957d51n26N25O76l72o38M38J74K43l3k8Q0k76P03L18j54q58lM88O81n18j378L27
979e82P67Q5n80j08J16L21q43P46L33M3j82M8L03m32k10M66P98j84j327p26J344
1000A96mk14l04k55M21l03r3N31M65p36O3N21Q3k86k05Q90J28n40j367P76J074
1021H41k62j133j50N64j82j2M79l9m26k32K06O66j24m6J15M8K21p51J33J021L39
1042A276r05j338K81Q79P4m17K95k50j023K08J086N83q46l64P91j3m03P3R18J40
1062A045r90l66m2M30L88n9n36l98n73K47J138L37m38p18m49R81M73j92l4K96
1082E40j41r25K38O97L83n82j37l81l55j63J048P18r78r20J54P56J05k5M17k52
$$ y = [-687, -506, -164, 216, -287, -450, -99, 200, 382, 18, 328, 102, 78, 473, 612, 184, -587, -166, 420, 679, -451, -977, -452, 224, -148, -786, -348, -174, 69, 36, 8, 88, -188, 515, 833, 679, -179, -182, 306, 987, 469, -909, -582, 185, 270, -310, -418, -302, 19, -824, -78, 255, 298, 116, 164, 467, 35, -175, 291, 1089, 905, -422, -1148, 196, 192, -22, -326, -581, -160, -463, -556, -25, 440, -296, -233, 288, 371, 85, -120, 770, 898, 358, -1009, -233, 841, 579, -554, -704, -140, -322, -334, 145, 106, -320, -552, -346, 320, 196, 150, 265, 313, 534, -217, -84, 937, 1276, 371, -967, -686, 193, 267, -150, 145, -105, -1128, -920, 166, 749, -97, -461, 330, 317, -86, -13, 905, 1045, 55, -311, -353, 77, 465, 406, -130, -528, -1101, -854, 284, 621, 183, -535, -984, -3, 470, 278, 244, 540, 399, -526, -288, 409, 792, 210, 73, -308, -663, -826, 222, 940, -38, -958, -804, -48, 57, 32, 449, 197]
1102A97m88Q2M95J27K12J77r11m85J34Q26j14J31j39q86o90N28J460J33p93o27
1122f31K22J89L76O69L11r96m81j02N80K10J42L3p09p57j95J071M01j80k70p58
1142h75m86R21J108J31o28k75L0k74O16O78J30q87p12M10k84L41O35o9p79j094
1162a363O49P44J49M82l21m94o90R60P55p4k37k42l57p67Q75R51l87n78m53k42
1182f40q2J43J186n9r76r7Q8K87M50N27j47j012k70M67Q02j5k4l01o16q11P61
1203c39Q53Pn94o03m5J37N57O92L5q90p4k2K54N97P79q05q67l95L13L30K69L48
1225E37o10j011K06Q40K31J73j35J4r08j98J494L14o33k33O8l0o22N70J055p58
1245C64o99l81M78L2J58L61l09q96J57O96K80L98j65k50l23m78O97O31j41k67
$$ y = [197, -291, -209, 286, 413, 625, 802, -109, -594, -460, 366, 252, 383, 244, -642, -1332, -804, 656, 789, -4, -631, -409, -220, 156, 825, 1136, 140, -341, -443, 137, 347, 489, 522, -187, -944, -1139, -68, 333, 153, -117, -875, -1361, -440, 668, 799, 171, -104, -74, -348, 268, 946, 1076, 189, -523, -113, -397, -56, 579, 510, -269, -1363, -714, 30, 179, 661, 340, -154, -844, 116, 871, 797, 560, 318, -39, -806, 69, 1020, 633, 55, -398, -640, -722, -579, 607, 548, -428, -525, -437, -150, 300, 827, 680, -332, -602, -135, 667, 652, 628, 327, -289, -1100, -339, 514, 521, -73, -676, -721, -584, -27, 665, 700, -190, -264, -286, -32, 565, 1344, 539, -328, -723, -410, -80, 189, 537, -73, -1084, -878, -38, 193, 366, 231, 245, -663, -861, 633, 947, 314, 81, 149, 119, -503, 67, 1122, 364, -335, -716, -238, -206, -48, 313, 4, -892, -735, -39, 241, 639, 474, 224, -99, -577, 120, 751, 610, 343]
1265C43n66m22J47N24M01k4p17j54o3J96N08M23m56n69q1K28N03N9J59l78k16
1286a55j37N44K37J87k52p37m16j01P23N5J10n6k73m76M51P43K50p49P8Qj60M63
1308C37K21J37o35o75J25M80j57O2J27j36l98j07O01L55n6k54k5o7o2M97K48k75
1330C43l53k64J44K28K14k80Om68j56J31L15N35n08r2j56J83N3M29J73l47j7k35
1352a22O3K55K22j87l06k78j15K79L13l13p4j1l37J40L49O08n40r3J25N1QM98
1374E35R3l42j71k20J08J8K01n4j74n09J75K55O5j55L19o06L97J97j11L74k61
1395A34j60J34j87K6p5K33k7m01j26K27m9L39l58J1K66l01K65M1J64k35J72J39
1417B32k69K32q5K4L3j25m29N63J38m48J6M5j95O7K08J40l20J49l60O51J2Nj89
$$ y = [343, -223, -645, -498, 26, 427, 403, -314, -468, -531, -335, 173, 596, 140, -429, -510, -282, 221, 280, 439, 61, -155, -292, 252, 489, 676, 424, -313, -729, -830, -107, -52, 58, 2, -271, -747, -296, 447, 697, -52, 26, 34, -126, 337, 558, 695, 60, -615, -490, -10, -167, -105, 22, -114, -512, -619, -18, 337, 281, 27, 2, -65, -127, 370, 618, 343, -10, -274, -130, 98, 312, 32, 38, -430, -586, -455, -140, 395, -113, -205, -361, -178, -125, 304, 477, 130, 113, -122, -59, 196, 418, 231, -75, -353, -468, -189, 124, -189, -263, -274, -611, -471, -122, 486, -54, -147, -22, 29, 37, 535, 628, 286, 115, -105, 3, 21, 222, 168, -6, -515, -340, -85, -20, -175, 144, -462, -65, 132, 21, 395, 134, -26, 108, -79, -53, -128, 105, 78, -323, -449, -222, -271, 68, -290, -279, -13, -314, -49, -8, 156, -79, 93, 232, -37, 195, 110, 134, 167, 42, -387, 176, 314, -134, -118, -73, -268, -201, 7, 147, -173, -24, -384, 267, 279, 284, 95]
1440I5J3O2j04Q0l48M32o7k07k2l08L7J35Q7m9j10N0o1N60j03K4j35J63J22n01
1464a55J21N5J94Q0l05L8k69J84J26k19q3R7j47J86J47j1j81K05r0M62l58J2K
1487I1J47l52J07K84k29J26m12J47q8L21l60J98J26j74j83K30L67k50j04J91O
1508A89j4k55L36l72L48k59k00J93J74l71K9L2j56l3J22K46k4O7J04l6j66J41
1530I5k35N69l34m15L36J10p8l21L4J09j88K88k26K32R8l09J29j70K05K34K4O
1552A93J16k04J47j19m0k28o5L23l30P4K5j21L41k41r6K72m4K98l92J29J63k59
1574e8j41P24k07l73K99l48j89K36j7J8k00p7jJ18K31N1R9j66j0L8N3J58J35k65
1598A08j38J80j62P8P3k56J99l13J2n9L37O0j49j98j66N67k06M19j80l24K99k97
$$ y = [95, 108, 170, 66, 146, -202, 230, 163, -44, -66, -374, -337, -202, -115, -164, -274, -224, -285, 275, 172, 196, 61, 224, 346, -155, -34, 21, 215, 295, -10, 28, -241, -57, 69, -150, -233, -136, -283, -97, 50, 39, -142, 63, -27, 435, 77, 89, 91, 238, -114, -7, 277, 48, 174, -238, -91, -179, 142, -218, -20, 106, -68, -251, -21, 346, 96, -8, 183, 189, 175, -80, 256, -116, 232, -27, -227, -34, 140, -231, -202, -170, -326, -359, -237, 9, -15, 52, 156, 120, -46, 95, -140, 429, 95, -320, 16, 126, 48, -273, -239, -130, -318, -30, -256, -24, 74, -235, -106, -276, -71, 163, 187, 193, 309, 105, 252, 133, 93, -135, -200, 123, -207, -133, -108, -229, 112, -129, -225, 47, 3, 301, -91, 38, 201, -58, -199, 525, 318, -55, 244, -104, -293, -57, -74, -56, -256, -333, -334, -216, 15, 66, 165, -1, -11, 27, 80, 238, 373, 108, -30, 150, -12, 66, 139, -117, 82, -231, -219, -278, 59, 119, -30, -228, -394, 173, -33, 386, 206, -118, 181, -116]
1620a16k0M33pJ35k41m61K47R9o7J26j20l60mK02K62p2l3j90k9R1O9N80j89k77
1644E8m4k24J70K68k3M6m86J81k23O8J32P8k07j81K53K68K42k20M5j72K6N9N4
1667A68M3J73j31l44k14K21J81p8m5k03J18j33K59J48q1j60m1R9J58P0K16j04
1689C20k62m0k06J79J81J17n01k09J44M0j05M73Ql5l33J54j87O18J61n41k35K88
1711B9n0m1M38l81l03j81L64J51K28J92k92j89l38L08J32L0L21p15K20j34L31
1732A20K74P4k09l09j22oJ11q7K67m07J86l27K2M97J34l03n1J29j75jQ6Q16p75
1755e6j28R1J80J14kj40k77mo8K45K61k06j77r1J91J74r0M43k39k04n4J26J78
1778B67J0j39k93q8P5O1L11oj26J05m97J67QK21J14k99J58k02K56K68J32p5m63
$$ y = [-116, -136, 297, 290, 425, 184, -277, -30, 69, 2, 128, 8, -352, -356, -154, 108, 36, 3, -187, -216, -125, -56, 524, 335, 58, 14, -210, -40, 228, 205, 251, -235, -54, -277, -209, -77, 1, -206, -387, -134, 134, 376, 156, 201, 29, 55, 114, 168, 211, 384, 253, -91, -305, -84, 97, 19, -26, -229, -111, -244, 15, 163, 82, -78, -119, -20, 138, 208, 424, 320, 58, 18, -188, -9, 172, 289, -212, -421, -277, -237, -342, 131, 139, 104, -229, -75, -262, 356, 517, -24, -259, 29, -21, -62, 376, -5, -308, -489, -125, 26, 254, 446, 154, -35, -373, -65, 67, 97, 418, -297, -77, -211, 120, 394, 468, 259, -50, -172, -178, -67, -154, 113, -294, -108, -435, -413, 84, 218, -85, -136, -7, -182, -183, -97, 719, -56, -184, -93, 87, 201, 199, 59, -218, -222, -290, -45, 216, 10, -167, -258, -67, 107, 17, 460, 221, 17, -37, 89, 267, 277, 138, -155, -243, -168, -107, 204, 198, 72, 177, -320, -153, -145, 76, 190, -109, 49, -153, 103, 371, 503, 428, -35]
1801c5L7j26J84m4j44j46J45k23M3J51L62K34n69o4L62M0m4o3PJ2k14mL94K5J87
1826E07n82K54m81L24M0j34K83j82n23L72k09K66K68k60Mm2K27n3J34q2R8l75
1848a46L73j18JN4k73Q9l51J79K62o7j38J70j75KN1L67n2k33K2J03J08k71K33
1871A90K7k06j53K5N9J45p1k55P4k11M26l5j7J57j9m80M91k2J12j63N5k53Jj44
1895b67J97J7L12n4k55k67J22J86j93K60j78K14j77R2J96m14K58K33l16K42Qj27
1917H9j31k90J09L5Q5R5J93J41n86q3J91K64j07J95k7j41J32O4M0l1l89r3K7N6
1941a62K14k14L04j19k27Q7J76j11j86j56N40j90K79k26J47l5l4J3j04j58M6n7
1963a73QJ98l2L43l05m4L5m63L79M2R2J18l1k9k57L00o9j62K5K24j90K5j47K36
$$ y = [-35, 2, -124, 60, 16, -128, -274, -129, -352, -309, -158, 204, 438, -131, -195, 167, 207, 163, 100, 107, 119, -95, -99, 295, 320, 507, -75, 179, -302, 22, 62, -72, 211, 29, -494, -122, -331, -65, 203, -57, -53, -95, 132, 79, 213, 131, 229, -146, 227, 109, 110, 164, -109, -20, -371, -192, 70, 3, -135, 35, -140, -138, -87, 280, 228, -5, 17, 120, 228, -43, 190, 217, 11, -142, -117, -58, 87, 16, -239, -165, -376, 50, 15, -2, 155, 136, -344, 147, 125, 237, 74, 129, -124, -123, -267, -70, -53, 259, 205, -50, -317, -195, -9, -202, 58, -120, 94, -83, 9, 205, -209, 49, 282, -34, 208, 216, 89, -42, -332, -223, -188, -103, -8, 185, 326, -260, -343, -152, 112, 5, 200, 173, 32, 164, 228, 268, 237, -152, -245, -218, -162, 52, -162, 142, 23, -204, -117, 59, -52, -238, -394, 146, -44, 235, 9, 156, 121, 87, 100, -4, -162, -116, -173, -165, 33, 1, 344, 39, -5, 30, -433, -54, -12, 80, 198, 167, 138, -119, 181, 112, -50, -25, 199, 9, 34, -113, 123]
1987A23k18P7m4M3o5K7J06j41j01j9J98J99j57K56j52r3J38l95J62J94Ll32K52
2010F1n7j17L1Q3L4J16q7m0m27K83L40j78r6J57k85J67n3j15K65l08J94J74k44
2033a02K3L8J65j5l3j02j26K69j40K3j38J54M4J16k42K54k18J32j02j3k48R8n3
2056b16K75j00j18p2J36K47l19L03j36J93q4l9m1l4K32j85L88n19j42J77J3K91
2078B50m79J36J88l39K24O0j25Jj40J66j08J95j05J72j32R8N6j04j65J99L5k87
2100b04J52P0k37L8J23K34k11R1K3O4j06k8P6K61k36j11J50j94M6l46M57j53K1
2123b0R4l51K97r8j05R0J86K75n18J2K20k21K03J36j58j07K06j45j34L07k29j6
2145g6r4J47k84K49j19K55j67k05M0J02O6J5K16K20k32j12K94j94N2j32K95m30
$$ y = [123, -95, -18, -62, -19, -84, -57, 49, -92, -193, -212, -14, 185, 28, 284, 132, 39, 177, -218, -56, 138, 141, -191, 61, 4, -113, -82, 1, 35, 151, 64, 24, -403, -120, 220, 42, -54, 103, -182, -15, -68, -183, 82, -226, -32, 142, -102, -79, -41, 124, 109, 76, -26, -152, 117, -23, 0, -138, 16, 60, 176, -66, 188, -30, 102, 0, -13, -261, -163, -216, 59, -41, -159, -231, -95, 152, -167, 136, 0, 193, 109, 70, 29, -5, 227, 42, 430, -89, -231, -54, -41, 250, -229, -93, 95, -244, -20, 40, -85, -84, -224, -58, -166, 29, -76, 96, -36, 62, 118, 14, -151, 48, 83, -204, -52, 18, -219, -181, -58, 176, -35, 56, 79, 143, 37, 9, 85, 346, 110, -1, 149, -45, 1, -345, 112, -41, -20, 74, -277, 20, -78, -183, -93, 93, 368, -150, -138, 82, -139, 64, 200, 42, -65, 141, -4, -138, 169, -60, -76, -170, -23, -307, -58, -177, 78, -89, -294, -254, -152, -86, -71, 145, 365, 133, 21, 315, 121, 173, 41, 336, -94]
2167i4j12J84N7j98J77J15k45J65J57r5j71K27pj83j53K42J5Q2m4p0jJ65l18J41
2191C6J7l11K96r2q6R2L26k45K74k55R8j14J59m56K76o2R4k02L79p9k03j02J60
2214@m5J3J44j58j59r0M39l27j9J49J33j98J36J41mJ83r1m03LJ89l17Q5K93P2
2238A69l35M3K8Rj20M44j26q7N1j54K79p7m25M99m35J9K89J80o61J40K44k55m0
2261c21L60j55K61j26j82J18L91j92L6k54J41j21JpO6m3O9m22K87J61J30j99o2
2284f3k49K52j94M99m29K29j12L22r6p2j12P2O8j36K49n38K65j62K21Jo3l40M75
2307H7r5M20r0k60k20J54j26K88m02K84L74n71K86j09K33j84l08p1j01M20J99
2328B08l01J11j75P2m7L77k10L1J0q0O9q2K84k36j22l5J68j54q9J11j86J59k24
$$ y = [-94, -206, -22, 35, -163, 14, 129, -116, 49, 206, 111, -60, 167, 160, -23, -176, 66, 81, 163, 119, 49, 48, 213, -105, 36, 53, -258, 38, -54, -140, -48, 278, 33, 307, 52, 150, 36, 195, -261, 15, -47, 47, -155, 224, 145, -58, -160, 0, -45, -32, 112, -46, -205, -295, 144, -183, -202, -53, 80, -118, 18, 159, 155, 338, 247, -156, -153, 36, -281, -196, 97, 169, -166, -123, -95, -86, -206, 238, 112, 25, 76, -78, 201, 124, -301, 198, -237, -218, 71, 251, -410, -270, -26, -281, -321, 39, -116, 145, 19, -163, -45, 346, 154, 190, -64, 77, -44, -43, -50, 16, -27, 42, -380, -93, 68, 198, -1, -63, -312, -60, -254, 245, -184, 45, -67, 255, 159, 87, -25, 47, 115, -21, 228, -310, -45, -207, 14, 15, -48, -388, 87, -8, 412, 322, 62, -158, -4, -130, 158, -244, 40, 414, -157, 129, 20, 253, 69, -239, -310, -411, 9, 208, -93, 18, -157, -85, -132, 245, 35, 66, 76, -4, 65, -17, 267, 31, -91, -126, 42, -112, -201, -90, -276, -117, -341]
2351c41L40J04K49k20N0j25l61M95j8o9Q7k94K41j94JK07j14l03M3K63r5J88l10
2374a76K55k21J17K45k22j04M00k23l4r9kL48l6K3m41Q9q0j65L66P2j79O4j7j8
2398c8k3J99j71L01k99P5J11k71L32L3l24O1Q9j08J36Nj68J46k52KJ36n1K6j14
2422a67J79j0j9j97K11l1R0j33O2J54m20K26J94R9l56r8J42K78k17k11J15L44
2444B35q9j75qoN3j2L0p1j22J33j0J56k49K84k91J74j37J28k4l9L3j23Q1J66J12
2469B29q4l56L14P7M7l69O2O7L0J5j85mK25K4j47j09m7l3L45j49J21pN3L3Q8k78
2495c8J49l1J93j89K32k89k62K10j57J70O6p4l5q9M62k60k9K3k02M43k90J03j58
2518e2J12K32r8j58q7K36j81k93R2N5j11N08k97J05j83J83p7L04j51l7j1j22J33
$$ y = [-341, -1, 103, 352, 132, 182, 57, -304, 191, 173, 104, 191, -103, 138, -56, -55, 152, 38, -265, -222, 41, -54, 134, -176, 79, -142, -25, 220, -2, -106, 294, 71, 37, -62, -64, 284, 248, 271, -170, -81, -161, -326, 40, 112, -67, -3, -20, -38, -61, 138, -33, 268, -31, 44, 155, -116, 216, 249, -75, -14, 75, -33, 103, 108, -60, 86, -166, -164, -28, -79, -53, -167, 12, 2, -17, -214, -3, -34, 56, -77, -15, 139, -281, -55, 139, 238, -118, -216, -74, 204, -13, -224, -109, 235, 146, -29, -37, -43, 10, -2, 28, -43, -165, -32, -42, 114, -135, 149, -142, 32, -105, 23, -1, -40, -7, -130, -49, 117, 229, 145, -211, 103, 180, 227, -142, -80, -13, 17, 32, -153, -157, 68, 92, -55, -164, -211, -244, 101, -48, 73, 66, 119, 152, 240, -38, 111, 80, 273, 84, 316, 27, -235, -25, -182, -12, 54, -20, -55, -144, 318, 58, 29, 52, -150, 293, 3, 106, -52, 60, 292, 194, 36, -51, 185, 4, -289, -197, -142, -253, 255, -42, 63, -120, 63, -14, 290, 139, 102, 91, -31, 102]
2541A02q9O9q2j74K45j06L0O9j38JJ41m6L4o6P7L2j33j37J96JJ73j56M6K48r7
2566B40k01l33J48l8K87l52j9K14j1J51j39J78l30J72O2J00j80o8K81k92J83j20
2588f7k6j37K63j2N5P0k41K32j87J27j63k5M6P9j24p9L88q7m14L88j86j1L06l03
2612a08JJ30k89J87J06k09J14l8J50J95o3j56K47k49m7K46l7p8j59K46J84l74
2634aJ15L9k83j26L9J5J12R9r5J20N1m64L30J07rm2r0J27kRj19J05j30N4R8k21
2660a62J75K71l39J18p7k53K66K33l6K06m92J92r0J4J4oJ35j77%n9M75m59J47
2683I6n32L35o6j6K73k54L3O7J34k4j33J08J53l62K11J06o5R0j31m5j60K37k88
2706b33K09J20k22K48k23j3P8J26l2L1N6j19O6Q8mj56QK6o1l8PO7Qmn9J09m9K05
$$ y = [102, 13, 82, 0, -174, 71, -35, -5, 64, -74, -73, 68, 22, 56, -10, 67, 99, -34, -171, 25, 26, 199, 43, 89, 337, 240, 39, -294, -146, -184, 103, -249, -268, -54, -65, 86, -53, 125, -205, -33, 29, 129, -51, -119, 162, -130, 53, -67, -93, -230, 33, 21, 76, 146, -95, 137, -50, 77, -86, -111, -65, 14, -110, -189, 199, 112, -302, 86, -100, -111, 195, -108, -107, 23, -266, -79, 27, -182, -68, -106, 44, 239, 176, 20, 267, 18, -29, 217, 180, 102, -57, 189, 373, -1, 114, 153, -130, -256, -217, -202, -90, 9, -86, 34, 85, -379, -49, 58, 49, 7, -83, 44, 42, 51, -68, 37, -93, -39, 59, -162, 13, 284, -55, 63, -14, -267, -1, 232, 196, 402, -90, 102, 12, 26, 40, 34, 169, -8, -8, -67, 408, -51, 96, -436, -101, -167, -183, 90, -164, -131, -64, 70, 46, -87, 21, 174, -188, 23, 129, 64, 154, 23, -22, -182, 55, -233, -24, 96, -126, 122, -101, -114, -36, 90, 58, 89, 145, 26, 92, 180, 176, 20, 28, 54, -7, -45, -38, 29, 37, 33, -26, 83, 34, 239]
2734B39j24r2j29K02j27k18L30P5k62J03p9J02L72m73l5L8K73j71J45j1l16J50
2756hj51K67l23K03J72j9l49L44l6m7j4J71j64n5j97J7J94p7N6K51l31J22J7J9
2780F2J13n8l13K80j49j5J66o4p1o0K91j80k01J09K0m8k08K18J96p8K0L9j4J96
2804B51l53N5o2J71K2k93R0J81r5N5K3p9K03o3o4j50j93K55L7R0q2R1K24l24j17
2829a27j45K71J02q7L33k31l11L43k16k6K50k69P2j79N2L23J8j26j00K3R9l4K68
2852C03l86j16J03J70j42K65l03K45k17J48J00r1J0k66K41k41K0R3rJ11K0j91
2874a33M40l14L26l92M5L6K7p4J66q8j94K13k64K69P5l06K00j25p5M26m46L66
2896A78k04M7O5P1j64J21k14j69K53k01J10m4J40J06r9L7k93J99J64j72N2M3R1
$$ y = [239, 115, 23, -106, 96, -31, -249, 81, 156, -106, -3, -82, 20, 392, -81, -116, -78, 195, 24, 169, 158, -158, -8, -159, 108, -215, -12, 160, 141, -208, 136, 100, 53, 39, 210, 46, -9, -206, -189, 5, -72, -16, 235, -96, 26, 43, 62, 175, 117, -196, 84, -65, -80, 86, 22, -49, -109, 182, 2, -199, -90, -70, -118, -326, -108, 88, 10, 30, 69, 55, 251, -102, -47, -109, 62, 84, -209, -119, 62, -33, 22, 45, -34, 169, 106, 42, -108, -301, -46, -9, 81, -1, 90, 314, -10, -127, -272, -1, 101, 14, 347, 116, -195, 148, -68, -94, 156, -113, -41, -220, -168, 155, 173, 47, -53, -30, 69, 35, 303, -83, -199, -96, 74, -68, 197, -106, 139, -78, 70, 170, 79, 89, -177, 64, -177, -157, -64, -73, 38, 58, -133, 307, -7, 319, -73, -28, 8, 35, -39, 127, 39, -155, 58, -206, 63, 138, -168, 32, -93, -168, 258, -188, 178, -26, 21, 86, 157, -7, 114, -100, -269, -16, -217, -107, -151, -11, 95, -4, 33, -260, -61, 103, -69, -17, 26, 117]
2919A17j08N1k58K85k8j12l8J46l73L42k71L65k06K4r1O4K69j70K10k72L2M4J37
2942A59k82J21K97j98l85K72k4J57l44K12j55J53p2J93k43J58J68k28J81L3Rj16
2964F6j36q2K58l27Q7K12j66j34M34k05j4k32kJ71k3J27o4n2L9j51K29k18L96
2987B13k23kJ35k13J64j19J0n0J66k73L19k29J77RP1j51M7j63O4j3j57K05J16
3010A03L0q4q6J76l13M1k9L0Q9J1k2j83J05K09J5k14M77l27o5o7K90p6q1j65l2
3035a68L04j8j11k01oJ07L13j78k07K11J17n2pj57J8n9K47j33l47L86n7J74k59
3058h3K01l8p5k41r1N47K8l9k51J34J05o9l32J30M36k88k26R5J16J10j10o0j00
3081a01n5K6J24m08L02K81j40J19j93N1r4J00Rm7n1J07J43k96J55J01l00K2K74
$$ y = [117, 9, 60, -198, 87, 59, -53, -91, 55, -318, 24, -247, 118, -88, -64, -155, -91, 178, 8, 218, -54, -22, 22, 159, -123, -2, 295, 97, -288, -16, -40, 117, -227, -15, -170, -17, -89, 104, -139, 19, 187, -41, 140, 173, 182, 66, -70, -152, 106, -221, -134, 78, -88, -222, 212, 7, -7, -239, -241, -70, -93, 34, -30, -82, -43, -194, 35, -183, 213, -10, -12, 123, -90, 74, -45, -35, -85, 81, -192, 127, -102, 75, 84, 155, 4, 51, -112, -48, -61, -218, -13, 103, 133, 49, -37, 139, -174, -133, -162, -132, -43, -32, -54, -237, -132, 77, 92, -122, 355, 28, -37, -104, 186, 110, 29, -136, -168, 136, 118, 7, -194, -200, -93, 220, 42, -165, 46, 163, 111, 104, -53, -35, -94, 153, 20, -327, 59, 2, 176, -83, 118, 80, 5, -236, -327, 220, 248, 209, -42, 92, 197, 128, -204, -74, 362, 74, -152, -57, 59, 169, 59, -1, -101, -156, -130, -6, -414, -112, 169, 29, 148, -45, 6, -88, 12, 21, -26, -77, 30, 173, -123, 32, 133, -167, -145, 129]
3104A29l17L31l55jK27j43L52j38j75J56n6Q1j53O6L11l34J10M6k8k21j4K2k2
3127a26n0J12j8j28K22j89J36J70j53kK01l0K14m80R7L12k55K2j17J46p0Qk72
3150b50L78j08l9NO2J36l36O1J27J72j63rk47L57j17o4l0J12Q8p3k04l1J42K68
3174B37l21K25L9l1o1L2l3K5l7l04J96jj9J76q6j92P1M4J90m0k74P9j47J39j03
3199a96J20N4J90k30J93O4k63J4k41L55O4LJr0J1K26l66J33j26o0P8j5j58M6J03
3224i0K05j61q9L89m03M46k07nP5k80J92J19k67R6P9k11K2N8N6j23j41R8Q3J9
3248d0k19M98j13p5N1J40P2j88j7j42o0K85l53L54j98j47K45k40k0L44j88J57
3270A46p5J9j03J19j3m08K47M49l30l6m3j8j58J64j21K46r1j35j4N5Q8M1J06j0
$$ y = [129, -188, 143, -212, -213, 14, -129, 223, 85, -90, 66, 10, 91, -62, 4, 315, -19, 91, 137, 109, -112, -126, -104, -126, -176, -64, -82, -210, 12, -177, -41, 129, -24, -26, 175, 145, 359, -121, -24, 288, 33, 55, -62, 84, 14, 22, -250, 128, 20, -19, -14, 48, 184, -152, -91, 36, 208, 45, 36, -211, 146, 29, -35, -65, 47, 135, 62, -142, -173, -31, 237, -84, 141, 180, 149, 88, 120, 87, 112, 75, -229, -33, -34, -53, 123, 37, -155, -84, -40, 150, 110, -164, -85, -232, -93, -196, -76, -22, 168, -62, 131, 195, -68, -54, -295, 60, 124, 127, 128, 38, 49, 275, -91, 42, -84, -144, -66, -81, -239, -193, -90, 115, -46, -135, 254, -149, 297, 90, 85, 160, -120, 72, 191, -76, 20, 99, -112, -90, -32, 24, -99, -240, -142, -59, -40, -259, 239, 126, 51, 102, 242, 314, 126, 109, -33, -93, 192, -161, 193, -5, -152, 93, -147, -167, 177, -11, 146, 71, 90, -13, 106, 93, -315, -68, 381, 51, 15, -28, -46, -204, -40, -161, 85, -6, -141, -155, -100, -12, 29, 135, 125]
3294A25J19l32K74l73K48j54J83Qk94J98o7Q7j54j7K15j21K6k40K97p6n4R5M1
3317C4k33K56j4Q5Q7j03j05K81l68K9k04J58k09L29n3J35J69k77N2j37j10L91
3339A93m46M33k99J91n4p0j6L46o9k61o5J64n3m4l7n5K17K5k34K05j48K12k32
3362i7R0m6J8L17n2j53l30M11J07l87j31L22k93N6J29k17J27o6J65o6n3Q2J36
3385F9j36N1K99k74j04R1K11l8k40K0P8j34q0j77J80K12M3R6m17L51r7m1J24J21
3409B08l13J15q9K2J97k50r0K61j94K6J44o5J03J9j15L08j62k41M33k73J74l05
3431h7K29j3m9p7J59m5p8LJ7K25k98L5q5J41j01j3J90J83k03p5Q6j25j07J31j5
3456B8K07j50j55L8m62K19K44oq3J98r9o3j02j3J38J50m6o6j66J03J17K73m34
$$ y = [125, 244, -88, 186, -187, 61, -93, 90, 98, -196, 2, -65, 22, -132, -149, 66, -55, -29, -269, 28, -48, -102, -7, 34, -199, 57, 43, 128, 215, 112, 7, 288, -80, -51, -255, -97, -306, 23, -30, 105, 274, -3, 49, -88, -198, 193, -253, 180, -119, 72, 18, -52, -68, 278, 209, -52, -117, 47, -6, -50, -87, -142, 75, 100, -134, 71, -77, 135, -97, -7, -53, -35, 282, 230, 77, -253, 158, 265, -122, -253, 69, -224, -168, -39, -256, -129, -195, -30, -96, -149, -67, 69, -67, -16, 283, 9, -95, -4, 207, 169, -71, -51, 27, -107, -187, -364, -184, 28, 71, 167, -250, 101, 4, -37, 87, 208, -105, 10, -79, -57, 140, -110, -200, 61, -133, -107, 37, -28, 75, 94, -21, 287, 125, -116, 317, 44, 218, -87, 142, 129, 80, 3, 162, 117, 39, 42, 59, 284, -14, 21, -64, 77, -24, -37, 153, 336, 133, 58, 144, 19, -88, 43, 28, 235, 85, -70, -32, -494, -275, -31, -37, -120, 78, -21, -84, -186, -199, -61, 89, 43, -23, -189, -86, 31, 304, -130]
3479a30L45j98L4p6Mj35K20k06J5K7J10j11J13Q8l52L47l57K00J19o6L06l20m0
3502f3N5j37K3j05j02R8K80J12p2n9o0J56m21L70n1oq2l1J16K14k26n5J31k05
3526a20R2J6n1K59j58M9l17J09L14ql08N8j10J5L49j24k08K55j7q0K25j99LK42
3550B86l7n29L14j58JJ44L2r7K47j95j16O9Jk4M11m1j87k06K12j51L04j37r2p
3574D4j33J00k44O01n06J0J94k6j52n6l0J90O0J20N8j73r3J60m0j83R0J97r1r7
3598@j6j07K16o7K98k28q6j17J75j5j09L53J06r0k34j67O6K42Nl00K74k2j50j97
3622a70J54M3J78l11L9p1J09M6j20L3r4J42l12J95J90n0R1n8j14L5J28N9o3j15
3646c6P7O1p0J72J8k26R7L5j25L10m30L80j1j46m32K30J36N1j09Rm2K11j49P8
$$ y = [-130, 215, 17, 51, -25, -21, -156, 64, -142, -127, -100, 10, -101, 12, 100, -252, 95, -262, -62, 57, -9, 297, -23, -63, -8, -145, -122, -227, -329, -231, 49, 161, 89, 30, -30, 126, -295, 75, 24, 18, -64, -95, 21, 235, 9, -46, 85, -120, -28, -12, -63, 196, 38, 87, -230, -121, 193, 185, -123, -65, -175, -160, 189, 65, -143, 112, 95, 15, 240, 41, 44, 286, 249, -280, 34, -124, -123, 21, 53, -44, 203, 8, -108, -39, -38, -62, 349, 308, 121, -85, 127, -24, 280, 143, 51, 44, -89, 11, -233, 368, -138, -128, 66, 40, -112, -168, -198, -8, 52, 172, 230, 57, -36, 124, 84, -99, -9, 188, 97, 0, -16, -123, 93, 26, 324, 96, 10, -107, 68, 53, -56, 297, 403, 313, 79, -88, -22, 220, 225, -75, 199, 177, 27, -170, -16, 27, 205, -106, -67, -138, -29, 17, -103, -70, -164, -22, -334, -139, 51, 1, 92, 34, -80, -45, 83, 142, 79, -36, 41, 102, 32, 204, 222, -4, 93, 128, 3, 313, -117, 263, 252, 106, -326, -96, 40, 91, -18, -9, -51, 160, 11, 89]
3670H9K56l21o1l3j08q3L73j34J1J09j15j88K63J7Q5j25N8j81J55l4J28k61J08
3693HJ05o0j12j80L33l8m7l50O39k83j11j5J61j26p9J97l9j16J26J56k28J9n2
3716i2J10R2p5j97L25n4m8j78K56n8K60m10l18K00R5K27m85N18l31j04K50J32
3738A15j66o8O4R2J26l65K39k8l7J22P6m28M99m27J6Q8L53l36M4J97k54L7p1K19
3762A07L4r4j74K71J19k31k39L24n5j21J49j22J32k05M89k87j77K20p8j94N8J42
3784F8L8j05L22l94m3N7J01j07K02L3K2p1rk23J9J29K0j94k3K76k37r0K17J1P1
3809I0Q1k62J18k23M9N1J77m5K15m24J73Or0j09m5M29j62j45J52J14j36l17K89
3832a4q2K58L9j83O3k5J51j97n9j31k82O18j27k09L34n83J68J47l1M63m67J76
$$ y = [89, 345, 24, -37, -70, -178, -261, 112, -22, -11, 98, -17, -205, 58, 75, 160, 35, 93, -88, 67, 33, 161, -100, 8, 113, 53, -59, -239, 94, 56, 9, -341, 298, 15, -96, -111, 50, -76, -155, 42, 3, -113, 13, 169, -59, -40, -92, 18, 110, 35, -162, 163, 109, 61, -117, 139, 81, 341, -69, -387, -187, -92, 135, -350, 168, -163, -267, -17, 115, -51, -119, -55, 37, 163, -202, 37, 9, -28, 94, 170, -258, 241, -186, -170, -82, 271, -65, -21, 176, -78, -41, -112, 107, 141, 47, -127, 144, 263, 32, -207, 117, 62, -59, 90, -32, 100, -105, 384, 97, -80, 140, 62, -132, -74, 68, 106, 1, 323, -71, -114, -57, 44, -63, 139, 172, 194, 123, 114, -109, -90, 39, 59, -135, -158, 118, -119, -209, 8, 19, 90, 171, -91, 27, -196, -147, -96, 81, 36, 251, -173, 0, 6, -84, -193, -238, 191, 29, -116, 36, 150, 14, -303, -14, -96, 162, 201, 18, 81, 56, 207, 10, -49, -180, -462, 156, 29, -180, 154, -429, -261, -114, -145, 318, -149, 27]
3854B7J32j67J13J6j80J09j26K34j02M5p1m4j82K81o1R4o9J24j57L4j75K05P0
3877A50k26o5Q8K17l85L01k36K5J15j5k9R7O6J8m0j47O5O0l3l7J21j22k19L31
3901A00l24R9j41K13jL25m15p8n0K53K18k72j05M18k41P2j2N2r1j03LL06j69j8
3925C9k32j7j0N1K49j61O7P7l27j87L45k20R5K60k59L50J49l55J29P1n5M2K0n82
3949d61M61J11J79n27K55o6k1O2R5j9k47K33k98R1J60K21j04m7j16j4n9K10j36
3972c7J77j67k67J75P7j27j8K43J8j35K47k43K12r7q5j24K12M2j12J16k41K25
3994I1J09k0k90M8J01Q8l28K9P9K4q1O6N2l4r4L34q8j70K19k16MO2K1n4M2K04
4020A98J59l40J24j59k00M05j46J36J8P2k07k08J76j7J14l73N8j3L31k4j13j9
$$ y = [27, 159, -8, 105, 121, -59, 50, -76, 158, 56, 101, 30, -14, -196, 85, 24, 118, 49, 173, 16, 50, -125, 80, 150, -76, -141, -53, 164, -221, 80, -156, -131, -16, -31, -60, 37, 103, 121, 81, -66, -1, 59, 26, -11, 110, -12, -231, 100, -224, -125, -266, -53, -54, 271, -144, -222, -272, -19, 199, -73, -178, 240, -1, 71, 59, 111, 20, -83, -80, 226, 57, 39, -193, -210, -220, -169, 80, -81, -14, 63, -264, -451, -106, -326, -231, 29, -230, 120, 269, -86, 43, 114, 59, 101, 121, -461, 0, 111, 290, -237, 18, -48, -69, -7, 88, 69, -178, 55, -243, -152, 8, 229, 125, 78, -38, -52, -111, 99, -37, 140, -27, -294, -119, -42, -169, -187, 56, 74, -61, 186, -57, 155, 58, -27, -151, 61, 103, -9, 107, -134, 91, 200, 180, -110, -62, 39, 127, -201, -172, -93, -69, -150, -84, -32, -66, -160, 174, 86, -84, 135, -81, -77, -15, 6, -48, -6, 198, 357, 17, 141, -18, -218, 187, 41, 177, 195, 267, 60, -148, 28, 11, 125, -248, -190, -203, 128, 104, -9, -28]
4042b8Q9O0j91J29n8O5k84J04PM53m66R3J40n5M2J37j11j26J66j10J12m30K48
4065a4L3P1k86k1J23P3j65q8K47J6K21k80K25k15K89n02L87l6K2M4p2o5p2k41
4089c06L93j75n8K6J73r4l95N35k19q9O5L51k22P1l0j98K83k15J49o3o7j04l0
4112b19J52n0N5J06o1K27l90J37K43j46j68M90o64j0L96J47l49M76m97J46J06
4133A27k85L56l00mJ57P5q0j13J56k5K60m93L29n9q7l1o5K11l76lL97o0o2j48
4157a23j29L00j69J59k10p4L72R9l34J47k13L21l25R4P0J48j81L01l11J09k20
4178a69O7Mk0Q8o8K25j74J17K01k56r2J64lok91L40l88J55K76l09M16r4k74L17
4202B26k79q2L61k43n8K84j53j0j57N1j02M2K27j42Q5l20K97J87m66L7K26j15
$$ y = [-28, 61, 121, -70, 59, 1, 66, -218, -114, -107, 346, -120, -27, 113, 58, 100, 237, 126, 0, 166, 56, 168, -262, -14, 19, 90, -196, -217, -94, -21, -186, -274, -27, -11, 210, -70, 155, -60, 229, -273, 114, 78, 100, 144, 72, 7, -65, -306, 87, -88, -146, -120, 53, -41, -436, 99, -120, -209, -144, 207, -15, 56, 26, -172, 111, -104, 45, -18, -85, -189, -219, -67, -117, -62, 44, -17, 210, -180, -43, 200, 54, -114, 376, -288, -298, 98, 245, -104, 372, -125, 21, 127, -158, 198, -102, -106, 51, 126, 46, -67, 89, 64, 324, -169, 160, 101, 14, -17, -82, 129, -247, -250, 147, 87, 25, -123, -252, 48, -121, 38, -172, -246, 126, 225, -109, 38, -175, 146, -179, -85, -15, 133, -48, 253, -58, 51, -169, -102, -98, -118, -30, -98, 127, -47, 70, 271, 15, -77, 87, 84, 78, -213, 127, -261, -106, 170, -139, 277, 183, -91, 226, -53, -135, 226, -17, -75, 209, 56, 46, -111, -60, -162, -120, 107, -35, 50, -270, 27, 214, -252, -215, 11, -104]
4224a04K79k80J54k75J31lJ85j71n2l8J09j8K2K2j88K81J1J71l74K61l78K28j40
4247a67K9J08j59J89R6k7l99J76J16M03j97j58LP2N5k46L05l14J35j60p7J84L17
4270B84n20K13J44q9j08O0j9j53J62k72L18J13j64K8J73l36j16M3L21j77l6J88
4292E7M1l94L99k64m6J98K67k29O1J59n19M16j0P9O9o21L26P4k6j25j30RJ82j69
4316a96o6J66K29j54K64j13J93m07P4J41k28M9R9j88K66l80J65K06k6K0m5l5P6
4339A10j91j14pK54k36P8M0J75k1j35j71K31j52K27N4j45k59K93R0J13m08L5L1
4362a08k03J36Q6J00p2K70l68L38k28l8J13O5k26K35kj60J44J42j43j62P5r7J62
4385E9j22L06n5l75O2j46K41J77j7l7l38J98J86M0l36P9J22k05K14L9k05K59j03
$$ y = [-104, 175, -105, 49, -226, -95, -98, 87, -84, -136, -174, -65, -83, -61, -39, -227, 54, 65, 236, -138, 123, -255, -27, -167, -138, -30, -189, 0, 96, 69, -330, -154, -38, 365, 168, 10, 13, 85, 140, -106, 199, -115, 20, -140, -217, -33, 284, -236, -23, 121, 32, -76, -16, -35, -188, -26, -298, 20, 133, -31, -3, 170, -166, -282, -239, 82, -95, -131, 57, 98, -296, 103, -161, -207, -9, 258, 29, 90, 249, -270, 146, 136, 215, 284, -337, -11, 63, 37, -88, -218, -209, -27, -196, -262, -96, 133, -21, 243, 130, 323, -84, -10, 131, -97, -48, 51, -137, 129, -251, -86, 120, 94, 114, 69, 34, 110, -81, -195, -202, 52, -184, -106, -66, 109, 88, -47, -218, 13, -139, 88, 142, -3, -262, 31, 121, 234, -174, -139, -108, -311, -175, -89, 11, -61, 209, -159, 179, -49, -87, 26, 91, -135, 100, 98, -62, 82, 224, 81, -81, -6, -103, 59, -63, 243, 188, -187, -125, -271, -30, 147, 130, 93, -245, -47, 139, 179, -157, -78, 44, -161, 53, 92, -113, 146, 43]
4408D3l32K57N8k74M57k21Qk5J7J08n2j23L52r5k60J17J86k7k49K34K0n18R1l5
4432b63J1K71q4j79J48J65l17M26k43M8K19j80j37J57J82k58OL04l50j38J68M8
4454Dl3J9j30J69j25j60K98j60R1k4l7J22J25l60J60m8N5L15l1k22m3K03j19K35
4478C04m20J37J11j36j80J74J6o1K9o7L71j96j22J66N9%k51O9k52JM84m5K8m76
4502b57L2K17J88j87L00j2k33R8k40j92K75J97k06Nn4J11j43LJ51j24L4K34k94
4525i7K12p2jR9k4j28l5K4m6p2R6%J90l90K80r8j94J72J91q0M9q2j93J59J86j54
4551hj12jK32j94K33k85K87l31k2N5L03k97K51Q5J4j36l40J72P5J15j51M1k5K27
4575A88j31j32K33mk05j6J17J9l31L70o4J60k36j0J45J99m14K83Pj46o6J08l28
$$ y = [43, -289, -32, 26, -248, 209, -12, -4, -29, -12, 96, 44, -79, 273, 178, -82, 35, 221, 194, -55, 179, 199, -319, -228, -263, -252, 19, -65, -244, -96, 69, -248, 178, -65, -17, 202, 22, -115, 42, 224, -34, -28, 276, -74, -212, -44, 4, -29, -10, -140, 29, -96, -256, 42, -118, -27, -51, -88, 34, 159, -201, -41, -89, -34, 281, 250, 28, -15, 188, 69, 304, -116, 21, 132, -4, -184, -10, 6, -55, -26, -93, 278, 82, -40, 126, 185, 185, -66, 3, -249, -248, 236, 191, 219, -257, -225, -8, 180, -7, 293, 281, 48, 146, -94, -286, -11, 186, -20, -15, -69, 42, -101, -98, 53, -71, -37, 197, -97, 115, 43, 42, 141, 117, -11, -46, -22, -68, -140, -44, -44, 146, -244, 36, -62, -256, -84, 107, 27, 76, -6, -199, -40, 146, -8, -120, -121, 111, -83, 150, -135, 152, -179, -201, -146, 157, -140, 111, 196, 210, 74, -266, -94, -19, 96, -55, -14, -39, 188, 57, -75, 158, 154, -51, -67, 50, 69, -262, 108, 44, 204, -32, -42, 103, 302, -112, 171, 178, 32, -34, 74, -254]
4598b54K74rk5J50j50l2j16R2P6k9RJ27j22Q5q8n9j04K40M9q0m9p6L31j27k50
4623a37M8J38q6j29K80Rl28K67k36J10lr2J98j05M4JJ21J49k18j30q6J47j90M07
4647A79j6j58J25j33P2n0J83n1j54J77k35q5O1k87L72K16k16m6L48k44k08K62
4669A12pj37j73K44Q2p4j79N7k0lJ26k02J60K2K1r3Q3K2o5K28k77J14j04m0k86
4694c89M39j1k0n2j43J44j31L28j86j38L89k55O9jj84J35k54K75m3N9l6j49L54
4717B00k10J9k8J78j87J59j10L9k07K67k67m2J06n1K99m46L11j92M1L28m19K12
4739@qK71l20M9j02K6P8r7Q4M09j97k05q9j8k41N15j05k99K64j15j54K63Q1p3
4763A7m4K4k22K4K25j4K1J86k94N0J18m2j06l4K25j14n9J97l82J1M88m9q7j27
$$ y = [-254, 20, 11, -14, 136, -14, -46, -162, -70, 6, -23, -14, 113, -9, 76, -12, -71, -175, 65, 114, 34, -15, -91, 240, 113, -137, -89, 49, -37, -166, 114, 123, -205, 62, -174, -64, -67, -159, 39, -66, -22, -21, 100, 249, 31, -99, -185, -38, -228, 179, 163, 5, 130, -3, 69, 19, 202, 151, -3, 174, -61, -146, -85, -372, 0, 216, 0, -46, 302, 58, -150, 112, 105, -32, -205, 39, 121, 47, -132, -75, -95, -98, 28, -174, -14, 8, 29, -64, 19, 41, -24, 204, -73, 41, -63, -103, -389, 50, 39, 19, -33, -176, -32, -163, 165, -21, -159, 230, -25, 44, 43, -141, -6, -260, 15, -28, 31, -5, -154, 200, -10, 9, -19, 159, -28, 131, 21, 60, -147, 120, -147, -189, -83, -134, 165, -281, 30, -162, -121, 207, -212, 0, -8, 263, -57, -8, -110, -84, -6, -103, -19, 390, 193, -12, -101, -119, -360, 155, 50, -249, 15, -100, -254, 9, 90, 17, -27, -3, -225, -201, 24, 10, 31, 217, -77, -27, 91, 49, -57, -91, 134, 20, -39, 158, -224, -213, 275, 226, 139, 12]
4787A2P1J28l28J67j02L6k2J64j38l4j13J55l50M22J71n7Nj11K5j45l69M50K81
4810C18l63o9J82RJ68m29K52J61j55r6K59m26r8J91J99m14K21j22K9r5L04O1j13
4833b6Q8l8j19J8K34k35J26l06L43k63K58j76j70J21K82k6k27L13j40j48Q0n4
4855f5J61j21K1PJ4j18M30m28P8k7K4j64J25J38K01l32l7K74o9j12K33k60K1p
4879a3J37j70m2j80J13J29J34k54J81L03n33K27N8Q9l0j63j35P2M1r9J47m3j62
4902a93L59k27J25l11L34j17p1J80j40J91J24j27j15j04k8J46N3j12j40l4K46
4923C9j79M2p7J0L40l33N21l94m0m0K7j9K23r9m7J17n4j6r6K84l74L76l27j2L5
4948i3K47l34L4K07q3K01m52M20k82K01k79J11q2K96l4r3j49m1J44j02J43J44
$$ y = [12, 83, 211, -117, 50, -52, -16, -38, 126, -12, -46, -159, -4, -354, 68, 239, 182, 187, 76, 101, -44, -413, 37, 318, -45, -114, 68, 77, 245, -184, 68, 229, 74, -22, 237, -189, -287, -96, 103, -311, -90, -212, -183, -278, 26, 87, -26, 62, 24, -95, -77, 157, -78, 48, -258, 85, -178, 80, -96, -266, -145, 137, 111, -116, 197, 57, -91, -11, -65, 96, -25, -4, 3, 17, -101, 329, -99, -21, -48, -24, -188, -63, 75, 276, -56, -93, 181, 112, 0, 233, -27, -6, -13, 124, -46, -88, -268, -155, -26, 108, -146, 35, 338, -195, 32, 90, 179, 149, -14, -149, -77, -36, -135, 12, -31, -193, 166, -61, 64, -247, 87, -30, -101, 79, -61, 130, 254, 127, 12, -92, -120, 26, 79, -33, -173, -207, 39, -140, -98, -175, -165, 175, -158, 363, -31, -71, -111, -84, -103, 120, 21, -26, 91, 37, 21, -75, 209, -165, 211, -116, -128, -93, 154, -180, -146, 61, -22, 179, -273, 147, -135, 66, -213, -102, -184, 112, 78, -15, -164, -205, -61, -163, -20, 124]
4970A24nj02q3J69j30l0N2j50P7j85q4O18l03l90L23K43p9j66J95m0n8j44J24
4993b4Q5p1k06K50J44j51K6l07K90l8k11L45k20K85p6j54qk2J36j70J96k17M9
5016f9P4l9j22L53k36j76J63j34L7j35L12j06K81p9k48L0L2Q0k56M21Q4l32k7
5039i2K12M0kk15L4L24k81N02o25J80k2j40J84j61p1M9j55K74M1j74J93J41j37
5062I9n0j5j82k6J39K15j5j86Q6m4m1K19k25P7J73k33P3j01J2j33L4K23j26Kk02
5087b27J80j08J71n1O8L3j81M4K00j62L3p3%L41l31J00r4j02j6J80Jj73J12q0
5111a35N8J65k5J61j41jj76O5K18k45J42l0J05l07N0m1K48K2l04L59m19K83o9
5134a7o7O7k41K66o0k10J00K76j25R3j61QK71l50J62J20J30N5n46M28m5M1k7l54
$$ y = [124, 119, 17, -66, 103, -27, -57, -5, -155, -78, -263, -347, 271, -32, -422, -99, 144, 65, -101, 94, 54, -4, -148, -24, 61, -10, -216, 34, 178, 27, 53, -254, 36, -2, -213, 132, -88, 197, 121, -33, -41, -63, 73, -97, 99, -118, -69, 5, -34, -156, 197, -39, -215, -52, -186, -149, -284, 28, -78, 203, 124, -124, -94, -62, 18, -238, 183, 267, -65, -92, 120, 160, 158, -57, -23, 301, 20, 522, -103, 77, 55, -85, 99, -62, -133, -84, -239, 35, 76, -98, 95, 236, 99, 49, 34, -148, -174, -35, 180, 165, -21, 65, 21, -20, 199, -26, 51, 224, -9, 64, -37, -25, -158, -124, 99, -27, -25, -227, -47, -155, 16, -35, 33, 66, -115, -71, 129, -33, 0, -73, -73, 268, -63, 37, -57, -159, -175, 5, 6, -167, -55, -135, -77, 88, 63, 224, 83, 82, -94, -29, 189, -56, 86, 56, 161, -146, -96, -137, 111, 133, -171, 188, -231, 52, -17, -84, -17, -258, 8, -52, -262, -162, 114, -11, 82, -79, -71, 200, -150, 12, 132, 262, 317, -229, 199, 154, 195, 168, -186]
5158a86K25Nm6j6K4n3L9J41r7o0P1J16J39l47l1J14k89J09M82m40J34MK5j9p7
5183c3k5j63N61k22l1j75M25n11K20k99M32j80L4J9j03M0J21l99L01J87k60K55
5205A94k97J90LP8j76l2j47J83j37L49j55J%j46oN2J38j71r6Q8R2J43j99J16n6
5230IM3N6k77j29Q6L35j86J58o4l22L99j80J23k54j46K12j17O5K77qJ3q2m4K76
5254B43r2j82K31m61K77K17k54r2Rj20J81k03L81n32M69j87O1J32k77K63p6L96
5276C84k33m4n9K81m30j31R7K89k70L3Q2n7K1p0J01J47l41K54Ll07M89l95n3K41
5300C2r2J66m09K63l77J89K6K05J75j51o3K31k35JK13m67N1J80K75l49K47M9j04
5323E6r3K79k49k27K44Q7%p1k1K8l3k47K97j13j59K27o3m7j17N28l64J15J03k14
$$ y = [-186, 39, 44, -2, -18, 6, -47, -8, 133, 36, -24, 47, 163, 302, -45, -76, 38, -251, -142, 340, -100, 34, 38, 63, 44, -33, -58, -221, 340, 118, 87, -88, 337, -174, 46, -253, 179, -1, 33, 52, -51, -11, 110, -289, 12, 199, -61, 194, -103, 87, 90, 168, -8, -40, -187, -4, -141, 208, 53, 54, 54, -92, -98, -46, 92, -79, -175, -87, 5, 148, -51, 65, 9, 52, 108, -169, -298, -212, 123, -63, 95, 31, -291, 108, -72, 51, -203, -349, -137, -254, -189, 88, 80, 93, 11, -33, 243, 151, -31, 200, -261, 16, 233, -21, -113, -104, -224, -43, -246, 135, -397, 72, -115, -54, 78, -199, 64, -12, 384, 151, 107, 48, 329, -101, -232, -135, 154, -116, -83, -1, -58, -37, -107, -6, 141, -200, 54, 57, -250, 239, -156, -209, 32, -60, 106, -303, -40, -417, -228, -202, 3, 178, 27, -36, 195, -40, -39, 174, -293, -242, -62, 213, -136, 111, 160, 56, -37, 242, -7, -234, 10, 97, 97, 26, 5, 33, 0, -247, 50, -63, -222, 5, -58, -105, -222, 306, -58, 57, 160, -54]
5347e4K44j80K28j03j06p9l2l9J09k9L48k45k87M92k46j90K62k81J15p6j40p7
5369c66L42L21q3l82N3P1J58l95K51j19L05k89J14N0q8o8j1K04j16O0j58m3J19
5392g0J34NJ02j81K26j53m07L35L6N0o5r9R8J02k73j06K51k24O1J83n3M9P3J1
5416H5j05j0P5kj09k40NM05o8K35p9j34K00q12P29l06J38o2j63J70J61n1l08J45
5440a01O9m2M47m6n56K62K01j63j69p8K77j93K23r9J95p5NP0k73J87m30J77J73
5463F1mp8j46OJ48j61N7J28n5J32j83K19q4j20K08k42J05j65oR8K59k04%j23L48
5488A98j1l85J84j76J08k46L23R3j19k6J35l01R6L0J95m22J90R5J02K29m71j23
5510c02R7j64L72J30k13pj80J01j8Q9K97k10O4K56n33j14K89K3N4%l31L98r4m2
$$ y = [-54, 190, 10, 238, 135, 29, -50, -82, -121, -12, -41, 307, 62, -225, 267, 21, -169, 93, -188, -73, -149, -289, -366, -24, 297, 214, -168, -115, -44, 114, -281, -30, -149, 156, -133, -19, 31, -57, -125, -136, 68, -48, 12, -146, -189, -70, 64, 69, 171, -10, 216, 63, -344, -9, 27, 77, 12, -87, 11, 113, -160, -266, -15, -239, -178, 5, -48, 1, 74, 85, -20, -30, 45, 43, -66, -306, -301, 104, 36, 271, 192, 58, 258, -554, 175, -131, 7, -55, -218, -48, 113, 62, -246, -101, -32, -74, 373, 327, -229, 33, 234, 71, -98, -176, 101, -92, 131, 32, 227, 152, 157, 227, -46, 141, -289, -112, 61, 57, -21, -167, -161, -13, -174, -117, 11, -44, 88, -95, 124, 40, -80, 128, -114, -9, -174, -180, -82, 177, -27, -27, -150, 198, 187, -198, -14, -190, -82, -328, -5, 88, -31, -57, 78, -223, -127, -97, 98, -324, -134, -39, 63, 292, -179, -302, -205, -369, 3, 133, -80, -87, -267, -166, -184, -95, 202, -8, 56, 312, -221, -335, -46, -23, 31, 31, -300, 98, 4, -38]
5534c8K39l93L61l95J92J15q4L3m51N30l20K41J44j57M36l37j61O6k79L52o7k37
5556b10J28J25l9k36L13j62L21J3m60K37j63K02l14K25K40m03N6N4j97L91m18
5577b97K72o7k4J56l07L34J99k8n91K28L4J11j88qR3K08j03L2k84N8K46p1j25
5600a22J62J59l51L04j95N31o37J39J94m04K38q7pL5k0M8L0k28J39L38l60j9P2
5623d1K46l50J18n2o1K76j76j51N22k22l67L97k4j48j48O25m46K26P3m32K52P8
5645A95r6k44K49j82J13j28J80j94K40l74K17J06j12j77K62r2j80pJ54M02l87
5666e5j68J76L06k53J92k63P5M3L0k34K38k8J59n20M11l21j92L17J8L66l53Q2
5688B6k42jK10Q3r8j21R3K58k05M0l53O94m20J36K29l84j26J13L04m81r6J38M48
$$ y = [-38, 201, -192, 169, -226, -34, 81, -3, 30, -421, 109, -211, 30, 174, 17, 453, 116, -45, 21, -258, 94, 27, -210, -82, 43, 4, -232, 81, -81, 240, 253, -207, 30, -133, 69, -245, -20, 220, -183, -127, -73, -270, 121, -297, -25, -92, -116, 40, -267, 67, 266, 238, -353, -125, -91, 20, -168, -176, -83, 125, 22, 54, -230, -172, 74, 3, -122, 40, 199, -152, 152, -43, 488, -149, -10, 184, -220, 18, -69, -76, -41, -61, -13, 17, -211, -72, 266, -94, -113, -41, 205, -145, -27, -79, -140, 136, -40, -191, 331, 109, -258, 139, 115, -33, -181, 444, -2, 224, 297, -135, 117, 195, 99, -145, 104, -78, 35, -93, 87, -107, 133, -241, -24, 82, -30, -207, 55, -37, -217, -224, -70, 332, -55, -223, -47, 259, 6, 198, -65, 10, 53, 83, -151, 87, 59, 218, -302, 109, -212, -404, -87, -69, 297, -56, 26, -216, -217, -7, 76, -22, -143, -50, 208, 3, 43, -310, 384, -36, 100, 329, -55, -181, -68, 236, -245, -341, -203, 245]
5711B45k68J40l16K17j03J74k08Q9j11K67j56J14j97Mj79M12r9q5R8p2J0m1k77
5734c42L36J54j14P1Rj74P5J42k18j4O7J05k66K92k01J50J81k00k45M1J9J76j84
5757a40J28j15J46j8j84j9J58j10K66o8j53K67l7j19L69k85j1n9RK79k13j83J56
5780F4R4l89m1O3M86l58L16k21o2J86O0m1k18O6L2k44K57J79l60K2K83j57K36
5803B53l36o6R8J34l7j96J6K51k11K03j47p2K82j16J59j25j35j41J77J88m71M32
5825A40j14r3K05l0j28mP5o1N9q4j3K19l18p5MJ90J02k04N8j5K37qj65j35L44
5850A86j12kr8p8o6J62K17j03j71J34j38l4N5L22j69l5j91J15r5m3M23k17L7J35
5874B34l55K5K16j52N6l0O1k69L86L2k62L00k41J32P8m19K87k0j05K16j91J01
$$ y = [245, -23, 117, -199, 18, -85, 89, -119, -30, -141, 126, -30, 84, -113, -109, -288, 124, 25, -60, 38, -34, -24, -65, -342, -6, 148, 34, 105, 114, -60, 15, 157, -61, -75, -8, 97, -169, 123, -78, 72, 253, 53, -192, -151, -132, 44, -140, -12, -127, 19, 1, -183, -202, -44, -154, 112, 44, -109, 158, 121, 2, 371, 86, 75, 16, 25, 304, 91, -92, 64, 158, -231, -272, -209, 277, -81, 235, 14, -48, 138, 198, 157, -61, 5, 37, -207, 50, 229, -131, -109, 174, 17, 253, -83, -149, -51, 83, 46, -150, -134, 117, -94, 109, -38, -110, 172, 56, 215, 90, -45, -186, -9, 179, -292, 140, 26, -67, 138, 108, -20, -24, 51, -10, 49, -35, -48, 171, -147, -222, -218, -28, 74, -130, -72, -87, 150, 142, -23, -158, 186, 74, 72, -26, -104, -170, -8, 209, 106, -65, 69, -69, -103, -48, 274, 105, 70, -121, -6, -101, -144, 279, 62, 99, 234, -121, -96, 120, -32, 24, -6, 55, -214, 172, 204, -58, 242, 1, 133, 211, -208, 79, 59, -46, 170, -21, 80]
5896H0Q5l00K62j80KQ8oK7J00k54J01j53j0J96L6j76J0J17J74k08rJ00j13j2J87
5921A44K3l01K01K04l87J21m6J17j51J34jm57M52Q1k28jj14J89J2J5nK9R4l03
5945a78M0MJ77m9Mj7J96k02J56j98K80j17j22J29j52l8n1M09k63J9R7k28P4J97
5969A67j80m5j52J32J87k7k26p1K7O0M9j11L54l10L84l07L32m61R3m3K15j35J34
5992F6j86j05P7J53J30j32j63P9K45l28K38K42l11O1k42Q6l7K13J34k57K26k15
6014b6J38j98j4R8J19J81j57l94k8K24k5N2J1J57k79K88l23L93k34K1k92K23J05
6037D0Q1l1q8j93K62k07Q1J12m16N0L66l02J10J04J27j38l0J4J84l22J49m0K1
6060f6r8J27K42k55J44n2J7L9q6K7K04l00K66M5n86L91ln4j16L1O6K89k96J10
$$ y = [80, 165, -135, 127, -53, -51, 37, 31, 58, 158, -96, 5, -148, -158, 38, 74, -102, -92, 25, 199, -9, -18, 82, -31, -43, 144, 167, -134, 67, 271, -116, 5, -41, 76, -75, 59, 58, -399, 53, 134, -94, -95, -209, -20, -8, 7, 2, 31, 125, -178, -138, -134, 43, -6, -2, -19, 177, -25, 131, -67, 213, 96, -26, 103, -49, -87, -138, 271, 8, 27, 124, -104, -30, 167, -13, -58, -210, -78, 109, 82, -144, -215, -188, -128, -79, -190, 164, -146, 238, -69, 263, -198, -105, -148, 67, -68, 66, -120, -225, -148, 5, 135, 3, -160, -81, 164, -164, 74, 316, 5, 66, -176, -90, -127, 86, 220, -37, 189, -26, 112, -86, -100, -2, 117, 298, 141, -253, -281, -57, -82, -30, -19, 138, -141, 147, -176, 217, -17, 4, -288, -65, 40, 121, 90, 2, -191, 71, -136, -55, 57, -359, -309, 57, -245, -135, -31, 96, -42, -72, -58, 126, -196, -47, -87, -66, -164, -37, 205, -50, 94, 42, 59, 98, 12, 39, 243, -57, 209, 254, -332, 59, 56, 2, -114, -83, -17, 272, -24, 86]
6084H6R4k69L12j21m3j79K11R1k56j44J13j80J72L6l78M73n3R5j95m1L68m2j72
6107b2K07j76L0J5M4l7J96m88O7N32n40L69j72k77L80j85o4K84N5j64J10k34K34
6130A64k62O9K37J61k60n17K80R7K69j29j80m5K61m7Q0m6j48L34l39M2n4q3J94
6153G8M2l96L55j87M45k35j35K47k36J20Q6j44O6j42J44L3L5J13l53K73K0j26
6175A03j95k54K97M13m88J84m68P57l07k9K64l04K4n5p4K10k4j91L42p5L1r0l5
6198C6q8Q2L7j64K30L2l28J40K15q6j67k48J50K0L3M8J9l3J65j17j92K96J11j72
6222A9oJ70r6k26j9N9J0oK3M3J91j42K26l31N4J63j26k44L20O8m7j42K3k26J83
6247e9K73l52m2R6J39M2j54r8M27n38J94j29J65J97j65MN7p5J48L75n02J91j91
$$ y = [86, 180, -89, 223, 102, 59, -120, 91, 182, -74, -218, -105, -285, -113, -77, -455, 18, -35, 60, -135, -176, 192, 150, -22, 185, 9, 39, 54, 98, 61, 257, -231, -164, 368, -172, 197, 25, -252, 128, -57, -121, 163, 218, 54, 164, -70, 164, -98, -29, 208, 369, 109, -408, -128, -31, 238, 109, -71, -116, 145, 98, 178, 132, -16, 318, -21, 21, -33, -116, 78, 120, -276, 79, -108, 337, 102, -33, 214, -22, 98, 184, 40, 106, -36, 108, 141, 176, 289, -64, 209, 229, 103, -92, -346, -49, 364, -124, 60, -408, 349, 42, 13, 277, -27, -3, -58, -132, 78, 54, -137, 205, 130, 161, 71, 36, -52, 30, 67, -97, 133, 165, -163, -23, 192, 106, -61, -309, -159, -139, -106, -58, -39, -72, 93, -24, -216, 80, 191, 19, 13, 183, 87, -139, -158, -99, -89, -95, -72, -29, 162, 20, 246, -85, -31, 132, 6, -238, 82, 150, 103, -39, -16, -242, -59, 214, -138, -180, -84, 55, 97, -57, -155, 272, -266, -72, -201, -36, 161, -4, 0, 57, -18, 130, 505, 3, 194, 3]
6270CJ19k01p3j79K33r8L56l41K33J53k24j63K93j51O1q6K47m52J90j37L12o2
6292C3k91K79J23k11K92j67k05K04j8M9j98J10N8k55M0M44m47J51k60K86R9k9
6314H7j67O6M1L39k20j91J51j57Ml7j12o9J99j01J02K05l9j35N7J52j04k17rp
6338a62L23k47j2L8L6K2k08M9J12q2j14K23j58O5M49l48M1j33r4L56j11J15k67
6361a07r0M15j91j9N7l22N16j49l40M8L58k20M1K34l50J35j5l8j69J74J69O4m88
6384b87K25q5L94l86P5k02L81l30K57q2L53m29k8k0k6K32k71K56M8K90k87k00
6406a22K37k9r8J78j00M2R8l63N4P1l9K1j15K52q3P3O9j67r7j14K73r2K8k50L09
6431C6j68K85m9j81j30R5K24R3l14j32K51p2L25k95P1j62L05l30K96m1k28J87
$$ y = [3, 122, -79, -152, -331, -98, -196, 160, -181, 52, 205, -19, -182, 111, -40, 21, -65, 182, -270, -80, -217, 95, 33, -258, 21, 144, -67, 225, 58, -147, 57, 39, 88, -110, 0, 58, -197, -157, 287, -160, -9, -269, 17, 116, 87, -80, -14, 27, 366, 146, -45, 106, -51, -47, -84, -196, -265, -66, -167, -65, 140, 101, -34, 23, 175, 71, -146, -155, -162, 161, -86, -98, -60, -24, -2, -210, -161, -49, -131, -245, -22, -180, -115, 334, -14, 27, -106, -200, 156, 45, 160, -107, -197, 218, 27, 8, 65, -257, 259, 110, -230, -182, 176, -44, -3, 231, -119, 16, 1, -37, -206, -32, 137, 201, -287, -62, -147, 247, -139, -64, -266, 115, -215, 42, -40, 313, -116, -144, -164, -190, 42, -229, 27, 75, 365, 78, -122, 115, 86, -12, 166, 66, 108, 206, -157, -103, -32, -71, -50, -165, 87, 4, 77, 146, -21, -118, -232, 41, -51, -23, -273, 36, -132, 153, 104, -77, -207, -112, 112, 205, -109, -241, 10, -62, 263, -32, 39, -123, 182, -148, 148, 107, -121, 66]
6453F6k19J78j21j48PK16r7k0J05j81O0k9K23K08l22R4j84K62j44j42L14pj8j33
6477c2r5K25j47m7J1J51j9j26N9p7M8M7m0K31k28j26L76j08j49k10L55j62j9K05
6501A23k04q1l2o2K00P9j41L05k28N4J14j63N0j23J46J71j72k56L01j28p9J29
6523Cj18K29J55k71K16j46k07j56M81l4L5k86L6R0K9k26P8K62j97p1p6K21P2J05
6547B24O9k68k11J99o7K29k61J1J39j60N8m2J11l20K19O8l40K51M8p7K44r9J58
6570A83k41M3L21k29j51k7J98N0k24R6J4K78k95J89l21K69K6j35J19j99L8m6q3
6593a27K22j12j43M2r7N13n20M96M5k56J61l42j89L11J5N7k77L78k36J32k70J8
6615a79K16j35j26L29R9R9k01R2m67J96K15n1q5l99K91K71k77K54J5l19L6mM3
$$ y = [66, -153, 25, -96, -244, -237, -21, -118, -138, -33, -214, -154, -183, 40, 248, -74, 20, -164, 98, -46, -188, 126, 119, 101, -32, -127, 98, -49, -96, -85, 66, 47, -79, -20, -97, -49, -2, -42, 189, -39, -165, 211, 103, -46, -256, 99, -63, -82, 123, -81, -162, -194, -256, -56, 23, -118, 187, -41, 13, 127, -36, 14, -109, 37, 208, 36, -220, 81, -47, -126, 3, -115, 114, 269, -2, 214, 68, -139, -295, 186, 152, 187, -99, -63, 27, 56, -170, -92, 170, -27, -98, -174, 47, 119, 224, 293, 25, -186, 13, -54, 175, -86, -75, 64, -96, -38, -80, 31, -289, -70, -2, -342, -91, -43, -120, 124, 25, 183, -58, -15, 306, 77, -74, -101, 97, 147, -77, 19, 33, 311, 16, 205, -116, 153, 179, 44, 163, -36, 2, -44, -127, 95, -17, -160, -118, -215, 298, -222, 274, 319, 63, 224, -118, -307, 4, 19, 76, -201, 177, -59, 73, -197, -179, 37, -98, -224, 105, 204, 303, 102, 194, -273, -77, 138, 87, 2, -397, -106, 165, -112, 142, 157, -162, -126, -130, -87]
6638h7P9l2K57n51L43m6J00j34P1J0k23K79m3Pl2j35J57m1k91M66k91o6J10l1
6662a24mJ84k8j06K78k98n4N42l00m0p6J70k76j08J43J22K3p8K23k62J59k66M6
6685a30K86n9Q5N9k06J64j66j18j33K63j1Q9j97J9J39l62L69l6k30M12k85J31
6707H3r0no6j06J23r5LK80k29L19n5l18J84M3k74r7L2L07j9Q8k6o1m8l9O3j43
6733a46J76j54K69j15J35l5K58l79J74k27K40j21j4j50M7J55k24K24K7k60Q4k13
6755b49J03J76k0O4R5k1j48j13K22j30m26K61L24j67JK32j86l13K45J96m7j83
6777h4k8J42R9l7o5J23jk98K03l11K25J72o9J35j19k69L0K72m48L92j24J41L6
6800A17j22k48K27j05J6J24J53k57MJ3J8J27J66l42k9L08j7o9kJ47j22q4j84J33
$$ y = [-87, -8, -40, 217, -334, 9, -37, 63, -71, 0, 10, -213, 66, 23, 30, -2, -137, 20, -21, -312, 154, -137, -203, -93, -124, -128, 56, 28, -78, 200, -98, -152, 390, 90, 50, -26, 144, -132, -240, -97, 25, 48, -30, 193, -69, 90, -176, -130, 156, 97, 182, 241, 35, 199, 33, -85, -218, 45, 34, 123, -74, -55, 84, -278, 91, 55, -175, 237, -48, 83, -7, -12, -78, -184, -61, -156, -153, 127, -102, 217, 162, -156, 28, 71, -203, -300, -268, 39, 20, 108, 82, 21, -27, -66, -3, -146, 30, -124, 145, 30, 165, 130, 388, 9, 183, -44, 196, 75, 61, -89, -42, 113, -111, 113, 140, -120, -36, -249, -146, 30, 10, 74, 169, 148, 0, -113, 109, -21, -447, -186, 138, -29, -28, 204, 18, -295, -50, 146, 99, -84, -112, 30, 129, 92, 27, 150, 149, -149, 54, -257, -32, 140, 71, 206, 87, -182, -152, 120, -328, 64, -60, 81, 117, -5, -253, -26, -131, -115, 9, 162, -95, -91, -78, -60, 67, 233, -109, -138, 170, 153, 84, 82, 229, 107, 23, -161, -28]
6824b8J12N6J47n47L57M3Q4k33J30j14J4J87m4k06n1l09L59J22J15m01L54j2j14
6847B1J12m99M57k83J52o7J3p3M2L13o9ok43P7j04k24K09l2K77l30J93J54Q4o4
6871A10j00J92j87q4K54l62K16J9o0M3j25J66l2k89J81J74m1r2j00P1rJ03K36
6894B84k03O3J70k14j54K03j39r7LL13m61K95k93L7R6j3L95l01m8k20K2L70L6
6917A44p2R3m5k35N8j37Q7P3P7P7Q9J2j10j45nk34L86Q1k82J16j87J41L06m70
6941a82J89P9N0N6k29m9J1R3N8p1k64L6k93N87j03k19L58qk25M7J88l52J18J66
6965D1j74K24q8n7r6J68p5J57k59J24P1m4O2Rk0N7l89J36J31q0Q0k31J15J29Q9
6990H0j43p3J20j70J72M4n6j1R9Oj00Q1k19N7J16O8k99K26l3r9J66L0L2j90L30
$$ y = [-28, 84, 140, 287, -260, 97, 140, 224, -9, 121, 7, 21, 208, 164, -42, -93, -402, -43, 79, 194, -207, 147, 135, 21, 133, -366, 91, -192, -40, -107, -94, -167, -125, 188, 119, 113, -130, -53, -157, -381, -172, -204, 73, -257, -64, 90, 174, 110, 10, 202, 15, -69, 185, -177, 39, 58, -2, 41, -84, 82, 50, -239, -58, 116, 75, -17, -117, -46, -55, 48, 284, 81, 144, 314, 100, -54, 149, 10, -87, -84, 229, -232, 63, -230, -193, -97, -110, 285, -16, -64, -284, -262, 108, 144, 72, 165, 120, -115, -57, -194, -107, -34, 43, 120, 209, 221, 111, -34, -39, -273, 113, 194, -88, 28, -159, -18, 288, -182, 7, 86, 136, 192, -37, -86, -75, 18, 76, 5, -259, -223, -516, 71, -32, -251, 107, 99, -126, -79, 109, -243, -125, 41, -133, 91, 3, -54, -150, 18, -57, 100, -159, -35, 36, -8, 54, 63, 43, 100, -289, -153, -22, -102, -22, -253, -138, -9, 80, -63, -136, -16, -186, -14, 30, -26, -37, 62, 68, -32, 49, -170, -113, 3, 71, -228, -2, -35, -134, 32, 62, 94, -96, 234]
7015B34o02L49O0p8J14j69K35l65K97k70L53k76J37P7j59k4kR1j78nJ63l6j07
7038a61J22J54k98Q5J45j77J44o6k93M42l7o9J26k44l2J51k4m3j56P0K62o0q5
7061d4K21q6J03j31J55j72l2j58K22J38k38k4J46k31J72k21L0J95j43j34L36R9
7083B03p1J06k23oJ58l05J80K5R5k64J31J55j13j03M0J19j92Kk52L74J11n3J01
7106B18p4n47M81p3R0m7j14O9J51p5m41K68N37l81O9J60k68J18Rl83L95q1j37
7129e6J22n0lJ12k94K03J38K03k92N0j10p0K00rNp6j12p2M37j35k32J00j15J78
7153A22kj21r2J55P7L9k14K00k29m4K91j62k29L07l83k3K91j26J7J26O5K5q9j91
7177a90L53k03K17j84j45J98j4J27j54j45R0rk89L01L17k38Nj27Q7O0o5K43l27
$$ y = [234, -368, -19, 41, -37, 77, -92, 143, -222, 75, -195, 158, -118, 19, 96, -63, -87, -89, 2, -176, -181, -18, -54, -161, -39, 115, -183, -98, 47, -130, 14, -52, -345, 97, 60, -9, 117, -127, -159, -8, -32, -75, -231, -161, 101, 41, -44, 177, 91, 194, 63, 218, 46, 14, -144, 78, 216, -22, -46, 100, -131, 41, -180, -150, 45, -98, -232, 104, 203, 132, 238, 15, 9, 167, -138, 42, 67, 162, -102, 29, 184, 71, -32, 8, 127, -65, -63, -315, 59, 170, 117, 218, 144, -403, 78, 5, 95, 48, -66, 3, 154, 79, -362, -94, 443, 62, 131, 291, 23, 141, 150, -233, 162, 81, -56, 66, 16, 13, 125, -169, 34, 172, 375, 83, 133, 23, -47, 153, 144, 149, 73, -39, -111, 326, 191, -41, 59, -56, 122, 120, -1, -93, 62, 139, 178, -36, 164, -65, -109, 182, 20, -209, 98, -285, -308, -17, -143, -126, 0, 65, 90, 1, -190, 163, -40, 177, -7, -152, 46, 32, 159, 5, -140, -50, -59, -348, -47, 270, 32, 37, -90, -3, 57, -8, 235, -92]
7200i2R9p0Q4K07k71J70l6J28k46J10k16nJ73J28l32K77l1p4J01q8j16J97m1j
7224E5j1J35j22j71P4n3L8k32M46j15m26N88k70L2J73k19J69j06Q8P5m61K23L59
7247B69l68j09L52nn7j07N2k4j69K03r0J64j46j31J99J49k34m7L12k84K87j38
7269G8O8k82p0O05m96K76m78K73J73j78Q0q1mJ05j85M3J03j2J04rj09L5j1j59
7293a31J18Q9k40J0K75O5J7l13K83j43r3K64k43m6K25j16r1K9j59K50J0k59lJ63
7317c9k67L40k85K16K0k26L00p5K05k84l58N41o0j35K3j05M89l30J21Q9l13j6
7339a49j94L67K22k12M1j7j49L70l46L9o1j00J19Q1Q3j22P5m2J2J08N7j17l4o3
7363c2j31J06j32M48j25j46J39j77J44j01o9PJ39k38J99l6l0j16K03j19L47m05
$$ y = [-92, 7, -63, 21, 228, -43, 127, 91, 219, -27, 83, -133, -138, 35, 163, -169, 108, 77, 3, 104, 16, -100, 97, 56, 55, 44, 179, 57, -114, -40, -93, -55, -287, 159, 44, -382, 206, -64, -32, 141, -78, 91, -15, 73, 148, -313, -90, 269, -99, -208, 144, 139, 82, -25, 27, 3, -166, 37, -53, 111, -35, -166, 33, 182, -52, -99, 213, -71, 216, 78, 146, -136, -206, 399, -97, 179, -299, -26, 147, -31, 49, -32, -36, 69, -116, -73, 30, 18, 122, 113, 4, 39, 28, -131, -13, 76, -164, -154, 121, 186, 203, -110, 173, 30, -63, 201, -42, -88, 137, 21, -70, -41, -200, 50, 60, -199, -202, -39, -306, 34, -251, -35, -15, -241, 59, -16, 189, -95, -453, 88, 28, -107, -84, -189, 300, -30, 91, 180, -133, -149, -343, 24, 246, 34, 75, 58, -91, 279, -67, -28, -89, -189, -70, 11, 94, -28, 47, 5, 17, 125, 182, 65, 31, -32, -163, -57, -189, 259, 134, -12, 127, -50, 94, -7, -76, -69, 70, -168, 31, -5, -35, -151, 52, -67, 280, -125]
7385a25O0K9j27J18j14k1K44J8R7j64j02k5J94j82j23J88l8J0K7J86j66K4N4l7
7409B5j57J14p9QM95m15J12j47M6Kn2J56j45m1j01J24K24m5m37L34q2K17m1l24
7433b09M24l81L48m83L72J13l8j93Ql1J54k8J3j00l9K46k27J2l7n6J26J34j40
7456a2R9j93jP8j58K04J22l30J04Q8j08M08k52j17J64k61J00J32O6O5j26l00J39
7479h9L08jl36K9K21m18J96K65m01K71J1J94k07K9j54k26K61K4J43M5L2k48K09
7502A58k3j34j3k33K09j67J50J21Q5l1j48J42J57k12%j11j39KO6K40k9O3k90K5
7526a12K24j19%l19M08j67p1N7M31l13J23k00P2J90j49j02jJ37P8m40M72l95J01
7549i5J2J68j93o3J0R3M2P1l3j67K95L9j26j21M6j47L22j57J9J44J17j81L9j50
$$ y = [-125, -65, -36, -163, -45, -159, -180, 64, 82, 179, 15, -87, -112, 82, -100, -223, -35, -73, -63, -36, 150, -16, 8, 62, 25, -132, -18, -97, -89, 406, -9, 103, -44, 2, 4, -48, 108, -37, -78, -179, -55, 169, 124, -313, 21, -61, 156, 115, -209, 215, -166, 182, -301, 71, 184, 146, -47, -39, -70, 84, 56, 69, -31, -70, 176, -51, -39, -76, -132, -6, 128, -12, 87, -106, -107, -29, -187, 17, 139, -191, -87, 1, -107, 301, 49, -68, 96, -165, -65, 67, 133, 198, 72, -228, -89, 219, 218, -118, -89, 132, -286, -90, 175, -226, 45, 56, 250, 43, 72, -82, -308, -47, -23, 120, 165, 197, -51, 158, 135, 1, -12, -245, -36, -203, -53, 68, 153, 122, -26, 116, 273, 61, 61, -50, -189, -187, -121, 119, 90, 153, -137, -112, 112, -7, -7, -326, 82, -85, -156, -99, 332, 19, 142, -58, 14, 204, 55, -47, -48, 89, 167, -273, 199, -196, -95, -83, 85, -108, -171, -161, -68, -26, 45, 12, -155, 140, 179, 53, -68, -22, -169, 153, -4, 15, 159, 276, 95, 134, -16]
7573a6K9J02k90p6J96J05j22R4N9k24K84j32p8J75k17J85NJ48m03J61r0M6j80
7596b39L31m46M08K77l39j45K3m9Q2J60N3k01L6q3J95k1K10k35J60k86J89j44
7618f4m1K81k30j7k22K57j46K92J2j46J78L0l00K91k02J96k29q8n6J3Q5J17j24
7641a13J62o5j9m2k0O1J69j46l56L30L05j18K35l18J56j34l71J79q1J64k1K15
7663A72o8J39l33J07OJ14o5l75J86L54l52J92k7m7K6p8n2N4l78N22r5j34J75k10
7687a67J6K49j62L26k32K44m21J82J8j28L43k33J4k2j2n2K50m85L29J3j03p8r8
7710b09O3J01J82k47J80j49J92J5j7j40J56J15n48K36k28J43J22J45j29K41m8
7731A76k40P5R2p0j67M45l6n41Q6J25n1J59j93K95j24jJ08j67J01n2O7j66j68
$$ y = [-16, 13, 115, -175, -251, -55, 50, -72, 22, 81, -143, 141, 9, -69, 106, -111, 74, 79, 227, -176, -15, -105, -59, -239, 92, -354, 54, 331, -8, -153, -130, -179, -97, 63, 116, -85, -49, -132, 63, 42, 252, 17, 177, -109, 80, -64, -105, 176, -54, -71, -293, -36, -182, 110, 122, -24, 154, 184, -116, 175, -27, 169, -60, -148, -204, -191, -106, 11, -113, 49, -16, -35, -77, -97, -36, 133, -13, -369, -39, 266, 148, 383, 65, 221, 87, -284, -105, -186, -22, -43, 172, 104, 243, -90, 17, 23, 137, 72, -303, -117, 237, -115, 77, 50, 3, 29, -49, -101, -47, -425, 97, 2, -132, 43, -167, -151, 98, -64, 262, 30, 274, -147, 35, 53, -75, 268, 35, 49, 27, 15, -37, 213, -272, 57, 70, -33, -111, -209, -146, -45, 137, -110, 70, -79, 113, 128, 111, -29, 127, 242, -306, -70, -298, -155, -33, 112, -17, 224, 176, -64, 11, 103, 33, -134, 311, 275, -266, -180, -55, -106, 53, -140, 155, 31, 30, 138, -29, 72, 20, 87, -79, -247]
7754b47K66o7k99K75Q9Q6R6k42P6J29l74j70K55N0n9O9J92m0j4k06J20J86k78
7777a07J90r9J46m7k8k21M38l32n6L96j95O5k31j5Q1O0O5k67J76L02l60k56J67
7800a28K44kJ66k28l31L79j78N4K7K76k10l1l0J02k83K81pk89L18j62r4jk22K95
7824e4J58k4k53k4K12n7P1M9J06l3K36l57l9P6J95m06Q9J20j20K73j9j72R7K17
7848C41m03L95k87n0l4M2N6R7j69j15K67K49m84j55J63K07J00k42l8K27j93j00
7870a26j21K27J69q8J26j91OK55m42j9O1J18J80j82L2q7n1j01K27J05j16r2Q0
7893c0N3L7K52k92j12K3J33j03r7J28j96PK35L0P8j70m8j41r7N31k77M6j6j69
7917a95J66J41j82K5P1n6L03m47O7L3m3J18J54jm4k87N21l91L23j06K87l25j59
$$ y = [-247, 19, -48, -347, -72, 17, 103, 199, -43, 33, 162, -212, -382, -127, -77, -136, -67, 125, 85, 71, -135, -15, 171, -107, 83, -16, 130, 83, 55, -166, 272, -60, -116, 280, 85, 150, -81, -96, -15, 45, 110, -157, 19, 321, -39, -295, -128, 116, 114, 280, 52, -279, 100, -78, -24, 3, 279, 69, 38, 8, 110, -173, 108, 101, -188, 130, -32, -126, -127, -349, -54, 104, 80, -173, -197, 15, -42, 29, 78, 184, 151, 387, 30, -9, 67, 262, -144, -55, 65, -55, 218, 199, 27, 124, 341, -62, 333, 46, -4, -38, 4, 60, 157, -12, -127, 140, 389, -95, -250, -87, 120, 220, -22, -60, 167, -26, -126, -247, -20, 149, 61, 187, -4, 2, 257, -185, -204, -143, -25, 155, -27, 5, -82, -133, -234, -7, 98, -18, -110, -30, 23, 60, 312, 20, -92, -69, 64, -39, -136, -8, -204, -197, 38, 68, 146, -24, -72, -213, -310, 221, -56, -10, -26, -195, -29, 112, -70, -45, 26, -30, 273, -174, -107, -74, -117, 1, 155, 154, 110, -177, 344, -47, 276, 170, 457, 132, -27]
7940b7j85K43K90l25p7J43k55J46O2oJ32k8q8q4K08l37K07l24L46P9J63j92j35
7963d4J00k61M0J56J19j64J41k43J17R7O7k03k02L23o6j51P3Q2j03K68n2j36J95
7986A53o6k59K14p1J96R3m46L0K8O1K42k71R3L2L00m78J87j73J57K82m05J53k42
8009a90K55J54j71J94j34k94J57N96o43K78k63jk8L94l23J85l39K43pk01K13R6
8031A71k93L27j67O2k5J8RK1q3j32K20r5J3r3J10P7n8QkQ1l14K05l9m5J85m09
8057b48K67r6L22k0l23L01m56K12J44l46K71p7o0m7K72J66k93p3J10J85k33r5
8079a17j09K43K38l15m7J57k82Q7J10J21rq1k62L42k65L39l28J71j11J49M2n23
8101d50L05L41n4n8j08K1J41k71M2K02k35K25l61J94O2J28j41P5k00K67O3l56
$$ y = [-27, -212, 31, 321, -4, -81, 62, -193, -47, 15, 9, 141, 113, 25, -59, 149, -188, 19, -305, 41, 120, 283, 91, -44, 56, -205, -165, -9, 110, -54, 87, -156, -39, 58, 125, -78, -280, 43, -23, -174, -101, -19, -122, 146, 94, -42, 153, 87, -172, 42, -29, 167, 260, -186, -156, -128, -67, 175, -96, -3, 29, 329, -149, 38, -135, 22, 304, -101, 52, -190, 65, 219, 48, 242, 108, -186, -29, 567, -76, 202, -61, -62, -90, 304, -19, 166, -173, 70, 63, -138, 75, 171, -122, 205, 38, 100, 75, 93, 102, 123, 40, -92, 128, 33, 46, -47, 63, 140, 82, 90, 88, 169, -145, 60, 21, -24, 161, -248, 19, -77, 245, 225, -98, 203, -253, -41, 103, -243, 28, -49, -109, -156, 116, 282, -11, -84, 26, 211, -22, -117, -226, 17, 255, -60, -107, 50, -232, -145, -35, 86, 77, -4, -266, 76, -189, 150, -178, -7, -118, 31, 73, -450, -145, 196, 142, 84, -24, -3, 138, -133, -91, 111, -124, 101, -260, -66, -4, 124, -17, 58, -142, 125, 188, -168]
8123a68K50m9j91K07j92K01J23j60Kr7k32M48J8l60M2K91j46J52k38K52k42j39
8145b28L6n8J25R5r3k4N3o5j03M06l12K36J51l02j52J52J56r2k53k6L86L0Qk81
8169a55R1J58j49J25q9j17J60o6j79J64J44q7P6J04k62J45j7j33K01j7M7k09
$$ y = [-168, 82, 33, -158, 49, -143, 58, 181, 21, 23, -74, -306, 142, 160, -200, -158, 133, -13, 139, -99, 153, -89, -228, -192, -250, -125, -30, -123, -147, -94, -159, -262, 144, -168, 68, 219, -83, -235, -83, 73, -19, -272, -298, 88, 118, 126, -155, -64, 94, -55, 70, -19, -136, 24, -42, -221, -57, 87, 0, 76, 180, -82, 63, 46, -87, 114, 97, 144, -65]
8191f5
$$ Imaginary data points
##PAGE= N=2
##DATA TABLE= (X++(I..I)), XYDATA
0@%%%%%%%%%%%pJ5j6J6j6K4l2L2m0N6o4P2q8J04j20J40j64J90k18K50k86L24l67
34a95M15m68N26n90O61p39Q23r14J016j127J247j380J524j681J855k043K248k476
52a298K730l012L325l676M075m531N056n671O402p287Q387r795J1670j4312J8330
67A0393k5258M0469j35768J12741K23983k36403j23916J19699Q6414j03820m845
78c6311N6391l0247m9090Q9480N2047q8878p5921Q1338Q0833n0931j00983J1047
90f1225R2586M2088n1425m2992j80K068K725M1233J9856m8074l3489M4580K8673
103C6424l4451j7620K4219j839j5992J7571O026l6564L295N8156j568q4099k7750
116g4192P9113O0682m4150o4271J1683M4774m999k3508J9825J9627l5624j8704
$$ y = [0, 0, 0, 0, 0, 0, 0, 0, 0, 0, 0, 0, -7, 8, -8, 8, -8, 16, -16, 16, -24, 32, -32, 40, -48, 56, -64, 76, -88, 102, -116, 134, -152, 172, -195, 220, -248, 278, -312, 349, -390, 433, -481, 535, -592, 655, -725, 799, -882, 973, -1070, 1178, -1298, 1432, -1580, 1745, -1931, 2144, -2387, 2669, -3002, 3400, -3887, 4500, -5295, 6375, -7937, 10393, -14865, 25604, -110164, 2577, 226560, -9843, -133759, -14060, 72354, -31466, -36311, 20080, -10167, -59257, 30223, 82270, -6608, -82529, -1191, 79642, 28711, -72272, -61225, 31361, 73449, 22024, -20968, -21148, -19080, -16355, 24878, 44734, -3340, -36829, 7751, 36424, 1973, -15647, 8572, 6733, -9259, 8312, 14338, -22226, -18931, 39225, 37657, -46442, -74192, 4921, 65603, 21453, -42818, -31135, 13639, 8640, -14868, 4957, 24584, -11040, -29744]
128b9744M8653J3905o1549k787P9101p189j00430L094J08177O721r3681m862O7916
141B7325j4443n1084L7199N0610m2577m7693L6528L4899k9018j6947K9771N306
153A9876l3649o594K6120P608j3650r32L714j3572j0179J8500K3419o552k6682
166a2573p926J6799J5475k694r246j551L811o35m081r48N709O734j275j1540j2946
181a6887L403K2223J1958j9626k3169R539K3429j601j4911N739J1344j1306j2110
194a1975J2714J2417r379n780P727n241j5509Q891K2618o579k3908J860J6506
207D362l232j0153J0433J1041j2734j3579R951J4132l411p675K569J186o405j238
221d753Q057M073o082o023K76J135Q20L313L574l325q205M3R235N359o098m422
$$ y = [-29744, 18909, 32814, -28735, -31522, 47579, 40390, -60040, -56946, 51231, 57952, -35729, -40591, 27325, 12882, -38202, -1003, 49607, 7030, -40663, -4135, 30764, 1746, -15201, 14570, 19876, -13773, -20367, 5753, 13361, -289, -1221, 2493, -11079, -21258, -2758, 20661, 14109, -12573, -20499, -3700, 11775, 9081, -165, -1716, 2095, 1460, -2621, -3569, 2140, 8874, 7599, -3941, -16887, -13484, 8739, 20697, 1071, -22098, -12559, 10870, 9269, -5642, 97, 11441, 135, -11975, 739, 13156, 3777, -2003, 5724, 483, -15026, -6135, 16483, 9904, -14004, -12144, 4362, 1130, -9023, 1410, 12451, -283, -13862, -3911, 10221, 6810, -865, 1704, 2890, -3515, -4753, 3304, 7377, 1295, -4728, -4452, -3317, -2497, 816, 4390, 1065, -7140, -7097, 2138, 7497, 1399, -3023]
237c023N478L377p431m019R084P060q126r483L244M849j621L67M131n045r219
252a0377N625J1766l680r826N095Q904o861p814Q491Q471p027p201M638L363n353
267a786j042O593l43q245j645O362J966m260j31N026j819o512L304R728j510r899
283d213J960Q480l102p134N265N559p957n804P892L665q685k253Q864N36q214
298e141N34P692p80m300J956L657k408m111K952O651j673r070j129Q378K707q795
314b880k823O799L97o197L070O014o745n366J0115O082j0791n261J1032M700q173
329b7k341M891j425l268M774J595p129l147N983M018l957m304P08L649K458k278
345B00k089J036K000k56J641P41m675k328P258L531q418n082P044L249o104m64
$$ y = [-3023, 2455, 5832, -1599, -5618, 3466, 10526, 2400, -7083, -3839, 1010, -611, -244, 3887, -1158, -10377, -4752, 7014, 3334, -6492, -1397, 7507, 646, -7168, 1323, 9794, 2767, -4434, 204, 3567, -1786, -2828, 3765, 3422, -4823, -6468, -106, 1860, -2400, -2531, 2495, 676, -5836, -2532, 7196, 5686, -4213, -2253, 6227, 3125, -4009, 1256, 6815, -1142, -6946, 946, 4611, -4074, -6327, 2537, 3073, -5141, -4607, 3085, 2305, -1995, -39, 3618, 1210, -2901, 51, 6702, 5029, -4041, -5170, 3208, 5915, -2880, -5703, 1096, 1493, -4704, -1634, 4380, -2365, -7731, 2384, 8466, -2325, -7586, 3446, 8146, -27, -2368, 2523, 1098, -2170, 2604, 4199, -2930, -6077, -94, 3924, -33, -4337, -3629, 20, 2478, 200, -1889, -853, 1147, 891, 2532, 3273, -1402, -3730, 3528, 7059, -1359, -6441, 603, 3852, -2252, -2716]
361b716L854k924l464O307L666p270l562P788M215n289l063L123J962j231j26
376A270j70j680p17J577J808j766m203k72N173K204m374l897L979M033k475j514
392a024J976J22j607K340J257l678j556M397J508m854k467K714J451n35m77p50
408a183j596J007L248j75k460j90K243J132j404j033J228J484n22k234n18Q40
424a33K98K66M24k206k890J084N261L98m725j451M453J431k253PK316j44j975
441A61N56M49j498j60K587M44m417l167K927M933Jm478k659K071L379R32j756
458C05j081R51Q12j65j14L51L07l00K18n91k895j021L911M001l699o963O09P156
476A792K338l807k593J265M41j6K163J357k042j501J124Q37j127j485J718K520
$$ y = [-2716, 1138, -1786, -5250, 1057, 4723, -2547, -6109, 1679, 5894, 605, -2458, 665, 2627, 1396, 1270, 1100, -580, -1297, 280, 2088, 322, -3881, -4153, 1020, 3224, -1150, -5047, -1068, 2965, 490, -1024, 952, 1074, -533, 1807, 3064, -614, -2170, 2227, 3735, -1119, -3586, -872, 579, 44, -433, -1183, -2779, -1772, 1476, 1301, -1159, -1349, 894, 2026, 622, -411, 817, 2301, 1779, -455, -973, -133, 165, 431, 855, -1351, -4241, -3157, 2104, 2502, -2223, -3674, 779, 2210, -43, -36, 2280, 2136, 161, 717, 1166, -332, -492, 2095, 2539, -1878, -5045, -2118, 2815, 2816, -1662, -4321, -2250, 1129, 2061, 305, -776, 175, 987, 822, 708, 1059, 1366, 1066, 1284, 693, -2202, -3223, 688, 4689, 990, -5973, -5364, 1792, 4130, 323, -2270, -1005, -564, -580, 1583, 2940, 898, -603, 521, 1358, 231, -1254, 464, 2984]
492B984j160n137k993M510O587j453o679j292M085J421o46K009Q88m774j924N198
508A624L257m412k766M112J734n351l574M624N037k071n023k108K073L157J952
523B265O00k889k719j82L052L368O21l520k975J867K750k161k688M374K984n379
539f32o429L842O542j117l366J537o54m486J606Q698J348p992m059N150L710k655
555A043q57J254n31j779j575L56K292K388j486l465p61R88J545K028L642k801
571B281p686k56R043L947o259l684L268J02l443J864M226j276m789K72J941j410
587a859l99M140K221m370m312J482M334K969k57l596l713P57M915R85k446j269
603d18K75k100r08L696J978k969j274K429j439l890L109P542q76p894j844M454
$$ y = [2984, 1824, -3313, -6306, -1796, 4791, 3338, -3341, -4633, -548, 873, 227, 2236, 3124, -1650, -3574, 1624, 4881, 469, -2297, 1815, 3549, -1802, -5376, -752, 4285, 2214, -2809, -4917, -2844, 313, 2265, 2865, -24, -2743, -2925, 127, 3495, 4116, 596, -2379, -512, 2238, 77, -2611, 1763, 4747, -632, -7061, -3219, 3323, 2206, -1160, 377, -277, -4763, -3157, 5541, 6889, -1103, -5162, -12, 3698, 1043, 186, 1440, 909, -870, -2445, -2089, 203, 2591, 1105, -2360, -3121, -2133, -588, 1440, 5082, 2281, -5405, -5661, 3382, 7329, 1070, -2614, 654, 756, -2687, -823, 3403, 2127, -2662, -2390, -449, -1859, -2258, 1882, 4103, -267, -4579, -3097, 1237, 4206, 3949, 353, -3360, -2603, 2312, 3297, 851, -418, -143, -2243, -3151, 545, 2523, -446, -1720, 709, -730, -4620, -1511, 6031, 5155, -2739, -4583, -129]
619a29K078J27J402k022m660n76M650J937k283j193K84j160o01J464J109O57J006
636B090j240m451J5O017K666l830k627N11l29m4L860K290n760m061L081L188j798
653d22q97K898n16l721m45L405J287q9O44j414l752K91M972K065k810k506o00
670a610l95J013K810J11k940j606J598M82j090K067K389j600l577O17K399O03
686A271O92K34j913l038J058L342P20k123j293m97m72O06K602n7j264n12j95o73
704a512N53L273Q25k634j822R14M88J62K091k59l047j891K132J722r85l10Q59
721E59j446j383Q99K600N8j031k04%j285P02K546O77k639j171N54L15J53J119
739A023pj732j308Q75J027J13M39K41j339o59R62J516K83j72m40j229r90J619
$$ y = [-129, 1949, 2076, 3478, 1456, -3204, -3780, 870, 2807, 524, -669, -385, -1545, -2146, -682, 427, 1084, 2090, 850, -3601, -3586, 2431, 5097, 1267, -1360, -849, -1178, -1222, 2638, 4928, -832, -4893, -1812, 1376, -422, -1319, 1579, 1063, -2658, -3103, 302, 1589, 1500, 2144, 730, -3022, -2731, 2241, 4306, 1496, -1010, -1610, -2005, -992, 1818, 1929, -1011, -2617, -1019, -537, -1627, 440, 2829, 1229, -2348, -1731, 668, 1271, 1963, 2197, 284, -2754, -1696, 1646, 2366, 243, -1050, -1547, -2019, -1413, 1189, 1132, -132, -644, -839, -1512, -959, 2314, 3139, 505, -1317, -403, 85, 247, 2338, 2079, -968, -2859, -727, 995, 10, -300, 559, -887, -2270, -1371, 1229, 1287, 256, 52, 52, -1233, -531, 2015, 2692, 53, -1118, -564, -249, -96, 1023, 1016, -716, -2024, -1149, -122, -9, 430, 671, -668, -1327, -365, 1151, 1434, 1262, 822, -407, -1397, 222]
757B22J350n85j209l36m1o18O07J242k43j481K66RK76O11J397l88j312l98K94
776c37R61L44j2l36j457k91J113O20n27m32N8o46p71J476J016l87q72R5L27m76
796e34J198P46j4j431p66J001N8J49l77K6l39q92M51N41L05j49n97M38J01J59
816G4M88J77L6m31o87N83O07k74k62l7m16l72l8N63m8k86m74J93K93N46J73L0
838D38k35k87J40M22M56l92j92O9l45k32J37J24k05n41J80k31j00O23L19m20q9
859c61j26N58M69n6j10l01P5o2K57mk77j42K29l33l22J66L90l7k56m44N72j77
881b92L94O0K82k15k19M24O1Q4m98o7J51O5n81k88N05J67m14m4j19K49l2L98K25
904B96p97Q2O67K79J03n54n0L25L6q0k72l49L06K47m70m26L89j02L17J4l03P4
$$ y = [222, 1572, 987, -222, -558, -599, -1217, -610, 632, 389, -1092, -826, -817, -541, 70, 1467, 1079, -233, -631, -337, 624, 968, 956, 620, -837, -1128, -15, 605, 78, -354, -296, -942, -1713, -237, 779, 392, -480, -385, -58, -534, 664, 1410, 1396, -35, -801, 200, 258, 407, 30, 56, -283, -1175, -724, -183, 122, -27, -624, -186, -85, 74, 562, 739, 775, 344, -343, 240, 847, 573, 311, 274, -142, -514, -552, 11, -37, -323, -797, -604, -311, 235, 408, 438, 203, -84, 56, 478, 934, 542, 350, 419, 74, -158, -21, 103, -102, -643, -463, -694, -794, -171, 148, -272, -361, -487, 71, 540, 484, 374, 73, 148, 86, 343, 339, 62, -80, 149, -184, -506, -340, 50, 13, -243, -687, -115, -292, 102, 162, 444, 229, 10, 434, 495, 579, 81, 14, 165, 230, -351, -639, -134, 33, -381, -425, -544, -295, -327, 71, 296, -501, -419, 248, 527, 630, 76, 26, 351, 387, 307, 35, -314, -8, 239, -231, -657, -268, -370, -53, -39, -342, -268]
926b68QK16M44l30K13m75N47M41k65j001N61K92j30n39m10Q11q3l96k44J87J8
947d03J52K65L92l17n20N71Q83k89q88k02L94N91n70n10K90O6j40m34K92K29q1
968b29k91K71K04m83O4Q74P96j156n64L62J246l02q42j76L63k27m13N73q7j37
988a54l54Q5K08k17J82K48P73m1r70l68J031P29m53o67l29M35m08K17K98k75k85
1009c15j21J91K93l48j67K67O36p61m17R13J188m97q68l44O72Q2j73L40l91o84
1029e04k46N02M85k0o66J03J7j54j0L10O73N41q26p59N02P08J35m89P2j36j078
1050h40j86J698Q2j335k24N43K76n11L11Q06r7o21m24L73N79L16r8m84k95QQ1
1071d2R80l83n15o83k54P22L61n2k37O8k25m79O13P14K60l53p64Q4J22J86P63
$$ y = [-268, -260, -44, 400, 70, 283, -192, 355, 796, 531, -470, 91, 383, 253, -286, -696, 115, 32, -364, -608, -421, -403, -251, 14, 406, 89, -431, 140, 1023, 734, -154, -356, 38, 629, 59, -451, -161, -95, -235, -669, -377, -148, -229, -520, -249, -45, -528, -464, 410, 1206, 50, -514, -152, 1094, 792, -50, -226, 137, -90, -503, 70, -17, -154, -508, -423, -215, -432, -250, -2, 771, 730, -240, -608, 423, 1152, 699, 32, -297, 138, -270, -53, 245, -30, -315, -436, -245, 48, -300, -467, -200, 436, -325, -742, 171, 1359, 862, -6, -350, 322, 404, 231, 571, 180, -504, -750, -248, 237, 217, -449, -346, -329, -483, -493, -183, 490, 1031, 205, -554, -52, 656, 791, 302, 374, 238, -840, -1026, 672, 754, -581, -805, -262, 14, -497, -186, 620, 523, -98, -522, -149, 430, 746, 648, 164, -131, -123, -42, 938, 555, 40, -643, -897, -175, 186, 134, -103, -35, -260, -739, -126, 588, 848, 495, -269, -185, -63, 123, 886]
1092H86r2n91j227M38N66K26n2k44m40j59N36L56P5L8%m79m10Q02P38N1r88r2
1114f2j67n65O59J249m52j309n43N42L27M48l5M49j102n01P94P70K68n4j07m91
1134A18n73Q8J131k24r1r05n44K28M53R43p1r97j83J78J21M94O02k42q72k14M25
1155a35N36l8N94j35j410o93R89P95l19r8k86o58o72J224R99j45p90o9j70R2O14
1176B25J200q08q65nK73o8R8Q42p49p27l29N27O96j58M3l65n75k39J180M90k61
1197D25k11l25l37R7P22O39o52k53o73M4J27P00L81o63o82p7M02M59R6L97n87
1218B9o19K19N52L83j88J39m94o50K08R69L16o95k49k09p35M00R45M27r07n61
1238g20L99L01K11M70K94n13r55O1R27J43j47Q6n67o40pR12M8r2n40k16j70J90
$$ y = [886, 794, 203, -1024, -586, -20, 206, 154, -90, -530, -689, -153, 203, 278, 316, 316, -163, -573, 229, 967, 1018, 30, -62, -229, -794, -135, 1114, 662, -647, -1190, -648, -321, 127, 92, 541, -561, -1062, -268, 502, 770, 716, 609, 118, -455, -367, 764, 540, 449, -456, -1000, -772, -319, 624, 553, -444, -627, -449, -328, 166, 768, 526, -346, -560, -135, 401, 363, 957, 822, -588, -1281, -292, 503, 184, 86, -200, -858, -1530, -306, 693, 548, -242, -311, -481, -389, 225, 1425, 617, -248, -253, 20, -48, 50, 892, 143, -584, -913, -386, 310, 152, 195, -170, -745, -984, 196, 686, 425, 214, -111, -448, -351, 371, 1010, 358, 105, -568, -524, -397, 303, 684, 21, -661, -738, -336, 123, 219, 616, 29, -590, -371, 181, 564, 376, 515, 21, -629, -421, 548, 864, 169, -80, -289, -1024, -624, 321, 748, -159, -720, -321, -20, 191, 661, 955, 442, -513, -452, 475, 618, 471, 557, -10, -650, -657, 255, 303, 211, -329, -545, -715, -525]
1260e25J019J81j01p12l62L74K82N09J84p60n74L74m8J36M08j51m34m95J69K80
1280b46M29k9k82o2l94M92M44J35k70P9j63m82L16M36K91r31Qj00k55K59Q80m96
1302E9n43j37M11M9L43K08Kn21l81O43K03%k67L55m03m71M21K17%l06j80Q2j28
1325c44k51O09K22q3l37k99M98K44R5o0O5l58k48M17K11j67k86j07m51M2M33L67
1347B12l51j57P5m9M02J96Ml40q7K4L89k48J61N3l29q2J68M4j34L15m67j54nK30
1371a30J3J93J32k47n0k70K58M30q2j53J70m30J94M6l1R0j29j80j88Q7r4K06K59
1394I4j19j67J06NM23k22Q2j31J14j54J60m1j48l1rl57J74K14j26j47J50J04K46
1417B20o52L60L66l33J14q2K26L07o33N8J68l93L64Q0R0l92o4j67J52J52J91k22
$$ y = [-525, 494, 675, 574, -138, -500, -126, 156, 665, 849, 89, -485, -111, -159, -23, 385, 234, -200, -695, -526, -246, 183, 154, -128, -190, -584, -92, 352, 487, 217, 296, 133, -349, -33, 403, 694, -237, -229, -329, -584, -325, 555, 59, -484, -621, -210, -161, 182, 390, 392, -129, -510, 133, 336, 336, 69, 424, 21, -450, -29, 188, 188, -118, -298, -216, -344, -595, 14, 236, 153, -184, -483, 15, 259, 354, 294, 359, 1, -247, 170, 381, 214, -72, -179, -630, -588, -155, 212, -139, -296, -221, -270, 132, 328, 332, -8, -95, -71, 318, 70, 231, 284, -45, -127, 41, 85, -49, 266, -201, -355, -360, -130, -117, 76, 208, -39, -89, -359, -101, 329, 247, 94, 264, -166, 28, 74, 43, 133, 4, -176, -364, -277, -371, -165, 94, -25, -192, -86, -81, 342, 120, 202, 71, 185, 31, 191, 150, 2, -29, -38, -395, -221, -7, -133, -280, -130, -26, 220, -432, -72, 294, -39, 75, -7, 219, 526, -107, -49, 119, -274, 90, 170, 260, -132, -196, -363, -211, -59, 132, -90]
1439i0K74k84J5m1M99l13P2j06J2j5K09r1K8j1n91L22r8J71K69l93J82j42R8j31
1463a55K8J16N3K07k39L02q8j86MRN1k10r2J62K0k09J86k63l7K89j37J86K14n55
1487c44L84J70J81n42J92J51r4j71L85k07o7l0l17J06J04L65l96J15k7r5K22l2
1509E3K84n47L98l5m8M9j38l9J79r8j21r5J28N2l34k4J4K92j79j9M12l3k92q3
1533b24M46k97L43J09k29j83J14j7L1L5j04j91k03L95k09R5J14Q3j98k05O3L02
1555G0M15m79L62l34K30L2m2o4k99J89j67O6k63L85r6l47M69o11P64l65J94k9
1577H0j40K75k02M7J38n9j09j06l33M39J46J52p24o9J20m5J57L59n7k35m7J93
1599b0J23J4J73n2m8k48J48M8l29N25o76J52k38L47K09o5j52o2l7p4K25K87P1
$$ y = [-90, 184, -100, -85, -126, 373, 60, 132, 26, 38, 23, 232, 141, 169, 158, -433, -111, -209, -38, 231, -162, 20, -122, -24, -155, -127, -11, 42, 249, 10, 312, 224, 38, 42, 51, 102, -108, -200, -38, -18, -227, -41, -304, -341, -52, -189, -3, 211, -344, 40, 210, 391, -151, 41, 192, 98, -73, 312, 105, 38, 8, -309, -203, -99, 266, -130, -15, -42, -137, 85, 53, 337, -210, 188, 153, 105, 154, 16, -23, 156, 58, -63, -158, -30, 22, -312, -336, -322, -30, -209, -228, 184, 151, -141, -224, 222, -75, 268, 377, 148, -35, 79, 62, 93, 128, 24, -167, -370, 25, -184, -89, 25, 108, -90, -295, -232, 70, 485, 6, 368, 34, 264, 296, 254, 190, -109, 80, -87, -21, -284, 101, 5, -342, 127, -484, 280, -85, 109, 80, -60, 215, 13, 60, 198, 139, 30, -76, -409, 30, 176, 328, -396, -465, -345, -390, -233, 126, 69, -166, -213, -20, 103, 117, 290, 238, 190, -58, 90, 138, -191, 334, -342, -190, -428, -81, 128, 63, -89, -151, -188, -262, -37, 250, 321]
1622C21n45Q5L26K54j45j03j47j7k60j94M88M9q0k18j48M2L80n1J01k15o9L18
1644A72j37J00K09l91Q5k5R4J40k22M10n22P3m01L71n6M00k05K6k53j53J72R6
1666a7J97j05j45q3M38p3K97l13l73J3j13k0K33L28k21l30o1nJ88L01M9Lj23k53
1690a88L39m5K48r0o0o6n69N30R3o0k63k6j41J45q9K84j33k5N7k30L46J70J75
1713D02l94j36L25J36k6k09p2J1p7j33J00J23K0R2k99k62K41J78L55l67j07p6
1735a75J04M6L01m0j16j6j55j94J94Q1J17l12l82N08j87M22l78K01J10n76K63
1756a84L98K25k46k06Q4j94K61r9L11l62k58P2QJ39M7J36j81j48j6K34j2J44J73
1779C26m58J56KN5m9J01k02j96l5j40P88j03k75k14K31j52L57l47O63n14O4l60
$$ y = [321, -224, -139, 187, 441, 296, 193, 46, 29, -231, -425, 63, 112, 32, -186, -334, -292, 88, 37, 138, -77, -146, 172, 35, 135, 344, -47, 38, 13, 107, 247, 25, 435, -87, -14, -415, -44, -100, 300, 95, 121, -132, -285, -113, -17, 180, 75, -70, -153, 285, 212, 509, 196, -177, -164, -277, -297, -64, 264, 43, -287, -348, -353, -165, 136, 185, 188, 65, -188, 151, 106, 354, 264, 204, 138, -431, 99, 192, 132, -131, -157, -298, -153, -242, 42, -91, -116, -59, -289, 57, 227, 402, 8, -128, 197, 333, 307, 98, 26, 37, -40, -173, -73, 50, 70, 162, -137, -399, -158, 20, 375, 8, -99, -175, -71, -25, 276, 236, 120, 104, -51, -245, -51, 30, 147, -165, -547, -39, -226, 196, -182, 19, 129, -447, -184, 214, 439, 193, -13, 71, -123, 138, 39, 350, -12, -270, -198, -190, -51, -4, 132, -49, -197, -213, 21, 9, 153, 326, -132, 24, 26, 81, 32, 133, -69, -265, -300, -440, 348, 245, -30, -244, -13, -165, 192, -155, 508, -6, 58, -302]
1801c02L84K8J73k09l3N6k22M46l57J80m4k96j52P7J03J1J53k55k4J22N8M39m16
1824h0J62P9n4k6j39J55K06l29j66mQ6j43K66k21j67J57q9L02L64l70O0j52j66
1847b69K18J74N2J91l17l25L25J94j06j53q4j86lL25K9n0l4j51M31j68L5NQ8k2
1871A99l21Q4LJ19P9m6j18J3j27r3K1L42k68p9m7Q9K96p8K0l02N63n17J98J61
1895A91m9j6l20Oj16L36J06j39j98k12K28J53J83j50j11Q4n8j59L58j09p8J12
1917D2J19l28K58M6O4j68j71K82j42p3L6N1J95l81j5L78l73J05L5K09j91K31m74
1940b65N04k62Q7R9k49N5L3R7k99Qn7P1J50l0O1o9j00K97j99K02j4K56k91pkR5
1966A71j58j44L3o7q4J91P9l2k86LJ45L70l10QK25j49K0r0J52J20l94K02K9nj54
$$ y = [-302, 82, 110, 283, 74, 41, 97, -125, 321, -36, 144, 100, -196, -348, -271, -168, -157, -4, -259, -283, -161, -103, 336, -80, 82, 161, 107, 81, -58, 97, 303, -26, -192, -196, -110, -253, 13, -208, -375, -218, -307, -5, 359, -11, 49, -103, -269, -51, 123, 175, 366, 49, -276, 49, 243, 137, -16, -100, -286, -289, 36, 65, 15, -19, -170, 261, 93, 128, 133, 221, 199, -122, -38, -35, 84, 163, 117, -1, 12, -115, -208, -187, 155, -113, -192, -239, -150, 146, 68, 88, -214, 349, -168, 30, 191, 142, 126, -194, -188, -304, 32, 138, -1, -199, -411, -183, -30, 153, 3, -108, -24, -82, -241, 117, 8, -70, 42, 161, -167, 91, 137, 201, 33, -138, 144, 2, -71, -35, 16, 211, -170, -185, 193, -180, -75, -40, 169, -22, 209, -265, 239, -23, 64, 163, -86, -31, 2, 99, -200, -192, -249, -178, -28, -58, 3, -66, -166, 131, -68, 134, 120, 376, 85, 78, 76, 171, 13, -131, -98, -165, -249, -58, 21, -11, -297, -294, -149, 221, -89, -81, 144, -5, 15, -75, 77, 197, -197, 5, 34, 29, -125]
1991a25l6J12j91q6K80l07M58j37j16J52M7p0K71p4j70j00J75j09K39q8Kj94J43
2014G6j48%J35q0Lj40L94m56L9j25M7M3Q9K84l4j09k1k5l1O8K5R1m46J38R3K02
2040A12j54J23l4J59j06k89N2M30l21Rl9j13M84k70o9r8J86r8M22m78j1j36J48
2063i1n5j15J07L31j42l55L41K07R1n91K62J73N8k77K32j18k37J8J87j00m5O64
2085E45n19j23j85M16j43R2j04K47l54R2o1R2J53J94k3l71p6M23k62j04K42j16
2107E5O8m33K82k3M4K51k46p1L44m4j27Q9L57n19N9L3kj27O8j42j04L26j54J41
2131A25k83K57k69m5J55L83m85J00K36j38j04K99j60j79K81m35L30j84K74k57
2151i9J33k05P6k4L7L2m2o9nJ42L1mR7k44L63k54L7J7l2K18n27J35J11K40l30
$$ y = [-125, -161, -49, -240, -326, -46, -353, 105, -32, -148, 4, 51, -19, 252, 178, 8, -92, 83, -26, 213, 125, 127, -67, 76, -72, -72, 63, -17, -14, -154, 240, -216, -177, -302, -255, -212, -123, 161, 127, 18, -3, -28, -59, 9, 34, 125, -321, -183, -90, 112, -42, 81, 47, 206, 100, -189, -137, 293, -28, -19, -58, -171, 313, 43, -26, -124, 62, -36, 386, -92, -103, -239, -91, -146, -261, -154, 177, 35, -320, 21, 228, 319, -272, -10, 163, 221, -56, 176, 58, -179, -161, 26, -74, -119, 545, 26, -97, -282, 134, -9, 83, -21, 226, -128, -36, -97, -5, 148, 342, 319, -52, -128, 295, 33, -71, 171, 55, 123, -310, -28, -51, -7, 244, -2, -73, 271, 227, 100, 189, 546, 27, 86, 119, 117, -10, 58, -84, -188, 138, -16, 125, -158, 99, -170, -215, -60, 323, -162, -62, 174, 36, -68, 231, 71, -108, 173, -262, 68, -116, 158, -99, 34, -171, -95, -119, -82, -50, -92, -161, -166, -24, 7, 3, 100, -144, 219, -35, 2, 19, -13, 205, -322, -187, -76, 164, -166]
2176a66L09k25j8K58n36L99q5L64m40J98L07l70q3M62n57K05J10k00Q4K4Kj59
2198a17L19m62M35l4o6j79p3L00rj96N8L9n4j17J68j77M33m67J12j08J72j23O6
2221h0l9K99k21j8p2K25J85k8j85K00k81j4j18K35j24k7r5m9L38j44j98J31j19
2244a99m8J75J45L47l98P5nm0KK42l91L22k44m2k8J67J82l95J69l4j52J63j33
2267a20Q7k31J02R5J38k71K26L78m23J05j64K71NP6k99l5j51L21j92jr3M2K01
2290F7j3p8J53M1r8nj10o5M3O8K21j09m04L81RN0j83J36o1l39J8J40K15M27p54
2315b50K22k1PM2L70j83j38%L78k76P3k85M4k14P0J68j22J3K68m43K68j48K1L82
2339B46p9k05k9L7J14j86L36j96nJ28j42K38q3k59j19K57j17O9k94M28K5l4j06
$$ y = [-166, 143, -82, -100, 158, -378, 21, -64, 300, -140, 58, 365, -5, -88, 374, -183, 22, 132, -68, 16, 40, 42, -117, 202, -260, 175, 141, 75, -104, -177, 123, 114, -82, -24, 15, -39, -156, 12, -165, 268, -199, -87, -195, -23, -146, -80, -119, 180, -41, -59, -131, 94, 279, 251, 66, 266, -15, -29, -147, 88, -36, -63, -158, -207, 131, -13, -211, -80, -199, -247, -72, 73, 420, 22, 97, 92, 52, 54, 296, -95, 227, -17, -59, -87, 80, 262, -133, 36, 2, -150, 13, -120, -33, -264, -162, -67, 71, -200, 26, 404, -19, 86, -78, 193, 198, 274, -25, -60, -211, 110, -82, -83, -176, -134, 67, 54, -24, 129, 170, 72, 67, -43, -108, -65, 3, 224, 115, -289, 92, 101, 151, -32, 104, 43, -296, -278, -138, 77, 504, -250, -28, -49, -42, 0, 370, 187, 49, 49, 427, 151, 224, -61, -17, -231, -161, 7, -115, -102, 166, -277, -9, -157, -136, 246, 167, -38, -67, -30, 84, -102, 234, 38, 33, 161, 19, 257, 174, -85, -204, 53, -64, 5, -289, 139, 164, 130, 24]
2362B4k43J42j16K19j08l0r1L52j13l34K91L8o0K5N5k69L20rk29J86L68k62pJ71
2386C20j41k37J00J46k34j1q9Lj82L54J63K03k94Q8n28K82j77J75L44k76j4N6
2408E1K08j14K46l39K28m93J64j26L29j9P3k94L0M0N5n7K4k44J15j05P0N7r2M
2432a89J11J49j03rk31L02K07l54l5j41R9N5k8L46l27K7m6K08n26N06Pl8L7J09
2456A36P5j78L1J46m78K14r4J24J6n6J12l20K30j77M1J46L8j7m2J4L3j23M7j64
2480b46O44n79L58l76k3K01l56L93O5K0j97J28j28P4O2M8r1J6l8J36j77J92j4
2503A12K0k40j39J87J97o7K3Jk37M16m17K8Q4Q4J12l46K05J0j2N8p2K17j64ll3
2528B4K39l20p6J35j5l96L19J80j41O2l53K80j3j19K38l05L52o9J74m45K07P2
$$ y = [24, -219, -77, -193, 26, -82, -112, -203, 149, 36, -298, -7, 31, -29, -4, 51, -218, 102, 93, -136, 50, 418, 156, 149, 320, 179, -58, 42, 188, -46, -57, -146, -143, -325, 29, 192, 395, 101, 189, -339, -57, -234, -59, 285, 9, -5, 51, 259, 145, 391, 52, 280, -213, -49, -175, 154, 135, 208, -86, -56, -16, 39, -18, 6, -238, -123, -228, -158, -101, -193, -189, -78, 71, -32, -41, -272, 30, 237, -117, -152, -293, -194, -139, -167, 179, -148, -121, -167, 41, -485, 21, 28, -10, 27, 136, 211, 33, 64, 210, -268, -54, -148, -24, -8, -64, 48, -272, -42, -219, -178, -32, 6, -11, -53, -39, -6, -129, -82, -246, 398, -181, 177, -199, -222, -21, -377, 16, 81, 101, -96, 32, -96, -22, 40, 88, -3, 13, -25, 111, -66, 126, 112, 132, -108, -247, -60, 137, 70, 93, 94, -143, 273, -144, -116, -32, 52, 164, -182, 23, 33, 21, 79, 7, 224, 60, 57, 24, 263, -57, -133, 2, -13, -409, -90, 90, -51, 11, -342, -62, -75, -194, 44, -261, 91, 22, 196, -249, -42, 30]
2550C0j48J92j20l4O1j36RJ31J00l66K88l03L70k12L43K1r5j67K96l65p2K50q0
2573gJ85l85L33j39j12J42q1J20j08J22m2k82L25O2k01K60j54j41K36j31M3j23
2595g8j0J20k11J6K26j79K79j75k5P7R1P8k34K3J14j70J53M8j87O1k30K71P8j21
2619A5j92J10J63p6q1l08K46M08m67OL41q4j03k8J59M0m7J19l96J2K02j26k7o2
2643a76j40K07J43o9j41J68Q3j43K5K22k62K45L5n7N2k28J36K2l12J11K49k37
2665f7q2P7j10J23K02o1p7N5l8l7K75j36m35N03L1j98J15K05l35o6K37l74J32
2688f1J06k32L78k47j47P6M4Q2L16k15r4K17k72R0N3k53L49j77k95K3J21J28j60
2711a70Q5K13k99M11k94R5k52J43OK07J0J9j28Plj35O7N2J36j58j8q8k06K72P7
$$ y = [30, -118, 74, -46, -80, -19, -155, -146, -15, 85, -281, 7, -296, 74, -138, 205, 226, 131, -36, 260, -105, -177, 73, -7, 178, -207, 126, -13, -125, 17, -64, 56, -52, 70, 28, -254, 71, 133, -68, 192, 38, -103, 133, 2, 45, -78, -88, 32, -179, -163, 63, -116, 163, -12, -37, 40, 131, 209, -25, -2, 112, -58, 95, 143, -44, 17, -213, 58, 136, 15, -177, -67, 96, 20, -61, -369, -123, 285, -182, -176, 165, 81, -22, -50, 109, 149, 102, 221, -175, -163, 39, -87, -114, -176, -316, -109, 34, -35, -176, -8, 75, -68, -43, 179, -83, 162, 197, 140, 192, -36, 100, 122, -190, -79, 170, -67, -149, -72, -182, -59, 143, 82, 5, 60, 22, -15, 260, 124, -311, 192, 223, 25, 140, 345, 10, -56, 181, -193, -61, 45, -187, 191, -56, -203, -127, -83, -1, 315, 100, 6, 223, -49, 41, 94, -159, 190, 13, -282, -259, -138, -10, -170, -85, 128, -171, 240, -54, 41, -211, -68, -62, 145, 155, 174, 46, 53, 50, -85, -18, 34, 170, 12, -6, -94, -300, -28, 49]
2736D9q3j0J35O1k10Q7K68m22J09L51j65j13m1k3J78j91j88l6R6L72j40j72k7
2759a15k0J52J52q2j40J05J37k63K26j20K8r3O9L1j72L2m6L83j11j72q5J63k60
2782b01K55R1k09r1J49q3J36K40k59j20K00r5k54K74J36j09k70J69p2n8L35l39
2804a75J53j75M25k66J06J55m4q7j16J68K02M6k97l03o0K72j25J29m7M7K19k09
2826A8k6k44K66LO1MPp1K04l01K65L1j40j22p5N08l60J7k54M9M0J44o8K75l30
2851i9J01Qk13M29j81o2k40L36r7J48r5J43l25J70L9k1j25k3J98k95J45J90K5
2874A56J7j94m9J73n4R8P9q7j75J71k2R3j05j80J61J90m74j07J78p2K78k11J4
2897a22J93k19M58j16m05K08J84k63K42k40L0M48l45j32k79L31j92J17J63j51
$$ y = [49, -34, -44, 91, 152, -58, 29, 297, -125, -16, 335, 170, 57, 16, -7, 171, -20, -208, -244, -148, 224, 84, -88, -115, -135, 17, 169, 87, -53, 52, 189, -74, 152, 32, 60, -33, 36, 67, -105, -73, -119, 264, 153, -19, -104, 59, -201, 54, 145, -64, -155, -6, -89, 47, 287, 28, -92, 108, 13, -241, 33, 169, 60, -210, -41, -113, -171, 164, -175, -22, -197, 228, -38, 68, 223, 179, 92, -24, 144, 346, 392, 95, -208, -268, 4, -121, 8, -39, 8, 227, 18, -8, -252, 14, 17, 78, 82, 89, 18, 222, -79, 186, 217, 77, -45, -120, 388, 28, 45, -209, -160, -120, 24, -44, 231, -99, 2, 10, -203, 226, 45, -17, -257, 79, -18, 130, 35, 178, -147, 23, 62, 41, -84, -107, 91, -204, -59, 131, 156, 173, -21, -70, 103, 49, 147, 226, 139, -36, 135, 113, 206, 101, -79, 82, 272, -202, -309, -131, -203, 75, -136, -122, 71, -148, 310, 194, -211, -3, 181, -82, 160, -80, -50, 398, 53, -79, -358, -27, -219, -102, 61, -90]
2917i0j7M80m23j58L26j90L06l8j2K31l81j08n8M3Kj5L1N1j89L6l2K48N6n4O2
2942A07K6k17j5K64J18k24j30J70l73K47K14j05l6j09L09k83J46k31J50Q1j06
2963Cl4J17q7J11j58J5J79j49p7K25L0j8q1L4j09q6J64L9k3J47r7Jp6rl0j7N0
2990F4P9j36J24J80j19k59O3J3j27J37j39J25q7K3P3r1L20k33p4J57j12j69P3
3013a15K85j89q3K85k25o0K12k78L07k55Q4j59K37L1l22J67j41J33K39n9K1p1
3035D4K2M5o8J20j27j94L61l43P6j12J54rmj90k47O51l92K24j97J68j3p2J89l
3059H3qj28R8kQ5l73M35l48R9L4J31m0r7j9j22K43j71j56L93p9j39J63P0j98k7
3084g3q0K65l57K25J54P9n20J75J08J39k58pJ90n8J06k21O9o9J28P3K15j77Qn25
$$ y = [-90, -107, 373, -50, -208, 118, -72, 234, 196, 184, 415, 34, -74, -132, -89, -87, -102, -71, -20, -209, -173, -205, 43, 99, 45, 107, 133, -84, -99, 165, 283, 59, -71, 99, -274, -27, 187, 82, 46, -63, 246, -37, 109, -122, 28, 109, 3, -31, 86, -1, 110, -48, -33, 146, -3, -80, 145, 175, 157, 76, 110, 1, -85, 79, 118, 95, 242, 145, 146, 70, 61, 31, 14, 64, 143, 7, 131, 311, 192, -67, -4, 9, -118, 19, -120, 5, -82, -59, 14, -77, 243, 10, -64, 93, -19, -188, -115, 170, -19, -102, 183, -42, -102, 110, -168, 139, -116, -32, -191, 46, 77, -245, -78, -219, -86, 153, 94, 115, 44, 66, 111, 43, 163, 36, -158, 203, -140, -64, -176, -22, -31, -35, -225, -472, 179, -213, 11, -186, -18, -31, -103, 86, 83, 75, -53, 45, 43, 128, -245, 190, -158, -59, -25, 106, 66, -31, -50, -172, 71, -100, -256, 137, 58, -81, 82, 152, -46, -73, -153, 112, -245, -20, 134, 213, -307, -132, -24, 115, -143, -150, 40, -18, 88, -133, -64, -133, -5, 68, 283, 106, 114, -411]
3108d11K83K15l85L19M43k95m70M72m13J39n4K57j71J43k31K41J77l37J40k10
3128a48L89j19k40op9L34k19j46M0J88j5K9L35l51N1j15L2J54j51j26L11k92K14
3151G0j41J01J04j9qk11l4j2J46k45J65o1nK13J87k11J15O1n2p2m06N21j98K63
3175B71m47J39qO1K33l28j84J97J21k13Q7p8K00j35o6R1j66L00k13k20M78l8o6
3198A6j65J20j03K93j52P2l10M11k05p0o6P5K08l0m08M71j07o9L81k79o5m6j30
3221a58R2M0q7m6o2K26j23R9J0p9K22L8n1R8j44o7L7N1j56J22j19J73o2l0k54
3246b30R1j86K19K16nJ04l79L87l92M95k61J8j83J82%r3p1J08J67n7o9L7m5l24
3270b71M41r5o5j13K22J8k94O9k13L73M9J7k35l2J12k57N02k69M9o2PJ02p0L6
$$ y = [-411, -128, 87, -298, 21, 464, 169, -301, 171, -242, -103, -157, 100, -71, 72, -159, 82, 259, -78, 62, -148, 241, 122, -118, -124, -203, 131, -88, -234, -194, -6, -21, 8, 343, -8, 43, -72, -40, 114, -37, -163, 148, -144, 70, -71, 30, 134, 115, 107, -104, -138, -150, -4, -249, -84, -145, -150, 63, 250, 39, 154, 215, 163, 91, -315, 206, 8, 271, -176, -37, -45, 16, 249, -79, -263, -66, 55, -158, -71, -149, 51, -84, -150, -59, -225, 75, -138, -358, 120, 82, 16, -149, -29, -132, 161, 9, 81, -229, 182, -23, -93, -159, -84, 124, 94, -314, 157, 50, -19, 362, 83, 18, -28, -158, -66, -26, -113, -159, -221, 5, -118, -19, -9, -88, 134, 172, 121, 219, 75, 8, 45, 96, -60, 62, -57, 116, 54, 24, -230, -139, -325, -106, 110, 105, 209, -170, 217, -175, 320, 59, 77, -106, 76, 76, -17, -88, 20, 187, 130, 61, 98, 53, -271, 170, 75, 10, -103, 119, 137, -157, -88, -301, 72, 121, 138, -97, -129, -17, -274, 228, -41, 8, -54, -47, 55, -15, 21]
3294B1j98k0J89j15K0J81K6j88j26K62p0p0j31K35K5J27l66J30J45j48o5k30L74
3317Hj61J04L9N4j78j7Q2M2j71L26q9qp7K59k74n9J99k00R5j06j9J06k01k2lJ39
3343a32K66q1l23L40l1K07q2k18Q7r0J59k69O9p5R5L1K99l17m8J92O0j22N2j0
3367E9M2m4o2j20O2L1K2j5q2M64m83r7J15jo5J72L9J01m6j6r7P2l2J55j57m6j42
3394a71N2M98n69K45r5q4J42n0j1L6p7J27M2o8k90J88mJ79O1k76N6J52l4l7M8
3419F0n9j97K26nj24Q5r8j6j28K4K04o6M8j33M61l10j97K46K88l33K12L5j84j3
3443B6j08J34j89J9K69k74L92m27L01k19M3r6J41J06l00L63k00M9M4j02J38pj01
3466BK69l15K77L2n14K6R4K19m56L22j51K89j20ro3J09J42k14j4J52k96M6L97
$$ y = [21, -177, -197, -8, -123, -103, 78, 104, -84, -210, 52, -18, -88, -219, 16, 41, 168, -198, -68, 77, -71, -136, -366, 8, -153, -49, -10, 44, -134, -151, -69, -27, -198, 128, 39, 31, -46, 213, -61, -120, 79, -121, -26, -132, -151, -45, -246, -268, -271, -132, 134, 53, -270, 70, 39, 246, 164, -54, 33, -57, 102, -167, -98, -173, -78, -47, 252, -65, -113, 79, 139, 17, 69, 59, 101, 57, -5, -125, -63, -32, -10, -25, -107, 357, -126, -223, -108, -109, -174, -2, 37, 138, 92, 76, -21, 51, 19, 174, 17, -29, -171, -119, 379, -190, 55, -40, -124, 18, -32, -43, -7, -84, 43, 85, 17, -273, -85, -89, 90, 151, -125, -69, 83, 49, 12, 60, 1, -196, 30, 25, -99, -14, -112, -128, -256, -232, -28, -94, -46, -179, 282, -28, -225, 21, 309, -24, 188, 223, 39, 26, -82, 52, -137, -118, 151, -123, 269, -158, 143, -76, -33, -129, 12, 118, -182, 181, -19, 30, 74, -28, 110, 103, 2, 271, -44, 233, 265, -249, -223, -129, 90, -366, -44, -195, 94, -26, -35, -98, 11, 153, -61, -75, 77, -219, -173, 224]
3489B24l64K87k94O4R6k45J7K12J29j61K0j4K0O5j08K05J8k79L04K3m18n4J27
3512a26J70k18k8J35K05k43Q9O1L2J0j19J92j26J77O7o6j92j71L08k41J6j64K67
3535C5j62K69k24m4J99P7m44l5L60m9R5N5p8J27j82p4K15l9j37j01J32J45j47
3558gj11l0J57p3J31m2j56J82j00j58K6q5L80j93J33j31K92nk70J0j40Q0J12M5
3582D7k53Q5J90j46J23L9j36j67L75o8j53L47j13k31R5p8K00K6k15k24J93J8K4
3605b2N6O8k1J22k41mK70J84l96J73l03L97p4N8j28k25k7K6R8n5P3K69j01k68
3629g1j27K36j06Q0m0j47M33j24n8K17k44l7j44L51k29j92L9J70J37k01k39J84
3651a12K12l11K82k45L71j26j04J38k01NJ52j6J36k15Q9l7r6m8Q4J24Q2k45j28
$$ y = [224, -140, 147, -147, -83, 13, -232, -215, -3, 126, -35, -15, -29, -9, 56, -52, 153, 171, -108, 196, 219, -199, -253, -126, 44, -174, -202, -67, 138, -105, -16, 45, 77, 87, -32, 160, 34, 211, 278, 212, 20, -151, 157, -84, -68, -232, 35, -127, 142, -82, -126, 73, 150, -294, -329, 31, -18, 77, 132, 54, 181, -1, -75, 140, 101, -36, -137, -5, 140, -7, -118, -148, 9, -64, 67, 25, -131, 51, -49, -207, -181, -266, 114, -79, 54, -77, 215, 210, -60, -50, -190, -110, 2, 47, -206, -121, 69, -77, 46, 85, -51, -218, 157, 89, -64, 283, 170, -61, 34, -44, 156, 182, -33, -257, -64, -46, -22, 34, 102, 81, 203, -38, -42, 228, 412, 16, 189, -114, 283, 209, 267, 139, -86, -113, -87, 11, -44, 29, 298, 197, -71, -198, 38, -68, 12, -28, -175, 258, 134, 76, 293, 49, 12, -132, 219, -10, -202, -163, 7, 144, -57, -296, -112, 100, -211, 71, -174, 197, 71, -33, 105, -96, -91, 61, 45, 181, -34, 55, 18, -78, -126, -42, 82, 164, -81, -209]
3674b09L3O4J43j08L69k76m93K15K20K4j61L22j1%k34J08l2JJ49l66P7O8n2K58
3698A09l13J21J71r6jL11k69J68j16k3k9k03Q3L76n55L03j91j14J54J87J87n4
3720B06k93J19K14O8j75k13K5J48m3J52k75M63l48j38L6J0j73O4J69J5n4m8p8
3743a49R2J58O3j75q1l21N58k53L9K0k2J68k33J11J71k00N7R8l57K62j43K31J74
3766B68m73K37j21j09K67m0Q7k2k6P0l94J83n6J72j6j89K13M6j58J53r9K36j17
3789A12r0M16m16K91l35Q4O8l27P2K44k83J1J23r3J83m7K6l10J91K02j25K22k25
3812fQl8J18J38l91J24R2K32k55R8k6Lr0K89l60K19Q4j41p6k44L87j34L6p6j38
3837a47K38k02J67P8l8J02k17K20j95k57K20j38R6n6R2K39k86o6M57k07j10j58
$$ y = [-209, -176, -112, 31, -77, 292, 16, -477, -262, -42, -18, -179, 143, 132, 132, -102, 6, -26, -25, 124, -242, -165, -97, -149, 109, -204, -83, 88, -8, -9, 302, 33, 201, 85, 62, 33, -170, -87, 289, -266, 37, -154, -268, -114, 73, 260, 206, -87, 32, 246, 314, 139, -74, -49, 99, 56, 208, -67, 396, 48, -90, -54, -44, -217, -153, 16, 31, -23, -71, -149, -57, 101, 164, -11, -92, -413, 145, -108, -69, -49, -71, 97, -136, -25, 146, -54, 3, 101, -256, 6, -137, 94, 268, -205, 32, -89, -198, 69, 29, 116, 94, 68, 138, -256, -73, -129, 43, 27, -162, 51, 97, -61, 92, -7, 229, 112, 22, 438, 22, 313, -22, 62, 130, -197, -125, 119, -164, -153, -30, -123, 60, 13, 39, -271, -80, 122, -3, 219, -6, 2, -36, 82, 220, -171, -47, 45, 277, 22, 120, 94, 97, 7, 296, -64, 155, 239, 98, 22, -222, 165, 31, 67, -9, -147, 91, -111, 56, 134, 96, 198, -19, 201, 6, -251, -31, -169, -73, -129, -37, 202, -84, -150, 307, 100, -10, -168]
3859a68L73l02j88K88k99O9r3M58k9j58J65J35n29L8K34n6J66p7p8j32N03j19
3881B01k68L31k60r2J83J4N7j29j23m8L03j49p3K55k50j22J40k25L75o2j41J89
3903A06k7L6j29J41l17K74j84K93o8k95K84n09K62l2Q0K7Q3j31J11M1Q1p1J50
3926B06k77J9n9J94N1N9k65j29P9j7l6J5k5Q4K88q8j00R9j04k67K91J27k62J07
3950a0K36p2j4l09N3p0K32J34o09M98j08J33l5j68m0K21j28KPR2p4l1J13j35M3
3975c9J5P2Q7r1j11K29j03L27l56r0J26k81J76N4J20M8k91Q7J03j89J84k99J60
$$ y = [-168, 205, -97, -285, 3, -296, -227, -320, 138, 109, -49, 116, 251, -278, -240, -6, -62, 104, 27, -51, -183, 320, 201, -67, 264, 4, -88, 95, 109, 166, 37, -86, -134, 169, 20, -53, 202, -48, -170, -30, -255, 120, 58, -83, 106, 79, 115, -14, 127, -190, 84, -100, 193, 125, -170, 114, -395, -133, -165, -85, -58, 25, -106, 5, 46, 127, 56, 206, -71, -52, -111, 83, 134, 193, -72, -201, -122, -139, -175, -160, -185, -101, 187, 99, -1, 98, -6, -273, 18, 145, -117, -10, 226, 154, 140, -169, -116, -186, 46, 180, -429, 69, -39, 94, 59, -109, -149, 72, -56, -54, -47, 45, -29, -60, 53, -82, -39, -24, 48, 135, 44, -67, 162, 59, 386, 30, -60, 66, -215, -39, 15, 135, 183, -108, -21, 82, -107, 77, -222, -62]
$$ [...]
8191A29
##END NTUPLES=NMR FID
##END=
