##TITLE=1H_Pr 5318
 200.13MHz, CDCl3,
 8 sc
 
 2.9.2025
##JCAMPDX= 6.0         $$ Bruker NMR JCAMP-DX V2.0
##DATA TYPE= NMR FID
##DATA CLASS= NTUPLES
##ORIGIN= UXNMR, Bruker Analytische Messtechnik GmbH
##OWNER= pz
$$ XWIN-NMR		Version 3.5
$$ Tue Sep  2 13:52:28 2025 Russian Standard Time (UT+4h)  she@DPX200
##.OBSERVE FREQUENCY= 200.1313
##.OBSERVE NUCLEUS= ^1H
##.DELAY= (6, 6)
##.ACQUISITION MODE= SIMULTANEOUS
##.ACQUISITION SCHEME= undefined
##.AVERAGES= 8
##.DIGITISER RES= 18
##SPECTROMETER/DATA SYSTEM= spect
##.PULSE SEQUENCE= zg30
##.SOLVENT NAME= CDCl3
##.SHIFT REFERENCE= (INTERNAL, CDCl3, 0, 14.3821)
##AUDIT TRAIL= $$ (NUMBER, WHEN, WHO, WHERE, WHAT)
$$ ##TITLE= Audit trail, XWIN-NMR		Version 3.5
$$ ##JCAMPDX= 5.01
$$ ##ORIGIN= Bruker BioSpin GmbH
$$ ##OWNER= she
$$ F:/spectra/data/she/nmr/H-C/1/audita.txt
$$ ##AUDIT TRAIL=  $$ (NUMBER, WHEN, WHO, WHERE, WHAT)
(   1,<2025-09-02 13:51:06.43 +0400>,<she>,<DPX200>,
      <created by zg, POWCHK disabled, PULCHK disabled
       configuration hash MD5:
       00 E9 B6 7A A2 85 ED C7 34 08 36 98 17 FE 4E 26
       data hash MD5: 16K
       00 3B F1 73 F5 94 DA 6E A6 CD 51 FD 82 51 A0 AB>)
$$ ##END=
$$ 
$$ hash MD5
$$ A5 06 9B 0F 8E 4F A1 5C B6 57 10 6F C6 B5 D6 73
##$RELAX= 
##$RELAX= 
##$RELAX= 
##$RELAX= 
##$RELAX= 
##$RELAX= 
$$ Bruker specific parameters
$$ --------------------------
##$DU= <F:/spectra>
##$EXPNO= 1
##$NAME= <H-C>
##$PROCNO= 1
##$TYPE= <nmr>
##$USER= <she>
##$AMP= (0..31)
100 100 100 100 100 100 100 100 100 100 100 100 100 100 100 100 100 100 
100 100 100 100 100 100 100 100 100 100 100 100 100 100 
##$AQSEQ= 0
##$AQ_mod= 1
##$AUNM= <au_zg>
##$AUTOPOS= <>
##$BF1= 200.13
##$BF2= 200.13
##$BF3= 200.13
##$BF4= 200.13
##$BF5= 200.13
##$BF6= 200.13
##$BF7= 200.13
##$BF8= 200.13
##$BYTORDA= 1
##$CFDGTYP= 0
##$CFRGTYP= 5
##$CHEMSTR= <none>
##$CNST= (0..31)
1 1 145 1 1 1 1 1 1 1 1 1 1 1 1 1 1 1 1 1 1 1 1 1 1 1 1 1 1 1 1 1 
##$CPDPRG= <>
##$CPDPRG1= <>
##$CPDPRG2= <>
##$CPDPRG3= <>
##$CPDPRG4= <mlev>
##$CPDPRG5= <mlev>
##$CPDPRG6= <mlev>
##$CPDPRG7= <mlev>
##$CPDPRG8= <mlev>
##$CPDPRGB= <>
##$CPDPRGT= <>
##$D= (0..31)
0 0.7 0 0 0 0 0 0 0 0 0 0.03 0 0 0 0 0 0 0 0 0 0 0 0 0 0 0 0 0 0 0 0 
##$DATE= 1756806665
##$DBL= (0..7)
120 120 120 120 120 120 120 120 
##$DBP= (0..7)
150 150 150 150 150 150 150 150 
##$DBP07= 0
##$DBPNAM0= <>
##$DBPNAM1= <>
##$DBPNAM2= <>
##$DBPNAM3= <>
##$DBPNAM4= <>
##$DBPNAM5= <>
##$DBPNAM6= <>
##$DBPNAM7= <>
##$DBPOAL= (0..7)
0.5 0.5 0.5 0.5 0.5 0.5 0.5 0.5 
##$DBPOFFS= (0..7)
0 0 0 0 0 0 0 0 
##$DE= 6
##$DECBNUC= <off>
##$DECIM= 32
##$DECNUC= <off>
##$DECSTAT= 4
##$DIGMOD= 1
##$DIGTYP= 9
##$DL= (0..7)
0 120 120 120 120 120 120 120 
##$DP= (0..7)
150 150 150 150 150 150 150 150 
##$DP07= 0
##$DPNAME0= <>
##$DPNAME1= <>
##$DPNAME2= <>
##$DPNAME3= <>
##$DPNAME4= <>
##$DPNAME5= <>
##$DPNAME6= <>
##$DPNAME7= <>
##$DPOAL= (0..7)
0.5 0.5 0.5 0.5 0.5 0.5 0.5 0.5 
##$DPOFFS= (0..7)
0 0 0 0 0 0 0 0 
##$DQDMODE= 0
##$DR= 18
##$DS= 0
##$DSLIST= <SSSSSSSSSSSSSSS>
$$ [...]
##$SUBNAM0= <"">
##$SUBNAM1= <"">
##$SUBNAM2= <"">
##$SUBNAM3= <"">
##$SUBNAM4= <"">
##$SUBNAM5= <"">
##$SUBNAM6= <"">
##$SUBNAM7= <"">
##$SUBNAM8= <"">
##$SUBNAM9= <"">
##$SW= 18.0517328524113
##$SWIBOX= (0..15)
0 0 2 0 0 0 0 0 0 0 0 0 0 0 0 0 
##$SW_h= 3612.71676300578
##$TD= 16384
##$TD0= 1
##$TE= 0
##$TE2= 300
##$TE3= 300
##$TEG= 300
##$TL= (0..7)
0 120 120 120 120 120 120 120 
##$TP= (0..7)
150 150 150 150 150 150 150 150 
##$TP07= 0
##$TPNAME0= <>
##$TPNAME1= <>
##$TPNAME2= <>
##$TPNAME3= <>
##$TPNAME4= <>
##$TPNAME5= <>
##$TPNAME6= <>
##$TPNAME7= <>
##$TPOAL= (0..7)
0.5 0.5 0.5 0.5 0.5 0.5 0.5 0.5 
##$TPOFFS= (0..7)
0 0 0 0 0 0 0 0 
##$TUNHIN= 0
##$TUNHOUT= 0
##$TUNXOUT= 0
##$USERA1= <user>
##$USERA2= <user>
##$USERA3= <user>
##$USERA4= <user>
##$USERA5= <user>
##$V9= 5
##$VALIST= <valist>
##$VCLIST= <CCCCCCCCCCCCCCC>
##$VD= 0
##$VDLIST= <DDDDDDDDDDDDDDD>
##$VPLIST= <PPPPPPPPPPPPPPP>
##$VTLIST= <TTTTTTTTTTTTTTT>
##$WBST= 1024
##$WBSW= 4
##$XGAIN= (0..3)
0 0 0 0 
##$XL= 0
##$YL= 0
##$YMAX_a= 347114
##$YMIN_a= -411432
##$ZGOPTNS= <>
##$ZL1= 120
##$ZL2= 120
##$ZL3= 120
##$ZL4= 120
##$ABSF1= 10
##$ABSF2= 0
##$ABSG= 5
##$ABSL= 3
##$ALPHA= 0
##$AQORDER= 0
##$ASSFAC= 0
##$ASSFACI= 0
##$ASSFACX= 0
##$ASSWID= 0
##$AUNMP= <proc_1d>
##$AZFE= 0.1
##$AZFW= 0.1
##$BCFW= 1
##$BC_mod= 2
##$BYTORDP= 1
##$COROFFS= 0
##$CY= -3
##$DATMOD= 1
##$DC= 2
##$DFILT= <>
##$DTYPP= 0
##$F1P= 0
##$F2P= 0
##$FCOR= 0.5
##$FTSIZE= 0
##$FT_mod= 4
##$GAMMA= 1
##$GB= 0.15
##$INTBC= 1
##$INTSCL= 1
##$ISEN= 128
##$LB= 0.25
##$LEV0= 0
##$LPBIN= 0
##$MAXI= 10000
##$MC2= 0
##$MEAN= 0
##$ME_mod= 0
##$MI= 1.114404
##$NCOEF= 0
##$NC_proc= 0
##$NLEV= 6
##$NOISF1= 3.799351
##$NOISF2= 2.8
##$NSP= 1
##$NTH_PI= 0
##$NZP= 0
##$OFFSET= 14.38212
##$PC= 1
##$PHC0= -1566.406
##$PHC1= 17.99228
##$PH_mod= 1
##$PKNL= yes
##$PPARMOD= 0
##$PSCAL= 0
##$PSIGN= 0
##$REVERSE= no
##$SF= 200.129724274929
##$SI= 16384
##$SIGF1= 3
##$SIGF2= 2
##$SINO= 400
##$SIOLD= 16384
##$SREGLST= <1H.CDCl3>
##$SSB= 0
##$STSI= 0
##$STSR= 0
##$SW_p= 3205.1282051282
##$SYMM= 0
##$S_DEV= 0
##$TDeff= 0
##$TDoff= 0
##$TI= <>
##$TILT= no
##$TM1= 0
##$TM2= 0
##$TOPLEV= 0
##$USERP1= <user>
##$USERP2= <user>
##$USERP3= <user>
##$USERP4= <user>
##$USERP5= <user>
##$WDW= 1
##$XDIM= 8192
##$YMAX_p= 0
##$YMIN_p= 0
$$ End of Bruker specific parameters
$$ ---------------------------------
##NTUPLES= NMR FID
##VAR_NAME=  TIME,          FID/REAL,        FID/IMAG
##SYMBOL=    X,             R,               I
##VAR_TYPE=  INDEPENDENT,   DEPENDENT,       DEPENDENT
##VAR_FORM=  AFFN,          ASDF,            ASDF
##VAR_DIM=   8192,          8192,            8192
##UNITS=     SECONDS,       ARBITRARY UNITS, ARBITRARY UNITS
##FACTOR=    0.0002768,     1,               1
##FIRST=     0,             0,               0
##LAST=      2.2672688,     0,               0
##MIN=       0,             -411432,         0
##MAX=       2.2672688,     347114,          0
$$ Real data points
##PAGE= N=1
##DATA TABLE= (X++(R..R)), XYDATA
$$ plain form
0 0 0 0 0 0 0 0 0 0 0 0 0 0 0 -8 8 -8 8 -8 16 -16 16 -24 24 -32 38 -41 48 -56 65 -77 86 -99 110 -125 141
35 141 -158 179 -200 222 -247 275 -305 339 -374 413 -456 504 -554 611 -673 740 -816 901 -994
54 -994 1100 -1222 1359 -1520 1707 -1933 2205 -2547 2989 -3582 4418 -5693 7855 -12200 24291
69 24291 -130891 -411432 -25447 233742 24287 -125427 43856 78210 -50618 -12632 101633
80 101633 -5458 -102038 35108 117987 -63921 -162100 11984 135119 9278 -88043 -7282
91 -7282 44914 -17238 -16657 50636 23859 -50010 -8328 57312 -2847 -71813 -13165 42449 -5131
104 -5131 -21724 43710 44829 -23330 -22770 16355 -19933 -50937 15456 57030 -13824 -60957 -2005
117 -2005 45165 11751 -18091 -1222 14448 8459 -640 -7676 -7524 7204 17955 2617 -23077
$$ packed form
0@%%%%%%%%%%%%%qJ6j6J6j6K4l2L2m0M8n6P0p9Q9j04J21j42J63j85K09k35K66
35A41k99L37l79M22m69N22n80O44p13P87q69R60j058J165j284J413j556J717j895
54i94K094k322K581k879L227l640M138m752N536o571Q000j0111J3548k0055L6491
69B4291j55182k80541L85985K59189k09455j49714J69283L4354j28828L7986J14265
80A01633j07091r6580J37146Q2879j81908r8179J74084J23135j25841r7321Q0761
91g282N2196o2152N81O7293k6777p3869M1682O5640o0159o8966N8648N5614m7580
104e131j6593O5434J119o8159N60L9125l6288l1004O6393M1574p0854m7133N8952
117b005M7170l3414k9842J6869J5670n989r099p036J52J4728J0751j5338k5694
$$ plain form
130 -23077 -28575 -7651 19418 23253 19 -15282 -1101 15510 4935 -15759 -16692 -312 7805
143 7805 2588 1380 9048 8881 -3292 -5899 4516 6119 -2408 472 4375 -10693 -19543 659
157 659 16194 721 -10652 2132 4569 -8915 -2231 18319 13356 -6859 -8508 -1042 -3872 -2727
171 -2727 8241 8301 -5051 -7532 2629 5632 -1808 -5522 -2215 536 -1081 -2697 -485 1312 1632
186 1632 2379 2137 -998 -751 4791 5610 -1718 -5295 455 3680 -277 -1982 -523 -2735 -3252 1210
202 1210 1851 -2965 -1646 3978 1483 -4427 -2103 3905 3812 814 1183 171 -1338 208 2583 120
218 120 -3144 -2062 577 267 -1662 -1740 229 1746 862 -2042 -2060 1029 2325 746 -795 -870 94 1917
236 1917 2049 649 -1145 381 1071 -314 -1682 -1334 -354 -9 -835 -1769 -1346 811 1599 890 441 292
$$ packed form
130b3077n498K0924K7069L835k3234j5301J4181J6611j0575k0694r33J6380Q117
143G805n217j208P668j67j2173k607J0415J603q527K880L903j5068q850K0202
157F59J5535j5473j1373J2784K437j3484O684K0550m963k0215j649P466k830J145
171b727J0968O0j3352k481J0161L003p440l714L307K751j617j616K212J797L20
186A632P47k42l135K47N542Q19p328l577N750L225l957j705J459k212n17M462
202A210O41m816J319N624k495n910K324O008r3k998L69j012j509J546K375k463
218A20l264J082K639l10j929p8J969J517q84k904j8L089J296j579j541p5R64J823
236A917J32j400j794J526O90j385j368L48R80L45q26r34M23K157P88p09m49j49
$$ plain form
254 292 747 1047 893 121 -465 34 53 -481 -1018 -290 452 260 -380 -361 -796 -883 618 699 -592 -1025 53
275 53 524 -130 377 1939 1683 -31 -659 288 373 -160 124 -244 -1331 -1654 42 459 -85 -1080 362
294 362 955 748 -104 295 551 -172 -191 206 100 -160 135 332 -499 -1032 -426 724 679 -202 -771 -1203 -887
315 -887 -44 760 900 126 -137 -320 -251 538 1205 785 60 -414 -721 -757 -472 -16 395 151 -299 -264 -372
336 -372 19 414 418 342 -89 -92 500 242 133 -516 -238 524 608 274 -429 -702 -959 -810 125 349 153 -2
358 -2 -640 -886 -102 9 807 1519 886 -352 -868 -581 309 668 997 396 -910 -1242 -824 3 523 -13
378 -13 -280 167 -229 -254 -50 285 285 275 404 381 -22 -594 -149 180 326 309 187 30 -447 -885 -976 -618 245
401 245 803 539 -527 -938 -549 -188 910 1158 641 -444 -936 -524 218 155 512 651 -48 -999 -872 -564
$$ packed form
254B92M55L00j54p72n86M99J9n34n37P28P42j92o40J9m35q7J501Q1j291m33J078
275E3M71o54N07J562k56j714o28R47Q5n33K84l68j087l23J696M17n44r95J442
294C62N93k07q52L99K56p23j9L97j06k60K95J97q31n33O06J150m5q81n69m32L16
315h87Q43Q04J40p74k63j83O9P89O67m20p25m74l07l6K85M56M11k44m50L5j08
336c72L91L95Mp6m31lN92k58j09o49K78P62Q4l34p03k73k57J49R35K24j96j55
358bo38k46P84J11P98P12o33j238n16K87Q90L59L29o01j306l32M18Q27N20n36
378a3k67M47l96k5K04L35%j0J29k3m03n72M45L29J46j7j22j57m77m38r1L58Q63
401B45N58k64j066m11L89L61J098K48n17j085m92M12P42o3L57J39o99r51J27L08
$$ plain form
421 -564 265 487 343 53 -503 -562 -142 318 368 238 452 548 118 -21 -19 -39 92 421 505 20 -388 -876 -745
444 -745 -701 54 505 352 -265 -333 -525 -150 807 1112 561 -140 166 62 -412 116 847 218 -245 -142 -963
465 -963 -657 -106 296 236 -101 -97 -369 -103 327 -92 80 838 857 121 -419 20 194 130 423 40 -972 -479
487 -479 -81 -165 -606 -309 63 -1 281 168 -821 -435 641 835 411 243 296 -194 -761 338 159 -150 5
508 5 -166 -659 -838 -122 408 34 -184 -503 -602 656 770 383 -308 174 287 250 768 474 -459 -259 358
529 358 -242 -127 0 -344 -690 -360 147 -52 10 65 -526 -647 178 904 788 549 377 -211 -78 843 227
550 227 -306 -346 -62 -112 -186 57 -262 -710 -236 180 64 -285 461 -31 -101 322 443 429 409 596 -53 -109 779
573 779 370 -416 -370 102 -397 -397 290 -502 -1497 222 340 -111 65 301 -315 -295 1016 922 -186 31 728
$$ packed form
421e64Q29K22j44k90n56n9M20M60N0j30K14R6m30j39Kk0J31L29Q4m85m08m88J31
444g45M4P55M51j53o17o8j92L75R57L05n51p01L06j04m74N28P31o29m63J03q21
465i63L06N51M02o0l37Mk72K66M30m19J72P58J9p36n40M39J74o4K93l83j012M93
487d79L98q4m41K97L72o4K82j13r89L86J076J94m24j68N3m90n67J099j79l09J55
508Ej71m93j79P16N30l74k18l19r9J258J14l87o91M82J13l7N18k94r33K00O17
529C58o00J15J27l44l46L30N07j99O2N5n91j21Q25P26j16k39j72n88J33R21o16
550B27n33m0K84n0p4K43l19m48M74M16j16l49P46m92p0M23J21j4k0J87o49n6Q88
573G79m09p86M6M72m99%O87p92r95J719J18m51J76K36o16K0J311r4j108K17O97
$$ plain form
594 728 -51 -556 475 354 -697 -512 211 -573 -410 433 -148 -723 -311 447 6 184 574 -165 -806 563
614 563 1089 143 203 322 -479 -375 704 755 -711 -1091 78 -274 -280 389 68 -995 -293 401 292 263 1093
635 1093 175 -578 335 863 27 -251 611 54 -652 -218 -135 -930 -381 373 -137 -290 73 400 -345 -116
655 -116 461 15 346 965 -16 -659 -142 356 166 538 287 -810 -1092 -19 342 -429 -467 43 28 -98
675 -98 383 -129 -357 271 980 392 52 488 -332 -614 248 946 -161 -270 -239 -724 -838 -15 114 150 -91
696 -91 90 -250 -225 228 245 138 769 852 -69 -378 212 -200 -226 169 593 -574 -645 -268 -655 -673 85 599
718 599 220 -196 -160 -298 -335 761 563 460 75 87 -343 -376 548 337 -202 -84 -356 -464 -972 -236 46
739 46 -210 314 273 -399 -369 -189 10 372 832 544 -3 -3 33 121 18 173 102 -383 -290 -308 -310 -608 -239 275
$$ packed form
594G28p79n05J031j21j051J85P23p84J63Q43n81n75M12P58m41J78L90p39o41J369
614E63N26r46O0J19q01J04J079N1j466l80J169l52oO69l21j063P02O94j09k9Q30
635A093r18p53R13N28q36k78Q62n57p06M34Q3p95N49P54n10j53L63L27p45K29
655a16N77m46L31O19r81o43N17M98j90L72k51j097k82J073L61p71l8N10j5j26
675i8M81n12k28O28P09n88l40M36q20k82Q62O98j107j09L1m85j14Q23J29L6k41
696i1J81l40K5M53J7j07O31Q3r21l09N90m12k6L95M24j167p1L77l87j8P58N14
718E99l79m16L6j38l7J096j98j03l85J2m30l3R24k11n39J18k72j08n08P36K82
739D6k56N24m1o72L0J80J99L62M60k88n47%L6Q8j03J55p1m85R3j8kk98L69N14
$$ plain form
763 275 11 80 -144 -269 -61 372 616 592 470 45 -537 -205 17 -57 -205 341 -3 -374 -793 -281 -208 -81
785 -81 43 459 91 -290 -7 308 576 380 420 516 148 41 -20 -224 -74 66 -9 201 -459 -849 -306 -335
807 -335 32 262 -66 -8 335 286 89 385 392 328 212 92 -276 -219 -285 152 273 -143 -605 -439 -1 -154 -200
830 -200 -270 -8 166 85 144 418 254 107 282 393 312 -172 -373 -188 -238 -46 -240 -399 -343 -224 -383 167
852 167 -299 185 178 224 257 222 59 317 353 189 135 -74 130 -89 -72 -185 64 -166 -310 27 29 60 113 -154
876 -154 273 196 44 205 183 226 73 210 232 -113 -354 1 110 -19 -223 -145 -91 -345 -190 -152 -389 -53 198
899 198 -67 358 -24 111 305 254 308 381 23 73 -30 -259 -336 160 -370 -266 -420 41 -308 -141 -97 141
921 141 2 327 509 304 90 81 155 30 186 -77 -224 -86 -325 -347 -15 -158 -52 -284 -193 -56 -76 8 309
$$ packed form
763B75k64O9k24j25K08M33K44k4j22m25n82L32K22p4j48N46l44l71m19N12P3J27
785h1J24M16l68l81K83L15K68j96M0R6l68j07o1k04J50J40p5K10o60l90N43k9
807c35L67K30l28N8L43m9j97K96Po4j16j20l68N7o6M37J21m16m62J66M38j53m6
830b00p0K62J74q1N9K74j64j47J75J11q1m84k01J85n0J92j94j59N6J19j59N50
852A67m66M84pM6L3l5j63K58L6j64n4k09K04k19J7j13K49k30j44L37KL1N3k67
876a54M27p7j52J61k2M3j53J37K2l45k41L55J09j29k04P8N4k54J55L8k37L36K51
899A98k65M25l82J35J94n1N4P3l58N0j03k29p7M96n30J04j54M61l49J67M4K38
921A41j39L25J82k05k14rP4j25J56k63j47J38k39k2L32j43J06k32R1J37k0Q4L01
$$ plain form
944 309 -44 17 -142 265 299 223 65 390 -160 414 47 -25 -99 188 -190 -454 -172 279 -271 -39 253 43
966 43 -17 226 626 133 52 456 -167 277 681 17 -194 -214 -364 -795 -350 193 -122 -353 -3 57 -229 83
988 83 273 136 -149 251 538 299 194 31 174 -155 322 182 -675 -516 -28 -135 -196 45 77 -347 -386 568
1010 568 220 278 738 371 -144 -99 372 212 -15 399 44 -330 268 -73 -478 -280 -146 -565 -244 539 -9
1031 -9 -664 -233 493 277 -63 526 174 -372 -38 296 18 305 138 -353 -300 -69 40 -529 -121 -45 -258
1052 -258 -202 240 230 -433 -115 574 297 370 592 110 -336 -348 517 302 56 167 -696 -750 -182 -119 -522 -193
1074 -193 262 -663 -287 427 359 -27 -93 341 75 -4 687 222 -182 0 2 -134 -148 102 -821 -715 -24 283
1096 283 -33 145 67 -477 -161 572 706 414 217 130 53 205 404 240 -335 130 -365 -280 -177 216 -322
$$ packed form
944C09l53O1j59M07L4p6j58L25n50N74l67p2p4K87l78k64K82M51n50K32K92k10
966D3o0K43M00m93q1M04o23M44M04o64k11k0j50m31M45N43l15k31L50O0k86L12
988H3J90j37k85M00K87k39j05j63J43l29M77j40q57J59M88j07o1K41L2m24l9R54
1010E68l48N8M60l67n15M5M71j60k27M14l55l74N98l41m05J98J34m19L21P83n48
1031io55M31P26k16l40N89l52n46L34L34k78K87j67m91N3K31J09n69M08P6k13
1052b58N6M42j0o63L18O89k77P3K22m82m46j2Q65k15k46J11q63n4N68O3m03L29
1074a93M55r25L76P14o8l86o6M34k66p9O91m65m04J82Kj36j4K50r23J06O91L07
1096B83l16J78p8n44L16P33J34k92j97q7p7J52J99j64n75M65m95Q5J03L93n38
$$ plain form
1117 -322 -478 32 246 -189 -56 299 -256 116 690 494 -135 -409 -11 -271 301 268 109 -293 -155 -123 -655
1138 -655 -276 171 -128 -406 165 275 -126 19 303 -51 65 499 418 -118 -317 101 17 103 378 -194 -430
1159 -430 -330 -66 -306 178 163 -50 -635 -75 114 253 286 236 100 -25 92 410 -112 -281 -21 -84 38
1180 38 64 53 -379 -327 -365 -225 -14 208 -22 -105 24 296 83 -143 501 417 149 -255 -185 -116 272 -6 122
1203 122 -216 -240 -42 -280 -197 29 -67 14 466 -54 120 229 428 60 226 197 138 -29 24 72 -208 -99 -355
1226 -355 -191 -88 111 -210 -86 -15 278 -213 -61 304 214 69 243 106 55 346 256 66 -128 -113 -85 -383
1248 -383 -305 40 -80 -87 103 -61 20 -179 91 244 -21 164 158 -11 219 253 323 -207 -79 124 -149 149 -119
1271 -119 -185 51 -105 -344 -55 -3 44 -82 346 279 12 316 143 240 65 -36 187 -124 -39 -25 -205 -112 -258
$$ packed form
1117c22j56N10K14m35J33L55n55L72N74j96o29k74L98k60N72l3j59m02J38L2n32
1138f55L79M47k99k78N71J10m01J45K84l54J16M34q1n36j99M18q4Q6K75n72k36
1159d30J00K64k40M84j5k13n85N60J89J39L3n0j36j25J17L18n22j69K60o3J22
1180C8K6j1m32N2l8J40K11K22k30q3J29K72k13k26O44q4k68m04P0O9L88k78J28
1203A22l38k4J98k38Q3K26r6Q1M52n20J74J09J99l68J66k9n9j67N3M8k80J09k56
1226c55J64J03J99l21J24P1K93m91J52L65r0j45J74j37n1K91r0j90j94J5K8k98
1248c83P8L45j20pJ90j64Q1j99K70J53k65J85oj69K30L4P0n30J28K03k73K98k68
1271a19o6K36j56k39K89N2M7j26M28o7k67L04j73R7j75j01K23l11Q5J4j80R3j46
$$ plain form
1294 -258 -103 -493 -43 40 -166 114 150 244 60 8 116 259 49 -141 7 -17 53 -135 67 -55 0 -407
1316 -407 -312 110 79 -230 38 280 -13 -92 111 -66 89 114 158 172 -309 248 -51 -66 166 -427 171 -182
1338 -182 -38 -189 -139 -87 -199 33 143 175 133 290 124 251 -55 -211 110 274 193 -181 -78 -225 -314 -271
1360 -271 387 -63 -84 -42 63 230 302 196 123 86 188 137 68 200 384 27 127 -11 -488 -160 -120 14 -227
1383 -227 -58 -324 -288 -152 -95 -9 302 115 208 145 356 -3 -144 -52 24 -26 -69 -109 -278 -203 -182 -104 -241 -254 32
1408 32 -24 -163 -21 -158 131 73 -164 22 -126 237 -58 71 274 -26 -110 -175 156 -317 84 102 -202 39
1430 39 -321 -178 -148 -68 163 10 216 129 291 -16 34 127 -262 -20 15 -118 69 -276 -416 -29 -54 104 11
1453 11 -141 14 132 -43 63 208 -19 187 184 322 -79 84 124 135 -146 -160 1 -324 -51 -110 -152 -179 171
$$ packed form
1294b58J55l90M50Q3k06K80L6R4j84n2J08J43k10j90J48k4P0j88K02j22N5m07
1316d07R5M22l1l09K68K42k93p9K03j77J55K5M4J4m81N57k99j5K32n93N98l53
1338a82J44j51N0N2j12K32J10L2m2J57j66J27l06j56L21J64q1l74J03j47q9M3
1360b71O58m50k1M2J05J67P2j06p3l7J02n1o9J32J84l57J00j38m77L28M0J34k41
1383b27J69k66L6J36N7Q6L11j87R3o3K11l59j41R2P6n0m3m0j69P5K1P8j37j3K86
1408C2n6j39J42j37K89n8k37J86j48L63k95J29K03l00q4o5L31m73M01J8l04K41
1430C9l60J43L0Q0K31j53K06q7J62l07N0R3l89K42L5j33J87l45j40L87k5J58r3
1453A1j52J55J18j75J06J45k27K06lJ38m01J63M0J1k81j4J61l25K73n9m2k7L50
$$ plain form
1476 171 -45 -108 9 57 -11 124 169 237 -44 -99 194 -41 -109 71 -10 -214 -88 206 -89 -102 -10 6 -274 144
1500 144 -223 -262 117 407 271 34 201 25 -55 132 105 -57 -225 47 -187 -140 217 28 -158 -205 107 217
1522 217 -126 283 58 -196 198 122 108 -54 225 1 -400 -104 131 -116 -330 -217 -37 -301 33 182 -243
1543 -243 227 -110 218 -211 -2 362 -77 -22 172 138 117 102 96 -101 -51 156 29 -309 -164 -196 -13 -179 40
1566 40 -386 -32 114 -187 298 185 455 61 -117 355 101 -81 167 114 -126 -84 75 75 -136 -126 -27 -230
1588 -230 97 155 30 -227 299 199 -37 134 127 -114 -56 184 22 -29 246 148 -181 -368 -2 -120 -309 15
1610 15 -40 -368 -51 81 -29 154 301 2 28 227 316 -191 -190 -126 -19 -140 85 241 -370 -381 181 331 -289
1633 -289 -55 -267 -52 146 111 74 71 -66 224 50 108 261 -210 -61 38 256 -138 101 84 -151 -334 131
$$ packed form
1476A71k16o3J17M8o8J35M5O8k81n5K93k35o8J80q1k04J26K94k95j3R2J6k80M18
1500A44l67l9L79K90j36k37J67j76q0J87k7j62j68K72k34M7L57j89j86m7L12J10
1522B17l43M09k25k54L94p6j4j62K79k24m01K96K35k47k14J13J80k64L34J49m25
1543b43M70l37L28m29K09L64m39N5J94l4k1j5oj97N0K07j27l38J45l2J83j66K19
1566D0m26L54J46l01M85j13K70l94j78M72k54j82K48n3k40M2J59%k11J0R9k03
1588b30L27N8j25k57N26j00k36J71pk41N8K40j62n1K75r8l29j87L66j18j89L24
1610A5n5l28L17J32j10J83J47k99K6J99Q9n07JO4J07j21K25J56o11j1N62J50o20
1633b89K34k12K15J98l5l7lj37K90j74N8J53m71J49R9K18l94K39j7k35j83M65
$$ plain form
1655 131 197 -103 -59 201 -114 73 68 266 -232 40 -119 -88 111 304 -98 -163 -23 -119 -438 210 170 -215 -364
1678 -364 118 113 61 156 -133 -166 -89 204 -88 -71 110 268 -109 -100 -67 -10 -280 68 -207 -190 -228 162 -126 -175 253
1703 253 215 -12 -249 148 -52 211 460 -113 175 -215 -76 -10 -228 -111 -128 -160 -128 3 -301 -79 -43 76
1725 76 -42 266 -184 55 79 331 -297 -214 113 64 -60 -171 198 -111 72 146 -24 -10 13 96 -179 -277 -156
1748 -156 -29 155 221 222 204 209 73 -98 -87 208 64 -251 78 -209 -40 -228 20 146 -34 -211 -166 125 256
1771 256 -27 -153 228 212 7 -44 -63 5 36 -107 -217 -43 54 -20 -220 -59 99 -23 35 -36 -2 99 -61
1794 -61 301 120 47 184 28 -23 122 25 -14 -358 -63 117 -52 87 -76 128 -89 12 191 -104 29 55
1816 55 -105 -305 37 244 -90 229 216 -104 76 -237 -83 199 37 -49 29 93 -8 -25 -115 209 43 -90
$$ packed form
1655A31O6l00M4K60l15J87nJ98m98K72j59L1J99J93m02o5J40r6l19O48m0l85j49
1678c64M82nn2R5k89l3P7K93k92J7J81J58l77RL3N7k70L48k75J7l8L90k88m9M28
1703B53l8k27k37L97k00K63K49n73K88l90J39O6k18J17j7l2L2J31l04K22L6J19
1725G6j18L08m50K39K4K52o28Q3L27m9j24j11L69l09J83P4j70J4K3Q3k75r8J21
1748a56J27J84O6Jj8Nj36j71J1K95j44l15L29k87J69j88K48J26j80j77M5K91J31
1771B56k83j26L81j6k05n1j9O8L1j43j10J74R7p4k00J61J58j22N8p1L4J01j60
1794f1L62j81p3J37j56n1J45r7l9l44K95J80j69J39j63K04k17J01J79k95J33K6
1816E5j60k00L42K07l34L19j3l20J80l13J54K82j62q6P8O4j01j7r0L24j66j33
$$ plain form
1838 -90 -126 115 42 81 212 17 9 34 91 -99 136 -77 -94 -301 11 -167 -56 33 -131 163 -171 -4 -11 -50
1862 -50 285 43 36 -37 -40 -30 -100 393 -82 -79 -83 -5 50 -48 -92 -54 9 -27 -176 194 97 28 244 328 71 6 -14 -35
1890 -35 194 25 -201 -341 53 -113 -56 -258 -202 114 131 -39 -219 -60 -57 194 203 11 35 143 -62 139 116
1913 116 -13 188 22 -135 40 -19 118 137 -133 -80 45 283 -61 156 376 -290 -78 161 167 182 114 90 174
1936 174 80 -186 309 -279 -111 -570 -236 79 14 -1 -59 159 -265 201 -44 -118 -223 -156 24 95 -172 53
1958 53 30 -92 76 -167 -129 -160 -57 59 -78 79 -6 -167 -95 18 -7 95 264 111 17 340 8 203 138
1981 138 -159 -223 287 174 -37 -5 -108 -254 -255 -90 121 -118 36 402 168 -183 89 218 -121 453 154
2002 154 -3 -69 96 -134 -190 -219 17 -131 -130 -60 -49 -49 242 270 -189 151 0 49 125 231 2 -135 165 -103
$$ packed form
1838i0l6K41p3L9J31j95qK5N7j90K35k13j7k07L12j78J11Q9j64K94l34J67pl9
1862e0L35k42pp3lJ0p0M93m75LmP8N5r8m4L8O3l6j49L70r7o9K16Q4k57o5k0k1
1890c5K29j69k26j40L94j66N7k02N6L16J7j70j80J59LK51Rj92K4J08k05K01k3
1913A16j29K01j66j57J75n9J37J9k70N3J25K38l44K17K20o66K12K39OJ5o8k4Q4
1936A74r4k66M95n88J68m59L34L15o5j5n8K18m24M66k45p4j05O7J80P1k67K25
1958E3k3j22J68k43L8l1J03J16j37J57q5j61P2J13k5J02J69j53r4L23l32J95o5
1981A38k97o4N10j13k11L2j03j46jJ65K11k39J54L66k34l51K72J29l39N74k99
2002A54j57o6J65k30n6k9K36j48JP0J1%K91K8m59L40j51M9P6J06k29j37L00k68
$$ plain form
2026 -103 -77 -195 389 -162 -271 21 -174 -333 4 64 135 -12 51 200 -43 10 -27 -12 37 253 -23 9 -248
2049 -248 210 -46 2 210 -247 -555 -118 52 19 210 389 -107 -26 95 203 -261 -151 266 -90 -117 155
2070 155 104 -41 75 -4 -446 -157 15 -45 -219 -32 261 -135 145 -94 101 -1 -91 199 142 -128 378 -91
2092 -91 -103 -92 110 -190 16 100 -153 -135 163 -128 -332 158 107 20 70 260 52 -15 19 0 38 51 310 -215
2116 -215 -306 212 -116 -1 -257 -154 -203 -66 434 -52 -171 -11 84 4 -195 -77 50 41 -10 -108 -136 -14 -109
2139 -109 -275 -246 -188 151 -123 -312 130 -8 -408 297 181 -181 71 152 78 19 429 103 -271 -44 49 -163
2161 -163 -271 358 69 -143 -38 -90 -287 46 120 -237 -82 243 262 -180 83 132 -113 81 423 -36 -203
2182 -203 -88 228 -72 -161 -132 -102 -244 58 -166 -240 119 -125 -38 -257 302 111 104 188 101 -25 -101 300 196
$$ packed form
2026a03K6j18N84n51j09K92j95j59L37O0P1j47O3J49k43N3l7J5M9K16k76L2k57
2049b48M58k56M8K08m57l08M37J70l3J91J79m96Q1J21J08m64J10M17l56k7K72
2070A55n1j45J16p9m42K89J72o0j74J87K93l96K80k39J95j02r0K90n7k70N06m69
2092i1j2J1K02l00K06Q4k53J8K98k91k04M90n1q7N0J90k08o7L4j9L8J3K59n25
2116b15r1N18l28J15k56J03m9J37N00m86j19J60R5q0j99J18J27rn1r8k8J22r5
2139a09j66K9N8L39k74j89M42j38m00P05j16l62K52Q1p4n9M10l26l74K27R3k12
2161a63j08O29k89k12J05n2j97L33P4l57J55L25J9m42K63M9k45J94L42m59j67
2182b03J15L16l00q9K9L0j42L02k24p4L59k44Q7k19N59j91pQ4q7j26p6M01j04
$$ plain form
2205 196 -240 -187 184 -222 -88 43 24 -268 -153 285 -297 39 4 214 -204 135 161 36 -66 311 40
2226 40 -170 -10 79 28 13 -106 -49 -114 100 -131 47 15 -25 106 -150 403 204 -71 117 66 -273 -270 -33 -27
2250 -27 -330 -38 27 -310 43 -174 -47 -168 -53 -191 4 -19 119 62 -117 363 121 10 -11 -119 89 -178
2272 -178 -84 -24 -214 -136 153 -87 -248 -4 -78 216 332 1 156 -366 102 -46 -33 6 -152 -185 -59 110
2294 110 101 62 4 122 -308 5 298 -172 -88 -76 85 -40 104 136 91 213 163 9 107 -145 -32 -221 -20
2317 -20 -129 131 1 -100 -229 77 -98 -256 -304 143 93 80 25 -43 40 242 59 256 -24 -77 284 -276 18
2340 18 34 -46 36 -102 169 -102 77 -241 117 -43 97 -123 223 202 2 -116 -79 -113 -347 66 -407 -41
2362 -41 133 -100 -61 -171 -171 -26 -146 63 71 -203 171 147 -75 -132 -121 -44 3 162 -110 11 -246 7 -8 2
$$ packed form
2205A96m36N3L71m06J34J31j9k92J15M38n82L36l5K10m18L39K6j25j02L77k71
2226D0k10J60Q9n1j5j19N7o5K14k31J78l2m0J31k56N53j99k75J88n1l39LK37O
2250b7l03K92O5l37L53k17J27j21J15j38J95k3J38n7j79M80k42j11k1j08K08k67
2272a78R4O0j90P8K89k40j61K44p4K94J16l31J55n22M68j48J3L9j58l3J26J69
2294A10rl9n8J18m30L13K93m70Q4J2J61j25J44L2m5J22n0j54R8k52J13j89K01
2317b0j09K60j30j01j29L06j75j58m8M47n0j3n5o8Q3K02j83J97k80n3L61n60K94
2340A8J6q0Q2j38K71k71J79l18L58j60J40k20L46k1k00j18L7l4k34M13m73L66
2362d1J74k33L9j10%J45j20K09Qk74L74k4k22n7J1P7M7J59k72J21k57K53j5J0
$$ plain form
2386 2 108 139 -181 -239 3 -218 -115 -89 66 126 104 58 245 223 141 6 -124 13 -123 -42 -114 -29 -136 232
2410 232 -176 -9 137 42 -126 -47 198 -135 131 -7 267 47 -91 -206 -180 162 84 84 -35 -143 -98 3
2432 3 -6 123 19 -75 -58 9 171 -80 8 179 404 -37 39 50 -160 -76 98 -74 114 112 -35 -19 15 -128 -303
2457 -303 -115 263 36 5 129 123 186 110 95 -8 17 143 184 -297 310 -92 240 -71 36 83 -139 12 76
2480 76 -4 117 -187 -106 -76 -11 270 -65 35 -34 -64 95 62 -381 109 98 -31 -255 -15 193 -56 5 89 -73
2504 -73 -127 -20 284 -13 -176 100 286 -43 -230 -65 -199 -48 -42 83 64 -259 -80 143 -311 -225 159 -47
2526 -47 244 73 175 -91 2 -14 51 -49 47 -139 -156 67 -171 -52 228 -83 -45 -154 -269 41 -247 -20
2548 -20 -89 159 -14 186 279 -103 129 -66 -180 152 109 -109 -31 -349 95 -201 2 -99 -18 -43 148 -97
$$ packed form
2386BJ06L1l20n8K42k21J03K6J55O0k2m6J87k2q2j35j30J37j36Q1p2Q5j07L68
2410B32m08J67J46r5j68P9K45l33K66j38K74k20j38j15K6L42p8%j19j08M5J01
2432CrJ29j04r4J7O7J62k51Q8J71K25m41P6J1k10Q4J74j72J88kj47J6L4j43j75
2457c03J88L78k27l1J24oO3p6j5j03K5J26M1m81O07m02L32l11J07M7k22J51O4
2480G6q0J21l04Q1L0O5K81l35J00o9l0J59l3m43M90j1j29k24K40K08k49O1Q4j62
2504g3n4J07L04k97j63K76J86l29j87J65j34J51OJ25j9l23J79K23m54Q6L84k06
2526d7K91j71J02k66R3j6O5j00R6j86j7K23k38J19K80l11L8j09j15L10k88K27
2548b0o9K48j73K00R3l82K32j95j14L32m3k18P8l18M44k96K03j01Q1k5J91k45
$$ plain form
2570 -97 198 -50 8 39 184 152 -31 -28 153 -166 127 -130 -305 104 -21 88 169 120 -59 86 24 -142 -190
2593 -190 1 -70 -4 -115 241 208 -77 -108 26 80 132 -66 -36 119 -34 -50 153 -99 8 232 154 -313 -34
2616 -34 83 30 38 91 120 105 118 98 60 12 162 63 158 239 123 -14 -14 -93 143 47 2 -34 -115 -48 211 99 -45
2643 -45 171 -2 169 106 154 -92 -47 160 -244 -201 -70 -39 -206 145 -268 21 -192 450 108 218 -33 173
2665 173 -110 90 74 90 85 4 104 -145 -149 62 -118 159 42 245 -83 -271 193 -373 -2 -167 126 -153
2687 -153 -29 91 -34 167 -175 98 -159 -40 68 -46 -233 43 109 102 -31 1 -150 -124 -16 15 15 85 10
2710 10 113 10 -103 109 30 135 129 200 -115 -86 40 10 -3 -275 -92 59 -61 -41 -6 -65 147 144 25 171
2734 171 -32 -49 5 43 258 10 -9 -297 171 -23 73 43 -156 132 -72 -107 -29 -4 -201 221 53 153 -22
$$ packed form
2570i7K95k48N8L1J45l2j83LJ81l19K93k57j75M09j25J09Q1m9j79J45o2j66m8
2593a90J91p1O6j11L56l3k85l1J34N4N2j98L0J55j53j6K03k52J07K24p8m67K79
2616c4J17n3QN3K9j5J3k0l8m8J50r9R5Q1j16j37%p9K36r6m5l6q1O7K59j12j44
2643d5K16j73J71o3M8k46M5K07m04M3J31L1j67L51m13K89k13O42l42J10k51K06
2665A73k83K00j6J6nq1J00k49mK11j80K77j17K03l28j88M64n66L71j65K93k79
2687a53J24J20j25K01l42K73k57J19J08j14j87K76O6pj33L2j51K6J08L1%P0p5
2710A0J03j03j13K12p9J05oP1l15K9J26l0j3k72J83J51j20K0L5n9K12lj19J46
2734A71k03j7N4L8K15k48j9k88M68j94R6l0j99K88k04l5P8K5j97M22j68J00j75
$$ plain form
2757 -22 143 -17 -163 72 71 -241 -22 -111 -84 -18 89 30 -89 -29 -66 -6 78 220 -238 40 167 -77 79 -69
2781 -69 46 -27 162 30 34 -5 10 95 -26 -142 13 0 77 11 -78 167 77 82 17 -185 -109 -2 89 129 -5 170
2807 170 45 -144 -306 -83 -95 -348 -203 86 -272 -160 378 31 -34 76 311 -39 28 56 163 16 83 -123
2829 -123 139 3 376 200 131 34 107 -302 -46 -100 -98 16 30 9 141 -19 41 -7 69 118 233 -129 -169 -36
2853 -36 102 -169 59 -232 198 -193 -289 13 104 93 43 -65 -104 -37 215 43 -42 66 -107 299 134 308 -61
2876 -61 31 67 -157 -186 -98 -201 129 123 -93 209 100 38 38 27 164 -394 -105 -184 -244 -97 -33 -25 189 -209 -206 -100
2902 -100 -130 -126 124 214 54 175 146 131 -161 153 -32 -48 95 -70 147 -136 281 18 -265 -42 196 214 -28
2925 -28 25 125 -20 21 72 -18 -33 -34 -118 245 180 -104 -233 7 -237 53 125 -138 117 181 -66 399 -220 91
$$ packed form
2757b2J65j60j46K35jl12K19q9K7O6J07n9j19O0l7O0Q4J42m58K78J27k44J56j48
2781f9J15p3J89j32Ml9J5Q5j21j16J55j3P7o6q9K45r0No5k02P6J07R1M0j34J75
2807A70j25j89j62K23j2k53J45K89l58J12N38l47o5J10K35l50O7K8J07j47O7k06
2829a23K62j36L73j76o9r7P3m09K56n4KJ14J4k1J32j60O0m8P6M9J15l62m0J33
2853c6J38k71K28k91M30l91r6L02R1j1n0j08l9O7K52j72q5J08j73M06j65J74l69
2876f1R2L6k24k9Q8j03L30ok16L02j09o2%j1J37n58K89p9o0J47O4QK14l98LJ06
2902a00l0MK50R0j60J21k9j5k92L14j85j6J43j65K17k83M17k63k83K23K38J8k42
2925b8N3J00j45M1N1r0j5jq4L63o5k84j29K40k44K90P2k63K55O4k47M65o19L11
$$ plain form
2949 91 -181 67 16 -123 149 -139 -38 -1 -126 145 14 207 204 -236 -101 -120 252 -49 80 -116 -220 -198
2971 -198 -271 -170 -220 57 92 -88 106 238 31 117 15 34 28 297 38 -28 -62 282 114 119 -153 -286 -90 -210
2995 -210 30 41 -85 -203 143 286 171 140 8 171 -145 -156 305 190 188 -59 -96 -82 -338 -15 5 -95 -245
3018 -245 114 -203 -139 263 54 -90 144 -151 -15 -18 -407 -278 -60 -21 -26 -53 -233 -138 -121 -135 147 -53 -62 266
3042 266 15 88 263 -53 25 -211 228 118 -278 -43 -209 -70 323 -50 -277 -54 -28 64 -262 -229 -27 -38
3064 -38 -122 13 175 -42 18 -13 -112 101 1 -38 -150 393 24 -112 -278 -122 -84 21 -164 167 -131 -61 22
3087 22 146 -86 63 122 -90 291 245 -216 -160 70 -43 21 162 -15 54 -67 65 -333 107 -168 -28 -183
3109 -183 17 -57 -157 -238 95 -225 177 55 217 -83 -163 -155 -204 3 -62 -120 95 131 32 140 -53 265 -33
$$ packed form
2949I1k72K48n1j39K72k88J01L7j25K71j31J93lm40J35j9L72l01J29j96j04K2
2971a98p3J01n0K77L5j80J94J32k07Q6j02J9oK69k59o6l4L44j68Nk72j33J96j20
2995b10K40J1j26j18L46J43j15l1j32J63l16j1M61j15kk47l7J4k56L23K0j00j50
3018b45L59l17O4M02k09j44K34k95J36ll89J29K18L9nk7j80R5J7j4K82k00rL28
3042B66k51P3J75l16P8k36M39j10l96K35j66J39L93l73k27K23K6R2l26L3K02j1
3064c8q4J35J62k17O0l1r9K13j00l9j12N43l69j36j66J56L8J05j85L31k98P0Q3
3087B2J24k32J49N9k12L81m6m61N6K30j13O4J41j77O9j21J32l98M40k75J40j55
3109a83K00p4j00q1L33l20M02j22J62l00q0Qm9K07o5n8K15L6r9J08j93L18k98
$$ plain form
3132 -33 96 -333 114 -357 -102 37 56 -198 101 46 -250 30 -39 -58 -16 158 -95 -131 -15 -213 90 20 -137
3155 -137 201 10 201 137 130 -197 -98 -52 -112 295 -74 106 -178 150 321 -11 9 -203 -49 -63 7 95 196
3178 196 60 167 66 -247 -89 -54 -500 -211 83 -300 -19 -170 -176 -32 177 141 -67 208 298 -168 148 325
3200 325 178 97 53 -18 224 -8 -76 139 36 92 -301 -220 -95 71 171 -63 19 155 -42 -14 -4 -49 -70 -55
3224 -55 5 -180 -107 -131 -301 98 178 -178 41 175 16 -230 70 18 -226 7 136 123 251 -39 -166 135
3246 135 -135 -120 -59 -62 56 -187 91 -207 90 -1 -299 -188 22 -216 -28 212 -151 -175 75 -260 33 357
3268 357 -86 73 -98 -23 171 35 -324 -29 215 -247 -110 -37 -127 -78 -32 -308 -61 169 185 69 -29 -65 -38
3291 -38 -187 18 169 153 -238 -98 231 -158 92 -13 -31 -107 -206 -115 -2 -81 9 -91 -6 -33 184 -42 -31 164
$$ packed form
3132c3J29m29M47m71K55J39J9k54K99n5k96K80o9j9M2J74k53l6J16j98L03p0j57
3155a37L38j91J91o4pl27R9M6o0M07l69J80k84L28J71l32K0k12J54j4P0Q8J01
3178A96j36J07j01l13J58L5m46K89K94l83K81j51oJ44K09l6k08K75R0m66L16J77
3200C25j47q1m4p1K42k32o8K15j03N6l93Q1J25J66J00k34Q2J36j97K8J0m5k1J5
3224e5O0j85P3k4j70L99Q0l56K19J34j59k46L00n2k44K33J29j3J28k90j27L01
3246A35k70J5O1lJ18k43K78k98K97r1k98J11K10k38J88K40l63k4K50l35K93L24
3268C57m43J59j71P5J94j36l59K95K44m62J37P3r0M9M6k76K47K30J6j16r8l6K7
3291c8j49K05J51j6l91J40L29l89K50j05j8p6r9R1J13p9R0j00Q5k7K17k26J1J95
$$ plain form
3315 164 -31 44 -236 -101 -38 137 126 308 71 221 -6 2 -363 224 -32 53 -89 -131 76 -16 -345 139 96
3338 96 22 -26 254 261 -112 22 141 -103 -178 -180 -9 -84 89 112 221 195 402 -145 -94 -112 213 -107 101 -70
3362 -70 -189 110 -13 -191 -178 -374 60 -81 -119 -6 182 74 -123 14 18 75 294 -109 52 -49 81 74 58
3385 58 -61 -56 13 -161 -65 -60 -60 147 57 136 -190 57 74 -9 182 -134 48 -7 47 -98 -74 -122 35 -108 28 -66
3411 -66 95 -90 -53 -184 -107 -81 244 -174 -115 132 14 117 -58 -139 3 150 57 22 15 157 20 -15 -45 -286
3435 -286 90 18 23 29 -87 34 -69 -5 3 -140 136 -15 144 -17 37 202 90 -177 165 62 -19 182 -97
3458 -97 8 -69 226 85 -6 294 69 119 -45 -66 103 14 -1 -77 17 331 199 -23 131 -18 -172 65 -94
3481 -94 -47 -278 1 -88 -12 -77 -30 22 245 76 210 258 24 -10 -99 -12 -215 -1 60 -20 -32 -74 -52 -157 104
$$ packed form
3315A64j95P5k80J35O3J75j1J82k37J50k27Ql65N87k56Q5j42m2K07r2l29M84m3
3338I6p4m8K80Pl73J34J19k44p5kJ71p5J73K3J09k6K07n47N1j8L25l20K08j71
3362g0j19K99j23j78J3j96M34j41l8J13J88j08j97J37MN7K19m03J61j01J30pj6
3385E8j19NO9j74R6N%K07r0P9l26K47J7q3J91l16J82n5N4j45K4m8J57j43J36r4
3411f6J61j85L7j31P7K6L25m18N9K47j18J03j75q1J42J47r3l5pJ42j37l5l0k41
3435b86L76p2NOj16J21j03O4Qj43K76j51J59j61N4J65j12k67L42j03q1K01k79
3458i7J05p7K95j41r1L00k25N0j64k1J69q9j5p6R4L14j32k22J54j49j54K37j59
3481i4M7k31K79q9P6o5M7N2K23j69J34M8k34l4q9Q7k03K14O1q0j2m2K2j05K61
$$ plain form
3506 104 120 -28 -41 176 109 86 -55 -15 -100 -46 -65 -44 -117 46 -12 -57 94 208 -135 -151 33 -267 99 7 237
3531 237 138 84 148 126 77 -139 141 -69 327 -82 127 54 -119 109 -68 -179 -65 -10 -220 -38 94 343
3553 343 8 230 10 -160 -19 -128 -182 15 -224 13 173 28 -37 -153 -118 -24 153 124 -72 63 -20 -28 -93
3576 -93 153 -140 -81 145 33 59 -90 -130 -31 33 -51 136 -6 -46 -288 -91 -302 -64 -176 -32 69 251 153
3599 153 -286 -23 91 -23 -200 -32 143 23 39 122 19 -109 249 -42 91 -296 19 -244 -41 334 111
3620 111 -314 -102 51 226 -50 -33 16 249 -92 141 -113 -18 74 187 59 66 -17 -15 -44 -13 -273 114 23 55
3644 55 26 -2 281 84 -1 -81 34 -21 245 -137 -85 171 35 -356 -5 129 -205 113 99 105 -142 147 -38
3667 -38 124 62 -34 -40 -151 32 117 153 19 139 65 -225 -199 148 3 -155 303 214 -11 181 95 -15 123 237
$$ packed form
3506A04J6j48j3K17o7k3j41M0q5N4j9K1p3J63n8m5J51J14l43j6J84l00L66r2K30
3531B37r9n4O4k2m9k16K80k10L96m09K09p3j73K28j77j11J14N5k10J82J32K49
3553C43l35K22k20j70J41j09n4J97k39K37J60j45o5j16L5R4J77k9j96J35q3qo5
3576i3K46k93N9K26j12K6j49m0R9O4q4J87j42m0k42J97k11K38j12J44J01J82r8
3599A53m39K63J14j14j77J68J75j20J6Q3j03j28L58k91J33l87L15k63K03L75k23
3620A11m25K12J53J75k76J7M9K33l41K33k54R5R2J13j28Pq3Kk9L1k60L87r1L2
3644E5k9k8K83j97q5q0J15n5K66l82N2K56j36l91L51J34l34L18j4Ok47K89j85
3667c8J62o2r6oj11J83Q5L6j34J20p4k90K6L47j45j58M58q9k25J92q6j10J38J14
$$ plain form
3691 237 108 90 159 63 77 -161 -51 -99 -154 -185 -272 -133 -36 -27 -187 -88 67 75 -106 -355 150 119 -116 -72 -228
3716 -228 -177 -70 62 69 -18 -4 -15 -228 -121 156 19 -91 109 146 101 114 -2 -1 -77 -18 80 -229 21 291 -151
3741 -151 12 44 62 -216 179 157 124 39 6 -88 -70 -27 -16 70 159 222 189 -15 14 -79 -248 40 24 -112 -239 189
3767 189 -107 -12 -268 -21 -254 -95 319 -129 -268 132 -136 -202 -80 -171 -60 -79 188 19 177 -229 352
3788 352 64 -184 19 -125 82 23 -71 200 -236 -144 117 113 70 96 -148 50 -101 45 -77 -35 -175 59 -78
3811 -78 -192 -42 -126 93 168 -201 167 -186 -83 159 -51 -1 -12 -11 -48 114 128 -65 -256 35 -107 147 -154
3834 -154 -141 73 -26 100 145 14 -101 -160 -4 -47 -53 56 -69 69 77 44 -39 -84 117 158 18 64 50 -82 -101
3859 -101 -26 30 -8 -32 -130 -39 -10 95 -78 -73 -40 -3 287 -23 27 -31 -64 -74 -228 7 -17 74 -103 -213 25 -20
$$ packed form
3691B37j29j8O9r6J4k38J10m8n5l1q7J39R7Rj60R9J55Qj81k49N05l1k35M4j56
3716b28N1J07J32Pq7J4j1k13J07K77j37j10K00L7m5J3j16Jp6N9R8l09K50K70m42
3741a51J63L2J8k78L95k2l3q5l3r4J8M3J1Q6Q9O3l3k04K9r3j69K88j6j36j27M28
3767A89k96R5k56K47k33J59M14m48j39M00k68o6J22r1J11j9K67j69J58m06N81
3788C52k88k48K03j44K07n9r4K71m36R2K61mm3K6k44J98j51J46j22M2j40K34j37
3811g8j14J50q4K19P5l69L68l53J03K42k10N0j1Jl7J62J4j93j91K91j42K54l01
3834a54J3K14r9J26M5j31j15n9J56m3oJ09j25J38Ql3q3m5K01M1j40M6j4j32j9
3859a01P5N6l8k4r8R1K9J05j73NL3L7K90l10N0n8l3j0j54K35k4R1j77j10K38m5
$$ plain form
3885 -20 -39 -2 -121 353 -32 -77 15 291 -66 37 185 -156 -29 40 -272 -55 -138 -185 111 43 105 246 -74
3908 -74 -80 -153 44 29 -152 -127 -68 114 24 -35 237 90 188 -116 -121 73 -56 210 -46 187 -178 -18 161 43
3932 43 93 -158 -2 288 -18 127 30 -48 -47 -2 -91 -28 119 171 -94 -141 -80 -148 75 -171 -48 10 139 44 -112
3957 -112 -99 171 -2 -113 -228 -99 50 -92 17 -145 -105 153 -208 158 68 -80 -47 75 -62 -21 54 64
3979 64 -14 55 5 29 -25 267 19 -22 -3 -50 -64 66 -31 -308 -113 -121 -113 -72 278 -254 94 136 -165 70 -20 3
4005 3 -51 73 -32 -16 112 85 108 102 97 21 141 -65 160 30 23 198 -3 -141 67 72 19 169 27 -138 -12
4030 -12 -241 164 285 -130 -99 -182 -202 70 11 -79 34 46 -113 -171 -7 161 -19 149 -102 -239 -54 -27 -353
4053 -353 -63 -174 210 124 38 179 46 -152 261 110 67 83 182 164 -44 43 -62 -40 16 130 -86 282 -131
$$ packed form
3885b0j9L7j19M74l85m5R2K76l57J03J48l41J27O9l12K17q3m7K96o8O2J41l20
3908g4op3J97j5j81K5N9J82r0n9K72j47R8l04nJ94j29K66k56K33l65J60J79j18
3932D3N0k51J56K90l06J45r7p8JM5q9O3J47N2k65m7O1o8K23k46J23N8J29r5j56
3957a12J3K70j73j11j15J29J49j42J09j62M0K58l61L66r0j48L3J22j37M1P5J0
3979F4p8O9n0K4n4K92k48m1J9m7j4J30r7k77J95qQM1L50n32L48M2l01K35r0K3
4005Cn4J24j05J6J28k7K3onp6J20k06K25j30pJ75k01j38K08Nn3J50j42j65J26
4030a2k29M05J21m15L1q3k0K72n9r0J13J2j59n8J64J68j80J68k51j37J85K7l26
4053c53K90j11L84q6q6J41j33j98M13j51m3J6R9j8k08Q7j05K2N6J14k16L68m13
$$ plain form
4076 -131 -59 -12 100 313 284 125 32 -26 35 -196 24 -71 68 -24 -86 -74 69 198 -9 55 -82 -52 12 10 -258
4101 -258 -174 -210 38 -131 -216 -158 -152 -99 0 -39 88 207 26 108 -40 -162 -106 -74 245 49 67 143 156 -96 -182
4126 -182 256 -229 103 -1 178 -42 115 -47 -17 -254 -2 124 158 11 -47 -63 -96 -186 -336 -187 25 110
4148 110 -144 107 -189 52 172 67 109 112 78 264 -59 154 -237 98 -128 -35 190 -207 45 -38 122 -49
4170 -49 -35 -99 -79 286 105 -70 70 23 -467 48 468 152 -24 139 137 260 135 103 166 21 -37 -151 -74 4
4194 4 123 -198 -132 18 -155 -110 -259 47 117 -61 57 170 102 312 -15 -33 -92 24 13 -58 -208 -41 53 190
4218 190 -276 -250 -94 -167 13 14 9 -221 -167 78 52 234 -53 -52 282 10 50 -159 106 34 9 -170 -128 -145 -119
4243 -119 317 285 41 85 192 -42 226 -47 112 -77 116 -55 243 -115 -211 44 80 120 -23 85 -140 -2
$$ packed form
4076a31P2M7J12K13k9j59r3n8O1k31K20r5J39r2o2J2J43J29k07O4j37L0O4kk68
4101b58Q4l6K48j69q5N8ON3R9l9J27J19j81Q2j48j22N6L2L19j96J8P6J3k52q6
4126a82M38m85L32j04J79k20J57j62L0k37K52J26L4j47n8j6l3r0j50J49K12Q5
4148A10k54K51k96K41J20j05M2Ll4J86l23K13l91L35k26R3K25l97K52q3J60j71
4170d9J4o4K0L65j81j75J40m7m90N15M20l16j76J63kJ23j25l2O3j45n8j14P7P8
4194DJ19l21O6J50j73M5j49L06P0j78J18J13o8K10l27j8n9J16j1p1j50J67R4J37
4218A90m66K6J56p3J80Jnk30N4K45k6J82k87JL34k72M0k09K65p2k5j79M2j7K6
4243a19M36l2k44M4J07k34K68k73J59j89J93j71K98l58r6K55L6M0j43J08k25J38
$$ plain form
4265 -2 -115 148 75 -111 214 -7 42 -243 246 -48 -20 20 -59 207 45 76 -67 114 -69 -37 454 205 -187
4288 -187 -141 -201 137 116 -63 -70 -74 19 -57 -1 -140 9 -6 -72 -254 111 -179 85 34 -76 44 -132 -46 -130 10
4313 10 -59 129 231 -257 207 349 -197 -283 -50 80 168 162 93 2 268 -41 -117 -112 -2 139 -70 63 -173 85
4337 85 -295 328 -41 -106 -17 -113 -125 -107 -170 -120 -71 -202 -84 -354 -70 -213 -84 62 239 -232 -230 70 -82 -66
4361 -66 -7 93 -62 243 11 -111 -6 125 70 -168 -8 -109 -147 -154 -131 -304 127 -113 -88 -177 106 345 74
4384 74 78 -67 33 -31 24 -10 -61 -69 -344 -24 9 7 195 -59 288 112 -278 -100 229 -41 0 197 -1 60 -207
4409 -207 123 40 -122 3 29 52 91 -105 -56 207 -84 179 262 67 -71 79 206 21 175 -24 323 -12
4431 -12 36 23 -51 -148 73 25 65 16 88 124 179 -155 -36 92 339 283 139 64 -152 32 64 13 243 46 -174
$$ packed form
4265bj13K63p3j86L25k21M9k85M89k94K8M0p9K66j62L1j43J81j83L2M91k49l92
4288a87M6o0L38k1j79pmR3p6N6j39J49j5o6j82L65k90K64n1j10J20j76Q6q4J40
4313A0o9J88J02m88M64J42n46q6K33J30Q8oo9r1K66l09p6NJ10J41k09J33k36K58
4337H5l80O23l69o5Q9r6j2J8o3N0M9j31J18k70K84j43J29J46J77m71KL00j52J6
4361f6N9J00j55L05k32j22J05J31n5k38J60j01l8pK3j73M31k40K5q9K83K39k71
4384G4Mj45J00o4N5l4n1qk75L20L3kJ88k54L47j76l90J78L29k70M1J97j98O1k67
4409b07L30q3j62J25K6K3L9j96M9K63k91K63Q3j95j38J50J27j85J54j99L47l35
4431a2M8j3p4r7K21m8M0m9P2L6N5l34J19J28K47n6j44p5k16J84L2n1K30j97k20
$$ plain form
4456 -174 56 -9 26 3 -78 -231 87 164 40 -133 -11 -74 18 -29 20 -119 339 4 140 236 -119 20 -46 258
4480 258 -92 -174 -70 -116 -130 -65 -47 9 -118 -42 -11 -107 81 -169 337 171 -16 253 15 -308 44 100 186 375
4504 375 -76 65 -152 254 -246 49 -68 -101 21 -111 162 -127 47 -69 29 250 167 31 -104 88 7
4525 7 -67 40 42 -96 72 -75 225 82 -88 80 -56 153 281 94 -202 -48 -159 81 131 -181 -99 -86 15
4548 15 183 204 -165 -13 109 66 85 -6 -245 -340 -189 -108 281 106 127 -24 35 251 140 -12 -7 117 -74 108
4572 108 138 -107 120 75 282 7 -22 311 69 -195 10 -162 -65 227 14 -212 -69 -93 160 -8 0 18 79
4595 79 -68 -194 180 -8 -122 -250 -277 4 -36 19 -71 -156 -104 154 -125 96 11 -84 -338 -48 -129 172 -335
4618 -335 -293 -32 -24 114 -139 -159 131 155 -206 -71 26 -99 191 56 -69 183 -54 -83 -26 96 -253 83 100
$$ packed form
4456a74K30o5L5k3q1j53L18P7j24j73J22o3R2m7M9j39M58l35J36R6l55J39o6L04
4480B58l50q2J04m6j4O5J8N6j27P6L1r6J88k50N06j66j87K69k38l23L52N6Q6J89
4504C75m51J41k17M06n00K95j17l3J22j32K73k89J74j16R8K21q3j36j35J92q1
4525Gp4J07Kj38J68j47L00j43j70J68j36K09J28j87k96J54j11K40N0l12Q2J3J01
4548A5J68K1l69J52J22m3J9r1k39r5J51Q1L89j75K1j51N9K16j11j52NJ24j91J82
4572A08L0k45K27m5K07k75k9L33k42k64K05j72R7K92k13k26J43k4K53j68QJ8O1
4595G9j47j26L74j88j14j28k7K81m0N5r0q5N2K58k79K21q5r5k54K90q1L01n07
4618c35M2K61QJ38k53k0K90K4l61J35R7j25K90j35j25K52k37k9N7J22l49L36J7
$$ plain form
4641 100 -10 154 -143 21 149 -32 109 255 110 118 163 -34 25 277 40 7 -201 7 -68 -219 -28 -311
4663 -311 20 -80 110 -17 -4 -134 126 -16 108 226 96 132 95 8 -42 -107 -62 -155 67 14 37 174 35
4686 35 3 -19 75 7 22 190 49 -151 272 320 71 313 102 95 32 22 222 -157 13 -130 33 286 -82 -295
4710 -295 -20 121 132 -15 120 263 164 201 19 -58 -113 55 178 -123 -5 57 -108 -103 -55 69 23 -3 -135 0
4734 0 199 8 -243 181 132 73 -97 -258 99 49 74 -30 81 48 -62 -48 180 -134 32 -107 97 102 164 -137
4758 -137 96 143 -25 147 -65 216 108 -127 24 205 -52 -246 39 -138 68 123 193 -244 58 156 -205
4779 -205 -80 133 241 -89 -218 -82 -74 6 9 222 -127 102 102 112 149 118 105 4 -61 49 -110 -122 -38 142 5
4804 5 -116 -25 -12 55 31 151 82 -5 0 -216 11 -113 11 -84 -135 -51 -128 26 291 -182 -191 -184 3 193 84 86 90
$$ packed form
4641A00j10J64k97J64J28j81J41J46j45QM5j97N9K52k37l3k08K08p5j51J91k83
4663c11L31j00J90j27J3j30K60j42J24J18j30L6l7q7n0o5M5r3K22n3K3J37j39
4686C5l2k2R4o8J5J68j41k00M23M8k49K42k11po3j0K00l79J70j43J63K53l68k13
4710b95K75J41J1j47J35J43r9L7j82p7n5J68J23l01J18O2j65NM8J24m6k6j32J35
4734@J99j91k51M24m9n9j70j61L57n0K5j04J11l3j10J4K28l14J66j39K04NO2l01
4758a37K33M7j68J72k12K81j08k35J51J81k57j94K85j77K06N5P0m37L02R8l61
4779b05J25K13J08l30j29J36QQ0LK13l49K29%J0L7l1j3j01o5J10j59j2Q4J80j37
4804Ej21R1J3O7k4J20o9q7Nk16K27j24J24r5n1Q4p7J54K65m73rPJ87J90j09KM
$$ plain form
4831 90 73 80 -33 -220 -4 -99 -64 139 10 -121 -329 313 -136 -102 -286 123 -128 44 -23 272 -67 154 -32
4854 -32 -96 141 173 -71 125 10 101 -12 24 -213 -9 -16 -82 232 242 -73 405 12 6 128 188 -171 42 217
4878 217 -218 16 -15 39 17 151 -145 42 -303 161 41 6 201 -37 100 268 -316 345 144 22 17 37
4900 37 182 -116 119 -166 86 107 78 -2 21 186 -3 34 -49 -13 -114 1 -121 7 -159 -241 1 -10 -41 128
4924 128 287 -290 -61 208 -127 51 85 269 301 -45 40 109 -9 32 -327 46 -65 -74 65 -142 -26 -164
4946 -164 46 7 17 44 -121 91 -57 15 -167 123 98 48 -123 54 -5 -223 -195 86 -135 -111 -18 -257 190
4969 190 -7 50 -61 48 -105 -266 -184 -264 -69 -242 -4 -13 26 -101 -189 -134 113 141 48 232 -131 41 -65
4992 -65 -39 -17 -8 85 -119 -98 -70 159 -105 -70 -112 46 -89 -200 -67 184 -181 -12 -70 -52 246 258 176 -61 190
$$ packed form
4831I0j7Pj13j87K16r5L5K03j29j31k08O42m49L4j84M09k51J72o7K95l39K21j86
4854c2o4K37L2k44J96j15R1j13L6k37K04po6L14J0l15M78l93oJ22O0l59K13J75
4878B17m35K34l1N4k2J34k96J87l45M64j20l5J95k38J37J68n84O61k01j22nK0
4900C7J45k98K35k85K52K1k9q0K3J65j89L7q3L6j01J15j22J28j66q2K42j1l1J69
4924A28J59n77K29K69l35J78L4J84L2l46Q5O9j18M1l59L73j11rJ39k07J16j38
4946a64K10l9J0K7j65K12j48P2j82K90k5n0j71J77n9k18K8K81k21K4R3k39M47
4969A90j97N7j11J09j53j61Q2q0J95j73K38rL9j27q8N5K47K8r3J84l63J72j06
4992f5K6K2RR3k04K1K8K29k64L5m2J58j35j11J33K51l65J69n8J8K98J2q2k37K51
$$ plain form
5017 190 -54 80 -134 -5 -6 15 -205 -95 297 -50 -77 52 197 293 20 89 -50 -79 -272 41 64 -125 -171
5040 -171 38 172 -201 -183 -52 -84 97 212 -55 220 63 104 -6 -12 220 -14 -22 -44 35 25 -102 179 27
5063 27 83 31 -182 323 -243 37 -112 -103 44 186 -126 79 95 116 75 30 -278 -151 -209 -132 -16 87 280 -45
5087 -45 119 -3 62 -93 83 273 -50 62 -143 267 65 -18 -104 33 260 -49 -10 -15 138 194 -45 66 -48
5110 -48 -74 255 -94 40 -57 59 -7 258 -33 134 -107 165 -184 223 -239 -233 -218 112 -29 -54 -190 -216 -24
5133 -24 -244 209 -175 -67 299 -229 58 41 -219 19 -106 -93 -83 6 -132 221 -156 189 -29 37 -81 -244
5155 -244 3 34 83 -243 -163 -139 84 -34 -31 119 -141 79 3 -75 43 -110 -152 -75 268 200 60 71 92 -229
5179 -229 -117 -56 -90 8 -71 -189 129 221 347 -38 -247 18 -211 48 -96 252 215 -122 2 35 -80 127
$$ packed form
5017A90k44J34k14J29jK1k20J10L92l47k7J29J45R6k73O9j39k9j93L13K3j89m6
5040a71K09J34l73J8J31l2J81J15k67K75j57M1j10oK32k34qk2P9j0j27K81j52
5063B7N6n2k13N05n66K80j49RJ47J42l12K05J6K1m1m5l08J27n8P7J16J03J93l25
5087d5J64j22O5j55J76J90l23J12k05M10k02q3q6J37K27l09L9nJ53N6k39J11j14
5110d8k6L29l49J34r7J16o6K65k91J67k41K72l49M07m62OJ5L30j41k5j36k6J92
5133b4k20M53l84J08L66n28K87j7k60K38j25J3J0Q9j38L53l77L45k18O6j18j63
5155b44K47L1M9l26Q0K4K23j18LJ50k60K20p6p8J18j53m2P7L43o8j40J1K1l21
5179b29J12O1l4R8p9j18L18R2J26l85k09K65k29K59j44L48l7l37J24L3j15K07
$$ plain form
5201 127 -156 180 296 -108 -77 139 -71 26 27 50 144 113 26 -94 -39 -66 7 55 40 111 -141 66 -14 93 -155
5226 -155 22 -21 201 87 307 -256 19 69 -208 70 -29 3 -259 171 60 -139 -18 36 141 93 -86 37
5248 37 276 -156 -24 -150 -45 -29 -122 -84 122 166 6 -94 132 56 85 -4 -41 -275 -332 -193 112 -73 -19 -97
5272 -97 227 -47 -93 29 -95 195 -34 -96 -216 -72 54 251 53 69 -311 -42 -170 -59 89 160 -143 -14
5294 -14 38 -57 142 -87 84 -113 51 130 119 23 -222 49 107 276 44 189 41 -279 -53 -106 55 -90 172
5317 172 59 80 -102 54 -132 -2 8 67 263 -90 -346 -203 -123 40 -168 -72 -102 -146 4 -43 221 -104 84
5340 84 -39 -90 21 111 124 86 175 -103 -305 83 27 35 -3 -52 151 7 -64 63 101 211 61 17 257 0 156
5365 156 -106 -93 -328 151 119 45 137 -13 -123 38 35 24 128 191 -21 -121 -118 171 302 169 -38 -270 -126
$$ packed form
5201A27k83L36J16m04L1K16k10R7JK3R4l1q7j20N5k7P3M8j5P1k52K07q0J07k48
5226a55J77m3K22j14K20n63K75N0k77K78r9L2k62M30j11j99J21N4J05m8j79J23
5248C7K39m32J32j26J05J6r3L8K06M4j60j00K26p6K9q9l7k34n7J39L05j85N4p8
5272i7L24k74m6J22j24K90k29o2j20J44J26J97j98J6l80K69j28J11J48P1l03J29
5294a4N2r5J99k29J71j97J64P9j1r6k45K71N8J69k32J45j48l20K26n3J61j45K62
5317A72j13K1j82J56j86J30J0N9J96l53k56J43Q0J63k08R6l0m4J50m7K64l25J88
5340H4j23n1J11R0J3l8Q9k78k02L88n6Ql8m9K03j44p1J27L8J10j50m4K40k57J56
5365A56k62J3k35M79l2p4R2j50j10J61lj1J04O3k12j00LK89J31j33k07k32J44
$$ plain form
5388 -126 19 96 -2 -19 -38 -11 -137 -198 252 -41 78 -62 73 -118 -69 -75 -117 -157 -78 255 -54 -154 9 -186
5412 -186 -97 95 127 -60 -219 -167 199 -164 -113 -14 -227 126 -19 35 227 -108 -72 64 159 188 107 -12 -99 140
5436 140 -133 -29 12 336 -297 30 54 -234 121 -62 52 181 -151 -171 -155 67 -21 -148 -112 22 50 205
5458 205 -59 38 5 -49 188 -29 -172 -88 -210 91 96 121 -314 -133 192 10 -2 250 -83 7 249 -43 -14
5481 -14 133 160 8 45 -172 -19 -10 26 -224 -90 37 -128 132 -133 -143 215 -118 -108 -109 239 -273 206 158 61
5505 61 214 -48 102 -155 -105 -104 18 123 85 -56 84 70 -189 17 -140 46 -30 -89 -34 -91 -66 135 -176 -48
5529 -48 141 112 84 -116 -108 78 -64 151 52 -23 -54 49 -82 146 -41 58 41 150 -16 78 106 -82 -7 -34 138
5554 138 227 -20 -217 -267 -163 -88 -114 -188 288 3 4 80 32 182 -89 -380 210 133 67 56 -8 -240 -205 37 -186
$$ packed form
5388a26J45P7r8j7j9K7j26o1M50k93J19j40J35j91M9om2m0P9L33l09j00J63j95
5412a86Q9J92L2j87j59N2L66l63N1R9k13L53j45N4J92l35L6J36R5K9q1j19q7K39
5436A40k73J04M1L24o33L27K4k88L55j83J14J29l32k0J6K22q8j27L6J34K8J55
5458B05k64R7l3n4K37k17j43Q4j22L01NK5m35J81L25j82j2K52l33R0K42k92K9
5481a4J47K7j52L7k17J53RL6k50J34J27j65K60k65j0L58l33J0jL48n12M79m8r7
5505F1J53k62J50k57N0JJ22J05l8j41J40j4k59K06j57J86p6n9N5n7K5K01l11J28
5529d8J89k9k8k00QJ86j42K15r9p5l1J03j31K28j87R9j7J09j66R4K8j88P5k7J72
5554A38Q9k47j97n0J04P5k6p4M76k85JP6m8J50k71k91N90p7o6j1o4k32L5K42k23
$$ plain form
5579 -186 -26 -33 -78 -39 36 28 -138 -209 6 58 -27 61 34 34 -70 84 -80 -141 -104 -221 -1 76 -226 65 195 148
5605 148 163 161 68 38 74 107 47 293 114 -207 155 116 29 -49 -15 -158 21 -139 -163 130 -40 6 269 35 31
5630 31 54 -30 52 -206 -50 23 -75 273 26 69 -124 101 -27 159 -108 17 108 81 13 -303 191 -166 -19
5653 -19 28 -30 36 125 -195 -90 -14 39 -114 -144 186 -196 -60 -70 247 23 6 187 142 -28 -132 -278 164 -90
5677 -90 -108 -85 106 128 -89 -116 311 190 -27 -30 31 -153 -174 183 74 130 87 -33 -152 154 225 -70 204 -58
5701 -58 6 232 -116 11 314 -41 86 -251 -32 -72 310 183 76 -43 -71 -160 49 -214 39 -151 -272 65
5723 65 -66 97 -59 -36 -161 -94 -173 -14 -24 220 226 -107 63 0 49 -2 -217 -5 216 317 80 247 -223
5746 -223 -270 40 383 -206 123 -21 -82 -51 4 -68 -166 -82 24 -251 -48 -214 26 -248 48 -107 -84 140 -62
$$ packed form
5579a86J60pm5L9P5qj66p1K15N2q5Q8k7%j04J54j64o1L7j17K20P7l02K91J30m7
5605A48J5kr3l0L6L3o0K46j79l21L62l9q7p8L4j43J79j60k4K93j70M6K63k34m
5630C1K3q4Q2k58J56P3r8L48k47M3j93K25j28J86k67J25R1k7o8l16M94l57J47
5653a9M7n8O6Q9l20J05P6N3j53l0L30l82J36j0L17k24j7J81m5j70j04j46M42k54
5677i0j8K3J91K2k17k7M27j21k17lO1j84k1L57j09N6m3j20j19L06P1k95K74k62
5701e8O4K26l48J27L03l55J27l37K19m0L82j27j07j19k8q9K09k63K53j90j21L37
5723F5j31J63j56K3j25O7p9J59j0K44Ol33J70o3M9n1k15K12K21J01k37J67m70
5746b23m7L10L43n89L29j44o1L1N5p2r8Q4J06k75K03j66K40k74K96j55K3K24k02
$$ plain form
5769 -62 129 -66 206 174 207 48 -152 70 2 -38 77 -195 75 140 -48 -157 -8 60 -84 -49 87 -141 -39
5792 -39 -222 -295 38 68 164 161 -204 -105 -209 -124 -7 -150 -195 79 -60 -65 17 148 -99 -87 -62 -211 -305 164 95
5817 95 98 74 131 -219 -146 218 -34 121 -194 89 61 -89 96 -3 -101 -42 138 -240 -117 72 176 131 -200 -21
5841 -21 71 -16 -41 -305 -198 1 23 123 -216 -10 -94 -77 248 -171 -78 -56 125 -56 -132 -26 244 26 119 -170
5865 -170 249 209 -128 113 -109 114 -206 91 59 265 -120 194 100 -109 -91 116 188 56 -30 139 -197 -51
5887 -51 23 78 59 -2 -156 290 -158 -289 22 -109 60 89 87 179 -92 11 48 -110 -154 -192 78 -80 38 -38
5911 -38 -4 126 19 -167 35 255 61 -80 85 -56 103 87 -26 -20 -364 -331 -9 77 42 8 -122 102 86
5934 86 -120 150 -96 -98 19 -2 152 -180 163 3 -188 -157 54 114 47 51 -42 56 95 -261 -272 145 -60 -219
$$ packed form
5769f2J91j95K72l2L3j59k00K22o8m0J15k72K70O5j88j09J49O8j44L5J36k28J02
5792c9j83p3L33L0R6ll65R9j04Q5J17j43m5K74j39nQ2J31k47J2K5j49r4M69o9
5817I5Lk4N7l50P3L64k52J55l15K83k8j50J85r9r8N9J80l78J23J89J04m5l31J79
5841b1R2q7k5k64J07J99K2J00l39K06q4J7L25m19R3K2J81j81p6J06K70k18R3k89
5865a70M19m0l37K41k22K23l20K97l2K06l85L14r4k09J8K07P2j32q6J69l36J46
5887e1P4N5j9o1j54M46m48j31L11j31J69K9kR2k71J03L7j58m4l8K70j58J18p6
5911c8L4J30j07j86K02K20j94j41J65j41J59j6j13Ol44L3L22Q6l5l4j30K24j6
5934H6k06K70k46kJ17k1J54l32L43j60j91L1K11O0o7Mr3R8L9l56j1M17k05j59
$$ plain form
5958 -219 272 -125 149 -99 -58 175 77 -108 -220 12 226 23 -386 156 42 -50 176 -78 159 87 -119
5979 -119 104 -210 44 -60 -264 -207 -164 -195 -77 -109 -140 -120 63 -82 93 186 103 -77 136 -139 -106 58 -262
6002 -262 388 -312 89 133 48 -111 211 71 -141 150 36 -102 -100 70 -8 102 23 17 13 119 -140 79 -149
6025 -149 -125 146 196 -91 -165 -105 -144 7 -477 258 172 -176 -32 -139 -73 68 -276 -47 -193 212 -191 -231 -68
6048 -68 106 236 18 62 43 37 34 4 74 274 -110 12 55 4 -115 -12 157 -245 -167 -62 90 -28 -8 -46 325
6073 325 -10 -111 -234 50 -73 3 -86 28 81 -35 7 230 -294 -81 -45 21 -43 -28 78 89 163 -26 266
6096 266 -35 152 -58 126 11 -211 187 -42 -18 22 139 -132 16 -146 -2 -66 -50 -32 -221 -12 399 -172
6118 -172 4 285 -136 51 25 -89 119 159 51 -50 -175 -14 39 100 193 -241 -250 -33 -173 3 160 -267
$$ packed form
5958b19M91l97K74k48M1K33r8j85j12K32K14k03m09N42j14r2K26k54K37p2k06
5979a19K23l14K54j04k04N7M3l1J18l2l1K0J83j45J75R3q3j80K13k75L3J64l20
6002b62O50p00M01M4q5j59L22j40k12K91j14j38KJ70p8J10p9omJ06k59K19k28
6025a49K4K71N0k87p4O0l9J51m84P35q6l48J44j07O6J41l44K29j46M05m03m0J63
6048f8J74J30k18M4j9oll0P0K00l84J22M3n1j19J03J69m02P8J05J52j18K0l8L71
6073C25l35j01j23K84j23P6q9J14N3j16M2K23n24K13L6O6o4J5J06J1P4j89K92
6096B66l01J87k10J84j15k22L98k29K4M0J17k71J48j62J44o4J6J8j89K09M11n71
6118a72J76K81m21J87k6j14K08M0j08j01j25J61N3O1R3m34rK17j40J76J57m27
$$ plain form
6140 -267 187 38 -169 227 43 46 -156 -173 -15 -168 -163 79 -179 91 163 -96 -123 -31 178 144 -146 19 -22
6163 -22 78 -1 112 -215 41 54 231 -173 4 22 31 -85 -25 197 -195 -215 -2 -117 -54 28 -265 -35 46 25
6187 25 308 -75 117 193 404 70 23 -169 79 121 -16 -29 -67 -112 -13 160 -73 10 -283 -115 103 164 124 -24
6211 -24 -105 -287 -9 -72 -247 72 -74 -151 150 -23 106 351 -206 87 51 -22 39 63 208 87 -37 261 65
6234 65 -47 84 -88 -163 -143 -103 306 199 -47 -73 128 20 -426 -22 -305 205 -76 47 53 33 -128 -3 -46
6257 -46 -53 162 26 29 -192 246 87 -53 226 -169 94 172 -83 -65 -61 -173 12 -150 -20 -114 24 127 -14
6280 -14 398 71 53 118 -215 -178 294 -189 -112 99 178 -321 117 -204 42 318 -20 101 202 27 -96 -3
6302 -3 -74 -46 77 -81 22 -173 130 -55 -115 -77 149 35 -55 29 28 103 -75 -125 -180 -11 15 -56 -10 100 48 -61
$$ packed form
6140b67M54j49k07L96j84Lk02j7J58j53NK42k58K70P2k59k7R2K09l4k90J65m1
6163b2J00p9J13l27K56J3J77m04J77J8Rj16O0K22l92k0K13j15O3Q2k93K30Q1k1
6187B5K83l83J92P6K11l34m7j92K48M2j37j3l8m5R9J73k33Q3k93J68K18O1m0j48
6211b4q1j82K78o3j75L19j46p7L01j73J29K45n57K93l6p3O1K4J45j21j24K98j96
6234F5j12J31j72p5K0M0M09j07k46k6K01j08m46M04k83N10k81J23Ok0j61J25m3
6257d6pK15j36Lk21M38j59j40K79l95K63P8k55J8Mj12J85j62J30r4J38J03j41
6280a4M12l27j8O5l33L7M72m83P7K11P9m99M38l21K46K76l38J21J01j75j23R3
6302cp1K8J23j58J03j95L03j85o0L8K26j14r0Q4jP5j78n0n5J69K6p1M6J10n2j09
$$ plain form
6328 -61 63 -136 65 -166 98 -23 -237 -28 -186 -46 -74 -154 102 -140 115 148 -110 -172 -224 -39 -318 95
6350 95 39 55 -53 -157 365 -193 -15 133 -75 94 -10 271 69 -32 301 300 -111 -85 -71 231 61 -278
6372 -278 -309 -30 73 47 2 24 -33 -145 214 -123 125 71 -134 156 -38 146 29 177 -266 -59 189 175
6394 175 154 4 11 42 -126 -193 43 -20 -19 132 -44 10 -100 -65 -161 -109 -68 -60 -35 89 183 -72 -17 -96 9 -166
6420 -166 -91 49 -69 19 -69 257 -36 -285 66 48 -51 -89 101 -164 -171 208 -215 -91 39 290 14 -51 -243
6443 -243 -41 147 42 4 -59 -109 37 136 -55 95 -216 278 -111 234 122 89 -32 73 -8 -123 88 70
6465 70 -87 -85 176 -83 -123 139 44 -135 -178 -385 46 -215 110 -127 198 39 -2 118 75 65 267 125 39
6488 39 134 -85 235 -90 -127 -45 -29 -43 -258 306 -204 -11 -75 33 165 -331 120 53 135 -173 -150 40 -12 197
$$ packed form
6328f1J24j99K01k31K64j21k14K09j58J40k8q0K56k42K55L3k58o2n2J85k79M13
6350I5n6J6j08j04N22n58J78J48k08J69j04K81k02j01L33jm11K6J4L02j70l39
6372b78l1K79J03k6m5K2n7j12L59l37K48n4k05K90j94J84j17J48m43K07K48j4
6394A75k1j50PL1j68o7K36o3JJ51j76N4j10L5r6N2M1QK5J24R4k55N5p9J05j75
6420a66P5J40j18Q8q8L26k93k49L51j8r9l8J90k65pL79m23J24J30K51k76o5j92
6443b43K02J88j05l8o3n0J46R9j91J50l11M94l89L45j12l3j21J05q1j15K11j8
6465G0j57KK61k59m0K62r5j79m3k07M31k61L25k37L25j59m1J20m3j0K02j42q6
6488C9R5k19L20l25l7Q2J6j4k15N64n10J93o4J08J32m96M51o7Q2l08K3J90n2K09
$$ plain form
6512 197 114 -216 -97 41 200 -36 273 48 61 56 60 141 15 67 80 -50 -161 147 26 84 0 -131 -94 -44
6536 -44 86 -81 209 284 265 -155 277 -188 -54 -78 -65 247 -104 -89 -41 136 -26 35 -61 -184 -71 -212 150
6559 150 -216 -12 -75 -215 -62 -98 -30 -74 167 229 26 -17 232 25 -170 146 -114 251 -53 -10 -75 145 222
6582 222 68 289 -87 -62 -17 77 -206 -149 -244 68 -124 -34 301 44 238 156 -140 -245 62 31 224 49 -101
6605 -101 -55 -93 -15 210 -159 149 29 -57 -195 22 -69 -40 -10 -64 -84 11 -244 211 20 -99 -44 -87 27 89
6629 89 25 -135 61 81 144 -225 68 -33 77 -117 -1 -72 291 7 -258 -201 71 337 25 -370 85 -34
6651 -34 -95 -15 123 97 6 -114 259 -59 137 -148 187 -133 -37 102 -136 83 106 17 -208 -75 217 204 62
6674 62 -112 17 152 170 72 88 158 101 -7 142 32 41 96 -50 -16 109 -130 -75 -128 128 259 -119 -64 108
$$ packed form
6512A97q3l30J19J38J59k36L09k25J3nMQ1j26N2J3j30j11L08j21N8q4j31L7N0
6536d4J30j67K90P5j9m20M32m65J34k4J3L12l51J5M8J77j62O1r6j23J13j41L62
6559A50l66K04o3j40J53l6O8m4K41O2k03m3K49k07j95L16k60L65l04M3o5K20P7
6582B22j54K21l76K5M5R4k83N7r5L12j92R0L35k57J94q2k96j05L07l1J93j75j50
6605a01M6l8P8K25l69L08j20q6j38K17r1K9L0n4k0R5k55M55j91j19N5m3J14O2
6629H9o4j60J96K0O3l69K93j01J10j94J16p1L63k84k65N7K72K66l12l95M55j19
6651c4o1Q0J38k6r1j20L73l18J96k85L35l20R6J39k38K19K3q9k25J33K92j3j42
6674F2j74J29J35J8r8J6P0n7j08J49j10RN5j46L4J25k39N5n3K56J31l78N5J72
$$ plain form
6698 108 293 -149 60 -157 -68 111 -135 122 -19 31 294 184 85 -107 -215 -300 113 18 30 -168 -109 -54 39
6721 39 -10 -330 109 -207 32 28 -11 2 -93 -232 61 -279 76 -168 266 -71 -137 -98 101 -135 65 43 -136
6744 -136 4 -104 61 -30 -112 -74 288 -91 20 -150 -192 -94 -69 188 219 -129 196 -105 0 -2 127 28 40 90
6768 90 80 66 -63 -58 -6 288 -51 48 -97 32 -32 88 -88 23 -140 59 -82 -63 -94 82 106 -387 -39 -39
6792 -39 -215 85 -158 -72 -46 -101 196 -38 -10 -34 11 163 -79 1 303 -173 -204 -106 19 -54 -43 83 13 -52 -85
6817 -85 -82 -323 65 -121 19 -58 -198 157 123 253 30 13 -220 -2 -38 -124 50 181 103 -188 -121 -238 -4
6840 -4 76 -218 79 -139 -66 -46 -163 -53 38 51 -188 -31 -164 -12 108 133 24 12 63 -40 300 132 -44
6863 -44 28 -1 67 -223 -317 183 94 61 -30 -129 -10 -30 -107 -127 -189 102 -15 -32 116 -186 -297 -26 -273 -13 168
$$ packed form
6698A08J85m42K09k17Q9J79k46K57j41N0K63j10r9j92j08q5M13r5J2j98N9N5R3
6721C9m9l20M39l16K39ml9J3r5j39K93l40L55k44M34l37o6L9J99k36K00k2j79
6744a36J40j08J65r1q2L8L62l79J11j70m2R8K5K57L1l48L25l01J05kJ29r9J2N0
6768I0j0j4j29NN2K94l39R9j45J29o4J20j76J11j63J99j41J9l1J76K4m93L48%
6792c9j76L00k43Q6K6n5K97k34K8k4M5J52k42Q0L02m76l1R8J25p3J1J26p0o5l3
6817h5Lk41L88j86J40p7j40L55l4J30k23j7k33K18l6q6J74J31p8k91O7j17K34
6840dQ0k94K97k18P3K0j17J10R1J3k39J57j33J52J20K5j09j2N1j03L40j68j76
6863d4P2k9O8k90r4N00q9l3r1r9J19k0p7k0o2K91j17j7J48l02j11K71k47K60J81
$$ plain form
6888 168 157 156 -158 -112 63 -177 -170 -74 114 -122 78 -7 -34 -135 0 -46 203 -17 -36 -64 -36 159 24 -261
6912 -261 311 -160 -127 -50 20 14 -112 -91 96 -56 -8 150 -209 243 139 -53 -102 83 11 26 65 -175 42 206
6936 206 123 -63 28 -93 245 -297 119 162 -36 121 -82 -85 -69 -18 41 -81 18 127 -72 -101 20 85 -101 -42
6960 -42 138 -24 -31 143 -121 175 90 170 29 206 7 31 31 -155 141 -24 92 -166 -96 118 -135 44 -123
6983 -123 -127 -30 -17 204 5 220 -19 -278 -85 -102 23 361 25 -40 132 44 42 -108 -186 39 63 -44 -19 309
7007 309 -114 105 62 34 -157 58 289 16 -61 -265 -145 8 342 76 73 70 -72 -155 -89 -40 -50 -50 193 36
7031 36 -193 56 281 68 -131 129 -233 110 14 441 -157 -194 -9 -178 -145 -42 -181 -205 -148 238 97 -147
7053 -147 -69 -107 -42 -72 132 5 -78 169 107 -31 -41 230 -95 -260 202 -42 -71 -51 11 -196 57 89 83 -27
$$ packed form
6888A68j1jl14M6J75k40PR6J88k36K00q5k7j01J35m6K49k20j9k8K8J95j35k85
6912b61N72m71L3P7P0oj26K1J87j52M8J58l59M52j04j92m9J85p2J5L9k40K17J64
6936B06q3j86R1j21L38n42M16M3j98J57k03lJ6N1N9j22R9J09j99k9J21O5j86N9
6960d2J80j62pJ74k64K96q5Q0j41J77j99K4%j86K96j65J16k58P0K14k53J79j67
6983a23mR7J3K21j99K15k39k59J93j7J25L38l36o5J72q8kj50p8K25K4j07K5L28
7007C09m23K19m3k8j91K15K31k73p7k04J20J53L34k66llj42q3O6M9j0%K43j57
7031C6k29K49K25k13j99K60l62L43r6M27n98l7J85j69L3J03j39k4N7L86j41k44
7053a47P8l8O5l0K04j27q3K47o2j38j0K71l25j65M62k44k9K0O2k07K53L2oj10
$$ plain form
7077 -27 -250 123 -52 -42 -226 45 54 -95 -194 -149 -133 97 398 -48 21 -139 -19 213 -19 185 74 182 72
7100 72 223 136 -27 13 -249 5 53 52 -33 24 -134 -78 83 92 105 -71 229 -14 -386 -83 113 -24 -256 318
7124 318 -6 -336 -4 239 -131 -79 9 -19 -186 157 140 -202 187 139 -93 20 20 -62 198 142 213 48 -303
7147 -303 -264 -20 129 146 -214 233 -30 42 -270 -165 -56 -239 -28 -178 -180 130 -172 -15 -92 -156 -153 78 231
7170 231 -12 226 -28 180 83 -154 131 -119 -146 -239 -23 45 -40 -36 45 -208 121 34 -109 147 -203 -53 -92
7193 -92 -292 102 45 92 -226 -230 -53 38 -69 -63 245 -151 31 -133 -24 -29 30 55 -38 -55 1 44 127 164 -30 136
7219 136 -5 9 85 -134 -212 33 -85 -332 153 273 37 -29 -139 145 111 283 -364 32 4 -183 89 133
7241 133 126 25 -103 312 -187 -16 -38 -77 151 -4 -24 -25 -24 -183 -14 57 162 192 -107 84 133 -199 -186 7
$$ packed form
7077b7k23L73j75J0j84K71Rj49r9M5J6K30L01m46O9j60J20K32k32K04j11J08j10
7100G2J51q7j63M0k62K54M8jq5N7j58N6J61RJ3j76L00k43l72L03J96j37k32N74
7124C18l24l30L32K43l70N2Q8k8j67L43j7l42L89m8k32J13%q2K60n6P1j65l51
7147c03L9K44J49J7l60M47k63P2l12J05J09j83K11j50kL10l02J57p7o4LK31J53
7170B31k43K38k54K08r7k37K85k50k7r3K16O8q5MQ1k53L29q7j43K56l50J50l9
7193i2k00L94n7M7l18mJ77R1j07OL08l96J82j64J09nN9K5r3j7N6M3Q3L7j94J66
7219A36j41J4P6k19p8K45j18k47M85J20k36o6j10K84l4J72o47L96k8j87K72M4
7241A33pj01j28M15m99J71k2l9K28j55k0jJj59J69P1J05L0k99J91M9l32J3J93
$$ plain form
7265 7 178 35 -39 77 -3 -199 -6 -189 -146 165 -142 121 -48 -219 -61 -194 83 154 85 -60 76 -85
7287 -85 64 -13 123 -198 83 70 -34 53 122 79 284 -184 290 -110 37 -31 128 -67 -159 143 -13 -80 -86 6
7311 6 -98 52 -129 36 -178 -255 88 -70 245 47 50 15 -34 84 213 206 -3 -111 -15 265 43 211 -79
7334 -79 37 -31 174 -10 -53 115 156 33 198 152 -10 300 17 64 -125 -32 -241 -192 -123 38 47 15 90 37 154
7359 154 -227 70 -23 -168 129 91 79 129 100 79 137 148 -304 -42 62 -3 195 60 -72 96 -246 -45 -3
7382 -3 -5 -107 -63 -41 57 50 167 188 111 120 66 -94 191 -59 17 -234 -111 41 -48 118 -119 253 -91 141 -60
7407 -60 -28 -107 156 171 -127 2 -113 93 -128 -138 -16 -40 -128 -223 41 -257 -34 80 33 192 113 -29 -69 -16
7431 -16 -141 -148 -98 -106 98 21 -8 205 253 111 -99 224 -152 -112 66 16 277 -102 97 -305 -236 42 144 -28
$$ packed form
7265GJ71j43p4J16q0j96J93j83M3L11l07K63j69j71J58j33K77P1o9j45J36j61
7287h5J49p7J36l21K81j3j04Q7O9m3K05m68M74m00J47o8J59j95r2L02j56o7oR2
7311Fj04J50j81J65k14p7L43j58L15j98Ll5m9J18J29pk09j08R6K80k22J68k90
7334g9J16o8K05j84m3J68M1j23J65m6j62L10k83M7j89R3k09M9O9J61Rl2P5n3J17
7359A54l81K97r3j45K97l8j2N0k9k1N8J1m52K62J04o5J98j35j32J68l42K01M2
7382ckj02M4K2R8pJ17K1p7Rn4j60K85k50P6k51J23J52q9J66k37L72l44K32k01
7407f0L2p9K63J5k98J29j15K06k21j0J22k4q8r5K64k98K23J14m7J59p9j42m0N3
7431a6j25pN0qK04p7k9K13M8j42k10L23l76M0J78n0K61l79J99m02O9K78J02j72
$$ plain form
7455 -28 227 27 19 -177 -30 -95 -206 -134 100 37 -39 77 386 -245 -67 -151 41 -261 -252 59 148 284 -222 245
7479 245 253 163 -49 43 -179 -109 -169 -97 -297 108 47 189 91 257 37 -1 149 79 -308 -21 -34 -81 -105 278 -197
7504 -197 45 -125 -31 -80 50 -169 -191 -44 128 211 51 -187 -235 -20 -48 57 -348 -154 -196 -183 -108 4 -129
7527 -129 -128 -126 -111 60 -160 -38 -173 73 -135 -101 -10 26 -50 75 -84 24 76 -34 73 -130 32 86 11 218
7551 218 -215 126 -9 -315 -176 294 -192 53 -117 -184 -31 -103 -85 87 -113 -41 145 -103 -156 51 52 -129
7573 -129 7 178 121 -114 79 43 211 -11 -170 101 -122 -189 274 -73 40 -99 -36 -122 -44 218 7 25
7595 25 19 -2 -96 -25 26 -62 9 62 29 -1 -45 -9 49 103 273 -153 30 217 -93 -23 -19 293 -11 12 -93 93 39
7622 39 48 87 -50 50 300 160 -152 -34 -73 -144 68 63 -20 -191 108 -24 7 7 358 18 20 -149 -255 5 327
$$ packed form
7455b8K55k00qj96J47o5j11P2K34o3p6J16L09o31J78q4J92l02RL11Q9J36n06M67
7479B45Qr0k12R2k22P0o0P2k00M05o1J42r8J66k20l8J50p0l87K87j3m7k4L83m75
7504a97K42j70R4m9J30k19k2J47J72Q3j60k38m8K15k8J05m05J94m2J3P5J12j33
7527a29JKJ5J71k20J22j35K46k08L4R1L6p6J25j59J08N2j10J07k03J62N4p5K07
7551B18m33L41j35l06J39M70m86K45j70o7J53p2J8J72k00P2J86k48n3K07Jj81
7573a29J36J71n7k35J93l6J68k22j59K71k23o7M63l47J13j39O3q6P8K62k11J8
7595B5ok1r4P1N1q8P1N3l3l0m4L6N8N4J70m26J83J87l10P0ML12l04K3j05J86n4
7622C9RL9j37J00K50j40l12J18l9p1K12nq3j71K99j32L1%L51l40Kj69j06K60L22
$$ plain form
7647 327 -96 18 -70 -48 -74 -31 133 220 -25 -138 -187 11 40 -145 -116 78 188 -172 -120 43 37 -25 -32 -126 99
7672 99 90 -130 152 -215 76 14 -100 -166 61 32 37 -39 -35 -132 88 -98 -97 -158 218 -12 215 11 -48 157 49
7697 49 131 -90 116 -230 26 79 -2 -152 61 52 -35 26 277 -193 -81 -109 139 33 -209 -284 -184 -47 -151
7720 -151 -74 68 173 124 144 231 -85 -205 102 5 64 -144 24 96 -194 375 153 52 -150 -205 128 154 13
7743 13 -55 137 43 -123 -95 24 -117 -227 -110 29 9 -138 58 -275 9 36 163 -245 -181 -157 258 -64 -99
7766 -99 -34 146 -13 265 -167 -138 106 -329 8 36 48 90 25 246 -89 49 113 112 -53 -110 166 41 113 -96
7790 -96 -141 165 -200 -218 123 74 267 -322 -86 -32 153 -70 101 128 -214 -9 12 -50 305 134 140 75 -376 16
7814 16 63 -35 -158 -20 -306 -5 -66 22 134 235 114 -191 114 -306 103 30 -5 184 171 49 -19 -180 227
$$ packed form
7647C27m23J14q8K2k6M3J64Q7k45j13m9J98K9j85K9J94J10l60N2J63oo2pr4K25
7672I9rk20K82l67K91o2j14o6K27k9Np6Mr7K20j86Jo1L76k30K27k04n9K05j08
7697D9Q2k21K06l46K56N3q1j50K13rq7O1K51m70J12k8K48j06k42p5J00J37j04
7720a51P7J42J05m9K0Q7l16j20L07r7N9k08J68P2k90N69k22j01k02n5L33K6j41
7743A3o8J92r4j66K8J19j41j10J17J39k0j47J96l33K84K7J27m08O4K4M15l22l5
7766i9O5J80j59K78m32K9K44m35L37K8J2M2o5K21l35J38O4jj65n7K76j25P2k09
7790i6m5L06l65j8L41m9J93n89K36N4J85k23J71K7l42K05K1o2L55j71Oo5m51L92
7814A6M7r8j23J38k86L01o1Q8J12J01j21l05L05m20M09p3l5J89j3j22o8j61M07
$$ plain form
7837 227 23 -4 80 114 -54 211 -79 46 151 -96 111 -229 -170 78 158 78 78 107 -124 143 132 53 22 69
7861 69 105 22 56 29 8 -113 -226 105 197 21 146 5 308 340 -103 -486 -97 -177 -123 215 -69 -101 109 -6
7885 -6 65 -16 -45 72 -96 171 215 -2 -9 117 -29 -43 -157 151 21 58 -248 -75 -114 -206 86 203 93 -133
7909 -133 56 -77 337 -20 -175 -36 163 119 17 -82 -89 125 96 -222 -28 99 27 -117 -19 8 87 48 70 -36
7933 -36 -129 220 -136 4 135 109 27 -115 83 -219 -1 280 -118 -23 -85 -32 161 56 216 -5 43 -131 132
7956 132 16 -37 4 115 -42 96 242 98 36 -91 -45 30 58 35 91 -28 -319 8 473 -6 78 -67 -154
7979 -154 -139 164 135 -54 -121 87 -257 -63 19 69 -287 129 190 -402 -28 252 175 20 -79 -245 -36 -21 0
8002 0 -74 -244 78 117 -49 -120 106 450 -109 -75 -146 -276 133 -30 234 94 194 170 -35 150 17 -120 146
$$ packed form
7837B27k04k7Q4L4j68K65k90J25J05k47K07l40N9K48Q0q0%K9k31K67j1p9l1M7
7861F9L6q3L4k7k1j21j13L31R2j76J25j41L03L2m43l83L89q0N4L38k84l2K10j15
7885fP1q1k9J17j68K67M4k17pJ26j46j4j14L08j30L7l06J73l9r2K92J17j10k26
7909a33J89j33M14l57j55J39J99m4j02r9pK14k9l18J94J27p2j44R8K7P9l9K2j06
7933c6r3L49l56J40J31k6q2j42J98l02K18K81l98R5o2N3J93j05J60k21M8j74K63
7956A32j16n3M1J11j57J38J46j44o2j27M6P5K8k3N6j19k91L27M65m79Q4j45q7
7979a54J5L03k9j89o7K08l44J94Q2N0l56M16O1n92L74K80p7j55r9j66K09J5K1
8002@p4j70L22L9j66p1K26L44n59L4p1j30M09j63K64j40J00k4k05J85j33j37K66
$$ plain form
8025 146 156 -33 -92 -36 -19 4 160 -43 -328 98 134 181 68 147 95 288 -56 -143 -140 42 -1 253 57 124 -126
8050 -126 -297 -134 -112 -68 82 6 -82 -368 -84 -46 -119 157 170 -56 -122 233 -200 -32 170 -154 -66 119 172
8073 172 -180 45 -46 146 43 -91 179 -96 221 -131 -110 -14 70 184 -18 130 184 0 -110 150 4 106
8095 106 76 -111 -71 59 86 -266 106 -105 -162 198 128 33 12 -120 33 -46 24 -83 31 89 -149 60 151 -147
8119 -147 -153 253 14 121 -68 -37 147 -461 -24 343 98 65 -75 -10 -84 -232 -39 -130 167 -103 167 -50
8141 -50 -188 165 -203 -208 -37 -118 -49 -94 -24 66 -311 -365 25 39 -177 -189 -39 -1 37 50 -74 -143 -125 344 -208
8166 -208 -112 7 -272 -27 140 226 9 -53 228 -57 65 -231 42 -213 20 127 -38 -55 -85 29 -86 108
8188 108 -45 57 250
$$ packed form
8025A46J0j89n9N6J7K3J56k03k85M26L6M7j13P9n2J93l44q7LJ82m3K54j96O7k50
8050a26j71J63K2M4J50p6q8k86K84L8p3K76J3k26o6L55m33J68K02l24Q8J85N3
8073A72l52K25r1J92j03j34K70k75L17l52K1R6Q4J14k02J48N4j84j10K60j46J02
8095A06l0j87M0J30K7l52L72k11n7L60p0r5k1j32J53p9P0j07J14N8k38K09R1k98
8119a47oM06k39J07j89L1J84o08M37L67k45l3j40O5p4j48J93r1K97k70K70k17
8141e0j38L53l68nJ71q1O9m5P0R0l77n4L90J4k16j2J50L8L8J3j24o9J8M69n52
8166b08R6J19k79K45J67Q6k17o2K81k85J22k96K73k55K33J07j65j7l0J14j15J94
8188A08j53J02J93
8191B50
$$ Imaginary data points
##PAGE= N=2
##DATA TABLE= (X++(I..I)), XYDATA
$$ plain form
0 0 0 0 0 0 0 0 0 0 0 0 8 -8 8 -8 16 -16 24 -24 32 -40 48 -56 64 -77 88 -104 120 -141 160 -185 213 -244
32 -244 277 -312 352 -397 446 -501 559 -625 695 -773 857 -949 1050 -1160 1281 -1414 1557
49 1557 -1715 1888 -2082 2293 -2530 2796 -3095 3435 -3825 4278 -4812 5449 -6233 7215 -8496
64 -8496 10234 -12749 16724 -23976 41506 -177872 -32174 347114 36927 -135322 15421
75 15421 108678 -63974 -45769 70455 11566 -101329 25834 100685 -56457 -146718 47661
86 47661 160173 11961 -110950 -10696 60135 -5038 -31682 34050 14612 -57274 -25675
97 -25675 46752 -4129 -66550 -2756 66141 14550 -20821 32779 37910 -35248 -38313 14473 -1850
110 -1850 -34195 19480 54933 -16668 -61924 4669 53244 7198 -32361 -8078 13896 3086
$$ packed form
0@%%%%%%%%%%Qj6J6j6K4l2M0m8N6p2Q8j04J20j41J65j92K24k61L01l45L98m57
32b44N21n89O64p49Q43r47J060j184J320j468J630j806J999k210K441k695K971
49A557l272L603l970M375m823N326n891O530p260Q103r090J0261j1682J3448j5711
64h496J8730k2983K9473m0700O5482k19378J45698L79288l10187j72249J50743
75A5421R3257j72652J8205J16224n8889j12895J27163P4851j57142r0261J94379
86D7661J12512j48212j22911J00254P0831o5173k6644O5732j9438p1886L1599
97b5675P2427n0881o2421O3794O8897n1591l5371N3600N131p3158l065N2786j6323
110a850l2345N3675L5453p1601m5256O6593M8575m6046l9559K4283K1974j0810
$$ plain form
122 3086 -8560 -8056 -2590 9468 14799 -1846 -20938 -13838 12617 31106 21334 -7619 -21360
135 -21360 -4762 10653 -2663 -21243 -15410 5341 12088 3102 -1096 5171 4725 -5495 -5917 6070
149 6070 8438 -1752 -1849 3199 -6000 -11494 7077 19373 261 -14652 -1190 5447 -6930 -4094
163 -4094 13011 6361 -15376 -13449 1352 3226 2245 10096 8372 -4711 -6176 5440 7890 -1373
177 -1373 -5814 -1349 1571 -749 -2847 -1202 733 -15 -980 -893 -2119 -1413 3275 3645 -2494 -4279 2776
194 2776 6068 895 -1608 688 0 -1232 1803 2326 -2507 -2579 2004 -108 -5668 -2841 3379 2670
210 2670 -1687 -1680 -446 -896 1214 3522 808 -1788 86 2944 1625 -807 -894 685 1337 -532 -3049
227 -3049 -2748 298 1483 -725 -2068 -812 549 1897 1913 4 -660 597 1722 799 -973 -356 880
$$ packed form
122C086j1646N04N466J2058N331j6645j9092P100K6455J8489r772k8953j3741
135b1360J6598J5415j3316j8580N833K0751O747q986m198O267m46j0220m22J1987
149F070K368j0190r7N048r199n494J8571J2296j9112j4913J3462O637j2377K836
163d094J7105o650k1737J927J4801J874r81P851j724j3083j465J1616K450r263
177a373m441M465K920k320k098J645J935p48r65Q7j226P06M688L70o139j785P055
194B776L292n173k503K296o88j232L035N23m833p2M583k112n560K827O220p09
210B670m357PJ234m50K110K308k714k596J874K858j319k432q7J579O52j869k517
227c049L01L046J185k208j343J256J361J348J6j909o64J257J125r23j772O17J236
$$ plain form
244 880 696 -402 -953 -486 995 785 -466 -1593 -1039 -357 -123 -214 -273 -477 492 670 430 304 972 1463
264 1463 609 -136 -277 -627 -796 80 -109 -1180 -1692 -415 441 -330 199 948 739 -508 -672 544 837
283 837 299 97 104 -507 -324 632 1142 -413 -1129 134 433 -325 -1407 -207 -77 -577 -330 192 457 314
303 314 449 723 -209 -305 833 947 671 -399 -1411 -1020 -618 438 679 212 -602 -1077 -606 -73 894
322 894 905 639 -104 -662 -370 232 294 576 657 -56 -526 -539 -135 -135 193 129 -331 -690 -471 -74 75 -235 -164
345 -164 142 674 1185 283 -219 -646 -24 431 286 189 -193 -984 -1100 -832 70 335 646 603 -279 -966 -1036
366 -1036 283 744 1326 667 -13 -455 -712 318 1043 732 15 -778 -537 -343 -595 -229 127 -67 -162 -35
386 -35 49 -101 -394 312 745 689 649 536 -119 -311 -672 -282 -159 701 617 -223 -746 -933 -481 135 885 846
$$ packed form
244H80j84j098n51M67J481k10j251j127N54O82K34r1n9k04R69J78k40j26O68M91
264A463q54p45j41l50j69Q76j89j071n12J277Q56p71N29P49k09j247j64J216K93
283H37n38k02Po11J83R56N10j555p16J263K99p58j082J200J30n00K47N22K65j43
303C14J35K74r32r6J138J14k76j070j012L91M02J056K41m67q14m75M71N33R67
322H94J1k66p43n58K92O02O2K82Q1p13m70j3M04%L28o4m60l59K19L97J49l10P1
345a64L06N32N11r02n02m27O22M55j45r7l82p91j16K68R02K65L11m3q82o87p0
366a036J319M61N82o59o80m42k57J030P25l11p17p93K41J94k52L66L56j94r5J27
386c5Q4j50k93P06M33n6m0j13o55j92l61L90J23Q60q4q40n23j87M52O16P50l9
$$ plain form
408 846 174 -1002 -900 -215 398 1027 884 547 -312 -647 -248 6 819 711 23 -703 -1012 -677 -267 182
428 182 214 67 -159 125 -43 -233 107 312 126 677 605 152 -155 45 -132 -150 712 721 -247 -969 -949 -139
450 -139 -276 496 792 -387 -760 -558 -12 280 792 725 677 -80 -274 -334 69 514 377 -24 -344 -177 -453
471 -453 -482 23 -364 -291 176 327 -192 -657 448 297 236 794 348 -196 107 372 373 -149 -221 349 -145 93
493 93 -171 -866 -555 443 486 -527 -91 87 -176 -84 516 598 289 200 94 -467 35 484 699 91 -534 -662
515 -662 -634 8 412 -207 -685 28 471 -108 335 357 -243 -127 681 658 103 270 279 -201 -152 356 92 -199
537 -199 -288 -446 -539 37 282 0 -511 -257 -196 22 774 452 -441 -219 433 541 169 542 -34 -587 -309
558 -309 472 -113 -310 -225 -554 -448 34 104 -461 -7 297 -439 -146 684 931 83 -102 556 217 -49 395
$$ packed form
408H46o72j176J02O85O13O29j43l37q59l35L99K54Q13j08o88p26l09L35M10M49
428A82L2j47k26K84j68j90L40K05j86N51p2m53l07K00j77j8Q62Rr68p22K0Q10
450a39j37P72K96j179l73K02N46K92N12o7m8p57j94o0M03M45j37m01l20J67k76
471d53k9N05l87P3M67J51n19m65J105j51o1N58m46n44L03K65Jn22p2N70m94K38
493I3k64o95L11R98M3j013M36J78k63R2O00Q2l09q9j06n61N02M49K15o08o25j28
515f62K8O42M04o19m78P13M43n79M43K2o00J16Q08k3n55J67Rm80M9N08k64k91
537a99q9j58r3N76K45k82n11K54O1K18P52l22q93K22O52J08l72L73n76n53K78
558c09P81n85j97Q5l29J06M82P0n65M54L04p36K93Q30K47q48j85O58l39k66M44
$$ plain form
579 395 -54 -584 -66 698 -366 -591 -369 -518 -745 578 567 -819 -416 665 46 -204 348 927 -217
598 -217 -315 667 30 -285 155 99 -1052 -299 409 133 -209 -4 -619 -1049 529 976 -85 -329 55 263
618 263 -128 907 1196 -447 -681 436 379 -310 353 -151 -1039 -402 228 -79 -558 198 -81 -634 190 1088
638 1088 34 -404 404 380 -135 121 403 -123 -197 275 -67 -940 -146 38 -571 -649 169 37 -536 433 -82
659 -82 -882 64 963 563 342 310 -324 -671 564 910 -176 -349 215 71 -439 -361 -566 -748 101 727 -218
680 -218 -546 103 -108 -275 714 1189 175 -260 230 126 -358 225 797 -23 -714 -758 -686 -183 -119 49 -27
701 -27 88 -56 -669 -128 583 494 265 591 676 203 -533 -34 -107 -258 -24 435 -341 -618 -524 -348 -258 340
723 340 292 -182 -128 -4 -184 63 978 702 100 23 218 -303 -214 86 234 -62 -22 -391 -580 -1023 -521 203
$$ packed form
579C95m49n30N18P64j064k25K22j49k27J323j1j386M03J081o19k50N52N79j144
598b17r8R82o37l15M40n6j151P53P08k76l42K05o15m30J578M47j061k44L84K08
618B63l91J035K89j643k34J117n7o89O63n04q88O37O30l07m79P56k79n53Q24Q98
638A088j054m38Q08k4n15K56K82n26p4M72l42q73P94J84o09p8Q18j32n73R69n15
659h2q00R46Q99m00k21l2o34l47J235L46j086j73N64j44n10P8k05j82Q49O26r45
680b18l28O49k11j67R89M75j014m35M90j04m84N83N72q20o91m4P2N03O4J68p6
701b7J15j44o13N41P11q9k29L26Q5m73p36M99p3j51K34M59p76k77R4J76R0N98
723C40m8m74N4J24j80K47R15k76o02p7J95n21Q9L00J48k96M0l69j89m43N02P24
$$ plain form
745 203 240 362 191 -497 -440 173 372 481 434 604 -29 -245 -94 199 -345 149 551 -66 -447 -545 -774 -242
767 -242 138 361 183 131 -166 -154 50 637 615 293 198 225 -35 -730 216 624 -155 167 -323 -701 -918 -309
789 -309 370 298 -360 -80 -26 -179 133 525 44 452 464 371 24 -111 -250 -157 -172 112 -92 -486 -614 -412
811 -412 47 -329 -35 68 550 29 58 67 259 221 509 386 238 -433 -290 -157 150 -288 -237 -272 -425 -242
833 -242 -188 -215 -21 26 169 564 123 61 334 160 471 309 249 -5 -187 -233 -321 -226 -265 -279 -190 -235 -303 2 -114
858 -114 -96 461 395 -294 95 370 -27 295 308 509 -141 -129 169 124 -344 -313 -195 -44 -353 -188 59 -81
880 -81 -52 -326 9 214 256 171 275 580 323 -9 309 134 77 -116 160 -332 -256 -198 -253 -311 -220 -357 -286 116
904 116 133 82 46 156 294 141 -139 204 247 79 -34 93 -117 -467 -383 -198 -454 -88 -228 39 -76 250
$$ packed form
745B03L7J22j71o88N7O13J99J09m7J70o33k16J51K93n44M94M02o17l81r8k29N32
767b42L80K23j78n2k97J2K04N87k2l22r5K7k60o95R46M08p79L22m90l78k17O09
789c09O79p2o58K80N4j53L12L92m81M08J2r3l47j35j39R3j5K84k04l94j28K02
811d12M59l76K94J03M82n21K9RJ92l8K88j23j48o71J43J33L07m38N1l5j53J83
833b42N4k7J94M7J43L95m41o2K73j74L11j62o0k54j82m6q8R5l9j4Q9m5o8L05j16
858a14J8N57o6o89L89K75l97L22J3K01o50J2K98m5m68L1J18J51l09J65K47j40
880h1K9k74L35K05M2q5J04L05k57l32L18j75n7j93K76m92P6N8n5n8R1j37P1M02
904A16J7n1l6J10J38j53k80L43M3j68j13J27k10l50Q4J85k56L66j40K67j15L26
$$ plain form
926 250 380 104 234 330 284 303 311 345 -145 131 211 -239 -113 4 -42 -590 198 46 -215 -445 -10 66 138 254
950 254 239 -123 55 650 133 64 42 105 -419 51 274 -135 -557 -324 -200 -290 -178 126 -286 -209 -16 138
972 138 162 483 292 1 -110 181 301 -16 630 159 -451 -287 -272 -236 -204 259 -163 -537 95 478 32 -175
994 -175 114 112 109 518 369 19 26 331 214 -120 197 -35 -809 -424 259 -16 -259 12 -291 -747 -151 155
1016 155 2 174 291 263 -216 73 221 -46 -10 503 -74 -139 37 -242 -803 -678 286 50 -324 10 -142
1037 -142 -459 -78 758 322 -169 -54 -205 -156 421 394 160 238 272 -141 -580 -231 -171 -687 -198 361 65 -400
1059 -400 45 -126 -250 141 834 540 203 102 -298 -394 376 462 100 -459 -92 -498 -476 47 222 -408 -202
1080 -202 -322 -33 128 473 -174 -333 275 378 427 11 -20 -170 -265 318 475 -294 -278 39 -594 -591 108 403
$$ packed form
926B50J30k76J30R6m6J9QL4m90K76Q0m50J26J17m6n48P88j52k61k30M35P6P2J16
950B54j5l62J78N95n17o9k2O3n24M70K23m09m22K33J24r0J12L04m12P7J93J54
972A38K4L21j91k91j11K91J20l17O46m71o10J64J5L6L2M63m22l74O32L83m46k07
994a75K89klM09j49l50PL05j17l34L17k32p74L85O83k75k43K71l03m56N96L06
1016A55j53J72J17k8m79K89J48k67L6N13n77o5J76k79n61J25R64k36l74L34j52
1037a42l17L81Q36m36m91J15j51M9N77k7k34P8L4m13m39L49O0n16M89N59k96m65
1059d00M45j71j24L91O93k94l37j01m00r6P70Q6l62n59L67m06K2N23J75o30K06
1080b02j20K89J61L45o47j59O08J03M9m16l1j50r5N83J57p69J6L17o33LO99K95
$$ plain form
1102 403 -191 -321 -297 -80 -31 527 227 -105 206 217 404 -111 102 -135 -226 101 74 -784 -421 -87 -339 -254
1124 -254 371 327 -360 -322 166 37 296 575 154 37 157 99 -91 -164 339 7 -432 175 185 -331 -671 -364
1146 -364 -270 -159 410 581 -314 -268 403 259 286 583 290 -362 -293 68 107 86 422 -267 -653 -274 25 -238
1168 -238 -380 -10 -269 -67 -8 431 -102 -215 335 343 104 285 94 61 -237 241 60 -147 228 -138 -513
1189 -513 -508 198 69 53 -2 -68 -117 66 420 129 33 81 -196 166 173 -293 -183 -139 -146 -451 -406 -103 -220 -260 -183
1214 -183 103 -39 -102 325 85 128 190 189 -1 -31 103 -126 106 92 -52 -65 -371 -284 -171 -85 -126 -305 -393 7
1238 7 25 32 10 176 56 125 142 255 200 89 115 -109 130 -3 -88 -10 -183 -24 -140 -79 179 -176 -329 111
1262 111 260 84 166 99 20 117 -103 224 -256 -22 -54 -311 -291 -7 -280 -272 -97 -83 143 -235 54 123 -18
$$ packed form
1102D03n94j30K4K17M9N58l00l32L11J1J87n15K13k37r1L27k7q58L63L34k52Q5
1124b54O25m4o87L8M88j29K59K79m21j17J20n8j90p3N03l32m39O07J0n16l40L07
1146c64R4J11N69J71q95M6O71j44K7K97k93o52O9L61L9k1L36o89l86L79K99k63
1168b38j42L70k59K02N9M39n33j13N50Qk39J81j91l3k98M78j81k07L75l66l75
1189e13NP06j29j6n5o6m9J83L54k91r6M8k77L62Pm66J10M4pl05M5L03j17m0P7
1214a83K86j42o3M27k40M3O2jj90l0J34k29K32j4j44j3l06Q7J13Q6m1j79q8M00
1238GJ8Pk2J66j20O9J7J13n5j11K6k24K39j33q5P8j73J59j16O1K58l55j53M40
1262A11J49j76Q2o7p9R7k20L27m80K34l2k57K0K84k73QJ75J4K26l78K89O9j41
$$ plain form
1285 -18 -76 168 79 124 235 -104 170 61 -50 215 -119 -72 -53 -135 -242 -94 -258 -258 264 -47 -109 59 114 -49
1309 -49 168 141 336 -88 -233 -109 -80 -241 -7 -55 -44 -3 -92 -198 -136 -145 -199 -163 -103 289 387 104 205 209 91
1334 91 390 94 121 114 136 -110 -114 -72 -243 -75 -371 -288 -15 58 -234 32 -156 -277 157 61 215 -21 284 162
1358 162 -180 94 -47 -109 -46 -33 -105 -96 -93 -272 26 -259 -147 419 108 179 465 186 335 -12 80 281 -127
1381 -127 235 -45 -55 108 80 -100 -160 -336 -13 -272 9 -37 -78 -270 -126 103 144 288 73 69 61 45 357 125
1405 125 115 44 -133 -233 -289 -291 -54 -147 -22 -68 44 99 -55 -96 346 254 149 171 228 -107 88 417 -260 -205
1429 -205 -23 -286 -140 -46 -294 -198 -104 -22 0 -176 60 471 276 148 304 209 162 -143 174 305 -35 -128 -111
1452 -111 -227 -279 -135 -267 -303 93 101 -133 -132 250 -71 -100 73 -44 78 196 34 274 -90 183 67 -470
$$ packed form
1285a8n8K44q9M5J11l39K74j09j11K65l34M7J9q2j07J48j64%N22l11o2J68N5j63
1309d9K17k7J95m24j45J24K9j61K34m8J1M1q9j06O2rn4L6O0L92R8k83J01Mj18
1334I1K99k96K7pK2k46mM2j71J68k96Q3K73P3k92K66j88j21M34r6J54k36L05j22
1358A62l42K74j41o2O3J3p2RLj79K98k85J12N66l11P1K86k79J49l47R2K01m08
1381a27L62k80j0J63k8j80o0j76L23k59K81m6m1j92J44K29M1J44k15mqj6L12k32
1405A25j0p1j77j00n6kK37r3J25m6J12N5j54m1M42r2j05K2N7l35J95L29o77N5
1429b05J82k63J46R4k48R6R4Q2K2j76K36M11j95j28J56r5m7l05L17J31l40r3J7
1452a11j16n2J44j32l6L96Qk34JL82l21k9J73j17J22J18j62K40l64K73j16n37
$$ plain form
1474 -470 -297 118 -173 -214 -28 -159 -25 66 -162 -329 -56 105 189 -96 107 328 47 -123 128 -149 -55
1495 -55 -84 32 64 -97 -142 -37 -135 -121 254 -138 -5 225 74 204 551 110 119 262 12 -104 271 65 84
1518 84 -440 266 -21 -273 -213 -360 -80 -173 177 -3 -119 168 171 77 164 223 -92 153 89 202 -95 284 160
1541 160 -173 -213 401 44 -289 211 -72 -217 -218 243 262 -114 155 -37 -266 59 485 -120 -234 32 234
1562 234 -66 77 195 -461 -521 -52 -25 -10 143 306 -72 -222 266 407 96 272 163 -108 96 58 180
1583 180 -121 11 35 -361 332 -74 -529 -166 53 67 -147 5 226 15 -197 159 480 -143 6 360 -91
1604 -91 100 147 279 -31 -226 -34 -135 -302 110 -47 -264 59 89 -266 -21 138 98 -355 293 173 88 155
1626 155 57 -244 -138 258 98 -304 73 -298 -312 -138 206 -150 -115 189 225 -41 117 -153 -161 -196 140 333
$$ packed form
1474d70J73M15k91m1J86j31J34R1k28j67K73J61Q4k85K03K21k81j70K51k77R4
1495e5k9J16L2j61m5J05r8J4L75l92J33K30j51J30L47m41RJ43k50j16L75k06J9
1518H4n24P06k87k52O0j47K80r3L50j80j16K87Lr4Q7N9l15K45o4J13k97L79j24
1541A60l33m0O14l57l33N00k83j45jM61J9l76K69j92k29L25M26o05j14K66K02
1562B34l00J43J18o56o0M69K7J5J53J63l78j50M88J41l11J76j09k71K04l8J22
1583A80l01J32K4l96O93m06m55L63K19J4k14J52K21k11k12L56L21o23J49L54m51
1604i1J91M7J32l10j95J92j01j67M12j57k17L23L0l55K45J59m0m53O48j20q5O7
1626A55r8l01J06L96j60m02L77l71j4J74L44l56L5L04L6k66J58k70ql5L36J93
$$ plain form
1648 333 -245 108 -86 -28 58 289 49 -238 -123 37 -80 -165 330 -277 -462 -47 -317 314 -129 62 -232
1669 -232 -173 69 280 -38 63 95 -186 -289 352 -216 86 114 -181 -355 -259 360 113 -330 51 -72 31
1690 31 131 123 136 -154 379 -17 -355 -34 -109 -380 -141 26 38 -90 -109 29 -302 -230 249 47 54 129 159 109
1714 109 272 182 -231 -70 -281 439 168 -124 307 -83 56 -174 -306 9 30 -16 39 31 168 -94 25 -125
1736 -125 87 126 -14 155 80 -1 -62 -123 218 -70 -118 -156 -47 78 79 -161 125 75 -39 107 89 171 38 191
1760 191 55 68 -102 204 26 -314 -174 17 15 118 112 13 -237 -259 98 42 -3 -49 -153 56 112 -74 124 78
1784 78 -17 86 8 -265 -53 -307 -186 30 -33 -188 -203 185 81 78 169 -28 237 94 140 3 351 35 210
1807 210 -97 -338 -38 -3 144 -335 26 -121 201 -45 179 -150 108 255 24 -71 130 101 23 249 46
$$ packed form
1648C33n78L53j94N8Q6K31k40k87J15J60j17q5M95o07j85M15k70O31m43J91k94
1669b32N9K42K11l18J01L2k81j03O41n68L02K8k95j74R6O19k47m43L81j23J03
1690C1J00qJ3k90N33l96l38L21p5k71K39J67J2j28j9J38l31P2M79k02PP5L0n0
1714A09J63r0m13J61k11P20k71k92M31l90J39k30j32L15K1m6N5qJ37k62J19j50
1736a25K12L9j40J69p5q1o1o1L41k88m8l8J09J25Jk40K86n0j14J46j8Q2j33J53
1760A91j36J3j70L06j78l40J40J91kJ03or9k50k2L57n6m5m6j04K09N6j86J98m6
1784G8r5J03p8k73K12k54J21K16o3j55j5L88j04lR1j97K65j43M6j37L48l16J75
1807B10l07k41L00L5J47m79L61j47L22k46K24l29K58J47k31r5K01k9p8K26k03
$$ plain form
1828 46 -142 63 252 -82 -123 -272 -57 49 36 145 92 76 -79 120 0 150 188 217 -101 -164 122 78 97
1851 97 140 61 -4 -92 118 5 -147 133 -251 -2 -143 9 -167 47 -28 28 22 130 -162 62 171 145 119 -31
1875 -31 98 -26 46 -411 -125 -95 -76 -321 -281 -138 -54 -14 276 38 -126 -168 120 193 114 -56 -131 -92 -62 -39 -340
1900 -340 123 -145 -39 -320 -187 1 45 -177 -116 -61 167 278 121 97 123 183 -82 11 -109 207 -92 87
1922 87 -189 -34 -107 -182 59 43 262 -252 -128 23 198 71 -80 199 -54 -46 260 218 -59 92 -114 -188 -174
1945 -174 -71 49 -462 22 -38 -67 -157 81 -25 176 324 166 46 73 249 251 142 67 -61 -88 300 -101 -104
1968 -104 -175 -125 169 164 113 79 -232 -126 214 -9 -38 223 127 -212 242 253 -3 58 204 -128 -23 -36 49 -341
1992 -341 85 -85 -168 55 -152 -93 9 -21 -306 -41 54 109 -77 -149 56 -185 -254 136 52 -11 -69 98 -117
$$ packed form
1828D6j88K05J89l34m1j49K15J06j3J09n3j6j55J99j20J50L8K9l18o3K86m4J9
1851I7M3p9o5q8K10j13j52K80l84K49j41J52j76K14p5N6oJ08k92K24J09k6k6j50
1875c1J29j24P2m57K86L0J9k45M0J43Q4M0K90k38j64m2K88P3p9j70p5L9L0K3l01
1900c40M63k68J06k81J33J88M4k22O1N5K28J11j57k4K6O0k65R3j20L16k99J79
1922H7k76J55p3p5K41j6K19n14J24J51J75j27j51K79k53QL06m2k77J51k06p4J4
1945a74J03J20n11M84o0k9r0K38j06K01J48j58j20K7J76Kj09p5j28k7L88m01l
1968a04p1N0K94nn1l4l11J06L40k23k9K61r6l39M54J1k56O1J46l32J05j3Q5l90
1992c41M26j70q3K23k07N9J02l0k85K65R5N5j86p2K05k41o9L90q4o3n8J67k15
$$ plain form
2015 -117 -236 -359 -54 23 -53 223 -58 168 -59 124 -71 17 41 158 135 -74 -41 -146 24 119 -333 -138
2037 -138 -119 -62 6 -222 -260 50 -125 141 254 -7 -85 120 265 80 247 20 -151 -122 101 -88 -196 -114
2059 -114 -96 -294 3 80 -176 -30 4 -118 -124 105 143 20 -31 81 -61 289 131 110 -150 -4 -19 -315 -258
2082 -258 -30 110 -228 -6 70 116 10 176 -35 94 235 192 123 -105 -76 -115 79 287 104 -485 79 327
2104 327 -140 -250 -8 -57 90 96 203 86 -129 201 -262 -135 41 192 -266 40 -244 -281 -248 95 33 -261
2126 -261 86 154 -73 -19 107 -78 -99 -43 200 118 -36 17 217 -161 180 251 17 -49 -151 -198 -17 73 325
2149 325 -310 -4 114 -271 -191 134 23 -448 96 192 23 1 -55 252 -280 -83 -85 -129 -56 -77 -162 -209 264 -120
2173 -120 -290 64 137 -134 111 -85 180 -216 10 396 170 -208 140 -218 -77 -30 142 -145 -265 -247 100
$$ packed form
2015a17j19j23L05P7p6K76k81K26k27J83j95Q8K4J17k3k09L3j05J70R5m52J95
2037a38J9N7O8k28l8L10j75K66J13k61p8K05J45j85J67k27j71K9K23j89j08Q2
2059a14J8j98K97P7k56J46L4j22oK29L8j23n1J12j42L50j58k1k60J46j5k96N7
2082b58K28J40l38K22P6M6j06J66k11J29J41m3o9k28K9l9J94K08j83n89N64K48
2104C27m67j10K42m9J47OJ07j17k15L30m63J27J76J51m58L06k84l7L3L43o2k94
2126b61L47O8k27N4J26j85k1N6K43q2j54N3K00l78L41P1k34o6j02m7J81R0K52
2149C25o35L06J18l85Q0L25j11m71N44R6j69k2n6L07n32J97km4P3k1q5m7M73l84
2173a20j70L54P3k71K45j96K65l96K26L86k26l78L48l58J41M7J72k87j20J8L47
$$ plain form
2194 100 -20 0 83 -194 -103 -90 -197 57 148 6 -56 71 40 -89 -49 -44 -148 -204 -79 -17 58 -10 -94 -215 -160
2219 -160 89 273 -8 -259 2 45 -83 44 -139 233 262 222 326 -110 466 -30 -312 -141 34 -198 -7
2240 -7 0 72 154 -135 -8 -127 260 264 205 198 -168 89 35 43 -130 -138 -23 164 163 1 -257 -152 -345 -50 226 -25
2266 -25 79 60 201 126 313 251 -137 -118 95 -251 -224 -292 13 4 137 24 193 -199 227 147 -194 -323 7
2289 7 55 -193 -193 -148 231 341 148 250 -27 -186 27 -238 -76 -179 -232 52 -154 86 -14 -200 169 -63
2311 -63 -44 46 22 -1 -19 308 -42 219 47 48 88 103 197 -44 15 -326 -122 -134 51 -112 -67 -260 81 -61 -90
2336 -90 -90 168 -87 -213 -63 -78 -12 -256 288 -35 207 -138 -86 225 153 84 -194 -187 37 174 -53 -109 122 -202
2360 -202 -94 -80 -192 44 -98 41 -15 -229 -216 -138 -241 56 -149 188 -56 -193 35 123 139 86 63 246 -1
$$ packed form
2194A00j20K0Q3k77R1J3j07K54R1j42o2J27l1j29M0Nj04n6J25O2P5o8q4j21N5
2219a60K49J84k81k51K61M3j28J27j83L72K9m0J04m36N76m96k82J71J75k32J91
2240gPP2Q2k89J27j19L87Mn9pl66K57n4Qj73qJ15J87jj62k58J05j93K95K76k51
2266b5J04j9J41p5J87o2l88J9K13l46K7o8L05rJ33j13J69l92M26q0l41j29L30
2289GM8k48%M5L79J10j93J02k77j59K13k65J62j03n3K84k06K40j00j86L69k32
2311f3J9R0k4k3j8L27l50K61j72JM0J5R4k41N9l41K04j2J85j63M5j93L41j42k9
2336i0%K58k55j26J50j5O6k44N44l23K42l45N2L11p2o9k78PK24J37k27n6K31l24
2360b02J08J4j12K36j42J39n6k14J3P8j03K97k05L37k44j37K28Q8J6n3k3J83k47
$$ plain form
2383 -1 -30 14 -27 -100 -270 -381 108 -138 116 -140 -82 287 94 -92 -146 106 -117 15 42 51 91 -83 -33 168
2407 168 127 158 -7 -45 122 -118 -116 -47 -57 285 -236 -53 -27 -49 -70 -268 62 -38 9 65 -105 -164 286 104
2431 104 -186 -108 119 -394 255 179 218 54 -22 -189 -37 116 -104 -151 -96 -57 -227 -120 71 140 113 -110 24
2454 24 -114 -168 -286 76 -51 -144 -58 56 114 -288 -153 -103 313 59 244 10 37 10 48 164 -24 264 -46
2477 -46 -74 -135 -75 256 -142 -12 9 -84 -203 -164 194 -68 92 -55 0 136 247 -151 251 -345 -80 130 -32
2500 -32 26 95 141 -366 46 103 80 -182 -119 -104 216 25 -63 -41 78 -163 49 -180 -162 210 -69 -123 -39 2 -234
2525 -234 71 -48 -101 -193 -122 -48 -39 33 -136 135 288 -100 10 79 -162 -218 91 -6 -35 256 -99 -300 -138 8
2549 8 187 267 -257 -124 111 88 -52 213 -244 -51 138 -213 -234 -201 195 -42 46 -70 197 39 11 94 1
$$ packed form
2383ak9M4m1p3j70j11M89k46K54k56N8L69j93j86n4K52k23J32K7RM0j74N0K01
2407A68m1L1j65l8J67k40KO9j0L42n21J83K6k2k1j98L30j00M7N6j70n9M50j82
2431A04k90P8K27n13O49p6L9j64p6j67J52J53k20m7N5L9j70J07J91O9k7k23J34
2454B4j38n4j18L62j27r3Q6J14N8m02J35N0M16k54J85k34K7k7L8J16j88K88l10
2477d6k8o1O0L31l98J30K1r3j19L9L58k62J60j47N5J36J11l98M02n96K65K10j62
2500c2N8O9M6n07M12N7k3k62O3J5L20j91q8K2J19k41K12k29J8L72k79n4Q4M1k36
2525b34L05j19n3r2P1P4RP2j69K71J53l88J10O9k41n6L09r7k9K91l55k01J62J46
2549HJ79Q0n24J33K35k3j40K65m57J93J89l51k1L3L96k37Q8j16K67j58k8Q3r3
$$ plain form
2572 1 -64 -89 -317 -36 -25 205 126 -131 161 -159 -57 -280 53 243 -60 -136 -35 147 76 -44 22 188 56
2595 56 -124 -8 34 1 -20 -6 120 -56 -228 334 123 109 0 -83 -23 -35 -198 108 30 137 220 -193 56 -244
2619 -244 -189 -54 223 51 187 71 317 -386 -83 61 43 -64 -91 77 -148 -182 198 -308 106 176 102 -48
2641 -48 37 214 -194 -243 -148 -51 -212 97 -171 84 -4 29 -2 -148 58 -5 -128 -38 -82 48 27 -186 -176 -192 -72
2666 -72 40 -52 0 55 4 272 175 49 38 167 236 241 58 -155 -72 -57 50 31 83 79 -177 64 235 9 172
2691 172 -55 -193 71 262 -126 -188 -81 -2 173 139 63 273 -174 -352 -119 -158 -44 60 44 -106 -57 61
2713 61 130 -70 50 97 58 233 -33 226 -112 -153 -169 209 466 -238 163 212 87 -22 6 -67 -118 -314 -90
2736 -90 20 107 32 -43 -33 -28 160 82 -81 17 32 -79 140 170 -121 -23 -75 128 -371 -7 -147 -103 134 -203 179
$$ packed form
2572Ao5k5k28K81J1K30p9k57K92l20J02k23L33J90l03p6J01J82p1j20O6J66j32
2595E6j80J16M2l3k1J4J26j76j72N62k11j4j09q3O0j2j63L06p8J07Q3m13K49l00
2619b44N5J35K77j72J36j16K46p03L03J44j8j07k7J68k25l4L80n06M14P0p4j50
2641d8Q5J77m08m9R5R7j61L09k68K55q8L3l1j46K06o3j23R0m4J30k1k13J0j6J20
2666g2J12r2N2N5n1K68r7j26j1J29O9Nj83k13Q3J5J07j9N2mk56K41J71k26J63
2691A72k27j38K64J91l88o2J07P9J75l4p6K10m47j78K33l9J14J04j6j50M9J18
2713F1O9k00J20M7l9J75k66K59l38m1j6L78K57p04M01M9j25j09K8p3n1j96K24
2736i0J10Q7p5p5J0NJ88p8j63R8J5j11K19L0k91R8n2K03m99L64j40M4K37l37L82
$$ plain form
2761 179 46 353 -4 -114 21 -56 -180 -36 193 -65 -124 -75 53 198 131 -283 -238 112 -158 106 -254 22
2783 22 167 -118 133 -6 -133 201 15 156 39 -73 22 35 -123 -130 -85 -162 0 -42 135 121 197 198 -320 251
2807 251 221 -108 -159 -20 -24 92 -310 -95 57 -135 0 -151 -84 22 -63 116 108 -225 61 -16 93 -67 13
2830 13 34 165 -43 -17 243 138 75 91 38 -274 -155 -177 22 -289 42 140 -5 -67 -206 73 193 -107 123
2853 123 -225 36 22 -5 53 -220 164 6 123 99 -3 -106 -204 151 16 -129 -110 88 -4 -58 -137 23 367
2876 367 30 178 71 190 27 -29 -89 -223 -174 -129 86 -288 -152 -27 118 152 94 -41 -325 -3 32 256
2898 256 -185 -153 -104 9 148 -176 -46 75 -129 -106 -71 -10 87 -227 135 -41 164 203 240 34 132 39 -64
2921 -64 219 17 178 -113 144 -267 -198 1 58 -111 -191 -136 -377 1 19 -43 111 64 54 15 118 -249 -72
$$ packed form
2761A79j33L07l57j10J35p7j24J44K29k58n9M9J28J45o7m14M5L50k70K64l60K76
2783B2J45k85K51j39j27L34j86J41j17j12R5J3j58pM5p7J62m2J77j4P6Jn18N71
2807B51l0l29n1J39mJ16m02K15J52j92J35j51O7J06q5J79ql33K86p7J09j60Q0
2830A3K1J31k08K6K60j05o3J6n3l12J19k2J99l11L31R8j45o2j39K79J20l00K30
2853A23l48K61j4k7N8k73L84j58J17k4j02j03r8L55j35j45J9J98r2n4p9J60L44
2876C67l37J48j07J19j63n6o0j34M9M5K15l74J36J25J45L4n8j35k84L22L5K24
2898B56m41L2M9J13J39l24J30J21k04K3L5O1R7l14L62j76K05L9L7k06R8r3j03
2921f4K83k02J61k91K57m11O9J99N7j69q0N5k41L78J8o2J54m7j0l9J03l67J77
$$ plain form
2944 -72 55 -131 60 -111 -82 -337 116 -72 -255 -31 -295 127 -87 82 -10 85 68 -39 259 -97 152 67
2966 67 -72 54 -103 -17 -18 15 -237 78 -26 -145 -99 164 392 64 -255 -84 -153 -38 -48 416 197 46 -8
2989 -8 -1 -3 63 7 -25 168 8 -24 -45 -126 173 106 -72 110 -1 -17 -219 -26 101 281 119 116 321 -105 74
3014 74 -38 -196 256 169 -30 83 -125 97 64 -220 6 13 -127 -12 -14 49 66 -3 49 79 -121 0 -232 -293
3038 -293 80 -91 -18 39 -240 -334 19 103 87 44 246 152 145 59 184 -69 234 -48 78 -56 65 0 159 185
3062 185 -155 -90 131 -28 -116 36 -67 -17 62 -195 -8 -69 75 52 65 116 -92 75 -429 63 -53 -261 100
3085 100 364 -117 103 145 -80 210 55 -129 -250 64 443 -132 -77 100 -65 172 99 119 -126 -155 155 -40
3107 -40 -10 -77 25 119 81 -149 39 291 -141 230 50 -12 -34 113 -58 210 144 101 -202 -35 135 -102 -30
$$ packed form
2944g2J27j86J91j71K9k55M53j88j83K24k64M22k14J69r2R5j7j07K98l56K49q5
2966F7j39J26j57Q6jL3k52L15j04j19M6K63K28l28l19J71o9J15j0M64k19j51n4
2989hPkO6n6l2J93j60l2k1q1K99o7j78J82j11j6k02J93J27J80j62lK05m26J79
3014G4j12j58M52q7j99J13k08K22l3k84K26Pj40J15kO3J7o9N2L0k00J21k32o1
3038b93L73j71P3N7k79r4L53Q4j6m3K02r4pq6J25k53L03k82J26j34J21o5J59K6
3062A85l40O5K21j59q8J52j03N0P9k57J87o1J44k3J3N1k08J67n04M92j16k08L61
3085A00K64m81K20M2k25K90j55j84j21L14L79n75N5J77j65K37p3K0k45k9L10j95
3107d0L0o7J02R4l8k30J88K52m32L71j80o2k2J47j71K68o6m3l03J67J70k37P2
$$ plain form
3130 -30 -379 1 30 192 -83 -28 -380 208 117 341 204 249 19 84 -114 -285 251 150 65 -86 174 128 138
3153 138 -51 132 -123 80 92 -94 -245 136 -103 17 170 183 80 -1 112 -80 130 -28 -179 -166 -40
3174 -40 30 -19 324 62 100 -125 -219 -100 -30 131 -72 99 -108 -55 32 236 -247 -104 102 -27 -12 288 -118
3197 -118 -188 -56 174 -94 107 90 -91 -94 11 232 -247 100 198 91 21 74 74 -34 -74 -16 297 44 252 56
3221 56 -119 214 -10 -143 -156 105 -120 -5 -110 256 33 251 24 75 -61 -2 -59 60 -72 -124 -82 24
3243 24 -265 29 -373 -181 50 -202 145 -58 18 -81 50 -5 -68 58 -103 -232 -179 -251 -66 71 -125 -48 52
3266 52 -30 -99 158 148 -106 25 -97 -31 -99 128 130 -178 207 -291 40 134 23 -9 -77 -106 185 12 -36 41 154
3291 154 -201 94 -48 96 308 -187 137 24 90 31 -140 -195 180 -165 -125 21 -81 -113 90 150 -118 113
$$ packed form
3130c0l49L80K9J62k75N5l52N88r1K24j37M5k30O5j98j71N36j01q5j51K60m6J0
3153A38j89J83k55K03J2j86j51L81k39J20J53J3j03q1J13j92K10j58j51J3J26
3174d0P0m9L43k62L8k25r4J19P0J61k03J71k07N3Q7K04m83J43K06j29J5L00m06
3197a18p0J32K30k68K01j7j81lJ05K21m79L47R8j07p0N3%j08m0N8L13k53K08j96
3221E6j75L33k24j33j3K61k25J15j05L66k23K18k27N1j36N9n7J19j32n2M2J06
3243B4k89K94m02J92K31k52L47k03P6r9J31n5o3J26j61j29N3p2J85J37j96P7J00
3266E2q2o9K57j0k54J31j22O6o8K27Kl08L85m98L31R4j11l2o8k9K91j73m8P7J13
3291A54l55K95j42J44K12m95L24j13O6n9j71n5L75l45M0J46j02l2K03O0k68K31
$$ plain form
3313 113 -133 -170 98 23 7 -157 -99 168 234 150 -211 19 121 -183 159 164 160 -175 44 -12 -104 116 -183 84
3337 84 81 -59 77 160 -82 -62 -14 -99 -5 151 41 34 118 -7 347 -103 248 364 -130 90 -24 353 53 -67
3361 -67 -23 322 -62 -37 -95 -201 218 -270 36 -79 53 -16 102 25 -41 -197 1 87 -50 10 -20 31 60 38
3385 38 51 -76 32 -190 284 190 164 118 -36 -61 -68 24 125 88 -70 23 30 -65 -27 13 -65 -88 145 -34 187 -23
3411 -23 -134 152 23 -39 -15 -41 41 -186 -203 128 138 -9 -15 -135 -8 61 -140 176 -81 293 -225 42 145
3434 145 62 173 -74 64 -119 96 107 -251 -101 -127 -57 -100 10 -82 41 -167 -56 8 -9 218 -203 -81 -130
3457 -130 84 -54 167 -16 47 80 208 -29 293 -192 -110 -48 32 47 7 -121 -251 80 116 -165 -12 191 36
3480 36 224 136 22 -125 -26 345 83 101 112 10 -157 -52 -249 327 301 -16 -157 143 33 43 120 -11 -48
$$ packed form
3313A13k46l7K68p5j6j64N8K67O6q4l61K30J02l04L42Nml35K19n6r2K20k99K67
3337H4lj40J36Q3k42K0M8q5R4J56j10pQ4j25L54m50L51J16m94K20j14L77l00j20
3361f7M4L45l84K5n8j06M19m88L06j15J32o9J18p7o6j56J98Q6j37O0l0N1K9k2
3385C8J3j27J08k22M74r4k6m6j54k5pR2J01l7j58R3Pr5L8M0p8k3K33j79K21k10
3411b3j11K86j29o2K4k6Q2k27j7L31J0j47oj20J27O9k01L16k57L74n18K67J03
3434A45q3J11k47J38j83K15J1l58J50k6P0m3J10r2J23k08J11O4j7K27m21J22m9
3457a30K14j38K21j83O3L3J28k37L22m85Q2O2Q0J5m0j28j30L31L6k81J53K03j55
3480C6J88q8j14j47R9L71k62J8J1j02j67J05j97N76k6l17j41L00j10J0P7j31l7
$$ plain form
3503 -48 -194 86 12 79 -56 202 -195 -138 -120 40 -113 193 49 34 22 82 13 186 153 99 -160 46 105 243
3527 243 -67 -84 -88 -237 66 138 -82 24 -33 -108 33 130 79 39 166 139 94 206 315 148 129 74 -52 -115 149
3552 149 -317 -208 14 46 207 227 -108 51 65 -277 -55 -284 -186 253 -38 143 20 178 -156 112 206 24
3574 24 -103 280 170 -157 -183 -38 75 -116 133 32 367 138 -6 243 37 148 -6 201 -21 1 115
3595 115 -243 163 155 14 -136 210 236 312 -69 -134 -57 -89 -144 68 61 -298 -131 265 -21 -18 -170 -79 -70 192 107
3620 107 -95 152 -126 -110 197 -76 82 118 -64 72 103 240 106 29 90 -159 182 137 11 -98 35 51
3642 51 -50 141 39 -103 165 9 -150 103 -20 23 -121 69 124 195 -209 165 64 -8 38 71 42 -203 -11
3665 -11 58 -38 204 -76 61 281 80 143 84 78 179 109 -73 -201 -323 -162 -100 52 -80 111 -8 -189 81
$$ packed form
3503d8j46K80p4O7j35K58l97N7J8J60j53L06j44j5j2O0o9J73l3n4k59K06N9J38
3527B43l10j7mj49L03P2k20J06n7p5J41R7n1m0J27k7m5J12J09j67j9n5j26o3K64
3552A49m66J09K22L2J61K0l35J59J4l42K22k29R8M39k91J81j23J58l34K68R4j82
3574B4j27L83j10l27k6J45J13j91K49j01L35k29j44K49k06J11j54K07k22K2J14
3595A15l58M06qj41j50L46K6P6l81o5P7l2n5K12pl59J67L96k86Lj52R1RK62q5
3620A07k02K47k78J6L07k73J58L6j82J36L1J37j34p7O1k49L41m5j26j09J33J6
3642E1j01J91j02j42K68j56j59K53j23M3j44J90N5P1m04L74j01p2M6L3k9k45J92
3665a1O9r6K42k80J37K20k01O3n9oJ01p0j82j28j22J61O2J52j32J91j19j81K70
$$ plain form
3688 81 -169 42 212 -50 19 183 -25 239 278 -105 -223 -63 57 160 -134 61 -81 159 46 -53 -249
3709 -249 29 -278 240 -127 -134 -164 -25 22 141 -31 59 163 -21 106 129 -113 85 -207 -161 31 -302 164
3731 164 125 20 -88 42 172 19 -31 -51 -187 -82 -87 -270 -118 223 -5 -249 146 50 81 -54 -147 -43 -66
3754 -66 -145 141 -135 172 -70 -67 -84 65 -35 96 176 -191 184 59 313 181 57 123 -103 -174 -6 110 -123
3777 -123 -54 -104 -221 -141 22 78 28 203 64 90 80 -11 -389 -59 154 -56 -68 189 -32 158 -45 -79 -247
3800 -247 6 -86 -246 40 -150 -222 -65 77 -169 0 -137 -105 -7 126 -88 304 35 166 -107 73 64 48
3822 48 -102 41 158 -149 -92 174 -2 202 96 158 -68 -124 -12 -17 -106 -39 354 175 10 101 40 -88 10 21
3846 21 -65 102 -200 141 283 -80 83 -288 238 -4 42 211 -7 2 -66 -178 67 -83 298 58 -167 -137
$$ packed form
3688H1k50K11J70k62O9J64k08K64L9l83j18J60J20J03k94J95j42K40j13r9j96
3709b49K78l07N18l67pl0J39M7J19j72R0J04j84J27K3k42J98k92M6J92l33M66
3731A64l9j05j08J30J30j53n0k0j36J05nj83J52L41k28k44L95r6L1j35r3J04k3
3754f6p9K86k76L07k42Lj7J49j00J31Q0l67L75j25K54j32j24O6k26p1J68J16k33
3777a23O9n0j17Q0J63N6n0J75j39K6j0r1l78L30K13k10j2K57k21J90k03l4j68
3800b47K53r2j60K86j90p2J57J42k46J69j37L2R8J33k14L92k69J31k73J80rj6
3822D8j50J43J17l07N7K66j76K04j06O2k26n6J12nq9O7L93j79j65R1o1j28R8J1
3846B1q6J67l02L41J42l63J63l71N26k42M6J69k18Ro8j12K45j50L81k40k25L0
$$ plain form
3868 -137 100 -130 152 -4 84 13 290 194 -65 139 -39 -76 -83 -160 218 73 -142 -21 -131 -28 -245 -9
3890 -9 -342 -33 -89 0 83 104 59 193 50 -221 159 155 39 -100 106 -100 -91 -54 96 -146 133 -15 -71 -335
3914 -335 240 -26 3 -125 18 217 110 75 244 66 -122 -13 -90 39 -33 196 182 -65 27 -36 25 -66 -64 309
3938 309 45 -5 136 14 -96 -34 -80 -46 19 153 -123 281 1 -115 -30 74 -101 199 -116 59 -114 -26
3960 -26 81 -95 111 -147 116 -204 -116 15 -55 70 220 -18 -138 193 -1 14 230 164 112 205 -53 -102 -45
3983 -45 28 118 226 -22 105 16 -223 -155 -87 14 55 -153 67 171 266 59 -83 187 -97 -113 -106 -176 -3 -142
4007 -142 28 -54 -283 15 126 -365 21 72 -102 345 -43 -45 50 144 -10 125 112 268 73 171 16 47 -168
4030 -168 106 59 -29 68 277 237 443 244 -144 -165 201 -26 -186 435 -67 -94 -76 -249 -110 29 31 115 245
$$ packed form
3868a37K37k30K82j56Q8p1K77r6k59K04j78l7pp7L78j45k15J21j10J03k17K36
3890il33L09n6Q9Q3K1m5J34j43k71L80mj16j39K06k06RL7J50k42K79j48n6k64
3914c35N75k66K9j28J43J99j07l5J69j78j88J09p7J29p2K29j4k47R2o3O1r1KL73
3938C09k64n0J41j22j10O2m6L4O5J34k76M04k80j16Q5J04j75L00l15J75j73Q8
3960b6J07j76K06k58K63l20Q8J31p0J25J50k38j20L31j94J5K16o6n2R3k58m9N7
3983d5P3R0J08k48J27q9k39O8O8J01M1k08K20J04R5k07j42K70k84j6Pp0J73j39
4007a42J70q2k29K98J11m91L86N1j74M47l88kR5R4j54J35j3J56j95R8j55L1k15
4030a68K74m7q8R7K09m0K06j99l88k1L66k27j60O21n02k7J8j73J39J39KQ4J30
$$ plain form
4053 245 61 -20 -7 21 272 75 164 132 -90 13 28 14 320 -270 -77 -29 194 -144 -80 9 -19 -74 -165 181
4077 181 -128 162 -265 -35 -48 -37 -165 91 -90 23 -222 -38 -60 264 236 -46 55 -144 -231 148 -49 220
4099 220 -162 64 11 105 115 45 151 103 128 414 -103 -204 58 -309 156 50 182 -194 186 -9 110 67
4121 67 -415 291 92 -3 -315 2 151 -134 -60 -124 -178 162 119 -142 129 20 79 -90 -56 -105 -15 63 -18 29
4145 29 -219 -144 -157 167 -145 44 73 -22 -56 195 -192 -401 -28 15 -343 -136 -1 145 -20 -167 112 -24
4167 -24 130 139 -58 2 215 -24 -175 -25 -180 -46 -184 41 3 -122 -60 -179 3 -74 -390 -117 178 -264
4189 -264 13 108 -52 -71 -181 24 -194 -12 177 -310 137 88 -125 -353 30 18 100 -300 -72 -12 -154 -70
4211 -70 121 -25 -216 -126 -71 146 207 153 -127 90 26 111 -134 -32 69 -90 -169 249 -246 -76 127 35 52
$$ packed form
4053B45j84q1J3K8K51j97Q9l2k22J03J5j4L06n90J93M8K23l38O4Q9k8n5r1L46
4077A81l09K90m27K30j3J1j28K56j81J13k45J84k2L24k8k82J01j99q7L79j97K69
4099B20l82K26n3R4J0p0J06m8K5K86n17j01K62l67M65j06J32l76L80j95J19m3
4121F7m82P06j99r5l12L17J49k85P4o4n4L40m3k61K71j09N9j69L4m9R0P8q1M7
4145B9k48P5j3L24l12J89K9r5l4K51l87k09L73M3l58K07J35J46j65j47K79j36
4167b4J54Rj97O0K13k39j51J50j55J34j38K25l8j25O2j19J82p7l16K73K95m42
4189b64K77R5j60j9j10K05k18J82J89m87M47m9k13k28L83j2Q2m00K28O0j42Q4
4211g0J91j46j91R0N5K17O1n4k80K17o4Q5k45J02J01j59p9M18m95J70K03r2J7
$$ plain form
4234 52 5 -77 78 169 70 -65 232 -3 -82 46 77 4 -81 -226 -129 101 214 99 87 72 -11 155 200 104 55
4259 55 216 161 -246 -171 -211 -45 -256 -38 371 70 13 100 110 -116 13 -65 -288 -26 -6 136 -243 -103 136
4282 136 140 -25 33 167 44 66 -197 -93 -282 93 -83 43 95 116 -145 -153 -76 -110 -69 125 99 47 93 79 -190
4307 -190 -32 -43 -152 306 -137 -102 -1 40 217 -100 -86 -69 -70 104 172 -23 -18 -105 -150 55 -76 203 43 -48
4331 -48 -75 86 -181 -67 17 244 84 223 -22 -57 -59 -52 -234 103 60 160 38 71 92 29 85 62 -1 -51 124
4356 124 143 -94 -38 121 219 116 3 99 -31 11 -64 -142 -157 -74 -31 22 69 205 75 248 -111 47 15 164
4380 164 -65 240 170 -228 44 -124 -1 359 -464 -33 257 -402 112 174 176 34 -12 -253 -17 78 75 20 -165
$$ packed form
4234E2m7q2J55R1r9j35K97k35p9J28L1p3q5j45R7K30J13j15j2j5q3J66M5r6m9
4259E5J61n5m07P5m0J66k11K18M09l01n7Q7J0k26J29p8k23K62K0J42l79J40K39
4282A36Mj65N8J34j23K2k63J04j89L75j76J26N2K1k61qP7l4M1J94k6n2M6j4k69
4307a90J58j1j09M58m43L5J01M1J77l17J4J7jJ74O8j95Nq7m5K05j31K79j60r1
4331d8k7J61k67J14Q4K27j60J39k45l5kPj82L37m3J00j22L3K1o3N6k3o3n0J75
4356A24J9k37N6J59R8j03j13R6j30M2p5p8j5Q3M3N3M7J36j30J73l59J58l2J49
4380A64k29L05p0l98K72j68J23L60q23M31K90o59N14O2Kj42m6k41K36R5ln5j85
$$ [...]
8191b0
##END NTUPLES=NMR FID
##END=
