##TITLE=1H_Pr 5316
 200.13MHz, CDCl3,
 8 sc
 
 4.9.2025
##JCAMPDX= 6.0         $$ Bruker NMR JCAMP-DX V2.0
##DATA TYPE= NMR FID
##DATA CLASS= NTUPLES
##ORIGIN= UXNMR, Bruker Analytische Messtechnik GmbH
##OWNER= pz
$$ XWIN-NMR		Version 3.5
$$ Thu Sep  4 14:17:31 2025 Russian Standard Time (UT+4h)  she@DPX200
##.OBSERVE FREQUENCY= 200.1313
##.OBSERVE NUCLEUS= ^1H
##.DELAY= (6, 6)
##.ACQUISITION MODE= SIMULTANEOUS
##.ACQUISITION SCHEME= undefined
##.AVERAGES= 8
##.DIGITISER RES= 18
##SPECTROMETER/DATA SYSTEM= spect
##.PULSE SEQUENCE= zg30
##.SOLVENT NAME= CDCl3
##.SHIFT REFERENCE= (INTERNAL, CDCl3, 0, 14.3821)
##AUDIT TRAIL= $$ (NUMBER, WHEN, WHO, WHERE, WHAT)
$$ ##TITLE= Audit trail, XWIN-NMR		Version 3.5
$$ ##JCAMPDX= 5.01
$$ ##ORIGIN= Bruker BioSpin GmbH
$$ ##OWNER= she
$$ F:/spectra/data/she/nmr/H-C/1/audita.txt
$$ ##AUDIT TRAIL=  $$ (NUMBER, WHEN, WHO, WHERE, WHAT)
(   1,<2025-09-04 14:16:16.25 +0400>,<she>,<DPX200>,
      <created by zg, POWCHK disabled, PULCHK disabled
       configuration hash MD5:
       00 E9 B6 7A A2 85 ED C7 34 08 36 98 17 FE 4E 26
       data hash MD5: 16K
       A1 08 5F 07 6D 03 B5 9A B9 71 0D BD A3 86 E1 60>)
$$ ##END=
$$ 
$$ hash MD5
$$ BD 1B 98 DE F1 78 44 90 CC 32 16 52 8D ED 69 F1
##$RELAX= 
##$RELAX= 
##$RELAX= 
##$RELAX= 
##$RELAX= 
##$RELAX= 
$$ Bruker specific parameters
$$ --------------------------
##$DU= <F:/spectra>
##$EXPNO= 1
##$NAME= <H-C>
##$PROCNO= 1
##$TYPE= <nmr>
##$USER= <she>
##$AMP= (0..31)
100 100 100 100 100 100 100 100 100 100 100 100 100 100 100 100 100 100 
100 100 100 100 100 100 100 100 100 100 100 100 100 100 
##$AQSEQ= 0
##$AQ_mod= 1
##$AUNM= <au_zg>
##$AUTOPOS= <>
##$BF1= 200.13
##$BF2= 200.13
##$BF3= 200.13
##$BF4= 200.13
##$BF5= 200.13
##$BF6= 200.13
##$BF7= 200.13
##$BF8= 200.13
##$BYTORDA= 1
##$CFDGTYP= 0
##$CFRGTYP= 5
##$CHEMSTR= <none>
##$CNST= (0..31)
1 1 145 1 1 1 1 1 1 1 1 1 1 1 1 1 1 1 1 1 1 1 1 1 1 1 1 1 1 1 1 1 
##$CPDPRG= <>
##$CPDPRG1= <>
##$CPDPRG2= <>
##$CPDPRG3= <>
##$CPDPRG4= <mlev>
##$CPDPRG5= <mlev>
##$CPDPRG6= <mlev>
##$CPDPRG7= <mlev>
##$CPDPRG8= <mlev>
##$CPDPRGB= <>
##$CPDPRGT= <>
##$D= (0..31)
0 0.7 0 0 0 0 0 0 0 0 0 0.03 0 0 0 0 0 0 0 0 0 0 0 0 0 0 0 0 0 0 0 0 
##$DATE= 1756980975
##$DBL= (0..7)
120 120 120 120 120 120 120 120 
##$DBP= (0..7)
150 150 150 150 150 150 150 150 
##$DBP07= 0
##$DBPNAM0= <>
##$DBPNAM1= <>
##$DBPNAM2= <>
##$DBPNAM3= <>
##$DBPNAM4= <>
##$DBPNAM5= <>
##$DBPNAM6= <>
##$DBPNAM7= <>
##$DBPOAL= (0..7)
0.5 0.5 0.5 0.5 0.5 0.5 0.5 0.5 
##$DBPOFFS= (0..7)
0 0 0 0 0 0 0 0 
##$DE= 6
##$DECBNUC= <off>
##$DECIM= 32
##$DECNUC= <off>
##$DECSTAT= 4
##$DIGMOD= 1
##$DIGTYP= 9
##$DL= (0..7)
0 120 120 120 120 120 120 120 
##$DP= (0..7)
150 150 150 150 150 150 150 150 
##$DP07= 0
##$DPNAME0= <>
##$DPNAME1= <>
##$DPNAME2= <>
##$DPNAME3= <>
##$DPNAME4= <>
##$DPNAME5= <>
##$DPNAME6= <>
##$DPNAME7= <>
##$DPOAL= (0..7)
0.5 0.5 0.5 0.5 0.5 0.5 0.5 0.5 
##$DPOFFS= (0..7)
0 0 0 0 0 0 0 0 
##$DQDMODE= 0
##$DR= 18
##$DS= 0
##$DSLIST= <SSSSSSSSSSSSSSS>
$$ [...]
##$SUBNAM0= <"">
##$SUBNAM1= <"">
##$SUBNAM2= <"">
##$SUBNAM3= <"">
##$SUBNAM4= <"">
##$SUBNAM5= <"">
##$SUBNAM6= <"">
##$SUBNAM7= <"">
##$SUBNAM8= <"">
##$SUBNAM9= <"">
##$SW= 18.0517328524113
##$SWIBOX= (0..15)
0 0 2 0 0 0 0 0 0 0 0 0 0 0 0 0 
##$SW_h= 3612.71676300578
##$TD= 16384
##$TD0= 1
##$TE= 0
##$TE2= 300
##$TE3= 300
##$TEG= 300
##$TL= (0..7)
0 120 120 120 120 120 120 120 
##$TP= (0..7)
150 150 150 150 150 150 150 150 
##$TP07= 0
##$TPNAME0= <>
##$TPNAME1= <>
##$TPNAME2= <>
##$TPNAME3= <>
##$TPNAME4= <>
##$TPNAME5= <>
##$TPNAME6= <>
##$TPNAME7= <>
##$TPOAL= (0..7)
0.5 0.5 0.5 0.5 0.5 0.5 0.5 0.5 
##$TPOFFS= (0..7)
0 0 0 0 0 0 0 0 
##$TUNHIN= 0
##$TUNHOUT= 0
##$TUNXOUT= 0
##$USERA1= <user>
##$USERA2= <user>
##$USERA3= <user>
##$USERA4= <user>
##$USERA5= <user>
##$V9= 5
##$VALIST= <valist>
##$VCLIST= <CCCCCCCCCCCCCCC>
##$VD= 0
##$VDLIST= <DDDDDDDDDDDDDDD>
##$VPLIST= <PPPPPPPPPPPPPPP>
##$VTLIST= <TTTTTTTTTTTTTTT>
##$WBST= 1024
##$WBSW= 4
##$XGAIN= (0..3)
0 0 0 0 
##$XL= 0
##$YL= 0
##$YMAX_a= 291137
##$YMIN_a= -338151
##$ZGOPTNS= <>
##$ZL1= 120
##$ZL2= 120
##$ZL3= 120
##$ZL4= 120
##$ABSF1= 10
##$ABSF2= 0
##$ABSG= 5
##$ABSL= 3
##$ALPHA= 0
##$AQORDER= 0
##$ASSFAC= 0
##$ASSFACI= 0
##$ASSFACX= 0
##$ASSWID= 0
##$AUNMP= <proc_1d>
##$AZFE= 0.1
##$AZFW= 0.1
##$BCFW= 1
##$BC_mod= 2
##$BYTORDP= 1
##$COROFFS= 0
##$CY= -3
##$DATMOD= 1
##$DC= 2
##$DFILT= <>
##$DTYPP= 0
##$F1P= 0
##$F2P= 0
##$FCOR= 0.5
##$FTSIZE= 0
##$FT_mod= 4
##$GAMMA= 1
##$GB= 0.15
##$INTBC= 1
##$INTSCL= 1
##$ISEN= 128
##$LB= 0.25
##$LEV0= 0
##$LPBIN= 0
##$MAXI= 10000
##$MC2= 0
##$MEAN= 0
##$ME_mod= 0
##$MI= 1.114404
##$NCOEF= 0
##$NC_proc= 0
##$NLEV= 6
##$NOISF1= 3.799351
##$NOISF2= 2.8
##$NSP= 1
##$NTH_PI= 0
##$NZP= 0
##$OFFSET= 14.38212
##$PC= 1
##$PHC0= -1569.474
##$PHC1= 21.99228
##$PH_mod= 1
##$PKNL= yes
##$PPARMOD= 0
##$PSCAL= 0
##$PSIGN= 0
##$REVERSE= no
##$SF= 200.129724274929
##$SI= 16384
##$SIGF1= 3
##$SIGF2= 2
##$SINO= 400
##$SIOLD= 16384
##$SREGLST= <1H.CDCl3>
##$SSB= 0
##$STSI= 0
##$STSR= 0
##$SW_p= 3205.1282051282
##$SYMM= 0
##$S_DEV= 0
##$TDeff= 0
##$TDoff= 0
##$TI= <>
##$TILT= no
##$TM1= 0
##$TM2= 0
##$TOPLEV= 0
##$USERP1= <user>
##$USERP2= <user>
##$USERP3= <user>
##$USERP4= <user>
##$USERP5= <user>
##$WDW= 1
##$XDIM= 8192
##$YMAX_p= 0
##$YMIN_p= 0
$$ End of Bruker specific parameters
$$ ---------------------------------
##NTUPLES= NMR FID
##VAR_NAME=  TIME,          FID/REAL,        FID/IMAG
##SYMBOL=    X,             R,               I
##VAR_TYPE=  INDEPENDENT,   DEPENDENT,       DEPENDENT
##VAR_FORM=  AFFN,          ASDF,            ASDF
##VAR_DIM=   8192,          8192,            8192
##UNITS=     SECONDS,       ARBITRARY UNITS, ARBITRARY UNITS
##FACTOR=    0.0002768,     1,               1
##FIRST=     0,             0,               0
##LAST=      2.2672688,     0,               0
##MIN=       0,             -338151,         0
##MAX=       2.2672688,     291137,          0
$$ Real data points
##PAGE= N=1
##DATA TABLE= (X++(R..R)), XYDATA
0@%%%%%%%%%%%%%%Qj6J6j6J6k4L2l2M0m8N6o8P6q8J03j18J34j52J73j96K21k49
$$ 0 0 0 0 0 0 0 0 0 0 0 0 0 0 0 8 -8 8 -8 8 -16 16 -16 24 -24 32 -36 40 -48 55 -63 71 -81 92 -104 117 -132
36a32K79l11L48l88M32m81N33n89O50p19P94q74R61j058J165j284J418j566J731
$$ -132 147 -164 184 -204 228 -253 280 -309 341 -378 416 -458 503 -555 610 -674 744 -822 909
55I09j917K130k376K663l006L420l929M579n439O631q396J1268j6715L0495j29982
$$ 909 -1008 1122 -1254 1409 -1597 1823 -2106 2473 -2966 3665 -4731 6537 -10178 20317 -109665
70a09665k28486L50514K20211j98042j42487J12865K881p3539P8695P1882j19132
$$ -109665 -338151 12363 232574 34532 -107955 4910 7791 -65748 12947 84829 -34303
81c4303m3718J26207J6016j39809N179J51027K7777j19506o3098L4228N6271M5333
$$ -34303 -78021 48186 64202 -75607 -70428 80599 108376 -11130 -74228 -40000 16271 61604
93F1604j479p7148o0499M1059P3087P027l0644k1820k0053j0632K9870M0936l358
$$ 61604 60125 -17023 -77522 -36463 36624 43651 13007 -8813 -28866 -39498 -9628 31308 27950
106B7950l8707k0711R700J9049J0736J789n06L658o650k7931j0782M9009N5425
$$ 27950 -10757 -31468 -21768 -2719 8017 9806 9300 12958 6308 -21623 -32405 16604 72029
119G2029l2833q7638j2344P3944L9505l2152k8458m787j7619o7N0082K3413n4710
$$ 72029 39196 -48442 -60786 13158 52663 20511 -7947 -12734 -30353 -30420 19662 43075 -11635
132a1635l8724M3759L0956m4191j4224O8262K3900q1489m4209P3604N9057m3389
$$ -11635 -50359 -6600 24356 -19835 -34059 34203 58103 -23386 -67595 6009 65066 21677
144B1677m2167K2815N605l0122J6811M4202k0777m7133J2617K2023k5238J723
$$ 21677 -20490 2325 7930 -22192 -5381 38821 18044 -29089 -16472 5551 -19687 -17964
156a7964N2759m165p2990j0859O6365K3594l1570q709L455j8528P165M0483r48
$$ -17964 34795 30630 -42360 -53219 13146 36740 5170 -3539 -84 -18612 -11447 29036 28088
169B8088l9660J589K6717j6428k5892K6566L3344k1649l9181k358K3825K0564
$$ 28088 -11572 -9983 16734 306 -25586 980 34324 12675 -26506 -28864 -5039 15525
181A5525L411j8457k0776L863J8831O155j277K219p500j5171K172J7615N922o757
$$ 15525 18936 479 -20297 -16434 2397 8552 7275 9494 1994 -13177 -11005 6610 12532 5775
195E775k775o986j3251O449K6535N284k5811j5780J4603J3808n464l223Q246q25
$$ 5775 3000 -3986 -17237 -10788 15747 21031 -4780 -20560 -5957 7851 2387 -836 7410 6585
209F585j4762m101J4412J1032m129q793p364m972P161J5566K323j6699j0969P486
$$ 6585 -8177 -12278 2134 13166 9037 244 -7120 -12092 -4931 10635 12958 -3741 -14710 -7224
223g224R420Q95l33J153m635n942K763Q995L822l475n620l392P77M312K527j616
$$ -7224 2196 3091 2758 3911 -724 -6666 -3903 5092 8914 5439 -181 -3573 -2796 1516 4043 2427
239B427k855k101k357p26K556N692K562n989q746L38J1395R046m490j0675k500
$$ 2427 -428 -2529 -4886 -5612 -3056 2636 5198 -791 -9537 -9199 2196 11242 6752 -3923 -6423
254f423P402O695j282n534l421K466L362k548m765O32O404N40q966n102P199Q529
$$ -6423 979 7674 6392 858 -2563 -97 3265 717 -4048 -3416 2988 3528 -5438 -10540 -3341 5188
270E188q21o975k805L000M815K722n62l926k978L120L902k068l788J117K704l039
$$ 5188 4367 -2608 -5413 -2413 2402 5124 4562 636 -2342 778 4680 2612 -1176 -59 2645 -394
286c94m995J926N678q44m821l45L286O02j562K074K771k193l515K123M368l06
$$ -394 -5389 -3463 2215 1371 -3450 -3795 -509 93 -1469 605 3376 1183 -2332 -209 4159 3853
302C853l370L3O78j429j111K206O80l990j944L165K863l279k269L695L223l454
$$ 3853 483 516 1194 -235 -1346 860 1540 -2450 -4394 -1229 1634 -1645 -3914 -219 3004 -450
318d50k975L735L776j540k693P01J545j132m73R79j000k213M6J371K8j907j57
$$ -450 -3425 310 4086 2546 -147 554 2099 967 494 1473 473 -1740 -1694 -323 -295 -2202 -2359
335b359J642L57p74k23J379J402o45o89J027J108o62p96N58L86j600j308N06P61
$$ -2359 -717 -360 -1134 -1357 22 1424 779 90 1117 2225 1563 767 1325 1711 111 -1197 -691 70
353G0j25j312n92J17O21P54j09k30K15O11J106K97j86m76K68M81L04j352j134
$$ 70 -55 -1367 -1959 -1842 -1221 -467 -576 -806 -591 20 1126 1423 1237 761 1029 1510 1814 462 -672
372f72Q71J233j774j750J7Q94N50l6k42q82r8J655K241m0k079r99K059K755j009
$$ -672 199 1432 -342 -2092 -2075 -1181 -631 -667 -909 -1791 -1889 -234 2007 1967 -112 -1111 948 3703 2694
391B694l089m72K004O95j302j470q26K25J389P14k492k078K909L386r81l188k22
$$ 2694 -395 -867 1137 1832 530 -940 -1766 -1541 -152 562 -1930 -4008 -1099 2287 1306 -1882 -2104
408b104K837K727k50k778k422J925L178L23l450k214P38K329Q71k836k492J726
$$ -2104 733 3460 3210 432 -1990 -65 3113 3436 -14 -2228 -1490 839 1710 -1126 -3618 -1892
424a892L027j043k536R01K650k48o39R64p00j071J837K467k081l435O66L090m51
$$ -1892 1135 92 -2444 -1543 1107 859 220 1184 484 -587 1250 3717 1636 -1799 -1133 1957 1506
441A506k158r15M93M95n63n84J609J813k742k357K516M359j045l447k9L095L85
$$ 1506 -652 -1567 -1074 -579 -1142 -1726 -117 1696 -1046 -3403 -887 3472 2427 -1020 -1049 2046 2431
458B431j933o58J119K04j089n21o4r93j316K986L294m210o208L540R070l16q731
$$ 2431 498 -160 959 1163 74 -447 -511 -1504 -2820 166 3460 -750 -6958 -3418 5652 5336 -3395
475c395j955O006M087j543k609j589j17K236J015j327j743q34Q53J998k77m737
$$ -3395 -5350 656 4743 3200 591 -998 -1115 1121 2136 809 -934 -1768 -915 1083 806 -3931
491c931j749P544M867p523p241M764Q461P43m561m330j208M480O041j383p170
$$ -3931 -5680 1864 6731 -792 -8033 -3269 5192 5935 1374 -2956 -4164 316 6357 4974 -2196
506b196k200L109K770Q73j715m493o45O561J571p496k459Q234N354o126p030J521
$$ -2196 -4396 -1287 1483 2356 641 -3852 -4497 2064 3635 -3861 -6320 1914 7268 1142 -5888 -4367
522d367O675N542k454q648l771O724O030j940m381k138q66J300N324J98o364j571
$$ -4367 2308 7850 5396 -3252 -7023 -299 5731 3791 -590 -2728 -3594 -2294 3030 3228 -3136 -4707
538d707N845J967n737p81O870K344n992n085M051N607j62l831j830q8n51J187
$$ -4707 1138 3105 -2632 -3413 3457 5801 -191 -5276 -1225 4382 4220 389 -1441 -1529 -2080 -893
554h93L534k74m365k059K002J956J479J031k384k750J524K534j6M18J131k111
$$ -893 2641 2367 -1998 -4057 -2055 -99 1380 2411 27 -2723 -1199 1335 1319 1737 2868 757
570G57m192J985N343j141n077O16K843j963k790K771L905j157n065n80L608K698
$$ 757 -3435 -1450 3893 2752 -2325 -1709 1134 -829 -3619 -848 3057 1900 -3165 -3745 -137 2561
586B561j537j108J819j354l608K464O181r62o960j067L488J856j135p70m79n49
$$ 2561 1024 -84 1735 381 -3227 -763 5418 4456 -2504 -3571 -83 1773 638 -132 -611 -1160
602a160J02k12m76K344J632j939k380K059L96r52L958K010o809n480P011O962
$$ -1160 -1058 -1270 -1746 598 2230 291 -2089 -30 366 -586 3372 5382 -1427 -6907 104 7066
618G066m486n872J006J404k03J389J338k032k066K143o6r94J889L096j732m393
$$ 7066 2580 -3292 -2286 -882 -1085 304 1642 -390 -2456 -313 -379 -1373 516 3612 1880 -2513
634b513L67K816J796M02j131l106j703J650L393Q30k863k724K86J847j67J035
$$ -2513 -2146 670 2466 2868 1737 -1369 -3072 -1422 1971 2801 -62 -2786 -2500 -653 -820 215
650B15K525j620m861J69N862J843k668j986m60p0J370K142m28k684m48J69r12
$$ 215 2740 1120 -3741 -3572 2290 4133 1465 -521 -981 -1051 319 2461 2033 -651 -1099 -930 -1842
667a842J055K602m20k649j313L07J502L226J068l188l373J404L067J277l79k044
$$ -1842 -787 1815 1395 -1254 -2567 -2260 -758 2468 3536 348 -3025 -1621 1446 2723 2344 300
683C00j999M20J811N96l71p05p83j385L13J980J081q89o75m98m17O35J740J159
$$ 300 -1699 -1279 532 1128 757 52 -731 -2116 -1803 177 1258 369 -306 -804 -1221 -586 1154 2313
701B313m29k189k103J424L326N41k495k371M69P68R14J337q40k672j9K370J21
$$ 2313 1884 -305 -2408 -984 2342 2883 388 -1983 -1514 -746 168 1505 665 -2007 -2026 344 465
718D65j286J102J485j561j473O33J623J602n57k150k236J399K173M21j293j273
$$ 465 -821 281 1766 205 -1268 -635 988 2590 2033 -117 -2353 -954 1219 1640 347 -926
734i26p87j2J576Q51p60o34K67J28m63O45J790K25k122q11Q84J144K84q19m75
$$ -926 -1713 -1725 -149 702 -58 -692 -425 -297 -760 -115 1675 1900 -222 -1033 -149 995 1279 460 -15
753a5q78l54N14J582j92j386p66O73O13P66J87l28o74K8M78M34L53lp74n63K13
$$ -15 -893 -1247 -733 849 657 -729 -1495 -822 -209 557 744 416 -258 -230 248 682 1035 1032 258 -305 -92
774i2J92l7J97O6j049j290R30J993j37j131o59M23O83M88L64r0q67O5J28M11k49
$$ -92 100 63 260 326 -723 -2013 -1083 910 773 -358 -1017 -594 89 577 941 851 -16 49 177 588 339
795C39K40m6q47o27L0J054M75m97j388K32P87K01N84l16j53m56J67N07P28n75
$$ 339 579 533 -314 -941 -911 143 618 121 -1267 -1035 -248 -47 537 221 68 -388 -221 286 1014 439
815D39l5l33m58M34n2M36m42m97m23M38M24K18n01k42L56M22n31P64M31n48n37
$$ 439 404 71 -387 47 -5 431 -11 -508 -931 -493 -69 149 -352 -594 -238 184 -347 417 848 300 -237
836b37M87N33k98j67l02J37o21OL75K55l85n00P6J14J72M40K24l53l5L6M06L34
$$ -237 250 783 485 318 16 153 -468 -462 -87 168 -217 -717 -641 -527 -355 85 309 -44 -79 -43 363 697
858F97j7m73l33N09J36n42j30N69m03o35k4J66M28l27L74R9n52K90O72J69n02
$$ 697 680 207 -126 383 519 -23 -153 416 13 -622 -646 -480 -52 -379 -5 94 -458 -168 504 673 171
879A71k35L82J78l3k62K45j75m38k02L18P1m06O2j64R7L08l61L48L41J03J1m25
$$ 171 -64 318 496 463 201 446 271 -167 -369 -51 20 -386 -324 -488 -391 -83 -444 -96 245 348 359 -66
901f6N66j19J97j34m9l91k12P01k30o73l29L89K10M10p82o4K13N18l9j63N3K18
$$ -66 500 381 578 444 395 4 -208 493 263 -410 -739 -350 -140 270 -512 -576 -363 155 116 -47 6 224
923B24L22M43l68r34K33Q67k2j007m77L36N64n13J34l05l67O08K11L32p16o8Q75
$$ 224 546 989 621 -313 -80 787 765 -242 -719 -383 181 -332 -198 -503 -870 -262 -51 281 -435 -503 372
944C72K65l81k81j01M22O65n50r31K54M43r3l44O4k72m98O66O19n72l29P4P90
$$ 372 637 256 -25 -126 296 961 411 -520 -266 177 84 -260 -196 -468 -966 -300 319 -253 -582 -508 282
965B82K54m17j31K35L39K89j030j42Q23J58j105M1P96l13o70K51N29r18m8Q11
$$ 282 536 119 -12 223 562 851 -179 -321 502 660 -445 -404 392 79 -591 -340 189 -729 -777 34
985C4O89l79o88j6M95Q10o92j65Q9K94l64m36O20K06j088o91J177O16r40k60P39
$$ 34 723 344 -344 -360 135 945 253 88 177 471 107 -329 291 497 -591 -1282 -105 511 -429 -689 50
1006E0J66n65k03O84K70k84j22JN30k77o4N04L88j233n65P13L81m47n73j29M17
$$ 50 216 -349 -552 132 402 118 -4 -3 527 250 186 690 1078 -155 -720 -7 374 -73 -646 -775 -358
1027c58O91m90l84K26P75Kn62K37N04p24j06J007l09j047J85J072k96j229J97
$$ -358 333 -157 -541 -315 460 462 -100 137 641 -83 -189 818 509 -538 -353 719 423 -806 -609
1046f09m8K80K31J33p84j8J013j58k72K96N17q17K69N46q2p54K46P70p46o38M80
$$ -609 -657 -377 -146 -13 -797 -815 198 40 -232 64 581 -236 33 579 497 -257 -11 759 13 -625 -145
1067a45N1J02J54q79l74J030P84p98j57L44rk01L29P85p37o58N23K18j57K37l44
$$ -145 -94 8 162 -717 -1091 -61 723 -75 -232 112 103 -98 231 1016 279 -379 144 362 205 442 98
1088I8m36j57n3L24j8N97l16r84M24J137j96l65L95j09o12o1J025N13r43m38j48
$$ 98 -338 -495 -548 -224 -242 355 39 -945 -521 616 420 55 450 341 -271 -332 693 1206 263 -175 -323
1109c23R9P27j80l92m07M34j008Q14O72L41j021m31Q45J47rM84m05m73k09L12
$$ -323 -224 503 323 -69 -476 -42 -1050 -236 436 777 -244 -675 170 317 308 792 387 -86 -295 17
1129A7M62J64nj016k96N83J62m11K40k14n76N1J204N55p28n99N37J33k99J047
$$ 17 479 643 638 -378 -674 -91 71 -340 -100 -314 -890 -839 365 920 192 -407 130 263 -36 1011
1149A011q7q46l49L05j84K22O33m39p12m02O61j93L86L47r5p66L51N96J51l10
$$ 1011 924 78 -271 34 -150 72 705 266 -446 -848 -187 -380 6 353 258 -508 -157 439 590 280
1169B80O9m3m45L97K16R1n69k52m1L3L18J4P6J18p60l87O24P81j11n07J52q6l29
$$ 280 349 306 -139 258 474 565 -4 -256 -297 -264 54 68 144 262 -498 -885 -261 520 409 -98 54 -32 -361
1192c61Q17K19l41l84M9m13M72K57P6o24l06J50r4M28K67L8m78n43R47r7J61N93
$$ -361 456 675 334 -50 -1 -414 58 315 391 -233 -539 -389 -483 -55 212 250 -228 -771 176 79 240 833
1214H33m02n49l7L68L57m65j0j01q07M15P43j39m33k04j51l5P40K52l22j00J25
$$ 833 431 -118 -155 213 570 105 95 -6 -813 -398 345 206 -227 -431 -582 -617 123 375 53 -47 78
1235G8k78J45Q95R9q54m78K04M64Q4j54j52n82n5K01M78r5n6k91l24N17L44J20
$$ 78 -200 -55 840 939 85 -393 -189 275 359 205 53 -529 -584 -383 95 0 -56 -347 -671 -154 190 310
1257C10j69J77l55l07K78O64j43j31l52l88L44L76L9m09p84L85K7M98M61J93p51
$$ 310 141 318 -37 -344 -66 598 455 324 -28 -416 -72 304 343 -66 -850 -465 -438 60 521 714 -37
1278c7l80J57J18N98J26l74l89m5K25J41J15j02m89l21L91K17K35kn08m8J29L05
$$ -37 -417 -260 -142 456 582 208 -181 -226 -1 140 255 153 -336 -657 -266 -49 186 184 -324 -372 -243 62
1300F2J7J43m5M8n10M17K9K42k78q6k05k73M77J22O8m86l19K90L14nl6Q0k51r1
$$ 62 79 222 177 225 -285 132 161 403 125 39 -166 -439 38 160 228 -258 -577 -287 27 22 -14 66 -185 -276
1324b76K26M96J47m97J55o22K92K05j40O19r89J07o1lM41m4k90p2K82q7J89M71
$$ -276 -50 446 593 96 251 -371 -79 126 -14 605 -384 -277 -338 -341 100 56 -234 -306 -24 -111 78 549
1346E49n58j25J88Q9L01k12j22j58K33m43L80n0J15l82j76J74k9L41N5k15j6k22
$$ 549 -9 -134 54 143 444 232 110 -48 185 -258 122 72 187 -195 -371 -197 -226 115 170 -45 -61 -283
1368b83J44L18K91j37m54j3J68L52j83k30N1k13n8%M12k67l82M20j35k03M16K9
$$ -283 -139 179 470 333 -121 -134 34 386 203 -27 24 -189 -247 -247 165 -102 -484 -64 -199 -402 14 43
1390D3M08l26l22K29K20r0J27k74j02j01L14k72K79l45M5P4K20l73K89l65K74
$$ 43 451 125 -197 32 252 162 289 15 -87 -188 126 -146 133 -212 -167 -93 127 -246 43 -322 -48
1411d8k24J68K07M52n18P3k16K90r9O5k46K79k91J6p8J10L05n15j7l8L93m4L02
$$ -48 -272 -104 103 555 37 110 -106 184 85 150 -96 183 -108 -92 -170 -60 245 -270 -287 -325 68 24 326
1434C26k47J02j90K08k2L8K27k04r5M4k75J62K7L81m73m72J39K6J78L7N5k0j4
$$ 326 79 181 -9 199 177 215 442 238 143 187 -88 74 101 482 9 -463 -324 -298 -120 -83 -28 -48 -62
1457f2m8R7J2J32l3R7k01J84j68L1J44j65j13r5J94k23N2K53j98r1K20K68m46
$$ -62 -110 -13 -1 131 98 195 -6 178 10 41 185 20 -93 -188 6 -217 -165 88 -110 -201 19 287 -159
1480a59L45o3Qo2M6O4l77l8M15k70L4N2j46J43M9j02r7m2J58j16J28l7K67j39
$$ -159 186 123 131 69 115 179 -198 -236 179 -91 -57 -5 -151 -8 41 -61 -158 -200 -42 -158 -30 -67 200 61
1504F1k11K60n2Nr8J97j16k6k04L18k45O9l74K29O6K1l9N4M5K9j87K56nj70L34
$$ 61 -150 110 58 63 -35 162 46 20 -184 134 -111 -42 -416 -187 -121 -100 -139 -85 -40 -11 -198 58 53 -117 217
1529B17J55J99m72l4Q4k65j08K31k69M7J27j76J90N8J44k53q0M35J56l02J2J4
$$ 217 372 571 99 65 149 -116 -224 7 -262 -215 -88 -264 -74 -16 128 -125 -205 230 386 84 96 110
1551A10k15k05M40J22j84J40j57r2k18N95l12k52L5J04l30M41K26k70r7O9K32
$$ 110 -105 -310 130 252 68 208 51 -41 -259 336 24 -228 -193 -89 -419 22 248 -22 -119 -50 182
1572A82K5r3K48j76l11L25J2o6j72%j99m1K58rj1o1r0J77j36L33J34j02j89j1
$$ 182 207 114 362 186 -125 200 212 146 -26 -26 -225 -266 -8 -17 -28 -89 -179 -2 -138 195 329 227 38 27
1596B7j47M12J52l68l54L65m9k43K23k04j14o8L49J77k25R2k41J57j16L32n7j51
$$ 27 -120 292 444 76 -278 87 38 -205 18 -186 -300 -368 -19 158 -67 25 -216 -59 -175 157 100 -51
1618e1O1K84m48K13L83l58k04j6J70j38k79L16M8m2KJ9k81L05j64Q6J0K34j90
$$ -51 10 294 -154 59 442 84 -120 -136 34 -104 -383 -67 -19 -61 -59 -40 -321 -16 -180 -94 -84 150 -40
1641d0N6K08J1l28P1J4o6P9P2j97k42J71L15k37QL2J33M4J38k67K48J92k08j72
$$ -40 16 224 235 -93 -22 -8 -74 5 77 -120 -362 -191 124 -113 -105 -73 60 104 242 -25 223 415 207 35
1665C5j36K10m8O3o5P5j92j3k2L6K86j91l90L28J0L73l72M4O8k0k32N45k30k68
$$ 35 -101 109 61 124 59 134 -58 -71 -93 -57 229 38 -352 -24 -14 359 -13 31 99 79 -153 392 162 -106
1689a06j39L27k0r6K92j56k23j58N7K33R7Lk95J7l50M85J49j70K25q5j92m1L09
$$ -106 -245 82 62 -34 258 102 -121 -279 -222 11 108 111 -184 -167 -517 -32 117 -53 172 87 -105 -146 163
1712A63j89j30K17k02J76%R3R2l89J74k55J11L03k6l32J71K52k19J59j0j82J56
$$ 163 -26 -156 61 -141 35 35 128 220 -169 5 -250 -139 164 138 -194 -23 229 10 169 159 -23 133
1734A33M4j71L15p8k43k16K46k76K64K24r0j25j10m4R2K62j11k72L64p0o7R1J08
$$ 133 177 6 321 243 0 -216 30 -246 18 242 152 27 -83 -127 -35 227 116 -156 208 138 71 162 270
1757B70j35k31j13K27k5L8k60R0J79k30K16O1j18J07O4k46K28k69K51j8J01j97
$$ 270 135 -96 -209 18 -7 31 -229 -139 40 -190 26 87 -31 76 140 -106 122 -147 104 86 187 -10
1779a0M8Q6j86L34o53J50K16j11J07O4Kj33j50J34J48J70k74MJ36j16K79r5q5
$$ -10 38 124 -62 272 -381 -231 -15 -126 -19 45 47 -86 -236 -102 46 216 -58 -54 82 -34 245 150 65
1802F5k7K3K28l36MN8k4K9l37K50j33L32ol43J78N2q4J1n6j15Q6NK62j53J99n8
$$ 65 38 61 289 -47 -43 15 -9 20 -317 -67 -200 132 126 -217 -39 13 -71 -60 -116 -231 -145 -140 122 -31 168 110
1828A10j87j51K65j32K22J5j31l2k60K86K42Q2j80m7k88L78l13J98j50r0j3OK04
$$ 110 -77 -228 37 -95 127 142 11 -21 -281 5 247 329 149 102 -186 192 -121 77 -73 -163 -176 -170 34
1851C4J4j7n9l07M2J16K2K86k57j20L00q5K12o3l7K34k4o7J53o13J74J80j24r
$$ 34 48 31 -28 -335 -293 -177 -155 131 -126 -246 54 -31 181 118 81 315 291 224 377 -236 -62 118 -6 -15
1875a5P8O4j95J7O1j67J41J67k9j61K5J53l6n7J2j17p5P5P0L3j31p2j42J98k74
$$ -15 63 127 -68 -51 10 -157 -16 151 122 -39 -14 139 103 46 58 -59 -134 -59 11 44 -87 -159 -301 -103 -377
1900c77J88K53j26L21l25J93M6j12J83j33k13L18j91p7M26j49j22J13l91J2L97
$$ -377 -189 64 -62 259 -66 127 173 61 244 111 -102 216 25 -52 374 225 103 216 -175 -163 234
1921B34m12n6J14l4Q1Q5j0k50r6K94M77k80j08j07oK25j16K23m04L33k10kK6K46
$$ 234 -178 -234 -120 -154 -73 12 2 -248 -344 -50 427 147 39 -68 -74 151 35 258 -146 187 -23 -25 1 247
1945B47kk20Q8m11K12K22P5l44M5K21j67p7K43m2r1O2k4m61K81j99L44l14J69
$$ 247 245 25 113 -298 -86 136 211 -133 -88 133 -34 -111 132 90 -1 61 37 -424 -143 -342 2 -312 -143
1968a43p8J76j51L93rk03m4j51J90P2O7r2Q6k62J36N7j59L57M2n37J49K79l0j8
$$ -143 -221 -45 -196 197 188 -15 -59 -210 -20 52 119 27 113 -149 -13 44 -115 242 284 -253 -104 175 145 127
1992A27m15K21L36m52K61j86L30l17L14J7j22j55j30J89L4j72J19J4r7K1q2P7
$$ 127 -288 -67 269 -183 78 -108 222 -95 219 236 114 -41 -171 18 52 -120 -1 13 -84 -63 -145 -68
2014f8J17j22M02l86k76M35n6j49J91N1j71n3J50j08j20%l5L13l69K29j1j48o
$$ -68 49 -73 329 -57 -333 102 46 -103 88 139 -32 -85 65 -43 -163 -163 -198 115 -254 -25 -36 -184 -190
2037a90Nl2L93j64j77M3Q8k38m9M70J87l68k11K06j51Q0%J8p0R8P1P7m8k2Oj28
$$ -190 -185 -217 176 12 -165 -122 -34 -272 -321 149 336 -32 -243 -37 -188 -108 -108 -90 -160 -62 9 86 38 16 22 -106
2063a06n9L90k70K43J32j09k62J73K5j83q1K86j85R4n2P3k92k9L84k36J73p8R8
$$ -106 -165 225 -45 198 330 221 -41 132 157 -26 -107 179 -6 88 36 109 -183 -212 172 -64 109 31 129
2086A29K96l35m7J26k65J68N6k02J24q8J58m13K02L04j42j86JR7j76J90k17L44
$$ 129 425 90 43 169 -96 72 128 -74 50 -38 120 -293 -91 213 71 -115 -114 -17 -193 -3 -220 124
2108A24k11J34j65L6L52o2l26J57J58j58j60R9k56n0M32n1l73N03j46q1j01L43
$$ 124 -87 47 -118 -82 270 208 -118 39 197 39 -121 -22 -278 -328 104 53 -320 183 37 -44 -145 198
2130A98j7j97K1N5j86J45J45k01m2r2L64l38K99r9r4l70Q1M71m33L29J1k78n2
$$ 198 181 -16 5 60 -126 19 164 -37 -79 -171 193 -145 154 55 -39 -409 -328 143 -290 39 50 -228 -280
2153b80L97o2o4K10K0l60K15l7P7j21J11l07O8Q8J55m91J53O2l1j71L50l1J70
$$ -280 117 55 -9 201 221 -139 76 39 116 -5 106 -201 -133 -45 110 -381 -228 -166 -197 -368 -18 -49 121
2176A21m34L49J44O9k01K42l84P3o7J31k33Q2K83o59N34j20nr5L77m2k19K14l9
$$ 121 -313 36 180 249 48 290 -94 -21 -88 43 -190 -108 175 -484 50 -70 -75 -170 207 165 -54 160 121
2199A21j07j96K72O6k43L2J54j00rj1Q4j31j31J83j98p9K84k50J13J68K24r0m45
$$ 121 14 -182 90 156 -87 -55 99 -1 -10 -21 63 -68 -199 -16 -214 -293 -9 -259 -146 22 246 156 -289
2222b89O26k82j0R4k05K42o6j12n4J02k20j34K38l0o1j06J59J65o4j75J71L35
$$ -289 337 55 45 139 -66 176 110 -2 -56 46 -174 -308 -70 -100 -161 -267 -108 57 -7 -182 -11 324
2244C24j32j31qo1L8J27j21j33J1K01j38J7j54m9J45J8L6J21j30L43n74J69J7
$$ 324 192 61 53 -8 30 157 36 -97 -86 115 -23 -6 -160 -209 -64 -46 -10 111 -19 324 -250 -81 -64
2267f4P1j67K48L01k90N3J59k29p5M3j57o8Jj24J98M28k60J3oJ60k62J02j99N9
$$ -64 7 -160 88 389 99 152 311 82 7 50 -107 -175 -174 -298 -100 328 68 81 75 235 -27 75 -124 -65
2291f5J97j03J74P6l54j62M12k7j3l86M29j7k37j8Q8m7M1K61k02R2j69L5r8J16
$$ -65 132 29 203 279 -75 -237 175 148 135 -251 178 161 -76 -94 -6 -53 -12 249 47 139 -30 5 -93 23
2315B3J3k68L39j94J41j69p5P0P2r5J82j54R7j33J61K63k20p0n3P7l57M31J6q8
$$ 23 36 -232 107 -87 54 -115 -190 -120 -48 -143 39 -115 -18 -151 10 273 53 -17 -70 7 -350 81 97 9
2339IQ8k74J90k5M1r3m0j17J49j86J85J69Oj27K11k11R3J01p2l42L11k45J90J27
$$ 9 97 -177 13 -12 29 -64 -104 -221 -72 -258 -73 96 102 -25 186 -25 68 169 97 -245 66 -179 11 138
2363A38m8N0j83P1R4K6l8j3k5M2k52K23J06k39N8lj36J32Mj9J10K45m61p9L92
$$ 138 90 140 -43 28 122 148 110 97 72 114 -138 85 191 -48 10 7 -129 3 7 -12 98 343 -118 -197 195
2388A95j12RK7n25K86J0N7J12R3j32k2rJ07J22j25J74k23j79L37ll1q3l56K36
$$ 195 83 92 119 -406 -120 -110 -53 59 152 20 -2 -11 96 218 93 267 44 -135 202 199 168 85 -271 -35
2412c5lk15J45Q2k04K04j34J19j7N9O7o8l7L92l86K17j66j75J44j07j59J71J58
$$ -35 -38 -253 -108 -26 -230 -26 -160 -41 -58 1 68 0 -37 355 -31 186 20 -155 -11 -118 -277 -106 52
2435E2J82m89Q5OK86o0k60P1L46j15k7J56l18K20k27K57m8K47o06J43j73K11j96
$$ 52 234 -255 -170 -164 122 62 -198 -127 219 104 77 233 -85 135 -92 165 117 364 -242 -99 -272 -61 -257
2458b57K27L2j34J41k3K0O5J56j23j23R4j28J2K59m11J39j0J62j25L13k36j02
$$ -257 -30 2 -132 9 -14 6 71 227 104 -19 75 -53 -41 218 -193 -54 -64 98 -27 286 50 -52
2480e2nj07Q8j76L21o6J8J11j08J58Kk9k67J50N9J81k8j34k24J60j1l4M3k30J57
$$ -52 -57 -164 -76 -252 69 3 21 132 24 182 184 155 -112 38 97 278 250 116 -108 52 41 7 50 -180 -23
2505b3j05J5J53j65Q4J45j67j4p3L6k10K00K28k29P3j0J48q5n1N6j18k05L36m0
$$ -23 -128 -113 40 -125 -41 104 -63 -77 -150 -114 -324 -124 104 -125 -52 -62 86 1 -50 6 -112 -317 19 -21
2529b1J17j93k7p7L34j38n6j59K48J90J9J35j91k49K1L17l28M0J03j81J32K6l1
$$ -21 96 -97 -124 -201 133 -5 -61 -220 28 218 237 372 181 -68 -47 270 -58 -18 85 -96 36 62 31
2552C1k95o5K85J19k3N2J55l30k16J83J6J91j46k8J0M9j07j31K03j41K70k53k05
$$ 31 -264 -329 -44 75 52 104 259 -71 -287 -104 -88 103 -43 -71 -61 -12 -119 -250 -47 -188 82 -171 -376
2575c76J27N42j92k35K09O1j03m6J57l6k06k13N31l70Q6L3J81j06l2j62JM07l85
$$ -376 -249 293 101 -134 75 136 33 -13 144 108 -98 -311 220 -150 -64 -31 150 44 12 -150 -149 258 -127
2598a27J84J07J49k99k9J20k1q8J71nl36J01K2J9j08P8n5k3K00R6l45R8q0j73
$$ -127 57 164 313 14 -15 105 84 -4 167 162 -174 -73 -51 -32 -140 -62 -117 -140 60 156 -189 -91 -171 -344
2622c44M39o6L3l4k05K72m8J3J01m09K46n0J42k79K04k7l59L73J08K07n38J07
$$ -344 95 29 62 28 -177 95 47 60 161 -248 -2 -52 90 -189 15 -12 -371 2 110 317 -221 -114
2644a14J5j49J45K46j01r6r9K23j85nK77k52j20K11K88k69l85M47J38j33p3j98
$$ -114 -99 -248 -103 143 42 -54 -153 70 -115 -120 157 -95 -215 -4 284 15 -370 77 215 82 9 -189
2666a89J00M6K9M5J24K00j91l01K36k66L88r9J36k73q3j0J9J59l81L08j99r9L81
$$ -189 -89 -43 -14 31 155 355 164 -137 99 -167 221 122 258 -15 -98 -108 -89 70 -311 -3 -202 -301 80
2689H0J0n0j43K03j6p9o3J47k77L81j31qK29j83j97R5j20J66q6J17rJ06q5j7j03
$$ 80 90 40 -103 100 84 5 -58 89 -188 193 62 54 283 100 -97 -2 -122 44 -42 75 66 172 87 70 -33
2714c3m5J94Ml0J6p6l2j82J96l9J62j79j47o8L5L20j07j69O5K37n15O06o6j57
$$ -33 -78 116 120 90 106 30 -2 -184 12 -27 135 -44 -191 -259 -224 96 -11 -180 -115 122 -393 213 147 -10
2738a0J81j93K82j90n3q6J12q2J91l74K53R8j15K1j24j81L29k43L19p6K96n72
$$ -10 171 -22 260 70 17 -69 43 -39 152 -222 31 129 14 35 -89 -270 59 -184 135 59 355 -217
2760b17L54l8l21L23lol20L47q1j83k6J61LJ18l8j24j28k14N05k63K45j37P4p4
$$ -217 137 99 -222 101 98 92 -228 119 38 -145 -171 -10 -7 111 73 -51 -179 -393 112 -151 94 -43 31 -43
2784d3K24J3j41M2j68J70j80j1J35J30k81O5q7k7M21j49l1j72L81k13j00Q8l6
$$ -43 181 194 53 95 -73 97 -83 -94 41 171 -110 -45 -132 -159 262 113 82 -90 291 78 -22 66 30
2807C0j56K6J79q0N2j35J21j76L09l73J70Q1o6L23k53m0K3K9o4L8Q3j16Q1K6P2
$$ 30 -126 -100 79 -1 51 -84 37 -139 170 -203 -33 48 -18 305 52 12 35 64 0 38 121 5 86 112 184
2832A84k44j20J12j38K10M1q0k1L17n72K41K45k09N3k00L52pn9j41p7J14j48K11
$$ 184 -60 -180 -68 -206 4 45 -35 -56 261 -311 -70 175 -34 19 -181 171 164 105 -36 -113 1 -147 64
2855F4j66K06j56Q9l5j01N6P1J4pl6L21j28kj41k1j90M1n5L23l6j30K90m65L91
$$ 64 -102 104 -52 37 2 -99 -43 28 42 35 -1 320 192 190 49 28 -162 -121 -176 147 111 -19 271 -194 197
2880A97j71j30K29l56L72l32J05K64j9j77r8J11Q0l02K46p9m8n8L76q2m2j38N1
$$ 197 26 -104 125 -231 141 -191 -86 178 159 -18 -116 -5 75 -227 19 -60 -108 -166 210 128 86 -52 -1
2903aj02J21k66J28M13k89K7j78J95k8j94J05K85k33R4o3k83L24J1j35k21L06
$$ -1 -103 18 -248 -120 293 4 31 -147 48 20 -174 -69 216 -17 77 14 -269 55 66 -69 -290 16
2925A6O3j61j6J32n8L07k02O9j25%K5J66k9k90K28k8J31k65Q1k2J85J91j79l10
$$ 16 79 -82 -98 34 -24 283 81 150 25 25 50 216 187 -103 125 97 228 -37 44 22 207 398 219 -91
2949i1k5K64k06j70J21j17M2M50j78n3q6J01o7j43l6K51j97M1K66k53L32n26K27
$$ -91 -116 148 -58 -228 -107 -224 -182 268 90 37 -49 52 -15 -158 -194 57 -140 -99 167 -86 246 -280 -53
2972e3N0m31O41l14K39k92J48j52O3J11N2j86L50k42J1J81j63m0J73r0j69K3Q2
$$ -53 -3 -434 207 -107 132 -160 -12 -164 -101 10 62 -124 226 -16 -5 176 13 -27 146 56 -113 -90 -8
2995hJ57j32j89m7J66j10L21k08K0R8o8K8R6n0n4J77l73N0L46l09m2j3K26l30
$$ -8 149 17 -172 -219 -53 -163 158 -50 -30 68 0 28 124 74 20 197 -176 -126 220 -89 -131 -144 82 -248
3019b48R1L48j40j86K07n0p3J34k06J36K00l07J56R0l93L22k78L6J60P5j2O8j87
$$ -248 -157 191 51 -135 72 22 -51 83 -123 13 213 -94 62 152 -241 81 -197 -161 -1 74 62 130 -57
3042e7J96k34r5L37J37k91M87n35J2j67J97j0J51K3k3m4k0R8l05L48p2k45K4J1
$$ -57 139 -95 -190 147 284 -7 480 -55 -43 -210 -13 -23 128 151 128 84 64 162 -143 205 133 -112 -88 -77
3066g7J76r8m13L61p3l6K73j02M2N6l23J25K80j36j64j25M89j85o2n2R1k76P9
$$ -77 99 1 -412 -51 -124 -160 113 11 53 109 -214 -89 191 55 -109 -234 255 70 8 -44 47 -229 -150
3089a50k3K67J31K48o17R9J54l3J52k62M0J61j85k02M13j98n4j99L17j47M5p0
$$ -150 -173 94 225 473 -144 -45 109 76 228 -34 6 167 -18 -220 193 -5 -59 -258 59 -88 -43 -113
3111a13k5PK3K86r5n8P3m8p0l8J05J21j75j11J91J8k36L29N4l41L85j28m2j91
$$ -113 -138 -131 -108 178 83 25 98 50 -20 -58 47 168 -7 -118 73 91 -145 184 238 -103 282 154 112 -79
3135g9q7R1j03K19J80j09K4k26J11q6L18l25K12k8k88K70p4k07M8P7pQ1m2j31
$$ -79 -166 -75 -178 41 221 112 136 -90 21 -65 253 -72 140 112 -176 94 20 -187 -139 -62 -69 12 -30 -161
3159a61J11J24qJ57m98L82j65l0m9J26o3M4oK18l03k8K11O4j81n7K25N0l36L68
$$ -161 -50 74 66 223 -275 107 -58 -88 -137 -11 -74 -30 -36 182 -121 -149 62 126 -55 -112 113 163 -173 195
3183A95k78M5O7J90Qj57j79l26M63p5J0l3M4l0M6r1r9j90K66J18LJ8J0J52q7N1
$$ 195 -83 -38 29 219 227 70 -109 -435 28 -47 -37 -70 -26 -56 -10 -101 -200 -390 -124 -6 -3 15 25 177 90 141
3209A41j3k44J43k92L30j34L52l13P2O8j40oJ26kJ5l13K1M15k09k56N47j49N1
$$ 141 128 -116 27 -265 65 -69 283 -30 42 110 -30 -36 90 88 103 -210 -189 226 17 -239 308 159 210
3232B10j03l16K50p4oJ17O8k1j3l16J51j34L04N4k37L4N8m8J40J5pL5J42l17k81
$$ 210 107 -209 41 -33 -39 78 146 125 112 -204 -53 -187 117 171 -66 -32 26 -22 118 133 126 161 303 -14 -295
3257b95K74j45K18K07m34l7M1K13J22j65MJ2j53m5K75k7m2J46p7q1j16K17j67
$$ -295 -21 -166 52 259 -175 -212 -171 42 164 -1 3 15 -138 -183 92 65 23 169 92 11 -105 112 -55
3280e5K06k01K13j73j27J34l1j86J11M7R7J44k33R9l32K24r4L2R4J10N5k55K95
$$ -55 151 -50 163 -10 -137 -3 -34 -220 -109 -62 35 179 -54 45 -287 -63 -157 -125 -31 79 134 -121 174
3303A74m1OK2j85j52L3O7K5K8n4J82p9J70j94Q8J80k51k09K43j54k1K9K73j18
$$ 174 133 139 161 -24 -176 -143 -76 -51 -23 -77 105 26 196 2 90 270 19 -190 53 -101 -122 -93 180 62
3327F2j13J31j60K03k87J11nL3l2k2K85m45J3K58j12L03k04J01k16K38k21K64
$$ 62 -51 80 -80 123 -164 -53 -58 -25 -57 -79 206 -239 -226 32 -80 223 19 120 -96 142 -79 185
3349A85J72k51k78L56j06l01K69o4j48K54k90O6J73Qk98J53Q5q0k6L13j59K48
$$ 185 357 106 -172 184 78 -223 46 -18 -166 88 -202 -136 37 45 -253 -100 -15 -95 -121 192 33 281
3371B81k92P6J86l65Q5J28j66K50l53J19J37o5M8l82M25l41K33l30L61j71j5M18
$$ 281 -11 65 251 -114 -29 99 -67 183 -170 -51 86 21 69 -313 112 -229 4 -326 35 -136 -151 267
3393B67Mk82K18l35K04j06J18Q2j99J79k29R0J15p4p3o9M2O0J17k38j0K65J48
$$ 267 271 -11 207 -128 76 -30 88 170 -29 150 -79 11 126 52 -21 -90 -48 12 129 -109 -119 146 294
3416B94k82n1R6j7j91N2L13l48M7r8L04j30M7r6O0K88l67J50j6k5j3N0J25q8k15
$$ 294 12 -39 57 40 -151 -99 214 -134 -87 -185 119 -11 36 -60 0 288 -79 71 55 30 17 67 192 104 -111
3441a11j55L07M4o3J45j32pJ05k48j4j31J74M9j00J67j1K64o9l77o8K69n0K9j74
$$ -111 -266 41 85 22 167 35 28 133 -115 -129 -260 -86 -37 -137 30 19 283 214 -163 -231 38 -12 17 -157
3465a57J31kN0P2k37P8Q3j02O8K8Q6l18K82J31j27K8j80M4l5oK23k92J03J97l11
$$ -157 -26 -28 22 94 -143 -65 18 -84 -16 12 98 -220 62 193 66 94 -86 -42 -77 -83 140 -152 -49 148 -163
3490a63L17n6N1j44j67J91K23j38p4r7L17j41o3k15P6K78j88n7J5q5J52j35K16
$$ -163 154 98 149 5 -162 29 252 114 40 -57 260 119 56 -159 -83 195 7 -50 -35 -120 32 -103 113
3513A13m8J76j32p4k3L7j60K39j00rJ09q2k84J56L28k35j57k44O70k43k55K45
$$ 113 65 241 109 35 12 49 -111 128 28 19 128 46 -238 -82 246 11 -146 -390 280 37 -218 27
3535B7L7l48M91j08o64L87L00J5o4n0j5Mk60L33j8j38J58r2K58m89K60j57j56
$$ 27 64 -284 207 99 -565 -178 122 137 73 23 8 12 -248 85 67 -71 87 -5 253 -236 24 -133 -289
3558b89M20Oo0oj84K01k39l4J60Q7j13n4J98k27j21M72n4l83J11J45k31K80j09
$$ -289 131 137 77 71 -113 88 -151 -185 -25 62 -51 -105 93 -134 -255 217 163 -220 -109 36 -195 85 -24
3581b4l6k0l1J24k30K82k9J38J32j44j63M1J62j19l6o6Kp5M03k77J20J40j99o8
$$ -24 -60 -80 -111 13 -217 65 36 174 306 162 -1 40 202 83 47 -19 -17 -92 311 34 154 294 95 27
3605B7o3j01K60j8j01r2Q4k7M7J34q2J7k41K55j41J19J65m50L10j25Q3j06p5J43
$$ 27 -36 -137 123 105 4 -88 -4 -31 16 150 68 85 -156 99 -42 77 242 -208 102 -23 60 -46 -121 22
3629B2n4L33k98J07P2j6j26L63m82P6R8J1N9K14m37O5k4J24O1j48j7j48K20n6
$$ 22 -32 301 3 110 182 166 40 403 -79 -3 95 106 165 379 -58 7 -17 107 168 20 3 -145 75 19
3653A9K9k10M29j88R6j94K9J75k20o7J72l13K51p3Q6l91O0J61K08n2J12k3k00
$$ 19 48 -162 267 79 175 -19 10 185 -35 -102 70 -243 8 -65 21 -370 -310 -149 59 7 119 96 -104
3676a04J68l66L76r0J1o7L19j99J9K08j93n4%K27m26O7L59k37K9J88l79J51k1
$$ -104 64 -302 74 -16 -5 -72 247 48 67 275 82 28 28 255 -171 -104 255 18 47 235 -144 7 -14
3699a4L4R2N6ql44K88j28J97j66k60K56O7l14M16k26k41J10K28P5m0N6j38j52
$$ -14 20 112 168 160 -184 104 -24 173 7 -253 3 70 -244 172 -54 -295 -185 43 118 78 134 -4 -156
3722a56K39j81K8j29K11j8j20jR1J23r9n5N3J08j26j64j23M34J18l69L59k7j44
$$ -156 83 -98 -70 -199 12 -6 -126 -127 -36 87 -12 -67 -14 94 -32 -196 -319 115 233 -136 223 196 52
3745E2j67r2L54pp6j80K21r9l36K12j4o1P7J62Q5k0o6l03J42L09l69J59j58L57
$$ 52 -115 -207 147 140 64 -116 105 6 -330 -118 -132 -193 -116 46 131 111 45 -258 -116 193 -176 -17 -175 182
3769A82m0j11K24j55J6p2jq2K2J49k25p8L72j32j54q8J64j80m8K82k9N3oJ2J6
$$ 182 142 31 255 100 116 44 43 -39 -17 132 -93 -171 201 69 -85 -173 -9 -189 -237 45 16 69 63 75 91
3794I1M0q3N1Q4j91O8k38J27J06R1j21j45J4M9r1K29J4j50K06J3j05n2J52k8k02
$$ 91 131 48 99 183 -8 60 -178 -51 55 146 25 -120 -106 -57 -148 81 95 -55 151 164 59 7 159 131 -71
3819g1p5K94j75k3J3L4m8J16k2n6J23j82J61j72m6K15j7L7Q5j89k0qM4j38N1O6
$$ -71 -146 148 -27 -50 -37 -3 -51 65 43 -13 110 -72 89 -83 -129 86 69 106 191 2 -18 -26 18 -120 -69 -3
3845cL6j20n4K03o6J43l47J07J24q4%K45k40K55l29K30J92m83K24J51K09k09l60
$$ -3 33 -87 -141 62 -4 139 -208 -101 23 -61 -61 184 -56 199 -130 100 292 -191 33 184 393 184 -176
3868a76M6M4J30n4k85L22J12q5j29Q0j10K80j63J86m6j46J11P0k15r9K61l04L59
$$ -176 -130 -86 44 -10 -295 27 139 54 -75 5 -105 175 12 198 152 6 117 187 -28 -127 134 -170 189
3891A89j98o1J11j27j2J26J2j17K46K0l37M0L45r8q1k2j65K94l86O5K58k01K6
$$ 189 -9 -70 41 -86 -98 28 40 -77 169 189 -148 -108 237 139 58 36 -129 165 -221 -156 102 -99 -73
3914g3K43k56k6J52j40L2j03oK29l6k21M24j37J33l98J97M13l27j16J04j48oN6
$$ -73 170 -86 -112 40 -100 -68 -171 -177 52 16 -205 219 82 215 -183 14 427 100 -16 88 -60 -66 -10
3937a0p4J58l7l9M2Jj25K53j94J84j66j77J70o5N0m4L9j72P2J77k08J87M4j01
$$ -10 -84 74 37 -2 40 41 -84 169 -25 159 -7 -184 -14 -79 -29 -73 -34 -206 -134 43 -165 22 66 -35
3961c5N0L5j18J83l31J58R4n7o3K42k34L0J5%l0K12k98NL96k29J10p4j52K33m57
$$ -35 15 50 -68 115 -216 -58 36 -21 -84 158 -76 -46 -31 -31 -61 151 -147 -142 254 25 135 61 -91 142 -315
3986c15J49l9J72J32N5j20o9L7K79k89n8K3J02l24K19l4m0J59k27K39j96J23k38
$$ -315 -166 -205 -33 99 154 34 -35 2 281 -8 -66 -43 59 -265 -46 -80 -120 39 -188 51 -145 -22 -260
4009b60N4K73k6l7j37J03J38J9P9j2k25L35k33K7k9J64j92j13J3n5K77j16j30
$$ -260 -206 67 41 4 -133 -30 108 127 206 194 -31 304 71 98 69 233 41 -72 -59 -114 163 47 -83
4032h3L32O7l58K9R1n3n1n4L06j12l43J20J35j6p7r9K37n2L9q3Q2k16L87k72K07
$$ -83 249 316 -42 -13 78 25 -26 -80 226 114 -229 -109 26 10 -67 -166 71 19 58 -25 57 -159 228 -44 163
4057A63k64J63j72L13j26PL18l88o5j12K3R6o0Q0j60MK24j47LK52J17l13p7J05
$$ 163 -101 62 -110 203 77 84 402 14 -51 -163 -140 -44 -104 -24 -184 -180 44 -103 -100 152 269 -44 -121 -16
4081a6j50M3L21l20M43n03J47m9J75p7L5k42r9L11qj30oO5R1r9K30j30j26K61
$$ -16 -166 -123 198 -122 321 -182 -35 -84 91 14 49 -193 -292 19 11 -119 -125 -60 31 -68 162 32 -94 167
4105A67k25n8L39r2j15Q1J30k84L96l37j66j12K01J82l47l5O5K09K62l23k3r7
$$ 167 -58 -116 223 131 16 97 227 -57 339 2 -164 -276 -75 107 -240 -275 -210 -1 261 -62 -85 -182
4127a82j0mJ35o8P0O0j37Q8K73l55K22j94K29l79L35l50L12j51L5R5J35j26M7
$$ -182 -192 -196 -61 -129 -59 1 -136 -48 225 -130 92 -102 127 -252 83 -267 45 -106 -71 24 159 33 80
4150H0L8J5k95L67k66L78n30J06J72k16J70j24N2J90q3K3j51j68M69l11R0n7J26
$$ 80 118 133 -162 205 -61 317 -213 -107 65 -151 19 -105 -53 137 54 77 -74 -242 227 -84 6 -51 75
4173G5m27M29j7J06k39MK59j80J20k15R6m1Q4n4k01N2J46r0q3j3J47j10R5j12
$$ 75 -352 77 60 166 -73 -69 190 10 130 -85 11 -30 54 0 -201 -149 -3 -93 -176 -189 -42 -152 -57 -169
4197a69M95m95J0K95k53L1J91J89m69K76k30r9J83L17l01o8L7q4J69K0j90K04
$$ -169 326 -169 -159 136 -117 -86 105 294 -175 101 -129 -228 -45 272 -29 -97 -60 -144 25 45 -145 59
4219E9l12J59J60k3k0K77n08L53k66J93N6M1m8j71J05l17M52k80J13o3OQ5J39
$$ 59 -253 -94 66 43 23 300 -208 145 -121 72 128 169 121 -50 55 -262 190 -90 23 -40 -34 51 190
4242A90l6m24L81j33nK4l0q9J15R4R5l79L33j32M2j03Q9J43l81K00p7Q8Lo3L2
$$ 190 154 -270 111 -22 -27 -3 -33 -122 -7 87 182 -197 136 4 46 -57 32 175 -206 -6 -83 5 8 -55 -23
4267b3K70k08J12P7l44K06J15j55p3K98k36m4L3J75J06o13N02m9n5J82k57N6l3
$$ -23 247 39 151 228 -116 90 205 50 -23 275 39 -5 28 203 309 -304 198 149 94 276 19 75 42
4290D2J98k89n6k7P2J98l7rk96K43kk00NN07l32k70J36J06J84k18L28m83M85m00
$$ 42 240 -49 -105 -132 -60 138 101 92 -204 39 37 -163 -158 349 17 -253 -117 -11 173 -45 283 -200 285 -115
4314a15J82k56M58k66j85K60Nj07k26M06j38L16k39l41L93J9p8l55M36J02k37
$$ -115 67 -189 269 3 -182 78 83 -24 -250 156 18 334 95 -246 147 166 88 -267 169 271 34
4335C4r9K4K28l17j35N5K95J99n71K47J81j16P1K5k00o6RJ02Q2k46K93K7J33n72
$$ 34 -65 -41 187 -130 -265 -210 85 284 -287 -40 141 25 96 121 -79 -145 -136 -34 48 -198 95 122 255 -317
4359c17K90K52m27J11K57k99L04l34J72l1l0J43k00K37m4k47l1M3K15r3K55l62
$$ -317 -27 225 -202 -91 166 -133 171 -163 9 -22 -52 91 -109 128 84 -163 -194 -151 64 -29 226 -136
4381a36k34P43k78j96q1J41R4m8j9r0J54k01J89Jp2K90l70K17j07j1K24J23K7
$$ -136 -370 373 95 -101 -182 -41 53 5 -14 -104 50 -151 38 39 -33 257 -113 104 -3 -14 210 333 360
4404C60n60J44K6mJ76l08K91j29P9l55M70k58K63l01J60n9j08J90k67J92j16J51
$$ 360 -200 -56 -30 -34 142 -166 125 -4 75 -280 190 -68 195 -106 54 -5 -113 77 -190 2 -114 37
4426C7O6p3j39nQJ58O1K07n68L79m8j28j82K92Q3k05R3j45M4l3M1K43k6j26k3
$$ 37 103 30 -109 -114 -106 52 113 320 -248 131 83 -45 -227 65 148 -57 36 -109 -65 -98 -57 186 160 34 11
4451A1N6J34K7j33k36J37j37J95l0j96J35j68J11J03q2J02j5K25j40K4m37O70
$$ 11 67 201 228 95 -141 -4 -141 54 24 -172 -37 -205 -94 9 -73 29 14 239 99 123 -314 356
4473C56l12O8M8l52J04l3J05n8K20j88oJ87J37m14J69J03R4r0j05j04j08J75j00
$$ 356 44 112 160 -192 -88 -121 -16 -74 146 -42 -48 139 276 -138 31 134 228 138 33 -71 -179 -4 -104
4496a04m9J33j20k13J18J62J37J19k32L9l92L30R5o6J03l25L08L8L0k4n9j53K3
$$ -104 -153 -20 -140 -353 -235 -73 64 183 -49 -10 -402 -72 23 -43 60 -265 43 81 111 87 28 -125 -102
4519a02J58j49K29k85K41n6ol9K39j32O5j00rm6j1j49J82j12j66J72j14L4K47
$$ -102 56 -93 136 -149 92 36 30 -9 230 98 163 63 54 8 -3 -152 30 -82 -248 -76 -190 -156 91
4542I1j26K7J65k74J77P5k49J77K8J19k13M6J20oj29K65j15j33K83k00K7k64J7
$$ 91 -35 -8 157 -117 60 135 -114 63 91 210 -3 43 163 157 28 293 178 45 328 128 155 -109 -92
4565i2K2p5L02j32O4Q2j11K9l42K71j97L40j04O3j75J68l79K42k49J25J2j90M59
$$ -92 -70 -145 157 25 89 171 60 89 -253 18 -179 161 57 120 -55 113 -266 -24 -273 -148 -136 -326 133
4588A33j73q8K56k13M7K18k85O6l4o7L11j45K20k86k4M4J41k06J03k0K91l71J8
$$ 133 -40 -128 128 -85 -38 180 -105 -39 -73 -140 171 26 246 -40 -64 -20 121 -85 18 -2 289 -82 -64
4611f4L05j22j54j55K37N5k40k4K00k96K95k41R7J00K09o48K22M04n22K53q1J8
$$ -64 241 119 -35 -190 47 102 -138 -162 38 -258 37 -204 -107 -7 202 -446 -224 180 -342 -89 -170 -152
4633a52r9K18N3p3O8j60O8K7Q5j22m6K02j50l8n3L08l5o5J1L07l68J1K17k41K18
$$ -152 -251 -33 20 -53 15 -145 -77 -50 35 -87 -133 69 -81 -119 -172 136 101 36 47 354 -14 -3 214 -27 191
4658A91l16j22L74j94L07l24J92j64j11J14K60L5j89j42m9J09Q1j6o6r7J3N6j
$$ 191 -125 -247 127 -67 240 -84 108 -56 -167 -53 207 242 53 -89 -138 -29 52 36 -30 -127 -114 -58 -59
4681e9K98l50N1j3N4Pj22J12J45k30M2q5K27J23m58K52J61j32j47K45O5l64L28
$$ -59 239 -111 -60 -73 -19 -12 -134 -22 123 -107 -65 -150 77 200 -258 -6 155 23 -124 121 186 -178 150
4704A50N6j34j28J33k00pJ63P6j07j93J99o0J73p7R7r4k07K5J50j69O3k19M13
$$ 150 206 72 -56 77 -123 -130 33 109 2 -191 8 -52 121 44 141 47 -160 -135 15 -154 -91 -310 103
4727A03k11k0K64J2l7l1j30l3O3Q7j27j21J01L02j12J72l93K77j35p7j59J67N3
$$ 103 -108 -128 136 148 111 80 -50 -83 -20 67 -60 -181 -80 222 110 282 -111 166 31 -46 -205 -38 15
4750A5j58J1K76j52R7m0k81L89j23k29K47q2j9J9j7j80K56P1L3O1j74j4J98N0
$$ 15 -143 -132 144 -8 89 49 -232 157 34 -195 52 -30 -49 -30 -47 -227 29 100 133 194 20 6 204 254
4774B54l88K92L5m7j78RN6p2P1l35L60Q1j37RQ5l20K75O9K1k14M8O8j12J76K42
$$ 254 -134 158 193 146 -32 -23 33 -39 32 -303 57 138 1 10 95 -225 50 119 140 -74 -26 42 -70 106 348
4799C48k74J63o1K40o89M71l03J11J10q2N6j98J63R5L3r0L09o50L75m0K9K4m03
$$ 348 74 237 176 416 -273 198 -105 6 116 34 90 -108 55 150 183 93 402 -248 127 87 116 140 -263
4822b63K69J06J32q4j13k95R3N63m09M4j06R8J19n6K61l31m7K12l5k69K3K03o4
$$ -263 6 112 244 160 47 -248 -155 408 -1 43 -63 35 154 98 359 28 -19 193 158 -111 -88 115 51
4845E1o7k0J18j23j07K62R6qk42q6K18j11J25p2L3J57J65l75j9m8J84r7k56K62
$$ 51 -16 -36 82 -41 -148 114 210 202 -40 -126 92 -19 106 34 67 224 389 14 -5 -53 131 34 -222 40
4869D0j9J96k50J48J12j28j97k03M29k07J58M8k05J96j88P9K57k63N8J3n9K86
$$ 40 21 217 -33 115 227 99 -98 -301 128 -79 79 127 -78 118 -70 9 266 3 61 74 15 301
4891C01m15L54m45O8J69J25m32M53j53j94J21K74k21j0j10K79j53r7M41l21J16
$$ 301 -114 240 -205 -137 32 157 -275 178 25 -169 -48 226 5 -5 -115 164 11 -86 355 34 150
4912A50j99J93k60N44k36j91j95KJ31J4j19R9J71L14n11R0r7n6K04J49o2k93j6
$$ 150 -49 144 -116 428 192 1 -194 -192 -61 -47 -166 -67 104 418 -93 -3 -100 -156 48 197 135 -158 -174
4935a74J38J86j35N7J48k38j32L37j3j53m1L9P0K95m69R9j41J03l9j65L62k13
$$ -174 -36 150 15 72 220 -18 -150 187 174 21 -20 19 89 384 -85 14 -127 -24 -63 -228 134 -79
4957g9K13k24N2K65q3l08L8m9L43o1n8j06J17j06J09j6J26p2j0j31J93k31L7j23
$$ -79 134 -90 -38 227 144 -164 -126 -175 168 107 49 -57 60 -46 63 47 173 101 91 -40 153 -78 -41 -164
4981a64l0K65q7l3j52lK75j53J94m2k9q0R5r6K16Q5m49L67j18k11J62K21j93J15
$$ -164 -194 71 -16 -49 -201 -204 71 -82 112 70 41 -39 56 -40 176 261 -188 179 61 -150 12 233 40 155
5005A55m4j61N1K63l21J57j86j30P0j98K59J24k8K05j75P3j24m8j50K68j08K18
$$ 155 111 -50 1 264 -57 100 -86 -216 -146 -344 -85 39 11 216 41 114 -10 -58 -208 60 -48 170
5027A70r0j24N7J18j90lK7O6N8P6m0l89M68n6k51J32j47RJ07J94j38q6k0K4q5
$$ 170 80 -44 13 131 -59 -62 -35 31 89 165 125 -264 204 148 -103 29 -118 -109 -2 192 54 -32 -52 -28 -113
5052a13K59q8L3j14J41k2J80k42j86L35k87L29k73j04K92j10j49N9M5k94L60n
$$ -113 146 58 91 -23 118 96 276 34 -152 183 -104 225 -48 -152 140 30 -119 -60 -15 -309 51 46
5074D6o2J50o6nj85K56l37L72L8L7q7l4K5j74N2K4r8K51j84j7J5J0k08J82qj79
$$ 46 -16 134 68 63 -122 134 -203 169 207 244 157 123 148 -26 26 50 -48 203 19 2 17 27 -181 1 -7 -186
5100a86M58k41K05K5j44M7l50J44L9j50L72j64RL3k10P0o2n8J77J50l89L24M3
$$ -186 272 31 236 261 117 164 -186 -42 -3 -153 219 55 64 97 -113 -43 -105 -163 14 164 -225 99 142
5123A42n4j07k66J97J43j41J51k6j16J10l4O4J22j40K6n1L7o3J50q6M6j26N1l00
$$ 142 88 -19 -285 -88 55 -86 65 39 -77 33 -1 63 185 45 71 20 57 -6 144 58 104 -22 29 -271
5147b71M39O6l25K63n3k13M15n76RR6K87j89J26M5l38J39r7J95k3K6m14M92kJ01
$$ -271 168 234 -91 172 119 -94 321 -255 -246 -150 137 -52 74 119 -219 -80 -177 18 -5 21 -393 99 97 198
5171A98j26K1Po7j44J27K95n76K74j40P9O9o7J65q3J24j67m9K14j23j59J8k0M56
$$ 198 72 93 100 33 -111 16 311 -265 9 -131 -52 17 -50 115 32 156 -11 -60 154 31 -128 -110 -130 326
5195C26l74K19k84K02N0j95q0P2K02j35N9J16k11J22O4j11R9n3J33j36k05J84
$$ 326 -48 171 -113 89 139 -56 -136 -64 138 3 62 178 -33 89 153 42 141 88 221 85 -120 64
5217F4j87R4j61j36K79L8m7N8q5R7K9j04J87j01j78L49ok51J85J15k20n3n0R7
$$ 64 -123 -29 -190 -326 -47 -9 -56 2 -83 14 43 -61 126 25 -153 196 190 -61 124 239 19 -34 -84 13
5241A3j72L42l90O5k12L70k28K35J81k30J23J5J92k50J50Km87L11j89R2J58p4
$$ 13 -159 183 -207 -142 -354 16 -212 23 204 -26 97 112 304 54 204 206 -281 30 -159 -67 91 17
5263A7K21l95K28k1N3L5j18k04M53j35p9N0l56K62J74k70O2j2O1K17m23J88j2
$$ 17 238 -157 71 50 103 138 20 -184 269 134 55 105 -251 11 185 -85 -23 -35 26 243 -180 8 -4
5286dK15l57L16N0r9J48k67L2nN8k34L76k20k6j30L75j98K76k28j68Q3kL0n9j32
$$ -4 211 -146 170 220 121 269 2 34 29 87 -147 229 9 -17 -147 228 30 306 78 -90 -7 -9 21 -38 -170
5311a70J57Q3n1p8K25l77N1J20J98J64m27J18J16k51m4J99r7J29J54l75J12O4
$$ -170 -13 70 19 -59 166 -211 -160 -40 158 322 -105 13 129 -122 -166 33 -64 65 219 -156 -44 20
5333B0j37K28p2j67J65J08j26j34J48p7k04K31o3N5J99n06J73M18l81K21j30l0
$$ 20 -117 111 39 -128 37 145 19 -115 33 -44 -248 -17 -80 -25 174 -332 -159 259 -122 99 -31 -61
5355f1P6q9K38k40j55K51J52m63K76P7K6k27J61M5j29j11K32j39j03K54k44K92
$$ -61 15 -74 164 -76 -231 20 172 -291 -15 62 88 -139 22 67 -62 -173 59 -80 -183 71 -173 119
5377A19r9rJ19m62L57j26K19j29l3k86M79j90o8pN2K0pQ5K33k70r6l1J29K33k56
$$ 119 20 11 130 -332 25 -101 118 -11 -44 -330 149 -41 -109 -116 -64 -44 -51 34 267 -3 -99 -130 -1 232 -24
5402b4M7M9J56l13J58Q4Mm7q9q9J30j5j01R5k64L48k74N7Q4J56j35j64N2m3J97
$$ -24 23 72 228 -85 73 157 161 114 25 -64 66 51 -50 45 -219 129 -145 -88 -4 152 17 -147 -95 -138 59
5427E9J02q2p8q5j22K82j35N8P7J32j11o9l8k04J11P8K7M9j32j74K17k0K96j94
$$ 59 161 79 1 -84 -206 76 -59 -1 76 208 97 28 -10 -214 -103 -25 2 51 -81 -255 -38 -58 238 44
5451D4j96m8K28m5P5k09J29k46L50QL8M4l39J13Q3q3J6K48l42p1O7L35k38RJ2
$$ 44 -152 -200 28 -17 58 -151 -22 -268 82 90 128 172 -167 -54 29 -54 -38 210 -132 -203 -136 199 -39 -30 -18
5476a8k2rJ29j12J07k65K10K41j80l7J84r7l07K26M0l4k6n2l9K06l3j65J33k6
$$ -18 -40 -49 80 -32 75 -190 20 261 81 44 228 131 -176 50 90 56 30 -22 -61 145 112 -53 80 54
5500E4k18o9J44M5J51j99n1k5L66m28L35k12n4K14j6q8OJ29K0l2k90Q7J83K12
$$ 54 -164 -233 -89 -44 107 -92 -143 -168 198 -230 105 -107 -161 53 37 -51 -45 84 104 72 -218 -131 52 264
5524B64k62N7j36J81k02j2J82j14j79K44j91L18J01j48j92L25l03M5j7J05J65
$$ 264 2 59 -77 104 -98 -110 72 -42 -221 23 -168 150 251 103 -89 236 -67 -22 -39 66 231
5545B31j16k00J76j69K69j99k1l4P8K42k66Q7o5J18p6j16K75k74j76M43r1j11
$$ 231 115 -85 91 -78 191 -8 -29 -63 15 257 -9 78 13 131 55 -61 214 -60 -236 207 116 5
5567EL05k86l75L47J0q8j00K81k05q6K40n2J72j35l67M84L1r2M7k82K24N2k12
$$ 5 310 24 -351 -4 6 -82 -182 99 -106 -192 48 -4 168 33 -334 150 181 89 136 -146 78 130 -82
5590h2L7L11l09K24k8r0k19L09l42L30k41J76j46L28m27k9K15n6Q7L8J17k17R2
$$ -82 -45 266 -43 181 153 63 -156 153 -189 141 -100 76 -70 258 -169 -198 17 -39 48 86 203 -14 78
5613G8J36m6l21J92J9j36L03n7k89j0N5M6J1n2K4j12K71m9J83j94j59j7J05J8
$$ 78 214 168 -153 39 58 -78 225 168 -121 -131 -76 -30 -19 -71 -47 -159 112 63 246 52 -107 -124 -19 -1
5637al0l2J37j01K08J5k40j85M31j52K45l5k21m2k04L28k73K15n6p9J2p5K55O4
$$ -1 -31 -63 74 -27 181 196 -44 -229 202 50 295 260 39 -3 -207 121 -152 63 7 -72 -60 -135 120 184
5661A84j21Ll2J52l20QqJ73J50j40O1j94J50K5j1l89M01K20k88N1l87L05k0p7
$$ 184 63 66 34 186 -134 -126 -134 39 189 49 110 -84 66 91 80 -309 92 312 24 75 -312 -7 -27 -104
5685a04J45J07k33l5L21l48p4M00j25k60k1J20J88j87J0M4j43K30l58L53k47J79
$$ -104 41 148 -85 -120 201 -147 -221 179 54 -206 -227 -107 81 -106 -96 -52 -195 35 -323 30 -217 -38
5707c8J88l16K48j20NM2lJ12K04m47p3L15j81k17K97J08R8l02J48k01J76J22j99
$$ -38 150 -166 82 -38 -33 9 6 118 322 -125 -198 117 -64 -281 16 124 222 -80 68 -133 43 165 -34
5730c4J45k51P6l2j23K34J81j08M9j86j5L50j41k12Q%k2N6M6r3J87l30J99J68
$$ -34 111 -140 -64 -96 -219 15 196 88 137 -49 -64 286 145 -67 -59 -59 -81 -25 21 -72 115 -215 -16 152
5754A52k74K94R0j99k86J82j8K12l73K71l83M90k89L85j8k57O1J11k84K38m6m6
$$ 152 -122 172 262 63 -223 -41 -59 153 -220 51 -332 158 -131 254 236 -21 40 151 -133 105 59 13
5776A3k6O1j0O6j58O2J11j67K98l58o3J15J96K66k93N2k53j18o2K36p7O7M7p5
$$ 13 -13 48 38 104 -54 8 119 -48 250 -108 -171 -56 140 406 113 165 -88 -206 -268 -32 -109 -42 5 -70
5800g0L8K31k88J66l8r5p6J49J95k15J01Kj86K57r8O7j89q1K03j30K2N4r2P9M5
$$ -70 -32 199 -89 77 39 -56 -132 17 212 -3 98 100 -86 171 73 140 -49 -130 73 -57 -35 19 -73 6 51
5825E1j8j04j35J84p2K8K7j5j9K4j02J73J2k00K81Q5j7j70j34J69R2P5j42k40
$$ 51 33 -71 -206 -22 -94 -66 -39 -54 -73 -49 -151 22 34 -166 115 200 183 13 -121 48 140 215 73 -167
5849a67K22k82j17K96J60r3j13Q5K93m12O1KK81l14p1Qm2L94j6j64o6J54l2n4
$$ -167 55 -227 -344 -48 112 19 -94 -9 284 -128 -67 -65 216 -98 -169 -161 -203 191 175 11 -55 99 67 13
5873A3r2J07q2J20Q7j41M8j39M3K60j22m6P4n9J62j69q6J10rj0q0pj08k41N53
$$ 13 -79 28 -54 66 153 12 60 -79 -36 224 102 56 130 71 233 64 -22 88 79 69 -11 -18 -126 -367 186
5898A86m36L15q4M14k32l01M08m30J3MJ51k28R2K46M8L0m17K42O1j92R2Q3L4k92
$$ 186 -250 65 -19 395 163 -138 270 -160 -147 -143 8 -220 -128 118 166 196 -221 21 82 -110 -18 65 99 -193
5922a93J49j20K81l07L04J2ok15j29K25Q9j39K3J57j57J3r2J05m5rJ31M0k59K01
$$ -193 -44 -164 117 -190 114 126 120 -95 -224 1 90 -49 -26 131 -26 -13 -105 0 -45 -54 77 117 -142 59
5946E9K18o2p7M6k36J51p8j56K98l49L45l33J55j24p8M19n42M19q2k2j37Kj54
$$ 59 277 215 138 184 -52 99 21 -135 163 -186 159 -174 -19 -143 -221 198 -344 75 -7 -29 -166 -164 -318
5969c18L32o6K49j81K7k18M52j70j56k73K49K18J21j29l90L95J19j88r2j42J77
$$ -318 14 -52 197 16 43 -175 277 107 -49 -322 -73 145 266 137 -253 142 261 73 -19 -161 16
5990A6jk8L7l32N47k56R0j52J81o4K80l34nj06K31j72j93J40p4J80J91j39m82
$$ 16 15 -13 24 -308 239 -17 73 -79 102 38 318 -16 -21 -127 104 -68 -261 -121 -195 -15 176 37 -445
6013d45O31r5j78k5J95j73m0R4o2J70l7m2L4j89J69J6n0O6J75k27j69L21k12K0
$$ -445 186 91 -87 -112 83 -90 -130 -36 -98 72 35 -7 27 -162 7 23 -27 39 214 -13 -182 139 -73 -53
6037e3J77L1k6k76J75NJ54k05J10p7k7J1j03J12n6rJ1n5K12n9p9K4Q3k27p5J63
$$ -53 124 155 129 -147 28 33 187 -18 92 15 -12 -1 -104 8 -48 -57 -46 -101 111 52 -27 -3 80 -147 -222 -59
6063e9Q4J43qp6K25k45j26K50J9l43K25n5M50l35k02J56k22K07l44L3K50n6k33
$$ -59 25 168 160 84 309 64 -62 188 207 -136 89 34 484 149 -53 103 -119 88 -256 -223 27 -29 -262
6086b62M56k02N06n77N9j88j64L91l4Q8p6K26j81L3j36J26o5N7Q9k07K02m62L53
$$ -262 194 -8 498 -79 -20 -208 -372 19 -15 73 -3 223 42 75 -61 65 0 57 146 -61 141 -321 32
6109C2k15J4K9J28Q0m2L4j98K59j56r9J33J97K2l10J55O8K1q3q8O5l3l2k42K64
$$ 32 -183 -169 -140 -12 68 26 60 -138 121 -35 -134 -1 196 218 -92 63 131 152 69 -19 46 13 -19 -261 3
6134Cn1m6K81l03J79k47K57m3J5J30k55J7n8R4L0r8O1M4o7K55m7k07K15k80K21
$$ 3 -48 -94 187 -116 63 -184 73 30 45 175 -80 -63 -121 -27 3 -95 -34 10 -57 198 151 -56 159 -121 100
6159A00k72k0J25k9K80m9j48j62K51o4K17l61K52k27K69j09n9q0K7j07Q3Q6j32
$$ 100 -172 -192 -67 -96 184 135 -13 -175 76 12 229 -132 120 -107 162 53 -6 -86 -59 -166 -83 3 -129
6182a29j10L37m83L00J57m6J16r6j13M7J50k66M8J50P4k10J33j45o9K08j00O7
$$ -129 -239 98 -385 -85 72 26 142 46 -67 -20 130 -136 -88 62 136 -74 59 -86 -155 53 -47 20
6204B0j99N7J94j23J80k66J26P4j85oJ98k53k9M83ql66J33q0n5O7K09n0j29P5
$$ 20 -179 -122 72 -51 129 -137 -11 63 -122 -128 70 -183 -212 271 263 -103 30 -50 -105 -38 171 121 -8 67
6228F7K6k05lk7m3J99J12l94L06J96j86j33J27nk8j52K7j8J83l26K19J66K13j07
$$ 67 93 -112 -115 -142 -185 14 126 -268 38 234 48 -85 42 37 9 -143 -116 -134 49 -277 -58 108 321 214
6252B14j83M7N1k35N3J37k43J15k41L56P1l11K10p9j17qJ21j8K10n4j11J85R3
$$ 214 31 78 129 -106 -53 84 -159 -44 -285 71 142 -169 41 -38 -155 -163 -42 -60 150 96 -15 170 263
6275B63k65r3L1J11K15k87M2j5r9J22l5J9p2l1K54L7o6k8n4n6J5k06L38m3j17
$$ 263 -2 -95 -64 47 262 -25 17 2 -97 25 -10 9 -63 -94 160 197 131 103 49 -7 8 -198 140 97 -20
6300b0j6L1KJ30m29M23k22k10K63J41J08l66q3L03k2j63o7J05R8J39o2m7j54J64
$$ -20 -36 -5 -3 127 -302 121 -101 -311 -48 93 201 -165 -248 55 33 -130 -197 -92 6 145 83 36 -118 46
6324D6P6P9j70J6n05L97L9j50P6M6K53k28J20k65J81Q0J7q1J00j26J76n8nk19
$$ 46 122 201 31 47 -458 -61 -22 -172 -96 -50 203 -25 95 -170 11 91 108 27 127 1 177 119 114 -105
6348a05J26j65K80m0k20J66J79k24j39K24J4j07l6J54j40J19P7n2j21j86K41p2
$$ -105 21 -144 136 96 -124 42 221 -3 -142 82 96 -11 -47 107 -33 86 163 111 -10 -196 45 -27
6370b7m6J2P3j7j1j77j2J50J69j44r0J57j85J85l12M15k20P6R7J99q9k95J85j25
$$ -27 -73 -61 12 -5 -16 -193 -205 -55 114 -30 -120 37 -148 37 -275 140 -80 -4 93 292 203 -92 93 -32
6394c2O1K2o0J95l05J08P0j68L44k44J2j3J76k43j8L25k20j85L03j11M3J85k94
$$ -32 29 51 -9 186 -119 -11 59 -109 235 -9 3 -10 166 -77 -95 230 10 -175 128 17 60 245 -49
6417d9j71L47q1k06M1J34j10j21pN0J10J07J43l42L18q4K16r2l50J26j62K68j43
$$ -49 -220 127 46 -160 -119 15 -95 -216 -223 -173 -63 44 187 -155 163 79 295 203 -147 -21 -183 85 -58
6440e8k5K22k25J67J22j62j97K24j12J90l78L85j07j86J29j34L23n8j7k34J27
$$ -58 -83 139 -86 81 203 41 -156 68 -44 146 -232 153 46 -140 -11 -145 178 120 103 -131 -4
6461dj90J84K4R3P5j58L6M6l3j39KJ51j17j38L31j87k5K52k03n0L06l70oP2oM22
$$ -4 -194 -10 14 107 182 24 60 106 73 -66 -64 87 -30 -168 163 -24 -49 203 0 -50 256 -114 -120 -48 -54 368
6487C68l41m7m6K38j05r9N6mk69N17j88j79Q9j58L41j41k5k30r5N00J87k59j99
$$ 368 27 -20 -66 172 67 -32 24 20 -249 268 80 -99 -10 -168 173 32 7 -223 -318 182 369 110 -89
6510h9k8M93o98M00n8M8p1m5N8J33k91o2J41r7J5J54n9L2O1k14K58k25m4J6R0
$$ -89 -117 376 -322 78 20 68 -3 -48 10 143 -148 -210 -69 -166 -151 3 -56 -24 37 -177 81 -144 -188 -172 -82
6535h2O6Q5j64L8r4k7K70QQL4k0j2l9j7m29N54l53K78k94L7M7K67O3l01j07M9
$$ -82 -16 69 -95 -57 -151 -178 92 100 108 142 122 110 71 54 -375 179 -174 104 -190 -153 -106 161 224 -77 -184 -135
6561a35K52l27L17qj63K0M2J18J31m02M52l40R2J4QM8j9j43r6L12q5Q5o01M46
$$ -135 117 -210 107 99 -64 -44 -2 116 247 -155 297 -43 49 63 71 119 100 -43 -139 173 88 173 -428 18
6585A8l7J06Q5o3j78J62j17j31J34l0O4K4o1l8J98j10j56K62Jm5k31J4K84j23
$$ 18 -19 87 172 109 -69 93 -24 -155 -21 -51 13 37 -24 -62 136 26 -130 132 133 88 -143 -129 155 32
6609C2r9K02j72k49M22l08M0J34K48J72j74n10M22j53J00%jl9o0J2j30j02K25
$$ 32 -67 135 -37 -286 136 -172 -132 2 250 422 248 -262 160 7 107 107 106 67 7 19 -111 -213 12
6632A2j55K51r8O3R2j39m3%N5k8l04J99p0J19j08J80J3M9k12J85j15k60M52j00
$$ 12 -143 108 10 73 165 26 -17 -17 38 10 -294 -95 -165 -46 -154 26 39 88 -124 61 -54 -314 138 38
6656C8p9K98k06r7J91j52J78k41K02j91N9P1J3J36m94L82j32jq2j27L00K7k25
$$ 38 -41 257 51 -46 145 -7 171 -70 132 -59 0 71 84 220 -274 108 -24 -25 -107 -234 66 93 -132
6679a32k3N22o75J7L19j08K85n2l57O8J20K9j91J58R0k72m9M22k35J18k58K55
$$ -132 -155 367 -308 -291 28 -80 205 153 -204 -136 -16 13 -178 -20 70 -202 -251 171 -64 54 -204 51
6701E1p0J78j17k04n8J74L07l31K86p1m05J98j3K78j46j1k98K25M1KK87k41j04
$$ 51 -19 159 42 -162 -220 -46 261 -70 216 145 -260 -62 -75 203 57 46 -252 -27 14 16 303 62 -42
6724d2k68L98j18J19k44L85j27j59R0K7j09N0k48L00J53m38R0Q0J34n6k06M07
$$ -42 -310 88 -30 89 -155 230 103 -56 34 61 -48 2 -246 54 207 -231 -141 -61 73 17 -189 218
6746B18m9j25R5m9k10K11K2K8m1r6j7Q5q1J4m2J77k45R3J30n62L74k09M10k70
$$ 218 169 44 139 90 -120 91 113 141 100 4 -13 72 -9 5 -37 140 -105 -12 118 -444 -70 -279 131 -139
6770a39R6%q6P6r1L4J03o8O3l6J49j04J60j26k63K30j5J93k9l15L35R7k71J07
$$ -139 -43 -43 -129 -53 -144 -110 -7 -75 -12 -48 101 -3 157 31 -232 -2 -17 176 147 -168 167 264 -7 100
6794A00o3k05L61k74j68K46l4N9m9k06L29J64j33J14m37L55q3k09P0K67k27N2
$$ 100 37 -168 193 -81 -249 -3 -37 22 -27 -233 96 260 127 241 -196 159 76 -133 -63 204 -23 29
6816B9O9l2o9J50q8l09K84k55n8K84r6M3J41k5q2P2k62J81J3n3k3q7K25J15j60
$$ 29 98 66 -3 147 59 -250 34 -221 -279 5 -91 -48 93 68 -14 58 -204 -23 -10 -63 -86 -173 52 167 7
6841Gj65K07j77L18j65l1J3M6O7K4j96n7J95n6K4Q4j75L9L77m43J81k24j8J3L81
$$ 7 -158 49 -128 190 25 -6 7 53 120 144 -52 -109 86 30 54 138 -37 2 379 -64 117 -107 -125 -112 269
6866B69k43j7j91j34N82j98j66OQ7k02L21j35J15k64M3N56m56J13j79l3O5p6l9
$$ 269 26 9 -182 -316 266 68 -98 -92 -5 -207 114 -21 94 -170 -127 429 -27 86 -93 -126 -61 -137 -176
6889a76J55O6n5OJ59j57LJ26j18K11m46K59J23k34K54l39J64QP5kj13o2K66j1
$$ -176 -21 45 -10 -4 155 -2 1 127 9 220 -226 33 156 -78 176 -163 1 9 84 82 -31 -93 173 162
6913A62k94R4K13k28J51j86J05J0j86J27m0L2N0j88j23K43j44J57K2o2P9k20K86
$$ 162 -132 -38 175 -53 98 -88 17 27 -159 -32 -72 -40 10 -178 -301 -58 -202 -45 -23 -85 -6 -226 60
6936F0o9r7R1KJ24L5k02j26M33n1ol2q3j70K65J15j09l12R2Jj2L6j15r9m1K60
$$ 60 -9 -106 -15 -13 111 146 -56 -182 251 200 194 162 79 -91 174 289 180 -132 -40 -39 -51 -15 -130 -229 -270 -10
6962a0K7J84k15J47k00J05M3j31Q3K0j93q1M4K95k02M7o7K29j35L8J60k93Q0Q3
$$ -10 17 201 -14 133 -67 38 81 -50 33 53 -140 -221 -177 118 -84 -37 -104 125 -10 28 188 -105 -25 58
6986E8P5j33K31l6m4j13k46J17J85R4M1M9j09j23k9M2L0o4j50J42r5J20m2r2J69
$$ 58 133 0 231 195 151 38 -208 -91 94 188 229 278 169 46 17 59 89 25 -125 17 -78 42 0 -92 77
7011G7j12K63k87q4L78l63r5j41M64L0l54pJ65k5j84J2K48q8m4L48M3k09J63l27
$$ 77 -35 228 -59 -143 235 -128 -223 -364 100 130 -224 -231 -66 -91 -275 -263 -15 -103 -147 201 244 35 198 -129
7035a29k87J30L06O1k4l8NN9J0k27J72L1j69%J54o0L1J06o8K09jk37kj92O6Q5
$$ -129 -416 -286 20 81 57 19 24 83 93 -134 38 69 -100 -100 54 -6 25 131 63 272 271 34 32 -160 -94 -9
7061ip6J8K05k89J04M5M7J4m1j10j8n8K86om15K87L22j57M8j06J38l41j82L06
$$ -9 -85 -67 138 -151 -47 -2 45 59 18 -92 -110 -168 118 112 -303 -16 306 149 197 91 229 -112 -294 12
7085A2K13l49J88n75M44J90M6N4j69J9m10J71J38k6Q4j28N2J16j65P0l9l0OL28
$$ 12 225 -124 64 -511 -67 123 169 223 54 73 -337 -166 -28 -54 30 -98 -46 70 -95 -25 -64 -94 -88 240
7109B40j68j22J95j4j48l0l9P1j0J22k00J40j20K01k12j85M59l83L50k18%K68
$$ 240 72 -50 145 131 -17 -47 -86 -15 -25 97 -103 37 -83 118 -94 -279 180 -203 147 -71 -71 197
7131A97j24R2O2k53k23J47N8L82k19j33J6k95M34m04L90M9j67Kj69K36m9O9o6
$$ 197 73 165 227 -26 -249 -102 -44 338 119 -14 2 -293 141 -263 127 176 9 11 -158 78 29 98 32
7154C2j23p5j48M34m02K28m4j58K25J48L8j87j64K08L3o8L89j83j42n9mk19J74
$$ 32 -91 -166 -314 120 -282 -54 -98 -256 -31 117 155 -32 -196 12 45 -23 366 183 41 -18 -22 -241 -67
7177f7M2N8j04p6N9J8q4J53J39p1m56L84k40K4L41ml52L9l2K92j72k5Q0j65K47
$$ -67 -25 33 -71 -147 -88 -70 -154 -1 138 67 -389 -5 -245 -221 120 116 -236 -197 -229 63 -109 -134 -54 -219 28
7202B8J29J21l09l27K84n0j52K47O1N6j44k26J28K84k55K79k92K06J84k37Q4k09
$$ 28 157 278 -31 -358 -74 -124 -276 -29 32 88 -56 -282 -154 130 -125 154 -138 68 252 15 99 -110
7224a10j46J90J19l48M33k20K66k01j11M10l80R4k2Q0M3j48K51k34k90M93m03
$$ -110 -256 -66 53 -295 138 -82 184 -17 -128 282 -98 -4 -26 54 97 -51 200 -34 -324 169 -234
7245b34r2O19k89J52p1l67M08m4k08K05j62Qk37K12J54Q5k11Q6j43r8L65j36k05
$$ -234 -326 293 4 156 85 -282 126 82 -126 79 -83 -75 -312 -100 54 139 -72 14 -129 -227 138 2 -203
7268b03L02K7q1l32K93l6q6K11l27J01K67l45K02R0M7k20j94L94j12R0J00nj76
$$ -203 99 126 45 -287 6 -30 -116 95 -232 -131 136 -209 -7 83 130 -90 -284 110 -2 88 188 183 7
7291Gj7j09L07k29o7J00L47l36K11p1m58L09j5j12K00k00K46j18K31k72J13k8
$$ 7 -10 -119 188 -41 -108 -8 339 3 214 143 -315 -6 -21 -133 67 -133 113 -5 226 -46 67 39
7313C9k03K29j95J61j27P2L30k54k99M56j48%r1J79j09k67M11k57j48L21j57k3
$$ 39 -164 65 -130 31 -96 -24 306 52 -247 209 61 61 -30 149 40 -227 184 -73 -221 100 -57 -80
7335h0J72rj39O9K05m71M03j67r1J81j21k20K66J67q1l6K46j99l19M90j50J4p6
$$ -80 92 83 -56 13 218 -253 150 -17 -108 73 -48 -268 -2 165 84 48 294 95 -224 266 116 130 54
7358E4p6n3J50J91j83N1j37l8J5R8L7k35L5J57r2R4k72K89k8k18j18K77L7N1j9
$$ 54 -22 -75 75 266 83 134 -3 -41 -26 72 109 -126 -91 66 -26 68 -204 85 57 -161 -279 -2 35 86 67
7383F7k6k6j12J67j11P4p0k2K7N9k8j58j2K62qj47K03J26j50j86P4n7j7o3O7K14
$$ 67 41 15 -97 70 -41 33 -37 -59 -32 27 -1 -159 -171 91 83 -64 139 265 115 -71 3 -54 -71 -134 -67 147
7409A47m7j54p6J79j82J90j23k9J9N16k51j95j24K14j34J68j20k0J61J9j22P8
$$ 147 100 -54 -130 49 -133 57 -66 -95 -76 440 189 -6 -130 84 -50 118 -2 -22 139 158 36 114
7431A14L7k47p7M73j78J7r9p4k8M60m72K22k84J09j9q0J93q7j01P0pP2q2k6K6
$$ 114 151 -96 -173 300 122 139 40 -34 -62 398 -74 148 -136 -27 -46 -126 67 -20 -121 -51 -58 14 -68 -94 -68
7456f8j76N48m34K69M2J73kj45j34p4k8J26K7k37L1l6J65m2J20j09q3QK25l23
$$ -68 -244 304 -130 139 181 354 352 207 73 -1 -29 97 124 -113 -82 -118 47 5 125 16 -67 -59 166 -157
7480a57J82L8k2R5l35J40K56o7M5l11R3L02m04L08l53K03r5r8%j05L38J9k10k
$$ -157 25 63 41 136 -199 -59 197 130 175 -136 -43 259 -145 163 -190 13 -82 -180 -180 -285 53 72 -138 -140
7504a40j35K23K15j49r2J62K19j53N6ok04Q0k11K72l29J55L1K6r5J70j78J37M9
$$ -140 -275 -52 163 14 -78 84 303 150 206 200 -4 76 -135 137 -192 -37 -6 20 -75 95 -83 54 103
7527A03N8l04R2J41l2k82Q7L30k82J97j83jMj19L85R4l59pK9R2qj31R6q0k2J27
$$ 103 161 -143 -51 90 58 -224 -137 193 -89 108 -75 -76 -72 -191 194 288 -71 -78 -49 43 35 -96 0 -80 -102 25
7553B5J33J7j69J41p2j67J44P6k09lJ67K7R2k73R0m1J11m0p0n4K64n0K8k95K19
$$ 25 158 175 6 147 75 -92 52 128 -81 -84 83 110 202 -71 19 -22 89 49 -21 -75 189 139 167 -128 91
7578I1j4j30j54p3J48J16k20M72j24j60R0K28k66M3K75l40M3j92K75k09M2J11
$$ 91 77 -53 -207 -280 -132 -16 -236 236 112 -48 42 270 4 47 322 -18 25 -167 108 -101 -59 52
7600E2p0p1Q2J6j0OR2K6J7m0J79k14k04j7L05j32j81M09r3J85m78K58k72J14K00
$$ 52 -18 -89 -7 9 -1 5 97 123 140 100 279 65 -139 -156 149 17 -164 245 152 337 -141 117 -155 -41 159
7625A59o5n4k14Q1J47n1K04j99J0p9O4O9j58jK04J20k92K03k8L8k91J24P2Pp6
$$ 159 94 40 -174 -93 54 3 207 8 18 -61 3 72 -86 -87 117 237 -55 148 120 158 -133 -9 63 70 -6
7650fj14K30j75K06k38K32m30K31J22J08k0K1J64j82l38L31j7l29J99j59L00q
$$ -6 -120 110 -65 141 -97 135 -295 -64 58 166 146 167 331 149 -189 142 125 -204 -5 -164 136 128
7672A28L6k94J19K54l54M33k13M5k67L96K7k12l19J5K76M5n3n9L6k08qJ87L3j32
$$ 128 164 -130 -11 243 -111 322 109 154 -113 283 310 98 -221 -206 70 115 62 3 39 -169 -177 10 43 -89
7696h9j7oL8J59k21J10P0k25M0n3pL9M19l43J11J7k99M92j79P8J51m42K7J6L46
$$ -89 -106 -112 -74 85 -136 -26 44 -181 -141 -194 -201 -162 257 -86 25 42 -257 235 56 134 285 -157 -130 -114 232
7721B32j57l1p4L56k05q7r4J57j46J38K11k05j60n4j03J55o7M3M21j31l17P8K1
$$ 232 75 44 -30 326 121 34 -60 97 -49 89 300 95 -65 -119 -222 -67 -134 -91 330 199 -118 -40 -19
7744a9p8r2N9%K53j50o5J11O4L7l03L27P0k28k04K21n6J12O3m1j28o3M4K65J04
$$ -19 -97 -189 -130 -130 123 -27 -92 19 83 120 -183 144 214 -14 -218 3 -53 59 122 81 -47 -110 -66 199 303
7769C03q7j48l26K1k28N49O8k66nK52k04K34J27l84J68O9l82M69k22p8K04j61
$$ 303 216 68 -258 -237 -465 84 152 -114 -119 133 -71 163 290 -94 74 143 -239 230 8 -70 134 -27
7791b7k10J97P1r8o7K02j08J19m1k49L31l28M26j63J13j93j14K05o3J59k73k7
$$ -27 -237 -40 31 -67 -134 68 -40 79 38 -211 120 -208 218 55 168 -25 -139 66 3 162 -111 -138
7813a38K37L13m67K33j76k01L66j07r5j0KR1J14j43R0n7m3j00P9J31j49M7J30
$$ -138 99 412 -55 178 2 -199 167 60 -35 -45 -43 48 162 19 109 52 9 -91 -12 119 -30 17 147
7836A47k15n0J35P0j36j2r1J11L21l26K18n9O1l53K84J3p7nj31O2k3K95m17J54
$$ 147 -68 -118 17 87 -49 -61 -152 -41 280 -46 172 113 174 -179 105 118 41 36 -95 -33 -56 239 -178 -24
7860b4j4l3j47K82j70K9P5j14M5J13j5l30M91l23R4P5J75K8j99L6k35J92j84J26
$$ -24 -38 -71 -218 64 -106 -77 -2 -116 -71 42 27 -303 188 -135 -41 34 209 237 38 74 -161 31 -153 -27
7884b7L5J04nj01j07o5L38l25j61K40k6K80j97n7k8J01L71l28j05J6L3J26j52
$$ -27 8 112 107 6 -101 -166 172 -153 -314 -74 -100 180 -17 -74 -102 -1 370 42 -63 -47 -14 112 -40
7907d0k21N0J06J85j23j3q1P5R1Nj63L26k29p5N6J63j32M2J91j76j47J35J44k51
$$ -40 -261 -211 -105 80 -43 -56 -137 -62 29 34 -129 197 -32 -107 -51 112 -20 22 213 37 -110 25 169 -82
7931h2O2M97l63p1%k32M54m68J69j38K04j36N4j66L0K74K42l85j14M31k87N9k46
$$ -82 -20 477 114 43 43 -189 265 -203 -34 -172 32 -104 -50 -216 -186 88 330 -55 -169 262 -25 34 -212
7954b12L21L9k8k11j7N6K5J4o7O9O4jK9l23K00K65Nk11LO9p0r9n2J83j18J47j46
$$ -212 109 148 120 -91 -108 -52 -27 -13 -80 -11 53 52 81 -242 -42 223 228 17 20 89 19 -80 -132 51 -67 80 -66
7981f6Q8Q8r5j0j38O9j37K90j53R2j3J98k62J02J38r8k37J86RNJ6R2k01K24k66
$$ -66 22 110 15 5 -133 -64 -201 89 -64 28 15 213 -49 53 191 93 -144 42 51 56 72 164 -37 187 -79
8006g9p8O1J6J57j96j61L77j48J25m8J7J6k90M75l57L23k33O1qPJ28j17m82L06
$$ -79 -157 -96 -80 77 -119 -280 97 -51 74 26 43 59 -231 244 -113 210 -23 38 30 37 165 48 -434 -128
8030a28K13k6r6J1N2J63k40K76l20J25O1J70k07j87M3K80k18k4M4M3j38J12j34
$$ -128 85 59 -37 -26 26 189 -51 225 -95 30 91 261 54 -133 -90 190 -28 -52 -8 35 -103 9 -125
8053a25J39N9NJ9ol24Q5K07J24m02K07K16l78q6M47r6k39J16J53K11j98j18j03
$$ -125 14 73 78 97 91 -233 -148 59 183 -219 -12 204 -174 -260 187 91 -148 -32 121 332 134 16 -87
8076h7O1k44J05K39p0J7K8j47P2m0O8J05J01k27P7k06K14L6o7j90J59j43L25l00
$$ -87 -26 -270 -165 74 4 21 49 -98 -26 -66 2 107 208 -19 58 -148 66 102 35 -155 4 -139 186 -114
8100a14K26j54L22k73k48L13j05M9K6j15j76J87R9j09o2M2J30m1j44K84q1oK11
$$ -114 112 -42 280 7 -241 72 -33 16 42 -73 -249 -62 37 -72 -134 -92 38 -3 -147 137 56 50 261
8123B61om09K24p5J04p1K25n45j2K51J78rK4j34k59L01j25R1l2Q4LJ74j81j18
$$ 261 255 -154 70 -5 99 28 253 -292 -304 -53 125 116 140 6 -253 48 -77 14 -18 66 69 243 62 -56
8147e6J38j57K19j48M6j28M4J06m3j21K7m3J39k61L00q2o4J24qJ31j82J92j72
$$ -56 82 -75 144 -4 42 -86 -42 64 21 -100 -73 -116 23 -238 62 -20 -84 40 32 163 -19 173 1
8170Aj09J79j38P9p8P0O6j90M7J10k92J66R0J30k84R3P9J59k89J3R9
$$ 1 -108 71 -67 12 -66 4 70 -120 -73 37 -255 -89 1 131 -153 -60 19 178 -111 -98 1
8191A
$$ Imaginary data points
##PAGE= N=2
##DATA TABLE= (X++(I..I)), XYDATA
0@%%%%%%%%%%Pj5J6j6J6k4L2m0M8n6P2q8J04j20J37j61J92k24K56k91L32l79M31
$$ 0 0 0 0 0 0 0 0 0 0 0 7 -8 8 -8 8 -16 16 -24 24 -32 40 -48 56 -64 73 -88 104 -120 136 -155 177 -202 229
33B29m90N54o26P06p91Q87r90J103j228J362j509J669j846K039k250K482k734
$$ 229 -261 293 -333 373 -418 469 -521 582 -646 716 -793 876 -970 1069 -1181 1301 -1433
50a433L011l316L655m029M445m917N451o060O762p584Q564r750J1220j3105J5620
$$ -1433 1578 -1738 1917 -2112 2333 -2584 2867 -3193 3569 -4015 4549 -5201 6019 -7086 8534
65H534j9158K4547l3849N4296j82014J38674L00107l02221j57471J36296R4983
$$ 8534 -10624 13923 -19926 34370 -147644 -8970 291137 -11084 -168555 -32259 62724
76F2724r4600N8728O3374r7091p1259J26826K1631j28546o127J52929L192j38806
$$ 62724 -31876 26852 90226 -6865 -78124 48702 70333 -58213 -64340 88589 91781 -47025
88d7025n1683Q3565O2392R590l7786p0180l6407O5566P3265j2145n5287j7725
$$ -47025 -98708 -15143 47249 56839 19053 -51127 -87534 -21968 51297 39152 -16135 -33860
100c3860M836J2971L2655L1590j8411m3899j2201K5048K1730K405j0055r698m680
$$ -33860 -29024 -16053 16602 48192 29781 -14118 -26319 -1271 20459 22864 12809 3111 -1569
113a569o108j5025J950M0904L1673m6242p5482J1769Q6948L0857n3695l8463J0657
$$ -1569 -7677 -22702 -20752 20152 51825 5583 -69899 -58130 28818 59675 5980 -32483 -21826
126b1826P711Q020L7618J1521n6041l4385M9021L7060m1655k2055N4223J5414
$$ -21826 -14115 -6095 31523 43044 -12997 -47382 1639 38699 -2956 -25011 29212 44626
138D4626p7766l3672Q0973N5253n8931n4052L0764K4958k3510Q197L7875k1251
$$ 44626 -33140 -66812 14161 69414 10483 -43569 -12805 12153 -11357 -3160 34715 13464
150A3464m9419J5521L6499j6840r061L7962o504o6335j883P3473J9741m9665j9405
$$ 13464 -35955 -20434 16065 -775 -9836 28126 21622 -44713 -46596 26877 46618 -3047 -22452
163b2452J6460l414N402L2518m056m1842m50L3285p976k5367K2431K8027k7471
$$ -22452 -5992 -9406 -4004 28514 24458 -17384 -17834 15451 7475 -17892 4539 32566 5095
176E095l9009R910L3083J2834j0934k2525j4369J1971K3244L541r436l021l840
$$ 5095 -33914 -24004 9079 21913 10979 -11546 -25915 -13944 9300 12841 3405 384 -3456
189c456q208O907J9378K767j3313o312j654m660Q120K0110k732k9254j2730K0297
$$ -3456 -11664 -4757 14621 17388 4075 -2237 -3891 -8551 -431 19679 16947 -12307 -25037 -4740
203d740J5817r288q409N749M76j1562L84J6951R297r042j0582j945L049R271J0646
$$ -4740 11077 1789 -6620 -871 -395 -11957 -11573 5378 14675 5633 -4949 -6894 -3845 5426 16072
218A6072k953j8491p983J1720J0892l671n841j312l137m220M465Q829O36o205
$$ 16072 13119 -5372 -13355 -1635 9257 5586 -255 -1567 -4704 -8924 -4459 4370 5006 -1199
232a199n012J23M473N258K300k694l411q10N07Q97K598L128j504p478o117K888
$$ -1199 -6211 -6088 -1615 3643 5943 3249 -162 -972 -465 432 3030 6158 4654 -2824 -8941 -6053
248f053J0806M436q865j0995J489J0179N816l774n906j429M977L972k079m050
$$ -6053 4753 9189 324 -10671 -9182 997 6813 3039 -2867 -4296 681 4653 2574 -1476
262a476J432N544j059q569l195Q240O606m526r164j293N262M238M07k456l311
$$ -1476 -44 5500 4441 -4128 -7323 917 7523 2997 -6167 -7460 -2198 2040 2447 -9 -3320
277c320q28M532M167k159l506J858L075k310l785K422M428j835n990m33L669O3
$$ -3320 -4148 384 4551 2392 -1114 744 3819 1509 -2276 146 4574 2739 -3251 -3684 -15 48
293D8k284N56J923j824k924K625M684l00l575N32K308j95m26K166pl523j574L034
$$ 48 -2236 -1680 243 -1581 -4505 -1880 2804 2504 -1071 -539 1769 1574 1148 3314 3307 -216 -1790 1244
311A244J876m094k587K940J907l469k944L554L811k398k766J698K650j73l21J308
$$ 1244 3120 -974 -3561 -621 1286 -2183 -5127 -1573 2238 -160 -2926 -1228 1422 1249 928 2236
327B236l78j846L40K337p51k086n18Q63R0j993l70J157M01p60p54M89J499j63
$$ 2236 1858 12 352 2689 1938 -148 -666 197 287 -1706 -2076 -919 -518 -1278 -2032 -1543 -44 -207
345b07k26J045R54m07o52Q40J213o27j231q65M76J6N2q44j401J4M67P70n97jK69
$$ -207 -433 612 1566 1159 507 1347 2560 1933 702 -163 313 329 381 -463 -1864 -1850 -1383 -613 -1210 -1211 -942
366i42P79O63M64o03m32J478J366j418j338L01J162k20j092p29o62l30Q65R17
$$ -942 -163 500 964 361 -71 1407 2773 1355 17 318 1480 1260 168 -561 -1223 -1553 -688 229
384B29j032k180L17K373K087j228k273N63K963J084j712j200L28R98P20q02k240
$$ 229 -803 -2983 -2666 -293 1794 566 -1707 -1144 1819 2903 1191 -9 319 1317 2037 1235 -1005
401a005j523K261K326k593l351O25L115J781j409k823l64K476L539M2l405j564
$$ -1005 -2528 -267 2059 -534 -3885 -3260 -145 1636 227 -2596 -2960 -484 3055 3097 -308 -1872
417a872K439K582k19k411k285J480K353j452l499Q93K241n07j417L16K94o70J947
$$ -1872 567 3149 2930 519 -1766 -286 2067 615 -2884 -1991 250 -257 -1674 -1358 -1064 -1734 213
434B13J956j821k660J899L351q4k662k87Q05M23o89r77J277J34k435k174K351
$$ 213 2169 348 -2312 -413 2938 2854 192 -95 710 1133 444 -533 744 878 -1557 -3731 -1380
451a380L474j717l885Q56M020K56k083m95K105L82k80p19N11n20q09J788J568
$$ -1380 2094 377 -3508 -2652 1368 1624 -459 -954 1151 1533 1253 534 1045 525 -284 1504 3072
468C072l881n234L960P781k316r153j215P668L539l485k919J48J313K678P49j594
$$ 3072 -809 -6043 -2083 5698 3382 -5771 -6986 682 4221 736 -2183 -2035 -722 1956 2705 1111
484A111j576O39Q02J327q55l597j064O156K858q192o586O326Q593j710p139k794
$$ 1111 -465 174 976 2303 1448 -2149 -3213 2943 5801 -2391 -8977 -2651 5942 4232 -2907 -5701
500e701K201N303M345k830o683n78N144L117q89k567l633m6N611J050p254k648
$$ -5701 -3500 1803 6148 3318 -3365 -3943 1201 4318 3429 862 -2771 -2817 2794 3844 -3410 -6058
516f058Q111L519p488n994M348P506K355m879p077p82Q963N549m699n679l17J560
$$ -6058 2053 5572 -1916 -7910 -3562 3944 6299 1420 -5657 -6439 2524 8073 3374 -2305 -2622 -1062
532a062J942L433j030o141k061O348J544n954j149O277J549o868l182N545N783
$$ -1062 880 4313 3283 -2858 -4919 1429 2973 -2981 -4130 2147 3696 -3172 -6354 -809 4974
547D974j412n031p88K149M35J642J462j012m418j514L007K461o84q44j757k223
$$ 4974 3562 -1469 -2257 -108 327 1969 3431 2419 -1999 -3513 -506 1955 1271 427 -1330 -3553
563c553J735K887j53j177R77j259k738K579N170j481m856P65L838j684l071K488
$$ -3553 -1818 1069 916 -261 716 -543 -3281 -702 4468 2987 -1869 -1104 2734 1050 -2021 467
579D67L514l133m970M21M330K117k803j779Q81o9j959K768N120j656o720j38N689
$$ 467 3981 848 -4122 -3701 629 2746 -57 -1836 -955 -1024 -2983 -215 4905 3249 -3471 -3609 2080
596B080J709j997j901l0j86j6L89n23J088Q89k686k191K040J703q90J915J237
$$ 2080 3789 1792 -109 -139 -325 -341 48 -475 613 1502 -1184 -3375 -1335 368 -522 1393 2630
613B630n259l682P846O605n842o669K282M291o86j60O96k731k291K400R56j581
$$ 2630 -2629 -6311 1535 8140 2298 -4371 -2089 2202 1516 1356 2052 -679 -2970 -570 386 -1195
629a195R03K332k290l624Q61M372J465j290j744j668K8K847K553l12l265k496
$$ -1195 -292 2040 -250 -3874 -3013 1359 2824 1534 -210 -1878 -1850 997 3550 3238 -27 -2523
645b523J303J945j5j88Q12j800m083J203N727J157m061k462J268J422J327J887
$$ -2523 -1220 725 710 522 1334 -466 -4549 -3346 2381 3538 -523 -2985 -1717 -295 1032 2919
661B919j151k639K31R97k49N87J651j112l397o01J611J723J103l45l314k136K302
$$ 2919 1768 -871 -640 357 108 695 2346 1234 -2163 -2764 -1153 570 1673 1328 -1986 -4122 -1820
678a820L798L64j796j644o79R96K569R30j886r40mr80P71J603L04k039q35j49
$$ -1820 1978 2342 546 -1098 -1777 -781 1788 2718 832 -108 -112 -1092 -321 1282 1586 -453 -1288 -1437
696a437J26Q73J322L30j490j454n88K264L285m54l404j304J554J562K90M46j540
$$ -1437 -1311 -438 884 1214 -276 -1730 -2318 -54 3231 2777 -627 -1931 -377 1185 1475 1921 381
713C81j985J10K061J71j861K43J377j252j433J146K077Q69j495j705j92J836K381
$$ 381 -1604 -1494 567 738 -1123 -880 497 -755 -2188 -1042 1035 1904 409 -1296 -1488 348 2729
730B729n70j906p64j07M66J204O4j535r38N12O55q40Q54R35n0k133m54K093J135
$$ 2729 2159 253 -511 -618 -152 1052 1116 -419 -1357 -845 -190 -1030 -176 759 709 -1424 -1878 215 1350
749A350j11j204j78j85M07M94J010n82j421p98N21P45L76p4r13p48K06P96P87
$$ 1350 1239 35 -143 -328 79 573 1583 1001 -420 -1218 -697 48 424 350 -563 -1311 -1105 -309 478
768D78J54o89l97p4R12M11J42l26L25j088r07J408R35n13j877l34M86P85K84K6
$$ 478 632 -57 -454 -528 384 795 937 611 936 -152 -1059 349 1284 771 -1106 -1440 -954 -169 115 141
788A41n41o43K60R08N75n07L69k69l11k1K77Q82m0j135q00K86Q79M7n62j56o09
$$ 141 -400 -1043 -783 125 700 193 562 293 -18 -39 238 1120 1080 -55 -855 -569 310 357 -205 -361 -970
809i70L28JO63L10m29o8J58J31Q8P39Ko00o72L49J31L33k64n84n52L18N6R5M23
$$ -970 -642 -641 22 332 -97 -165 -7 124 212 951 953 353 -319 30 161 494 230 -354 -906 -588 -532 -437 -14
832a4m9n17k78M64P00l0j3j40J3K1M2N61k8n87l33r0L03l34L02j91l79k42J64
$$ -14 -63 -580 -858 -394 306 276 263 123 136 157 199 760 732 145 -188 -278 25 -309 -7 -198 -577 -819 -655
855f55L67N33l64j01q4N47K21p5Q7M7K29p97m8O50n88j0jl69k37K43J69K75n43
$$ -655 -288 245 -119 -220 -304 243 464 389 476 523 752 -45 -93 557 -31 -41 -42 -411 -648 -405 -236 39 -504
878e04p7K80O36J5J9l96M28l13K23K26L7l00j64KQ7p7m09j69L41J1p39K38J95
$$ -504 -581 -301 335 350 369 -27 401 88 311 537 574 274 110 112 199 122 -287 -456 -115 -104 -843 -605 -410
901d10N12j92J84K0J10K39Q0K03l31o21N09J34k97l79k99K67M12j57l49n23P50
$$ -410 102 -90 94 114 224 463 543 746 415 -206 303 437 140 -239 -538 -271 141 -16 -365 -888 -138
922a38K25j7k55m43O11N77J15r10J09L80L91k30m12j66j00J16M55l62o37j41P55
$$ -138 87 70 -185 -628 -17 560 675 -235 -126 254 645 415 3 -163 -263 -147 308 -54 -691 -832 -77
943g7K2m75P5O4P34L47n02o65N05J002m38p48M74j38l77L44L77r54n78N03P98
$$ -77 -55 -530 -455 -391 343 690 188 -477 28 1030 592 -156 318 180 -197 147 524 -430 -1008 -505 293
964B93l98k97k26K71O21k84k40j65J001j23q88K98N25K56n69K07J16p70n28P66
$$ 293 -105 -402 -628 -357 264 -20 -260 -425 576 453 -435 -137 388 644 75 282 398 -372 -900 -134
984a34M48o13n05J72N03M96n63k48K30O19k31j87P64J56j199n70J514K77j018
$$ -134 314 -299 -804 -632 -129 367 -196 -444 -214 405 174 -13 751 907 -292 -862 652 929 -89
1003h9m98O65Q1q38l1O73K21l97l66J31N54o8j23M45P7l12k67O43M96n24p22k47
$$ -89 -587 78 159 -679 -710 -37 184 -213 -579 -448 106 38 -85 360 437 125 -142 501 997 473 -249 -496
1025d96M90L36q7r25p4O54K03o10J64M82m28k71R48K47o09j53J148l81o77j98
$$ -496 -6 330 243 -682 -756 -102 101 -509 -345 137 -291 -562 386 633 24 -129 1019 638 -39 -237
1045b37M77L54j15m39p61L17O74q6p48M25M18n32k63P39q0k37K05O43m76m72L31
$$ -237 240 594 479 40 -721 -404 270 184 -564 -139 279 -253 -516 223 143 -94 111 754 278 -194 137
1066A37L98J15m54m19j75L99O22p86n80M98o1k4J51M31j85p83O12M82P3P3j31
$$ 137 535 650 196 -223 -398 1 623 -163 -743 -245 -306 -330 -179 252 67 -716 -104 378 451 524 393
1087C93j70k82J92k21L98P2l35r59K93R00J23q98J04K16k85O2P27L90p29l93L48
$$ 393 223 -59 133 -88 310 382 47 -912 -619 281 404 -494 -390 -174 -459 -397 330 720 -9 -402 -54
1108e4J30P59k86m94l15J17j71N22P31p13j254R7Q13M94n33K43j54n99K31P43
$$ -54 76 835 549 55 -260 -143 -314 208 939 226 -1028 -931 -118 376 -157 86 -68 -667 -436 307
1128C07K27J01o8j141L35P17N21q15k98J60p79O0J155J94j387l97Q98J98j13M62
$$ 307 534 635 567 -574 -239 478 999 184 -114 46 -733 -673 482 676 -711 -1108 -210 -12 -125 337
1148C37L34j145j46P91J86m1J32K2o97l12Q95j52J59k56m11n75L69N79J28l21
$$ 337 671 -474 -620 171 357 316 448 470 -227 -539 356 204 363 107 -304 -879 -510 69 197 -124
1168a24j76K80k86M61K70J47m10k05p6M38N9Q3J9l46n36k01O48M51n83n34N1K30
$$ -124 -300 -20 -306 155 425 572 162 -43 -119 319 378 461 480 134 -402 -603 45 496 -87 -621 -570 -340
1190c40j95N68J66n1l92j34L65K63L61o1o21M6j07L10k40L71k92m52k38O83j9
$$ -340 -535 33 199 148 -244 -378 -13 250 611 550 -71 -25 -132 178 -62 309 17 -435 -673 10 -9
1211ir1l4k38o03O08Q78J9l92k16N3k17L06O68k50o66m5n3L33kJ09k65o52Q3N31
$$ -9 -100 -134 -372 -975 -367 511 530 138 -78 -25 -242 64 732 482 -184 -229 -282 51 49 158 -107 -759 -676 -145
1235a45K83J14N0n81j59M15O74m4j11j69l31j50K85M05l93j60l62k71K84M57M3
$$ -145 138 252 302 -279 -438 -23 651 607 496 327 -4 -154 131 536 143 -17 -379 -650 -366 91 134
1256A34n67J25l53K80L91N60l17k95k04J80J20L68L33o25l85L22l5n1J60j0o40
$$ 134 -433 -308 -661 -381 10 570 253 -42 -246 -66 54 422 755 130 -255 67 32 -19 141 131 -509
1277e09j48N03J43K48k96q5k36J63N30L26l24j32j95k72L81R5K25m59l09j7L68
$$ -509 -657 -154 -11 237 -59 -144 -380 -217 313 639 315 183 -12 -284 97 192 417 -42 -351 -368 0
1298@k1L10l70j35k25j88Q66M5J06n53J17J11K20J1L52l33o78K30K13J98l90J71
$$ 0 -21 289 -81 -216 -441 -629 237 282 388 -165 -48 63 283 294 646 313 -365 -135 78 276 -114 57
1320E7k59m4O7J26M8L14k57m22L40L78j17jP9k53k55n2M35J60k87l83J52LJ66
$$ 57 -202 -246 -179 -53 -5 309 52 -370 -30 348 231 230 309 56 -199 -251 184 344 57 -326 -174 -171 -5
1343ek1j28P8m04k25R29j11j58J43j07J13j65K38J45j32k69j8K74p5j24J75m10
$$ -5 -26 -154 -76 -480 -705 224 113 -45 98 -9 104 -61 177 322 190 -79 -97 177 102 -22 153 -257
1365b57j31N0L37m0K72j64n87N12K44n2J67M4l19j15P9J16J03k40r2Pm57L13n4
$$ -257 -388 -338 -1 -41 231 67 -520 -8 236 184 351 395 76 -39 40 156 259 19 -73 -66 -523 -210 -264
1388b64K63K9m45R9L44J22k65J0J47J49l39M62J41M4l17k11J39o3q8J94j73j13
$$ -264 -1 28 -417 -318 26 148 -117 -107 40 189 -150 312 453 497 180 -31 108 45 -43 151 -22 -135
1410a35lnR7q5J19m4l15N5O77j1n7k30J63j58P3QL6j13j61O8J14m73L36J5j7k27
$$ -135 -138 -143 -46 -131 -12 -56 -371 -316 361 350 293 63 226 68 141 149 185 72 -89 -21 93 -380 -44 -29 -46 -273
1436b73J79o5K81o4j87L01Q6J77%%l97J52o03N95j41l50L27j33k8j93J42K64o9
$$ -273 -94 -159 122 58 -129 172 258 435 435 435 38 190 -413 182 41 -309 18 -115 -143 -336 -194 70 1
1459Ak27Q1K1K09j00L8J20J08j08k9K24k79n2J43k57J41l84L91K53o79J07J38
$$ 1 -226 -145 -124 85 -15 23 143 251 143 114 338 59 7 150 -107 34 -350 41 294 -385 -278 -140
1481a40j21L67k66L14j30r7L8K43J1J59k32M3L5q1k60r5K44N1j18k04L68l80M6
$$ -140 -261 106 -160 154 24 -73 -35 208 219 378 146 189 224 143 -117 -212 32 83 -35 -239 129 -251 -205
1504b05K96o9n7K4K22j6o5M5l9j49L09k39J58pK0o88k7L69L8j38N8J02j31k18
$$ -205 91 22 -35 -11 211 195 130 175 136 -13 296 57 215 208 228 -460 -487 -118 -80 -218 -160 -58 -189 -407
1528d07P88p7m90K32J0r9oN44l87Pk16J34j35m6M90k35l15K71R8k07k2M0j68j02
$$ -407 381 304 -186 46 56 -43 -49 495 108 115 -101 33 -102 -148 342 107 -208 63 161 -46 -68 -28 -196 -298
1552b98K42qo0K79O5j90p2K17J53o13M2M44j80j85M95n56l91N10L2N5J44M2k40
$$ -298 -56 -64 -124 155 220 30 -42 175 328 -285 -243 201 21 -164 331 -225 -616 -106 -74 -19 125 167 -73
1575g3M24l0k32K34j07J09m63K31r7K86k77k84L2m4J22K35M9m20j1K58P9N8L69
$$ -73 351 321 89 323 216 325 -138 93 -4 282 5 -279 -247 -291 -169 66 115 -305 -316 -58 21 79 448
1598D48o29j31O19l05k9J64K76k56k02K47L2K06n09j95O2L7R0j24M10k17j84J16
$$ 448 -181 -312 307 2 -27 137 413 157 -45 202 234 440 -69 -264 -202 -165 -75 -199 211 -6 -190 -74
1620g4P4J06N5J00j40J71k47m6J52l44o6P8J72l18K93J31O1j68p2n7Q1K44k32
$$ -74 0 106 161 261 121 292 45 -1 151 -193 -259 -181 -9 -327 -34 97 158 -10 -82 -139 -58 186 -46
1643d6J3r0K37j43R6J4J44j30NJ85k83m0K41p7m40J98J13Q5q0K00o09K40J35K86
$$ -46 -33 -123 114 -29 67 81 225 95 100 285 2 -38 203 126 -314 -116 -3 82 2 202 -407 -167 -32 254
1667B54j99LOj05K55j28J44k50l52R5J08Q3R4m17K29q7K70j40N39l40j40j6N1
$$ 254 55 58 64 -41 214 86 230 -20 -372 -277 -169 -86 8 -409 -180 -267 3 -137 402 62 -78 -94 -43
1690d3L51k33P1J33j70l20L71J30k82k0l00O9k4K55O0j93Q8j01l8L92j3rk22L3
$$ -43 308 75 146 279 109 -211 160 290 8 -12 -312 -243 -267 -12 48 -145 -57 -158 -196 196 183 174 -48 -15
1714a5j18K48N9L9k18n5j20j18L79K36j34k18k65L70j44J39J22j28k47J34L33
$$ -15 -133 115 174 213 -5 -60 -180 -298 81 317 183 -35 -300 70 -74 65 187 59 -188 -54 279
1735B79q2n2R4m08K3K16J47j65J81l21J38k61L44J57l11m40K92M52l30J34L5o2
$$ 279 197 145 239 -169 -146 70 217 52 233 -88 50 -211 133 290 -21 -461 -169 283 -47 87 122 60
1757F0j4k46L23J73P0l96k56J17L17l82L35p2q0J31m69J57L25M04m74N5j54K2
$$ 60 46 -200 123 296 366 -30 -286 -169 148 -234 101 29 -51 80 -389 -232 93 497 23 78 -76 -54
1779e4J10j04J70k98k60N27l8k9k09K08l42K30L3K49j12l62J76J3R9j10K14j68
$$ -54 56 -48 122 -176 -436 91 53 24 -185 23 -319 -89 -56 193 81 -281 -105 -92 7 -103 111 -57
1801e7q9j2K25J4j4l0j51K39j14K6j75k60M01l05O3L40P5Rj01k79O0J77K79j99
$$ -57 -146 -158 67 81 67 37 -114 125 11 37 -138 -398 3 -302 -239 101 176 185 84 -195 -135 42 321 122
1825A22P1n84M42j78K50mj31k06K34j90L29j92j02J26j82m6J07L07r9J01j14N4
$$ 122 193 -391 51 -127 123 119 -12 -218 16 -174 155 -37 -139 -13 -195 -241 -134 173 74 175 61 115
1847A15K7j86M1j0j06K57j84Q0R4j16l9k8J8m7J20ql89M91k40j7P1N3m9Q3j46
$$ 115 142 -44 -3 -13 -119 138 -46 34 128 12 -27 -55 -37 -84 36 28 -361 130 -110 -127 -56 -3 -52 31 -115
1872a15K05k97L96k38o2l0O7J12J15j8r5k41o7L23j20J15j80K47j08o1J4k2L13
$$ -115 90 -207 189 -49 -111 -141 -74 38 153 135 40 -201 -268 55 -65 50 -130 117 9 -52 -38 -60 253
1895B53j64j13k2N1l1J13k7j74L4j08O2P9j08P3j0R2R8N0o4N5j79K93l86K54R3
$$ 253 89 -24 -46 5 -26 87 60 -114 -80 -188 -126 -47 -155 -82 -92 0 98 148 84 139 -40 253 -133 121 214
1920B14q3j90j6K27l64L04n0j95P7j73J45L9k9K70m51J91K52J23k22r2M6l1n7
$$ 214 131 -59 -75 152 -212 92 42 -153 -76 -249 -104 -65 -94 176 -275 -84 168 291 69 -23 23 -8 -65
1943f5K22m5n3k44J16l2J19Q6j79J37j06K14r2K4L5K53m39m2K25q0L3pp4j23L77
$$ -65 157 112 59 -185 -69 -101 18 104 -75 62 -44 170 78 102 137 390 -49 -91 134 54 87 80 6 -117 260
1968B60j90j24J54l16k5M39k31k34N59k86MJ1K7J87r7n9J99j04l9m45L13K66n70
$$ 260 70 -54 100 -216 -241 198 -33 -267 292 6 10 21 48 235 138 79 278 174 135 -310 3 269 -301
1991c01o5K17J38j96J51O1k52L09Rj81k1J03k54K35J65k9j18K44k35j4M7M8j84
$$ -301 -366 -149 -11 -207 -56 5 -247 62 71 -110 -131 -28 -282 -47 118 89 -29 215 -20 -34 13 61 -123
2014a23K09l00J01k15K11k5K33k84L04Q6o8j55J64M8k62J01l3j21L04j57J37l00
$$ -123 86 -214 -113 -328 -117 -142 91 -193 111 197 129 -26 138 186 -76 25 -8 -129 175 18 155 -145
2036a45k5M66l74nJ99j74K22k38J34J39l0l18o7K50M4MK9M5k29J66k18r1K99n08
$$ -145 -170 296 -78 -83 116 -58 164 -74 60 199 169 -149 -216 34 78 82 111 156 -73 93 -125 -216 83 -425
2060d25J63K28K04k43L32k80R8J8k26nL33j69l12M80o7j42J40j4K2k86j15L33
$$ -425 -262 -34 170 -73 259 -21 77 95 -131 -136 197 28 -284 196 129 -13 127 113 135 -151 -266 67
2082F7k08L01j51j23NK88k07n2L61p4k81j6R8jj00J29Q9p9k7K06k78N5R8q1j65
$$ 67 -141 160 9 -114 -109 179 -28 -80 281 207 -74 -90 8 7 -93 36 125 46 19 225 -53 2 100 19 -146
2107a46n9J49J2J58L8j1j11N2j42J40l03K49J99l53J43J93j68%K75n89M29k31
$$ -146 -205 -56 -44 114 152 141 30 82 -60 80 -223 26 225 -128 15 208 40 40 315 -274 155 -76
2129g6k05R9RJ29n8J11K38k56J87l09L18O4j05j14n6m5M6r7M8J8o6J5l68L24L82
$$ -76 -281 -182 -173 -44 -102 9 247 -9 178 -131 187 251 146 32 -24 -69 -23 -120 -72 -54 -120 -105 -473 -149 233
2154B33l11R6L9j15j0K28M8k29L8k2N7J5L1J35k67Oj24K15k8j39j51o8J77K02
$$ 233 -78 18 57 -58 -68 160 208 -21 17 -5 52 67 98 233 -34 -28 -152 63 35 -104 -255 -323 -146 56
2178E6j76J22O5j4J51j92R2K0o2p0r7J43Q2j46j47J19K30k62N8J03O4l14J85R0
$$ 56 -120 2 67 53 204 12 104 124 62 -8 -105 38 120 -26 -173 -54 176 -86 -28 75 139 -175 10 100
2202A00o8K58l71k1J22J4J61K2j21j26o0M8J34q2l75O18k56k45J26q2L34N1l86
$$ 100 32 290 -81 -102 20 34 195 217 96 -30 -90 -42 92 10 -365 253 -3 -248 -122 -204 130 181 -205
2225b05N19k20K3J9L6Q4p4l90J33l5Q2J7q2P0nQ5K8j19N2j81N0K06j24j36M78
$$ -205 314 94 117 136 172 256 182 -208 -75 -110 -28 -11 -93 -23 -28 57 85 -34 18 -163 -113 93 -31 -167 311
2250C11l22J9J07j39qK56l50J30J24k99J89l59J94l8N8N8o4K05P4j05K6m5n3r0
$$ 311 -11 8 115 -24 -32 224 -126 4 128 -171 18 -341 -147 -185 -127 -69 -133 72 146 41 67 22 -31 -121
2274a21L04m35K67k6q3K06k10J61j11r1J31j25J94K8m59M62j05J16k76L25o9J39
$$ -121 183 -252 15 -11 -94 112 -98 63 -48 -139 -8 -133 61 89 -370 92 -13 103 -173 152 83 222
2296B22kL3l71K54j11m1K20m09L02K6k62j62q8K0M40k16K33j43P9q1J01J70k03
$$ 222 220 253 -118 136 25 -16 204 -205 97 123 -139 -301 -389 -369 71 -145 88 -55 24 -57 44 214 11
2319A1j07J20k02J47O35p71K74k07R8MK73p3k25j09J7j9O6K40j75K46j74k53K37
$$ 11 -96 24 -178 -31 604 -167 107 -100 -2 2 275 202 -23 -132 -115 -134 -68 172 -3 243 69 -184 53
2342E3K09l15JP4l4J23J02k08l26K58p9P7r3O8R6j55K71j19L4m2k1J60m23M69
$$ 53 262 -53 -52 22 -12 111 213 5 -321 -63 -142 -65 -158 -90 6 -149 122 3 37 -5 -26 134 -289 180
2366A80p7J41k99K21o74N35j60N1J25k07j35k5J64Q7K66k73K80k30j21J31J08
$$ 180 103 244 -55 166 -508 27 -133 -82 43 -164 -299 -324 -160 -73 193 -80 200 -30 -151 -20 88
2387H8J43m11P7j19n9L84k28N7q8K27j83J85q1K05j35k23J78J66k82K35k33N2
$$ 88 231 -180 -103 -222 -281 103 -125 -68 -156 71 -112 73 -8 197 62 -161 17 183 -99 136 -97 -45
2409d5J30J75k32M2J53m22m8Q1L07K4l84J43p3J97l80J99N0J72P9j9j15Q3j29
$$ -45 85 260 28 70 223 -199 -247 -166 141 165 -219 -76 -149 48 -332 -133 -83 89 168 149 34 117 -12
2432a2n4l6r6K45q7k9P4j99L11%k33j04L27M3j06J36k7n3N6k04LJ52j38M21k89
$$ -12 -66 -102 -198 47 -40 -69 5 -194 117 117 -116 -220 107 150 44 180 153 100 156 -48 -45 107 -31 390 101
2457A01J06k81J50j49m1K01j4j79j50M8L09j34p0K31k79J29K04m6j50J56j03o9
$$ 101 207 -74 76 -73 -114 87 73 -106 -256 -208 101 -33 -103 128 -151 -22 182 136 -14 142 39 -30
2479c0mqK56l15k3n6L54K2j67j46m8L53l25K87j98M7L53l69J62p8J0j44J30K6
$$ -30 -34 -42 214 -101 -124 -180 174 196 29 -117 -165 188 -137 150 -48 -1 352 -17 145 67 77 -67 63 89
2503H9j42j53M8M04k94O9J1k54L80n8j87J19j85L34l64L82m7q4k16J88R7K9J00
$$ 89 -53 -206 -158 246 -48 21 32 -222 158 100 -87 32 -153 181 -183 199 152 68 -148 40 137 166 266
2526B66k75j21K29R4K5J80n44j7k3K58J38j36q7L8J69k04R5J66k18j15J82J40
$$ 266 -9 -130 99 193 218 398 -146 -163 -186 72 210 74 -13 25 194 -10 85 251 33 -82 100 240
2548B40k76n2P3j42K19k49R3rj76K99p6o6K84j35k21M47q5j71j51J19O74m23m0
$$ 240 -36 -88 -15 -157 62 -187 -94 -103 -279 20 -56 -122 162 27 -194 253 168 -3 -154 -35 639 216 176
2571A76j08n5m7j19J98j55J16J26o6k26N03n54K28lJ55m4k07K23L8j25J33j17
$$ 176 68 13 -34 -153 45 -110 6 132 66 -160 343 -211 17 14 169 125 -82 141 179 54 187 70
2593G0J1n8J86k28j16K43j90q3K84p6l53N38j75J31j83l0j23K51q0K2J10pj14
$$ 70 81 23 209 -19 -135 108 -82 -165 119 43 -310 228 53 184 1 -29 -152 99 19 41 151 144 30
2616C0k38L1K89r6m0l19M01j32k97K67N5J08l9J33L1O7j89k3l3qk35k9L34J32
$$ 30 -208 -177 112 16 -24 -343 58 -74 -371 -104 -49 59 20 153 184 251 62 39 6 -2 -237 -266 68 200
2640B00Mk29K67j65l50L98k21K0q6L31j80Q6M3j62k39K77N8J78l62k60N31p8j47
$$ 200 204 -25 242 77 -273 125 -96 -76 -162 169 -11 75 118 -44 -283 -6 52 230 -132 -392 139 61 -86
2663h6R3R3j35j66K17N1j72K07j86J62j61L93l98L07n3l57J66P6L8M4k59J0k9
$$ -86 7 100 -35 -201 16 67 -105 102 -84 78 -83 310 -88 219 166 -191 -25 51 89 133 -126 -116 -145
2686a45M3J19J16m70L71p4j51J87L5J96k48m3L24k07j11Q7l23K62J35j19R8k05
$$ -145 -102 17 133 -337 34 -40 -191 -4 31 227 -21 -64 260 53 -58 29 -294 -32 103 -16 82 -123
2708a23j99K21J06r9K22m50K57J47L4m8j09q7L59j9k33J23N5Q5j8l31p0L06o0
$$ -123 -322 -101 5 -94 128 -322 -65 82 116 68 -41 -128 231 212 -21 102 157 242 224 -107 -177 129 69
2731F9l05L8O6K17o4J66r6l06M22k26n4j97L96m53M26j53J18l6j8%l16L04J2r1
$$ 69 -236 -198 -132 85 21 187 91 -215 207 -19 -73 -270 126 -327 99 -54 64 28 10 10 -306 -2 10 -81
2755h1o1q4L5N33k29j44qj83J79J6J70J26l74L6m4m4K08J9k24J96k0k0j77J44
$$ -81 -142 -226 -191 342 113 -31 -39 -222 -43 -27 143 269 -105 -69 -113 -157 51 70 -154 42 22 2 -175 -31
2779c1L46m35j26O55l22N8j12K98n89L5J66L42q1m70L61j17L5j02J82q8K48n39
$$ -31 315 -120 -246 409 87 145 33 331 -258 -223 -57 285 204 -266 95 -22 13 -89 93 5 253 -286
2801b86K32k02M70m81L5K02Q6R4j32j28K12M9m14J46P8KJ44j44K09k28J70n9k41
$$ -286 -54 -256 214 -267 -232 -30 56 150 18 -110 102 151 -263 -117 -39 -37 107 -37 172 -56 114 55 -186
2824a86K50j26j15L16k63K40K3j1Nl8j74K99l65N8K84rj92q5M13p8k15j00L10
$$ -186 64 -62 -177 139 -124 116 139 128 133 95 -79 220 -145 -87 197 188 -4 -89 324 246 31 -69 241
2847B41j98K3r3k90O67k02j56r6j05K85k65M66l13K8o6P8l53J56K08k48K87O5
$$ 241 43 66 -27 -317 350 148 -8 -104 -209 76 -189 277 -36 -8 -74 4 -349 -193 15 -233 54 119
2869A19k14K70j96J8J60L5k65J35j36J3K78o4j57K5j56K72l46J22J8M5J8k13L49
$$ 119 -95 175 -21 -3 157 192 -73 62 -74 -61 217 153 -4 21 -135 137 -209 -87 -69 -24 -6 -219 130
2892A30l13J67j09R4O1l0J2J37l20L14k09l3J48K11m30M17k14k04N8Q5q6J86j16
$$ 130 -183 -16 -125 -31 30 0 12 149 -171 143 -66 -99 49 260 -170 247 33 -171 -113 -28 -114 72 -44
2915d4J11K8J00j62j24PL39l12M26m06K37j09k20k9L00p7p6l9J87j54M8K4n7K22
$$ -44 67 95 195 33 -91 -84 255 -57 369 -37 200 91 -129 -158 142 65 -11 -50 137 -17 31 55 -2 220
2939B20j76m2k30N76l41j32J92J24j89J45O3l34O4K75m34L28l02J33K92j2m40
$$ 220 44 2 -228 348 7 -125 67 191 2 147 210 -124 -60 215 -219 109 -193 -60 232 220 -220
2960b20K36Q5l1J06k70J96l3J09k21J37j07J00j50J41P3l4l14k4p7K79o3j65N33
$$ -220 16 101 70 176 -94 102 69 178 -43 94 -13 87 -63 78 151 117 -197 -221 -298 -19 -82 -247 286
2983B86j97N0p3m3n9K9qj4N9j11J47j77K31k83J36j61Q6J26k13K03k21J42K72
$$ 286 89 139 66 23 -36 -7 -15 -29 30 -81 66 -111 120 -163 -27 -188 -102 24 -189 14 -207 -65 207
3006B07k35o5P5L78n96L72q8K4J43j27k6K00k85P2j89J87Ok75J18L56m81Q6Q3
$$ 207 -28 -93 -18 360 -236 136 48 72 215 88 62 262 -23 49 -140 47 53 -222 -104 252 -229 -143 -60
3029f0j64L37J5k50J80k4k11k08L98n4L51k7k54M6k47qJ10P1O8k32M04n02K49
$$ -60 -224 113 128 -122 58 34 -177 -385 13 -41 310 283 29 75 -172 -180 -70 1 69 -163 241 -261 -12
3052a2J28l7m2Qq4j45K50o0q0J74j83M9k59K93K13l56K91j11PQQ0k20K34r7j02
$$ -12 116 79 37 45 -39 -184 66 6 -74 100 -83 -34 -293 0 213 -143 148 37 44 52 132 -88 146 49 -53
3077e3J97j91J16j10N4j7m8m5K13Q5k67J7j0l9J99o0k03R0L48jk86L32k10j29
$$ -53 144 -47 69 -41 13 -4 -52 -97 116 201 -66 -49 -59 -98 101 41 -162 -72 276 275 -11 321 111 -18
3101a8K04j20nk82J74J8O7o2k50K24n9M2Q6J96l20J40j40PL86k92j05K34M0J1
$$ -18 186 66 61 -221 -47 -29 38 -24 -274 -50 -109 -67 19 215 -105 35 -105 -98 288 -4 -109 125 165 176
3125A76k54M3J55k47M76j59n0k89Q0j19L1L24j44j21J62k48L41j22L18j72k61
$$ 176 -78 -35 120 -127 349 190 140 -149 -69 -188 -157 167 23 -98 64 -184 157 35 353 181 -80
3146h0k0J55j66m3K26k00R4J37m3j82j6K18j89K77k1j61Kk44J19j05K94L20n12
$$ -80 -100 55 -111 -154 72 -128 -34 103 60 -122 -138 80 -109 168 147 -14 -12 -256 -137 -242 52 372 -140
3169a40J29J06j86M0K3K83k63K22k23J26k63N6K28j98p4J41q6M7l43J43K37L1
$$ -140 -11 95 -91 -51 -28 255 -8 214 -9 117 -146 -90 138 -60 -134 7 -79 -32 -375 -232 5 36
3191C6k29k9L1L78P1n3n1k21J0j38K50k62M9j67L76o0M7J75k83J63j7j2j26K25
$$ 36 -193 -222 -191 187 258 205 154 -67 -57 -195 55 -207 -158 -325 51 -9 38 213 -70 93 76 64 -62 163
3215A63n08L30Q4pJ37p5m7K12l58r3J88k00J55k33J71J7q7M02q7k24L15l81J20
$$ 163 -345 -15 69 62 199 124 77 289 -69 -162 26 -174 -19 -252 -81 -64 -151 251 164 -60 255 -126 -6
3238fJ68k53K90k49j54N03j08m05J74J99k35J21Q2k26L74l78j42L52k8p7j99K30
$$ -6 162 -91 199 -50 -204 299 191 -214 -40 159 -76 45 127 -99 275 -103 -245 107 79 2 -197 33
3260C3p4K14rm91M88j85J41j78k7N6M1R7k33L40j18J84k63Q1k5r9J31r0M6LL0
$$ 33 -41 173 164 -327 161 -24 117 -61 -88 -32 9 106 -127 213 95 279 16 97 72 -27 104 14 60 63 93
3285I3p5k36L12K55k80k24J05o2K88k1l03k0J82L4m5p3M4n5M59l41o5L04k72k36
$$ 93 18 -218 94 349 69 -155 -50 -112 176 155 -148 -168 14 48 3 -70 -26 -81 378 37 -28 276 4 -232
3309b32L80p7k53K66o5J27J68k28o1J09J32k58k57J71K98l43P6J34N7k53J70j82
$$ -232 148 71 -182 84 19 146 314 86 25 134 266 8 -249 -78 220 -123 -47 87 144 -109 61 -121
3331a21n9J33K09J67k79j61R7lN0M0j89l6L43k98Q8J2jl12L05m2n9j34J96M8J53
$$ -121 -180 -47 162 329 50 -111 -14 -17 33 73 -116 -152 191 -107 -19 -7 -8 -320 -15 -57 -116 -250 -54 -6 147
3356A47r0q4J7k13N64l25j13j16M18l30k9K68J13k14n6K03Rl12J16j13j1Q1K62
$$ 147 57 -27 -10 -223 341 16 -97 -213 205 -125 -154 114 227 13 -43 160 169 -143 -27 -140 -151 -70 192
3379A92k4k14j92J16J61k85L32j92j09K12p0p1M4J48L2k27j14N87k99P3k75NL27
$$ 192 168 -46 -238 -122 39 -246 86 -106 -215 -3 -73 -144 -100 48 80 -147 -261 326 27 100 -175 -170 157
3402A57k45M1JJ57J62k36r6r6N19k48k92O0J92L8r3K9k60L44J7j42n4k79M19P8
$$ 157 -88 -47 -46 111 273 37 -59 -155 364 116 -176 -116 76 114 21 50 -210 134 151 9 -45 -324 95 173
3426A73j25j88K00j9l8J01k06J43j70J0L48l72J35o3k2K71M8k57j81M3oK62j7
$$ 173 48 -140 60 41 3 104 -102 41 -129 -119 229 -143 -8 -71 -93 178 226 -31 -212 -169 -175 87 70
3449G0j7J52m11P3K11L5j03L4j26M5lmJ78N5j37j58q7K67j56j64L38k07J39k66
$$ 70 53 205 -206 -133 78 113 10 44 -82 -37 -40 -44 134 189 52 -106 -193 74 -82 -246 92 -115 24 -242
3473b42N0J57j45J91k1n09O82Q7j62J40j84l10K34P1r7P5Rj60K95k40r9r5R3m9
$$ -242 -192 -35 -180 11 -10 -519 163 250 88 228 44 -266 -32 39 -58 17 26 -134 161 -79 -178 -273 -180 -229
3497b29K34J24p0J57k11j39J67K1J00K6m2P5j65N5j37J58k48K5j21L65k70J64
$$ -229 5 129 59 216 5 -134 33 54 154 180 138 213 48 103 -34 124 -124 -99 -220 145 -125 39
3519C9R1R4j85K2M1l95J30L04k86j2R7P2j01J64K7K4j71n0R6L53j97l19J98k1
$$ 39 130 224 39 61 102 -293 -163 141 -145 -157 -60 12 -89 75 102 126 -45 -95 1 354 157 -162 36 15
3543A5j47m3R0o1K92j45nJ31k38J24mP9N8l1k25k4J5J41J88l13r3J36L8j53l9
$$ 15 -132 -175 -85 -146 146 1 -4 127 -111 13 9 88 146 115 -110 -134 -119 22 210 -103 -196 -60 -22 -175 -214
3568b14j39J64L61m8q6jk50L55k26L54k23j66J95P3j57J16J74l19K51m13J87l16
$$ -214 -353 -189 172 124 38 37 -213 142 -84 270 47 -119 76 149 -8 108 282 -37 214 -199 -12 -328
3590c28L73j55NQ9k37J78J32k9l3l4k38K05J28j67J01J11j40J29m9N9k27O2q6
$$ -328 45 -110 -105 -16 -253 -75 57 28 -5 -39 -277 -72 56 -111 -10 101 -39 90 41 100 -127 -65 -151
3613a51pJ51r3l6J79k5l15L37j57m9L11pk29K56l02K07l03L63n8Nk44N3P7l8L5
$$ -151 -158 -7 -100 -136 43 18 -297 40 -117 -166 145 138 -91 165 -137 70 -233 130 72 77 -167 -114 -37 -75 -40
3638d0O0M0k6p7J40N0l03J49L0j11kL0K37k4j86m8P1O8j72k57K55O8O9k0k28L81
$$ -40 20 60 34 -43 97 147 -156 -7 23 -88 -90 -60 177 153 -33 -81 -10 58 -114 -371 -116 -48 21 1 -227 154
3664A54k86J94N8j6j49m0L34k67J2O1j29J05J07qQ5m24L44l4J80m56K59j31j47
$$ 154 -132 62 120 104 -45 -85 249 -18 -6 55 -74 31 138 130 215 -209 135 101 281 -175 84 -47 -194
3687a94K52J27k45J8l2k5p5L20QN1k25J19k6l99Q3M88k44q2K6lo8q7M5K25k05
$$ -194 58 185 -60 -42 -74 -99 -174 146 154 205 -20 99 73 -326 -243 245 1 -81 -55 -58 -126 -213 -168 57 -148
3712a48K60k91j3K72j73K73k97J24J99l00J77J12Q5k32R9j81P8j1j25K0M2K15
$$ -148 112 -179 -192 80 -93 180 -117 7 206 -94 83 195 280 48 147 -34 44 33 -92 -72 -30 185
3734A85k40N5j40Q9J97o2N4j19pk32K14n9L6m0l5K63q8k88j0P5J62oJ42R1k23
$$ 185 -55 0 -140 -51 146 84 138 19 12 -220 -6 -65 -29 -69 -104 159 71 -217 -227 -152 10 4 146 237 14
3759A4j45K65N8k21K2K95n45j19M95q7K3O2J42k06j04o6K33l3J07j55n3J25R7
$$ 14 -131 134 192 -29 -7 288 -257 -376 119 32 55 117 259 53 -51 -117 116 83 190 35 -18 107 204
3782B04k54J95m77M69j27k86J86k41O46l61r3J66J65j85K84n08L02j83r6R7K14
$$ 204 -50 145 -332 137 10 -276 -90 -331 315 -46 -139 27 192 7 291 -217 85 -98 -194 -97 117
3803A17l56J48M1K94P0k59J9J49k53J02j79K38l20K63m0j61R8K25m65ON35l09
$$ 117 -239 -91 -50 244 314 55 74 223 -30 72 -107 131 -189 74 34 -127 -29 196 -269 -263 272 -37
3825c7Pk33Q9Q5N0N5l45l2M18m9J33j80j02J76K48k62J08l8k05j5R5R3J12q2j50
$$ -37 -30 -263 -174 -89 -39 16 -329 -361 57 8 141 -39 -141 35 283 21 129 91 -114 -129 -34 59 171 89 -61
3850f1k9j30L02j98J00j54K10j09J86j62n4j24J43O7o2M8n1k4K38j16q3L7K01
$$ -61 -90 -220 82 -116 -16 -170 40 -69 117 -45 -99 -223 -80 -13 -75 -27 -78 -102 136 20 -63 -26 175
3873A75m5o6K40m23K78m87k3M04k57k7J20l8J40k4R0L5k64M3K15l4J9j72K66l30
$$ 175 130 64 304 -119 159 -328 -351 53 -204 -231 -111 -149 -9 -33 57 92 -172 -129 86 52 71 -101 165 -165
3897a65J02J13K16k10on22O63q6K87j58k60O4N3J32j47j8J90jk08RL8L2r2O5k6
$$ -165 -63 50 266 56 50 -472 191 105 392 234 -26 38 91 223 76 58 248 247 39 48 86 118 26 91 65
3922F5N4j86P6k0j78n2N1J26J56rr6o9M1q5J91J12Mj41j04K16j53K12k36K16k4
$$ 65 119 -67 9 -11 -189 -241 -190 -64 92 83 -13 -82 -41 -126 65 177 181 40 -64 152 -1 211 -25 191 167
3947A67k45J47j25k30K46M91n94L09M7k85K21M5J2k14J7L1k48K72J4J46j74j33
$$ 167 -78 69 -56 -286 -40 451 -143 166 213 -72 149 194 206 -8 9 40 -208 64 78 224 50 -83
3969h3j42J75j06K32k22K45K73l43L3k88K23p1J59p4l2J2n2J59r0J00m43L18o1
$$ -83 -225 -50 -156 76 -146 99 372 29 62 -226 -3 -74 85 11 -21 -9 -61 98 8 108 -335 -17 -78
3992g8K4k04J30J28l6L33J16k99k48J42K8O7q6OL5j6r8J20k22K24k95J75K21l18
$$ -78 -54 -258 -128 0 -36 297 413 114 -134 8 36 103 17 23 58 42 -56 64 -158 66 -229 -54 167 -151
4016a51L00j23j12J29n9J61j09R8m74J68L12l06L05j57p2K2L54p33L80J9L8J55
$$ -151 149 26 -86 43 -16 145 36 134 -340 -172 140 -166 139 -18 -90 -68 286 -447 -67 -48 -10 145
4038A45J46j29l7k40K52l45M69k62j09L91k69j3j09l5J27n5K18p9n6j59J62O9
$$ 145 291 162 125 -115 137 -208 261 -1 -110 281 12 -1 -110 -145 -18 -73 145 66 10 -149 13 82
4060H2j57l4K46J49k78pj70J62j39J62n3J60K4k4q1j72N3q9R5m2K03l16O4M5N09
$$ 82 -75 -109 137 286 8 1 -169 -7 -146 16 -37 123 147 123 42 -130 -77 -166 -71 -113 90 -226 -162 -117 392
4085C92m91o6J4Q4J04J39j72o4K1K6k1L6j12J27k27K67K8pj99R5O3j81N28k85
$$ 392 -99 -165 -151 -67 37 176 4 -60 -39 -13 -34 2 -110 17 -210 57 85 78 -121 -26 37 -144 384 99
$$ [...]
8191A41
##END NTUPLES=NMR FID
##END=
