##TITLE=1H_Pr 5308
 200.13Hz,CDCl3.
 8 sc
 
13.3.2026
##JCAMPDX= 6.0         $$ Bruker NMR JCAMP-DX V2.0
##DATA TYPE= NMR FID
##DATA CLASS= NTUPLES
##ORIGIN= UXNMR, Bruker Analytische Messtechnik GmbH
##OWNER= pz
$$ XWIN-NMR		Version 3.5
$$ Fri Mar 13 15:36:12 2026 Russian Standard Time (UT+4h)  she@DPX200
##.OBSERVE FREQUENCY= 200.1313
##.OBSERVE NUCLEUS= ^1H
##.DELAY= (6, 6)
##.ACQUISITION MODE= SIMULTANEOUS
##.ACQUISITION SCHEME= undefined
##.AVERAGES= 8
##.DIGITISER RES= 18
##SPECTROMETER/DATA SYSTEM= spect
##.PULSE SEQUENCE= zg30
##.SOLVENT NAME= CDCl3
##.SHIFT REFERENCE= (INTERNAL, CDCl3, 0, 14.3821)
##AUDIT TRAIL= $$ (NUMBER, WHEN, WHO, WHERE, WHAT)
$$ ##TITLE= Audit trail, XWIN-NMR		Version 3.5
$$ ##JCAMPDX= 5.01
$$ ##ORIGIN= Bruker BioSpin GmbH
$$ ##OWNER= she
$$ F:/spectra/data/she/nmr/H-C/1/audita.txt
$$ ##AUDIT TRAIL=  $$ (NUMBER, WHEN, WHO, WHERE, WHAT)
(   1,<2026-03-13 15:33:51.00 +0400>,<she>,<DPX200>,
      <created by zg, POWCHK disabled, PULCHK disabled
       configuration hash MD5:
       00 E9 B6 7A A2 85 ED C7 34 08 36 98 17 FE 4E 26
       data hash MD5: 16K
       08 84 95 19 60 90 DF 09 79 A6 3A E0 B3 E8 21 91>)
$$ ##END=
$$ 
$$ hash MD5
$$ 23 9F 09 66 B4 8A BD E0 50 6A 31 94 26 70 CA 55
##$RELAX= 
##$RELAX= 
##$RELAX= 
##$RELAX= 
##$RELAX= 
##$RELAX= 
$$ Bruker specific parameters
$$ --------------------------
##$DU= <F:/spectra>
##$EXPNO= 1
##$NAME= <H-C>
##$PROCNO= 1
##$TYPE= <nmr>
##$USER= <she>
##$AMP= (0..31)
100 100 100 100 100 100 100 100 100 100 100 100 100 100 100 100 100 100 
100 100 100 100 100 100 100 100 100 100 100 100 100 100 
##$AQSEQ= 0
##$AQ_mod= 1
##$AUNM= <au_zg>
##$AUTOPOS= <>
##$BF1= 200.13
##$BF2= 200.13
##$BF3= 200.13
##$BF4= 200.13
##$BF5= 200.13
##$BF6= 200.13
##$BF7= 200.13
##$BF8= 200.13
##$BYTORDA= 1
##$CFDGTYP= 0
##$CFRGTYP= 5
##$CHEMSTR= <none>
##$CNST= (0..31)
1 1 145 1 1 1 1 1 1 1 1 1 1 1 1 1 1 1 1 1 1 1 1 1 1 1 1 1 1 1 1 1 
##$CPDPRG= <>
##$CPDPRG1= <>
##$CPDPRG2= <>
##$CPDPRG3= <>
##$CPDPRG4= <mlev>
##$CPDPRG5= <mlev>
##$CPDPRG6= <mlev>
##$CPDPRG7= <mlev>
##$CPDPRG8= <mlev>
##$CPDPRGB= <>
##$CPDPRGT= <>
##$D= (0..31)
0 0.7 0 0 0 0 0 0 0 0 0 0.03 0 0 0 0 0 0 0 0 0 0 0 0 0 0 0 0 0 0 0 0 
##$DATE= 1773401630
##$DBL= (0..7)
120 120 120 120 120 120 120 120 
##$DBP= (0..7)
150 150 150 150 150 150 150 150 
##$DBP07= 0
##$DBPNAM0= <>
##$DBPNAM1= <>
##$DBPNAM2= <>
##$DBPNAM3= <>
##$DBPNAM4= <>
##$DBPNAM5= <>
##$DBPNAM6= <>
##$DBPNAM7= <>
##$DBPOAL= (0..7)
0.5 0.5 0.5 0.5 0.5 0.5 0.5 0.5 
##$DBPOFFS= (0..7)
0 0 0 0 0 0 0 0 
##$DE= 6
##$DECBNUC= <off>
##$DECIM= 32
##$DECNUC= <off>
##$DECSTAT= 4
##$DIGMOD= 1
##$DIGTYP= 9
##$DL= (0..7)
0 120 120 120 120 120 120 120 
##$DP= (0..7)
150 150 150 150 150 150 150 150 
##$DP07= 0
##$DPNAME0= <>
##$DPNAME1= <>
##$DPNAME2= <>
##$DPNAME3= <>
##$DPNAME4= <>
##$DPNAME5= <>
##$DPNAME6= <>
##$DPNAME7= <>
##$DPOAL= (0..7)
0.5 0.5 0.5 0.5 0.5 0.5 0.5 0.5 
##$DPOFFS= (0..7)
0 0 0 0 0 0 0 0 
##$DQDMODE= 0
##$DR= 18
##$DS= 0
##$DSLIST= <SSSSSSSSSSSSSSS>
$$ [...]
##$SUBNAM0= <"">
##$SUBNAM1= <"">
##$SUBNAM2= <"">
##$SUBNAM3= <"">
##$SUBNAM4= <"">
##$SUBNAM5= <"">
##$SUBNAM6= <"">
##$SUBNAM7= <"">
##$SUBNAM8= <"">
##$SUBNAM9= <"">
##$SW= 18.0517328524113
##$SWIBOX= (0..15)
0 0 2 0 0 0 0 0 0 0 0 0 0 0 0 0 
##$SW_h= 3612.71676300578
##$TD= 16384
##$TD0= 1
##$TE= 0
##$TE2= 300
##$TE3= 300
##$TEG= 300
##$TL= (0..7)
0 120 120 120 120 120 120 120 
##$TP= (0..7)
150 150 150 150 150 150 150 150 
##$TP07= 0
##$TPNAME0= <>
##$TPNAME1= <>
##$TPNAME2= <>
##$TPNAME3= <>
##$TPNAME4= <>
##$TPNAME5= <>
##$TPNAME6= <>
##$TPNAME7= <>
##$TPOAL= (0..7)
0.5 0.5 0.5 0.5 0.5 0.5 0.5 0.5 
##$TPOFFS= (0..7)
0 0 0 0 0 0 0 0 
##$TUNHIN= 0
##$TUNHOUT= 0
##$TUNXOUT= 0
##$USERA1= <user>
##$USERA2= <user>
##$USERA3= <user>
##$USERA4= <user>
##$USERA5= <user>
##$V9= 5
##$VALIST= <valist>
##$VCLIST= <CCCCCCCCCCCCCCC>
##$VD= 0
##$VDLIST= <DDDDDDDDDDDDDDD>
##$VPLIST= <PPPPPPPPPPPPPPP>
##$VTLIST= <TTTTTTTTTTTTTTT>
##$WBST= 1024
##$WBSW= 4
##$XGAIN= (0..3)
0 0 0 0 
##$XL= 0
##$YL= 0
##$YMAX_a= 160240
##$YMIN_a= -186341
##$ZGOPTNS= <>
##$ZL1= 120
##$ZL2= 120
##$ZL3= 120
##$ZL4= 120
##$ABSF1= 10
##$ABSF2= 0
##$ABSG= 5
##$ABSL= 3
##$ALPHA= 0
##$AQORDER= 0
##$ASSFAC= 0
##$ASSFACI= 0
##$ASSFACX= 0
##$ASSWID= 0
##$AUNMP= <proc_1d>
##$AZFE= 0.1
##$AZFW= 0.1
##$BCFW= 1
##$BC_mod= 2
##$BYTORDP= 1
##$COROFFS= 0
##$CY= -3
##$DATMOD= 1
##$DC= 2
##$DFILT= <>
##$DTYPP= 0
##$F1P= 0
##$F2P= 0
##$FCOR= 0.5
##$FTSIZE= 0
##$FT_mod= 4
##$GAMMA= 1
##$GB= 0.15
##$INTBC= 1
##$INTSCL= 1
##$ISEN= 128
##$LB= 0.25
##$LEV0= 0
##$LPBIN= 0
##$MAXI= 10000
##$MC2= 0
##$MEAN= 0
##$ME_mod= 0
##$MI= 1.114404
##$NCOEF= 0
##$NC_proc= 0
##$NLEV= 6
##$NOISF1= 3.799351
##$NOISF2= 2.8
##$NSP= 1
##$NTH_PI= 0
##$NZP= 0
##$OFFSET= 14.38212
##$PC= 1
##$PHC0= -3702.954
##$PHC1= 6.3923
##$PH_mod= 1
##$PKNL= yes
##$PPARMOD= 0
##$PSCAL= 0
##$PSIGN= 0
##$REVERSE= no
##$SF= 200.129724274929
##$SI= 16384
##$SIGF1= 3
##$SIGF2= 2
##$SINO= 400
##$SIOLD= 16384
##$SREGLST= <1H.CDCl3>
##$SSB= 0
##$STSI= 0
##$STSR= 0
##$SW_p= 3205.1282051282
##$SYMM= 0
##$S_DEV= 0
##$TDeff= 0
##$TDoff= 0
##$TI= <>
##$TILT= no
##$TM1= 0
##$TM2= 0
##$TOPLEV= 0
##$USERP1= <user>
##$USERP2= <user>
##$USERP3= <user>
##$USERP4= <user>
##$USERP5= <user>
##$WDW= 1
##$XDIM= 8192
##$YMAX_p= 0
##$YMIN_p= 0
$$ End of Bruker specific parameters
$$ ---------------------------------
##NTUPLES= NMR FID
##VAR_NAME=  TIME,          FID/REAL,        FID/IMAG
##SYMBOL=    X,             R,               I
##VAR_TYPE=  INDEPENDENT,   DEPENDENT,       DEPENDENT
##VAR_FORM=  AFFN,          ASDF,            ASDF
##VAR_DIM=   8192,          8192,            8192
##UNITS=     SECONDS,       ARBITRARY UNITS, ARBITRARY UNITS
##FACTOR=    0.0002768,     1,               1
##FIRST=     0,             0,               0
##LAST=      2.2672688,     0,               0
##MIN=       0,             -186341,         0
##MAX=       2.2672688,     160240,          0
$$ Real data points
##PAGE= N=1
##DATA TABLE= (X++(R..R)), XYDATA
0@%%%%%%%%%%%%%%%%%%%%%%Mj0J4j6J6j6J6j7J9k2K7l1L4l8M2m8N4n8O3p1P9q7
44d6R8j07J16j28J41j56J72j89K07k28K56k87L19l58M06m61N31o25P46r13J161
65F55j552K233l651P689l8419j53296J01889J86654O209j04821m1146K2357Q02
78a4397Q297M3016j4602o0726J3303O3727n523o7940j6992O2127K8163m1223j2704
91a5474K1218j1108j5460K3560K8182j7236l1938J4442K0162k3970q082K8016
103A2312K452j7110O757N935l5113k6287N7095O3101m8082p6694J8753N9823K704
116B5646l3226J55K0471j4040j1894L0245N859m3044j3193M5023L0358l7750m1183
129c6573K2541K5287j5673P1K3190p983l4856m783L5395J6935j6796j082L577
$$ plain form
0 0 0 0 0 0 0 0 0 0 0 0 0 0 0 0 0 0 0 0 0 0 0 0 4 -6 8 -8 8 -8 8 -9 10 -12 15 -16 18 -20 22 -26 28 -30 33 -38 41 -46
44 -46 52 -55 61 -67 74 -82 90 -99 108 -120 136 -151 168 -190 216 -245 286 -339 407 -506 655
65 655 -897 1336 -2315 5374 -33045 -186341 -84452 102202 108411 3590 -37556 -15199 -14397
78 -14397 -6100 36916 22314 -38412 -25109 38618 33095 -34845 -51837 10290 38453 -2770 -15474
91 -15474 5744 -5364 -20824 2736 30918 13682 -18256 -3814 16348 -7622 -15704 12312
103 12312 14764 -2346 4411 10346 -24767 -51054 6041 69142 21060 -55634 -36881 22942 25646
116 25646 -7580 -7425 13046 -994 -12888 17357 23216 -19828 -33021 12002 42360 4610 -36573
129 -36573 -14032 11255 -4418 -4347 18843 10860 -23996 -28779 6616 23551 6755 5673 9250
142I250k4801r175K9971K4325j2823k6509k103Q481n548O400J7071r176j9640
155a4277K743J7049M409j7213m434J7478J827q971Q024M584j7066j4777J7218
168c406L1851p028l3355p309Q478N268J4599J1101j2730k7046q651K5816J9876
181A7464p517o454m561q981M315J2923O704q618j6759M815J7959j168j0386p717
195g981m029O785J0261O981m019k2228q021K0495J3538j568l779o771p766l959
209a2061J0063K1990j838k0653p778r3N198J2254M002n995j2795q654J1495J2413
223G548l141o045n230K083J0693K262m588n795p628P684J5792p15j0212j1075
237h367m307R442R036M317k739j6441p839R876R348O400O17j0001q910j335J0831
$$ plain form
142 9250 -15551 -24726 5245 29570 16747 -9762 -11865 -3384 -8932 -2532 14539 5363 -14277
155 -14277 -11534 5515 9924 -7289 -11723 5755 7582 -1389 6635 11219 -5847 -20624 -3406
168 -3406 28445 21417 -11938 -19247 -10769 -5501 9098 20199 7469 -19577 -28228 -2412 17464
181 17464 9947 3493 -1068 -10049 -5734 7189 13893 5275 -11484 -6669 11290 10122 -264 -7981
195 -7981 -12010 -5225 5036 12017 7998 -14230 -22251 -1756 11782 10214 6435 -336 -8102 -12061
209 -12061 -1998 19992 18154 -2499 -10277 -10370 -5172 7082 11084 5089 -7706 -16360 -4865 7548
223 7548 4407 -1638 -6868 -4785 5908 8170 3582 -2213 -9841 -2157 13635 12920 2708 -8367
237 -8367 -12674 -3232 5804 10121 7382 -9059 -16898 -7022 2326 8726 9343 -658 -9568 -10903 -72
252g2J5104l494j2760m171j07P251P070m160p269n939J112J3181M229j1592j0194
267a1811j069J2030J2748k930q704q744m969J3268J5581j504j1140j1478m59R761
281E80M795J963j871j0880m339L922M404O863q59q179k907J384O607P655n154
296C984p382j654L122J0983L216j1544q681j199Q421J3424k768j4070r051K39
310a2960J2964J0617l596p537r303k728J3863J0287k921o936p499R29P153K425
324D758K406l250j0002k28N926M142J556q388p354M942N490N450J687j0031o498
339i394K762Q920J2257l594j4712m814K325Q869J0394m324j1219p512p94J1773
353I37Q466n292p244p268J435J2022M401l935m338n497L174Q805K104j979p537
$$ plain form
252 -72 15032 11538 -1222 -5393 -5500 1751 8821 4661 -2608 -8547 -7435 5746 9975 -1617 -11811
267 -11811 -12880 -850 11898 8968 264 -8480 -13449 -181 15400 13896 2756 -8722 -9181 580
281 580 5375 7338 5467 -5413 -9752 -5830 -1426 5437 4578 -3601 -6508 -5124 1483 9138 3984
296 3984 -3398 -5052 -1930 9053 12269 725 -7956 -9155 -734 12690 9922 -4148 -13199 -12960
310 -12960 4 10621 7025 -512 -9815 -12543 1320 11607 8686 1750 -5749 -4820 2333 4758
324 4758 7164 3914 -6088 -6316 -390 3752 5308 -3080 -10434 -5492 -2 5448 7135 -2896 -9394
339 -9394 -6632 2288 14545 10951 -3761 -8575 -6250 2619 13013 8689 -2530 -10042 -10836 937
353 937 9403 4111 -3133 -10401 -8966 3056 7457 3522 -816 -6313 -3139 5666 7770 5791 -1746
368a746o008O728P098M91k874j0185m379P572N961L821k452j0786l429M864P980
383B656P419m834q539l28P43N425P326l729q008m838J178R969L276o650n728m452
399i114L653R747Q66m441n413m262P215J0008k98o095p961p36R418N767M01m640
415D115j1579l182Q576P379K914o965j0845O21O969O806K099q053n818K466M775
430B78P624J704r577o208J607N958P198k950o516l469k741N213O512k074m472
445a913m382j342Q328N574k128l413n496k10N307L926M921k594j0943k328N476
460a217N305L340o477q846M13N444Q622R31j2173p310M384J0400J0640n158j4968
475f670l211P577R914M538q759q538j213L277R036K100q562n011j358J746O982
$$ plain form
368 -1746 -7754 -1026 6072 6563 3689 -6496 -10875 -3303 2658 6479 4027 -6759 -10188 -5324 2656
383 2656 10075 5241 -3298 -3626 -2883 2542 9868 6139 -1869 -6707 -5529 4440 7716 1066 -4662 -9114
399 -9114 -5461 4286 5152 711 -4702 -8964 -1749 8259 7961 1866 -6095 -6831 2587 8354 8755 4115
415 4115 -7464 -10646 -2070 5309 8223 1258 -9587 -8966 -1997 4809 6908 -1145 -6963 -4497 278
430 278 7902 9606 29 -6179 -4572 1386 8584 5634 -882 -4351 -7092 -1879 4633 2559 -1913
445 -1913 -6295 -7637 691 6265 4137 724 -4772 -4982 325 4251 9172 6578 -4365 -6693 -1217
460 -1217 4088 7428 951 -7895 -7482 -2038 6584 7515 -4658 -11968 -7584 2816 13456 8298 -6670
475 -6670 -9881 -2304 7610 12148 3389 -5149 -6362 -3085 5951 8051 -511 -5522 -6880 -5134 1848
490A848J070k193r61m105K26M671K718L210m450o980L220N112J458Q06n573o544
506f467R93M153P423M49r441n023K14N401R553j076q783l569R28Q177Q048m231
522F749r123n257L279J2139K589r539o670k134N832R326k260q926m782J489R906
537B618N933m842o320n150K507J1367K451m645m031m085J704O070P08j562n156
552b433l214L365K209N75K659l314m767l28O47P017O458l356p095n142K466J0264
568F011K871n029o424n455N620J0403j504q667p256P44R368O128k587m997o738
583g512N79R251L358q23l728n374K702N468Q58j696m340k555K159R26K853J295
599C421n937k618J415J891M733L48m753k017N57M448N967k558n782l761q23R245
$$ plain form
490 1848 2918 725 -236 -4341 -4115 556 3274 6484 2034 -4946 -1726 3386 4844 5650 77 -6467
506 -6467 -5474 -1321 6102 6551 -2890 -7913 -7699 -2298 7255 6179 -2604 -6173 -5245 2932 10980 6749
522 6749 -2374 -7631 -4352 7787 10376 837 -5833 -7967 -2135 7191 4931 -3995 -8777 -7288 2618
537 2618 8551 3709 -2611 -7761 -5254 6113 8564 3919 -112 -4197 -2493 3577 4285 2723 -2433
552 -2433 -5647 -2282 -73 502 3161 -153 -4920 -5248 -4601 2416 8874 5518 -1577 -6719 -4253 6011
568 6011 8882 3853 -2571 -8026 -2406 7997 6493 -2174 -9430 -8686 682 6810 4223 -774 -7512
583 -7512 -6933 2318 5676 4853 1125 -4249 -1547 3921 4779 3083 -1257 -3812 -1653 -727 2126 3421
599 3421 -2516 -5134 -3719 -1828 2905 3253 -1500 -3517 -2960 1488 7455 4897 -885 -4646 -5469 3776
615C776O832n786p838n025J202Q432L564k134n004o763K569R266K557k234o116
630b702m021O215O324j30j665n681l224L634L725L736k866q702q33M448K220K860
646C338k085n913m72J751N542M442m187m680o23J081O269K237m923k686k780N75
662c114O500J183l957m921l365N662O550j319m015m677k96P550L578j798k658
677I03m242R94N212J836o87l815m418J942K068J056K501k926n237q61J858O062
693B246L643n158m476p03K747O869J439m223m134k993M023P439j393o027m804
708e505j98O498L613k835l609m351Q91P582K856k162m265l731L628N359R15p17
724C969l954k970J664K223K617L54n914l023J566K540L888n94n191j240K86L676
$$ plain form
615 3776 10608 4822 -3016 -8041 -6839 1593 5157 3023 -1981 -8744 -6175 3091 5648 3414 -2702
630 -2702 -6723 -508 5816 5686 4021 -1660 -4884 -1250 2475 6211 3345 -5357 -6190 -1742 478 3338
646 3338 1253 -4660 -5132 -3381 2161 6603 2416 -2264 -2887 -1806 4463 6700 1777 -909 -3689 -3114
662 -3114 3386 4569 612 -4309 -7674 -2012 4538 3219 -796 -5473 -5769 1781 5359 3561 903
677 903 -3339 -2345 2867 4703 4016 201 -4217 -2275 -207 849 3350 424 -4813 -5674 -3816 2246
693 2246 5889 731 -3745 -4448 -1701 5168 6607 2384 -1750 -4743 -720 6719 5326 -701 -5505
708 -5505 -5703 795 4408 1573 -2036 -6387 -5496 2086 4942 2780 -1485 -5216 -1588 3771 4686 3969
724 3969 15 -2955 -1291 932 3549 3903 -2011 -5034 -3468 -928 2960 2366 -2825 -4065 -3779 -103
740a03N048j866l977k137J87O076L974m367m226k552Q35O199J494k927l595n122
756g059K294O986J286j747m563l430M908M596L74O7m845k764L828L412K222k445
772C120o858O7L587Q13J953k253m649M19J131L233L538l760l145L6R93N456J546
789E227l372k000l085P59O624J678l698n007l412M253N626q22k777m540j926N529
805i43M118K08k284n231L36O267K425o62l590m181K400K651O33J074l936l500
821d215J484J504K680Q36m160j892J034J466M092Q60k991k112j820L138O131j194
837D841m387l515o75M659L047k057k965l750M0N703J933j674k782l633K940M813
853B538O24l67k474k731J755J957K265P33m967k821J654J354L019k83m346j841
$$ plain form
740 -103 4945 3079 -898 -3035 -2848 3228 7202 2835 -1391 -3943 -3108 3091 4585 1658 -1937 -7059
756 -7059 -4765 2221 3507 1760 -2803 -6233 -1325 3271 3645 3712 -1133 -3897 -69 3343 5565 3120
772 3120 -3738 -3671 -84 729 2682 429 -4220 -3801 -2670 563 4101 341 -2804 -2768 -1775 3681 5227
789 5227 1855 -145 -3230 -2471 4153 5831 2133 -2874 -6286 -2033 3593 2771 -6 -4546 -6472 -943
805 -943 3175 3383 1099 -4132 -3796 2471 4896 4234 644 -3537 -1137 1514 2147 3221 -715 -4215
821 -4215 -2731 -1227 1453 2289 -1871 -3763 -2729 -1263 2829 3689 698 -1414 -3234 -96 6035 4841
837 4841 454 -3061 -3736 923 3970 1913 -1052 -4802 -4762 941 2874 1200 -1582 -5215 -2275 2538
853 2538 3162 2795 321 -2410 -655 1302 3567 4300 -667 -3488 -1834 -480 2539 2256 -2090 -3931
869c931l24K494N288n27m040k323N0N391L627l288k837k004O89N016J212k690
885A803l230l824K469N491k42k307l063k363L776L467K73k23m276j516M476K893
901C604P53k115m853N65K875R02J267j857l861j30O03K177K488k987k045O46k56
918b224L578J854k045j313k755O36O023J844l072l713l614K974N175o56k296l697
934c301k104M662L546p29k811m419J401O476J623j706k923k641K564K636o0J62
950B376k526j935J789O34J21J90k768q5R57r95K853J811j476k474k666K604O222
967D632O7k796l563k111M098M384p28l489n273j049O422L862j603n260m594L374
983c627N904R47j316k960k766L081L417J090j114m375n18K899J230R90j366m078
$$ plain form
869 -3931 -4255 -1761 3527 3000 -1040 -3363 -3313 2078 5705 2417 -420 -2424 -1735 3281 4493 1803
885 1803 -1427 -5251 -2782 2709 2467 160 -2903 -5266 -1490 1977 2250 2027 -2249 -3765 711 3604
901 3604 4357 2242 -2611 -2046 829 1731 2998 1141 -2720 -2850 -2247 -70 2418 -569 -2614 -1968 -2224
918 -2224 1354 3208 1163 -150 -2905 -2269 3754 5598 2526 -1187 -4801 -1827 3348 2692 396 -3301
934 -3301 -5405 -743 2803 2074 -737 -5156 -3755 2721 4344 2638 -285 -2926 -362 2274 2214 2376
950 2376 -150 -2085 -296 338 459 649 -2119 -2204 -1247 -2242 611 2422 946 -1528 -4194 -1590 4632
967 4632 4699 1903 -1660 -3771 327 4711 3983 494 -4779 -5828 594 4456 2853 -2407 -7001 -3627
983 -3627 2277 3224 1908 -1052 -3818 -737 2680 3770 2656 -1719 -2237 662 1892 2882 1516 -2562
999b562J66N31O82K595o75j920q14n67K575K123j080l84q25j326L328J431j142
1016B136j424l033J35L490Q30n88k954l476K887K748P85l09l633k082M055L076
1032B643R40j665l946K13K665J709J580l160m104J713J774J055M55l704j809J806
1048a835R56J853P14k000m42j075Q2M320L44j253o20k530k76L155J172M28l712
1065g19m146K613L687J279j470n566j061N195K810K86j815m436Q56L629K791L36
1081D269m858k922L419K031N3o84l252n23J708l6J299j84k263N16j90J592K306
1098B281j505j269P90j606J408K747P6j552l214r35L426J518n15j857l535R5L853
1115B06J091M63k254l491J528L821K419p03m768j386L414J826J222j085l753j088
$$ plain form
999 -2562 -2396 -1865 -1183 1412 737 -1183 -1997 -2564 11 2134 1054 670 -155 -1481 1847 3278 2136
1016 2136 712 -2321 -2186 1304 2134 1546 -1408 -4884 -1997 751 1536 1227 -2406 -4488 -433 2643
1032 2643 3583 1918 -2028 -1815 850 2559 4139 979 -3125 -1412 362 1417 1872 -1832 -3641 -1835
1048 -1835 -879 974 1688 -312 -754 -1829 -1747 2573 2917 1664 1044 -1486 -1762 1393 2565 2993 -719
1065 -719 -4865 -2252 1435 2714 1244 -4322 -5383 -188 2622 2908 1093 -3343 -2487 1142 3933 4269
1081 4269 -589 -3511 -92 1939 1992 1308 -1944 -2467 -759 -795 504 320 -1943 -1427 -1617 -25 2281
1098 2281 776 -493 297 -1309 99 2846 2922 1370 -1844 -2779 647 2165 1650 -207 -3742 -3647 206
1115 206 1297 1760 -494 -3985 -2457 1364 3783 3080 -1688 -3074 340 2166 3388 2303 -1450 -2538
1131b538J403J839J777k544k676L98Q13K017R91k236J20N77j144K051J456j121
1147A183l98j215L19J905q44P9n36l122L62J909J251J328l363l360J854L045K378
1164B775n38m010q66J954K268K774j860n103P3K812K531M44m330k024J139R60
1180a001K354j51k998n0N31P21K473q23j373O01q15M89J407p2O43j222k993J354
1198i25J646P30j57k948k190K500J801J660j114l865j45K372K817J740l073m022
1214c173K013K589J782l54l890j256J397R23K021r98l472k20R11J784J887k152
1230b08j394J121j24R95J461n30n11j428m58K691K32j345o4j667m66J203P84R89
1248A281j189l206J279J867R97O53j759j701J256J347J538Q65l532j557L93K412
$$ plain form
1131 -2538 -1135 704 2481 -63 -2739 -2341 -1528 489 1480 -756 -636 -59 -1203 848 2304 1183
1147 1183 785 -430 -111 1794 950 1029 493 -2629 -2267 -358 893 2221 -1142 -4502 -2648 397 2775
1164 2775 2237 -1773 -2639 -685 1583 4357 2497 -2606 -2533 279 2810 3254 -1076 -3100 -1961 -1001
1180 -1001 1353 1202 -1796 -1846 -1315 -594 1879 1056 -317 284 -531 -42 1365 1293 1936 714 -2279 -925
1198 -925 721 1451 1294 -1654 -3844 -1344 457 2117 1003 -2862 -3007 -635 2182 3922 849 -3173
1214 -3173 -1160 1429 3211 2857 -1033 -2289 -892 31 2052 1054 -2418 -2638 -1727 57 1944 -208
1230 -208 -1602 -481 -605 390 1851 1321 810 -618 -1076 1615 1847 502 438 -1229 -1695 -492 292 1281
1248 1281 92 -3114 -1835 32 1029 1682 -77 -1778 -522 825 2363 3228 -304 -1861 -1468 944
1264I44K339j658l500p62P92K232J819k239k095n2P61K957O03k125p93m31J653
1281D45K051r14r04k76j554O34J070o3M49j502j886J080O19J324N15k006j078
1298a996Q19J168K794k28l343r82J210K462J594k689k202k25M09K468P42k661
1314f60j594k69J658L026j379k067K76J03J272J610r22k56q33j320J677J385q72
1331H35j67j815n78J522r2R86l5k834l62K097J008J687j903k012J005Q96J479
1348A717J316k475j538K3O86K243R7k734j310K09J026K046p89j549l40o39J758
1365b53K379r87r27j251Q1K580O39j071q33j495N34J453k6m2j223j956J060J572
1383B34j26N76j514o55J190K65J226Q53j846j279P58Q04J972p39k364l61m18J118
$$ plain form
1264 944 3283 1625 -1875 -2637 -1845 387 2206 -33 -2128 -2180 -1419 1538 2141 16 -777 -1208 445
1281 445 2496 1582 678 402 -1152 -518 552 489 938 -564 -2450 -1370 -751 573 1088 -918 -1996
1298 -1996 -1177 -9 2785 2557 -786 -1768 -558 1904 3498 809 -1393 -1618 -1209 1259 2001 -660
1314 -660 -2254 -2523 -865 2161 782 -1285 -1009 -906 366 1976 1054 798 -35 -1355 322 1707 835
1331 835 668 -1147 -1725 -203 -295 691 656 -2178 -2540 -443 565 2252 349 -1663 -658 238 1717
1348 1717 3033 558 -980 -957 -271 1972 2069 -665 -1975 -1766 -740 1306 517 -1032 -1372 -2011 -253
1365 -253 2126 1139 212 -1039 -958 1622 2261 1190 357 -1138 -604 849 823 781 -442 -2398 -1338 234
1383 234 108 684 -830 -1485 -295 -30 1196 2049 203 -1076 -318 486 2458 1719 -645 -1006 -1424 -306
1401c06J908r78j650r87q4K850R56j938p71m61R13K260j6r21n54j167R28J350
1419A332k06l73j256q00J057N1p9O49j037r47P27N94J621r6k032j87N73J605J386
1438B582j568j590p6l0J764Q13k089j463Q1R15J818m33j633k51l81J096J864m72
1456I47n60n44p33J745Q12m25l21j535j57J010J7O49l63k666K2J621R28Q52j265
1475C4j920P96J112J144N09j549q01N23K70J840J4k804l95N58P3J592o06p07m78
1494g95j358J399K124p93n09m99p08J750J018r71K89j066m96J122M76O28j343
1511B68k483J042J415j54J96p08j115M08P06J380N31j798p03O29P45J710p79j674
1529c84O1J44K47J422p35j704q53J80K300O61j862m31n46L86K099J78n47o92o74
$$ plain form
1401 -306 1602 624 -1026 -2013 -2097 753 1709 -229 -1000 -1461 -548 1712 1696 775 221 -946 -18 1332
1419 1332 1126 753 -503 -1303 -246 -195 -274 375 -662 -1609 -882 -288 1333 1237 -795 -982 -409 1196 2582
1438 2582 1014 -576 -652 -682 1082 1895 -194 -1657 -1576 -661 1157 724 -909 -1160 -1541 -445 1419 947
1456 947 387 -157 -890 855 1667 1242 921 -614 -771 239 256 905 542 -2124 -2102 -481 447 1299 34
1475 34 -1886 -1090 22 1166 1675 126 -675 -152 118 1958 1972 -832 -1227 -669 -596 996 390 -317 -795
1494 -795 -2153 -754 1370 577 68 -431 -1139 611 1629 658 947 -119 -615 507 983 1611 268
1511 268 -2215 -1173 242 88 284 -424 -1539 -1131 -425 955 1486 -312 -1015 -386 359 2069 1290 -384
1529 -384 -323 -179 68 1490 755 -949 -1802 -1622 678 1339 -523 -954 -1500 -1114 985 1163 616 -76 -750
1548g50O57J552j94k25j200n78R10J60m82O71j159r97O72P60R53k19j555J20K92
1567f12R76J514q23j503mk5J145J533j326j658l91P37J307m28j315J12k51K93
1585g19J520n16p27K8l97J258P31l61n7p42l14N51K13K10M86k119m19J047M72
1604A45L98n72j236J62N26J028J215j487j309O55L49J778L47k230m70L13Q98O68
1622A178o02j037m96q13J299J635r26j070J43n91J339R15j06l13q73j59J502k08
1640H17J83n22j479P08J119m89j39k26j178J65M9J402O66j582l61N05J88J045
1658H71M58j259k91m1N86J348o07j352r95m2J878O59j547o45m40J81J616N56o77
1677B57q07n73J173J586m79n15r51l48J208J82l95K74o17q86K40M20M30j85p48
$$ plain form
1548 -750 -93 1459 1265 1040 -160 -738 172 332 -150 521 -638 -1635 -963 -203 750 531 -1024 -904 -612
1567 -612 364 1878 1055 -448 -452 -477 668 2201 875 -783 -1174 -437 870 442 -873 -761 -1012 -719
1585 -719 801 285 -442 -414 -811 447 1178 817 760 18 -296 255 468 678 1164 -955 -1374 -327 145
1604 145 543 -29 -1265 -1103 -577 451 1666 179 -1130 -475 -126 1652 1999 -231 -701 -388 510 1178
1622 1178 576 -461 -957 -1770 -471 1164 238 -832 -689 -1280 59 974 868 555 -318 -477 1025 817
1640 817 1000 478 -1001 -293 826 337 198 -28 -1206 -1041 -992 410 1076 -506 -867 -362 -174 871
1658 871 1329 70 -221 -262 324 1672 1065 -287 -1282 -1324 554 1213 -334 -979 -1419 -1238 378 934 257
1677 257 -550 -1123 50 1636 1157 642 -309 -657 551 733 338 612 -5 -891 -651 -231 199 14 -734
1696g34L6K32j61J533M11j575k99n2J198J223p26j365l75J50J631o6j376k62p87
1715a364L49J838k15j294l08j63J273N68m75L9j36k73O92K69k18k3j002J13M84
1734A54j22N55o42q47K11r9M85J325q49j147M45K50J322J03j046k56l0J04J500
1753A416l29j097n17p34O62J445m00j154j31m58J234N09l06N5r66l8J821J61k35
1772I38o20j079M83J093k33O4m65j150N16j9L78L98q77j38L89Q0M89N60p19j92
1792a04m13P09J189m2j079m16n51R70O20n75n12q21q0J134N30l61n92j039R17
1811e16J564j08p57m27m85J147P38o62l2n84j96M80jr3o4p35L38n1k73R29P1n45
1833b62k94j89R31J217o23r45j23k32J072O58o46p69q04P6J746j21j101n59l42
$$ plain form
1696 -734 -698 -466 -627 906 1317 -258 -557 -609 589 1812 1086 -279 -654 -504 1127 1061 -315 -577 -1364
1715 -1364 -1015 823 608 -686 -994 -1157 116 684 209 248 112 -161 531 800 582 559 -443 -330 154
1734 154 32 587 -55 -902 -691 -790 -305 1020 171 -976 -531 -281 1041 1144 98 -158 -188 -84 1416
1753 1416 1087 -10 -527 -1261 -599 846 446 -708 -839 -1297 -63 446 140 195 -771 -809 1012 1173 938
1772 938 318 -761 -278 815 582 646 181 -969 -453 -472 -94 304 -573 -711 -322 -242 247 807 88 -104
1792 -104 -517 192 1381 1339 260 -156 -707 263 883 308 -204 -1025 -1105 29 559 198 -394 -1433 -516
1811 -516 1048 940 183 -244 -729 418 1156 494 462 -122 -318 162 161 68 4 -731 -393 -444 -717 212 283 -262
1833 -262 -556 -745 186 1403 780 -165 -288 -520 552 1210 564 -205 -1009 -933 813 692 -409 -968 -1310
1852a310J102R16l70p9n27m43J111O32k32l20r29K68Q67l29J04k21r91J92K39
1871c20J2P86m55j033L53L26J001K33j005k8r7L9R69K44q06k18m97M02R64k68
1891F02q48j88p07P89N84m4j93p90n36J589O31j03l79r47M23R44j56J28o14r00
1911g15O19J96q9M8r65M2P48l80N14K40m74M8l19K23J227l09m39j32l56K41Q59
1932H27k48j58q32o19P30R58n97n26j236N29J760Rm29n22l67N86R46k4j88r38
1952c39j11J024R1m18m21n04K44O11m33J87O5l35j55J8L64N03j45j48N8o85P01
1973A72R31l88m68r29J94J040K68p11q65j45J47J072P9k43m22o22O55R02O9l51
1993C85j096N52P41j83M42l15j215M23K50L7K49l94p81M61J68M66K43q23k1J62
$$ plain form
1852 -1310 -208 708 338 259 -268 -711 400 1032 800 480 -449 -181 686 357 461 240 -751 -559 -320
1871 -320 -308 478 23 -1010 -657 -331 670 903 -102 -130 -227 -188 781 1025 219 1 -496 -94 870 602
1891 602 -246 -434 -1141 -352 232 188 -5 -795 -1331 258 889 786 407 -540 -117 827 671 799 185 -715
1911 -715 -96 100 11 59 -906 -864 -116 -496 18 258 -216 -168 -487 -264 963 654 215 83 -273 -32 827
1932 827 579 421 -411 -1030 -300 658 61 -465 -1701 -1172 588 597 168 -354 -721 -135 811 787 599 -339
1952 -339 -450 574 665 247 -174 -678 -434 177 -256 -69 -4 -339 -494 -476 -112 391 246 98 156 -529 172
1973 172 1103 715 247 -682 -488 552 820 109 -756 -901 -754 318 397 154 -268 -890 -235 667 736 385
1993 385 -711 -159 582 399 841 526 -689 -266 -16 21 270 -124 -905 -444 -276 190 433 -390 -411 -249
2013b49j54Q75J16m77N5M9nL80l37ol69o19L96O09j22l4r34n33J391N45K7o25
2035b1o29K45J084J11K51m32j421P05O48L0j67r17l24Q75r5Q8r1o14J66J18J69
2056b21O05K3n07M53l43l27P75L30k69m42p70L67R64l61k14q97l63J053M64j24
2076A96j22r90M47R79K29M6j066o06J330l3J28k28o02j42O13K3r3k98n05L29J10
2097b55J95M28n58j51M09j56R7N35m5l25m12j4O08J24j75k90o78Q8R05l10J12
2118A32o61n32N47Q87J73j08p89q8N10J12M15N9q11j45N46L81Q5r72n79P68j13
2139a83J84P6n38j51M55j27M91K17m10L84l08M07p4k26J14J26q43K41N64n41K46
2160A04m12m68M02M74Q7J31q57j45Q45J27P91p04j107M91P29K16k7q04m62J92
$$ plain form
2013 -249 -403 472 588 111 166 215 210 590 253 247 -122 -741 -345 264 142 108 -826 -1359 32 577 604 -21
2035 -21 -650 -405 679 790 1041 609 -812 -107 541 571 404 -513 -837 38 -57 31 -60 -674 -508 -390 -221
2056 -221 384 407 -100 353 10 -317 458 788 519 77 -693 -326 638 277 63 -834 -1197 -144 320 196
2076 196 74 -916 -469 510 739 785 -281 -887 443 410 538 310 -292 -434 179 202 109 -189 -694 -365 -255
2097 -255 -60 368 -190 -341 68 -88 9 544 499 174 -238 -252 356 480 305 15 -663 -575 330 20 132
2118 132 -529 -1061 -514 373 546 438 -351 -439 71 183 598 657 -154 -299 247 628 713 -259 -838 -70 -183
2139 -183 1 77 -461 -612 -157 -284 207 424 14 398 90 497 423 197 311 437 -406 -165 399 -142 104
2160 104 -308 -776 -374 100 187 318 -539 -684 161 288 1079 375 -732 -241 488 704 677 -127 -589 -397
2180c97K06N31j70r81J36L71J90N88n07n71O84lJ52K86n27L12O1o57L14N20o73
2201a35N11n24m21K41K94J17J17p71k2O43L24L47q49m97O02P39k29o4m56l55L52
2222c6M16J82l06q84J97M49j20L42l80m94M56l8M07J01j91Lj9j55N44k3l45J87
2244B93l68k21N62j18o7k71n91L90L31L9L70m44k96M53k12Q90J7r80j83M81L18
2265C93M83o88n30O3J60M8O70q29n01K77J90O34l10m48o0J29N59M35m45j41J85
2286B74j16J25K33l75j02p1k21J09j03P2N77p94k9J94K09L38J11q73J43M33M03
2307E37O56p49r12L59j24P61R1r27l60J82L98N51o41n66Q03m9K1M68k13j08n6
2328A22l58M00J29k46K93r8k93J78q5j99K39l29k45M27m7J51Ro78N38R2M5N87
$$ plain form
2180 -397 -191 340 170 -811 -675 -304 -114 474 -33 -604 80 77 229 515 -12 300 361 -296 18 538 -135
2201 -135 376 -148 -569 -328 -34 83 200 -571 -593 50 374 721 -128 -625 -23 716 487 423 -33 -388 -36
2222 -36 380 562 256 -628 -431 18 -102 240 -140 -634 -178 -216 191 292 101 104 85 -70 474 451 106 293
2244 293 -75 -296 266 148 81 -190 -781 -391 -60 -21 349 -95 -391 62 -150 740 757 -223 -406 75 393
2265 393 876 188 -342 -279 -119 -71 599 -230 -731 -454 -264 370 60 -388 -448 -319 240 675 230 89 274
2286 274 158 283 516 141 39 -32 -253 -144 -247 -175 402 -392 -421 -227 -18 320 431 -442 -299 134 537
2307 537 1193 444 -468 -109 -233 528 619 -308 -668 -486 -88 463 -178 -744 59 10 31 499 286 178 122
2328 122 -236 164 293 47 340 242 -51 127 42 -157 82 -247 -492 -65 -112 39 48 -630 -92 0 45 632
2350F32m83l92K20L96N1j13n35l60M74J40J84k97l07n2j8O11M38o32o8k7j25P22
2372D59K1l46P0l21JO66j55k48j58n58M33O1j13o0J51m21M20j46K09M81n08j07
2394a69Q8L02J79l0n11K58j62O0L78m41l40j16OM06L40o38q4J18L47M06j20l88
2416a11P0k22M58M41n05k05j02P9L70m8l77K58k93k11J46J3J72L7k26PR3L24L68
2439E36j22n23M3m0M22N79r70k20n4L05K55k00m51N6L6J33M52l4k68j29M2L78
2461B26L71n23J85L7m47L01k08R7K41o06n8M86j62J47j20l63J09P1K82L52m24
2482fm5L72p9K42j28n69K51K29j97K72j81m20J49k55K23M93m85k50J67o2L56J36
2504B13m6L1k60k2L11J4m5k69k28L99J15j72j17j08k38J00K15J11O6m35L04Q2
$$ plain form
2350 632 149 -243 -23 373 424 311 -224 -584 -110 30 214 -83 -390 -442 -460 151 589 -43 -111 -138 -263 459
2372 459 480 134 204 -117 -116 550 395 147 -11 -569 -136 -75 -188 -248 -97 -518 -98 -244 -35 446 -62 -169
2394 -169 -81 221 400 370 -141 117 -45 15 393 -48 -388 -504 -498 -92 248 -390 -474 -356 -9 397 277 -111
2416 -111 -41 -263 195 636 131 -74 -176 -97 273 225 -152 106 -187 -398 -252 -239 -67 -30 -256 -249 -156 168 536
2439 536 414 -109 -66 -106 316 895 -75 -295 -349 -44 211 11 -440 -384 -348 -215 237 203 -65 -194 -152 226
2461 226 597 74 259 296 -151 150 -58 39 280 -326 -384 102 -60 87 -33 -396 -287 -216 66 418 -6
2482 -6 -51 321 242 484 356 -213 38 267 70 342 161 -259 -110 -365 -142 351 -134 -384 -217 -279 77 213
2504 213 167 198 -62 -84 227 241 196 -73 -301 98 213 41 -76 -184 -422 -322 -107 4 70 -365 -61 21
2526B1J38N5J6m21M38k80M3K68j92l70l3K35L02L14q37J86j07k03O36L0m99K8
2548b32m3K60M10j12k23l5j08L03N3j01Qm75j69Q5L48M1N1k13l4J78p9J92Q7j79
2572A3j80J53R9M21n24R4k87M01q7M6n70K56J61j52K35k7l62P7k4M21K68l25K09
2595C16k68N6j6L6r7L08m82N2k2j9n4R7l14K98l04K16M93n67o3J34K76K09J54
2618D39n08J11K16j67L01j89k81j85Q0J58K42l90m4Jj23M01R8k43J64k44j33P36
2640D40k20M6m0l32N5M67n13L01l06k28K6J26K91P4m62J19K70l07J35M26l99L7
2662FJ12R5L53k61k86j37Q2N7L29k42l90J0k2M15q9l03k99J59N84K87k54j1j95
2685@q3L99m7j40r5j65o0K22j47J86j78k78K94k8j17K16J49l15JK2K05M38j56
$$ plain form
2526 21 159 214 230 -191 247 -33 10 278 86 -284 -317 -82 220 534 -303 -117 -224 -427 209 239 -260 -232
2548 -232 -275 -15 395 283 60 25 -83 220 273 172 180 -295 -464 -379 -31 10 61 -152 -186 -8 -87 105 192 13
2572 13 -167 -14 85 506 -18 76 -211 190 103 149 -421 -165 -4 -156 79 52 -310 -233 -257 164 432 107 316
2595 316 48 104 88 124 27 335 -147 -95 -117 -136 -190 -93 -407 -109 -413 -197 296 -271 -334 -200 76 285 439
2618 439 -69 42 258 91 392 203 -78 -263 -183 -25 217 -173 -217 -216 -339 62 160 -83 81 -163 -296 440
2640 440 220 266 226 -106 -51 416 -97 204 -102 -330 -304 -178 113 187 -275 -156 114 -193 -58 368 -31 6
2662 6 118 213 566 305 19 -118 -36 21 350 108 -282 -272 -294 121 32 -271 -570 -411 173 460 206 195 0
2685 0 -83 316 269 129 34 -131 -191 31 -116 70 -108 -386 -92 -120 -237 -21 128 -187 -186 -164 41 479 323
2708C23j48j26J6K48K08o33j33l0K95J45p0l39j6J5K47J35j72j53K1O5M52J9l14
2731E5M9j81J90P6k04o7J30k13j24J3Q8K60j39j65O4J20L6K93m63J24n2l3M84
2754C41l3k75j13k43K73K57k02k57k1o5K41J82j40o6j35N1L68L7j34M0j2J3M6
2777A53L33m87L9k52J87L0q1m9j67J81J38r7O0K39m95Q4K03j5R0R2l69L33k23
2800g3j07O12l69M5k56l30N87Q2l15k97J25O6L26J24m02R8k46L22K58j24k66N6
2822h4J51K08P4m84J63j32KM8q9J71J15j55j69PK82Rk35O0K04m03N69M4l59j17
2846a20J05J2M54l01m22M8p3J15K89k79R7r6N8M18j73O1O9j99l56M90Q7k60Rj42
2870a09J78Nk95J80j14n3J9J11N0J35l15J88p6j5L10k08P3J63l86J45L57j54m38
$$ plain form
2708 323 175 49 65 313 521 -112 -245 -275 20 165 95 -244 -260 -245 2 137 -35 -188 -167 -102 350 369 55
2731 55 104 -77 113 189 -15 -82 48 -165 -289 -276 -188 72 -67 -232 -168 -48 -12 281 -182 -58 -110 -143 341
2754 341 308 33 -80 -323 -50 207 5 -252 -273 -338 -97 85 -55 -121 -256 -205 163 200 66 106 94 107 153
2777 153 486 -1 38 -214 -27 3 -78 -127 -294 -113 25 -72 -12 227 -268 -184 19 4 94 186 -183 150 -73
2800 -73 -180 432 63 108 -148 -478 109 191 -124 -421 -296 -230 96 220 -182 -84 -330 -8 250 126 -140 -84
2822 -84 67 275 349 -135 28 -104 -102 -54 -143 28 143 -12 -181 -174 108 117 -118 -58 146 -257 312 356 -3 -120
2846 -120 -15 -3 451 150 -272 -224 -297 -182 107 -172 -75 -171 -113 305 132 193 262 63 -293 197 284 24 33 -109
2870 -109 69 74 -221 -41 -155 -208 -189 -78 -28 107 -208 -20 -96 -111 199 -9 64 227 -159 -14 343 189 -249
2893b49P1q7K70K12l2k90j62o9N05M9k44J23k22p1L91O9o7k08N8N8K05j88j74
2916e2k47m7K72J7j98L37l33J38K72k95L8J80r9N8O2l40N07K9r5j76k58L96p8
2939H8k38j10K8l7L30N3j00k44m7M01j04L34m23O4j31L47m0j33K49l95K8K23j74
2962c1K4Nj7m2k9n0P2p0J29J4QM3K2R3k54P9J48O4k30j12L37n42K46K74l19n1
2988a89K53k56J69J03K18k19j46O1J83k24N14m27j35O7K60k41J53j24k08L45k04
3009d7l3M4J8K0nj19J78K12k91K78j63j05K61L1k37l0L9j16J65J1k8j46j90J46
3033a07L17l06R5l07J89L35mN9j26m96L74L65j25l03q4J76M0J4k53J72k10j3K28
3056C0j34J26R6k49L09j47m4J03p3K51r8l73K53N7k99L37q5k93K20O2p5j28J33
$$ plain form
2893 -249 -178 -265 5 217 185 -105 -267 -336 169 218 -26 97 -125 -196 195 264 197 -11 47 105 310 122 -52
2916 -52 -299 -346 -74 -57 -255 82 -251 -113 159 -136 -98 82 -17 41 103 -237 270 299 204 28 -230 166 88
2939 88 -150 -260 -232 -269 61 114 14 -230 -277 124 20 354 -69 -5 -136 211 171 38 287 -108 -80 143 -31
2962 -31 -7 -2 -19 -61 -90 -140 -68 -138 -9 5 13 56 78 171 -83 -4 144 208 -22 -134 203 -339 -93 181 -138 -189
2988 -189 64 -192 -23 80 298 79 -67 -6 177 -47 467 40 -95 -28 232 -9 144 20 -188 157 -47
3009 -47 -80 -36 -18 2 -3 -122 56 268 -23 255 92 -13 248 279 42 12 51 -65 100 111 83 -63 -253 -107
3033 -107 210 -96 -1 -308 -119 216 212 271 145 -351 23 388 263 -40 -124 52 92 106 -147 25 -185 -198 30
3056 30 -104 22 118 -131 178 31 -13 90 17 268 170 -203 50 107 -192 145 60 -233 -13 49 -26 -154 -21
3079b1k61L10K8O8k9j58K47M4k33Jj6J04M5k3J3j41j84J24j4n0J39M3j87K22J11
3104A82j31m7R7l8j48K6J60j78K71J63l98j42L24k42O9j47P8q4L34k87J80j38
3126i6j2J53N9K49j11l17Q5O6o8M9r3k30K74J10j85J59l11j38L87J19j78j14K1
3149a22j9R0J91R8j48j1K4k18L9Q2k64J52%k40K60J04j74M06m39J56K61k05L0
3172E3r1j25J99K33j65l0j47o6K37K4J53m5o38M23r6J9q7m0N6K12o8n6n2p7J33
3197d1P0j62J77J89n23L17P2k98J07l2J39jk84J48K6J32M5k91K4J33J09J18n0
3220A24m9j00O9j42J31j8j54R6K21l98K81k12q7K11r6J19j44j6J25n8J07J9M6
3243G5j0k05L36k86l5K11j39l03O8K50J23j73M6j68K19J32j37K88j50j80j4K57
$$ plain form
3079 -21 -282 28 56 124 95 -63 184 228 -5 -4 -20 84 129 106 119 -22 -206 -82 -96 -146 -7 36 -151 71 182
3104 182 51 4 101 63 -85 -59 101 -77 194 357 -41 -183 141 -101 -32 -179 -101 -185 149 -138 42 -96
3126 -96 -108 45 104 353 242 -75 10 76 8 57 -36 -266 8 118 -67 92 -219 -357 30 149 -29 -143 -122
3149 -122 -141 -51 140 238 90 79 103 -115 -76 6 -258 -106 -106 -346 -86 18 -156 250 -189 -33 228 23 53
3172 53 -38 -163 36 269 104 74 -73 -139 98 122 275 230 -408 15 -81 -62 -149 -189 -133 79 11 -45 -97 -174 -41
3197 -41 29 -133 44 233 -290 27 99 -199 -92 -124 15 14 -270 -122 -96 36 81 -210 -186 -53 56 174 124
3220 124 75 -25 44 -98 33 15 -139 -43 178 -220 61 -151 -238 -27 -123 -4 -148 -164 -39 -97 10 29 75
3243 75 65 -140 196 -90 -125 86 -53 -356 -288 -38 85 -88 -42 -210 9 141 4 292 142 -38 -52 205
3265B05k51J21N5j36p2P6R1p1J2nj42J28n7n0j61J46N7O0L3J29k66M27n77L79
3289A31J45j91n2J57j99O2l1o8J98k44r2P9O7J17N4n2o8N5j11K67N5n29J02L81
3313B33j48j05J77l84L20j09m0nk40J61j02J91K79k28j73J86K8j45J87m2j34M9
3335d4M2m1J39k18j54L53j75R3J7j54k0K65k47m8K22J17j06M4q7m4J41q1j71o1
3359b18L34O1M8k31k7k9j29K38J8k4k43K28l0k03J85j6l9M2J46j4L3p3jL6j63
3384g1M84l97j4n7j01J99o4j69K08p0j8J12J41j69J20j54j06J35k7R2l2j6j24
3407i8L07j24j38k3J14j13m3J25J42j49j33Q5R1J2m1N2J42j82R6k21J9R5j46J7
3431a14L11k73j6p8K36k17K43j40L38k46J11k05K1J24J9M2k94J05O6J37k10j16
$$ plain form
3265 205 -46 75 130 -6 -78 -2 89 18 30 25 -117 11 -46 -96 -257 -111 -54 6 39 168 -98 329 -248 131
3289 131 276 85 33 190 -9 53 22 -46 152 -92 -184 -105 -38 79 133 81 13 68 -43 224 279 -250 -148 233
3313 233 85 -20 157 -227 93 -16 -56 -61 -301 -140 -242 -51 228 0 -173 13 41 -104 83 41 -93 -44
3335 -44 -2 -43 96 -122 -276 77 -98 -5 12 -142 -162 103 -144 -192 30 147 41 85 -2 -46 95 14 -157 -218
3359 -218 116 177 225 -6 -33 -62 -191 47 65 41 -202 26 -4 -207 -22 -38 -77 -35 111 97 130 57 56 92 -71
3384 -71 413 16 2 -55 -156 43 -21 -190 18 -52 -70 42 183 14 134 -20 -126 9 -18 74 42 26 -98
3407 -98 209 85 -53 -76 38 -75 -118 7 149 0 -133 -48 43 55 14 66 208 26 122 -99 -80 15 -131 -114
3431 -114 197 -76 -92 -170 66 -151 92 -48 290 44 155 -50 -29 95 114 156 -138 -33 33 170 -40 -156
3453a56L61k29l3Q6j51q4K64j84J78p6R2q4N0j99L38r7p3K14l53J45K7k19L53
3476A70k1k27j04P8J37K37l72M3L81j76j83P4j09oJ49J04p3j97Q9q7o4L17j75
3499a5k0j4j03K14j25L7K4K12j36p6K36j41Jj01L4LN0Q6j70M1O2q7o6K59j70q1
3525d6Q9k12L33q6J21k37K6M5J83j03j66j59J61J6m3N0q6q9LJ25J11j25l8Pj08
3550b28L86j71L4k2k3J39p5J98k28J74j68P1j22n8K7K44k61K2r2K21j90J47N2
3573G7O9k28j02L01n7m3m7K52l46R9r6oJ45k4J78k70J73q9M5k02J42M7m6J3k6
3598d1L1J27r0j3J3j16O3Q5L4o2l9L5J18k33J8J90m77L51o5Q5j24J73k16J06O7
3623B0J39j40K9L7j17K79n4j93j59L05k44J85j38n6J61k77J69K45l6p1M8l34K78
$$ plain form
3453 -156 205 -24 -57 29 -122 -206 58 -126 52 -24 68 -16 34 -165 173 76 3 217 -136 9 36 -183 170
3476 170 149 -78 -182 -104 33 270 -102 -59 322 146 -37 37 -72 -78 71 175 102 -95 -6 -93 -157 160 -15
3499 -15 -35 -49 -152 62 -63 -26 -2 210 74 -2 234 93 94 -7 27 30 80 166 -4 37 99 12 -54 205 35 -46
3525 -46 43 -169 164 78 199 -38 -12 33 216 113 -53 -212 -51 -35 -78 -28 -114 -203 -200 -75 36 -89 -127 -120 -228
3550 -228 158 -13 21 -1 -24 115 40 238 10 184 16 87 -35 -93 -66 178 -83 -61 -153 68 -122 25 77
3573 77 146 -82 -184 117 60 17 -30 222 -124 -25 -121 -127 18 -6 172 -98 75 -14 31 -171 -29 18 -28 -15 -41
3598 -41 -10 117 27 14 27 -89 -26 59 93 31 -8 27 145 -88 -70 120 -357 -6 -71 14 -110 63 -153 -47 20
3623 20 159 19 48 85 -32 247 193 0 -159 146 -98 87 -51 -107 54 -223 -54 191 155 84 132 -202 76
3646G6J62j34q6J09j33k9K12k24K61l55L49l34K7J53k79J14J13j95K75k2p8j29
3668a47LJ75J8m9k5r7K27N5p6k2l11K72p2O3P7J8k77K44k04L24P9k81J65k10N
3693d6J4J10j41K64l10j3K57j10q2M8j16N5k47L04K44q7%n1q2r9J1j59M27k14
3717b3l9J80k25J07j30J47q3M4k6J19o1j15j0J31r0q4k0J42J86j96J01o4J10m2
3741E9K38l20M6l05J45L0R9r1K70l14R2k0J34o4k1L5L0l8q4j21K81n9j23J04r7
3766i4K05j90q6L13j63l1K7j63M75k47j96K81k00l9J83j11K57l25J90l9j12k5
3788i0j4J62P6j85mn1J64j96K76m07J32P3l4K51p8j32m2J28j17N6K92m67Q9pK40
3813A15n8O7M3j57m6QJ98j75M2k6n6J91l26K52J08k13j41K49j97R1J28j40o4P3
$$ plain form
3646 76 238 104 18 127 -6 -35 177 -47 214 -141 208 -126 -99 54 -225 -111 2 -193 82 60 -18 -147
3668 -147 -144 31 49 0 -25 -122 105 160 84 62 -249 23 -49 14 91 109 -168 76 -128 196 275 -6 159 -51 -46
3693 -46 -32 78 -63 201 -109 -122 135 25 -57 -9 -125 -70 -317 -13 231 144 144 93 11 -88 -77 -236 191 -23
3717 -23 -62 118 -107 0 -130 17 -66 -22 -48 71 10 -105 -115 16 -74 -158 -178 -36 150 -46 55 -9 101 59
3741 59 297 -23 23 -282 -137 -107 -8 -99 171 -143 -51 -71 63 -1 -22 13 43 5 -79 -200 81 22 -101 3 -94
3766 -94 111 -79 -165 148 -15 -46 -19 -182 293 46 -150 131 -69 -108 75 -36 221 -104 86 47 -65 -90
3788 -90 -104 58 134 -51 -55 -106 58 -138 138 -269 -137 -64 -98 153 75 -57 -99 29 -88 -32 260 -207 -118 -125 115
3813 115 57 124 167 10 -36 -28 170 -5 37 11 -45 146 -180 72 180 -33 -174 75 -122 -31 97 -43 -107 -34
3837c4j82K53k22K32p3j31J74M2L6m1K53m58K45k56n8J89K04l16K56j74J45l8
3859D6p2j60K95k64JK52k36J96J3j02j2r3L13j82P5n7J90l97K07J11l52J31n4
3882a51m2K26j15K42P1j6n4j77r8K46j31J4j00k9J41J45n3m0j17O7k90M10Kj57
3906fJ23l21K11j00r6J28L6K6k0J00m1k18L17j17j81O2m1R7J63l42O7J94nk5N8
3931F9j40o6J73M0L1j74q6K25pm0k05J46J6O9m4q2q5P4K49r5j1j85P7j21L54k86
3957a04J19M8j12J49P1j81J7j01j15K50K72m68P4K22k78J83j27R8j81K35L2j88
3979h5J62j77kJ36R4o5q8J64Rj49J6%L5k3k93K40J37l10K92oK5J24n9l71K8J85
4005A9k10K40j65K4K54k75Q9k14J6K84p7L8j61K58KKk66J47k5O3j59J87l1J08
$$ plain form
3837 -34 -216 37 -185 47 -26 -157 17 59 95 54 307 -151 94 -162 -220 -31 173 -143 113 -61 84 46
3859 46 -26 -186 109 -155 -154 98 -138 58 71 -31 -43 -136 177 -5 70 13 203 -194 13 124 -228 -97 -151
3882 -151 -193 33 -82 160 231 215 161 -16 -114 132 1 15 -85 -114 27 172 119 79 -38 29 -261 149 151 -6
3906 -6 117 -204 7 -93 -189 -61 -25 1 -19 81 40 -178 139 22 -159 -97 -138 -41 122 -220 -153 41 36 11 69
3931 69 -71 -137 36 76 107 -67 -153 72 65 25 -180 -34 -18 51 7 -75 -160 -86 163 68 57 -128 -51 -172 182 -104
3957 -104 15 63 -49 100 171 -10 7 -94 -209 41 313 -155 -81 141 -137 46 -81 17 -164 71 103 -85
3979 -85 77 -100 -102 34 128 63 -25 139 148 -1 15 15 50 27 -266 -26 111 -199 93 87 112 236 177 -194 -166 19
4005 19 -191 49 -116 -92 162 -113 -24 -238 -222 62 -15 23 -138 120 122 124 -142 5 -20 43 -116 71 40 148
4029A48j28r2K36k57j48K39j72m4K66k18L88k70J74k13J27k03L89o2j45j48q9
4050b22L3J35J9J11j87k1K53k93K18j43N0kL3P3L6o1k05K58J08m6J0m58L87oO9
4075A49k31R7%j19J6R1J09j28J72l4j06j32J79l6j51L09m62K22L6L3J01q8K15
4098B42k35JJ09p3o4J87k14K4l1n5J75k36K56o9J48k87P5L7n6M0J07q7L9j35J61
4123E9j44K45j38k07J95o2J27j91K43q8J54k90J07L5k6j59k7J67j05K23m6j25
4145e3J37k32l5Q3J6L5K76j10n4j5j71J56K2j3j63n6K04j72J16J3l0J10j07r7
4169a40N0K02k34P9oJ2jm9L38k62P6k9Q5j72L20k06j2mQ5k14MK21j99R4J75l97
4195a84J37o3O9m4p7L48k22N6j5j6m8rN2J06l16K62j65J98J13k93K0r4K55j39
$$ plain form
4029 148 20 -72 164 -93 -241 -2 -174 -218 48 -170 218 -52 122 -91 36 -167 222 160 15 -133 -222
4050 -222 -189 -54 -35 76 -111 -132 121 -172 46 -97 -47 -49 -16 57 93 32 -173 85 193 147 157 -301 86 80 149
4075 149 -82 15 15 -104 -88 3 112 -16 156 122 16 -116 63 27 -124 185 -277 -55 -19 14 115 27 242
4098 242 7 8 117 44 -20 167 -47 -23 -54 -109 66 -170 86 17 165 -122 -47 -10 -66 -26 81 -6 33 -102 59
4123 59 -85 160 22 -185 10 -52 75 -116 127 39 193 -97 10 45 19 -140 -167 0 -105 118 72 -53
4145 -53 84 -148 -183 -100 -84 -49 227 117 63 48 -123 33 55 42 -121 -177 27 -145 -29 -16 -46 64 -43 -140
4169 -140 -90 112 -122 -43 -49 -37 -38 -87 251 -11 65 36 121 -51 269 63 51 47 132 -82 -78 143 -56 38 213 -184
4195 -184 -47 -110 -41 -85 -162 186 -36 20 5 -11 -59 -68 -16 90 -226 36 -129 69 182 -111 -91 -185 70 -69
4219f9K47j00n5P9j43L5K46k68p5J66q1N2j10O6J2J18j17j6j0n6K1K16k24P0J49
4244A53k52p4j84K64J55j02P9j04N4j59R7J99k77JK43j40k0j69L72j67k07M24
4266A86r2kK89l92K06j0k66L30j83k13O8J25q6K8p7K8J73K1j55P2r7l0rP5J55
4291A44l78K48N5k30Q2k1K69j82M9J30j41mO9R7q7J31l58R0K05k74K35j81m9%
4315a01K27j32J71k21J91j05K58l89P7m1j06K21J07k19J9L9M6o8j44J57k32L93
4337A48j07p0l1L4j1j62J09k9J5K56l33K24p4m1J05o2Q4Or0P7J24k13j06K19N4
4362A26m4p4J16J6j04J20j66J8L07l52q6L58l16J81O4k26J24m4J8j2n7Oq3J77
4386F7M6j10r9J26l1L3J1o5n6K1K22k07n4P2J08kk50J19J78k35N6M6P3j67L9M7
$$ plain form
4219 -69 178 78 23 102 -41 -6 240 -28 -103 63 -18 34 -76 -10 2 120 3 -13 -23 -79 -58 158 -66 4 153
4244 153 -99 -173 -357 -93 62 -40 39 -65 -11 -170 -73 126 -151 -150 93 -47 -67 -236 136 -31 -238 186
4266 186 94 92 381 -11 195 185 -81 249 66 -147 -79 46 -40 -12 -89 -61 112 133 -22 50 -47 -77 -86 -11 144
4291 144 -234 14 69 -161 -79 -100 169 -13 36 166 25 21 90 187 100 231 -127 -37 168 -106 129 -52 -101 -101
4315 -101 126 -6 165 -56 135 30 288 -101 -24 -65 -171 50 157 -62 -43 -4 42 -26 -170 -13 -245 148
4337 148 41 -29 -60 -26 -37 -199 -90 -119 -104 152 -181 43 -31 -72 33 -29 55 61 -29 48 172 -41 -147 72 126
4362 126 82 8 124 140 36 156 -10 8 315 -37 -123 235 -81 100 164 -62 62 18 36 24 -33 -27 -110 67
4386 67 113 3 -96 30 -1 32 43 -22 -78 -57 165 -42 -96 -24 84 82 -168 -49 129 -106 -50 -4 69 -98 -59 -12
4412a2p0oJ81j60J54R2j61n3J26j60k00K87m3J3L4L2j01J76k45J36j0J1pq7Q9
4437A6J55j09J3j56J30j59J25J55k29L09j89k10J11J29mj18O6j8Q1J11l55J41
4459ej31L08k45J17l1L2M8l3o5j04J32R7j79j14R0K84k0k26j32K07j07J07j49
4482a19L08j98m2P8J52p4j52K05j54Q9K7M2k97J65J9j37J6J90l36K80l6K0k10
4505a64K64j87K18m6j57J96N8j83L42l22J12k0j61o3J6K83q8k80K23k23r5K07
4527g0o3K19k23K36j15J9jM7j5N9j46L7K32l13O8k3L5p2n3P5K25k17r1O8Q8r4
4553h8J9Q1j9Q6j16N2m7k66R8K37P2J38l22K00j39N3JJ01j18p4O4K01k10l5KJ
4579b8k9l6m8J08r8j09N75m51o6J4K73q0j95m9N05m40J32p3K33k36PK5P1J10J5
$$ plain form
4412 -12 -82 -88 93 -67 87 179 18 -35 91 -69 -269 18 -25 -12 22 54 -47 129 -116 20 10 21 14 -73 16
4437 16 171 62 75 -81 49 -110 15 170 -59 250 61 -149 -38 91 87 -31 35 17 98 209 -146 -5
4459 -5 -136 172 -73 44 13 45 93 60 -5 -109 23 120 -59 -173 -83 201 181 -45 -177 30 -77 30 -119
4482 -119 189 -9 -51 27 179 105 -47 158 4 93 120 162 -135 30 49 -88 -72 118 -218 62 26 46 -164
4505 -164 100 -87 131 85 -72 124 182 -1 341 19 131 111 -50 -113 -97 186 98 -182 41 -182 -277 -70
4527 -70 -133 86 -137 99 -16 3 2 49 34 93 -53 -16 216 -97 -29 -52 -17 -89 -142 -67 158 -59 -150 -82 6 -88
4553 -88 -69 12 -7 79 -37 15 -32 -298 -200 37 109 247 -75 125 -14 39 40 141 23 -51 13 214 4 -31 -29 -28
4579 -28 -57 -93 -141 -33 -131 -240 335 -116 -182 -168 105 25 -170 -219 286 -154 -22 -95 138 -98 -91 -66 5 115 130
4604A30j2L0j02j28Qo0K67n6rj48J29r5R9J35n4K2k17O8l4j21K01n4r4R5R6l44
4630b48J37Q3R4l3j31J79k33J57K1M0j35M2j01K10j02j2j28p7J73j59J76J2K43
4653B08l33j3o9o3L41p6j58J89r1J6J07q7m9O1J69k14P2J20m2j0k36P9L1pJ31
4678G6r1j24J22Oj03R1K58k08j15K25k88J80l4O6k55L11q3j31J92j96J03lJ07
4701A06k01K55r3J91m02J56j56P8l0J15j72L29j62J22j99Q4j97J5L49l06M0N5
4723b3o5J01R3k60J78M3k39J10J41K4j24o5jJ35j88K63j7J17l88J01L35l27o8
4746a24j9K75q6L2j28M1k94L92Pj98K26j11N8L7r6n9l1j12J00m6J12j37L17l98
4770b42K08P3L9K2j40Q9j33K42L3k88J72O5J20l58L66j23j1M7K7j37j38J04j72
$$ plain form
4604 130 118 148 46 -82 -74 -134 133 77 68 -80 49 -46 53 188 134 156 -61 7 -27 -148 53 -1 -95 0 96 -248
4630 -248 -111 -28 66 33 -98 81 -152 5 26 66 -69 -27 -128 82 -20 -32 -160 -237 -64 -223 -47 -35 208
4653 208 -125 -138 -207 -270 71 -5 -163 26 -65 -49 58 -29 -78 -17 152 -62 10 130 88 78 -158 -79 -48 -55 76
4678 76 -15 -139 -17 -11 -114 -23 235 27 -88 137 -151 29 -5 61 -194 117 34 -97 95 -101 2 -1 106
4701 106 -95 160 67 258 -144 12 -144 -66 -96 19 -153 176 14 136 -63 21 -176 -161 188 -118 -78 -23
4723 -23 -88 13 106 -154 24 67 -172 -62 79 103 -21 -86 -87 48 -140 123 106 223 -165 -64 271 -56 -124
4746 -124 -143 132 46 78 -50 -9 -303 89 96 -102 124 13 71 108 12 -47 -78 -190 -90 -136 -24 -161 156 -242
4770 -242 -34 39 78 100 -40 49 -84 158 191 -97 75 140 260 -98 268 145 134 181 208 71 -67 37 -135
4793a35J93j36l7J99K01k14K2O8k51Pk2L38k93J19k66K1K73j24J10Km8J04j38
4816gl20K25J56j50j5J93o5j47K70j05J32j44L2r0R8l17QK04K26l7k83J53p7J52
4840I2n6j62K02j30KQk5J05pj42R0J31k87J55j42K61j56j28K53k07K72q2P2p1
4864D8n0J3n6L21k90J83q6Nk20N8L04o4j55J45q5j35k47L26m1m2o4J26nQ2j55
4889h4J51k20jM8P3J53j94M4K14o7Qk04rK33k17R6j80J77l3Q8r1N2Rj40L0J39
4915G5J54k76J69o4P1j4j11l8l5K96k38o1jok11L74K7Rj33J21J8l67J79K07o3
4940H2j79M2N5J67o3j48O4j5p7nm9K37j07R0l6q3O6J3N0j9o8l9O6N5or7k4P6Q3
4969A31k0j85K2Q8j33K04j29j53J44N0j56J52J47j23kk99K04L10j59J9j27k1l7
$$ plain form
4793 -135 58 -78 -115 84 285 71 93 161 -90 -83 -105 233 -60 59 -207 -186 87 -37 73 75 27 131 -7
4816 -7 -327 -102 54 -96 -111 82 17 -130 140 35 167 23 55 -35 63 -254 -246 -42 184 147 -136 17 -60 92
4840 92 36 -126 76 -54 -52 -44 -69 36 29 -113 -23 108 -179 -24 -166 95 -61 -189 64 -143 129 47 119 48
4864 48 -2 11 -45 276 -14 169 83 88 -132 -74 230 166 11 156 71 -64 -311 15 -26 -68 -132 -6 -11 71 -84
4889 -84 67 -153 -154 -106 -33 120 -74 -30 184 117 125 -79 -88 145 -72 24 -156 21 -12 76 -15 37 46 -94 -64 75
4915 75 229 -47 122 58 129 115 4 -34 -69 227 -11 -72 -73 -79 -290 84 111 120 -13 108 126 -241 -62 145 82
4940 82 -97 -55 0 167 104 -44 20 5 -72 -77 -126 111 4 94 58 -25 41 54 104 85 17 -22 44 99 93 -4 -28 48 131
4969 131 111 -74 -52 36 -97 107 -22 -175 -31 19 -137 15 162 39 37 -262 -58 252 93 112 -15 -36 -73
4992g3J37r8J3m5k2K18J8r7N1l7j20J14qkl6jkj43J90J1k32K99j08k34J72K14
5018A79j04k40L2J52r0K56k40K7J10j5r9J28Q2k85K40l3k73L11J92k12n1j80O4
5041d9R5N5j53M1O9J0n0k39J11L30j91j72J77o4j6j53K70m2k28M23k86Q7n1J07
5065H1R1k52k8R1J9J37J08k96K38j45m8J21j42Oj66L21mj47P8J46k97j8J50r1
5089d7Q5p5R1j14j57J54n6l7J51n9K72k60O1j8l9R6j71J73L9m1M0J1L2j34J08
5114A05ml45L30p9J64j89o2Q2j70MK78J4j4j33j24J61K8Q2j22o5K66l20O0O4R1
5139A02j31p1K38m8N6j03NJ58k12KPj73J33j01Q9J3o6L0P6j61N4l9M4j32J45J92
5165A07j19Nj04j02L07K9k16K8Q6p5Qj29K64j63J33L7jk05PJ77k2k24K66NJ37
$$ plain form
4992 -73 64 -34 -21 -66 -88 130 148 51 102 65 -55 59 51 49 13 12 10 -133 57 68 -164 135 27 -207 -35 179
5018 179 75 -165 -133 19 -71 185 -55 -28 82 67 -32 96 178 -107 133 100 -173 138 330 118 67 -113 -49
5041 -49 46 101 -52 -11 58 68 18 -221 -110 220 29 -143 34 -30 -46 -199 71 29 -199 224 -62 25 -26 81
5065 81 172 -80 -108 -17 2 139 247 -49 189 44 -4 117 -25 -19 -185 136 132 -15 63 209 -88 -106 44 -47
5089 -47 38 -37 54 -60 -217 -63 -119 -156 -5 -64 208 -52 9 -9 -48 48 -123 50 89 48 88 99 131 -3 105
5114 105 101 -244 86 7 171 -18 -80 2 -168 -164 114 128 114 -19 -143 18 46 128 6 -59 207 -113 -53 11 102
5139 102 -29 -100 138 90 146 43 48 206 -6 -4 3 -170 -37 -138 -49 -36 -102 -72 4 -157 -103 -142 -98 -230 -85 107
5165 107 -12 -7 -111 -213 94 123 -93 -65 21 -54 -46 -175 89 -74 59 96 95 -110 -103 74 52 -172 94 99 236
5190B36l33q9K13O7j11O1J32j91j51K05j8j49J31k79L12R0j48l2R9K06j11q4r9
5213d3K0L0j72K77k25Q1R6k16K79J0j54mp2L7j77K09J47K4j94J35k66K26%j38
5237i0l8RJ45r0J98p4K13L8l98K32j08J0j33P5m2K19k13J79k5j45j36P2K85J5
5261A98l05n7R8j9L1N2k7J5m9j68J59K18l25L20k51oK77j95n5J58j79M12j66p0
5285F6P3j58MmJ92k44J09l9J21K8j62j67K78k15J83j45J3Q1j64nJ42l4r8L24l5
5310A44j59Kl8M2k4K41pj48J08q0J6j84L04j08k87q2L41j94K6J35lJ23j95K79
5334B52l11j02L78k15jj7l6L10k33o1k8K40k66J32j98J0L5M01k84J88j57j75R0
5357d8j34K58L2m3K4o5j77K15j25N7J07r9j73J55n8j7K28ok8k27L30l11o7J86
$$ plain form
5190 236 -97 -186 27 94 -17 44 176 -15 -166 39 21 -128 3 -276 36 126 -22 -54 45 251 140 56 -43
5213 -43 -23 7 -165 112 -113 -32 64 -152 127 137 -17 -21 -93 -56 -233 -24 123 147 -47 88 -178 48 48 -90
5237 -90 -128 -119 26 -64 134 60 273 311 -87 145 37 47 -86 -11 -53 166 -47 132 107 -38 -174 -102 183 198
5261 198 -107 -164 -66 -85 -54 -2 -29 -14 -63 -231 -72 146 -179 141 -110 -116 161 -34 -89 69 -110 302 136 66
5285 66 139 -19 -15 -19 173 -71 38 -1 120 148 -14 -181 97 -118 65 -80 -67 14 -150 -155 -13 -47 -145 179 144
5310 144 -15 -13 -51 -9 -33 208 201 53 161 81 97 -87 217 109 -178 -260 81 -113 -87 48 45 168 -27 252
5334 252 -59 -161 217 2 1 -16 -52 258 25 -36 -64 176 -90 42 -156 -146 -111 290 6 194 37 -138 -48
5357 -48 -182 76 108 65 89 24 -153 62 -63 -6 101 2 -171 -16 -74 -91 137 131 103 -124 206 -105 -172 14
5381A4j5J21j15Lj05J05Q1j62L28k01l40L54K6j53J45P6j4j66j36K76j67o8K21
5404A08l18L67l68L30Qk30J59k84K18J62k01pJ71j1P1j80n4K03k83LJ38K9K14
5427B45k24j16K58p9j43k7l03o7L89K5J00q3Rm0N5J59n2j69J36K40m25K58j82
5450c6J43n6k21K53N0k72K0P0Q2k49K01r7L49j74j38L6%K7n6K23L6k22p3J56j08
5475e6j71L51r6N7k38P3L17r7r5p2N7j62K25L5j95o8K68k80J48o0J17J16k42J24
5499E6j58P2l3J58j80K48k59J82k16R8j03OJ68m1m1O7O3j90J22n0L5r1q4J59N5
5524D3j34l5j09M79l41J54N0P3j86j71J76k3K02k16O9r3O2j27K07m9n1j59K41
5547F2p6J37j67K10j18J61k66m1J06k84M15L8p1J00j83r7M8K00l37J9K47N8j69
$$ plain form
5381 14 -1 120 5 8 -97 8 89 -73 255 54 -286 68 94 -59 86 162 148 -18 -154 122 -45 -113 108
5404 108 -210 157 -211 119 127 -103 56 -228 -10 152 -49 -56 115 104 175 -5 -59 144 -139 -136 2 31 245
5427 245 21 -95 163 84 -59 -86 -389 -456 -67 -42 58 -25 -16 -56 -1 158 106 -63 73 313 -112 146 -36
5450 -36 107 51 -170 83 133 -139 -119 -49 33 -216 -15 -112 237 63 -75 -39 -39 -12 -68 155 191 -31 -104 52 -56
5475 -56 -227 124 28 85 -153 -80 237 140 45 -27 30 -132 93 128 -67 -135 133 -147 1 -59 58 174 -68 56
5499 56 -102 -30 -63 95 -85 163 -96 86 -130 -32 -135 -129 39 -2 -43 24 87 -103 19 -31 4 -87 -171 -12 43
5524 43 -91 -126 -235 244 -97 57 107 180 -6 -177 -1 -24 178 -38 31 -62 0 -127 80 31 -20 -179 62
5547 62 -14 123 -44 166 48 209 -57 -98 8 -276 139 177 106 206 23 -74 -26 174 -163 -144 103 161 -8
5570hJ16l75J08K13J3j79J15l4j0k1j88K88R3k24J66n4J07j5p1j73K01n9k39K58
5594B8m1Q1q6j9J55j7q9l3R1q2P2l5j37K71n9n2o6j36J80j43K29j17J65j09k58
5619b07J86J03p6q4J08j18L66m01Q7J72j91J97Oj84O4o9K6j3J18o6k18k5K54q2
5643d7j07P9k75J39K63m1J30k06L7OK01j29k54J36L1J1J11L3j66L4O5j07O7J5
5667B6J08k18k1K88k08J72j45Op9K7J57k58K87l41M27l31N1K11k66Q7L5j7M3N5
5691I6o8p7M0k4R9j7j70K82k64K28o8j22L9R7P5k47K3L7L9K73k25J1J2l2J42k50
5717g1P3P9l1j99J23m9j3K41j77l0jj48J10j30J92J59l16K19L0k19K00j38R1k86
5741b91Q9J72K65m11J74R1j60O1J72l26K72p4q1MJ88p2Nk01M4K04L6j54q0K1l3
$$ plain form
5570 -8 108 -267 -159 54 67 -112 3 -31 -41 -62 -250 38 131 -93 73 19 126 111 40 -133 68 9 -230 28
5594 28 -13 68 -18 -37 118 101 12 -21 70 -12 60 25 -112 159 100 48 -18 -154 26 -117 112 -5 160 51 -207
5619 -207 -21 82 6 -78 30 -88 278 -123 -36 136 -55 142 148 -36 28 -41 -15 -28 90 24 -194 -219 35 -47
5643 -47 -154 -75 -350 -211 52 11 141 -65 -28 -22 179 50 -204 -68 -37 -26 85 118 -48 -14 51 -56 11 26
5667 26 134 -84 -105 183 -25 147 2 8 -71 -44 113 -145 142 -199 228 -103 -52 159 -107 -20 15 -2 41 96
5691 96 28 -49 -9 -33 66 49 -121 161 -103 125 57 -65 -26 71 146 -101 -78 -41 -2 271 46 57 69 37 179 -71
5717 -71 2 81 50 -149 -26 -75 -88 153 -24 -54 -55 -203 -93 -223 -31 128 -188 31 61 -158 42 -96 -5 -291
5741 -291 -202 -30 235 -176 -2 89 -71 -10 162 -164 108 34 -47 -43 145 73 78 -123 -79 125 161 7 -73 -52 -85
5766h5J60j46J20k53M59k64o1q7K17l18K16JR6J23j6o1K1j11q5Q2J7Q7O9j32j78
5791a29J11K78l00k29L37jP8l03K56k84K51o3k4k6L84m04J94o2P8l98j2K37k42
5814b73L19kk9kj61R1J86k91K07m3j6J4j02L04l98L37j32M9r2J46j34k0J47o1
5838D4Q0k08Q6M7r1j8J41lJ2r9q4J35m8J9J55o3j88j26J7J47J31k24K28L6P4j96
5864Dj23N4P7K7j15r3K91j2j52R1pQK0k61L42M8m38K73J39k62J77j28o6K13J19
5889B26k68M1n7k6P5R0k5n1j42J69j84O1J31N9l09J15o6R4J78l95K25O0j71L60
5913A90k25k17J16J86R5N3j26M3m9j15n5q8K60j89K41l24J89j34K00l8j65J55
5935CJ11L4k23m2r7P1K29l3J05k52L02m40L07k4j57K24J19l52Q9j12R4n3J06j74
$$ plain form
5766 -85 75 -71 49 -204 255 -9 -70 -157 60 -258 -42 -41 55 178 162 101 122 11 -74 8 25 112 181 49 -129
5791 -129 -18 260 -40 -269 68 67 145 -158 98 -186 65 2 -22 -48 336 -68 126 64 142 -256 -268 -31 -273
5814 -273 46 44 15 13 -148 -57 129 -162 45 2 -14 0 -102 202 -196 141 9 58 -34 112 -22 -42 105 44
5838 44 124 -84 2 49 -42 -60 81 78 90 -9 -93 42 -6 13 168 105 -83 -209 -192 -45 86 -138 90 126 200 4
5864 4 -119 -65 12 39 -76 -169 122 110 -42 49 42 50 70 -191 151 199 -239 34 173 -89 88 -40 -106 107 226
5889 226 -42 -1 -58 -84 -9 81 56 5 -137 32 -152 -91 40 99 -210 -95 -161 -67 111 -284 -59 1 -170 190
5913 190 -35 -252 -136 50 145 198 72 115 66 -49 -104 -192 68 -121 120 -204 -15 -149 51 13 -152 3
5935 3 114 148 -75 -117 -214 -143 86 53 158 -94 208 -232 75 51 -106 118 237 -115 -26 -138 -44 -97 9 -165
5959a65K23j18M3J19k29R4L5K22o3k14j40J89P9O5l47K83o0K32k31J82p4mq3j04
5983f6J36j59J21p4N3M3j1J02j47l0J18qN0o5o5k27J78jP0Q4k03J31k44K21M4
6008E1L1k49N2K65j29N0L3o3q5JJ96m04M33r0l27M3Q8K25j71J96j98P3l10K01
6032h8K9K8l3K29k27o3J28j54K33n5p5J13j13L9j19J80l0n1J35m9k5nj22J3j20
6057b02J14K4j43K54o6J11n1j2j75K05k06Q8lp1O9M2j07l1J55R5J14k07J27Ll8
6082H9j44J1K96k80J24n7p2K8K6q9l7n7K89l9j50M9l0J26K35l62m7L0o8K07j22
6107d4Q7j14O4J14k41k5%J10P7jK8l1O2j11l1K0J31k63L46l07NJ76j48j77K40
6132c3p3Q9J99m05J91j01J77r4N7Pj18O0N0j14k2K71k10m8Q7k3j0K39l44K78j64
$$ plain form
5959 -165 58 -60 -17 102 -127 -33 2 224 161 -53 -193 -4 75 140 -207 76 16 248 17 199 125 121 38 -66
5983 -66 70 -89 32 -42 11 54 43 145 -2 -32 86 78 128 63 -2 -229 -51 -52 18 102 -101 30 -214 7 51
6008 51 82 -167 -115 150 21 71 104 41 -44 -43 153 -251 182 92 -235 -192 -104 121 -50 146 -52 21 -289 -88
6032 -88 -59 -31 -64 165 -62 -125 3 -151 82 27 -48 65 -48 -9 -128 52 22 -29 106 57 32 27 -95 -82 -202
6057 -202 -88 -64 -207 47 -19 92 41 29 -146 59 -147 -59 -62 -133 -64 -22 -129 -160 -5 90 204 -3 124 127 89
6082 89 -55 -44 252 -28 96 39 -33 -5 21 -68 -105 -162 127 88 -62 -13 -43 83 318 -44 -91 -61 -129 78 -44
6107 -44 43 -71 -7 107 -134 -159 -159 -49 28 27 55 24 86 -25 -56 -36 95 -168 178 -129 -124 52 -96 -273 -33
6132 -33 -106 -17 182 -223 -32 -133 44 -50 7 14 -104 -44 6 -108 -130 141 -69 -117 -30 -53 -63 176 -168 110 -54
6157e4j10J89NN8J00j3k79J40J14j48j62P6J85j22r1Q8j04J46J1j67J3o4J48K26
6181A85l09J10P0j14M5j50L64j55K52r2o1k90O5J30j70K79j73k9J75q9l1k4J2
6204@J66j82J2K09j10j71P4j09J75j53K57k96J48qk9kl1J13k64K19j21J43J00
6227A40l50J96lR2n7KQ4r1k2J59j49J21j80K53k23n8J05j23J40JQ3L8k27j32K88
6252H7j52O4L4p6J51L5PJ6k17j21J42l0J29q0L3k01K54K5j74R1J17n5J7N6j57
6277ej04l5kP9l3R2J3j33R0R3r4j53J00O4j0%K1M2p5J5J52j8p2L2Oj04L7K8nk5
6307dJj72K93r9j74K30l55M27rk43J39j53o3N8L0J11j64J0J21k9m3L93m15K4o1
6332a47K27r8q0J04j11K56k17J23j83L75j98k19O9K26k75m6K00j2n8J94j32rN2
$$ plain form
6157 -54 -164 25 30 88 188 175 -104 36 150 2 -160 -84 101 -21 -112 -24 -128 18 29 -138 -125 -189 -41 185
6181 185 -124 -14 56 -58 -13 -163 201 46 298 206 145 -145 -80 50 -120 159 -14 -43 132 43 12 -12 0
6204 0 166 -16 -4 205 95 -76 -2 -111 64 -89 168 -128 20 12 -17 -19 -50 63 -201 18 -103 40 140
6227 140 -210 -14 -17 75 18 20 104 13 -9 150 1 122 -58 195 -28 -86 19 -104 36 37 120 158 -69 -201 87
6252 87 -65 -1 33 -43 108 143 150 166 -51 -172 -30 -60 69 -11 22 -179 75 100 -74 17 134 79 96 152 -5
6277 -5 -109 -144 -146 -67 -100 -8 5 -128 -38 55 -39 -192 -92 -28 -38 -38 -17 25 -50 -35 117 99 27 59 65 -39 -2 26 21 -4
6307 -4 -3 -175 118 19 -155 75 -280 147 138 -105 34 -119 -182 -124 -94 17 -147 -137 -16 -45 -88 305 -110 -86 -147
6332 -147 80 -18 -98 6 -105 151 -66 57 -126 249 51 -168 -99 127 -148 -194 6 -6 -64 130 -2 -11 41
6355D1l3j01n2L29j39N5j37Q4m1l5J91l01K17j43j06j9J55N4R9OJ3n2k68K09K7
6380E3J3r1J94k82k8K06OJ10p6j36J07k43Q3J10q2M0J00RMj01k35J89J58l37K78
6405D9J18j45J34j43R2p9k4L0m6JJ20k45J05K35j29k24K08j83J11Ol9N4j11rQ1
6430c3MJ04j85l0J38m6Q0q8K0Q5k72K63j81Q3m2J61r4L4o3j7K78O1j27q1j06J94
6456A40l8q0k67J85J04j55K58j99L9O7n4l6J8q8J55l0j86J62P5j77K45k25P2N1
6480C6k5j3Q9k17P2M5q2m0M4M3o7J49r0J3N3R3o6k4j5j14N7P4K7j85K24J04j92
6507go0Q5P5j83N8Q3J2J7J28k64J29m0l9J59k6p5N1j22q9J50J5j98Q8M5J30k05
6533h3M6m7k4lj7j59K10K18o4j06j4QN8K6Q7j01N0j55k8J05q7L45l59j05L11l71
$$ plain form
6355 41 8 -93 -145 184 45 100 -37 47 6 -29 162 -139 78 -65 -171 -190 -35 19 118 124 137 85 -183 26 53
6380 53 66 -25 169 -113 -141 65 71 181 105 -31 76 -167 -84 26 -56 -16 84 93 97 -4 -239 -50 108 -229 49
6405 49 167 22 156 13 105 26 2 32 -14 -13 107 -138 -33 202 73 -151 57 -126 -15 -9 -48 6 -105 -114 -33
6430 -33 -29 75 -110 -140 -2 -48 32 -56 -36 49 -223 40 -141 -58 -100 61 -33 1 -62 -79 199 260 133 52 -54 140
6456 140 102 22 -245 -60 44 -111 147 -52 -13 54 0 -36 -18 -106 49 19 -167 -5 70 -107 138 -87 -15 36
6480 36 11 -2 87 -130 -58 -13 -95 -135 -91 -48 -115 34 -56 -43 10 103 37 13 -2 -116 -59 15 42 -143 81 185 -7
6507 -7 -67 18 93 -90 -32 51 63 80 208 -56 73 33 -6 153 127 52 103 -19 -108 42 57 -141 -53 -8 122 -83
6533 -83 -37 -84 -108 -111 -128 -287 -77 141 77 -29 -43 -35 23 49 136 35 85 -70 -98 7 -80 265 -94 -199 112 -259
6559b59K29J01P2Ll15M5J67J5q2K80k02k06L29l57K47j2l60L10mj41L55k11k17
6582b13L06k04j72L80r0J42q9O4j09n6Q7J14j06J50j61O1J3J7k27J25L1l25L77
6605A15q4j75J34N0J3J30j93k6K0j96J89L9j30j16K73j46o6J12o6J18j63K73J33
6628B38k80K63j82j64J37k2l5J75K9j4j65KJ8j06K08k97RJ06J58n4j06J71Q8k26
6652d9J85m7m2M0o5q8K95k24J6J17j37K03j38R4k44J92k16J63J0J80j08j76J07
6675F8k31P4K02mj26j8M2j56K35j2k96L07k10J7J74mj0m6N7oO6j47J6K44J8k06
6701D8q7J81m7m35L16j18J64j54J60J06j89j85L88m01L04J53k77K30l65L84n1
6722A25j78n3j4J39k17L49k96n7J13J60j43J75j12j14Q0J38r5O7j18K18k01K8
$$ plain form
6559 -259 -30 71 143 146 -169 -124 43 58 -24 256 54 -152 177 -180 67 55 -305 5 1 -140 215 4 -213
6582 -213 93 -111 -283 97 7 149 60 124 15 -41 46 160 54 204 43 104 117 134 -93 32 63 -262 115
6605 115 31 -144 -10 40 53 183 -10 -36 -16 -212 -23 16 -114 -230 43 -103 -169 -57 -123 -5 -168 105 238
6628 238 -42 221 39 -125 12 -10 -45 130 159 145 -20 -18 0 -106 102 -195 -186 -80 78 24 -82 89 177 -49
6652 -49 136 89 47 87 22 -66 229 5 21 138 1 204 66 160 -84 108 -108 55 65 245 137 -39 68
6675 68 -163 -89 113 109 -17 -35 7 -149 86 74 -222 85 -125 -108 66 62 52 6 63 57 123 -24 -8 236 254 48
6701 48 -39 142 95 -340 -24 -142 22 -132 28 134 -55 -240 148 -253 51 204 -73 157 -208 176 125
6722 125 -53 -106 -120 19 -198 151 -145 -202 -89 71 -72 103 -9 -123 -43 95 0 67 -51 167 -34 -6
6744fK72j12k14K80k61J58k05mK50l13J88m4j74P5K09k41P6O9KJ12j36J11k6k53
6768a87n1L41J5j44J87k24K48k99J45m7j85K4J15P5q9J38l23K42J09k58n2K71
6790E1j19j2Q7p2J4N8j49J81j38J48J77j11j66J05J82j93P0k1K49k20k61L88l20
6813g2K75j12l6R4k38J81j91J22j11K81l15L1K4r7J07K4l1O5r1R7M4j78J91j79
6837a15N3R2J24lj82o6J45l7K36k15r1j5J27r4J05N5o5k10K80J6K6m4j14M4j3
6862C9k67m2J44J83r8R8O4j87Qqj78J7Q7L83j54l96N14j66k3r1M2N3j68J44l7
6887c9j4k25J66j1J82K4j79L42j92j74R0O1k11K52j27L2n8O1O9k91K95o2j96K53
6911D8j35k5K06j22k2O6L2J06j08j56p7L83j16RJ56k56l6P3j39J1L20j00j31P7
$$ plain form
6744 -6 266 154 -60 220 -41 117 -88 -92 158 -155 33 -11 -185 -110 99 -142 -66 3 5 117 -19 92 66 -187
6768 -187 -238 103 118 -26 161 -63 185 -114 31 -16 -201 -177 -62 13 -76 62 -261 -19 90 -168 -220 51
6790 51 -68 -80 7 -65 -51 7 -142 39 -99 49 226 115 -51 54 236 43 113 92 341 121 -140 248 -72
6813 -72 203 91 55 149 -89 92 -99 23 -88 193 -122 -91 -67 -164 -57 -33 -64 1 -90 7 51 -127 64 -115
6837 -115 -62 30 154 151 -31 -97 48 11 247 32 -59 -74 53 -41 64 119 54 -156 124 140 166 122 8 52 39
6862 39 -228 -270 -126 57 -41 57 121 -66 -58 -66 -244 -227 -140 243 89 -307 207 41 18 -73 -31 22 -146 -2 -39
6887 -39 -53 -278 -112 -123 59 83 -96 246 54 -120 -30 31 -180 72 -55 -23 -81 -20 49 -242 53 -9 -205 48
6911 48 -87 -112 94 -28 -50 16 48 154 46 -110 -187 196 80 89 245 -11 -47 26 -113 -102 218 118 -13 64
6935F4l1L4p5m2K61l54J20L8M8j2p3L9Q8j53j8M6J42l24P1m8J17R3j51J25R7m00
6961b98M72l19pL15j28N9p2l8J2j1J2J36l03J68q4L02l55K35j90K79k59r7J01
6984g0Q2r7N3O2M7k29K74o8J7r3j65K57M7L9j8j56l4j18K91k18K77J7l99M2J33
7009b7O6k48L15n8j62J28j04J89j87r6J98J52j79m4O4l6l9P6m4M1J64j92NJ48
7033A30k27j03K61n4j8O0N5j76m4O0N2j1J78j64r1K0RP4J5l1N6j47L38l00J57
7058I9o8q9%O4J1q1MR0j60K6l4q9J00J94j94J26L7j38l6m0L49k17K5K03n6M0k76
7085a10P0j8J77k34K39k4m6J27l72K61R0l7k13J5k8K35j69J64k3j08P6N0k43K63
7109A42P9l38J94j22J71k87L02j01mp5J59j23K24m44K39M5L7J07l54N0J56n5P1
$$ plain form
6935 64 33 67 -8 -50 211 -143 -23 15 63 51 -22 17 105 -48 -66 -20 122 -202 -131 -179 -62 31 -120 5 102 -298
6961 -298 174 -145 -152 163 35 94 22 -16 -4 -15 -3 133 -170 -2 -86 216 -139 96 -94 185 -74 -171 -70
6984 -70 12 -85 -32 30 77 -152 122 54 71 -22 -187 70 117 156 138 -18 -52 -170 121 -97 180 197 -202 -160 -27
7009 -27 39 -209 106 48 -114 14 -90 99 -88 -184 14 166 -13 -57 7 -29 -68 8 -36 5 169 -23 -18 130
7033 130 -97 -200 61 7 -11 49 104 -72 -116 -56 -4 -15 163 -1 -92 -72 -63 11 26 -5 51 -96 242 -58 99
7058 99 31 -58 -58 6 17 -64 -60 30 -130 -104 -138 -227 -127 67 -127 -1 36 -102 -138 -178 171 -46 -21 182 126 166 -110
7085 -110 -40 -58 119 -115 124 100 54 181 -191 70 160 123 -90 -75 -103 132 -37 127 104 -4 72 122 -121 142
7109 142 221 -117 77 -45 126 -161 141 40 36 -39 120 -3 221 -223 16 61 98 205 -149 -99 57 2 73
7132G3k5O7n42L67J07j62o4K60j52J7l7K86j64j68J87Q8j46j34j07K66j88J20
7154e1j8K09k13R1j31K44J48k60j29L3O3k28L70k75K56L1J77m05J0J06p7J37Q3
7177A71j64k5K6J39K7n1m9j34P9J22o9p7K11l55J85q5o2K65j03J50j15k7MJ0k36
7202a63K63k07J34j05P2m5J94o6k22J13K5Q6N6P2r8O1j86J62N8r4j24R4j11j46
7226a77J66O1R6k75N4O8K5k05J74j81J22j54L49j86K62m8k05k61J51K45l00L16
7248I7k62K93j70Q8J18j78j63K38qj28r3K70j38pJ78j35j3J88k20K58k83K13m7
7271I6k3k5j03j33O9J14kj23J98r0J75k64R9j21J00P2j19J61k08o5L61j55N6j41
7295g1m3J24J04j73R1l0p9L1j8J12N6n4j78N4P7j02J84k57l3J97j16J15o7J06
$$ plain form
7132 73 48 115 -427 -60 47 -115 -179 81 -71 -54 -91 195 31 -137 50 138 -8 -142 -249 17 -171 -51
7154 -51 -69 140 -73 18 -113 131 279 19 -110 -77 -14 -242 128 -147 109 140 317 -88 -78 28 -49 88 171
7177 171 7 -18 8 147 174 123 74 -60 19 141 72 -5 206 -149 36 -49 -111 154 51 201 86 59 63 73 -163
7202 -163 100 -107 27 -78 -6 -51 143 77 -145 -32 -7 79 135 207 109 170 -16 146 204 110 -14 80 -31 -177
7226 -177 -11 50 146 -129 -75 -7 18 -187 -13 -194 -72 -226 123 -63 199 151 -54 -315 -164 81 -219 97
7248 97 -165 128 -42 46 164 -14 -177 61 53 -75 -168 102 -36 -43 135 0 -13 175 -45 213 -70 143 96
7271 96 73 48 -55 -188 -119 -5 -7 -130 68 -22 153 -111 -12 -133 -33 39 -80 81 -127 -192 169 14 70 -71
7295 -71 -114 10 114 -59 32 2 -77 -46 -64 48 104 50 -128 -74 3 -99 85 -172 -205 -8 -124 -9 -76 30
7319C0j70K13j04q8K22N1L8k73J21J37j1l24QK26m2q9J06j08j6J0l2L19l31J21
7343A4J47k12M6P2k35L76l5L8j15l4j02j50J78m2J8J3K00k29l7K01k44J6K72K
7367A58k2l20P4J29l0M4j74L9J70M8m7k19J35r7L7P1r0j74L05J9J70k13q5J17
7391D5O4j32O2J65l34J30j67P9j1R8l9p4Q6J40j03M2L0n9q6j49K20m1P3p2j38
7416a71K95j59OL1K6k42J90P3j46J49m9O0j04J67o0m2J46k31k3J81m5r9l2J19
7440D0J18n3j53j98L53n6J10k05rJ69j2j94J92j39m7J8j40J92n7j33R0K22j56
7463d8q6L2O7k1m6K69j50J2O1k28Q9O6L9m0p5N4P1Q0L0k92J57m3K5N3NJ24k19
7490a4p2Q2M9M0J1j90J00Q0r7J96k13k4p6j72M10M9l6k49J38M6O2k47L06k81J44
$$ plain form
7319 30 -140 73 -31 -119 103 154 192 -81 40 177 166 -158 -150 76 34 -55 51 -57 -73 -63 -95 224 -107 14
7343 14 161 -51 -5 67 -168 208 173 211 96 62 -40 -190 -12 -54 -36 -23 177 -52 -89 112 -132 -116 156 158
7367 158 136 -184 -110 19 -11 33 -141 -102 68 116 69 -150 -15 -112 -75 -4 -94 -268 37 56 226 13 -72 45
7391 45 109 -23 39 204 -130 0 -167 -88 -99 -1 -40 -114 -28 112 9 51 81 22 -64 -213 7 -34 39 -33 -171
7416 -171 124 -35 -29 2 28 -214 -24 49 -97 52 3 63 -41 126 66 24 170 -61 -84 97 52 -47 -79 40
7440 40 158 105 -48 -246 107 51 161 -44 -53 116 104 -90 102 -37 -84 -66 -206 -14 -71 -204 -114 108 -48
7463 -48 -134 -102 -35 -56 -102 167 17 29 90 -138 -49 17 56 16 -59 -5 66 146 176 -116 41 -2 23 76 81 205 -14
7490 -14 -86 -4 45 85 96 -94 6 86 -11 185 -28 -52 -128 -300 110 159 123 -126 12 58 120 -127 179 -102 42
7515D2M8j72J87k43J68K01k17N0q1p3M27m62J02R3N3j02J6j02K48k57j3M5q7J81
7539E2j15K9o1J23LP1p5J3J7LJ6k1j31Q8l5J48k75J24Q1j79K06j74P8J13o2N3
7565I0j32P2j03J82j43J4J42q5n0k10K48N9k2M4k09l6J69J24k79J62p0R2k6l2
7589AK8p5n4J36o1J10k3k46L99l81K76J46O6l36q7K96l45M13m78K23o4J86l2j61
7613f3J13P0j31k11K49P6k45J93R7mj75j07K89j34K35k12K0k59K59j39N4K1j3
7636a7R9j54J7J43n3RJ16oP7k83%J44k21j43M21Qm07K30J32N1%j72K6O5j84M5
7662e7QL7k18L24k20%K4K85k20l9K8L5K7J47j03j26j31K31K47j02j03M5q8L4j4
7687E1j95K15n7rj09M4R1r5P5p1K33j54J20k14O1N6k14Q6r8K59l0p6m1Q5J2k0
$$ plain form
7515 42 90 -82 105 -138 30 231 14 64 -17 -90 337 -125 -23 70 123 21 37 -65 183 -74 -87 -42 -129 52
7539 52 -63 -34 -95 28 31 102 27 40 57 60 76 55 -76 12 -23 125 -150 -26 55 -124 82 -92 -14 99 37 90
7565 90 -42 30 -73 109 -34 -20 122 37 -13 -223 25 84 62 106 -103 -139 30 154 -125 37 -33 59 33 1
7589 1 29 -46 -100 36 -25 85 62 -184 215 -166 110 256 322 -14 -101 195 -150 263 -215 8 -56 130 98 -63
7613 -63 50 120 -11 -222 27 103 -142 51 148 144 -31 -138 151 17 252 40 60 -199 60 -79 -25 -4 -17
7636 -17 82 -72 -55 88 35 44 160 154 231 -52 -52 92 -129 -272 149 157 -250 -20 112 163 163 -9 17 82 -102 -57
7662 -57 -49 -12 -230 94 -126 -126 -102 183 -37 -76 -48 -13 14 161 58 -68 -199 32 279 177 74 119 31 65 51
7687 51 -144 71 14 5 -104 -60 31 -64 11 -60 173 19 139 -75 -14 42 -172 -86 -184 75 45 -31 -72 13 25 5
7713Eq5J74P0j89j8J2J34j43o6K95k97j86L08J07m2k32K12k15J07j2J55j78o6
7736a50Q4P1L9J30n2l29K52l14L63j55Q0k6q0J25lN7J25m24M01j54j42J56J35
7759A89L0l07r7J22j8M5n1m8M36l03K4RK6j55J95q4Q0k37P0L9J28mJ2k43O5p8
7785a55K19jj14J30k74K59k21L05K24k45k79J07JK96k53k8l9j75M74l41O2k49
7807b97L59N2j10Q2k08J36R9Kj44M3J11r6r4K33j17O3k48j21J5K64l9oJ8p4J48
7832G1o3o5J48j58J11k23L14N5j88q6J02K0j49Q2k02K80j60N8L7p1n5L12j72p3
7856g5J39p3r2j29J75k4J84k3K8j4n3k11J11L8N7k60R7j93M19J00k32P6j01j13
7880a69J07Q5k8k9N0O5j0P5N0k36K5j67J60q7J82n9j0J17j83R6L1q5pO0R3k95
$$ plain form
7713 5 -80 94 164 -25 -43 -31 103 -40 -106 189 -108 -294 14 121 79 -153 59 -156 -49 -61 94 -84 -150
7736 -150 -66 5 44 174 122 -207 45 -269 94 -61 19 -7 -87 38 35 92 217 -207 194 40 -102 54 189
7759 189 219 -88 -185 -63 -81 -36 -87 -135 301 -2 22 31 57 -98 97 13 93 -144 -74 -35 93 89 101 -142 -77 -155
7785 -155 64 63 -51 79 -195 64 -157 148 372 127 -152 -45 -44 252 -1 -29 -68 -243 231 -110 -48 -297
7807 -297 62 114 4 86 -122 14 113 115 -29 14 125 29 -65 168 51 114 -134 -255 -240 24 -15 -21 -3 -77 71
7832 71 8 -57 91 -67 44 -179 135 190 2 -84 18 38 -111 -29 -231 49 -111 -53 -16 -87 -142 170 -2 -75
7856 -75 64 -9 -101 -230 -55 -79 105 82 110 96 43 -168 -57 -19 38 -222 -125 -318 101 201 -31 45 -56 -169
7880 -169 -62 23 -5 -34 16 81 71 146 196 -40 -15 -182 -22 -109 73 14 4 121 -62 34 65 -20 -27 33 126 -169
7906a69J14J13k5p7J58l09J12J12k00J93k17jJ78M1n7MJ76k14J28j6j13l15L16
7929f8R6j3N7p1j51L09j15l26K56J6J75j13L8m9k09N5K09j81L42k65j9k09J44
7952i2K09j00j09M5j21K0M2R1noJ6l8j68N1J95p6J51pk06Ro9J42n1M7Q1o0j40
7979a49P5J10l6J10r7m0J19k04K04Oq7P3J6k98K74N2r9K4L9l8j7o8L03l4k95J64
8005A07j2Q4k09M9j09kk1n3K76J09l86J46j07L1P4j07K04oJq8M1m1m6J97l4lK
8032I7l5j24J68j10J9M5k32K34n4nK8pJ19o7r7J81k15p0J76K2r1K2L3j42K1KJ40
8059E8j26J36k1n6J42k08N5j9K8j11J21Q4J19l03J08K22j56J47k89m0J52l37K67
8082b7K27l24R3J13K9p5L2j57j6N8J1J59o2J0k6k43J70j9J36k69L29j73l8K43
$$ plain form
7906 -169 -55 58 33 -44 114 -195 -83 29 -171 22 -195 -196 -18 23 -34 -30 146 -68 60 44 -69 -384 -68
7929 -68 28 15 72 1 -150 159 44 -282 -26 -10 165 52 90 41 -168 -113 96 -85 257 -8 -27 -236 -92
7952 -92 117 17 -92 -47 -168 -148 -106 -15 -20 -26 -10 -48 -216 -165 30 -46 105 98 -108 -99 -168 -26 -77 -30 51 -9 -149
7979 -149 -74 36 0 110 13 -27 92 -112 92 98 11 84 100 -198 76 128 29 53 92 54 37 -31 272 238 -57 107
8005 107 95 179 -30 19 -90 -92 -113 -166 110 219 -167 -21 -128 -97 -23 -130 74 68 69 -19 22 -19 -65 132 98 95 97
8032 97 62 -62 106 -4 15 60 -172 62 8 3 31 24 143 76 -21 160 -55 -125 51 73 -18 4 37 -105 -84 -82 58
8059 58 -68 68 47 -9 133 -75 -20 -39 -11 -122 -1 83 202 -101 7 229 73 220 -69 -109 43 -294 -27
8082 -27 200 -124 -31 82 111 36 68 -89 -105 -47 -36 123 61 71 45 -198 -28 -47 89 -180 149 -24 -62 181
8106A81j18l1L1Q1j25K4j64K9J19l2L36o14L18j36P6J58k51M06m83L72l23K62
8128A16j72J73n2j17l5R2J64j75J12j33K7Nk4L8J49M4l84Q5K49j64J0j95M2J2
8152a33J93J4Oj50P3j3m1J96rk07P3J21j33p8L65m18J10J29n3M2j09J01j11N0
8176A8lp0J9J7n0J05n7J86j24j63J94r5j5K4J11
$$ plain form
8106 181 63 32 63 144 19 43 -121 -92 27 -5 331 -283 35 -101 -25 133 -118 288 -195 177 -146 116
8128 116 -56 117 65 -52 -87 5 169 -6 106 -27 0 5 -19 19 168 212 -172 -87 162 -2 8 -187 -145 -133
8152 -133 60 74 80 -70 3 -10 -51 145 136 -71 2 123 -10 -88 277 -141 -31 98 45 87 -22 79 -32 18
8176 18 15 -55 -36 -19 -69 36 -21 165 41 -122 72 -23 -38 -14 97
8191I7
$$ Imaginary data points
##PAGE= N=2
##DATA TABLE= (X++(I..I)), XYDATA
0@%%%%%%%%%%%%Qj6J6j6J6k4L2m0M8n6O4p2Q8j04J20j42J66j92K17k42K81l20
34a68L60m08M56n12N76o41P13p93Q81r77J081j195J319j455J604j768J948k146
52a125K365k608K880l186L532l927M385m920N559o339P306q550J0221j2592J6244
67I245k2665L7234j31877J3864K54439n4617j36150n4690O7681K1620J0388J7485
79C1957r363o1585J9863O0101q129p0802m351O3751K7656n5844k2223K7368J263
92c38j7134K1583K0319j9498l2133J5715K7920j6418j3199K9043M737k4054m63
105c920Q707k0409j2498M7921M4631n8059p5229L3650P0862n571m5520l624K6114
118G055n612j5301K3548R000l6920o959M6007K1744m3156l8613K9508L5458j8362
$$ plain form
0 0 0 0 0 0 0 0 0 0 0 0 0 0 8 -8 8 -8 8 -16 16 -24 24 -32 32 -40 48 -56 64 -78 88 -104 113 -129 152 -168
34 -168 192 -216 240 -272 304 -337 376 -417 464 -513 568 -627 692 -763 841 -927 1021 -1125
52 -1125 1240 -1368 1512 -1674 1858 -2069 2316 -2604 2955 -3384 3922 -4628 5593 -6999 9245
67 9245 -13420 23814 -108063 -94199 160240 105623 -30527 -85217 -17536 4084 14472 31957
79 31957 22594 -38991 -19128 40973 32844 -37958 -42309 21442 49098 -6746 -28969 -1601 -338
92 -338 -17472 4111 24430 4932 -27201 -11486 16434 16 -13183 15860 20597 -3457 -3920
105 -3920 4787 -15622 -28120 19801 64432 6373 -68856 -35206 35656 30085 -15435 -19059 7055
118 7055 1443 -13858 9690 18690 -18230 -25189 20818 42562 -594 -39207 -9699 25759 7397
131G397j2804J7172q202l0068K684L7453J3429k7204j1642Q469j1922k763L1995
144A3994J8064k2332k7524L006J8907k6P6J1365j0170k0648N331J7908O44j7216
158h621n417J8383L795j3668L324O168j2444p049J9516K4802j3056l5604m96K2657
172B290Q342N048O74j8507k1459J927K8386J6788j7706j5370J32j872P016J2973
186H662J464j0403j2139P668J9290l243j5245l469K983Q517Q349k281r120j6907
200a5874l004K3706J2044j2078r668n044k093M285J1506J5056o585k3667l406
213a4822J1746Q118Q496j278j1519r842k537J2908J1424q708j0366j332K833R125
227D246M0q250l628p55Q662J3701m507j4163n586L320J2662Q304l722p704j2981
$$ plain form
131 7397 -5407 11765 3563 -26505 -23821 13632 27061 -143 -11785 -3316 -15238 -18001 13994
144 13994 32058 9726 -17798 -14792 4115 4089 4165 15530 5360 -15288 -9957 7951 8595 -8621
158 -8621 -14038 4345 8140 -5528 -2204 3964 -8480 -15529 3987 28789 15733 -19871 -20367 2290
172 2290 10632 15680 16354 -2153 -23612 -21685 6701 23489 5783 -9587 -9455 -11327 -4311 8662
186 8662 10126 -277 -12416 -4748 14542 11299 -3946 -7415 -4432 4085 12434 10153 1033 -15874
200 -15874 -18878 4828 16872 4794 -4874 -9918 -12011 -7726 3780 18836 12251 -11416 -14822
213 -14822 -3076 5042 13538 12260 741 -9101 -11638 1270 12694 3986 -6380 -7712 -4879 4246
227 4246 4286 -3964 -7592 -8347 315 14016 9509 -4654 -10240 -6920 5742 14046 10324 2620 -10361
242a0361l515J4591R469k133n340j1209n602N845J0939J0114o814j5486O6P605
256a831O930N084o253p759p52M308J0044P75j4492q013N403J1637P467r002j3088
271i542l324K596J3713J1929q277j4055n661O184J3776L833m182m078q283j860
285g231Q203M782J175l732r861j360N157M729L565o422p995K928O110P398O23
300H069j2302n554O931R473P918o236j6244l449P574J1638N941j0497j1537l570
314a1845K424J3458P681r565q896l016M752R607J905k042l110o876K365Q866J841
329G549k629p405n655O760O753n77k574r726m411P970Q711N468o730j4794j42
344a1432J0321Q627N475p290j2442j701N640J0982M814j0404r358j842L947J0466
$$ plain form
242 -10361 -13876 715 10184 8051 2711 -8498 -14100 -8255 2684 12798 5984 -9502 -9436 -1831
256 -1831 5099 10183 3930 -3829 -4581 -273 9771 10546 -3946 -11959 -6556 5081 12548 3546 -9542
271 -9542 -12866 -10270 3443 15372 7095 -6960 -12621 -6437 7339 11172 6990 2912 -5371 -7231
285 -7231 972 5754 6929 3197 -6664 -8024 -2867 1862 5427 -995 -8990 -6062 48 7446 8069
300 8069 -4233 -9787 -2856 6617 14535 8299 -7945 -11394 -3820 7818 13759 3262 -8275 -11845
314 -11845 -9421 4037 11718 2153 -6743 -9759 -5007 4600 6505 4463 1353 -5523 -3158 5708 7549
329 7549 4920 -2485 -8140 -1380 5373 4796 2222 -7504 -11915 -3945 4766 10234 3504 -11290 -11432
344 -11432 -1111 7516 12991 5701 -6741 -8442 -2802 8180 12994 2590 -6768 -8610 -4663 5803
358E803J739r648m641r93M170R328o12n346m485k212Q791Q146l489n787o110j248
374f594J0295N518k964n483r685p46Q683O048J634p327r236K744N768M389M786
389G830n156p971M9N001Q421J381r488n359M90M614P986k398q514l848l25O753
405e34Q006m375q802l631L512J0830M474n003n191o918J325J1837N576l194q577
420f65q739L613R322K894k371r144n049O461N775L177j081r910l753O808P552
435D890M076m501p711k14K021M308N274m749o986j472Q44O842L669o129n470k322
451g630K005P440K957k61l115q692O11J0204M667j013o473p267L625P660L571
466H289k957j2435n192R636R315K948q363j4605J387J3292P754p70j0215o973
$$ plain form
358 5803 7542 -2106 -6747 -7740 -3570 5758 5146 -200 -4685 -6897 1894 10040 6551 764 -5346 -6594
374 -6594 3701 9219 6255 772 -8913 -9659 -976 5072 6706 -621 -9857 -7113 -1345 3044 7830
389 7830 2674 -5297 -5248 -247 8174 9555 67 -5292 -4802 -188 7798 5400 -3114 -6962 -7287 -534
405 -534 7472 3097 -5705 -9336 -5824 5006 9480 4477 -714 -7632 -6307 5530 11106 7912 -665
420 -665 -9404 -5791 3531 6425 4054 -5090 -10139 -3678 2097 5274 4193 -5717 -9470 -2662 4890
435 4890 8966 4465 -3246 -3460 -1439 2869 8143 3394 -3592 -5064 -4220 2622 6291 162 -5308 -7630
451 -7630 -5625 1815 4772 4511 1396 -7296 -6685 3519 8186 7173 700 -6567 -2942 4718 8289
466 8289 5332 -7103 -12295 -2659 6656 9604 1241 -13364 -11977 1315 9069 8299 -1916 -8889
480h889M730O925O110O1j0510m599L805L007M552l71o199k022j801N46N416J384
496B145p60l109n527N011P644j033j644l822m414M647O136L221k399j0379l832
511h115N296N282M554l774j0906j238N519O539M505o572r456M49P346J0541J00
526A0070j2065n161M056O687O205m826j0668j666N303P499K284q551p516l45N310
541c384R567O24q556l034K55L660O509Om020l339j352M736K979k014m97l246n010
558f116K072K912M002L073o393p405l50N716R470P90q133m765M6P176Q701m233
574F563j0945l106M475R113K899p475o956l010L127R053J497n226l634k536L765
589b396P061o27l277k636o55M140K221K21j59n752k711L969K071J187r85n927
$$ plain form
480 -8889 -4159 2766 8876 8937 -1573 -6172 -2367 640 5192 4821 -1378 -3400 -5201 -4655 761 2145
496 2145 1385 -1724 -7251 -2240 5404 4371 2727 -1095 -5509 -862 5274 8495 6096 -4283 -8115
511 -8115 -2819 2463 7017 3243 -7663 -8901 -3382 3157 7662 1090 -8366 -7917 -571 9970 10070
526 10070 -1995 -7156 -3100 3587 9792 4966 -5702 -7368 -2065 5434 7718 -833 -8349 -8694 -3384
541 -3384 6183 6807 -1749 -4783 -4528 -868 5641 5647 1627 -1712 -3064 1672 4651 2637 2140 -1106 -6116
558 -6116 -4044 -1132 2870 5943 -450 -7855 -8205 -2489 6981 7771 -362 -5127 -5081 2095 10796 6563
574 6563 -4382 -7488 -3013 6100 8999 1524 -5432 -8442 -5315 3738 5235 9 -3625 -6161 -2396
589 -2396 4665 4038 761 -1875 -2530 1610 3831 4052 3893 -1859 -4570 -601 1470 2657 1672 -4255
605d255j266L251L296L473m001o318L38L518P759M918q531q388P95M846P692J151
621H278o614n230l493L551Q990o85o675m379j335O882O819l307l956l160n51O318
637A453M490O6l518p158O28P260J325q65l475n588Q31M074K833J543n484n212
653f797K651L296M823Q13n904k372J766K166N624k36n971l587K37N357N058m565
669B359o201k194J321O764K671n267l461p31K220O047P80k792k559k644L937M133
685D383p24l2k903n133J163L864L327L96p085m443K251M072M948k55o255k427
701d853R24N176O417k801p229k009L189O176J865n842m282j473J944O872P54n784
717i56m006j343M476N718j275k946k242j159L835L753N56r74n058k274M362K934
$$ plain form
605 -4255 -5521 -2270 1026 4499 498 -5820 -5482 -1964 5795 10713 2182 -6206 -5411 -565 7127 8278
621 8278 1664 -3566 -7059 -3508 5482 4797 -1878 -6257 -7592 -710 6109 2802 -1154 -4314 -4865 1453
637 1453 5943 6009 2491 -4667 -4039 3221 4546 3681 206 -5382 -4551 -477 2356 3899 -1585 -6797
653 -6797 -4146 -850 3973 4786 -1118 -3490 -1724 442 6066 5830 -141 -3728 -3491 1866 6924 2359
669 2359 -3842 -6036 -4715 2049 4720 -547 -4008 -4739 -2519 3528 4308 1516 -1043 -3687 250 4383
685 4383 3659 3627 724 -4409 -3246 618 3945 4341 -2744 -7187 -4936 -864 4084 3829 -2426 -4853
701 -4853 -3929 1247 7664 4863 -2366 -4375 -1186 4990 6855 1013 -3269 -4742 -2798 4074 4828 -956
717 -956 -4962 -6305 -1829 3889 2614 -332 -2574 -3733 102 3855 4411 3437 -1621 -3895 467 3401
733C401R10k457n719n94K569K756K666l326n257M50K408N046K542n549m042J622
749b574L002N341M12n299l116j815L006O877j451n671l245j521N512M339k753
764A044k130k621j525N644L761m24k740n095J799N740P74r48k132m375J247K739
780G58J052J033m374l876K059K526K957O85m815j704Q10J857O044Q99o106l116
796c311J98M682N431l159n202k456l49N449L349l617l666l080J331O811J681l659
812D33l132j300L718M392p95r09k452k791K776K615M94o21m495j998K393J610
828f2J936m25m628j150J197L143N153k128n571p27J919M895K296m193l183j152
844b680J233N085R55m837k939j836L142M793j345k862j470j223K897L353M02j77
$$ plain form
733 3401 4311 1854 -3865 -4459 -1890 866 3532 206 -5051 -4601 -2193 2853 5395 -154 -4196 -2574
749 -2574 428 5769 6181 882 -2234 -4049 -1043 5834 4383 -1288 -4533 -6054 -542 3797 1044
764 1044 -1086 -3707 -5232 412 4173 3749 1009 -4086 -2287 3453 4227 3279 1147 -3228 -1981 758
780 758 1810 2843 -1531 -5407 -3348 -822 2135 2820 -1995 -3699 -2889 -1032 5012 5911 -195 -3311
796 -3311 -3113 1569 7000 3841 -1361 -3817 -4166 1283 4632 1015 -2651 -5731 -4400 2411 4092 433
812 433 -2699 -3999 -281 4111 3316 2407 -45 -2836 -60 2555 3049 2428 -2067 -4065 -1672 -62
828 -62 1874 1449 -3179 -4329 -3132 11 5164 3036 -2535 -3262 -1343 3552 5848 1655 -1528 -2680
844 -2680 -1447 3638 4593 -244 -3183 -5019 -1877 2916 1571 -1291 -2761 -3984 -1087 2266 2668 2491
860B491l871j726L653K571R39r37n025j138J855K067K974k381n788n10K021M587
876A782K241m619l619J351K215M403P99m470k071o46L086N349j805m882j767r17
892c570L782L180k512k108k667p17N299K609k054k226l170K154N247m03r8j449
908A297l474R45K448Q36J067l364l121J862L31J647J454l371j819N6J568N431
924C793Q50n250k420p3L869N400k582m000j880l92M558K758l665l897k136J992
940c075O214J34m515k250n44L353L376j005r00j088j203K717J368r30m09k084
956h41m58J975q06R95J001l027k508n37K990N297j644m572j655N83M675M005k535
973B938m042k287J150O586K100m813n188k172M318N979j851l717k506j327M055
$$ plain form
860 2491 -1380 -3106 547 3118 4057 3120 -1905 -3043 -1188 879 3853 1472 -4316 -4826 -2805 1782
876 1782 4023 -596 -4215 -2864 -649 3754 4553 83 -1988 -2634 452 5801 3996 -886 -2653 -3570
892 -3570 212 3392 880 -1228 -3895 -4612 687 3296 1242 -984 -4154 -2000 3247 2844 2746 1297
908 1297 -2177 -1232 1216 2052 3119 -245 -3366 -1504 -1173 474 1928 -1443 -3262 -3206 -1638 3793
924 3793 4643 -607 -3027 -3100 769 6169 3587 -413 -2293 -2685 1873 4631 966 -2931 -5067 -3075
940 -3075 3139 3273 -1242 -3492 -4036 -683 2693 1688 788 -300 -1503 1214 2582 1652 1243 -841
956 -841 -1299 676 -130 865 1866 -1161 -3669 -4206 -1216 4081 2437 -2135 -3790 -3207 1468 5473 2938
973 2938 -1104 -3391 -2241 4345 6445 1632 -3556 -5728 -1410 4569 2718 -999 -3505 -4832 -777
988g77L297r14k037k761O58M541J344r03j469k814R12K556k77R66j011l287j39
1005b115N49J459J736k254j493K22q5L038J626k404j282m27J012L939K78k444
1021A355k372j884L040L485j826k018k715j609M312K890j691k389k750J446M087
1036A361J188n85k056l032L020L360o08p20k803j729K735J077L60o18k886n38
1052b474O95K54L093M30k986r7r54P98L647R30j459k519k486L526M270j321k921
1069D26m150m60N672K009k548k924k718J482N007J221j680l700k136N116L087
1084C704j411j414k069J45K773j96k74j34k839J56J036K18J473j731k093J395
1100a261J12Q66K678r44j944j415O4M434J636k511j987k251J052M186j8k145k076
$$ plain form
988 -777 2520 1606 -431 -3192 -2534 2007 3351 2448 979 -1835 -923 1633 1356 2322 1311 -1976 -2115
1005 -2115 -1566 -107 1629 -625 -2118 -1896 -1981 1057 2683 279 -1003 -1430 -418 3521 3799 1355
1021 1355 -1017 -2901 139 3624 1798 -220 -2935 -4544 -232 2658 967 -1422 -4172 -2726 1361
1036 1361 2549 1964 -92 -3124 -104 3256 2648 1928 -875 -2604 131 1208 1568 950 -1936 -2474
1052 -2474 -1779 -1525 1568 1998 -988 -1085 -2039 -1241 2406 3336 1877 -642 -3128 398 4668 3347 426
1069 426 -3724 -4184 1488 3497 949 -1975 -4693 -3211 1796 3017 1337 -2363 -4499 617 3704
1084 3704 2293 879 -1190 -1045 1728 1532 1258 1124 -1715 -1559 -523 -305 1168 -563 -2656 -1261
1100 -1261 -1149 -283 2395 1451 -493 -1908 -1844 2590 4226 1715 -272 -2523 -1471 2715 2697 552 -1524
1117a524k797K304M005l5j773l860l71M814K201q73j432k859M22L513J194j31
1133B798k276k763J155J579P41M80k883r67J360q06J067J503j519o90K13O16K095
1150A703O4j096Q9j865N17L035Lj030k586k797K688L159J22k004l428m10L736
1167a00J721P13j888m247J286M717J537q59l842j706K832J727O96j019l648l31
1183b411J870M78J213j016k427R15L03L50J563p4k19l65j803J559K839o25r43
1200A207k134j473L137J715q03j786l368M33L675J188k92l014k889K896L836J42
1216B470j119k963l34L043J086M86j049l765N74K012Q56N39k304k329J621N56
1232f20R5J242j154o45KL22K451O64k208l9m18j93K078K99m88j106k773R72K323
$$ plain form
1117 -1524 -4321 -2017 1988 1953 180 -3680 -4051 763 2964 2091 659 -2200 -1778 1735 2929 2798
1133 2798 522 -2241 -1086 493 1234 1714 -1169 -2136 -776 -1582 -515 988 -531 -1221 -1008 -392 1703
1150 1703 1767 671 760 -1105 -588 2447 2450 1420 -1166 -3963 -1275 1884 2006 2 -3426 -3836 -100
1167 -100 1621 2334 446 -3801 -2515 2202 3739 2880 -962 -2668 164 1891 2587 1568 -2080 -2411
1183 -2411 -541 -63 1150 134 -2293 -1378 -1075 -725 838 764 545 180 -1623 -64 2775 2150 1207
1200 1207 -927 -2400 737 2452 1649 -137 -3505 -3072 603 1791 1499 -1515 -4404 -1508 2328 2470
1216 2470 1351 -1612 -1946 1097 2183 2669 1620 -2145 -1571 441 1297 1836 -468 -2797 -1176 -620
1232 -620 -525 717 -437 -1082 -1080 -758 1693 2357 149 110 -308 -501 1577 1876 1388 282 -2491 -1519 804
1251H04J16n63j853j628K059J784M63n9k861j039L008J961J430k399l475O83K514
1268I45R60P92k635k720J020J134K078m07k923p33J077J581J631r92j628M17j57
1285e60Q86J561n32k36j108j372J416Q30m25K79k144r51J622Q23J320j040l162
1302b793mK749K129L97k363k319K118J137J405j85k820j631J557J188J550j644
1318D71k990N40J084Q17J021j100j051O67n41J735J594j511l58m71n06J903L83
1335A687p89k80k380k13K275P77m74j559k056J372K441j32N20j915j309J523J476
1352I64J245q4k936m85J534R44J014j633k021NK94J308J269j467j883L09M67K177
1370A021R31k060o53J64P52J730L0j171p78j534J205J905o75q27r97r11J420O34
$$ plain form
1251 804 920 357 -1496 -3124 -1065 719 1182 1123 -1738 -2777 231 2192 3622 1223 -2252 -1569 945
1268 945 1905 2697 62 -2658 -1638 -504 1574 1167 -1756 -2489 -1412 169 1800 808 -820 -403 -560
1285 -560 326 1887 1355 1119 11 -1361 55 885 460 739 -1405 -2356 -734 89 1409 369 -2793
1302 -2793 -2797 -48 2081 2478 115 -2204 -86 1051 2456 2271 -549 -2180 -623 565 2115 471
1318 471 -2519 -1979 -895 -78 943 -157 -1208 -541 -1082 653 2247 736 378 -93 -599 1304 1687
1335 1687 898 618 -1762 -1975 300 1077 603 -956 -3012 -1640 801 669 1189 -726 -2035 -512 964
1352 964 2209 2125 -811 -1296 238 1182 2196 563 -1458 -1453 -1159 149 1418 -49 -1932 -1623 -1156 1021
1370 1021 1952 -108 -761 -597 155 1885 1915 744 -34 -1568 -363 1542 867 40 -957 -1868 -448 186
1388A86m0L65j802p06J674J170R78n91k271J87J269P82J191j297k450J45N83J984
1406A357M45k733j322N13R69K038m55j782n2P0J047J669n43q74m75m88J686K21
1424A291q18K35j080j000J231L85M48o75k035R2J467J271M39j176j672O71J633
1441G07Q43P52k377j255J268J162Q23j149j975j44L08O09J543j131j159k8r4J371
1459G4J373j221l67k58qJ671L07n85k30k038j11K599L07o78j464j710J021J501
1477A83J03R8j325r84J398J137Q55j96k352j81J778O75M56m98j431r2l99N62J589
1496A376j495r19J49n04J401J141j380n75N0J8J758O07p42p88j279J154K112j076
1514A008o10q63q68O84Q53M43j15k088m92J372J029O49o34j729N32J373J26R12
$$ plain form
1388 186 146 511 -1291 -1997 -323 847 1825 1234 -1037 -850 419 1201 2392 1095 -1355 -1210 -627 1357
1406 1357 1802 -931 -2253 -1740 -771 1267 812 -970 -1022 -952 95 1764 1221 347 -128 -616 1070 1291
1424 1291 473 708 -372 -1372 -141 244 692 17 -2018 -1926 -459 812 1251 75 -1597 -926 707
1441 707 1550 2302 -75 -1330 -62 1100 1923 774 -1201 -1345 -1037 -428 1115 -16 -1175 -1203 -1297 74
1459 74 1447 226 -141 -399 -407 1264 1571 986 756 -1282 -1393 1206 1513 835 -629 -2339 -1318 183
1477 183 286 384 -941 -1925 -527 610 1465 1269 -1083 -1264 514 1189 1645 1147 -284 -376 -775 -213 1376
1496 1376 -119 -1038 -889 -1393 8 1149 -231 -806 -756 -738 1020 1627 885 97 -1182 -28 2084 1008
1514 1008 398 -465 -1333 -649 204 647 532 -1556 -2048 -676 353 1002 368 -1361 -829 544 670 1582
1532A582n02j914m3R20J655J02k311j133P40M01J428m96j416l95J93N63J902m12
1550H64j004l76k33J689L26o10J36m98j212R78P13O3n21j857N0J018N85Q45j050
1569i4j721P04J081R93J068j696j395N77J217J111p65j671K97J85K1R85q27j439
1587a369L50J80R31N47r46o5j98o0J246L05m03N60j320p51J818K35j62p21j277
1606a100K22R24L63K46j706j061J412O25Q57O2j735m37J436R73M59m78j396O4
1624b70l9R50J487j770j447K56q3P93P70q84m41m82M33J510k9n16l97n51Q90J559
1644A739p76o25k54p43K25Q30K90L5j720o16J166K78J66M95j270l80P89N55J087
1663A271j94j840J77P54J265M97j969j049N99J55R39K93j593p56R3J021J391r57
$$ plain form
1532 1582 1080 -834 -877 43 1698 1800 -511 -1644 -904 -503 925 429 -987 -1382 -1189 -626 1276 864
1550 864 -140 -516 -749 940 1266 656 792 294 -918 60 773 836 315 -1542 -1492 -474 111 956 -94
1569 -94 -1815 -1111 -30 963 2031 335 -1060 -483 734 1845 1080 -591 -294 -109 -88 897 70 -1369
1587 -1369 -1019 -839 92 639 -307 -372 -570 -630 616 921 518 1078 -242 -993 825 1060 898 177 -1100
1606 -1100 -878 46 409 655 -1051 -2112 -700 -75 782 844 -891 -1328 108 1081 1540 1062 -334 -270
1624 -270 -309 641 2128 358 -1089 -833 -916 -123 647 -237 -678 -1160 -727 783 754 238 -159 -710 180 1739
1644 1739 963 338 84 -659 -434 396 686 721 -999 -1615 -449 -171 -5 490 -780 -1160 -371 184 1271
1663 1271 1077 -763 -586 168 1433 1930 -39 -1088 -489 -334 605 898 -695 -1451 -1358 -337 1054 97
1681I7r90K3J42J178O90p83J03j70n91N94L67q0k0j088j17N10j60P25k16j391
1701a177m59Q51J120R58j046j311L94R09J201j2j588l60L59K36J247l50j838k04
1719a070L64R80K52r69n02K76QQ46L63n96K97l49KR07%p2l23q81L57K93k06O76
1741F53p70j342N86N96M58P0j029l18J054K09J075k92j265n2J37R47J239j180
1759G76j425k6K20Q13L95j048k57n67J88J262L91q59m31j49M79J322l74l46j34
1778B30o25O12M45j19R6p59r32J109j08j55J33p42o5L38O4J073J94j417K94J26
1798b08Q73J068j177p02j52L7J054J57r44j026j37P47J110m29j485M54l03J216
1816A53P32p40j24j89pQ89K5l72j51l50mM43l02K20J04j222j37M61K83J047p25
$$ plain form
1681 97 -893 -870 -728 450 1140 357 460 290 -301 293 660 580 560 -528 -645 -135 -295 430 214 -1177
1701 -1177 -1636 -785 335 1293 247 -1064 -670 239 1440 1428 -160 -520 -161 75 1322 972 -866 -1070
1719 -1070 -706 274 526 -443 -945 -669 -661 185 548 -48 249 -100 -98 809 809 737 414 -467 -110 183 -23 653
1741 653 -117 -1459 -873 -277 181 251 -778 -1096 -42 167 1242 950 -315 -367 -230 717 1956 776
1759 776 -649 -675 -455 358 753 -295 -552 -1119 -931 331 722 -137 -568 -717 -238 1084 710 364 230
1778 230 -395 217 662 543 639 -120 -1052 57 -51 -206 -73 -815 -880 -542 -478 595 789 -628 -334 -208
1798 -208 665 1733 556 -146 -298 -261 793 950 6 -1020 -1157 -410 700 271 -1214 -760 -1063 153
1816 153 885 145 21 -168 -175 714 739 367 216 -134 -138 305 3 223 327 -895 -1032 -571 -288 759 34
1837C4j086L99L09J079O90j184o38L3N18J324r6j700l59QQ12O00q80p20r6j41
1857a094J024R26p97k95m65N39Q88J30n59L24o80P7N70k1J45p32j164P40N45M6
1877A47J61j051r2N11k95J214J61j041k54J94P42R50o93p24k00j28N69O40p33
1896G8k34p98k73J593M48r66l63m77L99J344r6n20J6p03Q21O57k24j53o65m66
1916e82J130l44k14J60n34k96J22J18P52m0r30M02q7M91P85m05m44j15j63R70
1936G76L04p09q62l82N69J350l15j544j82J6M40J244n80o99j13K06J104J17l74
1955C66m47j90N19L81k44j61J17p63j73M52mM52n39n52L29j38M64Q83m47o84j56
1976e35N60Q07K98j079l95j19O61P87n98q01K9o39P91Q19o56l39n70L61R81o0
$$ plain form
1837 34 -1052 -653 -344 735 1425 241 -397 -364 154 1478 1382 -318 -677 -669 143 743 -137 -857 -953 -1094
1857 -1094 -70 856 59 -236 -701 -162 726 856 297 621 -59 18 588 567 712 -20 -1184 -444 101 147
1877 147 308 -743 -835 -324 -619 595 756 -285 -539 -345 397 1347 654 -70 -270 -398 171 811 78
1896 78 -156 -954 -1227 366 814 -152 -515 -992 -593 751 655 135 151 -552 269 926 702 549 -116 -582
1916 -582 548 204 -10 150 -384 -680 -558 -440 312 272 -658 -256 -343 148 933 528 84 -31 -194 776
1936 776 1080 371 -491 -873 -304 1046 731 -813 -995 -979 -539 705 125 -574 -687 -481 623 740 366
1955 366 -81 -271 248 629 385 224 341 -422 -595 -143 -147 305 -234 -786 -457 -595 -131 752 305 -379 -535
1976 -535 25 832 1130 51 -344 -463 198 985 387 -414 -385 -1024 -233 586 -70 -409 -979 -618 363 303
1996C03k51Q1o07N70O06k1q1l83p39N20M13j50K9o42k18J52k40N82N62j241K17
2017e38N02O0O81k87k65J84o05L25Q45m52m79o70k06J414K81q66m13o21J48J206
2037B44J47k96k98p18J018R03m07k56n63k19J043J41n30p6n50K81M3j43L25k13
2057a24p60N00K49k28P08J66k69k79p65J078O29l30n04m87q3J118l4l93m03r80
2077a191N35J296m92m13o50j07J246Q04r58r7k83J86P11j0o1k77o17K69M15m77
2097a71L88m34j54K69l25P9N85l5m33j1R4O22L85q93k27k2K67Q36r3p41l62l96
2119g72N27P58l02m47m98j08Q65K70k27P1l92j48R13J1K11q97l72Q66K35k83m
2140B77n03n22Q35k09L5P5p49M24K65j32M41m02N4O85n51R8O47n08j17k05m25
$$ plain form
1996 303 52 133 -474 96 702 681 600 217 -522 -2 411 261 290 -352 -570 -418 -658 -76 486 -755 -538
2017 -538 -36 24 705 418 153 337 -268 57 902 450 -29 -699 -905 509 790 -76 -489 -1110 -962 244
2037 244 391 95 -203 -921 97 1000 593 337 -226 -445 598 739 209 133 -417 -136 -93 -236 89 -124
2057 -124 -884 -384 -135 -363 345 511 242 -37 -802 276 905 575 71 -416 -499 619 585 192 -211 -1191
2077 -1191 -656 640 148 -265 -915 -1022 224 1028 70 -27 -310 -124 587 577 516 239 -378 -109 306 -171
2097 -171 217 -217 -371 -102 -427 -348 237 202 -231 -242 -148 474 859 -34 -261 -283 -16 820 727 -14 -376 -772
2119 -772 -245 513 211 -236 -734 -842 23 293 66 137 -255 -403 510 521 732 -165 -537 329 564 281 277
2140 277 -226 -748 87 -122 -87 -12 -761 -337 -72 -204 237 -165 -111 574 23 121 768 260 143 -62 -487
2161d87N03N37l94Jr04j0Q63R5J25o08r34N48J570j57m76n97l43J018L39J6j47
2182E58j054oR66l02R0l56n70L89L04j34J56Pj41K66p12O02N50m19J20m2m41M23
2204B54K90k65o2p59j32J002k7m26l31o35R04O07l45j28j49k65Q24L52M2p04n21
2225d74N50N71l90N1m14m69O63l28J7J94l67m2K65R0J96M2l46J51J22j30N11K0
2247D83j67k31l91J70N95m30p5k91m59N20J90J19L2o54jO39N34k4m31o35L31N71
2269C95K09O1o30o68M51L89M1r9q06Q3O01K4n8j99k56N39P8J4L87m64J42j20o0
2292E4J68J68k46M7j97o07L68L71J03j58q55J47Q87q6J89l87m49L73M79L25m1
2313F53p46l90Q96M4j21k97n70M65K31k72J45l48k22K99n6L96L31n50J42M30m72
$$ plain form
2161 -487 16 553 159 160 -744 -754 109 204 329 -279 -1213 -665 905 748 272 -325 -668 350 689 705 558
2182 558 -496 -502 464 162 252 -104 -674 -285 19 -115 41 48 -93 173 -539 63 613 194 314 272 -169 254
2204 254 544 279 217 -542 -674 328 301 -125 -456 -1091 -187 420 75 -53 -202 -467 357 709 751 47 -474
2225 -474 76 647 257 308 -106 -575 88 -240 -223 -29 -396 -438 -173 -83 113 155 -191 -40 82 -48 463 483
2247 483 316 85 -306 -136 459 29 -46 -337 -796 -276 -86 33 65 -589 -590 49 583 559 128 -507 -176 395
2269 395 604 665 35 -633 -182 207 248 149 -657 -574 27 51 -7 -206 -462 77 155 169 556 92 234 114 54
2292 54 222 390 144 191 -6 -613 -245 126 229 71 -784 -637 250 164 353 -34 -483 -110 369 694 653
2313 653 -93 -483 413 457 336 39 -531 -66 165 -107 38 -310 -532 -233 -289 107 438 -112 30 460 -12
2334a2L52M7j11Rm11o4L20o2l04L6m85K92M60l05J10O6n79N18N90nq3n98R2L96
2358B69p1K94l90m66O3M35J22K03p52m95N61J67K9K08m55K36j2M3M72j03n09j33
2380b84K69L93K65l79k62j24L6k1K45j75q6k57l57O82J70O3l7m33J19K85k3M42
2402E31m00m44J60L48O8K25r51j02M26J21K10k39m50j91N95L91N3k28n69N83j93
2423e6L85K2m48L46Jm81M04J09j93Q1l78k86M87k28K48J51o33L33J17M62J82n67
2445E8m19O82N4R6l18m55K55M6k30N88m79l27J45J27K68J12n42l0K91l5L26K29
2467D42n28K87j36j20N54j70m67J24k80J03M07k77J76l25k40M38K14j97L14n13
2487a94J57L71O5L8O6n08j18o5J72N58n89n59L60j5M03J95l88mn4K13J37j53J14
$$ plain form
2334 -12 340 387 276 285 -126 -190 130 68 -236 -200 -685 -393 67 -238 -128 -62 -641 -123 467 462 379 -219 -127 269
2358 269 198 492 102 -364 -301 134 256 459 -293 -788 -227 -60 -31 177 -278 -42 -54 -11 461 358 -151 -284
2380 -284 -15 378 643 264 2 -122 -86 -107 138 -37 -123 -380 -737 -55 115 178 141 -292 -173 112 89 531
2402 531 131 -313 -153 195 263 488 -463 -565 -139 -18 192 -47 -497 -688 -93 298 351 123 -446 137 -56
2423 -56 329 351 -97 249 250 -231 173 282 89 170 -208 -494 -7 -235 13 164 -469 -136 -19 443 625 58
2445 58 -361 321 375 471 153 -302 -47 -1 -231 357 -122 -449 -304 -177 91 203 -339 -369 -78 -113 213 442
2467 442 -86 201 65 -55 499 329 -138 -14 -294 -191 216 -61 115 -210 -450 -12 202 5 319 -194
2487 -194 -37 334 399 437 503 -5 -123 -188 -16 542 -47 -606 -246 -261 142 337 -51 -55 -109 104 241 88 202
2510B02m49J67K63N58m63l53K69j51r9K64j75o6j35k35O00j84K79k04k88J00J66
2531F6M1J17N3l94J90j06K81J67n62n5J07p9K30K32m54l45J30L64q4J76q1J81
2553A75l48L76J86m17K39p3j48J08J14k80L41n40p9L93k39L50q6n06J76L22O4
2574A28J78l74k71L69J86J87r9m67K1K77L1J57k56n05L56J81k37L35l82r4L4J80
2596f5K45n6k42K67k78Q4O64k15j64n0k93O9J35R7L6n13k01N93j62k7j9l79L31
2619a43J68J0J35n4m30K63K37O8L61p58k0J99r0J39Nk8k75j4n2L91L4j57lk2l2
2644f8M85m20RK16j36J72O9k93J27k53k29N02k05q0N3k57j1R1K30J59k01j55K47
2667E2o9O4L40l13j2P1q0J79P2n91J65j72J30K50j96l59N14j64K46J65k95J57
$$ plain form
2510 202 -247 -80 183 741 278 -75 194 43 -56 208 33 -33 -168 -403 197 13 292 88 -200 -100 66
2531 66 107 224 277 -117 73 -33 248 415 -147 -202 -95 -174 56 288 -166 -511 -381 -17 -101 75 -6 175
2553 175 -173 203 389 -28 211 138 -10 98 212 -68 273 -267 -346 47 -192 158 72 -434 -258 64 128
2574 128 306 -68 -339 30 216 403 304 -163 -142 135 166 323 67 -438 -82 99 -138 197 -185 -279 -245 -65
2596 -65 180 124 -118 149 -129 -45 619 404 240 190 -103 -34 101 198 234 -279 -480 113 -49 -76 -95 -474 -143
2619 -143 25 35 170 116 -314 -51 186 254 615 -143 -163 36 -54 85 90 62 -213 -227 -279 112 146 -11 -14 -36 -68
2644 -68 417 -3 6 222 86 258 327 34 161 -92 -321 181 -24 -104 -51 -308 -319 -228 2 161 -40 -195 52
2667 52 -17 47 387 74 62 133 53 232 304 -287 -122 -294 -164 86 -110 -469 45 -119 127 292 -3 154
2689A54O5p1j21J15M6q0j99j14K68k8j49K43l57rJ46r1K05j09j10M7K56N1L37
2712D95n45l12N27n6L45k66m89L39R7O9o6k85k22K88k92K87J12o1K3k32J90L86
2734C32j38j74K69k75O4j37j36N05k55l69J03J39J86k3k55j47L34n4J34m0j39
2755g6J4J02N7M30n41k26M65j15r6J96k60l14J41j13L50P1m88R0K4L55K94l11
2777D9M2P3k17K70J6j0k84K88j70o5m1j90J95p6l9R9K0J28Q4n05K58R0N7K23O4
2802C59k95k7n8K27K14m02j7k37K02K23l79l18J87J4M85J93n38K2m9J00K08m4
2824G0p0L0J80l9Nl67O1n6K08l73K52J42k6j79l08L09J76r6K49j9l10o0L34K39
2848C52j18k41j0Q9M2Q1j87l1j40n2L45o8j41O9j73P8J86M4l28O6L62k00L53k10
$$ plain form
2689 154 219 148 27 142 188 108 -91 -205 63 35 -114 129 -228 -237 -91 -182 23 -86 -196 -149 107 158 495
2712 495 -50 -362 165 109 454 188 -301 38 135 204 138 -147 -369 -81 -373 -86 26 -35 -12 -244 -54 332
2734 332 194 20 289 14 78 -59 -195 310 55 -314 -211 -72 114 91 -164 -311 23 -31 103 63 -76
2755 -76 -62 40 97 527 -14 -240 225 110 14 210 -50 -364 -223 -336 14 85 -403 -313 -289 66 360 49
2777 49 91 164 -53 217 233 223 -61 227 57 -8 -49 -239 -44 -120 -159 -60 -40 88 172 -333 -75 15 72 295 359
2802 359 64 37 -21 206 420 18 1 -236 -34 189 -190 -508 -321 -307 178 371 -167 -145 -194 -94 114 70
2824 70 0 30 210 171 176 -191 -130 -186 22 -351 -99 43 17 -162 -470 -161 15 -81 168 149 -161 -221 113 352
2848 352 234 -7 -17 72 114 195 8 -23 -163 -215 130 62 -79 -10 -183 -105 81 125 -203 -137 225 25 378 168
2872A68o7j03n5K52k2j88p7Nj68M66n40K75n7k06K6K98j03L30J6p1j77m4LL20
2896B81m9k39o6k80J87J95k41J11j21P9K52q6j02j57j91M56K41j36j20k3K39m7
2918A83j78rK03k35J35Rr5N7k61N0J60n4j78J90J94j19n5J46j8J73p3l79n2M3
2942a63L17j87r9r5J67J15J73j01n11K03j92M42r1R8q8rM3L07j07k52N9qL4P7
2966A32j26M8R1l16j72J57J12K06j50o7q3o6L66M4l50K55l9j39K75qp8j62J1j15
2990a74M19m54k6K5K23q8J20j01J7j04L3K92o2J65k13j97P9K48k29k46L97j71
3012d7L7J68n13K90K0J50l17p0J64K58k55J54J34N0J02k52K2N0j44k3L87m05Q
3035c2j95K08J07n3j2p9k38J59L94l07n0k1J09p0J82j15%Nj71L85k79Qr2R0j26
$$ plain form
2872 168 101 -2 -57 195 173 -15 -92 -87 -255 211 -329 -54 -111 -317 -291 7 -96 234 250 179 2 -42 -39 281
2896 281 232 -7 -73 -353 -166 29 -212 -101 -222 -143 109 23 -79 -236 -427 29 270 134 14 -9 230 183
2918 183 5 -4 199 -36 99 108 13 70 -191 -141 19 -35 -213 -23 171 52 -3 143 125 298 225 -154 -206 -163
2942 -163 154 -33 -132 -227 -60 55 228 127 -384 -181 -373 69 -22 76 -12 -21 22 329 222 -30 29 21 55 132
2966 132 6 54 145 -171 -343 -186 -74 132 -18 -85 -168 -234 132 176 -174 81 42 -97 178 170 92 -70 -59 -174
2990 -174 245 -209 -235 -210 13 -75 45 -56 -39 -143 -110 182 120 285 72 -125 -46 202 -27 -273 124 -47
3012 -47 -10 158 -355 -65 -45 105 -212 -282 -118 140 -115 39 173 223 325 73 95 145 1 -22 365 -40 -32
3035 -32 -227 -19 88 35 23 -56 -294 -135 259 -48 -98 -119 -10 -80 102 -13 -13 -8 -179 206 -73 -65 -157 -67 -193
3060a93J53k13J97Mpl7J82r5K26rj87K94l61R0j40Q7l4R3j76J29O8j55k85K17
3084a52O5K35j65j01k5J60K58p0k17L10k09r7K46k0j99p1j98L12j03N7j91K18
3106D3r5Q1Pj6N9j23K05L0j73N7K39l11n4K05m6mj9J43n26K87nJ0J1j59J40k58
3132b72M28ol9j61J03k33M46J7o9j85j43J82k45L00n3j91kO4P5R3j17j4O8L5j70
3157h9M70j72j48K6j90J16J76n4k03Q4j90J30J23j70N1k30J74M05j38l00n0O9
3179a10K67N8m4k02o4k03M88J25j99j35j16J31L2k55N9Q3Q0J1j13J5K85k29J75
3202A39j6k2l1K8l1R8k47o7K42R3j07j35j85N8K83j62K68l37J10P0K6k54K33l9
3226A5j30K69q6M8m1j19J49Jj03M8n3j40J90L7j23K18l79L72j10N6Oj82Mk1L02
$$ plain form
3060 -193 -40 -253 -56 -52 -59 -96 86 -9 217 208 21 315 -46 44 -96 -9 -43 50 -126 3 71 -84 -369 -152
3084 -152 -87 148 -17 -118 -143 17 275 205 -12 298 89 -8 238 218 19 -52 -250 62 -41 16 -175 43
3106 43 -52 29 36 20 79 -44 161 191 18 75 314 3 -51 154 108 104 85 228 -298 -11 -16 -6 5 -154 -14 -272
3132 -272 156 150 111 -50 53 -180 266 283 214 29 -114 68 -177 123 70 -121 -123 -59 16 109 -8 -22 46 81 -89
3157 -89 381 209 61 87 -103 13 189 135 -68 16 -174 -44 79 -91 -40 -270 -96 309 171 -129 -179 -110
3179 -110 157 215 171 -31 -95 -298 190 315 116 -19 -135 -4 28 -227 -168 -85 -5 6 -107 -92 193 -36 139
3202 139 123 101 70 98 67 165 -82 -149 93 186 79 -56 -241 -183 100 -62 206 -131 -21 49 75 -179 54 15
3226 15 -115 154 68 116 75 -44 105 106 3 51 -2 -142 48 85 -38 180 -199 173 63 119 125 -57 -53 -74 228
3251B28j92j6m1R0j61K15m2k5j82L40l48J43mJ72j73N6j47L4K63L7r8k01l3M7
3275c8J97R0m66Q4Q3J85j94J9J69m15M11J34k64J85l38J44J7K09j07N7j19q8J32
3298H7k73M08l26O7Q7j61k20K65L2J35j94l0K54PJ7N6k41j42K09n1L7M1j84q7
3322b07L65j85J8J70j37j93K94J19j47p6r1J23k1j0J45j94K58p5j18Rn0P5K7j2
3346H7k07K60m8j51o1r3K03Q0k15K20j00j1L4K99l38R6q4J6N4mM7k34n6J29j35
3371b12Q7o6O0L97l58K3K12pL5k40J53J42n3k26l4L50k97R8q9L7L3k76J20K02
3395I1k78J83J29k49J05J86l16K46j44r3O6J07J36r1k23L1J98R8j57k2j87kL03
3418A17k37J20Mj65J18K47m03R6l8J66L3k31K53O6j36O2j84L4j31K27J43k23l5
$$ plain form
3251 228 36 20 -21 69 -92 123 81 56 -126 214 -134 9 5 177 4 60 -87 -53 210 247 149 -52 -85 -38
3275 -38 159 249 -217 -133 -50 135 -59 -40 129 -286 125 259 -5 180 -158 -14 3 212 105 162 43 -45 87
3298 87 -186 222 -104 -37 50 -111 -331 -66 -34 101 -93 -123 131 138 155 211 -30 -172 37 -14 23 64 -120 -207
3322 -207 158 -27 -9 161 24 -169 125 244 97 21 -70 53 32 22 167 -27 231 156 38 47 -3 72 99 87
3346 87 -120 140 92 -59 -120 -213 -10 70 -145 75 -25 -36 -2 297 -41 55 -29 -13 41 37 84 -150 -206 -77 -212
3371 -212 -125 -191 -131 266 -92 -69 143 136 171 -69 84 226 173 -53 -87 263 -34 64 -25 12 45 -231 -111 91
3395 91 -187 -4 125 -124 -19 167 -149 97 -47 -140 -74 33 169 78 -145 -114 84 182 25 3 -184 -186 117
3418 117 -120 0 4 -161 -43 204 -199 -103 -141 25 58 -173 80 146 10 72 -112 -78 -209 18 161 -62 -97
$$ [...]
8191A75
##END NTUPLES=NMR FID
##END=
