##TITLE=1H_Pr 5306
 200.13MHz,CDCl3,
 8 sc
 
 29.7.2025
##JCAMPDX= 6.0         $$ Bruker NMR JCAMP-DX V2.0
##DATA TYPE= NMR FID
##DATA CLASS= NTUPLES
##ORIGIN= UXNMR, Bruker Analytische Messtechnik GmbH
##OWNER= pz
$$ XWIN-NMR		Version 3.5
$$ Tue Jul 29 13:47:23 2025 Russian Standard Time (UT+4h)  she@DPX200
##.OBSERVE FREQUENCY= 200.1313
##.OBSERVE NUCLEUS= ^1H
##.DELAY= (6, 6)
##.ACQUISITION MODE= SIMULTANEOUS
##.ACQUISITION SCHEME= undefined
##.AVERAGES= 8
##.DIGITISER RES= 18
##SPECTROMETER/DATA SYSTEM= spect
##.PULSE SEQUENCE= zg30
##.SOLVENT NAME= CDCl3
##.SHIFT REFERENCE= (INTERNAL, CDCl3, 0, 14.3821)
##AUDIT TRAIL= $$ (NUMBER, WHEN, WHO, WHERE, WHAT)
$$ ##TITLE= Audit trail, XWIN-NMR		Version 3.5
$$ ##JCAMPDX= 5.01
$$ ##ORIGIN= Bruker BioSpin GmbH
$$ ##OWNER= she
$$ F:/spectra/data/she/nmr/H-C/1/audita.txt
$$ ##AUDIT TRAIL=  $$ (NUMBER, WHEN, WHO, WHERE, WHAT)
(   1,<2025-07-29 13:46:17.20 +0400>,<she>,<DPX200>,
      <created by zg, POWCHK disabled, PULCHK disabled
       configuration hash MD5:
       00 E9 B6 7A A2 85 ED C7 34 08 36 98 17 FE 4E 26
       data hash MD5: 16K
       02 43 84 97 00 23 69 6D 66 66 DD 7B C1 F8 92 F5>)
$$ ##END=
$$ 
$$ hash MD5
$$ 12 2A 55 FC 46 B1 F0 61 47 01 76 D1 4B C5 93 0D
##$RELAX= 
##$RELAX= 
##$RELAX= 
##$RELAX= 
##$RELAX= 
##$RELAX= 
$$ Bruker specific parameters
$$ --------------------------
##$DU= <F:/spectra>
##$EXPNO= 1
##$NAME= <H-C>
##$PROCNO= 1
##$TYPE= <nmr>
##$USER= <she>
##$AMP= (0..31)
100 100 100 100 100 100 100 100 100 100 100 100 100 100 100 100 100 100 
100 100 100 100 100 100 100 100 100 100 100 100 100 100 
##$AQSEQ= 0
##$AQ_mod= 1
##$AUNM= <au_zg>
##$AUTOPOS= <>
##$BF1= 200.13
##$BF2= 200.13
##$BF3= 200.13
##$BF4= 200.13
##$BF5= 200.13
##$BF6= 200.13
##$BF7= 200.13
##$BF8= 200.13
##$BYTORDA= 1
##$CFDGTYP= 0
##$CFRGTYP= 5
##$CHEMSTR= <none>
##$CNST= (0..31)
1 1 145 1 1 1 1 1 1 1 1 1 1 1 1 1 1 1 1 1 1 1 1 1 1 1 1 1 1 1 1 1 
##$CPDPRG= <>
##$CPDPRG1= <>
##$CPDPRG2= <>
##$CPDPRG3= <>
##$CPDPRG4= <mlev>
##$CPDPRG5= <mlev>
##$CPDPRG6= <mlev>
##$CPDPRG7= <mlev>
##$CPDPRG8= <mlev>
##$CPDPRGB= <>
##$CPDPRGT= <>
##$D= (0..31)
0 0.7 0 0 0 0 0 0 0 0 0 0.03 0 0 0 0 0 0 0 0 0 0 0 0 0 0 0 0 0 0 0 0 
##$DATE= 1753782376
##$DBL= (0..7)
120 120 120 120 120 120 120 120 
##$DBP= (0..7)
150 150 150 150 150 150 150 150 
##$DBP07= 0
##$DBPNAM0= <>
##$DBPNAM1= <>
##$DBPNAM2= <>
##$DBPNAM3= <>
##$DBPNAM4= <>
##$DBPNAM5= <>
##$DBPNAM6= <>
##$DBPNAM7= <>
##$DBPOAL= (0..7)
0.5 0.5 0.5 0.5 0.5 0.5 0.5 0.5 
##$DBPOFFS= (0..7)
0 0 0 0 0 0 0 0 
##$DE= 6
##$DECBNUC= <off>
##$DECIM= 32
##$DECNUC= <off>
##$DECSTAT= 4
##$DIGMOD= 1
##$DIGTYP= 9
##$DL= (0..7)
0 120 120 120 120 120 120 120 
##$DP= (0..7)
150 150 150 150 150 150 150 150 
##$DP07= 0
##$DPNAME0= <>
##$DPNAME1= <>
##$DPNAME2= <>
##$DPNAME3= <>
##$DPNAME4= <>
##$DPNAME5= <>
##$DPNAME6= <>
##$DPNAME7= <>
##$DPOAL= (0..7)
0.5 0.5 0.5 0.5 0.5 0.5 0.5 0.5 
##$DPOFFS= (0..7)
0 0 0 0 0 0 0 0 
##$DQDMODE= 0
##$DR= 18
##$DS= 0
##$DSLIST= <SSSSSSSSSSSSSSS>
$$ [...]
##$SUBNAM0= <"">
##$SUBNAM1= <"">
##$SUBNAM2= <"">
##$SUBNAM3= <"">
##$SUBNAM4= <"">
##$SUBNAM5= <"">
##$SUBNAM6= <"">
##$SUBNAM7= <"">
##$SUBNAM8= <"">
##$SUBNAM9= <"">
##$SW= 18.0517328524113
##$SWIBOX= (0..15)
0 0 2 0 0 0 0 0 0 0 0 0 0 0 0 0 
##$SW_h= 3612.71676300578
##$TD= 16384
##$TD0= 1
##$TE= 0
##$TE2= 300
##$TE3= 300
##$TEG= 300
##$TL= (0..7)
0 120 120 120 120 120 120 120 
##$TP= (0..7)
150 150 150 150 150 150 150 150 
##$TP07= 0
##$TPNAME0= <>
##$TPNAME1= <>
##$TPNAME2= <>
##$TPNAME3= <>
##$TPNAME4= <>
##$TPNAME5= <>
##$TPNAME6= <>
##$TPNAME7= <>
##$TPOAL= (0..7)
0.5 0.5 0.5 0.5 0.5 0.5 0.5 0.5 
##$TPOFFS= (0..7)
0 0 0 0 0 0 0 0 
##$TUNHIN= 0
##$TUNHOUT= 0
##$TUNXOUT= 0
##$USERA1= <user>
##$USERA2= <user>
##$USERA3= <user>
##$USERA4= <user>
##$USERA5= <user>
##$V9= 5
##$VALIST= <valist>
##$VCLIST= <CCCCCCCCCCCCCCC>
##$VD= 0
##$VDLIST= <DDDDDDDDDDDDDDD>
##$VPLIST= <PPPPPPPPPPPPPPP>
##$VTLIST= <TTTTTTTTTTTTTTT>
##$WBST= 1024
##$WBSW= 4
##$XGAIN= (0..3)
0 0 0 0 
##$XL= 0
##$YL= 0
##$YMAX_a= 97759
##$YMIN_a= -159655
##$ZGOPTNS= <>
##$ZL1= 120
##$ZL2= 120
##$ZL3= 120
##$ZL4= 120
##$ABSF1= 10
##$ABSF2= 0
##$ABSG= 5
##$ABSL= 3
##$ALPHA= 0
##$AQORDER= 0
##$ASSFAC= 0
##$ASSFACI= 0
##$ASSFACX= 0
##$ASSWID= 0
##$AUNMP= <proc_1d>
##$AZFE= 0.1
##$AZFW= 0.1
##$BCFW= 1
##$BC_mod= 2
##$BYTORDP= 1
##$COROFFS= 0
##$CY= -3
##$DATMOD= 1
##$DC= 2
##$DFILT= <>
##$DTYPP= 0
##$F1P= 0
##$F2P= 0
##$FCOR= 0.5
##$FTSIZE= 0
##$FT_mod= 4
##$GAMMA= 1
##$GB= 0.15
##$INTBC= 1
##$INTSCL= 1
##$ISEN= 128
##$LB= 0.25
##$LEV0= 0
##$LPBIN= 0
##$MAXI= 10000
##$MC2= 0
##$MEAN= 0
##$ME_mod= 0
##$MI= 1.114404
##$NCOEF= 0
##$NC_proc= 0
##$NLEV= 6
##$NOISF1= 3.799351
##$NOISF2= 2.8
##$NSP= 1
##$NTH_PI= 0
##$NZP= 0
##$OFFSET= 14.38212
##$PC= 1
##$PHC0= -1202.302
##$PHC1= 13.79254
##$PH_mod= 1
##$PKNL= yes
##$PPARMOD= 0
##$PSCAL= 0
##$PSIGN= 0
##$REVERSE= no
##$SF= 200.129724274929
##$SI= 16384
##$SIGF1= 3
##$SIGF2= 2
##$SINO= 400
##$SIOLD= 16384
##$SREGLST= <1H.CDCl3>
##$SSB= 0
##$STSI= 0
##$STSR= 0
##$SW_p= 3205.1282051282
##$SYMM= 0
##$S_DEV= 0
##$TDeff= 0
##$TDoff= 0
##$TI= <>
##$TILT= no
##$TM1= 0
##$TM2= 0
##$TOPLEV= 0
##$USERP1= <user>
##$USERP2= <user>
##$USERP3= <user>
##$USERP4= <user>
##$USERP5= <user>
##$WDW= 1
##$XDIM= 8192
##$YMAX_p= 0
##$YMIN_p= 0
$$ End of Bruker specific parameters
$$ ---------------------------------
##NTUPLES= NMR FID
##VAR_NAME=  TIME,          FID/REAL,        FID/IMAG
##SYMBOL=    X,             R,               I
##VAR_TYPE=  INDEPENDENT,   DEPENDENT,       DEPENDENT
##VAR_FORM=  AFFN,          ASDF,            ASDF
##VAR_DIM=   8192,          8192,            8192
##UNITS=     SECONDS,       ARBITRARY UNITS, ARBITRARY UNITS
##FACTOR=    0.0002768,     1,               1
##FIRST=     0,             0,               0
##LAST=      2.2672688,     0,               0
##MIN=       0,             -159655,         0
##MAX=       2.2672688,     97759,           0
$$ Real data points
##PAGE= N=1
##DATA TABLE= (X++(R..R)), XYDATA
0@%%%%%%%%%%%%%%%%%qJ6j6J6j6J9k7L2l2M0m8N3o1P0p9Q9j02J15j30J46j63J80
$$ 0 0 0 0 0 0 0 0 0 0 0 0 0 0 0 0 0 0 -8 8 -8 8 -8 11 -16 16 -16 24 -24 29 -32 38 -41 48 -54 61 -69 77 -86 94
39I4k01K25k49K76l06L38l73M13m55N00n52O09o72P40q17R03r98J111j240J389
$$ 94 -107 118 -131 145 -161 177 -196 217 -238 262 -290 319 -353 387 -430 473 -525 586 -654 735
59G35j567J779k040K372k809L412m298N733q426J5161o4171j05536J44634J12780
$$ 735 -832 947 -1093 1279 -1530 1882 -2416 3317 -5109 10052 -54119 -159655 -15021 97759
73I7759l3855o8489J9160M5000j7987l0332K2446j5141k7269J9822j1054o9609
$$ 97759 63904 -4585 14575 59575 41588 11256 33702 18561 -8708 11114 60 -69549
85f9549l0705N6262P9704k0047p0855J3616N1308J2919J0960M138q100m542k006
$$ -69549 -100254 -43992 35712 15665 -55190 -41574 9734 22653 33613 37751 29651 25109 23103
98B3103L215j7655k4133L2560J7779n7344l8964J7897K3551J643r667J5716J1656
$$ 23103 26318 8663 -15470 17090 34869 -22475 -61439 -43542 -19991 -18348 -28015 -12299 -643
111f43k2434J9944M8931r442k1737J9409J8718k4289n1279M95M5592j2098m1968
$$ -643 -23077 -3133 45798 36356 14619 34028 52746 28457 -22822 -22327 23265 11167 -30801
124c0801k162K747k690R552J6692J6138j1619j0082K7250N206j7972J7652K0896
$$ -30801 -32963 -30216 -32906 -23354 -6662 9476 -2143 -12225 15025 20231 2259 19911 40807
137D0807r510k5396j7671J2618N434j8249M139J097k4586k246J4838J0271Q588
$$ 40807 31297 5901 -11770 848 6282 -11967 -7828 -6731 -31317 -33563 -18725 -8454 134
150A34L024J0434J596k0456J1107K9411o900j6492q072o050j477r281N60J2853
$$ 134 3158 13592 15188 -5268 5839 35250 28350 11858 3786 -2264 -3741 -13022 -12462 391
164C91j1116r774Q730m688J021J7130J2265M690j4827j0809J9778P691p959K606
$$ 391 -10725 -20499 -11769 -16457 -15436 1694 13959 18649 3822 -6987 12791 20482 12523 15129
178A5129p497j1016k823n526L096J42n828J0937k198j7310R349J8616R084J780
$$ 15129 7632 -3384 -6207 -11733 -8637 -8495 -14323 -3386 -5584 -22894 -13545 5071 14155 15935
192A5935j0501K65O758n868M877L565j4720k796m91r197j984j177P916J1306j2855
$$ 15935 5434 5699 12457 6589 11466 15031 311 -2485 -2976 -12173 -14157 -15334 -7418 3888 -8967
207h967p686J1536N794R085M872o150J544j556l529O578o081n999O662p914j1968
$$ -8967 -16653 -5117 677 9762 14634 8484 10028 8472 4943 11521 5440 -559 6103 -1811 -13779
222a3779k605N98J1377L347r516L742L079P50J2753K916k900L289l820j061j976
$$ -13779 -16384 -15786 -4409 -1062 -10578 -6836 -3757 -3007 9746 12662 9762 13051 9231 8170 6194
237F194r291N450M160j2281n151l076m95R788L02j066M691m215L610R513k634
$$ 6194 -3097 2353 6513 -5768 -10919 -13995 -14490 -4702 -4400 -5466 -775 -4990 -1380 8133 5499
252E499L832M328m456k04o722n059P804l124o766p16p868J37O924p20N086J876
$$ 5499 9331 13659 9203 8999 2277 -2782 5022 1898 -4868 -5584 -13452 -13315 -6391 -7111 -2025 -149
268a49k976P526J70k535Q388P57l015o50q681m24L706m898J486j908p876L793
$$ -149 -3125 4401 4571 2036 10424 11181 8166 7516 -1165 -1589 2117 -2781 -1295 -3203 -11079 -7286
284g286J212j205O660l66J306N080n374K008O818k060K093k354p865J992k226
$$ -7286 -6074 -7279 -619 -985 321 5401 27 2035 8853 6793 8886 6532 -1333 659 -1567
299a567k694M084n033k353M103l667J709N395q05N301L99n086M485Oj096M877
$$ -1567 -4261 -177 -5210 -7563 -3460 -7127 -5418 -23 -828 4473 4872 -214 4271 4277 3181 8058
315H058n007l821J730m903N38J978m497L439p1m540M549Q09R92O738k581j252
$$ 8058 3051 -770 960 -3943 -3405 -1427 -5924 -2485 -2556 -7096 -2547 -1738 -746 5992 3411 2159
331B159L182l571K319K077n704Q69j423n096K407k164p39N307l194n88L651k305
$$ 2159 5341 1770 4089 6166 462 1331 -92 -5188 -2781 -4945 -5684 -377 -3571 -4159 -508 -2813
347b813M237L962l023K714p98l201L919k362k612L148n006j849J359m573K296
$$ -2813 1424 5386 2363 5077 4279 1078 4997 2635 23 3171 -1835 -3684 -2325 -6898 -4602
362d602K651k538L155r0j908O270J82K2M076l709o08K249m618J186M15n221J583
$$ -4602 -1951 -4489 -1334 -1424 -3332 2938 3120 3142 7218 3509 2901 5150 532 1718 2133 -3088 -1505
379a505k105l424L739j093NM441k938J215M236j969L507K055l446K713j364l563
$$ -1505 -3610 -7034 -3295 -4388 -4383 58 -2880 -1665 2571 602 4109 6164 2718 5431 4067 504
395E04K979l029k274K148m752o34K052l382L090K276k420L712L57r22N108j053
$$ 504 3483 454 -1820 328 -4424 -5058 -3006 -6388 -3298 -1022 -3442 270 627 -295 4813 3760
411C760j80K831m106n3J379m537J216k24m092J822j728k121L891j010M20L919
$$ 3760 3580 6411 2305 2252 3631 -906 310 86 -4006 -2184 -3912 -6033 -2142 -3152 -2732 1187
427A187l010K017L319k141L248N17l505K654j692k912K272l487q47J980m297O26
$$ 1187 -1823 194 3513 1372 4620 5137 1632 4286 2594 -318 1954 -1533 -2380 -400 -4697 -4071
443d071J668k531L783J257k463L322j56M2L913k225l48K287l646O75N46m143J924
$$ -4071 -2403 -4934 -1151 106 -2357 965 809 851 4764 2539 2191 4478 832 1507 2053 -2090 -166
460a66k26l072J945k126r71M470j465K47K635k676K964J989k739K479j98k599
$$ -166 -392 -3464 -1519 -3645 -4616 -146 -1611 -1364 1271 -1405 1559 3548 809 3288 3090 491
476D91K452k112k359K311k368J24J319m385K001J846j860K932j49k029L903q66
$$ 491 2943 831 -1528 783 -1585 -1461 -142 -4527 -2526 -680 -2540 392 243 -1786 2117 1251
492A251o30K827k451O60J455l893P94N59l004K850j014l150K755j035J52L321
$$ 1251 621 3448 997 1657 3112 -781 13 572 -2432 418 -596 -3746 -991 -2026 -1874 1447
508A447k590P96K634k347J864M84k426L135j034l083K037j933q59K497k659J69
$$ 1447 -1143 -347 2287 -60 1804 2288 -138 2997 1963 -1120 917 -1016 -1875 622 -2037 -1868
524a868J441k876K924J245k351K900Q4j575K823j729k41K467k951o7O49l430J656
$$ -1868 -427 -3303 -379 866 -1485 1415 1499 -76 2747 1018 777 3244 293 226 875 -2555 -899
541h99M45k434K571j042j780L476j199L75L317k282R23J531k713J904k10k314
$$ -899 -454 -2888 -317 -1359 -3139 337 -862 -487 2830 548 1471 3002 289 2193 1983 -331
557c31K123j837k595K290k180j45K608k518O20J531j885L324R30k096L270q31
$$ -331 1792 -45 -2640 -350 -2530 -2675 -67 -2585 -1965 -434 -2319 1005 1935 -161 3109 2278
573B278j249K384k330n25J616l052p0L04l181K033N27k018K393j132kL611j322
$$ 2278 1029 3413 1083 558 2174 -878 -948 -644 -3825 -1792 -1265 -3283 -890 -2022 -2024 1587 265
590B65O05K621j917Q54P89k808J691k86k537J540k786j635K572j720j19J956k360
$$ 265 870 3491 1574 2428 3217 409 2100 1814 -723 817 -1969 -3604 -1032 -2752 -2871 -915 -3275
607c275J951J837j311K874L16j145K892j518j713K180k374r0Q10m014N87L81k091
$$ -3275 -1324 513 -798 2076 2392 1247 4139 2621 908 3088 714 624 1434 -2580 -1993 -1612 -3703
624c703J880j61j401L067n40O6K923j394J217K227k984Q82O36k485J650j440k513
$$ -3703 -1823 -1984 -3385 -318 -858 -792 2131 737 1954 4181 1197 2079 2715 230 1880 440 -2073
641b073J614j861p38K104j889N02K164j769K018R71j186L052j56j768K043j871
$$ -2073 -459 -2320 -3058 -954 -2843 -2341 -177 -1946 72 1043 -143 2909 2753 985 3028 1157
657A157m97J740k952m21P93k703J285Q3j722K616k16q14K531j098N58K764j909
$$ 1157 660 2400 -552 -973 -180 -2883 -1598 -1515 -3237 -621 -837 -1651 880 -218 340 3104 1195
674A195L04J122k530J386q2k534J654j527j230J708j917K61K550j556Q50J358
$$ 1195 1499 2621 91 1477 1395 -1139 515 -1012 -2242 -534 -2451 -2190 360 -1196 -346 1012
690A012j629K073M50j462J992j127j465J794k243m34J453k380P57P12k205J934
$$ 1012 -617 1456 1906 444 2436 1309 -156 1638 -605 -1039 414 -1966 -1209 -497 -2702 -768
706g68O11q94K401p73p20K603j582J78J280k366N93L20k674J263j41j752K028
$$ -768 -157 -1051 1350 577 -143 2460 878 1056 2336 -30 563 883 -1791 -528 -669 -2421 -393
723c93j019q92K513j134R90J858j817J510R34k187J647l65j919J511j939j182
$$ -393 -1412 -2304 209 -925 65 1923 106 1616 2550 363 2010 1645 -274 1237 -702 -1884
739a884J602k090M54J291k089J509R23r67K534K52j146K351p71o00J391k170J61
$$ -1884 -282 -2372 -1918 -627 -2716 -1207 -284 -1251 1283 1535 389 2740 1969 1369 2760 590 751
756G51N07k804K93J12k051J735j87j177K125m71L33K494j271J171J438j596J075
$$ 751 1258 -1546 -1253 -1141 -3192 -1457 -1644 -2821 -696 -1167 -834 1660 389 1560 2998 1402 2477
773B477K38k064J077j105j905J177k038n96J488j704P70J370j271J833R33n80
$$ 2477 2715 651 1728 623 -1282 -105 -2143 -2739 -1251 -2955 -2185 -815 -2086 -253 680 100
789A00K553k97q12J915j710o15J223k371j35J26k695J009j16j441J767j53m68
$$ 100 2653 2356 1544 3459 1749 1134 2357 -14 -149 -23 -2718 -1709 -1825 -3266 -1499 -1652 -2120
806b120K404o94O79K225j208R87Q52k060J198n61j999J323j546j711J320j724
$$ -2120 284 -410 269 2494 1286 2273 3125 1065 2263 1702 -297 1026 -520 -2231 -911 -2635
822b635K05J425j263J095J166j173K164O50q99J911p50q59J455j833n23Q48k159
$$ -2635 -2430 -1005 -2268 -1173 -7 -1180 984 1634 735 2646 1896 1037 2492 659 136 984 -1175
839a175K72J00j900J374J13j257K497n89k19K149q29M04J552j691Q06L35k156
$$ -1175 -903 -803 -2703 -1329 -1216 -2473 24 -565 -784 1365 536 940 2492 801 1607 1942 -214
856b14J144n04j612J220j377n86J478j339M94J480j342J257J069j306J794k71
$$ -214 930 426 -1186 34 -1343 -1929 -451 -1790 -1296 184 -1158 99 1168 -138 1656 1385
872A385r08J426j240n89J009j762NQ05k089Q78M09j103J796j44o89J873n59j44
$$ 1385 477 1903 663 74 1083 -679 -674 131 -1958 -1080 -671 -1774 22 -122 -811 1062 503 359
890C59J471j379M15O91j722O21j41j827J499p71j055J590j158J90J700j107O51
$$ 359 1830 451 866 1557 -165 456 315 -1512 -13 -784 -1839 -249 -1407 -1217 483 -624 27
907B7J362j472J215L04j291J649j077j114J448j727k32Q18j516N50O26j445J603
$$ 27 1389 -83 1132 1436 145 1794 717 -397 1051 -676 -908 -90 -1606 -1056 -430 -1875 -272
924b72L37j049K165m68m17J748j328K3J075j761J50M48j973J069l94j354J395
$$ -272 65 -984 1181 713 296 2044 716 739 1814 53 203 651 -1322 -253 -647 -2001 -606
941f06n35o83J913q11K26J775j370J275N94j444J334m41j329J460j503p24R35
$$ -606 -1141 -1824 89 -722 -496 1279 -91 1184 1778 334 1668 1227 -102 1358 -145 -869 66
958F6j571J75Q08j282J115L03p16J404J71o26J728o45j03R53j339K40M13j639
$$ 66 -1505 -1330 -522 -1804 -689 -386 -1102 302 473 -153 1575 930 827 1780 441 681 1094 -545
976e45O24r4j618J161l25r31J622r86J63J615j191O32J172j159R94L48j474J268
$$ -545 79 -15 -1633 -472 -797 -1728 -106 -1092 -929 686 -505 127 1299 140 1134 1482 8 1276
994A276o89j033J296j499m89J251j535N09P50j062J122M12j001J582l30o21J371
$$ 1276 587 -446 850 -649 -1138 113 -1422 -913 -163 -1225 -103 309 -692 890 560 -61 1310
1011A310j070lR08j428L87N80j634R39o9j229J454n27m58J251q12K51J340j520
$$ 1310 240 237 1145 -283 104 684 -950 -11 -80 -1309 145 -382 -840 411 -401 -150 1190 -330
1029c30O77O90j443Q53l4j162J318q19o48J104q54O5J102j266P26P10j312J319
$$ -330 347 1037 -406 447 413 -749 569 -250 -898 206 -648 -583 519 -747 -21 689 -623 696
1047F96k2r29J171n50n47R58j118P1P56j493O95N59j386J209j23o22J363o64k77
$$ 696 674 -255 916 366 -181 777 -341 -270 486 -1007 -312 247 -1139 70 -53 -675 688 24 -253
1066b53J530j121J86R21j633O09L29j426J076l54j080J154n62m45J403j023L07
$$ -253 1277 156 342 1263 -370 239 568 -858 218 -136 -1216 -62 -624 -1069 334 -689 -382
1083c82J066j124J093M61j179J120l43q62J086r75m93R01j467L55O51j324R92
$$ -382 684 -440 653 1114 -65 1055 712 -150 936 -39 -532 369 -1098 -743 -92 -1416 -424
1100d24L03j067J313K84o99J474q35Q6J189j251J88O48j684P07k65j269J036k56
$$ -424 -121 -1188 125 409 -290 1184 349 435 1624 373 561 1209 -475 232 -33 -1302 -266 -522
1118e22r41J250p80K33Q96p68R05Q23j149R06L51j058J118o02p49R74j306l82
$$ -522 -1463 -213 -993 -760 136 -632 273 1096 -53 853 1204 146 1264 662 -87 887 -419 -801
1136h01J025j566M20N95j217J259J57p98J421j85l63J311p30R1Q60j356M67L16
$$ -801 224 -1342 -922 -327 -1544 -285 -128 -926 495 310 -53 1258 528 619 1479 123 590 906
1154I06j431O22r3j223R69m62n50J201q82L12J002r44Q80N34r98J114j48p88J124
$$ 906 -525 97 4 -1219 -250 -712 -1262 -61 -943 -631 371 -573 307 841 -157 957 809 21 1145
1173A145q49m87J106j378j10O35j380O96M72r38J226k86n21J270n70k06J310q96
$$ 1145 296 -191 915 -463 -573 62 -1318 -622 -150 -1088 138 -148 -669 601 31 -175 1135 239
1191B39N8Q75j390P38q0j109Q13k77q02Q13m16k56J068r92N59Q54j007N33N15
$$ 239 297 1172 -218 520 440 -669 144 -133 -935 -122 -538 -794 274 -718 -159 695 -312 221 736
1210G36r74J082m27o83R94q74j46O96r40M9O91q93N96L33j107J468m05n22J107
$$ 736 -238 844 417 -266 728 -146 -292 404 -536 -487 204 -689 -93 240 -867 601 196 -326 781
1229G81p43k41J016j007J48M93j120N46k0n19R27n35m35J204n89k63J094q80M05
$$ 781 38 -203 813 -194 -46 447 -673 -127 -147 -666 261 -274 -709 495 -94 -357 737 -143 262
1248B62N47j090Q04q8r30R85n59p05J125r38n4P20q92O75O40r68R05J15p42J169
$$ 262 809 -281 523 435 -495 490 -69 -774 351 -587 -641 79 -813 -138 502 -466 439 554 -188 981
1268I81n95l93Q35r52qP67j348N34J99j200Q52l7l72J122o23j81J313q04P8R45
$$ 981 386 -7 828 -124 -132 635 -713 -179 20 -1180 -328 -365 -737 385 -238 -419 894 90 168 1113
1288A113q06K52K67r84O99m08q21Q55o28m93Q27p58K63Q31r08Q58K33o93J019
$$ 1113 307 559 826 -158 541 133 -688 167 -461 -954 -127 -885 -622 209 -699 159 392 -301 718
1307G18l6n21R72p75k15N30j034J12M87r72L66J90r60P89nn12J107l88J19J018
$$ 718 682 161 1133 358 143 673 -361 -249 238 -734 -368 -178 -1138 -349 -354 -866 241 -147 -28 990
1327I90q18K56P04q46M28q7q65N62l28q23P85n55l30R52q46K23Q18p45Q50J29
$$ 990 172 428 1132 286 714 627 -238 324 -4 -827 -42 -597 -927 25 -821 -598 220 -525 325 454
1347D54m59R69l39o07R29o24k11O81j113J31L42j105P53j97m56R70k37m33J046
$$ 454 -5 964 625 18 947 323 112 793 -320 -189 153 -952 -199 -396 -852 118 -119 -552 494
1366D94o41pR63q80N02L33r44N52J46r02O34l69n53O51l05q4O36o95J35P26r08
$$ 494 -147 -154 809 -71 431 764 -180 372 518 -384 250 -119 -672 -21 -326 -410 226 -469 -334 392 -516
1387e16Q90j13l53P14m10l54O97n78o0L69p15L39Q2n76O81n1n05P85m87q5O28
$$ -516 374 261 -92 622 212 -142 555 -23 -83 286 -429 -90 -8 -584 97 46 -459 326 -161 -246 382
1408C82n37P4N06o27L57O0n17M72j72m28O53l10j30O28o78L09M12p58N40O3n62
$$ 382 -155 -81 425 -202 155 215 -302 170 -2 -430 223 -87 -217 411 -267 42 454 -304 236 299 -263
1429b63L91J39o54O89m82j99N67o89J37M65m16L90J15l02M80J38n63P14m90k5
$$ -263 128 267 -387 302 -180 -379 188 -501 -364 101 -315 75 190 -112 368 506 -57 657 167 142
1449A42N82r45K32K71p26K99j37l97O00j04k72P00k45L6N56n76K48L34p45O87
$$ 142 724 -221 11 282 -444 -145 -282 -679 -79 -183 -455 245 0 36 592 16 264 598 -147 540
1469E40k42n42M26l00m23N47m10k18N72m51J61O31n37L66L23n14P55l93r2N94
$$ 540 298 -244 182 -118 -541 6 -404 -622 -50 -501 -340 291 -246 120 443 -71 684 291 199 793
1489G93n70k04L97q13L24J87p52M95j06m30P11j63l29P59k38j3M80o10L97K12
$$ 793 223 19 416 -397 -73 114 -638 -143 -249 -679 32 -131 -460 299 61 48 528 -82 315 527
1509E27n42L04M5p10P70n20m67O68n46m8N04o31N18K14k02O22j86k32N28m70j39
$$ 527 -15 289 334 -376 394 -126 -593 75 -471 -519 -15 -646 -128 86 -116 506 320 88 616 146 7
1530GN57o15K20L69p30K57P5q24P13j49k26N95m28p0P29o46J60M50l65P9K51m89
$$ 7 564 -51 169 538 -192 65 140 -684 29 -120 -346 249 -179 -249 480 -166 -6 444 79 158 409 -80
1552h0L49k02l56N09l18l48N86l00K4M01n77K15J60m06M46L3k69M58k99j78N25
$$ -80 269 67 -289 220 -98 -446 140 -160 -136 265 -312 -97 63 -343 103 136 -133 325 26 -152 373
1573C73n26j0N15p16M33J28l66M13k38k94P56o73M1M76m61N8M29o96M44J17n18
$$ 373 -153 -163 352 -364 69 197 -169 244 6 -288 468 -205 -164 312 -149 -91 338 -358 86 203 -315
1594c15M15j22l30O53m37M4M80m41K48J9n18O41k51l25M33k92k17O28p35L04M75
$$ -315 100 -22 -352 301 -136 -92 388 -53 195 214 -304 337 86 -239 194 -98 -315 313 -422 -118 357
1615C57o11J58L35m57M61K9l93M94j04l03L55l75j22M16m48K65rm33L91n4l48
$$ 357 -254 -96 239 -218 243 272 -121 373 269 -34 321 -54 -176 240 -208 57 48 -385 6 -48 -396
1636c96N85k89k01N71l78R7J90l22K00L07n53L10n5l05O24o78R9L89n17J46K36
$$ -396 189 -100 -301 270 -108 -11 179 -143 57 364 -189 121 66 -239 385 -293 -194 195 -322 -176 60
1657F0k88K06J23l00M03j14j94N08j48k69M32n11K16K01n55L02Q0o79N29l11K7
$$ 60 -228 -22 101 -199 204 90 -104 404 256 -13 419 -92 124 325 -230 72 152 -527 2 -309 -282
1678b82M46l78q0M63k44J75J45o15O83j56k57M02j97k08M84m48j24K59l24N7K26
$$ -282 164 -214 -294 169 -75 100 245 -370 313 157 -100 302 105 -103 381 -67 -191 68 -256 -199 27
1699B7k73K56j18k17O22l44j07L62k63k1M94o08M56j10l56L87K3m71L48j60KJ25
$$ 27 -246 10 -108 -325 297 -47 -154 208 -55 -76 418 -190 266 156 -200 187 210 -261 87 -73 -71 54
1721E4m09J77L15l54J79K68o21M54P9k65L34k02n5K92k63n1K38m14J69Q5k35N07
$$ 54 -355 -178 137 -217 -38 230 -391 63 142 -123 211 9 -46 246 -17 -68 170 -244 -75 10 -225 282
1743B82m27j68M26j24l20L84k17J94J22l16K58K06l66J53R2k30M76l60k77N76
$$ 282 -145 -313 113 -11 -331 53 -164 30 152 -164 94 300 -66 87 179 -51 425 65 -212 364
1763C64n71M1K60m00L44j08l09M70k42R8K88j70k32N30l31j4J56l25L15N3k43
$$ 364 -207 -166 94 -306 38 -70 -379 91 -151 -53 235 65 -167 363 32 18 174 -151 164 217 -26
1784b6R7r3j84J57k44l7L35q5L8J62l37L17j09j20M24k28r8M36m94%N20n92R8
$$ -26 71 -22 -206 -49 -293 -330 5 -80 -42 120 -217 100 -9 -129 295 67 -31 405 -89 -89 431 -161 -63
1807f3R7j73J45mm77N14m6j22M42l04j54L60l88K23J3q4J53jj02J45q1l12K94
$$ -63 34 -139 6 2 -475 39 -7 -129 313 9 -145 215 -173 50 63 -21 132 131 29 174 93 -219 75
1830G5m3q2J38l80K92R7l44L37j04o0M29l87n5L13l27J05K91k52J8J79m92L68
$$ 75 32 -50 88 -292 0 97 -247 90 -14 -74 355 -32 -87 226 -101 4 295 43 61 240 -252 116
1852A16j10k47M43j43j64K12m53K57K68l56L36n7l59M03n5j42M32l75p4M07m14
$$ 116 6 -241 202 59 -105 107 -346 -89 179 -177 159 102 -257 146 91 -51 381 6 -68 339 -75
1873g5Q5P4k93K02M8k82M47k68j53M57l86J2K71j98M8J84k76J87N7k17J22P6l12
$$ -75 10 84 -209 -7 41 -241 206 -62 -215 242 -144 -132 139 -59 -11 173 -103 84 141 -76 46 122 -190
1896a90M42m45R6K27k30J2L20m54K36m9o2K69p4j60L66l52M9K82m70L07M9k70
$$ -190 252 -193 -97 130 -100 -88 232 -222 14 -35 -97 172 98 -62 304 -48 1 283 -187 120 169 -101
1918a01K24l8k22K19k52J5K63l31J24K29k79K13J68l16L68j72k24L46j12j40J87
$$ -101 123 85 -137 82 -170 -155 108 -223 -99 130 -149 64 232 -84 284 112 -112 234 122 -18 169
1939A69j76K1M0j81J36P4k10L00j54r6R5j29K6K14j95N7K70m62L95j94o3L28q7
$$ 169 -7 14 54 -127 9 83 -127 173 19 -77 18 -111 -85 129 -66 -9 261 -201 194 0 -63 265 178
1962A78l58J68j42M3J10j01J29j8k92L09O7k87L92k12mL1PoJ10j97J48M4j72L0
$$ 178 -180 -12 -154 -111 -1 -102 27 9 -283 26 93 -194 198 -14 -18 13 20 14 124 -73 75 119 -53 -23
1986b3P9k47L69j51nl5Lj31K24k75J82Pl2J51j90l7L46l23K20M4k45J6K41l94
$$ -23 56 -191 178 27 22 -13 -10 -141 83 -192 -10 -3 -35 116 -74 -111 235 -88 132 176 -69 -53 188 -206
2010b06J40J46k67J77j13k9K11k59R7K48k83Q4J18k59K14Q2j64J49p9K28m2j35
$$ -206 -66 80 -187 -10 -123 -152 59 -200 -103 145 -138 -54 64 -195 19 101 -63 86 7 235 193 58
2032E8j59K29l82L11k7j04L1M8k8K01j53j48K99j21j75L04k91K71J19l42J64j51
$$ 58 -101 128 -254 57 30 -74 -43 5 -23 178 25 -123 176 55 -120 184 -107 164 283 -59 105 -46
2054d6L7N1k14j5K19k70J49K27k65K08j1j65K94m7k62L14j8j55L08j93j84J67
$$ -46 -9 42 -172 -187 32 -238 -89 138 -127 81 70 -95 199 152 -110 204 186 31 339 146 -38 129
2076A29j89L9J22k19L2m9k6J08pM2K26k37Q1J50k57Q6M5r7K18k58j96L31n4m8
$$ 129 -60 -21 101 -118 -86 -135 -161 -53 -60 -18 208 -29 52 202 -55 31 76 -21 197 -61 -257 74 20 -28
2100b8O2j31M4K45k83J21j52NK25J9j81J76k21L9L06n07M32L7k48j18K6m2K08
$$ -28 34 -97 -53 192 -91 30 -122 -117 108 127 -54 122 -99 -60 246 -261 171 208 -40 -158 -132 -174 34
2123C4P8l80L68l65J87J24k20K07Nj85O8K50j57n5K81m13L46k60J44Q3k26K1J15
$$ 34 112 -268 100 -265 -78 46 -174 33 38 -147 -79 171 14 -41 240 -173 173 -87 57 140 -86 -65 50
2146E0l16J89K6j65K82r5k04K16N2J0K7j58J31J87k51Q6j03j05L51j2k92J29j2
$$ 50 -266 -77 -51 -216 66 -29 -233 -17 35 45 72 -86 45 232 -19 67 -36 -141 210 198 -94 35 23
2169B3LQ0j25n4J34j95J43Q0o4K5Q9l37L42k20l8K92k97J19K10k68N7J94k40K79
$$ 23 26 106 -19 -73 61 -134 9 89 25 50 139 -198 144 -76 -114 178 -119 0 210 -58 -1 193 -47 232
2193B32k58k2K09l83J90q7M9P6J51j66J61jj18J82k10j09R2r8J09K65m33J81K7
$$ 232 -26 -48 161 -222 -32 -119 -70 6 157 -9 152 151 33 215 5 -104 -12 -110 -1 264 -169 12 39
2216C9j75K65r8m4R6q2J01k0K9j69Q6j36kK74k38K07j1k85K74j35k3J92l81K91
$$ 39 -136 129 31 -13 83 1 102 82 111 -58 28 -108 -110 164 -74 133 122 -163 111 -24 -47 145 -236 55
2240E5M7j06j49O2j71M56k74K9Q8j9n3j47J47J83j20k10K60Nk56K08q8j4k0N9
$$ 55 102 -4 -153 -91 -262 194 -80 -51 37 18 -35 -182 -35 148 28 -182 78 83 -173 35 -53 -67 -87 -28
2264b8O6j2j36O3L19l91L43j15k60L08k15KO5P6N1j51j91R0R6L3p8J22k25K33
$$ -28 38 26 -110 -47 272 -119 224 109 -151 157 -58 -56 9 85 136 -15 -206 -116 -20 13 -65 57 -168 65
2288F5q0n3K22k21L6J76k2j06o6Q4%N9k73K39j40P4J78j86L2LK5q2J13j87N6J69
$$ 65 -15 -68 154 -67 -31 145 123 17 -49 35 35 94 -179 60 -80 -6 172 -14 18 21 46 -36 77 -110 -54 115
2314A15k59L67l91K21Q2j47N6J6k20J25Oj46K39R8k18j36O9P0J36l3o5q1Q4K16
$$ 115 -144 223 -168 53 135 -12 44 60 -160 -35 -29 -175 64 162 -56 -192 -123 -53 83 50 -15 -96 -12 204
2338B04p6j01L8O6k65J65m7P4J29m09K35o1J5J09n3o2M2P2PP8m40K09K20l23J94
$$ 204 128 27 65 131 -134 31 -16 58 187 -222 13 -48 -33 76 23 -39 3 75 82 160 -280 -71 149 -174 20
2363B0R9j23J10n5k23J43K0r9J55k18KJ82j17K31k32l9K17M4k8J31l24Q9J25M8
$$ 20 119 -4 106 51 -172 -29 -9 -108 47 -171 -169 13 -104 127 -105 -144 73 117 89 220 -104 -15 110 158
2387A58l32M29k49j1M9j99M9k2J40K2q5NPR8j6K21l11pJ99j82J63k3n5M6j51j03
$$ 158 -174 255 6 -5 44 -155 -106 -128 12 34 -51 -46 -39 59 43 264 -47 -54 145 -37 126 103 48 94 -57 -160
2413a60K19j74k8L5R3N7k2r5J05J79k20R4k17k7J88o3N7J17k34K27n9k06K33j97
$$ -160 59 -115 -143 -108 -15 42 20 -75 30 209 -11 83 -134 -161 27 -36 21 138 -96 131 72 -134 99 -98
2437i8K1M2N7l6q5J1KJ43q0pR8j31J70j30J58J15k97rJ15j17l0j3n7J59P6q4P2
$$ -98 -77 -35 22 -14 -99 -88 -86 57 -23 -30 68 -63 107 -23 135 250 -47 -56 59 -58 -88 -101 -158 1 77 -7 65
2464F5j63J38lj31K3J55q7L7N7m8j17K18l77L22l63J31J19l8O6J18l06J60O7q3
$$ 65 -98 40 37 -94 -71 84 -3 34 91 43 -74 144 -233 89 -274 -143 -24 -62 4 122 -184 -24 43 -40
2488d0J8j3J12R7p8k29K99l06k4J12O3J3L7j34J19n7j4J25p0q8J69k07K19kk37
$$ -40 -22 -35 77 174 96 -133 166 -140 -164 -52 11 24 61 -73 46 -11 -25 100 30 -58 111 -96 123 121 -116
2513a16J34r1R2R9m5j30J83j88QJ18k04J85Q1q5P0J76m38K9R7k4n6R9k61K67k3
$$ -116 18 -73 19 118 73 -57 126 -62 -54 64 -140 45 126 41 111 287 -151 -122 -25 -49 -105 -6 -267 0 -23
2538b3K6P7k12K46k46M8K34o7k0j29Pk41K97j6Q0j27k0K17j59J08k8j22Q9J38
$$ -23 3 80 -132 114 -132 -84 150 83 63 -66 -59 -300 -3 -19 61 -66 -86 131 -28 80 52 -70 19 157
2562A57k49JK28k42J38J36j26jj52J40n5j16j0L62j08k2j36p7L48j88l9%J89j34
$$ 157 -92 -91 137 -105 33 169 43 42 -110 30 -25 -141 -151 211 103 81 -55 -132 216 28 -11 -11 178 44
2586D4J22j39j5j25J52o9J33j18M9J6j67J66p7K16j75P4m1j4m1M4J7K9oq7J29
$$ 44 166 27 12 -113 39 -30 103 -15 34 50 -117 49 -28 188 13 87 46 32 -9 35 52 81 75 -12 117
2611A17k97J79Qj3J10j38J07l9p2J12k30J75n0m3P8j70Q7R9m2j48L11j01Q6l4
$$ 117 -180 -1 7 -6 104 -34 73 34 -38 74 -156 19 -31 -74 4 -166 -79 20 -22 -170 141 40 126 92
2635I2m03L32J09l66K77j85l7K62l49R0K93j57Nj66K09J11l8j4M4j44R6M0j82
$$ 92 -311 21 130 -236 41 -144 -181 81 -268 -178 115 -42 -37 -203 6 117 79 65 109 -35 61 101 -81
2658h1J80k5j51Q4p3N0k4l6o5Q2J47l5j89j05J72j15J13J96l2k19J04J25k06N9
$$ -81 99 74 -77 7 -66 -16 -40 -76 -141 -59 88 53 -136 -241 -69 -184 -71 125 93 -126 -22 103 -103 -44
2682d4n0J17j38N9m3O2K1J57j04J7Jj04J47j08l7n0K15m0r4M1j06J20J6n6M8j45
$$ -44 -94 23 -115 -56 -99 -37 -16 141 37 54 55 -49 98 -10 -47 -97 118 78 -16 25 -81 39 55 -1 47 -98
2708i8L17j41k21J00O0L3j64J56K3O5J1j30K30j59k17K15j91J05P6J5o3N9n5m0
$$ -98 219 78 -143 -43 17 50 -114 42 65 130 141 11 241 82 -135 80 -111 -6 70 85 22 81 26 -14
2732a4K8j2p6LO6L2Ol4M5j71P0M6mO4r5O8j73K63j61J18j8n5jn9J73m3q8J62j31
$$ -14 14 2 -74 -71 -5 27 33 -1 44 -127 -57 -11 -15 49 -46 22 -151 112 -49 69 51 -4 -5 -64 109 66 -22 140 9
2761Inp3J1J37m5o7J07J19k66J53p9m6K43k70J5o3J77j9q0O6l1P6q1K30k36oJ73
$$ 9 4 -69 -58 79 34 -33 74 193 -73 80 1 -45 198 -72 -57 -120 57 38 -42 24 -7 69 -12 218 -18 -24 149
2788A49j68j0L6o2p1Q7qL6j1Q4j19nn9J46K9l2M1r1n5K6p2O8O4r0K23j68J65O1
$$ 149 -19 -29 7 -55 -126 -39 -47 -11 -22 62 -57 -62 -121 25 54 22 63 -28 -83 -57 -129 -61 3 -87 136 -32 133 194
2816A94j93R0p0p3L1p1j2O9O3k37L01r7r5K30j35j85L30j57R4jm2Q0j89J64P2
$$ 194 1 91 21 -52 -21 -92 -104 -35 28 -209 92 -5 -100 130 -5 -190 140 -17 77 76 34 114 -75 89 161
2841A61j42n7mO9j45K05j76M3nP6RQ8j01J18p0k03K15j43K0P3J1P0j53j41R6K
$$ 161 19 -38 -42 27 -118 87 -89 -46 -51 25 34 122 21 139 69 -134 81 -62 -42 31 42 112 -41 -182 -86 -84
2867h4n5K44j71j09L10k37K28j28P5j49J08pR9O4k57J98j17K6J08l01K40r6P7
$$ -84 -139 105 -66 -175 135 -102 126 -2 73 -76 32 25 124 188 -69 129 12 38 146 -155 85 -11 66
2890F6pj2L0Oq6k5N6K9n8J93k31J51K11l05l9Q9M2k3r3j6k3l9J56R0l77J18L20
$$ 66 59 47 77 83 -3 -28 28 57 -1 192 -39 112 323 18 -21 68 110 87 -6 -22 -45 -84 72 162 -215 -97 223
2917B23k67l5l0R5J03J7j35J6O2m0M2M7j59J00L3L8j70n2L5N5OQ9j21j7J35j39
$$ 223 -44 -79 -109 -14 89 106 -29 -13 49 9 51 98 -61 39 72 110 -60 -112 -77 -22 -16 73 -48 -65 70 -69
2943f9L18k30j34J18l4J03K5p7r1K18j61QJ13j55%J66k84K43j31K36l06k1J59
$$ -69 249 19 -115 3 -31 72 97 20 -71 147 -14 -6 107 -48 -48 118 -166 77 -54 182 -124 -145 14
2966A4R9r4j48k0O6P9m0q8K22j39J41mp9M9kj28J9O8l8J9Q2r8j87J57M2K4k9q
$$ 14 113 19 -129 -149 -83 -4 -44 -132 90 -49 92 88 9 58 56 -72 -53 15 -23 -4 78 -20 -207 -50 -8 16 -13 -21
2994b1J2M3p4j4R7M7k00J79j13K0O4n9N5r1Q0m1m9N4j00L20k20J7p3K4j37K20
$$ -21 -9 34 -40 -54 43 90 -110 69 -44 -24 40 -19 36 -55 25 -16 -65 -11 -111 209 -11 6 -67 -43 -180 40
3020D0n1J17j13l5P1r9l2J40M8k7j01l6J12J17j79R8J39j03l1m5kk30K54J9j75
$$ 40 -11 106 -7 -42 29 -70 -102 38 86 59 -42 -78 34 151 -28 70 209 106 75 30 28 -202 52 71 -104
3045a04l7K15J29k36J30jj46J34L8j41N0M8l2J28j84p5J11p5j17L60k92K0M1K1
$$ -104 -141 74 203 -33 97 96 -50 84 122 -19 31 79 47 175 -9 -84 27 -48 -165 195 -97 -77 -36 -15
3069a5o4j55J08J42j3J48k34M4P3j07J26j07m3J96k01M4J11j6K5q4M9k04J96L7
$$ -15 -79 -234 -126 16 3 151 -83 -39 34 -73 53 -54 -97 99 -102 -58 53 37 62 -22 27 -177 19 56
3093E6mj41LJ30Mk84J55O1Rj94K44j52O2P9j27J46r6J75p5j79Q1n6M1K5J80j94
$$ 56 52 -89 -86 44 48 -236 -81 -20 -11 -205 39 -113 -51 28 -99 47 -49 126 51 -128 -47 -103 -62 -37 143 -51
3119e1P6r1R3j27J64j62J4R6q7K23l0l00J21N2j52J05J8K52k76J24J07k86J26
$$ -51 25 -66 27 -100 64 -98 -84 12 -75 148 118 -182 -61 -9 -161 -56 -38 214 -62 62 169 -117 9
3142IJ41k35J10J00K6L9l22jM4J13r5O1j28J60J6N3j45J20o1J72j30j67O8K07
$$ 9 150 -85 25 125 151 190 -132 -133 -89 24 -71 -10 -138 22 38 91 -54 66 5 177 47 -120 -52 155
3166A55j21J1m9l6K77k50m0J30J14o4p0j52K01j31k2K63k14k05L19k31K41N5j49
$$ 155 34 45 -4 -40 237 -13 -53 77 191 127 57 -95 106 -25 -47 216 2 -203 116 -115 126 181 32
3189C2Kk7k5O7p3Q2P0j88J6oR9K5N9k83O6Q3n3J39k8q6O6j03R4rj18J07K0l8n6
$$ 32 34 7 -18 49 -24 58 128 -60 -44 -50 49 74 133 -150 -84 -1 -54 85 57 -29 37 -66 28 19 -99 8 28 -10 -66
3218f6M5o8J65p8J22j51m4l5J42n7L1K0j06K68L6j14j16J26k39Q3K48k02J32j91
$$ -66 -21 -89 76 -2 120 -31 -75 -110 32 -25 6 26 -80 188 224 110 -6 120 -119 -36 212 10 142 -49
3242d9Q4r4J55o6o5J95k21r4RJ09m2j02K48Q9j00O2j76K54j78l7pL7R6j4j59O0
$$ -49 35 -59 96 30 -35 160 -61 -155 -146 -37 -79 -181 67 156 56 118 -58 196 18 -19 -26 11 107 93 -66 -6
3268fJ59j71M6J47k54J28Q3l4k05K01p8j79J2K05k8j30K55j3k00Q1j09J77r9j03
$$ -6 153 -18 28 175 -79 49 132 98 -107 94 16 -163 -151 54 26 -104 151 138 -62 19 -90 87 -12 -115
3292a15M6R2P4K6j68l4O1j00L2J20n7M4P2n4j96J73N1l6j25J25q1K44l65J83M0
$$ -115 -69 23 97 123 -45 -79 -18 -118 -86 34 -23 21 93 39 -157 16 67 31 -94 31 -50 194 -171 12 52
3317E2K2j6j29j34K47L3j02j9l07N84j46l2J4J07k91J42q3O6Q8r6J50j15j47J45
$$ 52 74 58 -71 -205 42 75 -27 -46 -353 231 85 53 67 174 -117 25 -58 8 96 0 150 35 -112 33
3341C3o8K19r4k20P7N5J77k41j9O5P3O6j64N7M4j1J12k51n6J01q2J31l15K58J24
$$ 33 -35 184 90 -130 -53 2 179 -62 -81 -16 57 123 -41 16 60 49 161 -90 -146 -45 -127 4 -311 -53 71
3366G1j44J12J9m9Q1J20j14k5j7o2p1J46O5j60o3M3j6J93l21K48j32J15j4J6q9
$$ 71 -73 39 58 9 90 210 96 71 54 -8 -79 67 132 -28 -91 -48 -64 129 -192 56 -76 39 25 41 -48
3391d8M3K4N5q5n9K1K0K0J66k15J09kj82O1n7J00J2R4J3p6j77R3K67k32q1P5J41
$$ -48 -5 19 74 -11 -70 -49 -29 -9 157 -58 51 49 -133 -72 -129 -29 -17 77 90 14 -163 -70 197 -35 -116 -41 100
3418A00N1p3P3n4j23O9M0l16K86k3j48J7Q3k3Q5o2j92K41J3m0P4pj47K46j61O6
$$ 100 151 78 151 97 -26 43 83 -233 53 30 -118 -101 -18 -41 44 -18 -210 31 44 4 78 71 -76 170 9 75
3444G5j54L17j19n6l1o8Q0j07O4r1J30j73O3l0J25j61PK52o5r4N7k69K17qM6q5
$$ 75 -79 238 119 63 32 -36 44 -63 1 -90 40 -133 -70 -100 25 -136 -129 123 58 -36 21 -248 -31 -39 7 -78
3470g8rp8M8J25rJ14j51q1K37j33j74J35J38q2N9j76K10o4R8J5j44n0J5J8P6r4
$$ -78 -87 -165 -117 8 -1 113 -38 -119 118 -15 -189 -54 84 2 61 -115 95 31 129 144 0 -50 -35 -17 59 -35
3496c5N8l1Q1P9j65r3J46j54J59J07j82L2J27q2qJ2m2O9K0j64J5R8j23O6mmk5
$$ -35 23 -8 73 152 -13 -106 40 -114 45 152 -30 2 129 47 39 51 9 78 98 -66 -51 47 -76 -10 -14 -18 -43
3523d3l6J09R4m9L7L1k40K97j75j5q6r0J64j39J39k4N6j30J09Q9J14q9J7n3k5
$$ -43 -79 30 124 75 112 143 -97 200 25 10 -76 -166 -2 -141 -2 -26 30 -100 9 98 212 123 140 87 62
3548F2n2J51r2j91J20K6L4n8oJ14j8j82K09k1K8oj18m3j09J97j03J42j69j29K56
$$ 62 10 161 69 -122 -2 24 58 0 -6 108 90 -92 117 96 124 118 0 -43 -152 45 -58 84 -85 -214 42
3573D2p8Q6mk01K12o6m7J77j02j3o1R6jr1OK6o5j4j0K91k74J74j30p4J7K37r3
$$ 42 -36 50 46 -155 57 -9 -56 121 19 6 -55 41 40 -51 -45 -19 -84 -98 -108 183 -91 83 -47 -121 -104 133 40
3600D0Qq1m2J19k36K10k9L6j80J18n5K4lR8o7R7J7o5l1Q0Jm2q3O0jj7L6m8J38
$$ 40 48 -33 -75 44 -192 18 -11 25 -155 -37 -92 -68 -71 27 -40 57 74 9 -22 58 59 17 -66 -6 -7 -24 12 -36 102
3629A02j98nK57j93m3P2m6J27L9q4K7k4j31LK07k2M5k80K90j76j83K87j53L2J15
$$ 102 -96 -101 156 -37 -80 -8 -54 73 112 28 55 31 -100 -97 110 88 133 -147 143 -33 -216 71 -82 -50 65
3654F5L7j89R6P7K0j17Qq8R9r8j30K66j27J04m8J4j3j5K4M1J14k31J28j35K56
$$ 65 102 -87 9 86 106 -11 -3 -91 8 -90 -220 46 -81 23 -25 -11 -24 -39 -15 26 140 -91 37 -98 158
3679A58j88m2O3J15j45R7o9P9j7K4j5k7n6r1J19j6j7Lq5J41j78J56ML4j42P0j48
$$ 158 -30 -72 -9 106 -39 58 -11 68 51 75 60 33 -23 -114 5 -11 -28 -25 -110 31 -147 9 13 47 -95 -25 -173
3706a73K08P4k10R4K50k64l2Q6j77J46oq6N8l8N1o4K7n8K12q2P5l5j30m0J88j79
$$ -173 35 109 -101 -7 243 -21 -53 33 -144 2 -4 -90 -32 -70 -19 -83 -56 -114 98 16 91 56 -74 -114 74 -105
3732a05l4K18k02N4N7J73k14L7j34K47n7l7J24k8K6j31p8n2K31k05O5j5R7M3o
$$ -105 -139 79 -123 -69 -12 161 -53 -16 -150 97 40 3 127 99 125 -6 -84 -136 95 -110 -45 -60 37 80 74
3757G4ml0p9R4j10P7J0P8k4n1m0r0R7o8N1Qj51J42l2J41R4j24P6q7rk64K80j7
$$ 74 70 40 -39 55 -55 22 32 110 86 35 -5 -95 2 -66 -15 -7 -158 -16 -48 93 187 63 139 52 43 -221 59 42
3785D2j64J49j25J45j39Q9r3j6J95k06J12n2L7P0J06q8Rm5K3q7m9j27L31O4j04
$$ 42 -122 27 -98 47 -92 -3 -96 -112 83 -123 -11 -63 -26 44 150 62 71 26 49 -38 -87 -214 117 181 77
3810G7r0J59p6Lq4nR3o6K4o5m6Rn4R5N8qp3J05j92J20O2m8l9j4Q1k32K81J43j64
$$ 77 -13 146 70 73 -11 -16 77 11 35 -30 -76 -67 -121 -26 32 24 -49 56 -136 -16 46 -2 -41 -55 26 -206 75 218 54
3839E4n3L2j57J8J25J5k2L1r7m3K46o8lj15k6Jq6J18K60k52k1J55o6M4r1J4p8
$$ 54 1 33 -124 -106 19 34 12 43 -54 -97 149 81 78 -37 -63 -62 -148 -30 230 -22 -43 112 46 90 -1 13 -65
3866f5j0p6J1K19j59J56q2J03j67J57k41J62J08k47Q9Lj28L3R3n3J62l9P0j03
$$ -65 -75 -151 -140 79 -80 76 -6 97 -70 87 -154 8 116 -131 -42 -39 -167 -134 -41 -94 68 29 99 -4
3890dj15P4J11L1j3j12J61m14L48k32J04m0N4R3m0j10J17J7mnk1M2J02j17j9o9
$$ -4 -119 -45 66 97 84 -28 133 -281 67 -165 -61 -101 -47 46 6 -104 13 30 26 21 0 42 144 27 8 -61
3916f1qJ07R5j05j00J16kj68J60k31K26K6J21o2j26k7N3R9l8mj45J84j81P0RJ27
$$ -61 -69 38 133 28 -72 44 42 -126 34 -197 29 55 176 114 -12 -39 14 113 75 71 -74 110 -71 -1 8 135
3942A35k40J49O8r7rq5r0K39l2R6J10l75J39j4k72L49N7j54P2K4r8J19q3rJ86
$$ 135 -105 44 112 15 6 -79 -169 70 38 134 244 -131 8 -6 -278 71 128 -26 46 70 -28 91 8 -1 185
3967A85j78j7J00k62J63l5PJ19p8j14J95j0r0J11k95K33n5Nj84K36r6J99k62P1
$$ 185 7 -10 90 -172 -9 -44 -37 82 4 -110 85 75 -15 96 -199 34 -21 -16 -200 36 -60 139 -123 -52
3991e2n3L8K11j25j79J34L9LQ1j3j74L05l10J17N4k05K63j93j04R9Q5k7J38k64
$$ -52 -105 -67 144 19 -160 -26 13 16 97 84 -90 215 -95 22 76 -129 134 -59 -163 -64 21 -6 132 -132
4015a32J31Rp1J13M3l01L35j90j16J34J45j62J44Mj0Q5o6j11kj89J01n0J21N4
$$ -132 -1 8 -63 50 93 -208 127 -63 -179 -45 100 -62 82 86 76 161 95 -16 -18 -207 -106 -156 -35 19
4039A9N2q7j42K62j16o0J05O6q6J1j20J71j22K1J39k02J37k6k3N5q3j8P6j99K35
$$ 19 71 -16 -158 104 -12 -72 33 99 13 24 -96 75 -47 -26 113 -89 48 22 -1 54 -29 -47 29 -170 65
4064F5p1j59J63M5Q8rj43j01J7J76j61K46k50k9K1N6R9j30o5J99l4L0k61R8Q8
$$ 65 -6 -165 -2 43 131 122 -21 -122 -105 71 -90 156 -94 -123 -102 -46 53 -77 -142 57 23 53 -208 -110 -22
4089b2l8P8Q6n4k04K56j9n5J19k61OJ19n1K6j53QR8O2j9ln2J09k4p5K2M5k19J84
$$ -22 -60 18 104 50 -154 102 83 28 147 -114 -108 11 -40 -14 -167 -159 -61 1 -18 -21 -73 36 12 -63 -41 4 -215 -31
4117c1o9r1J73j0m8J40o4k4j07j2J10L07k63P4L7j86J06L9j67J3K60m5j89Q0k0
$$ -31 -100 -191 -18 -28 -76 64 0 -24 -131 -143 -33 274 11 85 122 -64 42 81 -86 -73 187 142 -47 33 13
4142A3O3MR9j90p8P1l5j83K25M6j11m9M0n8J54j20J17Lj6KL5k3r6J16q5m4l0R
$$ 13 76 80 179 -11 -89 -18 -53 -236 -11 35 -76 -125 -85 -143 11 -109 8 11 -5 -3 32 9 -87 29 -56 -100 -130 -121
4170a21J13m7J62o6j21K60j61M5j36pR5m3k5k6J01p4M0M2o1r2M2J17J61j06j11
$$ -121 -8 -55 107 41 -80 180 19 64 -72 -79 16 -27 -52 -78 23 -51 -11 31 -30 -122 -80 37 198 92 -19
4195a9J55L8p0M5k69J75L5j40P5J56k02K47k99L2lO1m4J0J45O8j56j01J69q5m4
$$ -19 136 174 104 149 -120 55 90 -50 25 181 -21 226 -73 -41 -44 17 -27 -17 128 196 40 -61 108 23 -21
4220b1k2J6J41n6j68J56M9k16J18K8PM5q4Q8j1P8j69L8M8q4q0K1M6q0N1N7K8o3
$$ -21 -43 -27 114 58 -110 46 95 -121 -3 25 32 77 -7 81 70 148 -21 17 65 -19 -99 -78 -32 -112 -61 -4 24 -39
4248c9J86j96k0J85l8J1o3j52J44L1n2L4rQ4o9r2K30j73J46M5k91R2J39k8j37
$$ -39 147 -49 -69 116 78 89 26 -126 18 49 -3 31 22 106 37 -55 175 2 148 193 -98 -6 133 105 -32
4273c2N6m4j1R8n1q4J97j74m1O8J1L4j25K55J7k60K15k58O0kM0j4j7J23j03J79
$$ -32 24 -20 -31 67 16 -68 129 -45 -86 -18 -7 27 -98 157 174 -86 129 -129 -69 -71 -31 -45 -62 61 -42 137
4299A37k49O2J63j65o9J72j1q7J94j75j53K39P6q0q1n2J64m1n2J00j14o2J96j72
$$ 137 -112 -50 113 -52 -121 51 40 -47 147 -28 -181 58 134 54 -27 -79 85 44 -8 92 -22 -84 112 -60
4323f0OP3r0P5K6p6J66j27j25J45j27J25r1L4K22j39j44J33N0p8j7R4j23n1J2
$$ -60 -54 19 -71 4 30 -46 120 -7 -132 13 -114 11 -80 -46 176 37 -107 26 76 -2 -19 75 -48 -99 -87
4348h7K82j46k36J77k0j71M7J40P6L9m0k11J47O3mJ3l7j5j2J77k46J59p9R1j43
$$ -87 195 49 -187 -10 -30 -201 -154 -14 62 101 61 -150 -3 60 56 69 32 17 5 182 -64 95 16 107 -36
4373c6J25Jk12J85Pj07m7Q9j11J39j73K5J34j25P1J70j38J25j6j72J49m7N4nj6
$$ -36 89 90 -122 63 70 -37 -84 5 -106 33 -140 -115 19 -106 -35 135 -3 122 106 -66 83 36 90 85 69
4398F9J4m3Nj7j11J16n7K1p9R1K1P2j58n2P3R9J44k14k11J19J78p2j42J41j78
$$ 69 83 40 45 28 -83 33 -24 -3 -82 9 30 102 -56 -108 -35 64 208 -6 -217 -98 80 8 -134 7 -171
4423a71J02J65q0O9j67Q9j8J26j89J77l3J1k11K49p5m9l3n7J38m9J34m2O3k37
$$ -171 -69 96 16 85 -82 7 -11 115 -74 103 70 81 -130 119 44 -5 -38 -95 43 -6 128 86 149 -88
4447h8J47q6m4L5J9J52j02o6P2k8L1P9j58j14J73j71L48j97rJ11q8J15j13oj1
$$ -88 59 -27 -71 -36 -17 135 33 -33 39 11 42 121 -37 -151 22 -149 199 2 -7 104 16 131 18 12 1
4472An4J5K82r0q8j32L9j16K45l5J2j15J50k61Q8J56nj75p1J32k34p0K95J13n5
$$ 1 -53 -38 244 154 66 -66 -27 -143 102 67 79 -36 114 -147 -59 97 92 -83 -154 -22 -256 -326 -31 82 27
4497B7rj01K65k22Lj5Q7q5J26jp3l4j34K15Q4j87J13q9Q1j83J57L6P8k08nK41
$$ 27 18 -83 182 -40 -37 -52 35 -50 76 75 2 -32 -166 49 133 -54 59 -30 51 -132 25 61 139 -69 -74 167
4523A67j95J05k82L02j43J02j76K71j36j5O2J3j51m3K42k33Q4N2k89L39k89L86
$$ 167 -28 77 -205 97 -46 56 -120 151 15 0 62 75 -76 -119 123 -110 -26 26 -263 76 -213 173
4545A73l19K83k44K40k40J55l3p3J51o6j5l1j64J65L3m4J16j4j49R6j05p5J15
$$ 173 -146 137 -107 133 -107 48 15 -58 93 27 12 -19 -183 -18 15 -29 87 73 -76 20 -85 -160 -45
4568d5J8l2J32k40K27j31o5K61k61J97j14Q3j65J86q7M7j30J20m3M5j35J11J99
$$ -45 -27 -59 73 -167 60 -71 -136 125 -136 61 -53 30 -135 51 -36 11 -119 1 -42 3 -132 -21 178
4591A78o3q7k6J55k66M7M9M0k8M8k49L16qo8L8j04q2J64N2k11J6J61m7m1l2J22
$$ 178 115 28 2 157 -109 -62 -13 27 -1 47 -202 114 106 38 76 -28 -110 54 106 -105 -89 72 25 -16 -48 74
4617G4j45J02L5j31J82j23j3J5n4l5j9P4p8j03J96j01J27q7P6k7j9kK16l04rK99
$$ 74 -71 31 66 -65 117 -6 -19 -4 -58 -93 -112 -38 -116 -219 -23 -124 3 -84 -8 -35 -54 -56 160 -144 -153 146
4643A46j98K5Qj22R3mkK4r7j6o1L60j41p4j41K13p3Q5J05j63k1J32j15MN1j36
$$ 146 -52 -27 -19 -141 -48 -52 -54 -30 -127 -143 -204 156 15 -59 -200 13 -60 25 130 -33 -54 78 -37 -33 18 -118
4669a18J35n8J09N1J9k18J34mr4J08p2k44K65r9K24j0j53j58K17r9J08J5k1Km7
$$ -118 17 -41 68 119 138 -80 54 50 -44 64 -8 -252 13 -86 138 128 -25 -183 34 -65 43 58 37 39 -8
4694hk3M3l8NJ68k38Q6pJ21k7N6j47J2n1J16j03m5O2M4o2J01l5M6o4o2K1m1J5
$$ -8 -31 12 -26 -21 147 -91 -5 -12 109 82 138 -9 3 -48 68 -35 -80 -18 26 -36 65 30 76 12 -50 -29 -70 -55
4722e5J52j11j07L01j83kn6P6l9q1J60k23P5N5j71K39R0k2j5q9M7Q6k13P9M9J22
$$ -55 97 -14 -121 180 -3 -5 -61 15 -24 -105 55 -168 -93 -38 -209 30 120 98 83 -6 41 127 -86 -7 42 164
4748A64n2o9j28L4P8o0m9j05K66j63J15m2j62JJ87O9K5J15l49O4R2k3kJ3p0M0
$$ 164 112 43 -85 -51 27 -33 -82 -187 79 -84 31 -11 -173 -172 15 84 109 224 -125 -61 31 8 6 19 -51 -11
4774a1J03l1N9p7n5j5M3n2J37q3p2K51k36K19m12N9K00k9n3R7M9k8o6p4Q3j82
$$ -11 92 61 120 43 -12 -27 16 -36 101 18 -54 197 -39 180 -232 -173 27 -2 -55 42 91 63 -3 -77 6 -176
4800a76J22n5L3K3N7j24P5J5n6N8J07n6L2O1j74N7j6J71j67K7j66J38L4j09P0
$$ -176 -54 -109 -76 -53 4 -120 -45 -30 -86 -28 79 23 55 116 -58 -1 -17 154 -13 14 -152 -14 20 -89 -19
4825a9q8J56j36J94J2r6l6r6K8j5J89k07K97j79R7q3o7M2o8P4J14m2q5j60J66
$$ -19 -107 49 -87 107 119 23 -13 -109 -81 -96 93 -114 183 4 101 18 -49 -7 -75 -1 113 71 -14 -174 -8
4850hn6J44m5q7M2q3J81r5J1l0lJ39k04qJ30l9n3N7m5R6j27R8o4mJ66j40P5J20
$$ -8 -64 80 35 -52 -10 -93 88 -7 4 -26 -29 110 -94 -102 28 -11 -64 -7 -52 44 -83 15 -49 -53 113 -27 48 168
4878A68l09K01l9JN7j31L7N4J72j01L3j04j49K2m2K9K32k38R6j6M0l9l5n6K08
$$ 168 -141 60 21 22 79 -52 -15 39 211 110 143 39 -110 -88 -130 -101 131 -107 -11 -27 13 -26 -61 -117 91
4903I1r3j18M0L19m3k20M6P9l34K20J84l47J43m8O3J03K3j03N9m1oN1l1m1q9O5
$$ 91 -2 -120 -80 239 196 -24 22 101 -233 -13 171 -176 -33 -81 -18 85 108 5 64 23 17 68 37 -4 -93 -28
4929b8N0n9J2o5n8O5J05j00M9k3j47K12j21J0J56K1Kk06R5J5L4qK3m1L7j23Q7
$$ -28 22 -37 -25 -90 -148 -83 22 -78 -29 -52 -199 13 -108 -98 58 79 81 -125 -30 -15 19 11 34 -7 30 -93 -6
4956fJ8mN4j0n1p3J4M7N1n1J59j30j97J39j9l9M5L3k3J24k2j44K18l56R3R9M8
$$ -6 12 8 62 52 1 -72 -58 -11 40 -11 148 18 -179 -40 -59 -98 -53 -20 -43 81 59 -85 133 -223 -130 -31 17
4983A7J87k24M7p4J80j30J6R7m7k44q6K01r1M5J8j32J49J83r9M0j79R6l6R5j44
$$ 17 204 -20 27 -47 133 3 19 116 69 -175 -261 -60 -151 -106 -88 -220 -71 112 13 53 -126 -30 -66 29 -115
5008a15OP9jk5RL7j1j20K22J2j20P5n0j96J89L3j34R1j95K92r2J72k02O7j39J4
$$ -115 -109 -30 -31 -56 -47 -10 -21 -141 81 93 -27 48 -2 -198 -9 24 -110 -19 -214 78 -14 158 -44 23 -116 -102
5034a02J42k04K43jK0j09J36k19M3M4M5n2J05P3k60M4L4J6K8N2k51K05J12j00
$$ -102 40 -164 79 78 98 -11 125 -94 -51 -7 38 -14 91 164 -96 -52 -18 -2 26 78 -173 32 144 44
5058D4J08k20j31K46R9k14K12j96J10O7j55n9J93l1R9j06k51K96j62j9K15n0j86
$$ 44 152 -68 -199 47 146 -68 144 -52 58 125 -30 -89 104 73 172 66 -185 111 -51 -70 145 95 -91
5081i1l0J45J37o1k9J44k27oJ61k88J14K1K2n5J95j82K7M1o8J75k35P4M2n8J12
$$ -91 -121 24 161 100 71 215 -12 -18 143 -145 -31 -10 12 -43 152 -30 -3 38 -30 145 -90 -16 26 -32 80
5106H0P4q2l3j83J05o9J52j19J03N9j60O1J32k51K98k39J32j47J09K3q9J47K8
$$ 80 154 72 39 -144 -39 -108 44 -75 28 87 -73 -12 120 -131 167 -72 60 -87 22 45 -44 103 131
5129A31k01q9K73j70o1K53l00K44j48J4J81k09O0J04r2K0LL9k01K84q6j8j06J23
$$ 131 -70 -159 114 -56 -117 136 -164 80 -68 -54 127 -82 -22 82 -10 10 13 52 -149 135 49 31 -75 48
5153D8j2o6P9O0L4l08K18qO7k09PN2p5J52n4L9j84J16J07j09J05NL0k1o9j76K69
$$ 48 36 -30 49 109 143 -165 53 45 112 -97 -90 -38 -113 39 -15 24 -160 -44 63 -46 59 64 94 73 4 -172 97
5180I7j01Oj25O1J28j80J84l7j63J17j05N7J8M5r0R0J08o2j01l7K58j54k0J04
$$ 97 -4 2 -123 -62 66 -114 70 33 -130 -13 -118 -61 -43 2 -88 2 110 48 -53 -90 168 14 -6 98
5204I8p2j0P9L7K2j44O1l3J42j30j42J00jn6R6j5r8k8N4J74j55j44J83N5j11P9
$$ 98 26 16 95 132 154 10 71 38 180 50 -92 8 7 -49 47 32 -66 -94 -40 134 -21 -165 18 73 -38 41
5230D1j91L2L78l01oN4j37R3n6P5j22m2N4K08k66J79kj22J75p5j8L2j5L1M4J1
$$ 41 -150 -118 260 -41 -47 7 -130 -37 -93 -18 -140 -182 -128 80 -186 -7 -9 -131 44 -31 -49 -17 -32 -1 43 54
5256E4J0j11O4j42rJ50m8J37j4j25O7j02j35nJ88K2K9r1%l1J1J77j9J3Qj6o6k5
$$ 54 64 -47 17 -125 -134 16 -32 105 91 -34 33 -69 -204 -209 -21 1 30 -61 -61 -92 -81 96 77 90 98 82 16 -9
5284iN2J0j04L7P9l8j75K87k43pk2O7J16j63K25j26J2J85j48J8k04K16KK3k27
$$ -9 43 53 -51 -14 65 27 -148 139 -104 -111 -133 -66 50 -113 112 -14 -2 183 35 53 -151 65 67 90 -137
5309a37J69pj07o7K10o5p4J02J1o6K2o0j28J65k6J37m2QQj52J94j2j42L11l82
$$ -137 32 25 -82 -149 61 -4 -78 24 35 -31 -9 -69 -197 -32 -58 79 37 45 53 -99 95 83 -59 252 -130
5334a30P3K3QK14k17r0J47j65J42O8j06R7Jj37J77j70J82j77K47q6j13K26j13
$$ -130 -57 -34 -26 188 -29 -119 28 -137 5 73 -33 64 65 -72 105 -65 117 -60 187 101 -12 214 101
5357A01lL3j70K17k28m0K18o5r9l1J62L5j46J66j26P7k11J42J36j00O9j67j14
$$ 101 98 131 -39 178 -50 -90 128 63 -36 -67 95 130 -16 150 24 101 -110 32 168 68 137 -30 -144
5380a44J77r9l8N5k9J54j62N0P3l3K8L5k63R1J66j66J13j3q6O9n8q4J85N3j59
$$ -144 33 -66 -104 -49 -78 76 -86 -36 37 4 32 67 -196 -105 61 -105 8 -5 -91 -22 -80 -164 21 74 -85
5405h5K8l3K39j48N3L1k0o9P8J08n7Mj52j9K10j08j38K19j16J15j75J59r4r3K89
$$ -85 -57 -90 149 1 54 85 65 -4 74 182 125 129 -23 -42 168 60 -78 141 25 140 -35 124 30 -63 226
5430B26j13j45j80L10j00K3M7O6j56L9q5J33k45K77l1J22k20J10o9n4J91k13q4
$$ 226 113 -32 -212 98 -2 21 68 134 -22 17 -68 65 -180 97 66 188 -32 78 9 -45 146 -67 -151
5453a51k3J77M0j55nK56q2k8J2j14R8O3l6N7j78R2M2j08R0m2m2J55p1j10J01L6
$$ -151 -174 3 43 -112 -117 139 57 29 41 -73 25 88 52 109 -69 23 65 -43 47 5 -37 118 47 -63 38 74
5479G4j28J25j40M5m1k6J47M8Ko8rJ08k0k80K6K29j11j26K2R4J9k1J36r6J1KR2
$$ 74 -54 71 -69 -24 -65 -91 56 104 106 38 29 137 117 -163 -137 92 -19 -145 -123 -29 -10 -31 105 9 20 22 114
5506A14j6j19L2k0l3J14M8rn3m9r5J4n9K08k11J38R9o2j70J84j19N2k9L5k2N2
$$ 114 98 -21 11 -9 -42 72 120 111 58 9 -86 -72 -131 77 -134 4 103 41 -129 55 -64 -12 -41 -6 -28 24
5532B4j00P6R1q3j00o1K0J61k7O7O5j50j44J94J9j31J27m5o7N8j57J72k09L44
$$ 24 -76 0 91 8 -92 -153 -133 28 1 68 133 -17 -161 33 52 -79 48 3 -64 -6 -163 9 -200 144
5556A44J0k02j7J36N1j73J15p3O8k9M3j64O0q0J01L2Lm6J86j59M6j77M9J69k47
$$ 144 154 -48 -65 71 122 -51 64 -9 59 30 73 -91 -31 -111 -10 22 25 -21 165 6 52 -125 -76 93 -154
5581a54K33q9N2K3Pp7j17%J46L8j7j30L1J78j77nJ18l5j6N4j49OnR1J7J9R0j61
$$ -154 79 -10 42 65 72 -5 -122 -122 24 62 45 -85 -54 124 -53 -58 60 25 9 63 -86 -80 -85 6 23 42 132 -29
5609b9k1J19q8QP3R1l7j64jJ55j95m8J64l3J7n8J2Q9J07k74K6J42N4k26P9K97
$$ -29 -50 69 -19 -11 62 153 116 -48 -49 106 -89 -137 27 -6 11 -47 -35 54 161 -113 -87 55 109 -117 -38 259
5635B59j54k71J54K0j83O6n8O0O2J17n4j01K14j48M9M5lk45J00J19j51K37j03
$$ 259 105 -166 -12 8 -175 -109 -167 -107 -45 72 18 -83 131 -17 32 77 74 -171 -71 48 -103 134 31
5658C1J25J0j90l3j9J18j05J2r0P4M2N8q6o2J69P3j5j90QJ27J43j22q4q4M6J12
$$ 31 156 166 -24 -57 -76 42 -63 -51 -141 -67 -25 33 -53 -115 54 127 112 -78 -70 57 200 78 -6 -90 -44 68
5684F8L3l8m3P3j84K54Qj95j7N6m0J40p4j79J84k1r7P3j2j33J36J24j9l4L5qP8
$$ 68 101 63 20 93 -91 163 171 -24 -41 15 -25 115 41 -138 46 25 -72 1 -11 -144 -8 116 97 63 98 90 168
5711A68k42J48k1j32J39j41R6J24k84J91J08m18L41j24L2j9O3n5M7n4K1O6Q9k88
$$ 168 -74 74 53 -79 60 -81 15 139 -145 46 154 -264 77 -47 -15 -34 29 -26 21 -33 -12 54 143 -145
5735a45K60j59j47K13K9J6q1J32MM6k77L96j03Qj14r7o7m7nK37k02K18j00p6J17
$$ -145 115 -44 -191 22 51 67 -14 118 122 168 -109 287 184 192 78 -19 -86 -133 -138 99 -103 115 15 -61 56
5760E6J14o5j55J44rq4j29K70j21o3j48K39n8L8q6r3P3J15o1k2N4O3M6p8q8K39
$$ 56 170 105 -50 94 85 1 -128 142 21 -42 -190 49 -9 29 -57 -150 -77 38 -23 -45 9 72 118 40 -48 191
5786A91k93O1K1l13M10l6j32J81q8q4J04j76R4J36R2j37m4J6j63J46J7J28j86
$$ 191 -102 -41 -20 -333 77 41 -91 90 2 -82 22 -154 -60 76 168 31 -13 3 -160 -14 3 131 -55
5809e5J26O3j53p7M1J67k09K33k06R3J62j45J10Jj54q9J51j49R7OL5Q0p5o2j75
$$ -55 71 134 -19 -96 -55 112 -97 136 -70 23 185 40 150 151 -3 -92 59 -90 7 13 48 128 53 -9 -184
5834a84K66k31J28J70k7j66J5Q4R9j29jO9L9j27R1q0O4q3J88j53k2J06p6j47l
$$ -184 82 -149 -21 149 122 -44 -29 55 154 25 24 93 132 5 96 16 80 -3 185 32 10 116 40 -107 -110
5859a10P3J89j16k35K44j01J37q5J10k5q8P5q6q3J45N6j15o3j2K2kL37l36L6l2
$$ -110 -37 152 36 -199 45 -56 81 -4 106 81 -7 68 -18 -101 44 100 -15 -78 -90 -68 -70 267 -69 -33 -65
5884f5J29q2L6p9J40PK3jr8r7Q4q5o0J63j14J69r5j33K39j09k5J8N9J4R6k27r1
$$ -65 64 -18 18 -61 79 86 109 108 10 -87 -3 -88 -148 15 -99 70 -25 -158 81 -28 -53 -35 24 38 134 -93 -184
5911a84J97n4O6l2l8J20j07N2o0PQ4k71K26O5j60p1J96l7j32K06o0Q9M9j98p0
$$ -184 13 -41 25 -7 -45 75 -32 20 -40 -33 51 -220 6 71 -89 -160 36 -1 -133 73 13 102 151 -47 -117
5936a17J36k28K54J6p6j83J33N4n6J76r5k0J23n6n4Q2o8O5q1o3Q1o5J76j33J3
$$ -117 19 -209 45 61 -15 -198 -65 -11 -67 109 14 -6 117 61 7 89 21 86 5 -58 23 -42 134 1 14
5961A4Km2n2J1R0k7OJ30j26m6O9K6j84J92j74N7J44M2j93K00j13j05j46J32J17
$$ 14 16 -26 -78 -67 23 -4 2 132 6 -40 29 55 -129 63 -111 -54 90 132 -61 139 26 -79 -225 -93 24
5986B4j16J18j28L39l15J54j55P2j03N3J22R3J24k07n0k0Qn6k9J59j0jK9j00M4
$$ 24 -92 26 -102 237 -78 76 -79 -7 -110 -57 65 158 282 75 25 5 13 -43 -72 87 77 76 105 5 49
6011D9J4r7j29J79k27Q3K11J8n2n0R3j64J00j19L8J09m3p0J09k28K37Pj71K40
$$ 49 63 -34 -163 16 -211 -128 83 101 49 -1 92 -72 28 -91 -53 56 13 -57 52 -176 61 68 -103 137
6035A37o4P3k25O1J14j84J38j29J65r4L1k7m1J9l3N9L6N8n2K9k13K31K4o8m4j03
$$ 137 73 146 -79 -18 96 -88 50 -79 86 -8 23 -4 -45 -26 -59 0 36 94 42 71 -142 89 113 45 1 -102
6061a02k1J19K6P6lj70R6n4l8O8J34j67K96k63lN6j73K11l3J15l38N7Q5N4J08
$$ -102 -123 -4 22 98 95 -75 21 -33 -71 -3 131 -36 260 -3 -6 50 -123 88 55 170 -168 -111 -26 28 136
6086A36k68J10j33J32p1N3PNP8j3Q1j82J39j26R1r1N1j59J92N3o7k9J88l94L12
$$ 136 -132 -22 -155 -23 -94 -41 -34 -29 49 36 117 -65 74 -52 39 -52 -1 -160 32 85 18 -11 177 -217 95
6111I5Kr1J51j67J2R8k58K73Q2j22j60QJ8j4M0r5qJ59J8l1J11j14J20j68P4l9
$$ 95 97 6 157 -10 2 100 -158 115 197 75 -85 -77 -59 -73 -33 -128 -136 23 41 10 121 7 127 -41 33 -6
6137fJ09j20k0J11k74J50N1M5k5j54Q6j20J89j65m1K58k29L9J00J41k15N7K63
$$ -6 103 -17 -37 74 -200 -50 1 46 21 -133 -47 -167 22 -143 -184 74 -155 -116 -16 125 -90 -33 230
6160B30l09L01p5l62J51J1j46J37m6J00k0LJ3q1J17n7Lo2L3J42M2j07N4j58J32
$$ 230 -79 222 147 -215 -64 -53 -199 -62 -108 -8 -28 -25 -12 -93 24 -33 -30 -92 -59 83 125 18 72 -86 46
6185D6j7NKL6k01J01j3J08j75K48j55K3j2k8j19Q5p4L06k13N3j69J55k9K00l29
$$ 46 29 34 36 72 -129 -28 -41 67 -108 140 -15 8 -4 -32 -151 -66 -140 166 -47 6 -163 -8 -37 163 -166
6210a66L14j47j6j42N5J28k1m0P3m3p8J00k3k3N9r0K88j81j31M21k99q7N9j26
$$ -166 148 1 -15 -157 -102 26 5 -35 38 -5 -83 17 -6 -29 30 -60 228 47 -84 337 38 -49 10 -116
6234a16NK21k41J56k00J27O4J16j00k15K36j92J05k8L0O6K8Mj7j48Q8P6R2k74
$$ -116 -111 110 -131 25 -175 -48 16 132 32 -183 53 -139 -34 -62 -32 34 62 66 49 -99 -11 65 157 -117
6258a17J01j18K37K8j67J85j98q1K42p1l0l8j15j5K68j16O5lk05R8j24J35j8l
$$ -117 -16 -134 103 131 -36 149 -49 -130 112 41 11 -27 -142 -157 111 -5 60 57 -148 -50 -174 -39 -57 -60
6282f0O0R5j80R6J48j04Nj17LM6r6Q3j39kR1j4J46j21J29j82J92j08l01M12k1
$$ -60 0 95 -85 11 159 55 60 -57 -54 -8 -104 -21 -160 -162 -71 -85 61 -60 69 -113 79 -29 -330 82 61
6307F1Q6q7r8J36j54r1J78rq4N6j4M2k4M9j4O7L6j32K4l7j7j9k8J70k2j00L7M1
$$ 61 147 60 -38 98 -56 -147 31 22 -62 -6 -20 22 -2 47 33 100 136 4 28 -9 -26 -45 -73 97 75 -25 12 53
6335E3Q0j92Q5J29k48J12K0k15L40o3q8j29J14O7j17j00Q6j4J23l0K21k15k2l2
$$ 53 133 -59 26 155 -93 19 39 -176 164 101 13 -116 -2 65 -52 -152 -66 -80 43 13 234 19 -3 -35
6359c5j0P5j14j5J75l8j05P8k1Q7j51J19k3R3Oj81J04j21J45k45K27J6m4j10J69
$$ -35 -45 30 -84 -99 76 38 -67 11 -10 77 -74 45 22 115 121 -60 44 -77 68 -177 50 66 22 -88 81
6384H1Oq6J50j76J37Q7l37K49kj62q0J82M7k21J46m2o6J3K27j36J3j53J14P3m0
$$ 81 87 1 151 -25 112 199 -138 111 109 -53 -133 49 96 -125 21 -21 -87 -74 153 17 30 -123 -9 64 24
6409B4j7r7J33j80R3P9k12K40k08M6P2j99K86j22J30N6m9k22P6K0P5n7R7J73k11
$$ 24 7 -90 43 -137 -44 35 -177 63 -145 -99 -27 -226 60 -62 68 124 75 -147 -71 -51 24 -33 64 237 26
6434B6M9n0n7M2J13j77K8K7K6n3n3J35J07j85j55J7J96m3p6J60j52J22Q5k03k0
$$ 26 75 25 -32 10 123 -54 -26 1 27 -26 -79 56 163 -22 -177 -160 36 -7 -83 77 -75 47 132 -71 -91
6459i1r8J10J7j11K59O2k46Q2j1r2o2K09j7m7j2K3K1j16J28M5j07O9o3J34n4J23
$$ -91 -189 -79 -62 -173 86 148 -98 -16 -27 -119 -181 28 11 -36 -48 -25 -4 -120 8 53 -54 15 -48 86 32 155
6485A55j31k3n9J14j06L14l83J51j74J33Mr9L8j61L20j2j79J20j00J37J01k61
$$ 155 24 1 -58 56 -50 264 -119 32 -142 -9 -5 -104 -66 -227 93 81 -98 22 -78 59 160 -101
6507a01m9J80K1k17K7J47K3J16J3k39n8J09J71r1j31K2K1Q5j13J65j80N0P3L4
$$ -101 -150 30 51 -166 -139 8 31 147 160 -79 -137 -28 143 52 -79 -57 -36 49 -64 101 -79 -29 44 78
6531G8p4m3J07o0n4J44j63M8j48J28J34j76O5j31J76J30k87J25n4N8k5k07K37
$$ 78 4 -39 68 8 -46 98 -65 -17 -165 -37 97 -79 -14 -145 31 161 -126 -1 -55 3 -22 -229 8
6554Ho3J11j52J83k92K60j53P0Q8o7O0o8p0L9L2n2O0n3k1O3j8P3j09K7R2Qj41
$$ 8 -55 56 -96 87 -205 55 -98 -28 60 -7 53 -15 -85 -46 -14 -66 -6 -59 -80 -17 -35 38 -71 -44 48 56 -85
6581h5J43J11k51Q0O6Ok10J29O7j07qJ74j46m9l3J50q2O0P3j18J45o9N2j20Q0
$$ -85 58 169 -82 -2 64 70 -140 -11 56 -51 -59 115 -31 -80 -113 37 -45 15 88 -30 115 46 98 -22 58
6606E8r1q4K51k61K23q3Q7M0j85J63k47j6J58mj6J04KJ8k05O6R9n4J24r2j61K57
$$ 58 -33 -117 134 -127 96 13 100 140 -45 118 -129 -145 13 9 -7 97 99 117 -88 -22 77 23 147 55 -106 151
6632A51j37qm0M2l6J02j31j3J26r4J21j55o3J93J35l45J05l2L4R9j15r3J08J60
$$ 151 14 6 -34 8 -28 74 -57 -70 56 -38 83 -72 -135 58 193 -152 -47 -79 -45 54 -61 -154 -46 114
6656A14j32L7k7J99j84P6j99Rp3M12l20Q4J83n9o3M9j81M1J24m3q3K7l7J08j61
$$ 114 -18 19 -8 191 7 83 -116 -107 -180 232 -88 -4 179 120 57 106 -75 -34 90 47 -36 -9 -46 62 -99
6681i9J3J17j40R4m2J05l8l5j7K29k63o1K23m0j54J77k6j33J32R4j35j33K16j45
$$ -99 -86 31 -109 -15 -57 48 10 -25 -42 187 -76 -137 86 46 -108 69 43 -90 42 136 1 -132 84 -61
6705f1J05r0L8o6J5j41M8J45R6r4P3j93N9N8k13J28n6J57N2M3k0m9j54N3R7p7
$$ -61 44 -46 -8 -74 -59 -200 -152 -7 89 -5 68 -125 -66 -8 -221 -93 -149 8 60 103 83 34 -120 -67 30 -47
6731d7O1k70L87j53P5n0n0J77k37J80N8n1j10J04j03R7j11N7O8q1j00O9k5K3K3
$$ -47 14 -256 131 -22 53 3 -47 130 -107 73 131 80 -30 74 -29 68 -43 14 82 1 -99 -30 -55 -32 -9
6756im4J47j22Q9j42j0J73j22nJ38l7M8k35K34j74N6J82k05J09J67k75rK00q1
$$ -9 -53 94 -28 61 -81 -91 82 -40 -45 93 56 104 -131 103 -71 -15 167 -38 71 238 -37 -46 154 73
6780G3j03K9Q3Q0p5o1L4j30M8r4J22P1j9R7l56K13K2j09J01N6Jl0p3O8k66K98
$$ 73 -30 -1 82 162 87 26 60 -70 -22 -116 6 77 58 155 -201 12 34 -75 26 82 83 53 -20 48 -218 80
6806H0l7l18K55r1K55l22K22j04J36k1%m4J5J4n3Q1k7J00lj31k2K3n7j7J94%k17
$$ 80 43 -275 -20 -111 144 -178 44 -60 76 55 55 11 26 40 -13 68 41 141 138 7 -15 8 -49 -66 128 128 -89
6833h9NJ18p0q6N9J06L3j79J92k24N0J05J45O3j22j78R0M1r3J13n9Q8ln9j1m2
$$ -89 -84 34 -36 -122 -63 43 76 -103 89 -135 -85 20 165 228 106 -72 18 59 -34 79 20 108 105 46 35 -7
6859gn2K49j30j06m7J65k38L19k63J58j82J77j35J54J9k8J48j12Ok25J00j8N9
$$ -7 -59 190 60 -46 -93 72 -166 153 -110 48 -134 43 -92 62 81 53 201 89 95 -130 -30 -48 11
6882A1j20L3L0oqK46j80L0N5k81J35j10J64%k8K2k52K22N9j25J00j74J04J14O6
$$ 11 -109 -76 -46 -52 -60 186 6 36 91 -190 -55 -165 -1 -1 -29 -7 -259 -37 22 -103 -3 -177 -73 41 107
6907A07K3j49P9j44J31j09N7o4J71r9M9j18M2M3k5J37j76K8K44j89q7j5J72l5
$$ 107 130 -19 60 -84 47 -62 -5 -69 102 3 52 -66 -24 19 -6 131 -45 -17 227 38 -49 -64 108 73
6931G3Q4j76o8R5j19M0Q4J1j4L6J56j73j4j29O9J09j39Q9L3p8q1J79j30P9J27
$$ 73 157 -19 -87 8 -111 -71 13 24 10 46 202 29 15 -114 -45 64 -75 14 47 -31 -112 67 -63 16 143
6956A43j63Q3j31J69O1j27P2j06J9j30J78kON6l7p1Jk9J10q9R4j19K7j43RK03
$$ 143 -20 63 -68 101 162 35 107 1 20 -110 68 66 72 128 91 20 21 -8 102 13 107 -12 15 -128 -119 84
6982H4j28l1K13j89QK84j63j41R0%l1K4J19k70R5OJ06l9K9r4j3K0J13j41q2J18
$$ 84 -44 -75 138 -51 -43 241 78 -63 27 27 -4 20 139 -131 -36 -30 76 37 66 -28 -41 -21 92 -49 -131 -13
7008a3J4P4n2r7J08L6lKj68J05k8n4J60n4J0K9o7j8Q3P8j74N5K4k09J51r6K00
$$ -13 1 75 23 -74 34 70 67 69 -99 6 -22 -76 84 30 40 69 2 -16 67 145 -29 26 50 -159 -8 -104 96
7035I6j61m4K47j31R8r9n2Q6o7O5J15j35j22K81j93J53m6J59k42j49J33l7J22
$$ 96 -65 -109 138 7 105 6 -46 40 -27 38 153 18 -104 177 -16 137 91 250 8 -141 -8 -45 77
7058G7k43J40N1n4J36j11l3O3k2k9J96q2m1R3j79J18j06L2JL9r8Q9r9J10j36J32
$$ 77 -166 -26 25 -29 107 -4 -37 26 4 -25 171 89 48 141 -38 80 -26 6 7 46 -52 37 -62 48 -88 44
7084D4o0p7J94m7p3M1j03j55J38J21M3o1k6J07n5j19P9j43K51j18O3r1K8m4q1
$$ 44 -16 -93 101 54 -19 22 -81 -236 -98 23 66 5 -21 86 31 -88 -9 -152 99 -19 44 -47 -19 -63 -144
7109a44J25l6LR7L6j22K11q1k27O2p5k5K80J0m7p1J53n8k6j28J1J76o3j26m9J45
$$ -144 -19 -55 -52 45 81 -41 170 89 -138 -76 -151 -176 104 114 67 -4 149 91 65 -63 -52 124 61 -65 -114 31
7135C1J16k09kj7J58k04Q2M2J09j69K73j94M2L1j44j32K25k5j71J18k5J8M7j7
$$ 31 147 -62 -64 -81 77 -127 -45 -3 106 -63 210 16 58 89 -55 -187 38 13 -158 -40 -65 -47 0 -17
7159a7J18P0k99J22O3p3p7J6K70j06j00Mj7o2J40n2k60L44j97lR5k13K52j62K55
$$ -17 101 171 -128 -6 57 -16 -93 -77 193 87 -13 -9 -26 -88 52 0 -260 84 -113 -116 -21 -234 18 -144 111
7184A11j89J6O2kO0j93K1K54l2j99onK28j38J9K0J14j35J38k28l4J8o6K01m9J65
$$ 111 -78 -62 0 -2 58 -135 -114 140 108 -91 -97 -102 126 -12 7 27 141 6 144 -84 -118 -100 -166 35 -14 151
7210A51m7Ok12n3Q7J4P6Lq1O3K6J49j46j62J56L1n1l2j3Q2l6k9K9O6q0pk9J91
$$ 151 104 110 -102 -155 -68 -54 22 25 -56 7 33 182 36 -126 30 61 10 -22 -35 47 11 -18 11 77 -3 -10 -39 152
7238A52o2j43k3Q2P2l3q8J05l2k44J45J53j49k3O0j44J67k9p7M3J79k58J51K35
$$ 152 90 -53 -76 6 78 45 -43 62 30 -214 -69 84 -65 -88 -28 -172 -5 -34 -111 -68 111 -147 4 239
7262B39l62Q1N3o2L5OK0q4J88j15m8J13r7N6P8J7l0Nj30O9j86N0L05k13Q2N0n6
$$ 239 -123 -42 11 -51 -16 -10 10 -74 114 -1 -49 64 -33 23 101 118 88 93 -37 32 -154 -104 201 -12 70 120 64
7289F4Jj30k4o7J24J10j29k5P3J62l01J43Pm3J53j91J15o5R1NJ11j87J53j13j
$$ 64 65 -65 -89 -156 -32 78 -51 -76 -3 159 -142 1 8 -35 118 -73 42 -23 68 73 184 -3 150 37 36
7314C6k56J53R6r5O1j56L37k68K07k52J1J69j56J63j35P4Q5k03J14J08j02R0n1
$$ 36 -220 -67 29 -66 -5 -161 176 -92 115 -137 -126 43 -113 50 -85 -11 74 -129 -15 93 -9 81 30
7337C0k3j17J09Mo0j4J78k23O0M1P3j54Q7kP8j0J9l04K13l0J65j93m5J83rj08
$$ 30 7 -110 -1 3 -57 -71 107 -116 -56 -15 58 -96 -9 -11 67 57 76 -228 -15 -45 120 -73 -118 65 56 -52
7363e2O9J5j33J54p3j21R5L0jP1l8p3P8L5J0j31K31j23K3J55j38n0k2J01k71N7
$$ -52 17 32 -101 53 -20 -141 -46 -16 -17 54 16 -57 21 56 66 -65 166 43 66 221 83 33 11 112 -159 -102
7389a02J30J10K6j61j07K05j11J61r9p1J49j04l8k3O0j26J57J9j71J17K8j85K05
$$ -102 28 138 164 3 -104 101 -10 151 52 -19 130 26 -12 -35 25 -101 56 75 -96 21 49 -136 69
7412F9L7j43J66l6m8j23K1M4m8L0j7l2N5j21R5Q5L9j56N8J78l13J54J19j53o8
$$ 69 106 -37 129 93 45 -78 -57 -13 -61 -31 -48 -80 -25 -146 -51 34 73 -83 -25 153 -160 -6 113 -40 -108
7437a08J15q6j4L9K8P6k3LnK3o0J06n2nj29M4N0j48J34O7j31R8q6O0j00K00k3
$$ -108 7 -79 -93 -54 -26 50 27 30 25 48 -12 94 42 37 -92 -48 2 -146 -12 55 -76 22 -64 -4 -104 96 73
7464G3j83K19k35J71j30P8J9j35J57Q2k58q1K44J12k02J25l46K09J22J2j46K0
$$ 73 -110 109 -126 45 -85 -7 12 -123 34 116 -142 -223 21 133 -69 56 -290 -81 41 53 -93 -73
7486g3K48j53j15N1j39K96j34K0j61K34j26J5m9O8j07J40J10k1q7M5j10pK57P
$$ -73 175 22 -93 -42 -181 115 -19 1 -160 74 -52 -37 -86 -18 -125 15 125 104 17 62 -48 -55 202 209
7510B09l41L13j09J72j48J13j10L1p0l5K9o6J27kj28qk0q0K8J22k17J47p2K01
$$ 209 -132 181 72 244 96 209 99 130 60 25 54 -12 115 113 -15 -23 -43 -123 -95 27 -190 -43 -115 86
7534H6M7j50K6j97J71J42j03p9J00JM%Q1l04K92j64J24j27P1j04M1rJ08j45l5
$$ 86 133 -17 9 -188 -17 125 22 -57 43 44 48 48 129 -175 117 -47 77 -50 21 -83 -42 -51 57 -88 -123
7559a23J38J36j39K0j0M7Q4p6j08J05o6K6j62R0J65r4%L0j04olQ4R6j71J60j04
$$ -123 15 151 12 32 22 69 153 77 -31 74 8 34 -128 -38 127 33 33 63 -41 -47 -50 34 130 -41 119 15
7585A5J81k94J55lp2J59n3j25K04n0k97L96j92m3M6l8n4Q4j50J59OL7p3j61J30
$$ 15 196 -98 57 54 -18 141 88 -37 167 117 -180 216 24 -19 27 -11 -65 19 -131 28 34 71 -2 -163 -33
7610c3J23j27ON7j39K12j34j11M19k01j0m0j9J40j69M6R5n7l6M5j55L3l0jP1J72
$$ -33 90 -37 -31 26 -113 99 -35 -146 273 72 62 22 3 143 -26 20 115 58 22 67 -88 -55 -85 -86 -15 157
7636A57l7j33R4j46J05kl6r6j07K62p7J07j61l9K75j47n9k1J48M6j30j50O7J13
$$ 157 120 -13 81 -65 40 38 2 -94 -201 61 -16 91 -70 -109 166 19 -40 -61 87 133 3 -147 -80 33
7660C3k9L7j27R8r8J25L2j23q1K47j75O3j60J55M6m1j39%J73q1Q4k3j17J71l2
$$ 33 4 41 -86 12 -86 39 71 -52 -133 114 -61 2 -158 -3 43 2 -137 -137 36 -45 39 16 -101 70 38
7685C8J11k44J73j23M4o2M9M6j81K25m6q6Q6n9J08o7m6r2J23M6l5R5j43O9l3l0
$$ 38 149 -95 78 -45 -1 -63 -14 32 -149 76 30 -56 30 -29 79 12 -34 -126 -3 43 8 103 -40 29 -4 -34
7711c4NJ80k05J4J10k0J41k02p6K1O3R9k18J74K5n6L5j83N2O6L8n4r0J04N7J97
$$ -34 -29 151 -54 -40 70 50 191 -11 -87 -66 -3 96 -122 52 77 21 56 -127 -75 -9 29 -25 -115 -11 46 243
7737B43p9k25j1N5L3j09Q4Q0j23K81k50J5J22j34j3o1K42M6j41n1P4Q0j13q9K4
$$ 243 164 -61 -72 -17 16 -93 -9 71 -52 229 -21 -6 116 -18 -31 -92 150 196 55 4 78 158 45 -44 -20
7762b0J8O3N5r5O4j46J35n6k1K8n9L8o3J02n4N2J58k5k4j96k6J13n1r3J21j54
$$ -20 -2 61 116 21 85 -61 74 18 -3 25 -34 4 -59 43 -11 41 199 174 150 -46 -72 41 -10 -103 18 -136
7788a36J51j04Q4J7n1O5j66OK59l5J0j07K1m6j8P7j2j61K53k05O0j05J70m1J50
$$ -136 15 -89 -5 12 -39 26 -140 -134 125 90 100 -7 14 -32 -50 27 15 -146 107 -98 -38 -143 27 -14 136
7813A36k21jK66l13J41k6P6Po0K11j41j69K09n8k8j50J19r0J70j00J72k20K8N4
$$ 136 -85 -86 180 -133 8 -18 58 65 5 216 75 -94 115 57 29 -121 -2 -92 78 -22 150 -70 -42 12
7837A2k80J90j34J11M0L7nO5j43N3P2q3q4Q0J75k02J05j03K29j94J67J27r1j05
$$ 12 -268 -78 -212 -101 -61 -24 -29 36 -107 -54 18 -65 -149 -69 106 -96 9 -94 135 -59 108 235 144 39
7861C9jQ4j48J2J10j08k9m6N0rL1J79j02p9r9J90m1mk3k13J78K6MJ35j52J46J08
$$ 39 38 122 -26 -14 96 -12 -41 -87 -37 -46 -15 164 62 -17 -116 74 33 29 6 -207 -29 -3 1 136 -16 130 238
7888B38k20n7N1RQ9l24J38J64r5m1P3n0J80j76o2M0k2j6J57j57J24n1l0R1q2J4
$$ 238 18 -39 12 21 110 -214 -76 88 -7 -48 25 -25 155 -21 -83 -43 -65 -81 76 -81 43 -8 -38 53 -29 -15
7914a5j50L01j96r6J09R3P0j84J26l9q1J09o1P7j56r0J09Ln2J30K5j09RQ9qj9
$$ -15 -165 136 -60 -156 -47 46 116 -68 58 19 -62 47 -14 63 -93 -183 -74 -71 -123 7 32 -77 -68 21 13 -6
7940fJ47k96Q1J52q3K89j39p2j16p6J06Pm4J12K34l58K15o8k90K05Q1M3j04j13
$$ -6 141 -155 -74 78 -5 284 145 73 -43 -119 -13 -6 -50 62 296 -62 153 85 -205 0 81 124 20 -93
7964i3K67J9l98J41P9n7M5M4l3J84k96J28%P6j27M2Q1Mj36J14o1J6j35N9r5K01
$$ -93 174 193 -205 -64 15 -42 3 47 14 198 -98 30 30 106 -21 21 102 106 -30 84 23 39 -96 -37 -132 69
7990F9k9j82l9Q5J64k5n1R6j11Q8p3nK0m3rj55L18q5m4J2P0j23L0R5kn6N1l7p8
$$ 69 40 -142 -181 -96 68 43 -8 88 -23 65 -8 -13 7 -36 -45 -200 118 33 -11 1 71 -52 -22 73 71 15 66 29 -49
8019d9q0J98Q9j50R5K8j65k0j9K10o7k77J47J49k13J14J32k22l4J59j73L34j86
$$ -49 -129 69 158 8 103 131 -34 -54 -73 137 70 -207 -60 89 -124 -10 122 -100 -134 25 -148 186 0
8042@mJ3m8J10M6m5O0j87k08L33K2k39J9J83m5O5j13J2mnp8J06oJ78p1k62J48
$$ 0 -4 9 -39 71 117 72 132 -55 -263 70 92 -147 -128 55 10 75 -38 -26 -30 -35 -113 -7 -13 165 94 -168 -20
8069b0l7M4M3j02J23J8J1j1k1l2K7n0M8k8L5j17K51j31j11L3j56K49j37MM4J6
$$ -20 -57 -13 30 -72 51 69 80 69 48 16 43 -7 41 13 48 -69 182 51 -60 -27 -183 66 -71 -67 -23 -7
8095gl3Po1R1n4Q0P9Km2K8J6j35l1qK0J72j31J07j48L5j21m1K55p6J02j33P7q7
$$ -7 -40 -33 -94 -3 -57 23 102 104 62 90 106 -29 -60 -68 -48 124 -7 100 -48 -13 -134 -175 80 4 106 -27 50 -37
8123c7M1K7L2m1M9l1J7R1k14M6j23N6J1Q5k5j47O1J82j5j14j10J53J01j33N9J8
$$ -37 4 31 63 22 71 40 57 148 -66 -20 -143 -87 -76 9 -16 -163 -102 80 65 -49 -159 -6 95 -38 21 39
8149C9n0m5M9K28j50j7J54k55K68n7m8j51j02J22Q2r9j71K43o7O9R9j80J64j40
$$ 39 -11 -56 -7 221 71 54 208 -47 221 164 116 -35 -137 -15 67 -32 -203 40 -27 42 141 -39 125 -15
8173a5k3P2L8j38L9N0M6l5rj36J56l0l5n0N3K00j21j47
$$ -15 -38 34 72 -66 -27 23 69 34 25 -111 45 15 -20 -70 -17 183 62 -85
8191h5
$$ Imaginary data points
##PAGE= N=2
##DATA TABLE= (X++(I..I)), XYDATA
0@%%%%%%%%%%%%%qJ6j6J6k4L2l2M0m8N6p2Q2r0J04j26J50j68J92k23K54k87L25
$$ 0 0 0 0 0 0 0 0 0 0 0 0 0 0 -8 8 -8 8 -16 16 -16 24 -24 32 -40 42 -48 56 -70 80 -88 104 -119 135 -152 173
35A73l65M08m62N17n74O41p13P92q79R73j076J188j310J445j592J753j933K132
$$ 173 -192 216 -246 271 -303 338 -375 417 -462 511 -565 623 -687 758 -834 919 -1014 1118
53A118k351K594k869L181l536L948m429N000n695O560p668R149j1246J4460k0077
$$ 1118 -1233 1361 -1508 1673 -1863 2085 -2344 2656 -3039 3521 -4147 5002 -6244 8216 -11861
68a1861L2732j16272J9462J65932q8392p1657J2783Q0496M954p856K4392Q967
$$ -11861 20871 -95401 -75939 89993 1601 -70056 -57273 23223 28177 20321 44713 53680
80E3680l5272K3847K044n4368k6851N1043M3693m2982r2911M418N5068M589q130
$$ 53680 18408 42255 44299 -10069 -36920 14123 57816 14834 -78077 -73659 -18591 -14002 -22132
93b2132Q058n832N500J4491K0641R013o309K3813J8145n4003l5718K9164J7961
$$ -22132 -14074 -19906 -14406 85 20726 29739 23430 47243 65388 11385 -24333 4831 22792
106B2792j9609k6325k807O488k3051M469M3774o086k5991K4084K4922j3541k4826
$$ 22792 3183 -23142 -25949 -19461 -42512 -38043 5731 -355 -26346 -2262 22660 9119 -15707
119a5707J9365N4380p670n1377o29J4512q986k998o11n378j8946j8161K0091J2929
$$ -15707 3658 58038 50368 -1009 -1638 12874 3888 890 279 -5099 -24045 -42206 -22115 -9186
133i186j6899J6908K8673q075j5865J062K3764J7079j7230n989L357k3910p798
$$ -9186 -26085 -9177 19496 11421 -4444 -3382 20382 37461 20231 14242 17599 -6311 -14109
146a4109J4878o80o775p689l007Q20j2758J0474L4595l340j7443N287P649P618
$$ -14109 769 89 -6686 -14375 -17382 -16562 -29320 -18846 15749 12409 -5034 253 7902 15520
160A5520J583o82Q566j2385j9942M138l843q682R781K230p513j1636n555K4199
$$ 15520 17103 16421 24987 12602 -7340 -3202 -7045 -15727 -5946 -3716 -11229 -22865 -28420 -4221
174d221J7345q605L438L349n951M953K392P76R48j1021j241l317k0666M019J7593
$$ -4221 13124 4519 7957 11306 5355 10308 12700 13476 14424 3403 2162 -1155 -21821 -17802 -209
189b09j784p148q727J496J5456K504M411J0439q246j860P675n511k224J376j001
$$ -209 -1993 -9141 -17868 -16372 -916 1588 5999 16438 8192 6332 14007 8496 6272 7648 6647
204F647J598j6577j5228J1025N742o51K127o460J958P850J754J0122L118n115
$$ 6647 8245 -8332 -23560 -12535 -6793 -7444 -5317 -11777 -9819 -1969 -215 9907 13025 7910
218G910P985k366j2524J298K208K768k445j6328l398N137l101O911L570o587M514
$$ 7910 15895 13529 1005 2303 4511 7279 4834 -11494 -14892 -9755 -12856 -5945 -2375 -8962 -4448
233d448K913J387O345j228O013Q583j1162o748K503k183L823l144j0700n36m140
$$ -4448 -1535 -148 6197 4969 10982 19565 8403 1655 4158 1975 5798 2654 -8046 -8582 -12722
248a2722j381R261j769L04P666k076J406L118q03J0373J564r672P5l859l019N717
$$ -12722 -14103 -4842 -6611 -6307 1359 -717 689 3807 3004 13377 14941 5269 5344 1485 -1534 4183
264D183m012m273l82o679K331L066m256P748M477l937K923m51K067R025k483j799
$$ 4183 171 -4102 -4484 -11163 -8832 -5766 -10022 -2274 2203 -1734 1189 738 2805 11830 9347 7548
280G548J63q400O72K423n972J235j636m671L334k954oR237p2J10K537m237L910
$$ 7548 7711 -689 -17 2406 -3566 -2331 -3967 -8638 -5304 -8258 -8264 973 901 1011 3548 -689 3221
297C221M405k723L147k977o207L307l588l218M085l550q43J500n585L994N219
$$ 3221 7626 4903 8050 5073 -1134 2173 -1415 -4633 -548 -4098 -4941 -3441 -9026 -5032 187
312A87j307N396m97l669N308n15j259L380m814j302N70o855J194K146l212L548
$$ 187 -1120 4276 3779 110 5418 4903 3644 7024 2210 908 1478 -5377 -4183 -2037 -5249 -1701
328a701j295l787N318J00J440N759l571M88L037l977J930Q64m076K647l249n628
$$ -1701 -2996 -6783 -1465 -1365 75 5834 2263 2751 5788 1811 3741 4605 529 3176 -73 -5701
344e701K858k262k02M567l644M26L094j878M817K935k834M155j312l268L045l133
$$ -5701 -2843 -5105 -5307 -740 -4384 -3958 -864 -2742 2075 5010 2176 6331 5019 1751 4796 1663
360A663j291K691n517j216O88m259L588J768l223M075o94p75N835j185P03M304
$$ 1663 372 3063 -2454 -3670 -2982 -7241 -3653 -1885 -5108 -1033 -1727 -2502 3333 2148 2851 7155
376G155l766K91J267m738J987k47m627J950l483k792M034j841O24L853k844K264
$$ 7155 3389 3680 4947 209 2196 1949 -2678 -728 -4211 -7003 -2969 -4810 -4186 -333 -3177 -913
392i13L374k000M161R10k669L113k427k976K845l721r63J752n125R1J116k682
$$ -913 2461 461 4622 5532 2863 5976 3549 573 3418 -303 -1266 486 -4639 -4548 -3432 -6114
408f114L579Q19j851M343p45k47M941j704N60K771m119N16L78m264K107r51l682
$$ -6114 -2535 -1716 -3567 776 31 -216 4725 3021 3581 6352 2233 2749 3127 -1137 970 19 -3663
425c663K102l177j125M057j789J126L271l052L010K301k136L378n1k172K784l010
$$ -3663 -1561 -4738 -5863 -1806 -3595 -2469 802 -2250 760 3061 925 4303 4252 2080 4864 1854
441A854k084K239l540J98J208m577P04J681j951L591k36j629M149q82K38L406
$$ 1854 -230 2009 -1531 -1333 -125 -4702 -3998 -2317 -4268 -677 -913 -2542 1607 725 963 4369
457D369k593P29K399l967L80n4l209K993j664l023J921j822K54L486k827J241
$$ 4369 1776 2505 4904 937 1317 1263 -1946 1047 -617 -3640 -1719 -3541 -3287 199 -2628 -1387
473a387K748k528K903R86k460L265l76k069J873l407o45K870l204M0O27l360K564
$$ -1387 1361 -1167 1736 2722 262 3527 3151 1082 2955 -452 -1097 1773 -1431 -1391 -764 -4124 -1560
490a560R98k235L158n07m73L336k298j00L108k438J121O06m254J618L62k369K314
$$ -1560 -562 -2797 361 -146 -619 2717 419 319 3427 989 2110 2716 -1538 80 442 -1927 387
507C87j996j728L141j714j6K837k271K284J517l318K556O08j912K561j518k375
$$ 387 -1609 -3337 -196 -1910 -1926 911 -1360 924 2441 -877 1679 2287 375 2936 1418 -957
523i57J841k494L78J839l443J178J301k561K556N04j343L398q66j197K655k303
$$ -957 884 -1610 -1232 607 -2836 -1658 -357 -2918 -362 142 -1201 2197 1331 134 2789 486
539D86N01K114l134O83P1l535K194j51k103K427j331r13L068j586J112K527k238
$$ 486 987 3101 -33 650 721 -2814 -620 -771 -2874 -447 -1778 -2691 377 -1209 -97 2430 192
556A92J758Q89k901K572j27k624K273k432j932J896k312O22J560k870J794J591
$$ 192 1950 2839 -62 2510 2383 -241 2032 -400 -2332 -436 -2748 -2126 -566 -3436 -1642 -51
572e1k144L051L92r92L362j483q02J904k506M30J393l708K54k06k394K478r58
$$ -51 -2195 856 1248 256 3618 2135 1333 3237 731 1161 2554 -1154 -900 -1106 -3500 -1022 -1980
589a980j775K916r16j1K898j478J614K146k130J626k20k475K767j002k853J349
$$ -1980 -3755 -839 -1755 -1766 1132 -346 1268 3414 1284 2910 2690 215 2982 1980 -873 476
605D76k608q26K170k662P29J464j888K285Q69j431L496M19q93K379k313k82K136
$$ 476 -2132 -2958 -788 -3450 -2721 -1257 -3145 -860 9 -1422 2074 2493 1600 3979 1666 1384 3520
622C520k941L48M1l296J083k81k395K295o71p03L286j810L68K966o94J326P97
$$ 3520 579 927 968 -2328 -1245 -1526 -3921 -1626 -2297 -3000 286 -1524 -1156 1810 1116 2442 3239
639C239k351J584K42k424J634j662j982J634k336n21J691k107J869J292k127K393
$$ 3239 888 2472 2714 290 1924 262 -1720 -86 -2422 -2943 -1252 -3359 -1490 -198 -2325 68
655F8J063r51K817q13j224K267k074l35J195k787K60M66k775J410k61j179K758
$$ 68 1131 180 2997 2184 960 3227 1153 818 2013 -774 -514 -48 -2823 -1413 -1674 -2853 -95
672i5j046m77K738j320P55K286k191J228M79k159J225q85j792J939j674j324J801
$$ -95 -1141 -1618 1120 -200 555 2841 650 1878 2357 198 1423 538 -1254 685 -989 -2313 -512
689e12j998Q51J933k011J868R77j699K197J57j265K018j500j071J485k324j09
$$ -512 -2510 -1659 274 -1737 131 1108 -591 1606 1763 498 2516 1016 -55 1430 -894 -1003
705a003J514k427P10K78j691K564n0q71K515j123k55K153j628M85J188k620J087
$$ -1003 511 -1916 -1206 -928 -2619 -55 -105 -976 1539 416 161 2314 686 1171 2359 -261 826
722H26m25k524J667o71j195J747j368l3K397j478J232J856j806J744K17j896K036
$$ 826 401 -2123 -456 -1127 -2322 -575 -1943 -1976 421 -1057 175 2031 225 1969 2186 290 2326
739B326p88j693J411k338p25J549k186N02J124k078J902Q63j364K895j22l75K320
$$ 2326 1538 -155 1256 -1082 -1807 -258 -2444 -1942 -818 -2896 -994 -131 -1495 1400 1278 903 3223
756C223j624j63J517k342L04L07k906Q48n49j724J784q75m80K145r68P55K332
$$ 3223 1599 1436 2953 611 915 1222 -1684 -836 -1385 -3109 -1325 -2200 -2680 -535 -1503 -748 1584
773A584j257J626J187j902J438j93j640J048j551j582J251k259m19J316j962J421
$$ 1584 327 1953 3140 1238 2676 2483 843 1891 340 -1242 9 -2250 -2669 -1353 -3315 -1894
789a894J028j338K390K86o50K714l52l88J674j861k36Q86k523L32k87k344R72
$$ -1894 -866 -2204 186 472 -178 2536 2184 1796 3470 1609 1373 2259 -264 68 -219 -2563 -1591
806a591l26j284K141p88p3K205q13R13J777j034J283M25j948J468p86k054J472
$$ -1591 -1917 -3201 -1060 -1848 -1921 284 -529 384 2161 1127 2410 2835 887 2355 1569 -485 987
823I87j503j349J194k019K54J415j548J437R88j004K153K31n99K006q81m46J196
$$ 987 -516 -1865 -671 -2690 -2436 -1021 -2569 -1132 -144 -1148 1005 1236 637 2643 1762 1316 2512
840B512k121J6M71k102N21K7k019J582l04q00K185r12L91K110j345J089R01j594
$$ 2512 391 407 878 -1224 -703 -676 -2695 -1113 -1417 -2217 -32 -944 -553 1557 212 1301 2202 608
858F08J080j62j663J308r59j599J554j692j82J261j449Q62J158j486J950L62j029
$$ 608 1688 1526 -137 1171 212 -1387 167 -1525 -1707 -446 -1895 -1033 125 -1361 589 951 -78
875g8J932p20o73J537j635l44R44j798L11M07j783J145L7j216K082m72k87J871
$$ -78 1854 1134 461 1998 363 19 963 -835 -524 -117 -1900 -755 -718 -1934 148 -324 -611 1260
893A260r51L35J172j544P76M01j812Q51m36j404J434j239n84J632j340L46J564
$$ 1260 309 644 1816 272 1048 1449 -363 488 52 -1352 82 -1157 -1741 -109 -1449 -1103 461
910D61j268J021R62j256J680j30j096J419j114p77J185k006o7R71j776P16M16
$$ 461 -807 214 1176 -80 1600 1470 374 1793 679 -98 1087 -919 -986 -15 -1791 -1075 -659
927f59j204J615n8m60J854o32P7J497j512M38Q86j994J057m05j883J116o85j021
$$ -659 -1863 -248 -306 -766 1088 456 533 2030 518 956 1842 -152 905 500 -1383 -267 -952 -1973
945a973J328q35n3J760j223O67J451j172J364K91j182J289o72j030J373j490p47
$$ -1973 -645 -1480 -1533 227 -996 -329 1122 -50 1314 1605 423 1712 1040 10 1383 -107 -854
962h54J016j740N21N60j383J245K27r39J722j35k90J587r78J88J235j719N10N13
$$ -854 162 -1578 -1057 -497 -1880 -635 -408 -1347 375 240 -50 1537 559 747 1982 263 773 1286
980A286j875Q21j71j533J252p16n63J521j132L90J545j367R92Q70j315J320j16
$$ 1286 -589 232 61 -1472 -220 -936 -1499 22 -1110 -720 825 -542 450 1320 5 1325 1209
997A209j113J246p84r49J305j579j47Q97j440P45O02j342J475Mq02J560m99m01
$$ 1209 96 1342 558 -391 914 -665 -812 85 -1355 -610 -8 -1350 125 129 -673 887 388 -13
1015a3J322j324L06R38j677M63L57j146R21m14q81J591r44j89J305r79K18R30
$$ -13 1309 -15 291 1229 -448 15 372 -774 147 -267 -1148 443 -501 -690 615 -364 -146 784
1033G84j149J133J06j293J084n01p73J233r94l74J271j374M51P88j194J186P1
$$ 784 -365 768 874 -419 665 164 -609 624 -370 -744 527 -847 -396 392 -802 384 455
1050D55j008J264j75q40J476r98m50J167j440K10M35j317J226r0r91J321l16o96
$$ 455 -553 711 536 -304 1172 174 -276 891 -549 -339 96 -1221 5 -85 -1076 245 -71 -767
1068g67J499o27j71J209j087M09P13j447O74qj369J051n51q28J388j057Q6J113
$$ -767 732 105 -66 1143 56 465 1178 -269 405 397 -972 79 -472 -1300 88 -969 -883 230
1086B30j142J068N01r70J420j83q93J286o52p18J121j337p1P65j761O73M77j372
$$ 230 -912 156 657 -313 1107 924 31 1317 665 -53 1068 -269 -340 425 -1336 -663 -186 -1558
1104a558J240qp30J352k36m02J506q28J76J076j362P27Pj476Q24n26p39O98o88
$$ -1558 -318 -326 -1056 296 60 -342 1164 336 512 1588 226 953 960 -516 308 -218 -957 -259 -947
1123i47l64J180j013K97J144r46Q98N17q92J251q3j003J337p03n89P95j270n2
$$ -947 -1311 -131 -1144 -847 297 -649 249 766 -126 1125 1042 39 1376 673 84 879 -391 -443
1141d43N38j430P83K85j330J476k06n36J350m75n0J415r34K58O23j333P34P8j264
$$ -443 95 -1335 -552 -267 -1597 -121 -327 -863 487 12 -38 1377 443 701 1324 -9 725 803 -461
1160d61O64l70r68J111r14o5R32r07N08Q56r29R61L94q88J203m46n42J094r55
$$ -461 203 -167 -1135 -24 -938 -1003 -71 -978 -470 386 -543 418 812 -76 1127 681 139 1233 278
1179B78l54P77j357J08P66j102N80K6q05J184l35l16J084n13J74R32j152M50O01
$$ 278 -76 701 -656 -548 218 -884 -304 -278 -1083 101 -234 -550 534 21 195 1127 -25 425 1026
1198A026j315P87Jj081Q43n03m31R34r39j3J047j059O22M94q77R58Q7q41R61m23
$$ 1026 -289 498 499 -582 261 -242 -673 261 -678 -691 356 -703 -81 413 -464 494 581 -260 701 278
1218B78n29J016j140J35O09j092N92L57j000Q86p3n67J167o33j38J110j127J77
$$ 278 -251 765 -375 -240 369 -723 -131 226 -774 112 39 -528 639 6 -132 978 -149 28
1236B8P10j170O14K76j200Q33j29q33J201o55k67J120r87L30Q15r65N19L61q67
$$ 28 738 -432 182 458 -742 91 -38 -871 330 -325 -592 528 -459 -129 686 -279 240 601 -266
1255b66R26k39p81Q35o84m58Q93j044K30Q25r63N68M90p05J035j87o70J156o10
$$ -266 660 421 -360 475 -209 -667 226 -818 -588 237 -726 -158 332 -373 662 475 -195 961 351
1274C51r4O17j050J88L53j206P29k1r40Q34op34J318p02r8J288j028O65N60j039
$$ 351 257 874 -176 12 365 -841 -112 -133 -1073 -239 -245 -979 339 -363 -461 827 -201 464 1024 -15
1294a5R30q5j118R71o24p78R92q65j12O66q93L31O56q50J022J46o05J147m19l04
$$ -15 915 830 -288 683 59 -719 273 -592 -704 -38 -931 -600 56 -794 228 374 -231 916 497 193
1314A93Q50p24Q0K61r96K61L76j216O28k26m66J012o02j75J037m73M8R15o03M88
$$ 193 1043 319 399 660 -336 -75 301 -915 -287 -513 -979 33 -569 -744 293 -180 -132 783 180 668
1334F68K27q83O24o4q21O45n43l53N53q60R7P39j097Q95L72r08R54j12j78J130
$$ 668 895 12 636 572 -249 396 -147 -500 53 -807 -710 29 -1068 -173 199 -709 245 133 -45 1085
1354A085o43j86O17n99j12N10r94L22P7q51N64n8o19R53k43l58Q79n01J78O63
$$ 1085 442 256 873 274 162 672 -322 0 77 -774 -210 -268 -887 66 -177 -535 344 -157 21 684
1374F84p24L29K80p33P15k67o64O46o00l08P60n41N3N92r22O02K70n67Q15k01
$$ 684 -40 289 569 -164 551 284 -380 266 -334 -642 118 -423 -370 222 -700 -98 172 -395 420 219
1394B19k26O73n81J2O25j075N22J03p50N69mo71Q20k81l86P86m39J6P74r32K70
$$ 219 -7 666 85 97 722 -353 169 272 -478 91 87 -584 236 -45 -431 355 -84 -68 706 -226 44
1415D4M18q29N44J8o00N93l63k94P11m53O4O72p77M25K83q74P19j00m87P01m79
$$ 44 462 -367 177 195 -405 188 -175 -469 242 -211 -147 525 -252 173 456 -418 301 201 -286 415 -64
1436f4m11P82n74L4M49p77L65L98p23P05J81o91P37j48l60O53m67j3L23n09J07
$$ -64 -475 307 -267 -233 216 -561 -196 202 -521 184 365 -326 411 263 -97 556 89 76 399 -110 -3
1457cN5m79L91j95m29Q30n06J23M34k72J27M64l99K36K14o20M08o7l10L10m98
$$ -3 52 -427 -36 -231 -660 170 -336 -213 221 -51 76 540 141 377 591 -29 379 312 2 312 -186
1478a86j95O81q04M7M29p27O38J76n05O48j61o1P78m10m0L05n57J16L09p96K57
$$ -186 -381 300 -504 -457 -28 -755 -117 59 -446 202 41 -20 758 348 308 613 56 172 481 -315 -58
1499e8J03p00O02l65j66N93l27OO25k83O3M14n91N06l1m07O54m90l63M14m79K8
$$ -58 45 -655 -53 -418 -584 9 -318 -312 313 30 93 507 -84 422 391 -16 638 148 -215 199 -280 -252
1521b52K78n22J48K89m53M29K16m56O43j96l43Q73m75j66M93o14K76R9n49L76
$$ -252 26 -496 -348 -59 -512 -83 133 -323 320 124 -219 654 179 13 506 -108 168 267 -282 94
1541I4j18n38O66m23p2O01m52QN04n42M91J63n21M83k98j39M12l17k65N66n10
$$ 94 -24 -562 104 -319 -391 210 -242 -234 270 -272 219 382 -139 344 46 -93 319 2 -263 303 -207
1562b07j4M20o40N06J16n50N68r7l12L99l9k30M73n70J25K84n59L08N1k46M72
$$ -207 -221 199 -441 65 181 -369 199 102 -210 189 150 -80 393 -177 -52 232 -327 -19 32 -214 258
1583B58j9n75N48k46j88N18m04J72K43m97K82Mm18M79j39k60M08k79j16L99l42
$$ 258 239 -336 212 -34 -222 296 -108 64 307 -190 92 96 -322 157 18 -242 166 -113 -229 170 -172
1604a72J58L74n43L59l8l44L67Nn53O00k96k94O23n04J59K12l64J59J85k62M88
$$ -172 -14 360 -183 176 138 -206 161 166 -387 213 -83 -377 246 -258 -99 113 -251 -92 93 -169 319
1625C19k16k63N81l54j71M72m90J57K51n10J62J09n38M59j68l13O34k34K79J22
$$ 319 103 -160 421 67 -104 368 -122 35 286 -224 -62 47 -491 -32 -200 -513 121 -113 166 288
1645B88m60L62ll56L26Q7l49M90m28l41O24n74N7L49k41LJ72m76N75j44k32O23
$$ 288 -172 190 187 -169 157 244 -105 385 -43 -384 240 -334 -277 72 -169 -166 6 -470 105 -39 -271 352
1667C52m68J07N67l63j07L58n12J50J27m28L63L5o14N07l24P8L41n30L65J32k34
$$ 352 -116 -9 558 195 88 446 -66 84 211 -217 146 181 -433 74 -250 -172 169 -361 4 136 -98
1688i8O8K56l18L33k17k06L21j56p9L94l83n0M79o89L01M4n05N73j23l32M39j08
$$ -98 -30 226 -92 241 24 -182 139 -17 -96 298 -85 -135 344 -345 -44 0 -505 68 -55 -387 52 -56
1710e6p0L02k91M9J55k62K14J51k20L10k93q2L51l33p2L45n67K45K90m69K52J42
$$ -56 -126 176 -115 -66 89 -173 41 192 -28 282 -11 -93 258 -75 -147 198 -369 -124 166 -303 -51 91
1732I1k35L56j84k06K64j96N7L78l74J2K26m42L21j1k51M69k67k40M24l75K2L74
$$ 91 -144 212 28 -178 86 -110 -53 325 -49 -37 189 -253 68 57 -194 275 8 -232 192 -183 -161 213
1754B13m29L22Jl31L39M6k82K48l7k01K54j49j03K83l41K24r2k70K73j29j04L46
$$ 213 -216 106 107 -224 115 161 -121 127 90 -111 143 -6 -109 174 -167 57 -35 -305 -32 -161 -265 81
1776H1j33k56N82k94o9N17m30M7J10k69M06j43l81M39l42j85N69p10K96J62k36
$$ 81 -52 -308 274 -20 -89 428 -2 45 155 -114 292 149 -232 207 -135 -320 249 -461 -165 -3 -239
1797b39K28l8j92M06P1m56K51M9j60M35l58j35K56k68K03J0l62J89l0j19M53l86
$$ -239 -11 -49 -241 165 236 -220 31 80 -80 355 -3 -138 118 -150 53 63 -299 -110 -140 -259 194 -192
1819a92L0K45j38k3J46j24K38l4l55N24k06j35K52j52r3K96m10k6L12k46L5L2
$$ -192 -162 83 -55 -78 68 -56 182 148 -207 317 111 -24 228 76 -17 279 -131 -157 155 -91 -56 -24
1841b4m05O04k57l2L06k84L8K75k16J56O8l90K53p0n0R0j56J9K82l48p2K97l09
$$ -24 -429 175 -82 -114 192 -92 -54 221 5 161 229 -161 92 22 -28 62 -94 -75 207 -141 -213 84 -225
1864b25K47J33n48M73J25k23K83j76k56L59j42j5K49l92l3K53l69L21q9k90L87
$$ -225 22 155 -393 80 205 -18 265 89 -167 192 50 35 284 -108 -141 112 -257 64 -25 -315 72
1885G2l18J44L16k23j17K52l37J87L44m27J77J14m62M23j00j11K69m05R8L64m32
$$ 72 -246 -102 214 -9 -126 126 -211 -24 320 -107 70 184 -278 145 45 -66 203 -202 -104 260 -172
1906a72pK30l46K72l1o5K63k16ML11m48K46N0p8MR0j29K00p5k80J82j03j08K60
$$ -172 -179 51 -295 -23 -54 -119 144 -72 -68 243 -205 41 91 13 17 107 -22 178 103 -177 5 -98 -206 54
1930E4k17J38J21m74L60J68k4J17pm13K94o4j12K23k28M2oj33K63j73k41M26o
$$ 54 -163 -25 96 -378 -18 150 126 243 236 -177 117 53 -59 164 -64 -22 -28 -161 102 -71 -312 114 108
1953A08k53J83p1j11L73l37J06P9k71L16L5k63L00j14j10J39l99L45J29m04K01
$$ 108 -145 38 -33 -144 229 -108 -2 77 -194 122 157 -106 194 80 -30 109 -290 55 184 -220 -19
1974a9J08j98P9J27j86J50l6m8J7M1j26J49j16K75Ml08K38n2j15Oj04k6J86k02
$$ -19 89 -109 -30 97 -89 61 25 -23 -6 35 -91 58 -58 217 221 -87 151 99 -16 -10 -114 -140 46 -156
1998a56L22k35m1J57J68k66J37j82j0M21k94m6R7j08J57J71m39K73L4m34K89J8
$$ -156 166 -69 -110 47 215 -51 86 -96 -106 315 21 -25 72 -36 121 292 -147 126 160 -274 15 33
2020C3j07J10j36j4L48m33L55j20p7K73r5j17J56k96k6J72j98K53L3k36K2J31
$$ 33 -74 36 -100 -114 234 -199 156 36 -41 232 137 20 176 -120 -146 26 -172 81 114 -122 -100 31
2042C1l08K93J3j26K4N9l8J99l60K80J79k14l4m4j27L95q6l62M47k81j0J40j50
$$ 31 -277 16 29 -97 -73 -14 -52 147 -213 67 246 32 -2 -46 -173 222 136 -226 221 -60 -70 70 -80
2065h0L6J28k64j17L95k63P3J23j25K95q4LJ71k44M4J75n16M20j6k19J18M4l43
$$ -80 -44 84 -180 -297 98 -165 -92 31 -94 201 117 120 291 47 91 266 -250 170 154 -65 53 97 -246
2088b46K83r1n2J59k26L20lj89R6N6k97L44o1j13%l3j22K00k85L60j00k63L01
$$ -246 37 -54 -106 53 -173 147 144 -45 51 107 -190 154 93 -20 -20 -53 -175 25 -260 100 0 -263 38
2111C8J62l41K38l8j25M3n2J16K14j86O1Q9k84J06O3k90J63r7r6L38k75J47j5
$$ 38 200 -141 97 59 -66 -23 -75 41 255 69 130 219 -65 41 104 -186 -23 -120 -216 122 -153 -6 -21
2134b1KJ2J29l42L26Pj78K41k1m42N77m40O6J71l48J19J76j61J57k2k64L05k14
$$ -21 -19 -7 122 -220 106 113 -65 176 155 -287 290 -150 -84 87 -261 -142 34 -127 30 8 -256 49 -165
2157a65J79J26l27J67O7j38K84j5l10K14n4j06J25j11p9L66l32L5P4k29K06J8
$$ -165 14 140 -187 -20 47 -91 193 178 -132 82 28 -78 47 -64 -143 223 -109 -74 0 -229 -23 -5
2179ej25P6J19n2P7j26j37L07j54L5J30j53Q0K5o0r7m2M0O1JoJ67l42K22J03l75
$$ -5 -130 -54 65 13 90 -36 -173 134 -20 15 145 -8 72 97 37 -60 -102 -62 -1 0 -6 161 -181 41 144 -231
2205b31K08J84j10o6l7J6J48j14j52L54j69k4nk75K62j12j5J46j0j04K6K4m4L64
$$ -231 -23 161 51 -15 -52 -36 112 -2 -154 200 31 7 2 -273 -11 -123 -138 8 -2 -106 -80 -56 -100 264
2229B64l45J86J55l64K21kj89J98j01o1mj78N6K09k65J44J18j74K10j46l8J16
$$ 264 -81 105 260 -104 117 115 -74 124 23 -38 -42 -220 -164 45 -220 -76 42 -132 78 -68 -106 10
2251A0M1RK37k02m7k6j4j11L05l28J93L3l12K36k02J10O8nJ1K5j25J00J01j99
$$ 10 51 60 297 95 48 22 8 -103 202 -126 67 100 -212 24 -178 -68 0 -5 6 31 -94 6 107 -92
2275i2J47j69o7K89J7j30m7J59j10K3m4k5M5o0J66r3j18P5j31J85J33q9J24j21
$$ -92 55 -114 -181 108 125 -5 -52 107 -3 20 -24 -49 -4 -64 102 9 -109 -34 -165 20 153 64 188 67
2299F7P0k49K14j32J91Ol32N44n15j6K86k10N8j51N8O7M4r7Q2M8k32K42K4M6M9
$$ 67 137 -112 102 -30 161 167 -165 379 -136 -152 134 -76 -18 -169 -111 -44 0 -97 -15 33 -199 43 67 113 162
2324A62r7n0OP9j80%o9K55k52J6J46l9J61o9r1K31j30k18K08R1k39J02J00j78
$$ 162 65 15 21 100 -80 -80 -149 106 -146 -130 16 -23 138 69 -22 209 79 -139 69 160 -79 23 123 -55
2348e5K41j88k0Q4j07J69nk11J80j50R8l4M0j54R6L3J6O9j54N5K41l59L00jj17
$$ -55 186 -2 -22 62 -45 124 119 -92 88 -62 36 2 42 -112 -16 17 33 102 -52 3 244 -115 185 184 67
2373F7K3k42R1N5o4l5J39j88M9M5j52M70k71l6J97k2k86K24j82NK04j49J16j02
$$ 67 90 -152 -61 -6 -70 -105 34 -154 -105 -60 -212 258 -13 -49 148 126 -160 64 -118 -113 91 -58 58 -44
2397d4j26J90j65J0K10j72l1J37j55O9J82r1J69n4j57L1J5M6j07k0K15k34j55
$$ -44 -170 20 -145 -135 75 -97 -128 9 -146 -77 105 14 183 129 -28 3 18 64 -43 -63 152 -82 -237
2420b37K52j6o5K00j36j58R5K18l24K14j12L21j41p8k8Q8j82j8K61j72n7J00q5
$$ -237 15 -1 -66 134 -2 -160 -65 153 -171 43 -69 252 111 33 5 93 -89 -107 154 -18 -75 25 -60
2443f0N6q3N0%P6j18ol2K63r1q5J97J4l54L51k49Q2M4j38M0J17j97P3l4J1K49
$$ -60 -4 -87 -37 -37 39 -79 -85 -117 146 55 -30 167 181 -173 178 -71 11 55 -83 -43 74 -123 -50 -84 -73 176
2469A76q1j40J7j10P2O4m9J74N3j37p6N3jk2K5k1J63j68j8P8o1j41L20l16K06
$$ 176 95 -45 -28 -138 -66 -2 -51 123 176 39 -37 16 15 -7 18 -3 160 -8 -26 52 -9 -150 170 -146 60
2494F0K6k04K93k00j06L22j63K1j2m5J50k26L4L7Lo3J77j4k22J60R7o3o2n4J03
$$ 60 86 -118 175 -25 -131 191 28 49 37 -8 142 -84 -50 -13 -10 -73 104 90 -132 28 125 62 0 -54 49
2519D9O9j49r7Q7R3O2l9j32l0J05n9j24l9K49j02m4K5j6k3P1q8J19m7J4J85j14
$$ 49 118 -31 -128 -41 52 114 75 -57 -87 18 -41 -165 -204 45 -57 -101 -76 -92 -115 -44 -132 -13 -60 -46 139 25
2545B5M4P3n0j17J39j04L6m2P7O3j83p1K5N0j30J26k1K3J53j14R6q2J88k05M2
$$ 25 69 142 92 -25 114 10 46 4 81 144 -39 -110 -85 -35 -165 -39 -60 -37 116 2 98 16 204 -1 41
2570D1m5J2R1l51L83k16K7m5J9m7J35j33N2Q5o0J55r7j11K49j31n5Q3k02J27O1
$$ 41 -4 8 99 -252 131 -85 -58 -103 -84 -131 4 -129 -77 8 -52 103 6 -105 144 13 -42 41 -161 -34 27
2595B7oO5j13j60K40j07l0M8j12Q2R9K0j60K39r3K3Rk16R4j6l0J41j70M9P7P4
$$ 27 21 86 -27 -187 53 -54 -84 -36 -148 -66 33 53 -107 132 39 62 71 -145 -51 -67 -97 44 -126 -77 0 74
2621G4k0j4q5J29j25j43L21l17K75k2q0J33j79K15k27K5M8j4j96J99k0K8J01j42
$$ 74 54 40 -45 84 -41 -184 137 -180 95 73 -7 126 -53 162 -65 -40 8 -6 -202 -3 -23 5 106 -36
2645c6p7m2K57j34J6j15L4k4J18M4R3j69j36J77j55K57j13L1j69MJ14j22K09R
$$ -36 -113 -155 102 -32 -16 -131 -97 -121 -3 41 134 -35 -171 6 -149 108 -5 26 -143 -139 -25 -147 62 71
2669G1j22o1J07J19j98L1Q1j80Q6O6L1J07%j24J35k11Q8J09j45p7J72Qj63J06
$$ 71 -51 -112 -5 114 -84 -53 28 -152 -66 0 31 138 138 14 149 -62 26 135 -10 -87 85 93 -70 36
2693C6m3m1J14j78O3k7n4KJ31O1Q4j33o1K38j87J19j65r6J72L%qn1J31L2k25Q5
$$ 36 -7 -48 66 -112 -49 -76 -130 -128 3 64 148 15 -46 192 5 124 -41 -137 35 38 38 30 -21 110 142 -83 2
2720BN1M0Qj50J11r0p1K33k35K60k49j16O2K23K8k16Q6q0M5J49l8r2J4K0N0Qn
$$ 2 53 93 101 -49 62 -28 -99 134 -101 159 -90 -206 -144 79 107 -109 -23 -103 -58 91 53 -39 -25 -5 45 53 48
2747D8P6J5p6N3j64j08J86k0j56Q3K5Q6o2l8K05j75j1K6k4Kj3R1j7j3j98J12N7
$$ 48 124 139 63 116 -48 -156 30 10 -146 -63 -38 48 -14 -52 153 -22 -33 -7 -31 -29 -42 49 32 19 -179 -67 -10
2774a0j19J21j67K36Q8j84j27K42j59R2L7j01J03K1j7J31k21J40k6j84K57k13
$$ -10 -129 -8 -175 61 149 -35 -162 80 -79 13 50 -51 52 73 56 187 -34 106 80 -104 153 -60
2796f0J55j3m6K2Q0q7L1j44J30j70J30j57R7O7kN8k0k43J95p4j24K11P0k38J73
$$ -60 95 82 36 58 138 51 82 -62 68 -102 28 -129 -32 35 33 91 71 -172 23 -51 -175 36 106 -132 41
2821D1R6l1k34L0N7J75j94j68J15K5K4Q2q0N4j36J34J14q0Qj14R5j07J94j7q6
$$ 41 137 106 -128 -98 -41 134 -60 -228 -113 -88 -64 18 -62 -8 -144 -10 104 24 32 -82 13 -94 100 83 -3
2846cq7J17j62R3K2k7m7rk0J96j55Q0q8J70k6J4j06m1J99l6l1n9k5%J9N8M3J0
$$ -3 -90 27 -135 -42 -20 -47 -94 -103 -123 73 -82 -2 -90 80 54 68 -38 -79 120 84 53 -6 -31 -31 -12 46 89 99
2874I9Pj11l3l9NJ01N3k52J26j25L56j25k59L23r4o3J07N1j73J14q8Ml4M6R2J11
$$ 99 106 -5 -38 -77 -72 29 82 -170 -44 -169 187 62 -197 126 32 -31 76 127 -46 68 -20 -16 -50 -4 88 199
2900A99k60J56q9Q4k18J76j58M8M8K30k43r7K47O6j55o3P6j52K95k19m3J16j13
$$ 199 -61 95 6 90 -128 48 -110 -62 -14 216 -27 -124 123 189 34 -29 47 -105 190 -29 -72 44 -69
2923f9R3j84L60j17O2m4J8j41p4J24k6j24L7L4j6R6M0k10K55k61R3J0J38j4p1
$$ -69 24 -160 200 83 145 101 119 -22 -96 28 2 -122 -85 -51 -67 29 69 -141 114 -147 -54 -44 94 80 9
2948IO8q6Q8k37J78j04K50k77j1K04L0M4j00n7R6O9k75R3k0n8L07r6O4k02K06
$$ 9 77 -9 79 -158 20 -84 166 -111 -122 82 112 156 56 -1 95 164 -111 -18 -38 -96 211 115 179 -23 183
2973A83j55l4o6Q6K5j72J39K7n0k0j99J08J95L4n5o5r1j1J93m1L6ko7%j22N5K27
$$ 183 28 -6 -72 14 39 -133 6 33 -17 -37 -236 -128 67 101 46 -19 -110 -121 72 31 67 65 -2 -2 -124 -69 158
3000A58k39R5Q1m5J24k07m4l5N7Q9J51j96j2J24o9M0j27J04q9K12k09R8m4p4m4
$$ 158 -81 14 95 50 174 -33 -77 -112 -55 34 185 -11 -23 101 32 72 -55 49 -40 172 -37 61 17 -57 -101
3025a01P8J22K6j67QJ1J00j74n2J38Q9j01K9m3J1p2P7j32J06l1L1m1J05M2lN8
$$ -101 -23 99 125 -42 -34 -23 77 -97 -149 -11 78 -23 6 -37 -26 -98 -21 -153 -47 -78 -47 -88 17 59 56 114
3051A14j58J13o3JM8l5o5J27N4J03k64l3J79j43J0K87j37L1L4p3k12k1M8J13q7
$$ 114 -44 69 6 7 55 20 -45 82 136 239 -25 -58 121 -22 -12 275 138 169 203 130 -82 -103 -55 58 -29
3076b9J9K4n4k0j1P6j07M6PK1M2j29K17j09k2O7j46R2R1j63J34P8j77K04k09O2
$$ -29 -10 14 -40 -60 -71 5 -102 -56 -49 -28 14 -115 102 -7 -29 38 -108 -16 75 -88 46 124 -53 151 -58 4
3102Dkn0J6K20j68r7J3K3p0K90r4lp0j38K66p0k19J85K0J38j04k26J39n5N0J78
$$ 4 2 -48 -32 188 20 -77 -64 -41 -111 179 85 82 12 -126 140 70 -149 36 56 194 90 -136 3 -52 -2 176
3128A76k00J30J8k03M2J34o9Jm2m0K87k32J45k64J13K1o1L2J18j33o2O6O2L9J11
$$ 176 -24 106 124 -79 -37 97 28 29 -13 -53 234 2 147 -117 -4 17 -44 -12 106 -27 -89 -23 39 78 189
3153A89k73lJ34ol0j7J3O7O4j95k9Q2k8P9o2q9Q4k6j2K40m3k1r7q2R5J05j72R1
$$ 189 -84 -87 47 41 11 -6 7 74 138 -57 -86 -4 -32 47 -15 -104 -20 -46 -58 182 139 118 21 -61 34 139 -33 58
3181E8k9o2m8J70q8p3mJ22n8l8J05j8l2M4K39m53J01J68j34J88k37K86m01K54
$$ 58 29 -33 -81 89 1 -72 -76 46 -12 -50 55 37 5 49 288 -165 -64 104 -30 158 -79 207 -194 60
3205F0j31R2lj24J28m1P9q9M9L6j33J26j75K82j80Q6rk3%j32R8om6J7J05j52n2
$$ 60 -71 21 18 -106 22 -19 60 -29 20 56 -77 49 -126 156 -24 62 53 30 30 -102 -4 -10 -56 -39 66 -86 -138
3232a38J13m5M3n8oK05n3j03L2j8L7l3qL7M9r5J27j41J43Mj42M8o9L3mN1J58k75
$$ -138 -25 -70 -27 -85 -91 114 61 -42 -10 -28 9 -24 -32 5 54 -41 86 -55 88 92 -50 -2 -71 -38 -42 9 167 -108
3260a08K00j28K2L8P8k7Lq5J6p3J39r7k7R7J3Op0K5k6J45j00j35O1J6j5l0K8J27
$$ -108 92 -36 -14 24 102 75 78 -7 9 -64 75 -22 -49 48 61 67 -3 22 -4 141 41 -94 -33 -17 -32 -62 -34 93
3288I3O7n3j60Q3J91j95k4M8N6o6K2j12K0J98k52kJ84k04J94j26J10J39j94j75
$$ 93 160 107 -53 30 221 26 2 50 106 40 62 -50 -30 168 -84 -86 98 -106 88 -38 72 211 17 -158
3312a58K39J8j52j9M5l2J6J15l4q%mP9K4m6o1J9o0j09L59l13J86Lj79J49j41L1
$$ -158 81 99 -53 -72 -27 -59 -43 72 38 30 30 26 105 129 83 22 41 -19 -128 231 -82 104 107 -72 77 -64 -33
3339c3nJ6J55j22R0k39K32l1k5m3j20L62k15n1k4N3j56J75r8J72n4m0p2J19M5
$$ -33 -38 -22 133 11 101 -138 94 63 38 -5 -125 237 22 -29 -53 0 -156 19 -79 93 39 -1 -73 46 91
3364I1q3k8nK5j47J06J13p6J37oj09m8J49q0j19J82J1m4k71J76J1M7J42j10pj81
$$ 91 8 -20 -25 0 -147 -41 72 -4 133 127 18 -30 119 39 -80 102 113 69 -202 -26 -15 32 174 64 57 -124
3390a24J42Kj57O5RK81l5k28m5J02l1l3J14J29k60o4J92qR3j47j2j56L75j65O9
$$ -124 18 20 -137 -72 -63 218 183 -45 -90 12 -19 -52 62 191 -69 -133 59 51 144 -3 -15 -171 204 39 108
3415A08l3j69J56Q4j18m9j2j10J32K3j22J23P5p3j24K5J07K8j38j8M3jk7J08j38
$$ 108 75 -94 62 146 28 -21 -33 -143 -11 12 -110 13 88 15 -109 -84 23 51 -87 -105 -62 -63 -90 18 -120
3440a20J68j24k7J45m9P4L6p1OJ4j61J53l1LM8k5L9Pl4L1n7R9N4j58j9j50K33
$$ -120 48 -76 -103 42 -7 67 103 32 38 52 -109 44 13 16 64 39 78 85 51 82 25 124 178 20 1 -149 84
3467H4j01q5j5Q4P7j34J37m4j80L03j18o3J9j9J09k20O1J80p1J37k8p6k48l4K11
$$ 84 -17 -102 -117 -33 44 -90 47 3 -177 126 8 -55 -36 -55 54 -166 -105 75 4 141 113 37 -211 -245 -34
3492c4j04K35k3Q5j58O7J41k28p6K42r6k06K45m0j0P3j07n7P1o3J14J50j24j26
$$ -34 -138 97 74 159 1 68 209 -19 -95 147 51 -155 90 50 40 113 6 -51 20 -43 71 221 97 -29
3516b9M7N6l4R7j16O4j97M7R2j75J33m6l0J48k31R5K47j33K7r2L0J16rk2m0jJ68
$$ -29 18 74 40 137 21 85 -112 -65 27 -148 -15 -61 -91 57 -174 -79 168 35 62 -30 0 116 107 85 45 44 212
3543B12k08p8P3kmm3M5N5N1n3p0k0N9lj00N6n5P8k5K05k37J08l5lj40N5j38K43
$$ 212 4 -74 -1 -3 -7 -50 -5 50 101 48 -22 -42 17 14 -86 -30 -85 -7 -32 173 -64 44 9 6 -134 -79 -217 26
3571B6j17K2K5K24j91J4P4j18rQ4j6j48P4J43O2k60P6N2j08OJ04r4J38m1o4j1
$$ 26 -91 -69 -44 180 -11 3 77 -41 -50 34 18 -130 -56 87 149 -111 -35 17 -91 -85 19 -75 63 22 -42 -53
3597e3J61j69J5l7o1J53K9o6rn0M5P7Pm0r6J37k30J53l3L7J7n7J85j75J11o3j59
$$ -53 108 -61 -46 -83 -144 9 38 -28 -37 -87 -42 35 42 2 -94 43 -187 -34 -67 -30 -13 -70 115 -60 51 -12 -171
3624a71K42M1m6q2L5J36j70m4R6r6L4N8m1KP1J6p3L1j57J19r4J93p6Q4j32Q4l6
$$ -171 71 112 66 -16 19 155 -15 -59 37 -59 -25 33 -8 -6 65 81 8 39 -118 1 -93 100 24 108 -24 60 24
3651B4q7jM6M8N5k03K5J08qo4rk10K25L9j41K55p0J22r8r0KO2Q3j65J09r0K46
$$ 24 -63 -64 -18 30 85 -118 -93 15 7 -57 -66 -276 -51 -12 -153 102 32 154 56 -34 -32 30 113 -52 57 -33 213
3678B13k98P5Q8j9q1L3P0o6j23P0K7j87K31q1J49n9R9k19R7J2j06J31mL1j92Q3
$$ 213 -85 -10 78 59 -22 11 81 15 -108 -38 -11 -198 33 -48 101 42 141 -78 19 31 -75 56 52 83 -109 -26
3704b6J24k4K5r9j29N1JJ66J59l14Q5j76L7J23r8J04p2K7R7N6Ok72J26K15j46
$$ -26 98 74 99 0 -129 -78 -77 89 248 -66 19 -157 -120 3 -95 9 -63 -36 61 117 123 -149 -23 192 46
3729D6M1Kj29j1L4p3m2L93j00q9o3q8J51j85J96j43J13k55K91j81J24j12R2j65
$$ 46 87 89 -40 -51 -17 -90 -132 261 161 72 9 -79 72 -113 83 -60 53 -202 89 -92 32 -80 12 -153
3753a53J67r4o3J61j40JJ52Oj16K40l59J80J2J22r0j76J26R0q5P7p1o2M6K6M0
$$ -153 14 -80 -143 18 -122 -121 31 37 -79 161 -198 -18 -6 116 26 -150 -24 66 -19 58 -13 -75 -29 -3 37
3778C7r9k6J05J31j47Q8J14k93K39j58qP8n0j42J81P4k46L6rJ27J7k61K61M1o2
$$ 37 -62 -88 17 148 1 89 203 -90 149 -9 -17 61 11 -131 50 124 -122 -86 -95 32 49 -212 49 90 28
3803B8Q0M6j01Q1j65l2J07j49J80j7j33J03J37j68J10k9M1N3k02N0p3M5N3L2k02
$$ 28 108 154 53 134 -31 -63 44 -105 75 58 -75 28 165 -3 107 78 119 172 -30 20 -53 -8 45 77 -125
3828a25K1J49j8J2p7R9j1o2J59%r2j28N8j05K84j29R1j30L3N4j9j84J2K53k90
$$ -125 -104 45 27 39 -38 61 50 -12 147 147 55 -73 -15 -120 164 35 126 -4 29 83 64 -120 -108 145 -145
3853a45K59J00k80N7Q7Pm8q7l3J0J8Jjo1K22j3n5J27k28M3K24r7o2j81J07k5O4
$$ -145 114 214 -66 -9 78 85 37 -50 -83 -73 -55 -54 -55 -116 106 93 38 165 -63 -20 204 107 45 -136 -29 -54 10
3880A0K6j95Q2J26q7J35k54K98k11p3j3R7R5o4Okj3J98n5k20J77rj19M6J12j46
$$ 10 36 -159 -77 49 -38 97 -157 141 -70 -143 -156 -59 36 -28 -22 -24 -37 161 106 -114 63 54 -65 -19 93 -53
3906e3K2m6O6J2j20J30K9m7n1J14J8j05OR8o8j62P1J76j15j30N6O8l4j39J53M5
$$ -53 -31 -77 -11 1 -119 11 40 -7 -58 56 74 -31 -25 73 5 -157 -86 90 -25 -155 -99 -31 -65 -204 -51 -6
3932fN7j24N4l0M3R1k8k53oJ70o5Q0R4l5q4%N2k1p5J42ok11K17n9j09K16l1j30
$$ -6 51 -73 -19 -49 -6 85 57 -196 -202 -32 -97 -17 77 42 -42 -42 10 -11 -86 56 50 -161 56 -3 -112 104 73 -57
3960e7J9j22M1J04l0M2O2N8j39n4L0O3j13m8K14K8o3j27l9J2K82j79Q6%j07j19
$$ -57 -38 -160 -119 -15 -45 -3 59 117 -22 -76 -46 17 -96 -144 70 98 35 -92 -131 -119 163 -16 70 70 -37 -156
3986a56Q4J11r4N2o6J04p7j7Q0n8N1p9J43O6j53K4J78j87lkn0J04k01L7K15k10
$$ -156 -72 39 -55 -3 -69 35 -42 -59 21 -37 14 -65 78 144 -9 15 193 6 3 1 -49 55 -146 -109 106 -104
4012a04J41j16R2J49j61j01R9M9j98J63lp9J05j26J97k09J11J38o6l7o5m9q4K90
$$ -104 37 -79 13 162 1 -100 -1 48 -150 13 10 -69 36 -90 107 -102 9 147 81 44 -21 -70 -154 136
4036A36j91N1j08M2Q6n1J37k00J09k3O2o9K8l5j33K37R0n9p5P4k9r0l7N3j3p1
$$ 136 -55 -4 -112 -70 16 -35 102 -98 11 -12 50 -19 9 -26 -159 78 168 109 34 108 79 -11 -48 5 -8 -79
4062g9M2j03M0j0j9J18m7R3q0K60j43j56L1K0P6m7j35O9K3j52K12R7j00K2n5J7
$$ -79 -37 -140 -100 -110 -129 -11 -58 35 -45 215 72 -84 -53 -33 43 -4 -139 -70 -47 -199 13 110 10 32 -23 -6
4088fL9LR8j41J00j48j8J33q3m7N6j07K57Pj29m5kN6Q6q7j92p4J72l9J45j23O2
$$ -6 33 36 134 -7 93 -55 -73 60 -23 -70 -14 -121 136 143 14 -31 -33 23 109 22 -170 -244 -72 -111 34 -89 -27
4115b7L6J37j54J33Q1j14k25P1k4J70J7ml6pq6R3j07JK22k15N1j50N9J28r2k9
$$ -27 9 146 -8 125 206 92 -133 -62 -86 84 101 97 61 54 -32 61 -46 -45 177 -38 13 -137 -78 50 -42 -71
4141g1mJ95k42K55p2J63k02R5j29Q2J7j04o6n7J72o5Or8J17n4J28J3r3j03J62
$$ -71 -75 120 -122 133 61 224 22 117 -12 70 87 -17 -83 -140 32 -33 -27 -125 -8 -62 66 79 -14 -117 45
4166D5O7k8l0K8j71K30N0l84L74l36J20L9O9o5q6j02K29r0o3R2m6K1J6J58k14
$$ 45 112 84 54 82 -89 141 191 -193 181 -155 -35 4 73 8 -78 -180 49 -41 -104 -12 -58 -37 -21 137 -77
4191g7k7L1M9J8J28j86J76m23J48J12M0j88Q2J32m7j12J26p4l9m7K07o0J49j32
$$ -77 -104 -73 -24 -6 122 -64 112 -311 -163 -51 -11 -199 -117 15 -32 -144 -18 -92 -131 -178 29 -31 118 -14
4215a4k16K78n2q4M2P3l2n9J8n8K04N8n0k14J26J05k69J52K5l8m7m4K91k58O4
$$ -14 -230 48 -4 -88 -46 27 -5 -64 -46 -104 100 158 108 -106 20 125 -144 8 33 -5 -52 -96 195 -63 1
4240An4J29L9j05k01R1j54m3L24j79J52l7O0N9j3l6J43j73q9J47q2J61j12j75
$$ 1 -53 76 115 10 -191 -100 -254 -297 27 -152 0 -37 23 82 69 33 176 3 -86 61 -21 140 28 -147
4264a47L08j98m5n2J37J0j87K02m8n1K83p4j87J59R8k88Q4J02mk01Q4o7K0K0N4
$$ -147 161 -37 -82 -134 3 13 -174 28 -20 -71 212 138 -49 110 208 -80 4 106 102 -99 -15 -82 -62 -42 12
4289A2J71k62J32j17n4n4J77q2P5m2k0K16p9k1q7mj4p9J36q1J50r1J5l3r8Q2J27
$$ 12 183 -79 53 -64 -118 -172 5 -77 -2 -44 -64 152 73 52 -35 -39 -53 -132 4 -77 73 -18 -3 -36 -134 -52 75
4316G5l1r3J53k45J19r3J87p2K36k41J97k59J96P1k41J45k5N3k12j3j5J38l0N9
$$ 75 44 -49 104 -141 -22 -115 72 0 236 -5 192 -67 129 200 -41 104 79 132 -80 -93 -108 30 0 59
4340E9q0M3j9l8N7N2j74N0K01m4r3N7M5r1Q6j03JM5o3j26qJ21K72k54P3p0q9j6
$$ 59 -21 22 3 -35 22 74 -100 -50 151 107 14 71 116 25 111 8 9 54 -9 -135 -143 -22 250 -4 69 -1 -90 -106
4368a06J65k14J83j00J66j65p3J39N9l4j01J00r3K6k8K4R5p2O3P8j31k00J55J20
$$ -106 59 -155 28 -72 94 -71 -144 -5 54 20 -81 19 -74 -48 -76 -52 43 -29 34 112 -19 -219 -64 56
4392E6j31J51q3K2j87J05J6O0j03n3K76o7j17k3J55m5j62O5J3J08J58k21L4J32
$$ 56 -75 76 -7 15 -172 -67 -51 9 -94 -147 129 62 -55 -78 77 32 -130 -65 -52 56 214 -7 27 159
$$ [...]
8191A21
##END NTUPLES=NMR FID
##END=
