##TITLE=1H_Pr 53-dep
 DMSO
 8 sc, 
 28.10.2022
##JCAMPDX= 6.0         $$ Bruker NMR JCAMP-DX V2.0
##DATA TYPE= NMR FID
##DATA CLASS= NTUPLES
##ORIGIN= UXNMR, Bruker Analytische Messtechnik GmbH
##OWNER= root
$$ XWIN-NMR		Version 3.5
$$ Fri Oct 28 13:57:13 2022 Russian Standard Time (UT+4h)  she@DPX200
##.OBSERVE FREQUENCY= 200.1313499994
##.OBSERVE NUCLEUS= ^1H
##.DELAY= (6, 6)
##.ACQUISITION MODE= SIMULTANEOUS
##.ACQUISITION SCHEME= undefined
##.AVERAGES= 8
##.DIGITISER RES= 18
##SPECTROMETER/DATA SYSTEM= spect
##.PULSE SEQUENCE= zg30
##.SOLVENT NAME= DMSO
##.SHIFT REFERENCE= (INTERNAL, DMSO, 0, 15.7039)
##AUDIT TRAIL= $$ (NUMBER, WHEN, WHO, WHERE, WHAT)
$$ ##TITLE= Audit trail, XWIN-NMR		Version 3.5
$$ ##JCAMPDX= 5.01
$$ ##ORIGIN= Bruker BioSpin GmbH
$$ ##OWNER= she
$$ F:/spectra/data/she/nmr/H-F/1/audita.txt
$$ ##AUDIT TRAIL=  $$ (NUMBER, WHEN, WHO, WHERE, WHAT)
(   1,<2022-10-28 13:55:54.60 +0400>,<she>,<DPX200>,
      <created by zg, POWCHK disabled, PULCHK disabled
       configuration hash MD5:
       00 E9 B6 7A A2 85 ED C7 34 08 36 98 17 FE 4E 26
       data hash MD5: 16K
       66 1E E0 1F 36 92 7F B4 11 3B 99 2B CD 89 65 03>)
$$ ##END=
$$ 
$$ hash MD5
$$ B0 1F 88 D7 75 B3 3C E1 FF DB EF D2 DE 99 0B EA
##$RELAX= 
##$RELAX= 
##$RELAX= 
##$RELAX= 
##$RELAX= 
##$RELAX= 
$$ Bruker specific parameters
$$ --------------------------
##$DU= <F:/spectra>
##$EXPNO= 1
##$NAME= <H-F>
##$PROCNO= 1
##$TYPE= <nmr>
##$USER= <she>
##$AMP= (0..31)
100 100 100 100 100 100 100 100 100 100 100 100 100 100 100 100 100 100 
100 100 100 100 100 100 100 100 100 100 100 100 100 100 
##$AQSEQ= 0
##$AQ_mod= 1
##$AUNM= <au_zg>
##$AUTOPOS= <>
##$BF1= 200.13
##$BF2= 200.13
##$BF3= 200.13
##$BF4= 200.13
##$BF5= 200.13
##$BF6= 200.13
##$BF7= 200.13
##$BF8= 200.13
##$BYTORDA= 1
##$CFDGTYP= 0
##$CFRGTYP= 5
##$CHEMSTR= <none>
##$CNST= (0..31)
1 1 145 1 1 1 1 1 1 1 1 1 1 1 1 1 1 1 1 1 1 1 1 1 1 1 1 1 1 1 1 1 
##$CPDPRG= <>
##$CPDPRG1= <>
##$CPDPRG2= <>
##$CPDPRG3= <>
##$CPDPRG4= <mlev>
##$CPDPRG5= <mlev>
##$CPDPRG6= <mlev>
##$CPDPRG7= <mlev>
##$CPDPRG8= <mlev>
##$CPDPRGB= <>
##$CPDPRGT= <>
##$D= (0..31)
0 1.2 0 0 0 0 0 0 0 0.06 0 0.03 0 0 0 0 0.0002 0 0 0 0 0 0 0 0 0 0 0 0 
0 0 0 
##$DATE= 1666950953
##$DBL= (0..7)
120 120 120 120 120 120 120 120 
##$DBP= (0..7)
150 150 150 150 150 150 150 150 
##$DBP07= 0
##$DBPNAM0= <>
##$DBPNAM1= <>
##$DBPNAM2= <>
##$DBPNAM3= <>
##$DBPNAM4= <>
##$DBPNAM5= <>
##$DBPNAM6= <>
##$DBPNAM7= <>
##$DBPOAL= (0..7)
0.5 0.5 0.5 0.5 0.5 0.5 0.5 0.5 
##$DBPOFFS= (0..7)
0 0 0 0 0 0 0 0 
##$DE= 6
##$DECBNUC= <off>
##$DECIM= 32
##$DECNUC= <off>
##$DECSTAT= 4
##$DIGMOD= 1
##$DIGTYP= 9
##$DL= (0..7)
0 120 120 120 120 120 120 120 
##$DP= (0..7)
150 150 150 150 150 150 150 150 
##$DP07= 0
##$DPNAME0= <>
##$DPNAME1= <>
##$DPNAME2= <>
##$DPNAME3= <>
##$DPNAME4= <>
##$DPNAME5= <>
##$DPNAME6= <>
##$DPNAME7= <>
##$DPOAL= (0..7)
0.5 0.5 0.5 0.5 0.5 0.5 0.5 0.5 
##$DPOFFS= (0..7)
0 0 0 0 0 0 0 0 
##$DQDMODE= 0
##$DR= 18
##$DS= 0
##$DSLIST= <SSSSSSSSSSSSSSS>
$$ [...]
##$SUBNAM2= <"">
##$SUBNAM3= <"">
##$SUBNAM4= <"">
##$SUBNAM5= <"">
##$SUBNAM6= <"">
##$SUBNAM7= <"">
##$SUBNAM8= <"">
##$SUBNAM9= <"">
##$SW= 18.0517283424941
##$SWIBOX= (0..15)
0 0 2 0 0 0 0 0 0 0 0 0 0 0 0 0 
##$SW_h= 3612.71676300578
##$TD= 16384
##$TD0= 1
##$TE= 0
##$TE2= 300
##$TE3= 300
##$TEG= 300
##$TL= (0..7)
0 120 120 120 120 120 120 120 
##$TP= (0..7)
150 150 150 150 150 150 150 150 
##$TP07= 0
##$TPNAME0= <>
##$TPNAME1= <>
##$TPNAME2= <>
##$TPNAME3= <>
##$TPNAME4= <>
##$TPNAME5= <>
##$TPNAME6= <>
##$TPNAME7= <>
##$TPOAL= (0..7)
0.5 0.5 0.5 0.5 0.5 0.5 0.5 0.5 
##$TPOFFS= (0..7)
0 0 0 0 0 0 0 0 
##$TUNHIN= 0
##$TUNHOUT= 0
##$TUNXOUT= 0
##$USERA1= <user>
##$USERA2= <user>
##$USERA3= <user>
##$USERA4= <user>
##$USERA5= <user>
##$V9= 5
##$VALIST= <valist>
##$VCLIST= <CCCCCCCCCCCCCCC>
##$VD= 0
##$VDLIST= <DDDDDDDDDDDDDDD>
##$VPLIST= <PPPPPPPPPPPPPPP>
##$VTLIST= <TTTTTTTTTTTTTTT>
##$WBST= 1024
##$WBSW= 4
##$XGAIN= (0..3)
0 0 0 0 
##$XL= 0
##$YL= 0
##$YMAX_a= 161459
##$YMIN_a= -224355
##$ZGOPTNS= <>
##$ZL1= 120
##$ZL2= 120
##$ZL3= 120
##$ZL4= 120
##$ABSF1= 10
##$ABSF2= 0
##$ABSG= 5
##$ABSL= 3
##$ALPHA= 0
##$AQORDER= 0
##$ASSFAC= 0
##$ASSFACI= 0
##$ASSFACX= 0
##$ASSWID= 0
##$AUNMP= <proc_1d>
##$AZFE= 0.1
##$AZFW= 0.1
##$BCFW= 1
##$BC_mod= 2
##$BYTORDP= 1
##$COROFFS= 0
##$CY= 11.3945322036743
##$DATMOD= 1
##$DC= 2
##$DFILT= <>
##$DTYPP= 0
##$F1P= 2.36226072786647
##$F2P= -0.459571619588291
##$FCOR= 0.5
##$FTSIZE= 0
##$FT_mod= 4
##$GAMMA= 1
##$GB= 0.15
##$INTBC= 1
##$INTSCL= 1
##$ISEN= 128
##$LB= 0.24
##$LEV0= 0
##$LPBIN= 0
##$MAXI= 10000
##$MC2= 0
##$MEAN= 0
##$ME_mod= 0
##$MI= 1.114404
##$NCOEF= 0
##$NC_proc= 0
##$NLEV= 6
##$NOISF1= 3.799351
##$NOISF2= 2.8
##$NSP= 1
##$NTH_PI= 0
##$NZP= 0
##$OFFSET= 15.70392
##$PC= 1
##$PHC0= -18394.99
##$PHC1= 13.4007
##$PH_mod= 1
##$PKNL= yes
##$PPARMOD= 0
##$PSCAL= 0
##$PSIGN= 0
##$REVERSE= no
##$SF= 200.130013532006
##$SI= 16384
##$SIGF1= 3
##$SIGF2= 2
##$SINO= 400
##$SIOLD= 16384
##$SREGLST= <1H.CDCl3>
##$SSB= 0
##$STSI= 0
##$STSR= 0
##$SW_p= 3612.71676300578
##$SYMM= 0
##$S_DEV= 0
##$TDeff= 0
##$TDoff= 0
##$TI= <>
##$TILT= no
##$TM1= 0
##$TM2= 0
##$TOPLEV= 0
##$USERP1= <user>
##$USERP2= <user>
##$USERP3= <user>
##$USERP4= <user>
##$USERP5= <user>
##$WDW= 1
##$XDIM= 8192
##$YMAX_p= 0
##$YMIN_p= 0
$$ End of Bruker specific parameters
$$ ---------------------------------
##NTUPLES= NMR FID
##VAR_NAME=  TIME,          FID/REAL,        FID/IMAG
##SYMBOL=    X,             R,               I
##VAR_TYPE=  INDEPENDENT,   DEPENDENT,       DEPENDENT
##VAR_FORM=  AFFN,          ASDF,            ASDF
##VAR_DIM=   8192,          8192,            8192
##UNITS=     SECONDS,       ARBITRARY UNITS, ARBITRARY UNITS
##FACTOR=    0.0002768,     1,               1
##FIRST=     0,             0,               0
##LAST=      2.2672688,     0,               0
##MIN=       0,             -224355,         0
##MAX=       2.2672688,     161459,          0
$$ Real data points
##PAGE= N=1
##DATA TABLE= (X++(R..R)), XYDATA
$$ [...]
1800a56K03N2m63N46j05l20K53j40Q0N7j79K87j06n53R97m27k99M28l63L36l6
1821I2K3K95q24O4P19n54K35Q8l67K99k50N2K03m33L62K21l62L18k39M3K26n42
1843c31M77p3k44L52k54p2O80q53K24N33o38K59j7j57K98l78K41K07p02O97k88
1864c9q5M89m39O1J28j72K10l82L2O28n47L15J6o25O92k53k33N05l81n1M04n77
1886c04L51J87o00N33l05j09L71m59J79M16n28L22k8j16L80o48L73L9j05J55q5
1907A9j84L20j53K50j51n95P21k21k14N64n89J74J72m26O02l50l57M85k12J47
1927BJ69n62N48m3l60O20m96R0K90m35N39k11o13N77k08KL08n79M98k0l96O91
1949D11p27Q6N91o17J72J49j22K14o8k26K44l51L58Q0p00O09j7k8J85m64K99R7
$$ y = [-156, 47, 99, -364, 182, 77, -243, 10, -130, -50, 7, -172, 115, 9, -544, 453, 26, -273, 155, -208, 128, 92, 115, 410, -414, -350, 369, -185, 50, 138, -229, 70, -180, -128, 75, -358, 4, 225, -137, 181, -58, -15, 211, -331, 146, 73, -171, 181, -73, -145, 535, -318, -94, 439, -199, 60, 43, -114, 184, -194, 47, 254, -448, 249, -39, -124, 365, -74, -13, 115, -57, 153, -229, -197, 431, -116, 199, 215, -410, 282, 29, -204, 301, -80, -131, 273, -304, 47, 234, -366, 167, -138, -247, 124, -335, -156, 260, -268, 54, 26, -90, 290, -358, 15, 54, -51, 104, 19, -165, 155, 2, 252, 101, -494, 227, 6, -208, 356, -233, -59, 113, -313, 289, -61, -418, 67, -145, 2, 171, -391, 157, 114, -246, 374, -122, -32, 258, -177, 362, 151, -462, 115, -93, -91, 217, -362, 136, 116, -280, 411, -316, -230, 361, -256, -84, 65, -57, 157, 89, -137, 107, -244, 114, 194, -506, 103, 86, 58, 243, -221, 78, 175]
1971A75j85J39l76J05K04j40r5N89q68P52l37k16M40l75K22K44n69M42j27o9K00
1992A55m55M22n3m69L56j24k28M60r3j35M60m70K33r2k01M09m78J40O48p18N88
2013C55k79l78M30l36K35K2l12N69m51p5N65o23K89R8l28J31L22n31M48l62J74
2034c7K9k26N36j56m43M18k95L62J20m58R6J93l21R4J33r9R8k68J94R3k63M08
2056B08j93r1L26k37l01O06m67P3j82K16L29n09O34Jo74N25l72j56M66k20k87
2077c05K46l50L49N2k10M49o18L21N11q00M97j92k30N58k05k29K71l08O6K20L7
2098A30r5k33J34L79n10Q6M99q35Q08l88KL24l93N0K88k03K37l45l27P38o25J67
2120a12L16n39M44J3l37L71j63P1pM2R2l23P6M9n0K02J9l63J87J65m09L90j25
$$ y = [175, -10, 129, -247, -142, 62, -78, -173, 416, -452, 300, -37, -253, 187, -188, 34, 278, -291, 151, 24, -45, 155, -300, 122, 69, -400, -44, -168, -396, 64, -29, -164, 296, -174, 59, -33, -234, 175, -303, -163, 485, -233, 355, 76, -302, 128, -208, 27, 49, -263, 306, -145, -220, 345, -278, 11, 109, -219, -88, 234, -297, 151, -211, -37, -8, -234, 302, 146, -297, 121, -174, 188, 308, -150, -54, 139, -182, -88, 45, -54, 44, -224, -30, 63, -200, 208, 15, -76, 250, 13, -288, 318, -149, -76, -258, -42, 287, -222, 412, 413, -261, 264, -108, -264, 202, -18, -305, -59, -409, -60, -8, -218, 231, -387, -66, 445, -355, 142, -50, -280, 278, 73, -156, 115, -193, -127, 93, 130, 35, -198, -64, 315, -195, -109, 390, -445, 363, -25, -23, 301, -92, -42, 246, 43, 280, -65, -392, 346, -279, -112, 204, -335, 109, 122, -215, 156, -7, 64, 57, 99, 191, -132, -56, -7, -57, 145, 164, -199, -12, 153, -256, 134, 9]
2143Ij60K20l19M11o0k45P4L0m8N43o06K56Q0j36R7l37J8L39j92n1P1l48Q96n56
2167a4l1Q6n61P29j81k35L39n8j78L72l80nJ06l35O39j14k98K09m48O62O5o00
2189b31M22k17l03N22p8r5jk02M02J6l08K77l03k70O06n69K93J52k09M2j14K68
2211A00R7m28M21n3n06O64l67j63K64k12M76j84j04K02j30j32K79n07M44m0l63
2232b42N49m04k45M45k13r6K24k7L40m62O1J92l20K04J24k66j48K30jK65j89j92
2254a71L59l17K41j90Q9J17k04k7M33m74J82J38n78N47l44Q3L83l29P0J5j57L38
2276B04k16m6J62l43P6J53k24J58k8r4M62l59L50k91j00L26l20k32P41n38P5K97
2298B13m44M42l61J52Q9o7j58M4rK67j14p1L16m55J79K12l74J81J30m18P75n47
$$ y = [9, -151, 69, -250, 161, 101, -144, -70, -40, -88, 455, -151, 105, 185, 49, 146, -191, -173, 166, -26, -77, -6, -354, 542, -14, -45, 41, -520, 209, 28, -207, 132, 74, -104, 268, -112, -117, -11, -346, 293, 179, -119, 90, -358, 304, 369, -231, 191, -26, -329, 193, 115, 20, 19, -183, 219, 235, -73, 204, -99, -369, 237, -332, -39, 113, -96, -54, -168, 100, 197, -231, 190, 137, -369, 295, -72, -235, 29, -183, 293, 109, 5, 207, 77, -55, 224, -283, 161, 121, -242, 307, -97, -342, 103, -110, -206, 18, -9, 331, -131, -70, 122, -198, 6, 130, -136, -284, -54, -55, 210, 21, -171, 188, -129, 112, -78, 11, 128, -76, -103, 330, -144, 38, 176, -402, 145, -199, -116, 267, -62, 8, 23, -134, 204, -12, -58, 104, -239, -163, -10, -234, -76, -104, -198, 264, -95, 255, -36, -136, 190, -130, -362, 379, -159, -84, 213, -231, 211, -150, 2, 91, 24, -134, -90, -99, 168, 54, -17, 299, -156, 23, 235, -139, 42, 172, -246, 529, -18]
2320a8k23L01k92L72k46qL55l52j4L41m68K93J97n12M77j67J50o4l51M14k46k10
2342b71N28k15j38K86l93M45k45l76P24m52kL34m46L16o7L6K77k84n9R9l03L05
2364I9j18k68M51k26r1L18j40j64J83k99K76L03k33J81k21m1K54o63M88r6j11
2385a18K65l92M5K75k13J88P7k74K5J1j12L25r7N5k76J16J37k81K05P6j29m5R9
2408c8l32P82m11j56L43l21K96k36k59M69j0l60N49m95J85N1l06K52k85ML83j91
2430h6J22J94m86L71j78L6L29k38j40J09j64O0j51n1M24j98N7k59M9L59k63j35
2452b39K05M0r9J83l70M09q6j88K26k9j47L42n33L34J16k63L28n09J56L30m59
2473b53J12K64l13L26j3j37K69l30J78j04p8K23k46J16O2k56L46k5j51J38q1j50
$$ y = [-18, -241, 60, -232, 140, -106, -114, 241, -111, -125, 216, -252, 41, 238, -274, 203, 36, 186, 122, -229, 185, -61, -271, 257, 42, -96, 190, -203, 242, -3, -379, 345, -107, -109, 225, -221, 95, 28, 64, 341, 57, -2, 97, -206, 99, -19, -287, 164, -62, -153, 165, 25, -139, 44, -255, 21, 324, 91, 272, 51, 10, 264, -399, 89, -7, -118, 147, -245, -200, 75, -138, 50, 127, -147, -122, -111, -223, 102, 5, 60, -216, -100, 37, -244, -39, 37, -92, -137, -38, -370, 412, 1, -155, 188, -133, 163, -73, -332, 137, 127, -233, 316, -179, 6, 57, -249, 3, -282, -278, 105, -86, 36, 230, -256, 115, -63, -27, 302, 64, -76, 33, -131, -71, -222, -273, 151, -47, 10, -249, -200, 159, -104, -239, -34, 6, -93, 90, -280, 129, 43, -145, 81, 52, -95, 247, -286, 48, 164, -99, 229, -280, -124, 206, -253, -141, 123, -190, 136, 123, -14, 255, -75, 103, -1, -79, 144, -102, 14, 76, -180, 166, 141, -10, 128, 47, -103]
2495a03K95k28M07j93k89J11Q4k9P7k22j03L29k99K45j32k43M76l59L57k2l94
2516b35L31j03l52N58k26j61K27L0o7R8l59L87k82J09j2j66K58N3k6l0j82o4O53
2539D39n39P5m1J8K56p5k46K22k42L04n8p1Jp0j32M08k30J22l5j79J08k63M3M24
2563B39m25K06K39k07J09j79m2L21k97k11R7J91L0j21j37M86l19Q2j38m43Q02
2584B83p8p8p8j99n2J88j92L41k00J70J24n6l12Q3k62M82j31k51M67o7j47J43
2606A78m18R9rJ95R6k99k58L43j41K92J06m69Q7J5K42K72m24J95k9l14N6M19l75
2629a41K68K6m61L79j38P3n0l6L03k03j43J81k86J33J38j6k4j48O2K99l77L62
2651B01m6m3p4P7k6k74R3N52n87Q4R0j11j16K85j94J3K94m55K64n4j4j4j32K90
$$ y = [-103, 192, -36, 371, 178, -111, 0, 84, 55, 132, -90, -193, 136, -163, 82, -50, -293, 183, -176, 181, 159, -235, 96, -7, -359, 199, -27, -188, 39, 69, 2, 100, -259, 128, -154, -45, -57, -223, 35, 88, 62, 32, -150, -214, 439, -100, -25, -66, -48, 208, 133, -113, 109, -133, 171, 113, 42, 43, -27, -159, 249, 19, 141, 106, -73, 35, -228, -185, 239, -186, 20, 259, 52, 161, -18, -60, 261, -36, -247, -150, 41, 71, -50, -187, 299, -20, 62, -76, -519, 283, 205, 127, 49, -150, -202, -14, -206, 135, -65, 105, 229, 173, -139, -56, -318, 164, 33, -218, 249, 182, 35, 178, -240, -141, -150, 45, 141, -158, -416, -73, -214, 78, 184, -285, -198, -183, 59, 331, -93, 102, 73, -241, -185, 234, -141, 127, 153, -308, 71, -67, 6, -44, -80, 223, 20, -123, 58, -228, -95, 43, 27, 3, -145, -83, 216, -161, 201, 155, 112, 38, 115, 89, -185, -92, 460, -127, -43, 47, -64, -180, 105, -89, -76, 218, -237, 27, -27, -41, -55, -187, 103]
2675A03j69r9J95p6j18L39j00k90L42j28J11j80j01K66m76N59l17j15L85l57M04
2696A78j74r3J14Q5j00J90k44k4N3K9k34J56r1J77P2j67K71k45k1J95m05M74l29
2719a33KJ15K56j49J39l41J54L4j39L00j74r2J95k88kN1N3J03n06M54J91n34J34
2742a77K53k18K56j86J34m0mj59m3J60J29p0K42j41p4p5P4j81J95j20J27J89k76
2765ek45K81j06J44k20K21K65o32L33L8l39L82J27k17K20l53J26K90l08n9J22
2786F5n8Q2j32J16O7k27J18J84k76J51R2q0l64J40J47j03K75j42r0j65M6J42J10
2809I8l42j7M52o0m9P0m14K99K39m98K26J60j44L9N2k77K26j3Q2r0p4K30K7l05
2833h3oj31L62j43j98N33k74R3m6j23mL09k01Pj09o0M16m42J12j57r6K76J25J8
$$ y = [103, -66, -165, 30, -46, -164, 175, 75, -215, 127, -1, 110, -70, -171, 95, -381, 178, -139, -254, 131, -226, 178, 4, -89, 25, 110, 10, 200, -44, -68, -15, 14, -220, -64, -155, 22, 94, -73, 198, -47, -68, 127, -278, 196, -133, -131, -16, 240, 91, 230, -111, 43, 77, -62, 238, 64, -28, 167, -121, -123, -72, -19, 84, -422, 32, 223, -311, -177, 76, -142, 114, -72, 62, 22, 18, -141, -184, -24, 105, 35, 277, 136, 62, -13, 61, -120, 75, -45, 82, 271, -5, -250, 31, -75, 69, -151, 70, 335, -297, 36, 74, -265, 117, 244, 27, 247, -106, 20, 310, 2, -57, 65, 7, 89, -43, 73, 140, -87, 31, 215, -61, 90, 182, 102, -262, -122, 25, -78, 197, 55, -35, -200, -154, -12, 98, -244, -261, 191, 131, 82, 152, -262, 37, 276, -222, 4, 164, 20, 59, 111, -166, 60, 47, 129, 39, -35, 195, 222, -83, -89, -220, 142, -1, -199, 334, 60, 153, 107, -16, -20, 289, 88, 95, -14, -74, 342, -100, 12, -145, -241, 35, 160, 178]
2857A78l02P6J95j94J14K97k32l02P3p9K3K36l50M02k57j29M20l73J67j03j33
2878b73M44j88k42J73J76j4j06M2K35p3l64K63j15J02J57l64L71m54J71K72m85
2899b72K64m8k89K29J59M7L7n3m9q3j60L88k79NL09l79L35Pj81J08K50k79K71
2922C37k95J9j31j43M18m06L21J00l91J72m3j23L07k73l5J60j45J38R2j51R6J4
2944C8l62M29o6k24K82k07J01R5m02K91j23K39J29m60J46J46j33k8J17p9O4j66
2966a73J99J10l85J67K33l66M85m92L15N6r8k3J34k04K70p3j59J03l76N11l12
2987g8K97j25l93J43K68k2p6N8Q2j6k85K6J94m68M16k0k63L11J19k9j01q1J43
3010A00J22k26m3k06N2K71R1j37M9k26L27M6n20N74l36P2j89P5K79o8%J56l04
$$ y = [178, -124, -48, 147, -47, 67, 364, 132, -170, -97, -176, -153, 83, -267, 135, -122, -251, 169, -204, -37, -140, -273, 171, -17, -259, -86, 90, 76, -30, 12, 247, 174, -190, 73, -42, 60, 217, -147, 224, -230, -59, 213, -272, -8, -56, -345, -116, 43, 90, 127, 74, 25, -58, -218, 170, -109, -104, 205, -174, 161, 168, -13, 95, 345, 66, 337, 42, 61, -70, -213, 205, -201, 120, 220, -171, 1, -42, -165, 142, -131, -166, -6, -151, -13, 79, -72, 24, 38, -324, 105, 39, -185, 97, -110, -9, 86, -316, -25, -148, 91, 220, -240, -94, 52, -81, -109, 8, -71, -7, -173, 26, 136, -249, -82, 151, -215, 270, -222, 93, 149, 51, 28, 162, -42, 228, 155, -4, 99, -277, 234, -78, 219, 94, -299, -156, 112, 90, 14, 72, 154, 138, -147, -121, 73, -395, 21, 1, -262, 49, 168, 139, 38, -43, 100, 222, -4, -47, -253, -201, 70, 161, 24, 73, -153, 174, 220, -300, 274, -62, 10, -179, -104, 175, 107, 107, 263, -41]
3033d1Q0k0l05K53J07j23J48j39J53J19n28K74J31l09L22k29J8K88m08K30k21
3054b00J48O9K4N7j58J96j82K79k58J46k55J35M4j88M4J83j10r4o6qJ56J07j04
3077c5L20k84O3J92l91K4J71n8m4J3J0j02k61O67l76K13M6j59K27p4l3k17m2K53
3101A23J22l98K48j27j7J66l39K87P5m6L9j9r0J32k11m1K55m01L12l08j08L52
3123Fr4K02j62Q7M8L5m7J65k21k36N46l63L00k78r3K23j59J14J36j92j9J6j47
3146a33J66j10J38pj90L56j68l16L19r5j36L39j33K6J80j84J8o3j25K2N7M6N1
3169E8k86J14J19j69M37m43P3K77j45j09J75k82K8L5L26P2m11K75k17k7OR3J7
3192A6oj08K23k76J72J51m4k55L62k63N9K04m66K85l97J79K38J07o8j95j02J98
$$ y = [-41, 39, 19, -286, -33, 74, -49, 99, -40, 113, 232, -296, -22, 109, -200, 122, -107, -89, 199, -209, 21, -200, -52, 17, 41, 98, -60, 136, -46, 233, -25, 121, -134, 1, 45, -143, -99, 84, -26, -120, -186, -194, -38, 69, -35, 285, 1, 64, 256, -135, -111, 60, 2, -42, -29, -19, -121, -382, 285, -91, 122, 168, 9, 236, 162, 129, -88, -130, 123, 245, -153, 95, -32, -49, 117, -222, 65, 140, 94, 133, 114, 24, 156, -55, -96, 159, -242, 70, -238, -346, 6, -88, 114, -48, 39, 87, 122, 75, 240, 19, -217, 329, -34, 266, -12, -105, 118, -41, 73, 209, 17, -2, 14, -133, 33, -77, 61, 54, -136, 220, 52, -264, 55, -40, -176, 163, 30, 56, 236, 52, 70, 7, -118, -96, -39, 7, 58, -228, -114, 5, -164, 273, -170, -97, 180, 35, -74, 101, -181, -153, -118, 208, 280, -131, 144, -73, -100, -94, -1, 16, 10, -98, 125, -151, 21, 172, 128, -127, 235, -28, 31, 235, -231, 54, -343, -164, 74, 181, 113, -82, -184, 14]
3214A4m1P7j8k02P6J76j63J47J99l91R8q0m2J42k61L55j29k20J90O5q6N60n56
3237i0J08K76l63L45k58q1R5j36p3J80R7R8k84j34L38l10K41J39k14j98J80p7
3259a21J26j52M8L57l60J75J12j59r4K29q3kj34K86l04r3J92J53o2P2j60qJ35
3282A53k80L49m2o2o6j06Q9k4l30M59O3l00n7L91j20p6j20J23p5Q2n7j89K60p0
3306el7p9J18JJ32k03J11J54l79L44j66j05O2o1J06n0p8K07j63P5K08k50J97L8
3330A77m24L32j92J94Q3k63J16K80m53J25J0L7K20l64K57J5l07L98k26ln9K17
3352A70j14r7J53k51J77k36J73n4j9K02p9j26J84k75J29k91N56J31l33M5m5o2
3374f2P0o2r3M09l70Q4L26m03k09O03l83J9O6j40P3j27L88j4j75j9k5P8L4j87
$$ y = [14, -27, 50, 32, -170, -94, 82, -81, 66, 265, -126, -28, -108, -150, -8, -269, 86, -43, -263, -73, -8, -94, 466, -90, 18, 294, -69, 276, 18, -63, 32, -104, -177, 3, 100, 198, -86, -220, 118, -192, 49, 188, -26, -224, -44, -121, 5, -147, -99, 258, -102, 73, 185, 26, -68, 161, 78, 76, -58, 228, -76, -169, 23, 176, 114, 186, 26, 18, 153, -127, 222, 180, 118, 52, -54, 35, 11, -319, 140, 203, -97, -154, 237, 117, 41, -79, 44, -31, 51, -6, -195, 65, -5, -42, -121, -3, -2, 130, -73, 38, 192, -187, 157, -9, -114, -52, -113, -7, -57, -135, 72, -91, -16, 192, -58, 139, 177, -247, 85, -107, 87, 170, -93, 23, 303, -150, -25, -15, 22, 242, -122, 135, 150, -157, 241, 15, 12, -47, 170, 56, -41, 112, -139, 38, -198, -25, -79, -98, 104, 25, -101, 83, -192, -63, -354, 202, 333, 0, 45, 0, -62, 8, -54, -147, 262, -108, -24, 302, -101, -310, 293, -90, -71, -5, -145, -72, -199, 189, 175, 0, -19, -44, 34, 68, -119]
3398a19K02j6n7R1j67P8l1k00J40Q1r1k5Q8n3K20m53M40l57jL22j90j1K94k18
3422c3P0j52n5L35o1R7k02K7N5m3k00K71k07J06J0k44L22J51k54L1j72K47o8j82
3446a51K70j86J04NJ54j32j97P3J85j36j69K68K1k72J62M4M7K9q4J62K5k63J35
3469I4m5o8K07k56R2k7j19J62k5O4Qn7J78k40l1n5p0K5K90k11jO9j9j06Q3J51
3495I3ol15J81J20j10L03k91o5K58l15K13m1l13M71l21l4J67j7J89K25l28Mn3
3518A5k7J47k85L81J1k29K24j88l99J07J36J10R2l82N58j65j34R0k30L40m0n03
3540c71O47j32n6j01Q6O7j1j88K87j92k97J82J89K1j21r3M2O5l53J81K60R0j64
3563C8j81M50j51p3j40k2n2J68p8L52l39o8J24q4KK42n17K06J55q1L0M6Q6L62
$$ y = [-119, 83, 67, 10, 101, -66, 12, -19, -219, -79, 2, -89, -114, -26, -79, 141, -312, 128, -229, -230, 92, -98, -109, 185, -33, 37, -115, -170, 165, 104, 201, -1, 26, 81, 38, -162, 109, -98, 8, 18, -226, 96, 247, -7, 24, -148, 99, 31, -151, 119, -67, 37, 42, 196, 64, -133, -60, 125, -11, -180, 88, 109, -163, -1, 43, 90, 119, 35, 197, 222, -41, 94, 49, -19, 188, -68, 24, -3, -122, 40, 15, 79, 87, 30, 208, -32, -63, -118, -188, -163, 127, -84, -85, -16, -35, -141, -58, 93, 87, -228, -47, 73, -37, 266, -25, -90, 168, -147, 66, 25, -288, 183, -138, -172, -5, -22, 167, 392, 64, 68, 15, -12, 135, -150, 231, 242, 13, 237, 49, -350, -243, -107, 3, 95, -287, 271, 106, -28, 62, -168, 172, 132, -371, 276, 144, 88, -13, 73, 140, 129, -59, 228, 36, -261, -79, 110, 131, 10, -83, -41, 24, -329, -148, 112, 202, 38, -143, 307, 156, 83, -57, -79, -131, 37, -41, 311, -28, -96, 28, -56, -54, 188, -329, -123, 32, -49, -19, 27, 113, 475]
3587D75p17M57M5m33K31q3k1L7J73j40j5J86l6k36j26K96k27j7K46L5j27R3J86
3610B82j53j43k52K16J58K25l77L0K14k8l96O30o76O0L70n89P34n36K81P7n09
3631c82L38j7k01K82J39o5J6j71J40q5j00K15k23m1J86k73L05k07N1pK38n1k65
3654a78k3M7J41n5K53j12j83J79k12J64K61k45j59J7L92j62k60J56J40m27L39
3675G3J16k15L10l28P5l3Kk6K73k22j42R1o7J14j81J0K97j39o4O8j6K01m2k08
3699e3K24k69J00Qk75K41k46J78J80j11M3p6j19L54j60k35K43m19O15l33L03Q
3721B01j64r2J92k8j28J3j10L33k97K2M0k03L72%l88K53n2J89j03j13O6Pk26K77
3745F1l75K90Q8j53n5J33n2n7K23L3n4j31J94k75M4J55l3k4K06k23rJ13N2j27
$$ y = [475, -242, 215, 260, -173, 58, -25, -46, -9, 164, 24, 9, 195, 159, -77, -203, 93, -134, -151, 95, 130, 3, 96, 282, 129, -14, -266, -50, 108, 333, -44, -14, 200, 172, -224, 406, -270, -210, 160, -429, 305, -231, 50, 127, -382, -44, -61, -262, 20, 159, 94, 110, -61, 79, -6, -106, 109, -114, -155, 31, -242, 63, -144, -93, -100, 138, 87, -178, -201, -154, -13, -68, 185, 73, -110, 69, -143, 21, 282, 37, -122, -105, 287, 125, -135, 21, 161, -266, 73, 189, -26, 284, -44, 31, -2, 0, -26, 247, 25, -117, -26, -93, 21, -160, -150, 147, 8, -56, 12, -4, 197, 155, -53, 171, -98, 2, 10, -265, -24, -270, -92, 88, -23, 20, -56, -175, 179, 19, -216, 27, -392, 223, -110, 193, 201, 37, -55, 137, 109, -19, -6, -116, 217, -80, -58, -18, -221, 151, 151, -237, 16, -36, 153, 50, -63, 3, 10, -216, 61, -314, -24, 64, -89, -144, -11, -63, -120, 103, 136, 82, -49, 145, -130, -86, 69, 36, 12, 218, -5, -14, 99, 151, 24]
3769B4O0j68L71m78k09L01j0L00j25P5k17R5Q1j80%L10r9k02J29Q4k78Q2m6K10
3793A10r2k8j9J72m0l0k19J14p5R3J31k8j32J7j66J78J1q3J65j17j54J70K13k71
3817h0k4J64j90K65j60n8r4k9L14l21M24j33K24l11j79R0M3j30L07p7k02K75l42
3840b24J44K54l68L56P0l45MJ65k8K47m02M39j84k68K03k8j72J30o9J69j02j41
3862a50J38M9j72J84j09n1J84j72J05p0k10M46l76L90k38l31N68r8k55K54k37
3883a51QK60m18M01l9l89M25k24K44m5j97J49j88Q8K27k92qJ37j02NK38j37J64
3906A56j74k5J28j56O6J76l18K72j77j61K47j51L8J0J94k76J23j07J78j50rL77
3928B61q34O10Kk76K65q0K19kl36L02n0j98L34l31K82jl29J71j58J46J60k56r9
$$ y = [24, 84, -84, 287, -191, -400, -99, -109, 191, 66, 141, -76, 19, 100, -80, -80, 230, 131, -71, 58, 142, -136, -54, -100, 110, 18, -10, -29, 143, 103, 73, -146, -32, -107, -14, 117, 89, -43, -26, -192, -14, -3, -86, 79, -38, -192, -22, 191, -80, -104, 60, -130, 135, -25, -83, -177, -206, 108, -213, 211, 78, 302, -9, -188, -98, -55, -185, 122, 45, -157, 118, -224, -80, 174, -194, 162, 232, -113, -109, 56, 28, 275, -127, 312, 128, -140, 63, 35, -137, -7, -76, 93, -9, -150, -12, 37, -135, 49, -60, -111, 73, -99, 6, -64, -274, 172, -204, 186, -52, -383, 185, 87, -168, 86, -151, -143, 117, -301, 100, 61, -328, 97, -127, 117, 72, -125, 24, -164, -76, 151, -141, -149, -12, -114, -109, 129, -8, 156, -18, -43, 85, -71, -5, 171, -147, 125, -52, -213, 34, -117, -79, -69, 125, -151, -28, -135, 43, -107, -116, 261, -573, 37, 39, -237, 28, -52, 167, 165, -171, 131, 81, -117, 217, -114, 168, 167, -162, 9, -149, -3, 157, -99, -198]
3951a98N85m74L8K55l36K63j13J76k06j28M38k78O3J75j51l97L41j18M9R3j62
3972h5J70k67J87L2r4K60q5k54P2j89K58Q%l2k8j09K56O3j7J0m65N05q4j22K06
3997A96m74K50P4r9J94J13j92l5n9J83m4j35K91j95k48M34j50l08L32j33J33n4
4019G4l01L43K8m08L71k08N2J74j66L3J61k44O2k28L14n0j08Q1J50j13j0J02k7
4042H2J44n22J85J56k07K49q7o9N0j27J2K50l33K68j74L04q0k27R1J82l24K45
4064F8k31q9M52k76K78q2j58q8K5J67n1n5r3K86m82M48k06j69K55n7n9J56l1o0
4088e2j01o4J93j24L12l7k11L4J39j51o8K23K49j20l71L31j70j20J22j90J78K18
4110B20k54r0J30p6M8j6J45m4j46J81k7l41M68m27K32J08Jk69Q3k0L06m20J24
$$ y = [-198, 387, -87, -49, 206, -130, 133, 20, 196, -10, -138, 300, 22, 85, 260, 109, -288, 53, -65, -16, 77, -85, 85, -182, 5, 37, -57, 203, 118, -136, -64, -253, 5, 13, 13, -19, -47, -156, 100, 163, 146, 156, -309, 196, 112, -10, 196, -278, -28, 46, -53, 141, 254, 62, 27, -32, 151, 107, -28, 263, 68, -180, 254, 104, -204, 128, -5, 128, 74, -227, 116, 144, -264, 107, -101, -49, 125, -41, -8, 153, -91, -29, -257, 57, 7, -101, -20, 130, 17, 7, 109, 82, 226, -296, -111, 45, -162, 87, 0, -69, -19, -146, -134, 116, -217, 51, -123, 181, 101, -126, -35, 147, -177, 68, -163, -252, 200, -76, 202, 120, -38, -126, -101, 66, 15, -40, -133, 153, -329, 119, -87, -256, -1, -58, -117, 39, 8, -52, -153, -217, -24, -148, 164, 127, -84, -50, 89, -62, -130, 93, 342, 222, -149, 182, 12, -108, 14, -176, 2, 220, -34, -124, 6, -70, -22, -38, 107, 63, -83, 98, 71, -270, 198, -229, 3, 111, 112, -157, -74, -94, 212, -208, -84]
4133h4J40j67J60J90k66K53j78j72L71j28j80j02K76l08J48j08R8J73j19J99m67
4154b71N55j16k29K85l31J10K7j29P9K85j80j60r3Q3Qk05N78l63m1K10j43j21
4176a62K73q9J3Q8l15M19j48k2m1k23nK47p7J69j12Q1n0l33L89j32k6J94k48J87
4200G7l4O4j72Q0r0j8K40l16L81j92j02J27j10L63k59k43K96l48J23n6m7L30L9
4223A33l25L23k07j06K33k33K17j64J59O2r6j37M48m22kK13j44J11j08Q4K51k60
4245C0l6q3N1K91m64K36j22J36j50L67j51o4j59J05l6J60r2m0j77L63m55K85L7
4268C2P3m0k45J31K34m4l37RK10k29L90L2j24j72j50K31k33L48j1m91N65rk44
4291g4L04l39J66K17m75L50N6o5m13J86j8K8J36j59L6M0K9L5K8K13j55K8j68l1
$$ y = [-84, 56, -111, 49, 239, -27, 226, 48, -124, 247, 119, -61, -163, 113, -195, -47, -155, -57, 116, -3, 196, -271, 284, 168, -61, 224, -107, 3, 30, -99, -20, 265, 85, -75, -168, -85, -77, -282, 296, -67, -108, 102, -41, -162, 111, 22, 35, 123, -192, 227, 79, 57, 16, -207, -212, 35, -42, 127, 15, 96, 46, -287, 102, -30, -56, 138, -110, 77, 43, 107, -65, 15, -75, -93, 147, -169, 212, 20, -82, 45, -65, 298, 39, -204, 92, -256, -133, -189, -236, 94, 133, -192, 131, -76, -182, 51, -182, 35, -129, 30, 92, -4, -141, 307, -115, -117, 96, -48, 63, -45, 39, 290, 30, -6, -89, -38, 253, -211, 25, -97, 39, -111, 256, 105, 41, -118, -13, -49, 111, 19, -21, -198, 165, -290, -5, 32, 105, 65, -180, -49, 185, 141, -196, -187, 23, -206, 184, 216, 92, -80, -230, 1, -232, 116, 105, -386, 179, 170, -74, 230, -109, 57, 274, -201, 149, 205, 140, -273, -87, -105, -77, 59, -100, -64, -24, 5, 40, 68, 281, 126, 154, -14, -45]
4315d5J7J00mN3j95K51j12j10P0N8k23O9J39P7P9l99K39j2k93K06l3K95l56J88
4339E9K5k83L24j34j32K53j07j84L44k42J72j27K04l72M2K9L8K6k74N25k20j40
4361a74K49o7K2K4j06Qn8j5N3J2J62q5r7J53K23l10O8j13J04K57l89J54j60L7
4385d8O2j20K15j37o2J96j45j34L62m17K25L3q5Q3k35N4nL88j85J19j94K56j83
4408D3%P1K7j80K03l13P8R0O6M4k69K69p7k36J53K32m30M06o38L94L66k12k89
4431b02K12n2l2k4K12o6k93K47J09m1j68K02k9l08P9L32o8j60J21j50j07K22O1
4454I7j02r4M8K77j04k24J83J00m4m3j23J03L9m36K13N7nO9j18J79J76l22J11
4477C7k43K76l7K5M2l00J63r0J0M6K26n22M49J3l41K58q7qJ66o0M2L9l92K50l20
$$ y = [-45, -28, 72, 68, 121, -74, 177, 65, -45, 25, 83, -140, -71, 68, 145, 224, -175, 64, 52, -241, -35, -68, 227, -129, 59, 84, -199, 125, -9, -141, 112, 5, -179, 165, -77, 95, -32, 172, -200, -158, -129, -91, -65, -339, 186, -34, -174, 75, 8, 30, 54, -52, -44, -102, -117, -64, -52, 110, 25, -72, 81, 304, -6, 62, -51, 53, 310, -79, 75, -85, -48, 14, -106, 109, -28, -90, 106, -39, -173, 189, -228, -3, 30, -55, 28, -207, -153, -158, 230, 45, 164, -30, 226, 43, 43, 114, 141, -39, 164, -149, -71, 19, 85, 129, -140, 129, 52, -184, -31, 201, -229, 177, -461, -67, 299, 87, -202, 10, -42, -74, -98, 114, 48, -245, 2, 111, 70, -98, 104, 75, -233, -154, 178, 110, -50, 71, -79, -186, 36, 97, -5, -99, -51, 226, 122, -102, 81, 181, 137, 94, -29, 74, 113, -323, -110, -53, -58, 11, -107, 72, 248, -74, 37, -206, 70, 33, 58, 100, -200, -37, -127, -117, -71, 155, -367, 82, 95, -246, 12, -75, -83, 83, 23, 65, 104, -288, -38, -358]
4502c58J69Q5n2L93J05k25J5j70J31J02j85K4q8K13j48j1P7J46k87O6O6l04L54
4525A18k67J04K31l29K93Mk78L80l86P6K58k81n3K15O6k78J54j36P7K4N1J33m97
4548c21L79Q1j29j29P7N4K02k03L6L4l16L87l6m26L88k97K06N0j8J9k65R6K52
4571A21l57N13n70J62K41j49j91K99j28L17J2l45J44P3R2l03j66K47q3j74J19
4592a26Q5j15J76R0r0J04k05K21k49j97K00Q8j73M71k98Q4J4j29J5k3MK57l17
4615a13o5R6J05J63k71J72k29J52P9m4j44J02mk04K57O1l93N08l52K40j02j08
4637i4k0k8K2J15J35n3j06J63kr2k6J08j90K28j65J19o3k11K56M8k42K27J62m37
4661a46M10l55J60L2o6j81K63j42O3rK34k81r9L24k84l4J49N6J34l34r5N6K89
$$ y = [-358, -189, -104, -156, 237, 342, 117, 132, -38, 93, 195, 10, 34, -54, 159, 11, 0, 77, 223, -64, 2, 68, -236, 118, -149, -45, 186, -143, 150, 154, -124, 256, -130, -54, 204, -77, -130, 85, 151, -127, 27, -109, -32, -8, 43, 176, -321, 58, 139, 10, -119, -42, 12, 214, 11, 47, 81, -235, 152, 116, -310, 78, -219, -13, 37, 19, 38, -227, -131, 121, -236, 277, -293, -131, 110, -39, -230, 69, -59, 258, 270, -75, 69, 142, 234, -69, -235, 12, -71, -245, -126, -41, -156, 20, 110, 20, 124, -81, 140, -109, -306, -106, -18, -191, 280, -18, 66, 80, -49, -34, -57, -53, 204, -113, -178, -82, 23, 186, -85, 87, -142, 10, 89, 45, -99, 3, -1, -205, 52, 113, -280, 228, -124, 116, 14, -94, -114, -142, -120, -5, 130, 77, -29, 134, 132, 40, 14, 122, -68, 160, -5, 114, 51, -160, 96, 144, -98, 129, 291, -146, 264, -91, 69, 101, 35, -146, 117, -25, 38, 29, 263, -18, -117, 207, -77, -111, 38, 94, 228, -106, -201, -145, 144]
4684A44o6J81l42j5j72L38j32K82l64J59m8j58L62q1j32R7r1p9K90j21N1j91K89
4707B01r9o4rm4J69j55m6o1R0L6J55j22j24j13J96j48J18J30j93K03l16K15O9
4730H8k4K0J7j14QJ02k32MK41J73l72K13j94j96L09o0j11K87Kk05J99j91J21j64
4754g9n4K60k16K39j00PK9k08k49M50k30K18Q3j48J15P8j93J9k57M03m18J57K64
4777A70j35p2Q7r6P1%k6Nj54M2N1J15k00N35o94M49k60J18l1j98K63rk59K39j46
4802a35L85j36J77k44K32m52K94J4j54r6P1J06M2j25r1L5lJ26j76j41J36J66j7
4825A4O8k11Q7j81K50j73j13N25j84j39k65L36N8j01j19k7N7J49j62n5n6L36l06
4848b12K42r5p1n6K10K13l15k3J11J97l28J57nnl4J1k24L59l49M14P0j25j38R2
$$ y = [144, 78, 259, -83, -98, -270, 68, -64, 218, -146, 13, -35, -193, 169, 88, -44, 53, -38, -117, 173, 52, 103, -88, 201, 102, 38, 29, -15, 154, -1, -47, -108, -18, 18, 173, 51, -73, -186, 10, -138, -20, 110, -83, 120, -196, 19, 88, 64, 84, 101, -13, -5, 97, -135, -131, 110, 283, -89, 124, -70, -266, 43, -17, -128, 159, 161, -44, 155, -36, 85, -79, -133, 127, -89, 150, 50, 57, 86, -122, -371, 79, -151, 67, 150, 2, 117, 195, 2, 21, -236, 167, -251, -94, 170, 35, -37, 50, -46, 25, 25, -1, 4, -150, -108, -57, 58, -142, 393, -301, 148, -112, 6, -25, -223, 40, 31, -228, 11, -135, 250, 114, 291, 47, 279, -173, 121, 135, -19, -115, -44, 62, 104, -21, -112, -77, -80, 46, -130, -271, -135, 31, 14, 82, -129, -42, -223, 27, -146, -259, 266, 82, -57, -322, 14, 72, -29, -148, -175, -118, 31, -131, -186, -242, 94, -212, 30, -65, -136, -192, 18, 231, -84, -107, 4, 201, -127, 30, 25, 20, -14, -3, -227, 132, -217, 197, 267, 142, 4, 96]
4872I6j05p6p9K65J40j66K4l82K35l7J24q4N6j32K70k01n5J10J6j19K73k50J07
4895C0j97J35J70k10L04j32O8j31J38l16J70J1k57L99j56mJ15k21J9J01k3j36
4917a23J06J54j31K5p8Q1j60K14l29Q7K11J8J29m25M0L25k96M29k04j56L09k91
4939f5m9J25j33L20n3j07k73J91j01R0j61L40K61m75R5P0j69J96k35K79k62J36
4961B0m3L7m8K62k40N6l5l25L48K2Op7p7R7L6K4j09k7N8K2J4j7n2K41j93J08j75
4988f7j45K32m2K1M3p2K5r4j77K87J94k82L4J30K5j66K5J2J76q0nQ9j76j07l0
5013a50J9m1lP1K01j65L27q0j95k11M56l39J05q6P8P7Q9Jj22j82P0M6nk20J5M33
5039A89m6j34l1O4k76M39k52O0J17k26J81j90j0J95q9k52K24Rj3k17K93m4l4J5
$$ y = [96, -9, -85, -164, 101, 241, 75, 99, -283, -48, -85, 39, -45, 11, -121, 149, -52, -107, 3, 19, -100, 173, -77, 30, -167, -32, 138, -72, 232, 100, 168, 37, 175, -141, 29, 40, -217, 182, 26, 22, 137, -84, -65, 36, 13, -123, -17, 137, 6, 31, -47, 34, -126, 88, -241, -154, 57, 75, 204, -221, -181, 144, -152, 277, 73, -83, 226, -65, -114, 11, -122, 198, 145, 38, -235, -44, -145, -55, -216, 124, 385, -90, 5, 75, -94, 102, -133, 146, -116, 20, -23, 14, -34, 228, -12, 44, 9, -316, 32, 54, 60, -17, -94, 3, 39, 63, -46, -73, -15, 7, 21, 4, -48, 193, 0, 108, -67, -212, 20, -22, -1, 42, -30, -5, -99, -276, 11, 205, -77, -43, 87, 112, -54, -29, -17, 159, 79, 74, 163, -13, -120, -150, -131, -172, -175, -104, 97, -68, 259, 179, -16, -227, 229, -110, -5, -91, -13, 64, 153, 154, 32, -150, -80, -34, -39, -259, -244, 189, 143, 9, -22, 42, -234, 205, -47, 13, 130, -96, 85, -105, -115, 80, -9, -261, -37, -28, -41, -258, 35, -9, -43, -28]
5063b8R3o1k7J40l05L15k07J8J37j53k2K49j80j27P1j0K39j52j08K09J05k17J40
5086A19j8m9k1J48k46J28j82J24J63L7l10K4J67j34J98k15J84l8k7J25L3m26J85
5109c1J25j81K00Qm1Oj27Q2l13M69j29J7l22L02k38K26J01l35J32n7J04p5m1L20
5133B02j60j14K39R6k56J99j86K6j3J74k66J40o0O9l11J84O5J00j18j34J39l6
5155b1L8J71j90j26N0j16M15l64J42l5j78K8K14l1K37l70L71k36j46J30K7k00
5177a90M9M15l85J18q0Q1j31J32N0k61L13M5j18m7n0J57k49K8J91j40J02k75M90
5200B45K9l65L3O2R5j46J64j62J01J21j58o0L5L93l46k15L86l73K3J46j26L6J31
5223D9pO8j90NJ9J79M0j83j40L34j45j35o0M15n9j51j79K78k02j37L39k18J4Q5
$$ y = [-28, 65, 4, -23, 117, -188, 127, -80, -62, 75, -78, -100, 149, -31, -158, -87, -97, 142, -10, -118, 91, 196, -21, 119, 101, 52, 31, 179, -67, 61, -121, 3, 166, 203, -107, -83, 84, -50, 148, -67, 117, 79, 52, 177, 210, -216, -31, 94, -87, 113, 121, 80, 86, -41, 41, -272, 197, 68, 85, -237, 65, -173, 53, 154, -181, -49, -106, -2, -77, -118, 202, 42, -72, 167, 263, 7, 206, 20, 46, 33, 207, -59, 81, 21, 90, -221, -37, 28, 128, 10, -124, 15, -21, 17, 188, -2, -128, -78, -194, 221, -143, -1, -36, -214, -186, 28, -3, 234, -136, 235, -1, -147, -17, 10, -190, -141, 274, -111, 7, -73, 8, -123, 9, 59, -202, 111, 156, 38, -9, -59, 98, -151, -123, 68, -72, 30, -245, 245, 274, -91, -58, 4, 99, -47, 117, -45, 56, 177, 19, -41, -6, 387, 41, -174, 212, -161, -138, 8, -118, -82, 49, 42, 110, -80, -75, -56, 123, 163, -20, -160, 174, 29, -106, -166, 249, 190, 39, -140, 138, -64, -201, 138, -80, -66, 19]
5247A9J50K34k32j03j7j59Q4M0J20j12L6r6k03K77k27L38j31K54k76J4p4J29K23
5270B88n05L23j05p1j3J39j1n2j67N9K72o6l09K29j04j1l4P1K72r2L1k05km1K06
5295A02J4J1k02o7N3Q5K38n36L46l6O2k32L03M4m4j50M2J39k55q7J33n0J96k26
5319a17L13j42J0k56K42K8o5m9L7j75J43O3Jj70J60m1M2j13K10r2m7J54m7M0j95
5344f6K27j94j23K22j62j18L13q4J25l35K40j99J1J81Q0ko0j17l5L99k60n6J01
5367H8o6R8o0k2J40l47K82Q2n29K02M66m83J35k11L34O7q3j93R9P8J15ll06K71
5391A54m22J61J16j29J9O9o1O4K3O3j53j55L49k8O6m03J85Q8K0n8J65q5k63L05
5415I0r6k38L41j30K56j63l19K07J53o4j81p0J03K83l65L16n9j07K18l16K39N1
$$ y = [19, 169, 403, 171, 68, 51, -108, -24, 16, 136, 24, 60, -36, -239, 38, -189, 149, 18, 272, -4, 10, -64, 65, 288, -217, 106, 1, -70, -83, 56, 45, -7, -174, -115, 157, 91, -218, 11, -93, -104, -138, -67, 205, 113, 144, -61, -63, -104, 102, 116, 127, -75, -142, -89, -4, 234, -302, 44, 8, 70, -162, 141, 185, 141, -9, 33, 172, -83, -170, -37, -87, 109, -117, 196, 54, 64, -192, 50, 78, 13, -36, 1, -174, -31, 32, 33, -137, 23, -18, 24, -89, 121, 29, -18, 136, 89, 129, -66, 161, -33, -156, 66, -96, -214, 99, 15, 140, -195, 45, -154, -143, 38, 118, 116, 56, -61, -96, 303, 43, -13, 88, 22, 120, 60, 38, 178, -169, 113, 195, -334, -132, 334, -149, -14, -225, 109, 176, 93, -100, -1, 77, 192, 189, -117, 154, -268, -107, 9, -120, -101, -32, -93, -29, -6, 57, -96, -251, 98, 70, 136, -267, -82, 6, 26, -32, 133, 48, -215, 90, -6, -244, 97, -33, 223, 60, -259, -52, 101, 37, -144, -214, -111, 172, -193, 123, 64, -43, 175, -141, 98, 149]
5437A49l46L08J5j97oj30K93r0j17o2J56l03K64j8K98j91j1j55J36J65k79K54
5459A33j86LO6k6j83K83k06J73j22O2k4J5L9l00K44R9k85K10J0L2j71J30K76l69
5483i7L9J31J07n74M11J59j94n5N9NK7P8j08N1m8M3j43P3j7m4m6J65m5j3O3l54
5509c27K54J32K9p8k41M65k85L6J7J86k09j07Q8k1J56j65J73o7k5J92r7L6k40
5532i8J29l8J13p2l1j94Q2J57n0J50r8j46K9k9j6N22l65m3j93N7qr3L55j72J92
5557A40l37K34Q1k84J47M6J56L5l63J83o8M1N7J7N1O4l75rJ69L7N2n7j36K01n5
5582B7O4j33q0K53j29m5L16k0l81N9K65l54J4K13O5k42O4J03j07j24K23k47M70
5605B74k25o3J09k23K18o1l5k7l1j35K17J00k31K82J2k13j81J1L64Q7l56j21L16
$$ y = [149, -197, 111, 126, -71, -77, -207, 86, -4, -121, -183, -27, -330, -66, -84, 214, 23, 12, -143, -7, 158, -121, 133, -53, -50, 16, -10, -193, 90, -116, 57, -65, -3, -27, -12, 27, -273, -29, 70, -215, -5, 5, 37, -134, -4, 272, -97, -58, 73, 180, -394, 17, 176, -18, -73, -14, -9, 18, 96, -12, 39, -9, 34, -109, -36, -53, -97, -143, 22, -23, -36, 27, -327, -73, 59, 88, 10, -231, 234, -51, -15, 2, 188, -21, -128, -40, -61, 95, -70, 103, 36, 11, 203, 106, 142, -98, 31, -7, 106, 34, 3, -191, -109, 48, -2, 148, 50, -96, -67, -96, -112, 410, 45, 2, -191, -134, -142, -235, 120, -52, 140, -197, 37, 118, -166, -19, 27, 183, 218, -145, 38, -30, 11, 68, 85, 136, 200, -175, -184, -15, 22, 74, 17, -119, 82, 27, 91, -42, -122, 131, 2, -43, 273, 253, -128, -69, 196, -158, -144, 69, 134, -108, -44, 59, -48, -172, 51, -196, 274, 49, -14, 95, -128, 90, 29, -6, -33, -64, -199, 18, 118, -113, 169, 181, -32, -213, -202, 162, 249, -107, -228, 88]
5628H8j2j00j37K44k57K52K6k15mK28J03l78K86j86L28m37P7j47J13J37L0l5P0
5651G4l11L16J19k18K16l13J29Pk05J22r7j02J90J01k55R1l6L22k90J68M0j46
5673g8r4L24o6p6J44l45K88l53J83L95k43m7rK96j69J54m41k34K91R7m5J8K55
5696B45l50N0J08J08k91K34k00K9Q1k4k10K43rn8R4j36O2J74K5k21K32p0j07N
5720A4O2j58Kp3Q3n1J45p5J42j12K6j82L23k19J0K13k38P1J79l55K07n7k10M42
5744A89j13j01P7N2k20P8j77J15J88m41N78j6m32M12l14K52l75L03o7J92k26J69
5766A23j54l67L93N0j5m5j10K41l1j05n8J02J5N9q6j3j06p8K68P7j32L9j62J10
5790A5J50l64J84L2L6p5j7J86o8m0L18m81K64j13M7J36m28J81J37k67K01j02P0
$$ y = [88, 76, -24, -161, 83, -174, 78, 104, -111, -115, 113, 216, -162, 124, -62, 266, -171, -94, -241, -128, 9, 39, 4, 74, -237, 79, 198, -20, 196, -117, 12, 19, -186, -64, -161, -263, -73, 28, -227, -136, -172, 150, -140, 28, 68, -78, -172, 152, 86, 10, 154, -191, 97, -256, -73, 322, 79, 32, 23, 319, 150, 304, -137, -371, -80, 17, -28, -10, 245, -105, -55, 53, 161, -130, 104, -96, -67, 14, -10, -220, 23, 14, -44, 50, -86, -24, 150, 175, -46, 186, 116, 9, 14, 76, -82, -80, -153, -70, -121, 24, -51, 91, -21, 5, -177, 146, -73, -63, 150, -88, -17, 162, -193, 14, -43, -253, 189, 76, -25, 52, 104, -116, -38, -215, -100, 88, -353, 225, 209, -223, 189, -125, 127, -248, 55, -12, 180, -46, 123, -31, -398, -5, 45, 30, -15, -125, 116, 85, -20, -78, 24, 39, 98, 12, -1, -107, -185, 83, 160, 28, 67, -95, 15, 165, -199, -15, 17, 53, -22, -39, 147, 79, 39, 357, -124, 140, 27, 74, 210, -218, -37, 100, -167, 34, -68, 2]
5813B%K41k15j02n8k7J92N8J67m18R2r8J26p6J86l3M8M8j89J27j40j41K83k16
5837a43R0j37L43k82J44K8lj21M1Q9k68K49o5j9n0K43J12p8n2n4j23R5R3j77P3
5862B8j84J05J4j4J53m1r0J48l35J68J34N1j43J06k07J39r8k3o9L7J44J16J04
5885B43k51J38j87J97K7m39L47P1k18K96l68L03l26K65j07MJ23r0r6Q8j83K1P
5908a35J81KQj44L3J13M7N1m33K05L25l06J82k81J62M4K1j88O8j53M6J15j27K53
5932H9k11L81k00j88J36R4r8O1l7K99k28m2m7q3q3L97q1l15K58j35P0J93l50L08
5956A88l43J36k2K5o7p0n9l1P5J97k8r4j30L30j9k17J19k14L12j10p3J95M5j12
5980C3m4k9R0K18j47j59j27n5L21l01J76r0J21J0J07k74J63j29K49k55J6J80k29
$$ y = [2, 2, 243, 28, -74, -132, -159, 33, 91, 258, -160, -68, -166, -40, -116, 70, 37, 85, 133, -56, 71, -69, -210, 73, -143, -53, -190, 153, -129, 15, 43, 40, -81, -40, 49, -219, 30, -35, -54, -104, 139, 251, 173, 121, 67, -56, 39, 132, -45, 28, -156, -51, -37, -51, 102, 61, -29, 119, -216, -48, 86, 137, -6, 100, -107, 32, -66, -89, -158, -121, 23, 139, 243, -8, 130, -57, 140, 167, -272, 75, 146, -72, 224, -144, 159, -167, 98, -9, -5, 118, 28, -68, 20, -163, -142, -135, 46, 48, 56, -88, -55, 58, 105, 156, -277, -72, 253, -53, 129, -152, 10, 54, 75, -113, -45, -198, -152, -37, -164, 89, -122, 259, 59, -129, 7, 101, 3, 64, 27, 326, 98, 56, 9, -74, -157, 240, 159, -156, 102, -33, 37, 230, -120, 188, -155, -19, -41, -16, -83, -153, -212, -243, -168, 29, 1, -93, -223, 107, 88, -129, -10, -224, 88, -22, -95, 100, 145, 33, -11, -40, 50, 268, 121, -38, -165, -220, 101, -200, -24, -114, 7, 17, 124, -150, 13, -116, 133, -122, -106, 74, -155]
6003a55K40j06J18j11%N6l5k1J82q2j96M83l36r6L1o6K17l21J14P8R8n3j4k31
6027b06L76j50jo9lL30l86R7p8O0j4Q6j92J11J46k98K44n6o2Q9L8N6j69r2N7J10
6053B4R5k94J73K06k69N1J20N7j00k04r6J88K2l1M4J22j28lJ60k29j36K59l9k4
6077c2MM7L2k0l9J1L9k70K05m9J20r8Rr9j43K91O9r2O0P0J0l6m0l7j16J04J36
6104A36k04K10jk61K14k87K36O3k73K85j97P2q1K67k37N3k25K75j65j66R6k7K38
6127B1J5r3nJ18k0n6k47K83q2p4jJ18RM0j79M2l5MK22k21j08K19P7j95K74o2l
6154F1J61m42K20J93l85K09k40L21k85K09l27L14j42R3J54m8M4k10J6k7J24q7
6176g4J93q9J09j69j54J21RK00j81p4o5K71j2o6k21l4K58J05r9j3O3Q2j73R0k06
$$ y = [-155, 85, -21, 97, -14, -14, 42, 7, -14, 168, 86, -110, 373, 37, -59, -28, -94, 123, -198, -84, -6, 92, 39, 25, -206, 170, 20, 19, -50, -53, 277, -109, -12, -90, -30, -44, 42, -150, -39, 107, -191, 53, -3, -65, 24, 62, 118, -51, -143, -86, 24, 119, -175, -2, 204, -65, -14, 106, 163, 63, -141, -237, -49, -27, -58, -14, 108, -20, -23, 137, -92, -228, 31, -8, -32, -28, 19, 51, 31, -8, 3, 42, -228, -23, -72, 48, -50, -41, -140, -283, 8, 77, -15, 45, 115, 125, 89, 49, 12, -104, 0, 136, -68, 142, 141, -120, 94, -193, 43, 106, -167, 118, -79, -7, -88, 179, -58, -5, -230, 45, -120, -286, -190, -217, 21, 36, -57, -62, 56, 36, -20, -267, 16, -66, -140, -141, -23, -14, 26, -153, -111, -146, -142, 80, -141, -249, -30, 47, -148, 126, 64, 61, 222, -220, 0, 193, -192, 17, -223, 98, -187, 22, -305, 9, -133, -40, 114, 66, 110, -100, -84, -111, 13, -74, 119, 30, 139, -30, -184, -63, -54, 146, -35, -109, -174, 97, 85, 19, -202, -236, 22, 127, 28, 15, 78, 160, -13, 77, -129]
6201a29L71j75K48l4k82k25L17Q4j66K18j85j15J38k9q6j41K7K12Qk85M35j66
6223D0J03M2k74O1p0L5J37r6k37L16j41j11J32J39k25n3M67n23J66L5j20P7L01
6246B01m09M41l13k94M19r7J71j83p4K1K46j55N0J99k26J25j70j12K88k60J55
6267B3oJ13J1j43m7J92j96N5k7J3j24J91k2k53R2L35k48J11k07J04J31j3r5J53
6291A43l13K68l56K41j3P0%O5j98J06j0M2j59K43q8K74l24k94L32n6j29K7p6J39
6315f6L33k70L51l02l8k65J56k6K37j38m8q9J61J47K9j16J75m62K86m8R1P5j44
6338B9p1L7j66J21j03R9J65j38M8M7l8k03k7J1L26j9k30K52r5k00L75k82j87R3
6362a56J99R0j37j5K54n24M10J1j05M5o4J70l31J32m7K11l15M23n09J34JJ73q6
$$ y = [-129, 242, 67, 315, 281, -1, -226, 91, 175, 9, 227, 42, -73, 65, 36, -50, -191, -164, 48, 56, -229, 206, 40, 143, 185, -89, -28, -98, -63, 74, -22, -259, 57, -84, -195, -63, 76, -149, -202, 265, -258, -92, -57, -177, -100, 201, -208, 233, -80, -374, 45, -52, 119, -64, -138, -117, 129, -26, 24, 223, -3, 122, -48, -160, 128, -132, 23, 17, 130, 141, -2, -49, 143, -53, 2, -25, -12, -136, 55, 33, -220, -128, 207, -41, 70, -137, -33, 98, 85, -10, 143, -170, 98, -258, -17, -30, 40, 40, 105, -93, 13, 3, 45, -114, 129, 41, 315, -9, -303, 29, -27, -156, -129, -205, -66, 267, -3, 348, 46, 8, -257, -101, -127, 110, -28, -76, -165, -4, 143, 172, 56, 231, -231, 55, 7, 98, 173, 29, -42, -5, -171, -50, -153, -54, 111, -27, 21, 68, 30, -173, -200, -189, 137, 118, -112, 140, 45, -155, 220, -62, -249, -156, 43, 133, -4, -19, 235, -289, 121, 132, 27, 72, 8, 178, -153, -21, -68, 143, -172, 251, -258, -124, -123, 50, -36]
6385c6p6J35O1J19k62P4n1J6j52K81o8M5j34r2K26j06j62K58M7j62rP8n6J12l27
6410b41J11J58L2l01J93k6Q1K47m42K13j86K18OJ08k79k06J73K37M2k6m2k06K15
6433G9q9m8o5k4J52o6R7Rl7J49k60j7J77o7jN4q4l3K19j46j38J4J29N6j93L19
6459A86l72O1K43jj57n9q4K29J81k80J80r0r9q5J75J2KK23k78l0q2L06L7k56j3
6484e1Q9k24K62j67K18j67J01j36L6O3J72l13M3Q7j17J22j19K73k18j3J9J17K2
6507I9jk36M92r2m25L7J33J69j53l0PpM1P8l8j44K04j30j46K03k32M42l22j24
6531a75L28m26J50K32j83j41J74rk37N33k74O3J0j23J13L0J32l79M42l12OJ97
6553A51k96K06o4o9J35k07J76p3J01L8k45N5J7M9j11PJ24jN9J90l43Q7q0J22J6
$$ y = [-36, -112, 23, 84, 203, -59, 15, -36, -20, -172, 109, 41, 86, -48, -140, 86, -20, -182, 76, 123, -39, -48, 30, -26, 86, -241, -130, 28, 60, -241, -48, -74, 7, 254, -188, 25, -161, 57, 63, 171, -108, -314, -141, 96, 138, 112, 70, -136, 79, -10, -58, -123, -147, 5, -61, 36, 45, 8, 157, -103, -120, 57, -10, -11, 43, -41, -74, 145, -1, -139, -125, 4, 60, -133, 186, -186, -125, 118, 117, -40, -99, -183, 46, 227, -53, 127, 37, -62, -147, 28, 40, 42, 265, -13, -43, -125, 181, 218, -38, -51, 38, -186, 76, -91, 127, -40, 61, -75, -39, 24, 196, -117, -74, 13, -104, 18, -101, 172, -46, -59, -40, 77, 99, 98, -138, 354, 262, -163, -126, 7, 176, 23, -7, 0, -7, 34, 112, 74, -70, 134, 4, -142, 61, -171, 271, -51, -175, 153, -273, -123, 109, -74, -215, -41, -50, -287, 246, -28, 35, 45, -78, 35, 65, 197, -182, 260, -52, -46, 151, -145, 61, -3, -72, 63, -144, 32, -41, 60, 98, -147, -92, -75, -26, -137, -130, -6, -7, 52, 242, -101, -14, -94, 28, 44]
6578D4Qk04J94Q5j44J46n1K0j8j49r0J28n8K02N0J3k73R3j9k89L50J52j80J05
6602A15j91o6J6kQ6o5J92k15L2Q4K08l36J22kJ0J9J07j42k04J83k30L26j73K39
6626A13Rr9j70n7K46Q4l47L49k51J97P4m22K03l0J22N3p9q6O0q8L87j33j81J87
6650A41j62j84L77j79K1l8j40L44p1k10k4J2J4K08k80K66k90P3M42l08P4J95k50
6673C1kLK5m1q2L17k10r1m5J60k28P4L8l7K82k0r4l06P7K13l73L34Np8k2K3K25
6700A78j91J7k78K05L61k65j1K01l13J4m4K51l87K77K13l88K30q6j91K65j28M5
6722b5p1k0j0K14j58J27k01J02J77l06M41k97KJ49J20k32P4j05J59j33j23k5K25
6745H4l92N71j28j20j29J66L6l51L73J2j99l5L78n07J38L3r6K99k81P1J31J52
$$ y = [44, 52, -152, 42, 127, -17, 129, 78, 98, 80, -69, -159, -31, -89, 113, 163, 176, -97, -4, -23, -312, 38, 190, 10, 115, -76, -142, -126, -128, -42, -107, 85, -130, -98, -14, 194, -142, -20, -22, -12, 7, 114, -28, -232, -49, -279, 47, -126, 113, 122, 23, -147, -204, 42, 126, -221, 128, -123, 74, 148, -274, -71, -101, 21, 74, -5, -91, -31, -119, 268, 135, -46, 141, -21, -205, 172, -7, 14, -24, -164, 180, 109, -101, -125, -113, -99, 109, -171, 95, -195, -122, 320, 12, 86, 281, 31, 29, 32, 57, 16, -66, 251, 41, -50, -95, 65, -163, -89, -51, -88, 194, 174, 80, -226, -149, 64, -309, 25, 30, -48, -70, -47, 178, -13, 4, -274, -69, 292, 27, 16, 217, -96, -82, -126, 125, -262, 15, 228, -160, 70, -16, -207, 58, -70, -25, -96, -116, -126, 88, -70, 57, -144, -42, 135, -171, 270, -27, -25, 124, 244, 12, 86, -19, 140, 7, -116, -141, 84, -308, 263, 135, 15, -114, 52, 88, -263, 110, 122, -77, -112, 266, -241, -103, -70, -166, 133, -148, -77, 54, 206]
6767B06l39K08N9l47L43j18l6p8Q4L4k27M08j95k32K99mm8J16j94j24J82J0l9
6790c2j3k59J22J48q5j45M40p0k51J83N4k01q8K15m2K5J11K41k77j50K75j62q8
6813d9j2l7L42k15oK04j44K8L5l2k49J48O8k07L18k99J25pj9J11l4k87K76l9k5
6838fK71k85j31RJ62j57J8K36j59k12M42k96K08q8k18K23j14j48J79k1J06O0o3
6861A6j0o8J17j86J10L2p8N2K77j99j64L25lm08J77Q0j61J93O8l50J72j89M49
6884B52l08m2K64m39n4K95J8J66l62M05p4p3P1j36k33J21J07q2J13j38K56j09
6906A8l8K05k89J16J1J19Pl64K07k3l7J25J35k92K32k86j26L93k22M0K07j14J36
6929A60k21J37P5j35j89J68K5J12j04J34j32J08k76K18p6J1l0J23j68o7K16j00
$$ y = [206, -133, 75, 134, -213, 130, 12, -24, -102, -18, 16, -211, 197, 2, -230, 69, 65, 17, 133, -61, -185, -3, 7, -32, -45, -304, -182, -34, -119, -264, 176, 106, -145, 38, 92, -109, -197, 18, -24, 1, 112, 353, 76, -74, 201, 39, -49, -61, -98, 244, 29, 23, 227, 83, 111, 146, 114, -135, 13, 81, -126, 192, -107, 18, 11, -8, 103, 69, -218, 58, 19, -6, 265, -20, -151, -142, 20, -137, -119, 117, -42, -254, 188, -108, 100, 12, -206, 17, -97, -245, -66, -87, 19, 79, 16, 6, -62, 55, -131, -21, 11, -67, -15, 262, 63, -101, 224, 221, -187, -10, 70, -91, 102, 170, -180, -8, -197, 252, -56, -98, 166, -273, -327, -32, -14, 152, -210, 195, 121, 48, 119, -17, -250, -129, -22, -104, 9, -129, 127, 18, -20, 185, -104, 12, 23, 142, 149, -215, -8, -31, -68, 57, 192, -100, 132, -154, -280, 113, -109, -69, 138, 24, 160, -61, 76, 151, 16, -173, -5, 20, 132, 28, 162, 30, 138, -138, 80, 4, 15, -15, 108, -60, -127, 89, -11]
6951a1n1J09J40j73K21l25J12k52J25rL5J61j98K0J28P0k39Q5J86j04m6M0J8J43
6975A85k82J15j18L5k8L21j30Ln1k9J72O1j31j66m8J26o4N7Q7k63k6L16j08j66
6999a32K09k01K27m57M26N4J5l94J26m1J58P5J84l16rJ57o8k43K99k7k24L24k22
7022h0J68j44o4L10k30K58j26l0R6n7l98L40K5m9J35r8q6J4L5K26k37l91O16j32
7046A01j0r9j68J90j48j09K49K34j65k06J23K06j95l4K41K1j78j38J3K38j94m0
7068f8M9P6J34k71K17q5j60L2m0R7O0m9l1l0J55L5j29l6o1k4J3NJ43M6j8p1K94
7095B83k58rK8j33K19j2j24q6M2J31o0j69J55r8K45oNk84K20o9j35J25o2J94o1
7120H1o2J40l54M7K42P6k6n4l17M67k57n5J99j1j49J67k75K12J80k69K5p5J37
$$ y = [-11, -62, 47, 187, 14, 235, -90, 22, -230, -105, -114, -79, 82, -116, -96, 32, 102, -137, -52, 134, 30, -16, 24, 42, 185, -97, 18, -100, -65, -93, 228, 98, 101, 50, 21, 193, 254, 123, -43, -91, 35, -29, 28, 115, -148, -174, 142, 34, -132, 77, -124, 103, -354, 72, 126, 141, -253, -127, -168, -10, 65, 249, -67, -76, 81, 13, -230, 69, 42, -182, 142, -80, 88, -56, -120, 190, -40, 218, 92, 62, 158, 101, -297, 43, 68, 19, 154, 56, -30, -16, 19, 245, 8, -383, 233, 101, 91, -8, -176, 14, -134, -243, 6, 240, 75, -131, -8, 198, 3, -31, 210, 231, 53, -85, -72, 166, -28, -68, -19, 57, 191, -80, 137, 52, -108, -76, -116, -19, 41, -8, -39, -69, 86, 121, -8, -44, -105, -129, -116, -111, 32, 78, 60, -11, 283, 25, 16, 44, -89, 130, 118, -6, -92, -50, 81, 21, -148, 7, -91, 154, 148, 153, -131, 89, 20, -115, 10, -52, 142, 81, 19, 159, -195, -148, 94, 170, 144, 90, -227, 240, -17, -72, 127, 116, -33, 134, -141, 71, 251, -18, 7, -68, 69]
7143F9N5p7q5j26K18j84M4J54q2M2J67j06K10j99K4m9m0j97L53p3L0k55k8K02
7167F7j41K4J66p8q4p2K99j22K46k30L9m7k82J43J60P1l1j16O0N9j64K3K55l71
7191a26J21k57R7J76j92L81j93k1K7j16J20j21J24j62k0J80K86l59L2J72j62P7
7213F4k18J22p2L4l7m0J30J45j96l33K49O3K35j60l5J34j53J77j46K7J70K0j24
7236E6K4k65K49N2K5l28J69K25m64K99J14L4j35p7O7p7j04J06j16J73m81P36l05
7259b3r6K5J39j04K29q4k96M42k02J32R0k97m9J46j3J50l20M8J88q9q1J59k18
7282a24M6L00j93O9k10L78k86p6J04j68K10q2K74l39P9J12N6j86J69k41K71j24
7304C9R9Q4m08Q8j17N2K10j40J75j11j53M96k85l8k52L12k54M7J95K4N7j68lj70
$$ y = [69, 124, 47, -38, -164, 54, -130, -86, 68, -14, 28, 195, 89, 299, 100, 124, 75, 35, -162, 191, 118, 148, -107, -135, 67, -74, -50, 116, 38, -46, -118, 181, 59, 305, 75, 114, 67, -215, -72, 88, 159, 128, 12, 72, 131, -33, -10, 245, -126, -5, -262, -165, 11, -181, 200, 7, -14, 13, -103, 17, -104, 20, -142, -162, 18, 304, -55, -23, 149, -13, 64, -154, -32, -104, -70, -107, -147, -17, 128, -68, -401, -152, -89, 146, -14, -49, 85, -68, 109, -37, -10, 160, 180, 56, 80, -185, 64, 116, 141, -187, -18, 207, -257, 42, 156, 190, 55, -22, 45, -32, -136, -30, -146, 27, -454, 282, -23, -119, -94, 45, -59, 170, 86, -210, 232, 30, 162, 252, -45, -94, 52, 39, 189, -131, -83, 105, 16, -65, 94, -124, -78, 222, 29, 98, -112, 266, -20, -96, 8, -160, 50, -32, 242, -97, -18, 94, 150, -36, 133, -108, 163, 39, 138, 222, -186, -98, -215, -163, 47, -93, 82, -29, -182, 314, 29, -9, -261, 51, -203, -156, 39, 63, 120, -48, -51, -221]
7328b21K39Q3k34j5j53L99j71N4J79j14l70Q1M76k14J4j03K81j92Q6l6J1M9q6
7351D3j26K59P6o57K50K00o3o1M4O1j02K66l40m3K44M2j37N6n0L4q6K6J97o2n0
7376B1K6J15k89M94l80qJ88j5j61j39J63k18J74J32N1L9l17j6K48j40N7k5k7O5
7400C8o5m0L27j09r2p3N9n9L6J1l5Q5o6K23j04m06K07J9jj44j10M00j26m8J88
7425A15r0Q3L6j81n6K09r7L63k59k43J53r3l7J40L1j11J18l51K85p3J59j43k21
7448b63L34j1j15J16r3N1K07j81k44P8J8J36J02k86K38j64j73K06j14RM5j5R5
7471b4j75J1M0J17J20r5R9L5j70J82j81K86q2p2m7J21k16l6J49m6J23k17R5J86
7495B03l71K05q9m3L15m29J97n7M0O2o3j40J40nk15K77Om8K2k5K91k41pm6j06
$$ y = [-221, 18, 101, -133, -148, -301, 98, -73, -19, 160, 46, -324, -243, 233, 19, 33, -70, 211, 19, 105, 69, 80, 129, 43, -83, 176, 252, -405, -155, 45, -18, -79, -35, 26, -76, 190, -150, -193, 51, 93, -44, 12, -38, -4, -90, -64, 133, 71, 21, 47, 162, -127, 367, -13, -21, 167, 152, -9, -148, 15, -203, -29, 103, 154, 193, -124, -140, 108, -32, 25, 0, -27, 38, -27, -67, 260, 151, 59, -14, 45, -14, 22, 33, -2, 83, 17, 240, 136, -270, -63, -44, -45, -189, -299, 101, -25, -73, 115, 25, 108, 144, -37, -93, 116, 19, 382, 123, -120, 33, -60, -97, 43, 74, -37, 81, -270, 15, -58, 101, -42, -263, 71, 60, -55, 61, -32, 19, 226, 45, -199, -121, -103, 33, 135, -151, 87, -77, -250, -44, -158, -149, -104, -119, -24, -199, -188, -148, -31, 89, -6, 93, 128, -42, 140, -41, 245, 163, 91, 44, 165, -51, -87, 62, 16, 139, -78, 17, 203, -168, 37, -52, -95, 220, -209, -12, -69, -29, 33, -30, -170, -30, -35, -250, 27, 33, -15, 7, -18, 273, 32, 25, -21, -127]
7520a27N0j60K45j86K59j55L91k96j0k96L85J04k80M7O3j40K19j37j62J63M6o5
7542d2P1j66K18j09j15J64j89R8m3K27j06P7k14L07m31M07k26r6K40j93K07k44
7564a58K31k16K54j64K0L4j77J07Q8l31M95k69j90L24k46L32k05j10O7j83L48
7585E1j5J0J39K8l68n9N15m71K03N7j72R6r6Q3J0j22Q7J7J0K42j40j30R5R1k32
7610g1N6j53J39o3P3p2j40Q7J51r3l9K25j13J38k09L55k92O5m8R4k33Q3O0J45
7634A45j22P8k14P7k13J30M08k23p5O1K4m64L36J5QM8K24j41R1l56L48k01j00
7657a16J57j4O1j84l06L80J5k14L41l3j32k00L14J04j00j56J34J18j38j67K9J23
7679A6j74K68j16M6l81K52j2K49k22p%K91J3j4j28n1j53O6KO0j97L71l37J44m2
$$ y = [-127, -77, -237, 8, -178, 81, -74, 317, 21, 11, -285, 100, 204, -76, -29, 34, -106, 113, -24, -186, -23, 23, -42, 29, -137, 81, -28, -143, 21, -168, -70, -113, 114, 8, 85, -129, 178, -253, 154, -72, -168, 72, -121, 86, -158, 73, -143, 111, -53, -33, 1, -176, -69, 19, -312, 183, -86, -276, 48, -198, 134, -71, -181, -114, -297, 51, 36, 46, 185, 213, -155, -214, 301, -170, 33, 90, -82, 14, -82, 1, 11, -111, -24, -7, 3, 245, 105, -25, 70, 161, -71, -15, -168, -29, -92, -19, -91, -231, -144, 7, -86, -125, 100, -13, 125, -84, 271, -21, 44, -4, 90, -143, -60, 0, 145, 23, 101, -113, -36, -249, -119, 289, 66, -9, 52, 76, -388, -52, -37, -29, 19, 243, 102, 193, -163, 185, -16, -116, 41, 27, 88, -96, -402, -22, -7, -221, 120, 87, -45, -245, 69, 173, 73, -83, 51, 169, 31, -136, -107, 16, -158, 110, -6, 40, -341, -89, -101, 148, -74, -81, -81, 210, 223, 209, 81, 30, -123, -57, -55, 5, -192, 179, -158, -14, -56]
7704e6J01R8k21nk8K29j80L01j38k41n8L03j34J43k24J31j2j87L07j02L6J6m9
7727C0N4j72J94k9j57o3J58l0J92k63K51j55m0L60l61J42kL4j70P4j01J91nj88
7751e6K63l27n8L71p1O7j27P6J02k79r8R6J01j75J34j61K31l76K64L8On6L17j71
7775A11J48l53j43M58l60K51l2j31P6J43j95L4j24J3M4K7l1J75k16J54Q7j04Q9
7798A21l46Q7J92j43K14K2j65p6J97j47J39k22K37o7o4J33j95pJ08m8J46j25j22
7821a31J60k06O1J21m5M5k4K44O9n02M25l53K29j58J76j32N7k71K06L6k46K33
7843fk7j35K09L9j10j52J82M8J24j16L7j79l7J67j27L01j88L1K27j87J3q8k98
7866b72K90J99k57J32j15ON1J05jk77O6J01k19P8J4J17P5j98O0kN8j48K81m13
$$ y = [-56, 45, 143, -78, -83, -111, 118, -62, 239, 101, -140, -198, 105, -29, 114, -110, 21, 9, -178, 129, 27, 63, 79, 30, 84, -88, 106, 77, -80, -143, 15, -15, 177, -86, 165, 10, -30, 330, -31, 111, 109, 143, -27, 47, -54, 137, 132, -56, 207, -120, -178, 193, 122, 189, 62, 138, 240, -39, -137, -41, 60, -115, 19, -142, 89, -287, -23, 15, 21, -35, 282, 111, 259, -94, -237, 221, -139, 112, 80, -51, 25, 168, -27, 7, -117, -104, -60, -33, -64, 111, -105, 49, 136, 32, 121, -225, -138, 54, -89, 125, 147, -18, -94, 103, -44, 95, -127, 110, 43, -21, 112, -83, -90, 18, -30, 116, -9, -131, 29, -177, -116, 5, -40, 5, -19, 225, 294, -208, 217, -136, 93, -65, 111, -21, 36, -235, -29, 7, -239, -6, -33, -168, 41, 80, -30, -182, 0, 48, 172, 56, 93, -86, -123, 44, -83, 218, 30, 61, 288, 101, 114, 26, -272, 18, 217, -40, 92, -23, -17, 34, 139, 138, -139, -73, 28, -191, -113, -99, 18, 93, -105, -45, -47, 11, -137, 144, -269]
7890b69J00J80k56M50k81L3n2j9J51m3k14K74o3K38r2m47Q8J59m0K44r6l04J75
7913h4J36j23P6j42J65r2l1J75p2J46l2j57R6j08L3K89m02j34J96L8K30n0J07
7936B60k80J69l77lM85k00RO7k27J58q9J34M5j58J18k0K1k55L09k21J45k95J83
7959b2j09J8m7M32l58J4J05j5k57L66j08j23K05p4k9K00j42N7j73j80K03j27J57
7982gj45mJ13k9o4K57k2k17L24k72P7K93k95o8k13K92K83l47p1J77p3J33k17J06
8006A1j69J10J65n7J9RK0k14K6P8k85M13q3k47J92Q0J22l32m8J53o8L67l57j5
8030a10J16j24O0q0MJ56J21M7j5k88J23k7J25o2k2J15o2k52k01L37O3j12J50j21
8054e9k0k73L57J45j32p3KJ41j5J31j35J91l29%J80k12K28k70L29j44j11J52j38
$$ y = [-269, -169, 11, -245, 205, -76, -43, -95, -114, 37, -6, -220, 54, -9, 229, 137, -310, -222, -63, -103, 141, 45, -259, -84, 52, -71, 5, -137, 28, -64, -95, 80, 8, 154, 122, -35, 61, -47, -14, 275, -127, -261, -65, -27, 203, 153, 260, -20, 149, -228, -231, 254, 54, 63, 130, -97, 61, -28, 106, 151, -7, 111, 91, 112, -143, 166, -55, 90, -205, -22, -131, -113, -160, 272, -86, -72, 33, 18, -239, 127, 19, -104, 101, 27, -2, 198, 56, 113, -60, -240, -37, -164, -7, -152, -156, -43, -72, -136, 121, 99, -118, 206, -66, 11, 304, 9, -59, -272, 20, 303, -44, -115, 62, -11, 122, -95, 11, -158, -48, 117, 60, 79, 88, 108, -106, -80, -2, -287, 126, 43, -204, -12, 68, 190, -142, -190, -37, -105, 262, -95, -110, 6, -118, -58, -138, -134, 22, 143, 190, 175, -113, 10, -17, 108, 46, 24, 139, 77, -175, -376, -39, 24, -88, 62, -59, -79, -352, 5, 150, 18, -55, -53, 88, 73, 204, 69, 260, -69, -69, 111, -101, 127, -143, 186, 42, -69, 83, -55]
8077e5k1j2R3j37q7J89J26k04N8q4Q4J80l3j93K56k48J92j8j65j6O3K14k2k28
8101f8o0K81j38k81K89K4j9L1k4j83l4K35j94K98j89J18P6l37L2J7L43k66j9L7
8125c1Rm7K9j8j09L88j93k40Q9L62k34o7J72p5K9n1nk7k4J32O2k90J5J21q8J57
8151F6j19Q4m0L19j66j26j7m0R5m2N2k14R9K7j20M7P2J10l09M23l42J32r4p6L35
8176A56k18p8K35j57K41r3j3K1J19l1l18K12J27j63k26
$$ y = [-55, -76, -88, 5, -132, -219, -30, 96, -108, -50, -134, -50, 130, 97, -96, 160, -88, 104, 86, -79, -95, -32, 182, 160, -68, -128, 153, 15, -266, 23, 47, 28, 59, 35, -148, -182, 53, -141, 157, -32, 86, 162, -175, -143, -126, 217, -49, -68, -31, -22, -69, -40, -58, -167, 221, 28, -212, -123, 239, 5, -62, 110, 35, 64, 13, 8, -19, -43, 89, 151, -139, -124, -3, -91, 66, -53, 31, -9, 310, 144, 18, 1, -39, 56, 14, 66, -148, -49, -22, -142, -95, -23, 87, -222, 201, -141, -9, -103, -179, 156, -62, -140, 95, -62, 179, 86, 73, 94, 213, 182, -136, 76, 203, 40, -186]
8191a86
$$ Imaginary data points
##PAGE= N=2
##DATA TABLE= (X++(I..I)), XYDATA
0@%%%%%%%%%%%%%%Qj6J6j6J6k0K8l2L6m4N1n9P0p8Q8j04J20j36J55j77J99k23
36a18K51k82L15l51L90m32M78n32N89o49P17p90Q71r60J058j164J281j414J565
55H23j734J925k144K400k705L071l520M089m837N861p360R766j4242K5259j00359
70h3707j40648K66986J18828j57937q3909Q7621J8562j3181J3132q618n3947L6950
82A32O0649n8294m4478L0391M0941K330p6826K95N9060R967k6149l8682K4245
95a6419K6934j0205K0078k8341l0917N1543L8431n2097m3455O1543L5945o4403
107a1363k0643O1392L23o0914K7528L0753m5321m732L8430L918n4337P145O8976
120D1155m4246m4214N3716K4901l8429l3709N2969L6983o4129k1322M9569K8095
$$ y = [0, 0, 0, 0, 0, 0, 0, 0, 0, 0, 0, 0, 0, 0, 0, 8, -8, 8, -8, 8, -12, 16, -16, 20, -24, 27, -32, 38, -40, 48, -56, 64, -72, 83, -94, 105, -118, 133, -149, 166, -185, 205, -227, 251, -281, 308, -341, 376, -414, 457, -503, 555, -609, 672, -742, 823, -911, 1014, -1130, 1270, -1435, 1636, -1884, 2205, -2632, 3229, -4131, 5635, -8607, 16652, -83707, -224355, 42631, 161459, 3522, -80387, 7234, 25796, 12615, 25747, 17129, -36818, 132, 60781, 2487, -41991, -11600, 29341, 31671, -45155, -44860, 14200, 24167, -1982, -40664, -16419, 10515, 310, 20388, -7953, -38870, 12673, 51104, -993, -44448, 17095, 53040, -11363, -32006, 29386, 29709, -31205, -3677, 27076, -18245, -22977, 15453, 19371, -34966, -27821, 41155, -3091, -47305, 6411, 31312, -7117, -40826, 12143, 49126, -15003, -36325, 13244, 41339]
132D1339l0885m0158K4205L2231j9506k0160J6449r71j5207J9149M102k4279r059
145b2750K9933J3570m5353R123L4916k3599k775J1613l857p586Q253K7258l4077
158e331k5283M8923J1964l7197j3699K6206J4245k3337p801J5122k736j0567J0309
171H18L785j3226M91Q199J0808j5458j7018L0479N694k1342m45R046J0169j7033
185e033L591K0358k9714k540L4567o660l0164j951L3500n78l1973Q191J7742j1757
199b421k436R073j0322j148J2843q99q873n784J5864N065j8795N861M630P85L795
214G238j3845P607N321j0824P463O60o406l315O326J1924j9140r308K6263L50
228A0314k3810M880J8695m888j3415K702J2616n230o119J1531j0217m395J8487
$$ y = [41339, 10454, -29704, -5499, 26732, 7226, -12934, 3515, 2544, -12663, 6486, 10588, -13691, -22750, 7183, 20753, -24600, -15477, 19439, -4160, -6935, 4678, 821, -6765, 1488, 28746, -5331, -30614, 18309, 30273, -6924, -20623, 5583, 19828, -3509, -11310, 3812, 1076, -9491, 818, 4603, -8623, -8132, 67, 10875, -4583, -21601, 8878, 14572, -6770, -7215, 1831, 12000, -5033, -1442, 18916, -10798, -13338, 21229, 14569, -15595, -17546, 15954, 15376, -16597, -8406, 9336, -2421, -4857, 4216, -6106, -7254, 5589, 4690, -4183, -9967, 5897, 10962, -7833, -1972, 2658, 3443, 7238, -6607, 1000, 6321, -4503, 2960, 3620, -2786, -6101, 225, 12149, -6991, -16299, 9964, 10314, -13496, -8616, 10079, 5191, -8224, -5522, 7094, 1864, -4255, 7276, -2941, -7336, 11151]
241A1151o063j1249K04J1595O463k2352L544J5661q428k677k010K962O522q623
255c300N82M017l006J395Q48J06j97m412N374O294j2671O07J2085o866l027K304
271A33J665n58n802J0744m492j3920J7766K366j5335J885Q383M293j1819k185
285f876J3516n872l834N536m224J091M720m358j773K363R37J675m936O28M326
300B919m563L893l274m293J1762o881n670R073j339k686l639O287M547j3716O234
315a346R589j1931O91O608k492k814J499K810l484k289P811k927q637R815J248
330D151q299L966j97J393Q0m742N072j978L90K913p868O631K452q683N659J101
346B041l484J739K54J488m049k59P958o642m497R666l143n022N398o64j543r66
$$ y = [11151, 5088, -6161, -5957, 5638, 12101, -10251, -6707, 8954, 526, -2151, -4161, -1199, 5323, -3300, -2718, 1299, -1707, -312, 536, 642, 445, -3967, 1407, 7701, -4970, -4363, 7722, 856, -2171, 133, 1798, 1240, -4562, 6182, 1690, -12230, 5536, 7902, -7433, -5548, 2835, 7128, -4691, -6876, 6640, 768, -3066, 2470, -1754, -663, 4057, -301, -2074, 289, 1226, 2901, -2035, -1407, 2919, -1644, 2249, -1025, -5318, 6444, -437, -6107, 2966, 1627, -1059, -4698, 1589, 6136, -7580, -1346, 8243, -3688, -2997, 3611, 1119, -1695, -196, 2614, -870, -3159, 4652, 1725, -6912, 2903, 4151, -4148, -182, -379, 1014, 1094, -3648, 1424, -554, -164, 2749, -5119, 1512, 3964, -4719, 940, 2041, -1443, 296, 550, 2038, -2011, -2270, 5688, -954, -5451, 4215, 1072, -3950, 1448, 784, -759, -1725]
362a725J997L605q751L236P394q942K437K817l787L358k067N48L73k845N938l336
378B50l994O684l001j695L611l091M77J860j398Q38k211J448K497o196N016K944
394D039r550N230L910m068m75j151M769j624l848O769n931j500R193n569m383
409d189L800J716J069l970Q4K323k116M614k069q187Q192M458p988J69J221J430
425E57J905k976P47l105J963P690r346j465O908m135K699N33n313J550K225L853
441D290m668o015R256J074o834L077m50j600M087j231j282j913N33O140m387k781
457b704L556l041M527J817q737K261M196J350k977n788O767J419l995M215m040
472a174m096P433J878l083m163o04P287L86m719j713k186R176L780j4251p1R830
$$ y = [-1725, 272, 3877, -4874, -1638, 5756, -3186, -749, 2068, -1719, 1639, -428, 120, 493, -2352, 3586, 250, -3744, 2940, -61, -1756, 1855, -1236, -759, 1101, -297, 541, -1670, -222, 2275, -3921, 1095, 4039, -5511, -281, 3629, -439, -914, -2065, 2704, 1080, -2768, 4001, -1930, -3430, 5763, 194, -4189, -389, 1327, 2396, -1574, -1490, 833, -1283, 3331, 1262, -6925, 1267, 5725, -2263, -2094, -873, 557, 2462, -514, 233, -2872, -909, 6781, -2565, -4030, 2878, -1257, 1442, 1975, -3338, -1788, 437, 4290, -378, -6393, 2863, 3937, -2897, 180, -270, -1870, 2217, 986, -296, -2209, -1676, 4464, 77, -2704, 852, -2189, 2338, 4155, -4582, -2321, 1875, 3225, 248, -5540, 1227, 2646, -1349, 2866, -1174, -5270, 2163, 4041, 958, -3205, -3809, 3478, 3864, -855, -2568, -4754, 4422, 8202, -6049, -6120, 3710]
488C710O8l319m693L460L425k641L338n272m300R833N63m208k231j646P024J132
504D243o541j417J916O776o48j0998L906O980k997j159j550K9L100j415K537l243
520d81n343Q033J936m879l85j892M550K194n355k65j77M254J640p678L156L409
536B717n882L262L431m120k460J920O410k868q071M345K898l14J400o842J965
551b209P651n858k993K477K505R14l660J503j303l307R524o85j0423L091N172
566B399J718k723o918L457N754m99l053n259M859N425o012r17J203j080N028j679
582A703m175J280o18N067p72o310K336K635J409j161n541M093L014m573J454l87
598e46R86K222m992O15L617j907K14l9J56L2l044M277J264p462M414L738m114
$$ y = [3710, 3778, 459, -4234, -774, 2651, 10, 3348, -1924, -6224, 3609, 4172, -36, -2267, -3913, 3111, 4243, -2298, -3715, -1799, 4977, 4329, -6669, -2763, 4217, 1220, 61, -1489, -1460, 1640, 225, 2762, -481, -5824, 2209, 4145, -734, -1119, -3011, 1539, 3733, -1622, -1887, -2064, 2190, 3830, -3848, -692, 2717, -3165, 97, 3528, -592, -3052, -1132, 5278, 2410, -5661, -1316, 1582, 1268, 2668, -4174, -2209, 5442, -416, -3409, -932, 1573, 2487, -1173, 330, -973, -4280, 5244, 4559, -5864, -2773, 2399, 4117, 1394, -5524, -2067, 3687, 3188, 135, -5124, -265, 5160, -852, -1769, -566, -1646, 3382, 1703, -2472, -1192, -1810, 3257, 2485, -3825, -1489, 1146, 2555, 1394, -4147, -54, 2960, -1613, -159, -546, 440, 2662, -2330, -1715, 1902, -5, 209, 170, 326, 358, -2686, 1591, 2855, -4607, -193, 3545, -569]
615e69M28j498J141J857j864J713j974o02L357l682J706K514n686J937M377k276
631H79j693r99J883J749l079K023o84j880M084k622j649L915k292j3Q84j778K302
648A030j064k91J620l804K492K455l363J059q64M84J973m013K290K192l574J985
664F07n61j385K672j413k47O23j679K800j125j010K251l931J535M298m524m18
680a507J672l74R22j627J684M1l143L710l71l277M008j742j866L311j089m95j67
697c10j82J641k129Q72K521m098J259J860k671K089k61j892J763p69J247m27k511
714a998L309j296j365L253k701J20J688j701J084q41L31J889l509J032K528l125
730a302J557L91k164K205r31Q31k20k490L542j142k248L932k126j003K461j850
$$ y = [-569, -141, -1639, -498, 1359, -505, 1208, -766, -1368, 1989, -1693, 13, 2527, -3159, -1222, 3155, 879, -814, -1813, 70, 1819, -1260, 763, 79, -1801, 2283, -339, -1988, 1927, -365, -378, 506, -1272, 1030, -34, -325, 1295, -2509, -17, 2438, -925, 134, -730, -246, 1727, -2286, 4, 2196, -1378, 607, 46, -1339, 1333, -80, -327, 296, -1383, 1417, 292, -718, 1533, -2398, -863, 3435, -1089, -1507, 165, -209, 713, -914, 770, 811, -2332, 1378, 1007, -2270, 1738, -4, -1870, 1441, 352, -143, -310, -492, 1149, -980, -108, 2413, -1685, -426, 1434, -1237, 852, 591, -1301, 462, -307, 940, 513, -1998, 1311, 15, -1350, 1903, -798, -678, 1010, -691, 393, -448, -117, 1772, -1737, -705, 1823, -1302, 255, 646, -1518, 687, -244, 587, 367, -2123, 1419, 277, -1971, 1961, -165, -1168, 1293, -557]
746e57M48K20l18J219k652J490K444m158J873J127k961K433N10j872Q84n74J498
763A054j027j637L811k537j623L937k455j01J517j665J081j006P19J362k848J530
779A12J288l305L081k00k450J968m80J17Rj262K439j587j086L688l137NK373k694
797a121Q07Q48l64M29j912J615J037l518L136k08k572K547l80q53Q79r59J138
814E49p60q14K576k111m91K572k762J032J142j718J361p08l19J470k153J749K52
831H67k595L311q09k201K257j048J36L19j352K617j616q07K573l162J320J868
847A678k711N89L49k30J241k063J360O26k301K568m70k526K905j009m11J221j667
864h51J309j91r94K057k412Q14K101l323J224J020j336J111q46K22N07j440K111
$$ y = [-557, -109, 111, -207, 1012, -1640, -150, 2294, -1864, 9, 1136, -1825, 608, 1118, -754, 130, -444, 1054, 27, -1610, 2201, -336, -1959, 1978, -477, -578, 939, -726, 355, -651, 68, 1430, -1418, 112, 1400, -1905, 1176, 976, -1474, 494, 14, 131, 140, -1122, 1317, -270, -1356, 2332, -805, -800, 1573, -1121, -314, 534, 170, 599, -1313, 302, 1339, -2179, 957, 749, -1823, 724, 344, -509, 370, -589, 549, -211, -1025, 1551, -560, -1051, 1521, -1241, -209, 933, -785, 576, -132, -451, 1019, -1134, 615, 867, -1728, 1583, 774, -1427, 830, -218, -82, 237, -1115, 1502, -114, -921, 1652, -1510, -190, 1678, -1033, -444, -95, -325, 916, -1147, 213, 839, -1462, 1106, 636, -1890, 1015, 6, -405, 816, -851, 458, 267, -727, 1330, -1082, -268, 1833, -1490, -266, 754, -582, 529, -317, -95, 412, -1028, 1083]
881A083l76k637L131q16j367K035j588L31M05l08J084k202M73K776k862K69J767
898A198k569J973K40j865J400r68J005J08k282K536q71q26L006k730o82K823j324
915A72L3j128J82K559k170j0J430k575K218M84k210J633j213R59Q09k440J678
932D11k23q18K039j827q42J891m95O9p69l48K489j812n75J670j811J074P88j982
950a071J583m09p30J534j449P02J2j148K985k546j217L409j335j121R61m70P88
967D78n93k13J411k536J231J755k495J230m76q34K451j190j154J057n31J920j625
984a14j494K430q86k47J184k318J589M80j609J935j562K24J276j193Q02l22j532
1001a357K929j374j105J080m8J090j360j725L498j152j814K373j230J0Q24j249
$$ y = [1083, 707, -1930, 1201, 385, -982, 1053, -535, -204, 201, -107, 977, -1225, -752, 2024, -838, -569, 1198, -1371, 602, 842, -1023, 377, -591, 414, 522, -1760, 776, -95, -921, 2085, -645, -1327, 1496, 172, 205, -923, -741, 1818, -352, -362, 1068, -1507, 711, 1195, -1015, 618, -595, 364, 1173, -1267, 411, 188, -630, 1409, -418, -1260, 631, 136, 205, -564, -912, 1577, -235, -810, 860, -951, 123, 911, -1071, 512, 103, -627, 907, -542, 160, 172, -976, 2009, -537, -1754, 1655, 320, -801, 160, -310, 478, -115, -328, 1083, -1453, -222, 1533, -962, 268, -208, -1042, 1409, 219, -935, 122, -409, 1511, -114, -1608, 822, -64, -311, 873, -1445, 144, 624, -985, 950, -612, -388, 888, -305, 497, 175, -1357, 1572, 198, -907, 173, 125, 1215, -145, -1870, 1628, 476, -1338, 1035, -195, -185, 639, -610]
1017f10J430j540P4K161k249O04P53j594K331j181k042K218p8j74L4p60J036q20
1035d07l42K496k386j06J884j916J240Q3j504R21j87Q09j3k127K408m25k012K298
1053G14k75r90R68j071J346p67j344K612q61j371J996j106K21P5r69J897j101
1070b6o52Q55p99J594k57k516K547l56j367J954o22j118M2M68J815k443J2K798
1088A929k826L50K103k474M81J245p55L26j015J099k15j798K606n71j731K226
1104I80j140k26J521j834M31K88k14Q12r00J83O61j984K528n2k768K050k21l59
1122b44P10j022P63l81r71K371q85j376J501n25L54l87q54J908j384m43K140j876
1140f01J17J224j077P06l02o30J043j300J190K39j523J668r94n07K036j712m17
$$ y = [-610, 820, -720, -646, 1515, -734, -130, 623, -971, 1360, 179, -1863, 355, 277, 103, 137, -623, 413, -407, -749, 1747, -639, -745, 1139, -777, 463, 546, -958, -37, -224, 585, 572, -1555, 853, 428, -1584, 714, 439, -551, 417, -654, 692, -75, -1419, 1193, 332, -1039, 957, -149, 72, 147, -822, 1075, -26, -678, 177, -622, 972, 715, -1801, 746, 390, -977, 977, 355, -763, -721, -253, 1562, -881, -869, 1929, -897, -547, 1556, -918, -437, 808, 53, 379, -636, 463, 248, -1550, 1056, 485, -1246, 980, -160, -386, 1135, -699, -268, 20, -194, 618, -282, -99, 562, -1422, 1106, 1054, -1714, 336, 115, -244, 466, -556, 207, -174, -1145, 1226, 341, -1035, 466, -59, 295, -92, -946, 962, -422, -865, 1275, -601, -484, 740, -337, 369, 67, -563, 480, -820, 370, 609, -914, 754, -240, -747, 1289, -423, -840]
1157h40J791j285M03J05R9M0k082K513M83k833K024O04k230J626L9p62J9j07J382
1176I89j245o33K078j747P3J526j547P14J31j131J397m04o77R23p89Q46l51j029
1194h76K031j286p80J755j219J31O36p61J196j206k89J747j667J58J319j217N06
1211A78n90K70J086j999P94J280k091J482K54j310N72J24L02K04j652J658o57
1228i5l11J373j653K87J346j910R94J000j726Q34m26M72J73j061J674q62j653
1245a544K616q92j032J575q23K5N6l08J347j666J03J253j187M58M55j051R34m29
1263a10n8R26j403O67N23j032R37o54l11J413j201J12Q46j222P93k35l52J063
1281G02j336R83N67j877J237L02j171Q52m81K88L51j460J875n99r15J622q68o95
$$ y = [-840, 951, -334, 69, 174, 273, 313, -1769, 744, 1227, -1606, 418, 1022, -1208, 418, 457, -305, -286, -393, 989, -256, -889, 1189, -558, -485, 1041, -506, 208, 339, -792, 605, 201, -476, 447, -342, 504, 153, -876, 1155, -131, -911, 844, -375, -244, 392, -369, 827, -379, -668, 1079, -588, -430, 889, -328, 178, -412, -142, 944, -1055, -261, 1019, -1072, 410, 664, -646, -74, 50, 352, 556, -1096, 562, -95, -406, 967, -686, -399, 947, -963, 31, 1031, -695, 139, -287, 185, 358, -703, 971, 109, -1544, 1072, 180, -852, 723, -100, -75, -19, -327, 1020, -646, -543, 710, -477, -19, 436, -615, 319, -110, -168, 758, -645, 22, 545, -487, 450, -204, -515, 898, -303, -191, 655, -567, 226, -9, -361, 702, -634, 349, 916, -961, 276, 578, -593, 259, -222, 66, 417, -1043, 832, 233, -682, 940, 72, -623]
1299f23J282r69N51k76m60J316j026N0P67j415J243J39j208J250p70m81J399q94
1317a25J85r3m90J159j032j65J319j370M04O95p50M01l12J02N89j268O88P55j405
1336g13Q09K30p82P19n66N38n6r39J307m97p05J255j032L25P18j316R82j64m69
1355c56P56n88J93M65j243J212k68r86J474p99l11O58o21R27k41o89J380j263
1373c00k11J379j320L01L69o58P54o49J0R32j234O08M29j041J090m64l23R68j103
1392d63N66L89j026R66o08j63R76j213M46M22r50R32j10r18P87l73N79K10j237
1411g88J330m32q49J063l57o9K74p39R05m65k54J270j176J55O15j303Q03K04o78
1430d91P03k77j32N45r53R51O9r83J106p08j15Q69p83j61O32k87L67p16L45N00
$$ y = [-623, 659, -310, 241, -35, -495, 821, -205, -155, 612, -803, 440, 579, -629, 621, -149, -630, 769, -125, 60, -33, -523, 636, -396, -561, 758, -612, -208, 487, -263, 138, -174, -72, 517, -751, -63, 692, -713, 96, 326, -456, 263, -303, 235, 179, -760, 547, 50, -655, 600, -432, -107, 611, -705, 277, 113, -356, 400, -188, 5, 470, -773, 439, 171, -815, 659, -140, -451, 207, -414, 513, 272, -417, 963, -300, -511, 868, -452, -151, 218, -440, 314, -335, -325, 607, -627, -19, 410, -631, 459, -5, -328, 640, -463, 103, 492, -534, 432, -176, -339, 637, -576, -130, 292, -658, 274, 164, -754, 33, -340, 239, 449, -788, 542, 110, -739, 324, -33, -102, 172, -567, 338, -127, -381, 889, -287, -132, 483, -820, -17, 187, -491, 212, -65, -197, 348, -605, 346, 415, -568, 538, -170, -285, 584, -199, -360, 272, -15, 352, -364, -19, 481]
1450D81j271J077L73j317J038K6q33N44l31O71k60r08J075n27q1Q18j367N57O88
1469D53r51O93O3l41L97q23P01k3q94R86P6p69O84o95K13M63j006R31k02n02J229
1490F83j106L83O05j017N15L07m78L50q18L67N71j025Q60L93q58N46k65j31M43
1509C25q16O95o8m98R18q76j22J119r13M1P86j231M73L00nRq89J104j62r63J384
1530F11o30o23J045o56K13M89p11L66l83j02P26o69L26P51j018J91K80l87M97
1549C16o41M53K67r53P67J35o27N17o09k3R31r01O99k58m73P65o69J16P65r68
1569c91M14L46o00L25j47j09L57m76O44j73j079J377n61l37P39o69L38M22m43
1588b3L81l89k44O79p02L36j1o35R05L4p19M67o21L65K14p4M36o49J20O96r46
$$ y = [481, -790, 287, 660, -657, 381, 407, -426, 118, -213, 458, 198, -710, 365, -162, -243, 575, -792, -235, 453, -498, 195, 258, -83, 314, -509, 192, 169, -725, 261, 337, -432, 252, -443, -230, 233, -773, 158, -44, -546, 683, -423, -40, 565, -452, 63, 370, -108, 242, -576, -209, 362, -663, 197, 590, -268, 278, 13, -118, 325, -491, 204, 136, -362, 556, -320, -442, 677, -236, -195, 591, -640, -167, 133, 128, 137, -752, 352, 190, -773, 611, -19, -642, 403, -253, -40, 449, -262, 104, -279, -381, 345, -324, 2, 753, -265, -74, 206, -181, 316, -325, 128, 395, -558, 209, 344, -283, 234, -375, -398, 533, -368, 331, 73, -400, 365, -304, -188, 577, -391, 23, 369, -231, 94, -53, -162, 195, -281, 363, 190, -889, 488, -73, -410, 329, -340, -2, 420, -23, 358, -31, -275, 404, -298, 38, 27, -608, 297, 331, -388, 79, -542, -177, 37, -37, 399, -250, -130, 566, -380]
1609c80K88P15q69O2K85k03P24r32K39M08o83K57K66n18N19l17J19K70q30O69
1629H9l6m40P35l24j87P09o78J23J42n47O00k82p8P16j266Q30M33j108R43m88
1649a14j69K36O7P2q9k99P98m72k64Q02j070O51K21o89N67j22k29M29l86J62J6
1670A18l55O96n02k34R68j040J68O99n91J59K30o74N11k59J86J46o88L72r8p0
1690b58N46l68j91O69p92O31Q1o37K88m5O4N3n89P50P6n18O53o43k86J004m69
1711A9P2J09o21M32J38k39L08m89L17l6k26O49l83n89J072n79j17N91m21M1j41
1732i3K0N42j133O02J74p38R16k36j47J42J4j18R0m46N00J71n36N32m56J7M95
1753C12p61O96j78k75N40q07J80N44o27N93q6l89L62q1k38N26p13N19k56j91O73
$$ y = [-380, -92, 623, -246, -184, 101, -102, 622, -310, -71, 337, -346, -89, 177, -341, 178, -139, -20, 250, -580, 89, 53, -387, 348, 24, -163, 546, -132, -9, 133, -414, 186, -96, -174, 542, -724, 106, 539, -569, 374, -114, -283, -47, 20, 92, 3, -296, 502, 30, -234, 568, -502, 149, 370, -319, 248, 126, -103, 326, -60, 102, 118, -237, 459, -43, -277, 691, -349, -181, 518, -73, 86, 316, -358, 153, -106, 80, 226, -462, -90, -188, -258, 288, -80, -271, 398, -394, 237, 318, -319, -31, -76, -12, 41, -548, 202, 278, -240, 413, -230, -516, 488, 19, 91, 200, -421, 11, 149, -90, 218, -271, 46, 10, -216, 433, 50, -539, 533, -46, -163, 428, 7, 48, -93, -73, 469, -664, -62, 112, -626, 290, 54, -93, 49, 63, -55, 35, -411, 89, 260, -276, 256, -200, -183, 312, -449, 247, 69, -206, 334, -473, -293, 251, -376, 217, 131, -258, 104, 23, -215, 311, -402, 117, -139, -330, 343]
1774C43l99j83N30n58J89J80l06O44n59J7M01m76J41K65o86O43j45k36L09m63
1794c49J56N53o27O32l65q6N55q46L92J66n11M87j98k75O86o47L84L48q18L92
1814B9N0m75L97k50l1L79o9L80m25l38O43j69l24M74m02L06j22m00O69n06L67
1835A83N8o37N68J7m44M40k60k61N59k58K55P7n36M01l91P1M85n44J09K74j96
1856c0J87k31q2L86m28j57M57k86K35j92lN24o05J64K97m33O39m85j65M15k80
1877g3K81j5o42Q05j92m04M39l82K9N28r30N46J23n43R11l40j77K89k87P6O1k74
1899a71L37k57j42P19q30J80J04r0L18m58J95M14o98N80K65o31L73l65M5O23q09
1920b98N76j5o09Q47m66j71K57l30l2M85o60P80k74l99M99k67K30k11l77M82o7
$$ y = [343, -56, -239, 291, -267, -78, 102, -204, 440, -119, -102, 299, -177, -36, 229, -457, 186, 41, -195, 114, -349, -193, 360, -267, 365, 0, -86, 469, -377, 15, 181, -330, 157, -41, -316, 370, -277, 107, 455, -363, 29, 79, -396, 1, -249, -280, 99, 30, 410, -15, -353, 290, 121, -203, 271, -131, 175, 53, -347, 322, -184, 183, 241, -396, 172, 189, -255, 185, -75, -336, 223, -35, 220, 297, -239, 162, -229, -158, 327, -217, -108, 166, -30, 157, -74, -156, 230, -198, -355, 102, -184, 51, -141, -144, 380, -225, -61, 236, -197, 442, -43, -208, 207, -73, 208, 193, -449, 356, 164, -240, 199, -183, -154, 374, -556, -10, 113, -430, 481, 141, -36, 253, -34, 42, 103, -171, 166, -91, -233, 486, -344, -164, -60, -150, 168, -290, -95, 319, -379, 201, 466, -165, 208, -157, -112, 511, -298, 278, 263, -346, 501, 35, -136, 121, -209, -241, 244, -416, 364, 90, -309, 190, -77, 153, -58, -435, 47, -20]
1941b0j76L61m24J27K50l24K18J84o54O36j05k48N70o02K76j89r0P14o95J13L81
1962C03n59L70j18l06Q50l31l50L97m54L82K0m09M39l65R5L2k30K28J04m60M25
1983F3j72Q6K18k81K93l33j40N22l05j47O64n97K09K51n75K92rj26M24l76j06
2004a45L39o2k80o3M9O38m43j96L02k90J42Q4n6q6p8JK18l72K86j24q9O51m66
2027d0l71N90m28M15O6m62L79k54O7L47q17P56j72l25N96k62j28K11l02K53o6
2048E3%J32l31J55L50p61K62M06n78M70j63m06P14l47j9J71k68L95m00r5P37o14
2070a37K1M90o52L97n3m19N27j56kJ06l85J43J48m13P30m28q7L57o01P41p7l56
2092a06J32R1j79K22j42L0l47K39K70l49J00L29p57N33M82r36L99J39k88L98m03
$$ y = [-20, -196, 165, -259, -132, 118, -206, 12, 196, -458, 178, 73, -175, 395, -207, 69, -120, -210, 504, -191, -78, 303, -256, 114, -4, -310, 540, 209, -141, 256, -198, 184, 204, -205, 234, -131, -36, -4, -234, -6, 98, -362, 63, -109, -23, 195, -86, 207, -126, -266, 256, -49, -196, 468, -129, 80, 331, -244, 48, 39, -87, 337, -39, -145, 194, 132, -148, -211, -162, 476, 33, -163, 139, -151, -9, 75, 19, -67, -145, -144, 74, -298, -12, -136, -225, 426, -40, -411, 179, -249, 166, 232, -230, 149, -105, -38, 309, -508, 248, 76, -249, 347, 85, -43, 168, -134, 119, 53, 53, 185, -146, 9, 359, -402, -140, 266, -312, 158, -5, -411, 303, -44, -63, 108, -160, 235, -165, -260, 477, -137, -116, 374, -278, 119, 66, -353, 174, 18, 16, 122, -263, -120, 28, -385, 345, -83, -170, 187, -414, 327, 250, -106, 26, 117, -62, 160, 18, 48, -299, -60, 210, -139, -39, 290, -467, 66, 548, -388, 11, 150, -138, 260, -143]
2113a43j1L41n52M97m5m22O68n53O8M84o32M16j50k60K26j38J03L53n54O38l68
2134c4L6R9l03Q1L95n82M61q6r9J21j05J60m7l53L50n0n46R19n03m5M79m12k4
2157h8k9O2K63j84k09J90j58J47O8n15O61J2o45P46o68L30J28l21L87j24l3J75
2179A95l63J80J80o29O40l02LM52o34J53L15k28m1K86k56M6l36L52J70n12J95
2200a34K79l61P14o58J39Lk08L23M9k65L01k50l9K79l22N24j39n35N86K1l76K47
2222A78m60M81J1m09M90n99K05M36m25L45j22k70L68k86j14K29j8K53j47k08J83
2243A21p0j10K32l58K23N2k36M19k65k22L31j75J7K57l07Q7j28M0L77l96K13K17
2265C19n26O35j92l28J89k36q7M04m16L13k6j07L62l71O1K17l61K33L7m46N88
$$ y = [-143, -154, 187, -365, 132, 87, -335, 333, -220, -152, 332, -300, 116, -34, -294, -68, -206, -103, 250, -304, 334, -34, 2, 101, -202, -121, 274, -308, 153, 67, -32, 89, -16, 144, 97, -256, 94, 44, -502, 417, -86, -131, 348, -64, -88, -117, -55, 208, 24, -185, 5, -153, -6, 62, -453, 208, 220, -425, 321, -347, -17, 111, -210, 177, 53, 20, 195, -168, 12, 192, -437, 203, -99, -96, 356, -278, -125, 190, -38, -79, 207, -49, -3, -339, 13, 183, -329, -134, 145, -216, 498, -160, -21, -18, -226, 97, 146, -119, 182, -68, -107, 172, -150, 374, 235, -300, 286, 307, -69, 178, -282, 199, 210, -199, 291, -308, -103, 333, -92, 253, 131, -139, 229, -57, -171, 58, 40, 293, 146, -62, 121, 51, -59, 173, -185, 38, 90, -146, 273, 8, -214, 117, -58, -41, 216, -91, -4, -132, -92, 285, -111, 102, 319, -207, 428, 236, -92, 97, -139, -226, 178, -238, 75, 49, -58, 304, -67, -6, 211, -150, 83, 120, -326, 262]
2286B62k54j14L69l46Q1J99k39N7o3r8J87Qk19L97m77M50l47q9N31n31J02K81
2308A47l30J1k3K2K67k1j82N82n26J74j45p0K42k28m4K87m24N70k45k21K14l54
2330b97L52r8J5j76K00MQ3j06k5L08p07M22K67n31N78k80l00M77j64K08k26j54
2352a50M10k85j99L07q4kl6o0J99l58J16L22k16J59j1j20J23n4m39M66p0J36j02
2375E2O3jl11n8N43l46J80n4j22K88j7m66N46n52K96J65n34P42m02r7J45r7J18
2398H1j5k96M16l23j86K66j67K46j06m2L18k61j89L33j58J17J06l44K78P0k66
2419a22O4j24J69K25j85k78M97n70M48j88p0K02l42J64K54n38M64l8r5K10k69
2440a22J12J34j40L20l56k0K75j66j16J36o4k35K64J07J20l92L14P7m61L32K24
$$ y = [262, 8, -106, 263, -83, -2, 197, -42, 15, -48, -146, 41, 49, -170, 227, -250, 200, -147, -236, 295, -236, -134, 147, -183, -172, -195, -173, 94, 73, -109, 473, -53, 121, -24, -94, 148, -80, -124, 163, -261, 309, 64, -157, 57, -297, 55, -43, -28, -204, -4, 0, 83, -23, -48, 260, -447, -25, 242, -289, 289, 9, -291, 186, 22, 230, 4, -150, 260, -25, -224, 83, -1, -3, -39, -99, 100, -258, -142, 180, -36, 123, 112, -8, 115, 61, -378, 88, 18, 154, 52, 115, 114, -197, -255, 288, -58, 122, 68, -54, 234, 217, -249, 297, -255, 41, 206, -328, 414, 12, -85, 60, -37, 81, 66, -230, 186, -137, -323, -57, -224, 22, -84, -126, 192, -69, -258, 75, -83, 34, 140, -204, 74, 144, -122, -58, -182, -13, 212, 27, -251, 246, -324, 124, -64, -134, 68, -274, -110, 144, -394, 70, 32, -63, 147, -122, -10, 124, -16, 304, -52, -72, 203, 37, -79, 57, -7, -242, 22, 129, 249, -143, 171, 248, -213, 119, 343]
2461C43l05P7m44M30O8o16L03J09k43N30k96L1K83n48L94j91l6J89k67P1R3j53
2483a78K00k32J42mM2n3N3j59K79l8l84N54l94J6M8k5J39K9q2n2j31J70M52n19
2507a27j02M03l54L20j17K7J71l89R2Q5j83K12rl52N35l49J88M16o84K32j94J35
2529d4j4j00m9M90m70L42K0o05M62j02O1J65l74J08J32k14J45K12k40L75l56J36
2551H0j47Q4N6n8O4oj50M3K36l16N2K68k08J36m38M59k46k19L74p8N5K75m15J51
2575E2O6j58K68m54J04K08l82K00O1m6N1K52n16M34k52r3K55l76O29l91J17J65
2597A94l79j2J93r3J29J86k86K54j63R3r4J49R6l00j99L80j23j41M33n63J54j8
2619a10r6L24jk83K36r7J12J15l37K93p2k77J37L4k9j05J28k50K35j67K00r8R8
$$ y = [343, 38, 115, -329, 101, 169, -447, -144, -35, -278, 252, -44, -13, 270, -278, 116, -75, -111, 78, -189, -118, -25, -178, 22, -210, -68, -72, -30, -83, -30, -189, 90, 52, -332, 222, -172, -156, -108, -133, 6, 35, -47, -99, -230, -60, 392, -127, -229, 174, -180, 140, 23, 50, 221, -168, -76, 9, -174, 38, 29, -323, 212, -137, 51, 467, -217, 15, -179, -44, -58, -158, -207, 283, -187, 155, 175, -430, 32, -70, -9, 156, -218, -110, 22, -192, -47, 165, -75, 300, -56, 80, -67, 17, 73, 15, 79, 73, -77, -34, 202, -114, -62, 206, -2, 134, -304, 155, -91, -310, 64, -14, 41, 316, -99, 52, 118, -40, 228, -226, -122, 86, -296, -96, -35, -81, -30, 222, -294, 140, -112, -205, 50, -326, 303, -88, 29, 194, -185, -197, -4, -97, 32, 218, -68, 186, 23, 116, 22, 171, 267, -33, -232, 148, 25, -116, 317, -246, -92, -110, -206, 118, 117, -166, 70, -27, 85, 200, -137, 156, 84, -193, -56, -22, -51, -156, -28, -278, -43, -210, -10, -108, -10]
2642a0K50k54N4Rl39M83l39L6J12q3J08RK17k25J08k10J83l5l1J2o1J85K6k01
2666DK94l69J46l21N62j36k04M03j71m29M56n1n83O59p0n98M56l16n8J65K18p7
2688b0r4J62J02k31K9K65n79N83j80k26L70k34Q2J39m84L86j13j59N66m04R5M8
2710A03k25L19k02k06N02o06L97p4k66L77l0l0%j5k72L53K6m3J65o86N51N0j41
2733D7N5l94L25j48j01K44J7RJ33m08J22oR8L5J45n4j48j61K91j40L6R8j5m7P6
2758A09l40N21q3r8J29k99P5n7J30L9j44r7M7l0o3K85j67k61M59k1o2j62M3p6
2782a23J81j71K00j99J78K18l17K37k55J22mj96K20j14PQN7k29J36Q7N5J04l92
2805a90J98M5J2j9k6N2j02j4K44l25N5P6j28K00J22k58J27J26j61K45k27J32l9
$$ y = [-10, 240, -14, 40, 49, -290, 193, -146, -110, 2, -81, 27, 36, 253, 28, 136, -74, 109, 74, 43, 55, -6, 179, 205, 4, 298, -71, 75, -246, 316, 180, -24, 379, 208, -221, 235, 184, -399, 260, 190, -408, 48, -268, -326, -161, 57, -20, -114, 48, 150, -81, -52, 213, -366, 217, 37, -189, 181, -53, 29, 168, -316, 70, -43, -202, 364, -40, 55, 103, -122, 197, -5, -211, 291, -315, 82, 8, -258, 119, 89, 59, 59, 44, -228, 125, 151, 108, 273, -413, 138, 188, 47, 102, -292, 33, -115, -216, 28, 45, 54, 187, -221, -99, -105, -7, 28, 173, 119, -29, -190, 101, -39, -3, 95, 80, 33, 109, -231, 290, 207, 109, 238, -61, 14, -43, 87, 126, -18, -115, -68, -98, -161, 124, -43, -304, 155, 134, 72, -90, -47, -123, 58, -113, 87, -112, 66, 284, -33, 204, -51, 71, 67, -129, 91, -23, -16, -8, 49, -180, -44, 43, 98, 202, -190, 8, 53, 65, 46, 20, 72, -30, -44, 200, -125, -70, 6, -122, 78, 200, -58, 69, 195, 34, 279, 52, 184, 145]
2828A45k36J36J01r8K17j31P4j06l76J99j66K11r0R4M1N3l7l7J01k23M65n03P0
2851i6K09l15K74P5k05L84m74J78R9q5J98k84r5K51k10J9K50j77N6m9k33L16k55
2874a69M4J79j45n8J84o6J72j97k90L88j44M87k79J06k63J69J14j16l20J91J12
2895I9r1J6P8k95J93J72k60J30k9k43K92J2j91j24P5L54l49L56q4l20K11J67m54
2918b85M10l85K55J07j67j34J24k20M02m45K25J15j81P6O0J42M6l97L38N5l1j14
2940dj07j09L29j78K4K05j25J10N4l0Q3k56P1J65o11M00Q3j27m2j09J30K68m81
2963b57N18k52r1J63k15J07P3l05M57j91l5l9j02J1L33l22J28J83k20L61m67K83
2985A21r6j28K64p4l4J0Q5j03k54J39K41j7m04N23n27N3L13m39L46p2n6K91m72
$$ y = [145, -91, 45, 146, 48, 265, 134, 208, 102, -274, -75, -241, -30, -120, -26, 15, 68, 31, -6, 95, -128, 337, -166, -96, 113, -202, 72, 147, -58, 326, -148, 30, 129, 44, 242, -42, -137, 114, -96, -77, 173, -4, 52, 3, -230, 86, -169, -125, 54, -91, -149, 35, -31, 141, -56, -346, 42, -102, 385, 106, 212, -51, 118, 232, 116, -204, -13, 99, 8, 24, 102, -193, 0, 172, -88, 42, 13, -230, 62, 74, -117, -241, -166, 188, -161, 195, 111, -209, 2, 169, -285, 125, -260, -5, 102, -65, -199, -75, -295, 107, -338, -113, 2, -179, -103, -43, 99, 145, -252, 86, 141, 110, -4, -111, -220, 109, -69, -45, 160, 35, 145, 199, 169, 252, -4, 67, 232, -379, 21, 104, -23, -65, -174, -44, 224, -257, 261, 9, -82, 81, -134, -27, 46, -259, 198, 7, -28, -67, -169, -158, 175, -147, -19, 164, -56, 305, -162, 121, 25, -103, 161, 87, 53, 63, 148, 45, -209, -70, 171, 154, -250, 273, -254, -201, 112, -327, 19, -53, -109, 182, -290]
3008b90M70j72P1K4j4pK71l85j89J77p2J80K6l15J45N3q1K06k40J69o6j64J81
3031b2j4o0K41k36k3K26k29J47j60J4Q3m0J04P7o6J92k03k20L7L29k41K11k95
3054a48L65q7l39N18l62J53Q9j28K9j5l05K96j32n3L44J4j25n7j89K42p5k54M01
3077A82l84K74R4l22K54j83L05j79j15M8J4r4J78N7j65J21l34L42j0n9L97m07
3099A4l0j05K46k27K59j40K46j39K3j77J0J54J53l22J85l46j1K72k33J83J13k82
3121a54L79k10l11K94j45QJ00M2j26n1N6K63j91J32R4k86J63J87l09J8p5R0P5
3144D3j82p3J15J94k21J00kR5q7k1K00k65J30m5l44N71o3k14J16KN7j03k6P6j61
3169a08L78j68l86N02n8j67M3j58J1J55j19J24J15j36Q4j87n4M33n16M58l22J73
$$ y = [-290, 180, 8, 79, 103, 89, 82, 353, -32, -221, -44, -116, 64, 90, -225, -80, -27, -108, 98, -142, 27, -39, -203, -22, -36, -96, 145, -91, -114, 112, -117, 30, -130, -116, -33, -73, 31, 108, 42, 234, 31, -189, -152, 177, -64, 147, -148, 217, 130, -209, 309, -53, 100, 189, 61, 90, 75, -230, 66, -66, -119, 225, 239, 114, 57, -132, 110, 35, -219, 182, -202, 72, 166, -156, 98, -85, 220, 41, -74, -26, -12, -106, 72, 129, -36, 85, -249, 93, 83, 24, 421, 14, -16, -121, 125, -102, 157, 17, 263, 124, 147, -30, -20, 134, 287, -35, 150, -196, -207, 65, -168, 15, 128, -154, 225, 15, -296, -2, -147, -139, -39, 3, -123, -174, -118, 145, -46, 86, 180, -106, 57, 244, -65, -47, -122, -32, 43, -139, -212, -97, 97, -124, -24, -26, 69, -18, -39, 161, -104, 26, -19, -363, 208, 145, -69, 47, 49, 106, 3, -23, 53, -108, 270, 102, -284, 218, 160, -7, 36, -122, -111, 44, -75, 49, 164, 28, 112, -75, -129, 304, -212, 246, -76, 97]
3191I7j03n3j91L64l69N09j59j19K01k67Q9J85j95J65l51j22K47K22j06k9p0j9
3213g4K22m71O46j51p8K53m31PK21o84L70j5J05J76M3m49J95j33K57J61p6K59
3235C53m46L0K43k31J6kj74M11l13K42m1k2L0j28o4M3J6O1J12r7J17L6j65K50
3259B77j99k5J09l23L51l7l18K01K2Q5N7n29L08Q8k57K43O5k88L31l37l8J73l78
3282d19O42l45L16J3j79n7K04j53k5m8J10m0p5J60L6k74K15m0j46J78j70J48R8
3305A49k60q0j32J49L20j99K20j0k66R5k59J74K42j06k69K98l2l8J79m53K04K68
3327A94j56K59l34q1K08p3K18k26%K8r7M08j81k65M03k42k62L24k2j08M4j36r3
3350a90L46k93J63K07j44j63k8J17O1k61J22j05K88k12J6J76j04Jj5J6j95N07
$$ y = [97, -6, -59, -250, 114, -255, 254, 95, -24, 177, -90, -1, 184, -11, 154, -197, -319, -72, 150, 44, 15, -55, -74, 148, -323, 323, 172, 94, 347, -84, -77, 144, -540, -170, -185, -80, 96, 139, -310, -115, -248, 9, 170, 94, 353, -93, -63, 180, -51, -35, -37, -211, 200, -113, 129, 88, 66, 96, -32, -96, -53, -37, 24, 136, 39, 156, 192, 27, 277, 78, 53, 162, -161, 190, 153, -165, 36, 58, 143, 200, -329, -21, 67, -190, 53, 118, -170, 161, -176, -214, -41, -419, 223, -122, 194, 207, 28, -29, 175, 22, -3, -51, 59, 19, -56, 104, 140, -134, 81, 41, -105, 73, -97, 51, 149, -111, -191, -323, -174, 146, -53, 167, 157, -109, -14, -273, -99, 143, 37, -232, 66, 34, -4, 175, -278, -74, 194, 38, 297, -37, -118, 90, 17, 235, 9, 9, 37, -60, 348, 167, -98, 305, 63, -199, 125, 103, -5, 39, -97, -190, 156, -137, 26, 233, 89, -74, -102, 15, 76, -185, -63, -168, 120, -92, -76, 100, -4, -3, -18, -2, -197, 310]
3372C10n43P18m89k56J99L63k71J51j86l5J68n23N77N8l48K68l18J44PJ6k02J49
3394d3OK5j88J41J42j22J8r6J29J34k41J54n3k39R7r0R3L34k56l37N32j74J72
3417A38j37Q0r9j56K45q7k55L30M3j84K44j99j36K16j29J40j00j01L25J63k68
3438G3j69k1LJ48k45L52k56PK74l35M61k13j26M90l48l46M08j37K4J39l42K03
3460D4l00K66j5j11J24J52M1q3n4l82L20j58K5K58j97K46n5n1R2l06%K9k31K81
3484f5R3N8j94J95r6J86k98O1J16k9o8Ol4J05k49L20o8q5J62j77O1m3j93K79l7
3509Fj39J74q4j47J98L14j53k41p7K2J04K02l29j89K23K30k09J72j05l3J2n5J96
3532I2K41l27K09k41j80L32k01J27k12j0L76l2k96J17p6J44n8j51L38jj75L42
$$ y = [310, -233, 485, -4, -260, -61, 302, 31, 182, -4, -39, 129, -394, 183, 241, -107, 161, -157, -13, -6, 10, -192, -43, -37, -12, -200, -59, 83, -39, -21, -117, 12, 146, -95, 59, 6, -233, -136, -226, -133, 201, -55, -392, 140, -34, 138, 1, 81, -18, -174, 71, -16, -271, 59, 102, -82, 162, -37, -173, 43, -86, 54, -46, -147, 178, 341, 73, -96, -117, -114, 34, -211, 141, -115, -108, 166, -169, 292, 79, -47, 443, 95, -251, 157, 20, 44, 183, -159, 44, -256, 10, -5, -116, 8, 160, 201, 118, 64, -318, 2, -156, -131, 127, -70, 176, 121, 70, 162, -144, -144, -115, -346, -65, 28, 86, -108, 87, -9, 177, -121, -60, 56, 27, -41, -35, -69, 36, -213, 107, 39, -46, 116, -61, 0, -43, -236, 43, 6, -133, 41, -43, -190, 8, 322, 169, -72, -149, -127, -23, 179, -150, -339, -116, 114, -95, 77, -28, -61, -49, -104, 92, 333, 6, 215, -26, -206, 126, -75, 52, -160, -170, 206, 174, -122, -5, -81, 63, 5, -146, 192, 191, 16, 358]
3554C58j84k73p6k3P2N24o49J10L18j2j66q9K5L04l12M04l69j37L70j95J65j24
3576D1j35M51k19k20J80p6j29J68m2J33n4j73o4l4J24J65j69q4J61l90L22J02
3598E8Q0K71m37k0K29j34p5j82L01J99k15m5K7j97M49n77J80K59k61K58j65Q4
3620H7l17L72k10j66K59R8r1j16K76k65M4N0r1K02l1k62J07k6l4L16k60%j16m3
3644b17L62k01M2J89l61M52j70p0J4q0j36m3n2J55J56l10M27j25j69r2K29K8r5
3667f7k28L82j88N0M36l61Q0L7j71J82n5l26L93l57K42N1k95L82l75q2K87J32
3689A49j46Nn2lm6j62M65l11J84J19j40j24o2J08J66j09j60J17j12R3J37j56Q8
3712D8j1j30N5J26o8n3J21O1l11K53k36K6J34J18j57j78N71n65M64k40J28o0k99
$$ y = [358, 174, -99, -175, -198, -126, 398, -251, -141, 177, 165, -1, -90, -65, 239, -73, 331, -38, -175, 195, 0, 165, 41, -94, 357, 138, -82, 98, 22, -107, 61, 19, 152, 98, -75, -139, -173, -49, 116, -53, -137, 24, -366, -44, 58, 138, 409, -28, -48, 181, 47, -28, -210, 91, 290, 75, 30, 57, -140, 309, -268, -88, 171, -90, 168, 3, 87, -230, 142, -68, -234, 25, 123, 32, -84, 192, -73, -29, 21, -70, 132, 101, -161, -54, -80, -114, 202, -58, -58, -174, -217, 145, -56, -14, 175, -186, 266, 96, 26, 40, -40, -176, -219, -271, -116, 40, -270, 157, 32, -137, -229, 0, 28, -67, -295, 87, -101, -51, 385, 24, 104, 141, -30, 152, 97, -229, 164, -193, 49, 100, -195, 187, -188, -270, 17, 149, 3, 8, -44, -47, -93, -255, 210, -101, 83, 202, 62, -62, -124, -16, 150, 41, -119, -2, -114, -21, 116, -40, 48, 37, -93, -38, 88, 20, -33, 88, 149, -162, 91, -145, -119, 15, 133, -24, -202, 369, -196, 268, 28, 156, 96, -203]
3735b03L23%Pk39j7Q0J96l23J59M9k41L92j12l2K16j93M0O8j39k00J29k0J55n6
3759C9j22O2r5N5J74j40O6j2j43L05k84L22Mk55K28l79J89Q8k48O4J65k65J85
3782Cl7J0N6k79M89o7l08K14j43k14K64m5J39p7j82K33k48K84j71j35N5Q4j22
3805a97L73m37L05J35k15n9R3n3J07k72J8R6o6J12J00n62M92J37j83J46k1J89
3827B38r0j30k10J20N1j30N6k2Pl3K82k03o1J3K03J44j60O1O4k43j20J24j05j05
3851b49M89j60j13j05J69N7j56L04r3q3K28m79L30j3p3J8j03P9j51P6J06j53N1
3874b4o3R1o9L30j2l80J27OJ31m5j41J48m18J45N5J54k6L8k56J63K32l46M78m63
3898a45m9J84J66k95Q7j14K15L21l89J64k1k37J53M0R1j17j14Q4O8k09K15l97
$$ y = [-203, 120, 120, 127, -112, -129, -49, 147, -176, -17, 32, -209, 183, 71, 39, 255, 62, 102, 170, 31, -169, -40, -60, 95, 39, -83, -21, -116, -61, 113, -27, 39, 27, -116, 189, -95, 227, 231, -24, 204, -175, 14, 102, -146, -82, 83, -182, 3, -34, -24, 32, -247, 242, 175, -133, 81, -62, -276, -12, -57, 82, 5, -177, 56, -192, 92, -79, -214, -159, -75, -197, 176, -261, 44, 179, -36, -95, -2, -55, 52, -220, -202, -106, -172, -60, 40, -522, -30, 107, -76, 70, 49, 238, 148, 18, -192, -72, -21, -151, -95, -117, -110, -143, 139, -64, -125, -112, 91, 235, 75, 136, 200, -43, -163, -39, -144, -249, 240, 80, -33, -138, 31, 88, -68, 236, 143, 60, 288, -191, 139, 126, 53, 71, -32, 47, -104, -28, 78, -75, -24, -87, 4, -65, 265, 253, -127, 0, 6, 137, 92, -49, 99, -319, -174, -119, 35, 9, 47, -209, -46, 186, -160, 318, -145, -194, -10, 156, -139, -52, -166, 49, 370, -19, 145, 124, -113, 40, 80, 171, 54, -60, 24, 92, -117, 98, -299]
3920b99N59l25J36q4r7K98j97LK06j57l18M70k95J29J38j58J1j49J09j85J71k75
3942c09M44m30N11j08j17j37L37k54O6J38k59K85k90K87J49k95J07q0j35L10j61
3963E9J4j05J01J47l28kK55O7k26J50k52K45l34J73P4k07J97K11l72K19L30m75
3985e9K36P3k53O5J37k05j32K00M7j02K8L2j91J93J14l49K71Q2l44L01K2L20k89
4008A97l91M46j98l01L78j40J60l6M4l81J98J13j51P5J03k23J63j72L6Q0R8k65
4030a67O2R1K82j86n5q5K04k31J67K2j84K48m04J43J85k24K63j08J61K2k09J51
4052A48l8l08K40j83J04J3K2k21K51k08K57p8j24J90LP3k3LK08k96k00P1K15k23
4076a04K7L05k63m7P7j6K69k94j89K84J12p8r5k8R2j75r1J80J9n1oNJ22J3n5j6
$$ y = [-299, 260, -65, 71, -13, -110, 188, -9, -6, 200, 43, -275, 195, -100, 29, 167, 9, 20, -129, -20, -205, -34, -309, 135, -295, 216, 108, -9, -146, 191, -63, 3, 141, -118, 167, -123, 164, 313, 18, 125, 45, -90, 220, 59, 73, -32, 69, 216, -112, -114, 141, 208, -18, 132, -120, 125, -209, -36, 38, -169, 28, 239, -133, 86, 416, -59, 177, 250, -3, 62, 199, -6, -138, 62, 109, 7, 35, 67, -124, 69, 183, -166, 105, 187, -157, 144, 166, 486, 197, -194, 252, 54, -247, 131, -9, 151, 115, 159, -222, -24, 89, -62, 13, 116, -107, 56, -116, -80, 0, 98, -167, -105, -14, 268, 82, 27, -58, 146, -85, 82, 104, -80, 168, -236, -93, 92, -132, 131, 23, 184, 206, -3, 148, 110, -198, 42, -141, -37, -24, -2, -223, 28, -180, 77, -1, -125, 65, 68, 141, 118, 121, 329, 33, -167, -96, 119, -104, -77, 228, -35, -82, -5, -21, 248, -46, -235, 49, 161, 83, -12, -40, 52, -123, -214, -34, -15, -66, -72, -67, 55, 68, 13, -3]
4102cL0J20j94l10J84j15N04k89k8L54k16M9o4l5J66j31L8J16k20J71j50j01L59
4125B35l34J90j49Q3l3L8j1J18o0l08K73j53M85k27m01K88r8J07J55k93PK82n97
4148d03N90r1j40Oj32K34j50J38P2r0l9n7K4r7L05j20j36N6J39k50pJ69J81m00
4172a98L81k21r3J97k42J59o4P3o5K95l14J52k8N2M7l27J19K71l85J86J99l19
4194a25kJ73j24o1K38J8m13J58L07j97L4P2m2P6n5J59k21j02K12O3k58J22j15
4217h3L5J18j94J18J59j47J47j87J5K30j91k07J92K8J25k54j30M82n24L89k1m31
4239c31J28k2K56K37j96j24K0L7o7K1J3J64j01p0K3Q6n0K4j65p9Q0L19QM5k47
4264IJ67n4J38l16j24L42p9m6j1M7J30k95q8L55l17J88n0k9K38l77j75O75n15
$$ y = [-3, 27, 147, -47, -357, -173, -288, 216, -73, -101, 253, 37, 86, 22, -13, 153, 22, 60, 176, -44, 127, -23, -124, 235, -99, 91, -58, 25, -8, 30, 19, 137, 77, -231, 42, -111, 374, 147, -254, 34, -64, 43, 198, -95, -88, 194, -403, 187, 96, -44, -38, -170, 64, -86, 52, 124, 34, -5, -62, -38, -135, 170, 50, -86, -30, 109, -141, -148, 21, 202, -198, 183, -38, -131, 66, -176, -17, -81, -8, -73, 222, -92, 60, 32, 84, 131, -196, -77, 194, -191, -5, 194, -125, -127, 46, -78, -139, 99, 117, -296, -138, 169, -28, 6, 78, 36, 112, 57, 216, -5, -107, 105, 168, -90, 32, -83, -48, 70, -124, -6, 153, 6, 153, -34, -19, 211, 20, -187, 5, 33, 158, -96, -226, 256, -268, 121, 100, -331, -203, -225, 31, 268, 72, -52, -32, 5, -62, -41, -28, 136, 35, -35, -12, 74, 24, 48, -117, -196, -116, 203, 211, 256, 9, 176, 122, 260, -56, -180, 162, 83, 37, 26, 73, 203, -92, -180, 175, -142, 46, -4, -33, 205, -172, -347, 328, -187]
4287a87J76r6j8j20J78N6K45k39J1J77j46M9j25j9J18J69o7Q2m33Q2J34j69L29
4310A87j81j39J71L6k02L22k53K67m29K68O4j04j21J81k15L6K04j35J28k45J36
4331b4N9n4J06J60n27N24l61L5J25o7J51j81N6J68l24K30P9k78K41k88J26J65
4353A21k65K94j11J61j06j04j12L15l64J89J49n72N56j70l4L05k55q2K08m65J42
4374b00M02l64L30k06J48R9j18j0L0l50L25k29k3K67j61J5%K60j43j18p6K23J17
4397B18j4l24J96j82K59l64J62Qj51K03n0N1k1k04L57K31l57n9M1m8K68j17J27
4420B30k22J31J27k17k5J51q3j03O0o1J29k41K65n6m58M70q4J2kj04p5M9R1P0
4444E4j74O7N5n9r4k2J94l39L22j21M33k84j03O4l4J04j29r2J52l6K95k04m8L16
$$ y = [-187, -11, -107, -125, -245, -67, -11, 234, -5, 6, 183, 37, 86, -39, -58, 60, 229, 162, 244, -189, -107, 27, -142, 187, 6, -133, 38, 74, -128, 194, -59, 208, -221, 47, 111, 7, -114, 67, -148, -112, 92, -43, 85, -160, -24, 35, -19, 87, 247, -280, 244, -117, -82, 43, -24, 127, -54, 2, 170, -154, 76, 155, -123, 118, -170, -44, 121, -144, 150, 39, 200, 94, -10, -122, 193, -171, 18, 167, -405, 151, -19, -53, 252, -3, -85, 123, -342, -200, 202, -162, 168, -38, 110, 209, 91, 81, 111, -239, 86, -143, -166, 101, -60, -45, -45, 215, 72, -46, -122, 101, 218, 204, -120, 76, -106, 153, -211, -49, -41, -192, 11, -39, 12, -9, -213, 144, 375, 18, -41, 0, -48, 220, 103, 230, 8, 139, 266, 49, 24, 175, 92, -11, 49, -12, 117, -124, 141, 85, -373, 97, 13, 25, 23, -81, -156, -107, -16, 54, -120, -53, 2, -57, -151, -173, 21, -318, 4, -117, 316, 32, -71, -7, -41, 63, -66, -158, -6, -42, 253, 49, 1, 317]
4468C17m81L61l36O9J44K3k10L9M8J47J31l73J91j92ok3J08l2J66l29M00j92k9
4491e9J94l05J95q6N4n5K21l11J73m8M0K98m24K25jk41J70J57k17l2K9O4%k26
4515a85K69pj46Nl0R7K9k4J00j65J3%k34K33J86q9k39L42k60J11j14o3K72k99
4539a98J58J97r0k66K68l43M10k91K05P2q1J15k95J94j41QJ0J23pl9J53l91L43
4562A14p9l07O49m74L7k8M8pJ68J6j39O1j42k9n4M73k99j9%k60J71N6p0J49k16
4587a81N7m7J03J1K8R1N4l37N9J49L4K98l07j22K02lj98J76j37J85O0k12Q8j36
4611h5J88Q7j72n7J46l67K07L3j94K86J12j20k4j52J96l6j14k3R0J13P4k46J99
4634A41J37l16M9J13j29qq7K36r2o9J13K6J82l31j96K61Q4l53K38j51%K69n2N8
$$ y = [317, -164, 197, -139, -70, 74, 97, -113, -74, -26, 121, 252, -121, 70, -122, -128, -151, -43, -75, 91, -238, 162, -30, -59, 135, -170, 25, -61, -7, -62, 159, -152, 21, -27, 13, 311, -113, 112, 111, -130, 40, 197, -20, -52, -23, 41, 41, -185, 84, 77, -69, -64, -94, 3, 32, 8, 108, -57, -44, -44, -278, -45, 141, 52, -187, 155, -105, 6, -108, -171, 101, -198, -40, 157, 67, -199, 69, -274, 136, -155, 50, 122, 41, 156, -139, 55, -86, -78, -68, 55, 48, 9, 162, -229, 114, 35, -272, 377, -97, -60, -88, -40, -47, 121, 137, -2, 59, -83, -112, -166, 307, 8, -11, -11, -271, -100, -44, -114, 35, -181, -124, -171, -68, -57, -29, 62, 116, -221, -162, -13, 21, 319, 12, -110, 92, 89, -109, 67, -70, 115, 175, -37, 51, -85, 103, 190, 18, -39, 107, -260, -53, -20, -214, 72, 184, 64, 40, -112, 84, 48, -66, -89, 1, 114, 188, -58, 141, 278, -38, 11, 124, -5, -13, -100, 136, 44, -25, 88, 114, 296, -35, -231, 30, 114, -239, -1, -152, -152, 117, 65, 123]
4658A23j65k15J73O8j5L6j12L63l93J45J30j71j66J07Q4Q9j45o9K19k63N1J81
4680E5O2k38K03Kj51L15o09N24l51J47p0j9J66j27k2J10k11l4L88k53J41J31j78
4703a9J72q5O0j35o0k14K01Q9l0j0l4O3m8J4j2m7j89M05J3j51R5k1J53l00J42
4728E2o3j16l9O7J46J22p3P3l28L27j22k4p1k3Q5M3k1l43M64q7k23J09j11J28
4752b8K8l2j8q0M2K69l76L16n9M8J02m1k17J72j68N2K42l39qJ27j9j79J61J62
4776A57K2l47R3J46l13K17K78j62k7k05J71j80K43m7j07R4J51j02r0j01p8M97
4798C10m33K22n2j90K77L7k95J97k31K12J62k15L3K6k38M40l68KL62m70N1L82
4820B21r5Q2l78J57K2L4L98l01l20K72j69n0J91m8K39k26j83J99j41r2L26k00
$$ y = [123, -42, -257, -84, -16, -31, 5, -107, 256, -137, 8, 138, -33, -199, -92, -8, 81, -64, -133, 86, -177, -126, 55, 117, -121, 82, 84, -67, 248, -361, 163, -188, -41, -111, -130, 36, -91, -113, -3, -214, -248, 140, -113, 28, 159, -19, 153, 68, 128, -7, -67, -281, -80, 9, -21, -31, -65, -2, -50, -36, -48, -95, -284, 121, 134, -17, 78, 57, 210, -90, 52, -11, -127, -166, -99, 47, 169, 96, 169, -159, 168, 46, 22, -49, -72, 13, 56, 35, -308, 156, 69, -154, -45, -156, -28, 0, -32, -50, -130, -88, 181, -195, 121, 62, 110, 212, 171, -46, 126, -42, 10, 252, -87, -95, 32, 13, -166, -5, 157, 179, -168, -75, 71, -242, -25, 253, 91, 64, -141, 30, -150, 93, 46, -61, 33, 184, 82, -8, -109, -187, 310, -123, 99, 47, -143, 134, 171, -124, 73, -158, 54, 216, 1, 34, 60, -178, 262, -106, -104, 258, -212, -161, 221, 126, 208, -170, -13, 9, 43, 441, 140, -180, 92, -77, -127, 64, 16, 255, 29, -154, 45, -96, -188, 138, -62]
4842f2R4p4O0K09k27j45J45K17k70J21l35L93j75P4nP6j17J66n69M36M9k48K12
4865B5r4K09l06K7J5M7k6K40l09J95n1J74k37J48r1l5j49J67K13k54K7K22j19
4888C8k1j02L3R5j36J3J81k78L27k78M6J45p2J07k0j10j72K40Ok45J41K60R1k53
4912C6k16J23Q7n2J17M0o6j42K16k11Q2J8l3N2r7j6J82l10J16K98m48M08k54L6
4936c4J10j09Q2j72M7K9p2L15l96k1P5L10j96J7K62m04K58j76L33k35n2l61M09
4959A9j2J14q7pQ4j97J0J18K52j05J4l15J82j02j57M08l23O5K1j27K04l11L99
4982A47Q4j67J1j8j45J37M5l02Q4K03j26l3J86j46J29l15J97k3qJ71M7r6j08R7
5006E1q7L0M2j10J6L19p1m62K37Q2J03k6l57K96N5k36K51j19r9J44j52q2K10j03
$$ y = [-62, 32, -42, 18, 227, 0, -145, 0, 217, -53, 68, -267, 126, -49, 25, 20, 96, -21, 145, -424, 12, 61, -187, 25, -69, 140, -166, -139, -124, -77, -103, 137, -172, 23, -28, 146, -91, 57, -34, -69, -218, -51, 162, -92, -65, 157, 38, 17, -85, -52, 43, -93, -80, 101, -177, 150, -128, -82, 63, -9, 98, 78, -32, -204, 36, 42, -203, -62, 198, 289, 36, -180, -57, 30, -22, 95, 135, 69, -73, 143, -68, 14, 32, -1, 51, -46, -62, 120, -190, -74, 224, -224, 184, -70, -34, 76, -33, 49, -123, -76, -47, -119, 196, -200, -221, -146, 164, -32, -15, 247, -157, 101, -75, 258, 23, -29, -390, 19, 7, 121, 34, 27, 111, -86, -76, 42, 294, 189, 203, -112, 70, -32, -189, 219, -104, -39, -18, -145, 59, -252, 147, 231, 64, 75, 57, -88, 49, 94, -208, -124, 79, -47, -80, 106, -40, 89, -226, -29, -52, -60, 111, 158, 62, -46, 51, -36, -6, 36, -74, -58, 261, 190, -272, -35, 47, 150, 124, -233, 63, 118, -118, 133, 14, -85, 59, -93, -175, 35, -68]
5030f8l8K17k25l3K49j21Qp1K75l21J23L1q8O2o6j23K19P9J6j1k50L65p0k52J38
5055D5p1j77N4J71L1N9j62K41j60k91K91P1j57K17j89j41K08k19M22l09J83q1
5077C6j28K20l36K66j52n7K20J91k64Q5k24K32m6r5K22j72J27k70M40l34J05M4
5099A10lj62K51m18M09k63N8J33n8R8k95J32J57l85L52j6k2K07l15o9j06J32J64
5122I1qk28K97m18L36J01n9n2k85M73k07J77l61J68j7K05%r2J97k02r6P2j27J51
5146A16k28j03M59l27J70J30m15P6J39L7k13K30Kj29j65J71J61k67J18l8K3K68
5168B15m07K20Q2j76KK53k25K24l91L75j93J59Q3M8m59K28j10K1J45k61J06J12
5190E1J58j03j7j8j03J8J94j89j67K88j68P4r1K1J92j87l8M1K6m0q9K96k63L23
$$ y = [-68, -106, 111, -114, -147, 102, -19, -11, -82, 193, -128, -5, 26, -62, 0, -66, -189, 30, 109, 125, 114, -136, 229, 159, -93, 45, -26, -203, -149, 22, 53, 112, -50, 191, 31, -260, 31, 102, -55, 162, -27, -168, 40, -179, 243, -66, 117, 36, -92, 128, -208, 58, -94, -151, 69, 260, -4, 81, -143, 89, 43, -52, 170, -2, 125, -145, 295, -39, 66, 110, 107, -55, 196, -222, 187, -76, -18, 115, 57, 155, -140, -8, 149, -236, 116, 100, 78, 285, -30, -99, -205, -73, 91, 83, -145, 152, -266, 70, 171, 112, 60, -225, 248, 41, 218, -143, 25, 8, 213, 213, 121, 318, 116, 20, 92, -35, 116, -112, -215, 244, -83, 87, 217, -198, -122, 17, 54, -159, 71, 73, -56, -221, -50, 111, -156, -38, -76, -53, 215, -192, 28, 110, -66, -64, 189, -36, 188, -203, 172, -21, 138, 221, 269, -190, 38, -72, -51, 94, -167, -61, 51, 209, 106, 89, 71, -32, -14, 180, -9, -176, 112, -56, 18, -73, -52, 140, -47, -85, -44, -18, -58, -147, 149, -114, 209]
5214B09j99o3P7N3J26l84L57m05L47N5o9m9j2k20K33j52j3J80k98K93J68k87J68
5237A15m2j35K25l9k39L61k56k19p4L33pj27K16n7j9k02J2J27P8R3m43M72l9k39
5261a05L18l26M43l26J17j13P7j35R2l38L18O1NP6k31J86j2k69K44n8j97K62k50
5284a61K87n2l83M49j45K1P1j74pQ8L4P7j59mJ66j42J77l77L03%J79j29q4J83
5308B18r1l12P0J98J67k87N3q8K4L02l08q6K16k08N8M9m0O9j69O4M1J8J47j77
5332g2J6J75k21J75J3j59k1L73k77oj82K64j39K16O5l84K52L5m3L2p0k38J44N1
5356aR6Jk13N2J58m5j0k25K50k7L2r9J06m0p6L18j13j59O7j00j16j81K87j04J34
5381hl9r3J03j27K74o5l27K32J77k82O3j7J30k4l09R3M13M0j46m8R6j42k7k5Q
$$ y = [209, 10, -53, 24, 77, 203, -181, 176, -229, 118, 173, 104, 55, 43, -177, 56, -96, -109, 71, -227, 66, 234, -53, 115, 73, -62, 163, 124, -115, 246, -10, -229, -303, 30, 23, -104, 112, 55, 36, -166, -154, -27, 51, 144, -299, 173, 134, -105, 213, -113, 330, 4, 121, 8, 85, -50, 42, -296, 22, 83, 88, 164, -67, 119, 107, -162, 82, 24, -173, 89, -161, 126, 74, -309, 140, -5, 16, 87, -87, -94, -6, 28, 105, -54, -58, 108, -34, 143, -234, 69, 69, 248, 119, 35, 218, 127, -185, -115, 83, 250, -37, 16, -72, -48, 254, -54, -140, 76, -132, -74, -25, -65, 4, -165, -101, -60, -42, 105, -72, -56, 119, -102, 73, 86, -73, -94, 279, 2, -4, -186, 78, -61, 155, 220, -164, 88, 123, 80, 112, 42, -196, -52, -1, 95, 96, -117, -65, 93, 48, 38, -187, 63, 36, 68, -31, 75, 35, -41, 277, 164, 5, 72, -28, -144, -325, -38, -142, -8, -47, -140, -37, -164, 110, 45, -282, -50, 127, -155, -92, -109, 21, -3, -312, -219, 194, 234, 88, 40, 136, -6, -33, -58, -50]
5406e0K3R2l1K3o1K75k98r4p7O3p1Q1M63l66k5R1J79l41pJ00m5pq0L86l35j18
5432b30K73k52J51r2R6N1kj19J46K4k57J84l0o6J39k82K10n6K85j08k92K85m5
5455A3O4J86k16j38M03l85N5K4P1k51j43M24J37l89K62j76J50j37n0P5K5j24L55
5478B35j27l7q7L1j46J90l8j18J08k6M3L9r5K38j87K8p0k4j47J95K49k03l10J53
5502a06J33j19J04j3l7R2k1n3l0J85qj5J47k47Q6l1K43j96m7j0l46M65k23M4J10
5527A07k13K78j94j06K09n4Q5J9l32MM38l2k77L18k89K22j42Q6k5j52J06l32J71
5550a05L08l95O5j02R0K7K54k00J57j85J56j57J20l9j34RL27l88K19J11k42J19
5572A5J3p9oL6l3l5J22M2k3k99K05m1k3Q0j7lL20j98Lm9k53J82K1J20m1k95L52
$$ y = [-50, -27, 65, 34, 57, -4, 271, -27, -121, -198, -135, -206, -125, 338, -28, -53, 38, 217, -124, -131, -31, -76, -83, -163, 223, -112, -230, 43, -209, -58, -150, -54, -3, -5, -124, 22, 46, -211, -27, -57, -123, 16, -266, -56, -112, 173, 65, -227, 58, 13, 77, 263, 47, -91, 312, -73, -18, 6, 77, -174, -317, 107, 244, -145, 117, -59, 91, -46, -96, -21, 4, -120, 235, 108, 71, -16, 15, -131, 59, 21, -97, 11, -15, 28, 67, -28, 210, 23, 51, -19, -43, -190, 5, 254, 51, -259, -106, 27, -92, 12, -1, -38, 54, 33, -20, -50, 135, 127, 112, 259, 12, 98, 67, 310, 114, 67, 57, -289, 176, -47, -3, 107, -106, 172, -22, -128, 81, 27, 112, 131, -201, -197, 241, 209, -68, 250, -39, 183, 41, 127, 102, -50, 56, -276, -105, 203, -192, -127, -229, -139, -112, 142, -58, 99, -86, 70, -87, 33, -6, -140, -131, 196, -192, 27, 138, -104, 15, 28, -51, -57, -21, -54, -89, 33, 75, 52, -247, -42, -83, -106, -26, -43, -46, 274, 76, 79, 30, -223, -41, -20, 100, 59, -236, 116]
5599A16k54J60J6j20K41j62J51l22K00k55K21K04K7j46k30L85J3m27L03N3j35
5620C9q1L03l68J37l01L40j52m5Q1j31K73k09O4P9o4J08r9J18n9j78J72j63L31
5643A95k51P1j36J06J73j61M6j03n0J47m1J50k22N8L0J61r6Ok54J53J2m4J24j14
5667d0j55K24P5l42J27o3K99l7k56J60Q0Q7l31j62K26m1K38J24m15Q4P7j44N6
5690a29Q8j75K27J25j71N4K36k28L7l14N14k89r8J17r4m1K35l00K82k92K57n2
5712a1j0o3J64j40j13K76L4j57k14J94k35J40L39l45J70oj6j17n5K05K0R8j48
5735A0j3q3J12PM9j39Lk03L70k45K40j31j25L54p1j14j06L2J04n6m3M9%k19J60
5760e8J86o9q4j57L17J56l26J0k73L42j16J22j2j06J71k17J09l7K17j66J9R8j89
$$ y = [116, -138, 22, 38, -82, 159, -3, 148, -174, 26, -229, -8, 196, 223, 77, -153, 232, 245, -182, 121, 174, 39, -42, 261, -107, 30, -271, 69, -83, -128, -47, -178, 95, -114, -50, 29, -35, 73, -26, 92, 33, -145, 27, -136, 195, -56, 15, -121, -15, 158, -3, 43, -60, -110, 37, -4, 146, -76, -18, 12, 173, 77, 83, -171, -18, -6, -50, 74, -40, -195, 29, 104, -238, -111, -174, 125, 88, -168, -8, 72, 159, -172, -334, -108, -149, 89, 213, -202, -118, -41, -185, -129, -41, -216, 11, 136, -35, 19, 255, 27, 64, -250, 264, -25, -123, -6, -100, -141, 94, -206, 76, -216, 41, -11, -21, -84, 80, -60, -173, 103, 137, -20, -234, -40, -275, -135, 204, -141, 29, 23, 7, -110, -165, 40, 60, 158, 10, -3, -86, 26, 33, 82, -57, -54, -257, 113, -132, 108, -23, -148, 206, 135, 21, -85, -53, 51, -5, -48, 1, 1, -218, -58, 128, 59, -25, -182, 135, 291, -35, -25, -298, 44, -72, 50, 38, -68, 103, -114, -5, -42, 175, 9, 28, 126, -63]
5783f3K90k54qL53n34K39K37j64R8j95J27o0k12J18J76K6l26J30m3j78J38J24
5805A9p1j04K97o9k33J87R0k3N3m8k70M30m81K21m5j54K77j54L89l69K17l17N
5828a53K55j59J30N6j57p7J9%O5K19j2j19k62J84N2l5q4K10j22R3r2k3j7P6j50
5853a03K63n25N60m72J13J30J10j03J56k3k37M64q0Kl79J12kj88M31j47j00N9
5875D1r0q6j04M53m81K84p3L1p5M4L0pJ25k36K67j25J64l90L46r5j6k05J64N0
5899A6j84K63k81J42K1J45o3n6r6k2J52JN1l2j59N1J9m9P1mk38L16k86M28l6k03
5925c3jJ66q0k01J74k2j3l03J99j16L62M9k60qk32M48k75J01J6r6P8K27j75J35
5949A40j66K2j7Q3n6j15j02R7J17L1l9K86l10J62l05J33L30k29k85O0k3K31lj22
$$ y = [-63, 227, -27, -35, 318, -216, 23, 260, 96, 194, -1, 126, 66, -146, -28, 148, 174, -152, -22, -65, -243, -105, 19, -52, -156, 141, 72, -161, 26, 116, 93, 146, 98, -172, 258, -223, -2, -47, -201, 76, -78, 311, -58, 159, -158, -153, 102, -57, 73, 129, -28, -105, -86, -86, -21, 198, 186, 67, -195, -11, 41, 6, -78, 132, 10, 103, 11, -12, -29, 47, -103, 160, -365, 195, -277, -164, -34, 76, -27, 129, 106, -131, 333, 253, 255, -124, -12, -14, -202, 229, 82, -18, 41, -49, -135, -239, 214, -267, 17, -56, -25, -100, -56, -26, -33, 92, -144, 123, -2, 162, -228, 118, 23, 7, -198, -34, 16, -168, 95, -186, -44, -23, 122, 59, 3, -93, -115, 37, 38, 89, 57, -102, -51, -32, -81, -10, -14, -252, 64, -222, 206, 170, -33, -34, 132, 52, -149, 25, 3, -10, -313, -114, -230, 132, 181, -79, -87, -319, 129, -146, -45, -29, -125, -47, 180, 5, 140, -26, -4, -21, 62, 6, -109, -211, -114, 3, 34, -5, 281, -29, 133, -172, -39, 291, 62, -223, -163, -186, 45, 42, -80]
$$ [...]
8191A8
##END NTUPLES=NMR FID
##END=
