##TITLE=1H_Pr 53-Stac
 200.13MHz, CDCl3,
 8 sc
 
 29.5.2025
##JCAMPDX= 6.0         $$ Bruker NMR JCAMP-DX V2.0
##DATA TYPE= NMR FID
##DATA CLASS= NTUPLES
##ORIGIN= UXNMR, Bruker Analytische Messtechnik GmbH
##OWNER= pz
$$ XWIN-NMR		Version 3.5
$$ Thu May 29 14:56:22 2025 Russian Standard Time (UT+4h)  she@DPX200
##.OBSERVE FREQUENCY= 200.1313
##.OBSERVE NUCLEUS= ^1H
##.DELAY= (6, 6)
##.ACQUISITION MODE= SIMULTANEOUS
##.ACQUISITION SCHEME= undefined
##.AVERAGES= 8
##.DIGITISER RES= 18
##SPECTROMETER/DATA SYSTEM= spect
##.PULSE SEQUENCE= zg30
##.SOLVENT NAME= CDCl3
##.SHIFT REFERENCE= (INTERNAL, CDCl3, 0, 14.3821)
##AUDIT TRAIL= $$ (NUMBER, WHEN, WHO, WHERE, WHAT)
$$ ##TITLE= Audit trail, XWIN-NMR		Version 3.5
$$ ##JCAMPDX= 5.01
$$ ##ORIGIN= Bruker BioSpin GmbH
$$ ##OWNER= she
$$ F:/spectra/data/she/nmr/H-C/1/audita.txt
$$ ##AUDIT TRAIL=  $$ (NUMBER, WHEN, WHO, WHERE, WHAT)
(   1,<2025-05-29 14:55:04.14 +0400>,<she>,<DPX200>,
      <created by zg, POWCHK disabled, PULCHK disabled
       configuration hash MD5:
       00 E9 B6 7A A2 85 ED C7 34 08 36 98 17 FE 4E 26
       data hash MD5: 16K
       5A 0F C8 A0 20 7E 79 3C 59 CF CA B9 07 A6 AB BC>)
$$ ##END=
$$ 
$$ hash MD5
$$ 83 4E 59 D9 BF 9E D0 83 6A CF BA 38 49 FB D3 10
##$RELAX= 
##$RELAX= 
##$RELAX= 
##$RELAX= 
##$RELAX= 
##$RELAX= 
$$ Bruker specific parameters
$$ --------------------------
##$DU= <F:/spectra>
##$EXPNO= 1
##$NAME= <H-C>
##$PROCNO= 1
##$TYPE= <nmr>
##$USER= <she>
##$AMP= (0..31)
100 100 100 100 100 100 100 100 100 100 100 100 100 100 100 100 100 100 
100 100 100 100 100 100 100 100 100 100 100 100 100 100 
##$AQSEQ= 0
##$AQ_mod= 1
##$AUNM= <au_zg>
##$AUTOPOS= <>
##$BF1= 200.13
##$BF2= 200.13
##$BF3= 200.13
##$BF4= 200.13
##$BF5= 200.13
##$BF6= 200.13
##$BF7= 200.13
##$BF8= 200.13
##$BYTORDA= 1
##$CFDGTYP= 0
##$CFRGTYP= 5
##$CHEMSTR= <none>
##$CNST= (0..31)
1 1 145 1 1 1 1 1 1 1 1 1 1 1 1 1 1 1 1 1 1 1 1 1 1 1 1 1 1 1 1 1 
##$CPDPRG= <>
##$CPDPRG1= <>
##$CPDPRG2= <>
##$CPDPRG3= <>
##$CPDPRG4= <mlev>
##$CPDPRG5= <mlev>
##$CPDPRG6= <mlev>
##$CPDPRG7= <mlev>
##$CPDPRG8= <mlev>
##$CPDPRGB= <>
##$CPDPRGT= <>
##$D= (0..31)
0 0.7 0 0 0 0 0 0 0 0 0 0.03 0 0 0 0 0 0 0 0 0 0 0 0 0 0 0 0 0 0 0 0 
##$DATE= 1748516103
##$DBL= (0..7)
120 120 120 120 120 120 120 120 
##$DBP= (0..7)
150 150 150 150 150 150 150 150 
##$DBP07= 0
##$DBPNAM0= <>
##$DBPNAM1= <>
##$DBPNAM2= <>
##$DBPNAM3= <>
##$DBPNAM4= <>
##$DBPNAM5= <>
##$DBPNAM6= <>
##$DBPNAM7= <>
##$DBPOAL= (0..7)
0.5 0.5 0.5 0.5 0.5 0.5 0.5 0.5 
##$DBPOFFS= (0..7)
0 0 0 0 0 0 0 0 
##$DE= 6
##$DECBNUC= <off>
##$DECIM= 32
##$DECNUC= <off>
##$DECSTAT= 4
##$DIGMOD= 1
##$DIGTYP= 9
##$DL= (0..7)
0 120 120 120 120 120 120 120 
##$DP= (0..7)
150 150 150 150 150 150 150 150 
##$DP07= 0
##$DPNAME0= <>
##$DPNAME1= <>
##$DPNAME2= <>
##$DPNAME3= <>
##$DPNAME4= <>
##$DPNAME5= <>
##$DPNAME6= <>
##$DPNAME7= <>
##$DPOAL= (0..7)
0.5 0.5 0.5 0.5 0.5 0.5 0.5 0.5 
##$DPOFFS= (0..7)
0 0 0 0 0 0 0 0 
##$DQDMODE= 0
##$DR= 18
##$DS= 0
##$DSLIST= <SSSSSSSSSSSSSSS>
$$ [...]
##$SUBNAM0= <"">
##$SUBNAM1= <"">
##$SUBNAM2= <"">
##$SUBNAM3= <"">
##$SUBNAM4= <"">
##$SUBNAM5= <"">
##$SUBNAM6= <"">
##$SUBNAM7= <"">
##$SUBNAM8= <"">
##$SUBNAM9= <"">
##$SW= 18.0517328524113
##$SWIBOX= (0..15)
0 0 2 0 0 0 0 0 0 0 0 0 0 0 0 0 
##$SW_h= 3612.71676300578
##$TD= 16384
##$TD0= 1
##$TE= 0
##$TE2= 300
##$TE3= 300
##$TEG= 300
##$TL= (0..7)
0 120 120 120 120 120 120 120 
##$TP= (0..7)
150 150 150 150 150 150 150 150 
##$TP07= 0
##$TPNAME0= <>
##$TPNAME1= <>
##$TPNAME2= <>
##$TPNAME3= <>
##$TPNAME4= <>
##$TPNAME5= <>
##$TPNAME6= <>
##$TPNAME7= <>
##$TPOAL= (0..7)
0.5 0.5 0.5 0.5 0.5 0.5 0.5 0.5 
##$TPOFFS= (0..7)
0 0 0 0 0 0 0 0 
##$TUNHIN= 0
##$TUNHOUT= 0
##$TUNXOUT= 0
##$USERA1= <user>
##$USERA2= <user>
##$USERA3= <user>
##$USERA4= <user>
##$USERA5= <user>
##$V9= 5
##$VALIST= <valist>
##$VCLIST= <CCCCCCCCCCCCCCC>
##$VD= 0
##$VDLIST= <DDDDDDDDDDDDDDD>
##$VPLIST= <PPPPPPPPPPPPPPP>
##$VTLIST= <TTTTTTTTTTTTTTT>
##$WBST= 1024
##$WBSW= 4
##$XGAIN= (0..3)
0 0 0 0 
##$XL= 0
##$YL= 0
##$YMAX_a= 150967
##$YMIN_a= -186140
##$ZGOPTNS= <>
##$ZL1= 120
##$ZL2= 120
##$ZL3= 120
##$ZL4= 120
##$ABSF1= 10
##$ABSF2= 0
##$ABSG= 5
##$ABSL= 3
##$ALPHA= 0
##$AQORDER= 0
##$ASSFAC= 0
##$ASSFACI= 0
##$ASSFACX= 0
##$ASSWID= 0
##$AUNMP= <proc_1d>
##$AZFE= 0.1
##$AZFW= 0.1
##$BCFW= 1
##$BC_mod= 2
##$BYTORDP= 1
##$COROFFS= 0
##$CY= -3
##$DATMOD= 1
##$DC= 2
##$DFILT= <>
##$DTYPP= 0
##$F1P= 0
##$F2P= 0
##$FCOR= 0.5
##$FTSIZE= 0
##$FT_mod= 4
##$GAMMA= 1
##$GB= 0.15
##$INTBC= 1
##$INTSCL= 1
##$ISEN= 128
##$LB= 0.25
##$LEV0= 0
##$LPBIN= 0
##$MAXI= 10000
##$MC2= 0
##$MEAN= 0
##$ME_mod= 0
##$MI= 1.114404
##$NCOEF= 0
##$NC_proc= 0
##$NLEV= 6
##$NOISF1= 3.799351
##$NOISF2= 2.8
##$NSP= 1
##$NTH_PI= 0
##$NZP= 0
##$OFFSET= 14.38212
##$PC= 1
##$PHC0= -1558.035
##$PHC1= 15.1922
##$PH_mod= 1
##$PKNL= yes
##$PPARMOD= 0
##$PSCAL= 0
##$PSIGN= 0
##$REVERSE= no
##$SF= 200.129724274929
##$SI= 16384
##$SIGF1= 3
##$SIGF2= 2
##$SINO= 400
##$SIOLD= 16384
##$SREGLST= <1H.CDCl3>
##$SSB= 0
##$STSI= 0
##$STSR= 0
##$SW_p= 3205.1282051282
##$SYMM= 0
##$S_DEV= 0
##$TDeff= 0
##$TDoff= 0
##$TI= <>
##$TILT= no
##$TM1= 0
##$TM2= 0
##$TOPLEV= 0
##$USERP1= <user>
##$USERP2= <user>
##$USERP3= <user>
##$USERP4= <user>
##$USERP5= <user>
##$WDW= 1
##$XDIM= 8192
##$YMAX_p= 0
##$YMIN_p= 0
$$ End of Bruker specific parameters
$$ ---------------------------------
##NTUPLES= NMR FID
##VAR_NAME=  TIME,          FID/REAL,        FID/IMAG
##SYMBOL=    X,             R,               I
##VAR_TYPE=  INDEPENDENT,   DEPENDENT,       DEPENDENT
##VAR_FORM=  AFFN,          ASDF,            ASDF
##VAR_DIM=   8192,          8192,            8192
##UNITS=     SECONDS,       ARBITRARY UNITS, ARBITRARY UNITS
##FACTOR=    0.0002768,     1,               1
##FIRST=     0,             0,               0
##LAST=      2.2672688,     0,               0
##MIN=       0,             -186140,         0
##MAX=       2.2672688,     150967,          0
$$ Real data points
##PAGE= N=1
##DATA TABLE= (X++(R..R)), XYDATA
0@%%%%%%%%%%%%%%%%%nJ3j6J6j6J6j9K7l2L3m0M7n1N9o7P6q7R7j08J22j37J52
39H0j69J89k10K32k56K82l10L42l79M17m59N06n58O15o80P53q35R29j036J164
59F17j317J502j733K027k420K973l800N166p796J4565o3162j32762J74664J19202
73A07726p8575r6794K4545R5059O018m9206J1105l5633l5543O4828K7772n3264
85a1962m4738Q485Q6751K2116q9950j4354N3842J1773o248k7173j2837J9538j099
98e856K8354K1951o4495j0047O6422o71m6037k4807J8943L4463k6435j6455L4397
111I727j8830j2702M6440m93l5017p964J6933K8083k6414l3822M6467K1566l6990
124c016l894J9471R029k4014l6558L6147L4598n0752k1448M0761K1210j4388k7345
$$ y = [0, 0, 0, 0, 0, 0, 0, 0, 0, 0, 0, 0, 0, 0, 0, 0, 0, 0, -5, 8, -8, 8, -8, 8, -11, 16, -16, 17, -23, 24, -27, 32, -35, 41, -46, 51, -57, 65, -72, 80, -89, 100, -110, 122, -134, 148, -162, 180, -199, 218, -241, 265, -293, 322, -358, 395, -440, 489, -547, 617, -700, 802, -931, 1096, -1324, 1649, -2151, 3015, -4781, 9784, -53378, -186140, -11476, 107726, 29151, -67643, -43098, 51961, 57979, 8773, 19878, -15755, -51298, 13530, 41302, -11962, -56700, -48215, 38536, 60652, -29298, -43652, 10190, 21963, 15715, -11458, -24295, -4757, -5856, 22498, 44449, -20046, -30093, 36329, 35658, -10379, -35186, -16243, 18220, -8215, -24670, 9727, -9103, -21805, 24635, 24142, -10875, -18839, -1906, 26177, -237, -34059, 12408, 33974, -3016, -6910, 12561, 21590, -2424, -38982, -2835, 31763, -18989, -40437, 324, 21534, 7146, -20199]
137b0199J4246L4570k3773j8894K2173m903j0241J1762L121N47q254j984J7383
150A5554j3569j9814J6387L074j3838q74M405J4834p79j5855J5166J3247j6105
163A833m475N815J356l651p700J1384Q861j8124p76J6073m656j1570o133K873
177h890O724m451Q99P497p772K316J7493P33j5594j0165J4400J9939j7226k5834
191a9931J0556K2362J448j8061j0115J3918O934q622m592n435r00J1309O459k319
205C011p481n76J6301M844j4226m426K211M035J938q444j293K549k468Q745K833
220G553j5011l814P006P316q35j6164L869K0003l249n948K302p23O326r32q034
235c35K249n388j228J0914p683o202P886j548K313j886r170J0084J916j0589Q310
$$ y = [-20199, -5953, 28617, 4844, -14050, 8123, 3220, -7021, 4741, 7862, 8409, 155, -1829, 15554, 1985, -17829, -1442, 1632, -12206, -13080, -8675, 6159, 5380, -10475, 4691, 17938, 1833, -2642, 3173, 4529, 878, -6822, 4562, 13423, -4701, -5477, 10596, 5940, -5630, -11763, -8890, -2166, -6617, -5718, 1779, -5993, -3677, 13816, 14549, -1045, -11210, 3190, 23129, 5903, -19931, -9375, 12987, 14435, -3626, -13741, 177, 7111, -1511, -6103, -11538, -12438, -1129, 5330, 3011, -4470, -5046, 11255, 16099, 1873, -2553, -342, 3693, 5631, -2813, -4106, -1557, -4025, 4720, 7553, -7458, -11272, -4266, 3050, 2215, -13949, -10080, 9923, 6674, 726, 3028, 2305, 8631, 7699, -335, 1914, -3474, -4702, 6212, -1471, -7673, 213, -1335, 978, -908, -10078, 6, 1922, -8667, -357]
250c57L572l036M726l966N913N782j6369K624R569j1182k58J029l630Q111m975
265b447l475R464q334J75J0720j1193j14P848m283P412j683p312J3526k670r603
280a969O814n408j127M781j1683O018N814j2991Q194N233r339O255j440k757Q823
295E218q918J049J1625j0149L084Q209j1242M324J505q089O987o417o540J2400
309C046o859l590R113o440M472M799j1529Q819L436j0864R428Rn800Q743n340
324A443p31P379j1451K443O018j2710M684L363q972P920o38l903R710o218j401
339c064R970q316Q10N886p324O307J585r569Q343l87p413O462n408k932O314p409
355f145J921N396q365P385L882q647P133Q41m961O809m687j381O967o817J418
$$ y = [-357, 3215, 179, 4905, 939, 6852, 12634, -3735, -1111, 8458, -2724, -2982, -1953, -5583, 2528, -2447, -5922, 3542, -4792, -4617, 6103, -5090, -5204, 2644, -1639, 5773, 4090, -3222, 10304, 7634, -1969, 4845, -563, -1690, 3091, -8592, -2574, 3240, -9751, -1557, 3676, -5663, 592, -848, -3605, 5218, -3700, -2651, 8974, -1175, 1909, 10118, -1124, 3200, 4705, -3384, 3603, -2814, -9354, 3046, -3813, -7403, 1710, -4730, -258, 4541, -6988, 1831, 5267, -5597, 3831, 3840, -1960, 6783, 1443, 712, 8091, -3360, -917, 5101, -7609, -2925, 438, -8534, -614, -1252, -5155, 4555, -1663, -3064, 6906, -1410, -600, 5286, -2038, 4269, 5854, -3715, 4628, 4241, -3172, 3290, -2118, -5050, 1264, -6145, -4224, 1172, -7193, 192, 4074, -4573, 2560, 3401, -1560, 5249, 562, -819, 6148, -669, 749]
370G49M890q037L615J124q064O098j618o134O791k347r88O103m393K579M126n725
386a231M857J081p165N832q8m401M467l076j881M351m987K29J594n567M056J811
402a18m806L937K49j293O112k376j674L532j883J182M95m565K638K00k873L389
418B146k860l541M169j029j973Q04j786L137R59k674L498J616j517K543j113j92
434B187J627l382r60J989q33J25k473j221L246j712j487J451j909J124K656j062
450f34O08n71N24M195m45j869K53k186L085J741o317j919K528J695Q27m632k120
467e237M779p45L34J22l529L169L576j152J572k654j415O464l45l382j272l141
483b856M520K013q120J015L214j446J833k872j087M476l172O73N096l666P05K111
$$ y = [749, 5639, -2398, 1217, 2341, -5723, 375, -1243, -7377, -586, -2933, -3921, 2182, -2211, 368, 4494, -1231, 3626, 4707, -2458, 3374, 3286, -1115, 3352, 276, -1605, 2746, -2241, -2012, -418, -5985, -1929, -118, -4924, -987, -738, -2031, 4081, 1705, 31, 3563, 1680, 2862, 3357, -1208, 1430, 1630, -1243, 2146, -714, -4255, -86, -1115, -3088, -2284, -4070, -933, 26, -2648, 850, 2466, 949, 3492, 2379, 2187, 3814, 432, -528, 1461, 628, 753, -1720, -2941, 305, -1407, -2894, -1443, -3352, -2228, 428, -634, -26, -597, -73, 4122, 3677, 1808, 2061, -125, 2960, 4701, -1616, -3535, -1007, 688, 1515, -3117, -5237, -458, -1203, -869, -747, -4276, -1107, 2469, 1317, 2889, 235, -1180, 5284, 4939, 1557, 285, -2856, 1664, 3677, -4443, -3428, -214, -1660, 173, -2699, -3786, 690, -2482, -1809, 3287, -379, 326, 2437]
499B437k453M790j085o150M847L73k846J746n334N90M569n469K068K903n428K958
515a484J723j949M823m233k369Q623k140k177J520m231N177L323r006J133J150
530a17k803M905m580l385O441k942J385M520p489J403N248k690L313j743m087
545b621Q263j645n236L605m031J538N306r023Q04M611n739K326N69l099O651l515
561a236k226Q477m841j812N725m955K461L396o396L913L45n562M561k093k504
576b747M580o754P20P951p196r03N064j864M710j442o185O516M23k328M283o127
592a299J32P494o316j667K242m551L862J220m824K744k345k85P478n707k470P199
608B907j884J381J640o062L107K435l646K625k372k023M919m712j371M801n767
$$ y = [2437, -16, 4774, 3689, -2461, 2386, 2759, -87, 1659, -3675, -3085, 1484, -3985, -1917, 986, -4442, -1484, 239, -1710, 3113, -1120, -3489, 5134, 2994, 817, 2337, -1894, 3283, 6606, -2400, -1267, -117, -2920, 1985, -2595, -5980, 461, -2481, -1096, 3424, -4065, -2662, 2586, -104, 3209, 1466, -2621, 5642, 3997, -1239, 2366, -1665, -127, 5179, -3844, -3040, 1571, -4168, -1842, -1273, -4372, 2279, -1236, -3462, 5015, 174, -1638, 4087, -868, 1593, 4989, -1407, 2506, 2851, -2711, 1850, -243, -2747, 1833, -4921, -4201, 3750, -3446, -4349, 715, -1149, 3561, 2119, -4066, 2450, 2873, 545, 4828, -1299, -1167, 6327, 11, -1656, 586, -3965, -103, 1117, -3707, -963, -3308, -3593, 3885, -1822, -4292, 2907, 1023, 2404, 4044, -2018, 1089, 3524, -122, 2503, 131, -1892, 3027, -1685, -3056, 1745, -4022]
623d022L53N198l644N62N19j037N420k324k660N402k433q34L365m240M69L013
639C107m323J256O24k546J630k231j128M938l208j244M036k376J220K523l296
654a018J701K091q49J250l066n95L574l240j215K286k677M32J628k651O05n3k46
671b043K577j339j70K717j391N36K048k501J215Q64j996P27n70j127K96j257O90
688g24Q60k880Q90J841j924R6J442N28R21j316R05J665j445P45Q33j886Q52m6
706A357j868kl99l0M81j943O39J161j139J236j84p90K575k62r94K082o02J43M94
725A955j620J718p16k823K239m42k428J581j255l21J662j846J139J371k095K729
741H48O97k477K588l8j033K795l140n59L193l060Q0Q06k847J975l19l081L728
$$ y = [-4022, -3669, 1529, -2115, -1553, -1034, -2071, 3349, 1025, -1635, 3767, 1334, 500, 3865, -375, 94, 3107, -1216, 40, 664, -1882, -252, -2483, -3611, 1327, -1881, -3125, 911, -1465, -245, 2278, -1018, 683, 2774, 1925, 3175, 109, -486, 3088, -152, -1367, 919, -1758, -1326, 302, -2349, -1744, -1797, -2043, 534, -805, -975, 1742, 351, 887, 2935, 434, 1649, 2513, 517, 1244, 674, -453, -157, -1414, -724, 136, -2744, -1854, -13, -1937, -1841, -399, 129, 1050, -266, 639, 2304, 859, 1604, 2437, 551, 1403, 1357, -511, -513, -912, -942, -461, -2404, -1765, -604, -1743, -507, -691, -1481, 1094, 832, -162, 1920, 1318, 1461, 1955, 335, 2053, 1337, -1486, 753, 311, -2117, -536, -1791, -2112, -450, -2296, -1157, 214, -1881, 848, 1545, -932, 1656, 1618, 585, 3380, 240, -319, 2874, -186, -106, 700, -2147, -172, -491, -3572, 156]
758A56j420j541L893k026j84K867k736K213J471l442K974J5l048L237j545k558
774a674L635l255n89K555l876J525K365l849K863N31k403M428j893j772M769k749
790F11j68L046l947J298J899m384K384q6l716M248k353k399M556l209k0L899m001
807b342J953L028m309L337Q93l540L969j784k133L993l831l39L504m496R75J961
823H39m201K805M11l223M231j300j513M543k673j85L935m171J466K439m801L055
839A657R4l728L278j485k390L795l270k86L532l868J425K689l822L010J042l138
855a465M024r80k338L929k764l42K672m005O91K054l945K013O34l411L388p48
871e93j912L045j822K08L656l555J476K360l494K472N82l286K392p44j801K167
$$ y = [156, -1264, -2805, 1088, -938, -1122, 1745, -991, 1222, 2693, -749, 2225, 2240, -808, 2429, 884, -1674, 1961, -1294, -1883, 672, -3204, -1679, 686, -3163, -300, 231, -2172, 2256, 363, -1409, 3360, 611, 443, 3489, -458, 840, 2739, -1645, 739, 653, -3063, 1185, -1168, -3567, 989, -2220, -2240, 1659, -2342, -389, 2639, -1670, 1667, 2560, -980, 2989, 1205, -928, 3065, -766, -1105, 2399, -2097, -1122, 839, -3362, -557, -146, -3369, 862, -438, -1951, 2592, -81, -266, 3669, -502, 964, 3403, -1398, 1657, 1751, -1977, 1301, -184, -2574, 1221, -2049, -2335, 1197, -2671, -1246, 1443, -2379, 631, 1673, -1465, 2559, 1579, -759, 3170, 406, 64, 2736, -1269, -578, 1476, -2469, -456, 178, -3233, 155, -593, -2505, 540, -1282, -1074, 2582, -973, 503, 2863, -631, 1841, 2423, -863, 1529, 785, -1016, 1151]
887A151k154q07K416k601R31J225k919K486Q79k272K379m2j061K581j435l26K086
904B517k708Q31J128k845J227k0k022J627p76r60J700j165N41J617j596Q99R30
921I25j342J907P6j572J684l98r05P20j190j20L30j124P00n06j598K047J15j096
939a347J015k26O82P25q27Q29J95o73J237m96o17P28j241k75P64j317j02R9l77
958a224P26n19m51J417o16L12J142n92M71L43r49J442n05p03J055j038m01J071
976I81k153l51J249j008R16l57j107J763k25m97J495r93M43J724j628Q20N30j935
994c33J576K82k039P44p29l48J652k882M5K591j864K25J221j963K229N7j185K399
1012A678r97q75K648k124o2J070k543J513R01k845J309P8j912K256j391n38L026
$$ y = [1151, -1003, -1810, 606, -1995, -1064, 161, -2758, -272, 607, -1665, 714, 672, -389, 2192, 757, 431, 2517, -191, 640, 1768, -1077, 150, 130, -1892, -265, -1041, -2001, -301, -1466, -925, 692, -904, -5, 925, -417, 1490, 1566, -6, 1678, 1280, 375, 1095, -95, -215, 115, -1009, -309, -815, -2413, -366, -251, -1347, -332, -558, 124, 849, 22, 851, 1046, 373, 1610, 1114, 497, 1225, -16, -291, 473, -844, -946, -847, -1224, -498, -1017, -1468, -51, -667, -355, 787, 195, 666, 1009, 60, 1502, 997, 294, 1349, 311, -90, 981, -1172, -1523, -274, -1282, -366, -723, -1830, -67, -292, -789, 706, -287, 156, 1880, 252, 1072, 1602, -333, 1243, 1525, -514, 230, -499, -847, 805, -2077, -2032, 559, -1305, -1080, 141, -1822, 407, 464, -721, 1678, 681, -194, 2454, 330, 268, 1338, -1205, 308, 1209, -1636, -327, -249, -2161, 95, -1296, -1834, 1192]
1029A192k512N68K376k547J399J346k557K395Q1k182K466j978q52K621l267L21
1045a130K199l212J174Q96k365K490k49j364L135j340j424L243j902N39J668l166
1061h08J783J281l640J549J32j970K529j900r27L066l014J54K998k837J133J946
1077A475k498K558k14k300L045j186j469K555k312K2J793l236J039J347l040K000
1093d21K47j954K675j105q85K907j739M40K225l225J714J406k963J801J17k393
1109a153K301j636r86K341k871L88K675k630P55J397k131K261j49j658K739o83
1125I60o64J700j857j61J532k386Q98J117k750J384J38j761J576p90j29K039k041
1142a195M88K052j692R17Q14j510J402j22j134J423j217q80J559j670j77J120
$$ y = [1192, -1320, -752, 1624, -923, 476, 1822, -735, 1660, 1741, -441, 2025, 47, -805, 1816, -1451, -1130, 1069, -2143, -969, -73, -2438, 52, -197, -1561, 1574, 234, -1190, 2053, 151, 690, 2358, -808, 975, 2256, -1384, 165, 297, -1673, 856, -1044, -1971, 1095, -1919, -1765, 1233, -1604, -471, 1475, -1023, 1535, 1321, -979, 2066, 880, -589, 1966, -346, -324, 1469, -1767, -728, 619, -2421, -421, -174, -2128, 547, -558, -1443, 1464, -275, 165, 2390, -835, 879, 2285, -678, 1123, 1240, -1153, 1148, -488, -1474, 867, -2004, -1616, 1059, -1571, -816, 581, -1550, 711, 562, -1096, 1643, 960, 296, 1996, 139, -22, 1510, -876, 22, 1139, -1611, -227, -89, -1850, -274, -1064, -1193, 846, -1195, -707, 1345, -347, 570, 1384, -126, 1276, 1154, 20, 1443, 226, -654, 905, -765, -942, 178]
1158A78j834J079J87j364J649K99o71J252p14k47J387j058N69R59j715P25K67
1175I48j204L53j48p09N12p59Q6J049j550O47P05p15P96J11J28P58l74l52Q05
1194A087o97J57L56j099N26l41q30P42m57l47N51p03L91N16r41J254M91q33J016
1213H39M3o52Q91o80K94K85j342P21J46j425Q76n08p96J109o56j12J000q14P14
1232f7N86r01J012J16p50J378n68o73J074j159k14P94j352L21M56j215J039l30
1250d53j165J875l57q00J494p40K20J154j339J016N39j825J397k13j411J351j063
1267c20o07J566j747K44J014j480Q79N79j226J819m09j077K050p56q16J843j321
1284B35j3J243k391J256J93j936J518k94j447J940j020o00J980j749L64J898j953
$$ y = [178, -1656, -577, -390, -1754, -105, 194, -477, 775, 61, -186, 1201, 143, 712, 1671, -44, 681, 948, -256, 97, -51, -760, -248, -1007, -921, 128, -1422, -775, -70, -785, 11, 122, 250, 1008, 634, 282, 1087, 390, 547, 903, -196, 330, -11, -841, -99, -556, -903, -352, -1055, -664, -148, -1089, 165, 656, -177, 839, 882, 230, 1121, 441, 735, 1020, -322, 399, 545, -880, -4, -512, -1308, -199, -855, -967, 33, -781, -67, 519, -382, 630, 746, -4, 1374, 806, 133, 1207, 48, -166, 628, -724, -403, 53, -1162, -123, -453, -1618, 257, -100, -900, 594, -146, 74, 1228, -111, 905, 1444, -381, 1016, 803, -608, 743, -320, -927, 639, -1108, -864, 150, -1330, -451, 128, -1098, 721, 312, -765, 1285, 529, -287, 1556, 235, 222, 1465, -926, 330, 523, -1413, 105, -189, -1636, 304, -716, -1316, 664, -1085, -721, 1177, -776]
1301g76J299O62j523J629l43j330J741j236p04K018k390P5J555k062R71N97j879
1318a696J774r6j231K257j062n91K126j368K97J225k198R79Q27k059J407k96j744
1335a449J968j345o18K003j662K53J685j744Q87R56j702J612Mj307K035j208o61
1352b93J823j829J03J153k030Q68L07j591J405k11j022J849q06p65J905j189K93
1369c0J433j747J061N55j767J107K74j370J247r90o08J226j404K77Q37j394R02
1386c91P47j372J460J49r17J314n75n19J307j130J28P92j348N59Q2j184J115o05
1404c88q64J210n53j54Q17q47O12N87o18P76K09p93P14o6p99J113q08r7L28r35
1424e56O9M95j008M47L19p55J116l55p0O55O0j86N49o32M09J23o72N74j26o17
$$ y = [-776, 523, 1185, -338, 1291, 948, -382, 1359, 123, -581, 1437, -953, -878, 677, -1385, -414, 183, -1696, 78, -18, -1249, 1008, -54, -645, 1481, 113, 410, 1635, -563, 416, 1243, -816, 591, 295, -1449, 519, -826, -1444, 559, -1103, -850, 835, -909, -22, 934, -768, 844, 848, -459, 1576, 368, -293, 1530, -299, -196, 957, -1073, -205, 102, -1489, -84, -295, -1317, 532, -274, -1039, 866, -323, -30, 1403, -344, 717, 1272, -495, 612, 886, -484, 763, -227, -835, 391, -1013, -736, 101, -1293, -391, 356, -1016, 444, 593, -324, 990, 415, -104, 1203, 73, 201, 993, -355, 204, 286, -898, 217, -388, -1252, -42, -595, -749, 68, -779, -167, 420, -198, 578, 787, -6, 708, 642, -157, 956, 148, 51, 379, -556, -487, 8, -1000, -553, -234, -989, 127, -228, -298, 357, 417, 231, 780, 148, 557, 680, 8, 582, 456, -161]
1444a61O33q42M9J30m62J69J63k90M80j22l8L71q8n1Q53k40j07N64o69K85k29
1465C98k20M8n32j34M70o77j86N38m71M90Q0l56O45m8k31Q15m20J10M64p40L46
1486C89M69j084N83k89n87P95p42k85Q48p07j7Q07p97O33N25q67Q40k3m88Q98
1506I01m65k49P70j251J53J013j359J80N27j074M69K4m72J174q72J59J088j001
1524b85L67R31j132O40M78r80P93k34r54Q34p01l23J035j370K09P64j299R07M23
1543A03r70J086M8n57J434j149j09J308j419M34P22j357M88L57j336R14l95m21
1561h19J061q23k1J187j161J75J040j162O85O74j006R16k89o78J154q73k99J091
1579H52j439M02P20j819J004M47j027R11j92o69J501r26J6J302j305N74P61j476
$$ y = [-161, 472, -370, -321, -191, -653, -484, -321, -611, -131, -253, -291, 80, -8, -59, 794, 554, 447, 1011, 342, 627, 398, 178, 226, -306, -440, 30, -647, -833, -295, -766, -276, -196, -552, 93, 45, -186, 629, 209, 319, 783, 43, 389, 858, -226, 357, 68, -519, 276, -466, -751, 97, -610, -627, 180, -617, 16, 541, -326, 514, 491, 3, 901, 436, 187, 957, -294, -141, 872, -487, -307, 220, -854, -385, -361, -833, 341, -531, -372, 716, -285, 82, 1013, -119, 521, 999, 19, 812, 578, -376, 458, -243, -566, 469, -901, -692, 72, -1227, -320, 103, -867, 219, 267, -290, 1144, -5, -114, 1194, -225, 209, 931, -426, 62, 419, -917, -3, -398, -819, 242, -581, -602, 585, -576, -401, 639, -523, 162, 836, -170, 746, 457, -221, 933, 60, -239, 852, -587, -185, 535, -1284, -280, 167, -860, 51, -141, -810, 691, -235, -219, 1083, -222, 352, 1113, -363]
1597c63O60L99j249O75L4o86R41j123J1R46j128L08J052j177J000J96j002R42
1615D36J69n56P59n92j73O19r80J77M53j147N98J98p72N95p8m86Q27k21m1J046
1635H31j109K94P78r69N76K07p82Q05j81q57P30l17l56O27r97N13K60q34M81K68
1655c2m67M89J30j26O99n27o4N48p12M13J19o46L50O4q25L23o9l95O88m11j12
1676e63O00m75N65J90m26M00J63k54M13k81l04M02m22O8lk36m0J50l40L16j58
1697b35k86N54k91J33K30j51K99J56m36N99K7k52J32o46O1J39l01r8M82o21L00
1718b05r2j93M76j90M7L26k70P6K81l16N10l0o00P38l79k23L96m21k31L10m96
1739d86M26j42l92O78j97j61L24J56k71Q03q90N20N3m33M61Km92L15k60l90M72
$$ y = [-363, 297, 696, -553, 122, 156, -530, 411, -712, -701, 245, -883, -575, 477, -700, 300, 496, -506, 436, 605, 49, 808, 216, 43, 662, -318, -141, 312, -835, -237, -39, -811, -216, -294, -780, 47, -174, -215, 831, -278, 16, 794, -175, 401, 608, -174, 631, 450, -407, 323, 6, -350, 277, -720, -207, 53, -781, -300, -32, -499, -10, 120, -6, 693, 166, 102, 650, -62, 351, 470, -176, 174, 238, -587, -264, -333, -728, -40, -451, -563, 37, -438, 127, 317, -109, 291, 454, 200, 613, 332, 28, 430, 8, 76, 73, -163, -203, -53, -393, -77, -235, -521, 33, -258, -125, 105, -46, 253, 409, -27, 572, 599, 347, 479, -167, -106, 33, -268, -366, 116, -505, -205, -297, -490, -14, -204, -157, 169, -101, -25, 256, -60, 450, 420, -180, 558, 179, -44, 352, -69, -300, 10, -486, -60, -202, -594, 84, -113, -274, 50, 206, -65, 738, -152, 368, 421, -12, 449, 451, -41, 274, 14, -376, 96]
1760I6n14j83O92l94j93O30o28M97J99m31N15J51o44R08o14j45O22o64J01J25
1780A26l03N0L7n77N80o9o17Q73l33k55P24l21J12N00o49Q39j85o64Q26m91m74
1801b71R43q79l5N12o83J73L98p21M33K61n52Q57l71j81P35n54j25Q62r72L32
1821A62L83r49L51K91p32P38m72l52R15o80k11Q32o41J37O07n93N01q4l61N73
1841D15j53n46Q51n48k63Q00q92NM51o53O43j97o53R72m14r5O92n03P4P33o47
1862G2J68K28o19M25P4m33M95j78p29N83l2k88M30p75J86O10n83M58J46l10M94
1883D22j59m73O88k94p1K40m13L3J57m99L51m0l90N15l75P3J39l83J90N21l78
1904a46N0L51m71O88l12n3K12j34k37L81m39o6L32n87L51r6o5J35n4l31N89JN7
$$ y = [96, -418, -601, 91, -303, -496, 134, -494, 3, 202, -229, 286, 437, -207, 701, 87, -58, 564, -100, 1, 126, -177, -127, -90, -667, -87, -156, -773, 100, -233, -488, 236, -85, 27, 527, -122, 717, 532, -132, 694, 203, -271, 672, -207, -242, 270, -413, -240, 158, -563, -130, 131, -421, 436, 65, -116, 619, 65, -60, 802, -170, 162, 545, -404, -53, 238, -494, 244, -228, -580, 335, -345, -556, 276, -365, -228, 379, -214, 287, 203, -158, 415, 262, -284, 567, 19, -244, 556, -336, -331, 120, -533, 110, -87, -740, 232, -182, -277, 415, -88, -14, 719, 72, 240, 468, -151, 274, 348, -85, 410, 232, -497, 86, 54, -234, 196, -579, -393, 217, -366, 92, 238, -72, 422, 263, -210, 478, 184, 113, 353, -60, -27, 130, -369, -18, -58, -448, 67, -308, -235, -96, -479, -289, 232, -146, -96, 255, -216, 472, 160, 107, 319, 185, -52, 329, -110, -176, 156, -431, -80, -176, -241, -106, -160, -491, 98, 99, 156]
1927A56n2k74L25J66k55J39L5l23J17j88MK83m52p1N18m73J11O5n1RJ74l8K44
1950A69Jp5J90j96n0K98n34L64%l38L56k33k19n7kN3J54k46L39M7j97L10j25J85
1974A94P9k16J2L65l89J26m3l11L19J5k22n5l5p8K72l61N1M74n06L16J17p0L06
1997C60Lm34N07k68k20L11l75k1K84m70J75J81l84K33J53r5K93l86K18M42o22
2018a15K99p4j31L23p8k63M3K20o24L08j17r8L90o24K19L27m91M77K1k55M64k04
2040A7k12N79l93P6N02o67J35L02q03M70n1m74L34l8k30N31k98jL76n79P10%m37
2063a51N81k78k20L09p1k80M83o13J25K48p77N94k7k07M71k39l96P89n50L3N58
2084C82m79K91J24l80J1M91o22M28j17l99L77l28M1L21k65L8J88n30K77L03m98
$$ y = [156, 104, -170, 155, 321, 66, 205, 240, -83, 34, -154, -150, 133, -319, -390, 128, -345, -234, -169, -220, -211, -37, -75, 169, 170, 95, 285, 89, 39, 337, -197, 167, 167, -171, 185, -48, -267, -324, -326, -273, -119, -365, -26, 21, -176, 134, 9, 194, 273, 57, 69, 434, 45, 171, 128, -183, 136, 151, -71, -126, -161, -239, 33, -328, -277, 197, -309, 7, 124, 54, 360, 363, -71, 436, 168, -52, 259, -116, -137, 147, -323, -148, 33, -351, -118, 35, -60, 233, -153, 65, 507, -115, 184, 110, -21, 302, 224, -39, 4, 224, -400, -92, -209, -307, 83, -541, -322, 5, -486, -9, 12, -243, 221, 17, -195, 384, -9, 67, 569, -98, 37, 339, -464, 6, -45, -519, -185, -223, -453, 78, -220, -221, 155, -424, 286, 286, -151, 430, 152, -68, 241, 170, -110, 373, -240, -115, 133, -644, -50, -77, -284, 187, -52, -448, 341, -209, -176, 382, -97, 194, 318, -62, -51, 440, -182, 246, 129, -270, 107, -221, -180, 141, -124, -86, 102, -428, -151, 152, -346]
2105c46M87k6l06O40k52j79L36k22j05J37m43K53R5m27K16L11n50M09m3k28M65
2126B22j81Q2L02n36J11K13j84L76k01l91L53l1k0J18n04L49L4m92N45M9k83M5
2148b4J09j84J90P5k70M02k26J94J71m75J42N9l53K04pm13L66j62P3L43l20K83
2170A77O8l72J52J40k00L45J8n29M20k28j03J44p4L0K46m41K09p1j57R2K37k47
2192a44J90l7O2K0m7L64k05j81P9j4k0R2k57L3K75m15R1P4j65J55j1o2K15kj57
2217f7L22j40l00M22k58M21j65m27M32k65RJ71l24J91J8p6j16M36m69R6N4j56
2239a91J28J17K3R6j19Nm1k18L73n5j70K10j35j79J25k46Q3J53j83J67r4j9L04
2262A34q6J35j12M6j38K08o7n7k2k15J42K7j97J11J60k23K91l40K30m6k03J93
$$ y = [-346, 141, 115, -191, 449, 197, 18, 354, 132, 27, 164, -279, -26, 69, -358, -142, 169, -381, 28, -15, -243, 222, 41, 123, 425, -111, 0, 213, 29, 405, 204, -187, 166, 135, 115, 233, -271, 78, 112, -380, 165, 214, -69, -24, 85, -99, 91, 166, -104, 298, 72, 266, 437, -38, 104, 163, -190, 14, 7, -406, -40, -202, -129, 214, -106, 177, 245, -127, 25, 165, -35, 310, 328, -201, 219, -9, -112, 32, -42, -12, 234, -207, 2, -69, -226, -134, 103, -144, 46, 9, 71, 91, 44, 408, 203, 22, 101, 87, 67, 159, -98, -65, 210, -205, -114, -40, -205, -50, -61, -123, 92, 90, -67, 255, 115, -185, 237, -21, 400, 235, -192, 240, -25, -16, 155, -169, 22, 40, -36, -152, 284, -185, -89, -35, -191, -63, 54, 77, 173, 54, 59, 18, -200, 173, 118, -52, 158, 23, -156, -31, -277, -194, -41, -224, -57, -151, -170, 134, 48, 183, 71, 117, -21, 187, 120, 63, 41, -174, -32, -5, -202, -91, 69, -154, 137, -203, 27, -19, -222, -29]
2284b9L70m99L15O4j76rJ24k36L42l51j10K01j29kL63m49J45K46l19P7K09l55
2306b08M06j94j5K88k99O3M12m80l0K38k64J15k74j5K06J06k81M75l16Q3J37j86
2328c3J52j25j25L17L1j63O2j39Lr8N7J21J26m50K08k2j65L60j41j64J19J56k38
2351a51K23N1k26L74k80M3o7k9P0J94k25J92k35j34L94k74J14j06n1R9j07Q0K7
2374b4P7k43L32O5m4O4l16l2L99l69J2Q5k21N30m50MJ11m5m5J83l3R1k38R2N0
2399C5R5j55M5Ql03L91k00J24J64k79K33J45n57K14J3Mm5J14j48N3JJ31M7j83
2423e3J47j8j19j4L2r5m1L19k00K56k36K6J4k27K36o5l7j04K20j64L04j58J96
2446B19j16j75K40k5j15Q3j7J6r1j00m0j13P9J86l86K33J31Jl0Q5j06jK06k62
$$ y = [-29, 341, -158, 157, 221, 45, 36, 160, -76, 266, -85, -195, 6, -123, -125, 238, -211, -66, 180, -139, -62, 147, -208, 198, 4, -11, 277, -22, 41, 453, -27, -57, 181, -83, 32, -242, -257, -51, 55, -226, 249, -67, 16, 153, -33, 119, -6, -131, 186, 217, 54, 116, -23, -20, -118, -61, 60, 186, -264, -56, -78, -243, 117, -24, -188, -69, 87, -151, 72, 123, -103, 271, -9, 34, -33, -62, 8, 202, -23, 169, -66, -200, 194, -80, 34, -72, -123, -24, -131, -51, -24, 53, -190, 142, 207, 163, 227, -89, -121, 278, -91, -79, 6, -215, 315, -135, -131, -20, -65, -110, 73, 40, 131, -107, -15, 35, 130, -25, 20, 28, -275, 116, -84, 40, 204, -75, 158, 303, -254, -40, -27, -23, -68, 46, -102, -49, -48, 83, 130, -53, 94, 76, -43, -57, -25, -120, -161, 158, -42, 214, -22, 4, 18, -209, 27, -38, -75, -179, 41, -123, 181, 23, 219, 103, -72, 168, 143, 28, 111, 94, 110, 19, -81, -121, -234, -155, 31, -355, -122, 9, 10, -20, 65, -41, -42, 164, -98]
2470i8mJ51L3N7p2l70L65j14K08k20J43j5j36p4m3K59j19K81J96l24k2Jm8K03
2494B38l45J86j23J27J5j4j21J51k39o1J63N4j39J26rO0j9p8mK48k39Q8j36K54
2518A83j04M4j11j21m7J03k0j31Q8K10k16J05O9m1k4J02r8l6J17J0J90l19L8J9
2542A0k23K35J01l38K59m1Q9Mj51kK51l30K68j94O9J71j88k0N0k14J07L32l19
2565g4J25Lj73K24k46P2J03j39j0K74j79N2M8j20J51K0j51J41l8j37P2j04j46
2588b32N10l42k6P6NP0rk28K10m3M3L0Rn8Jj13n4J48k07L65k6l46J16K80n22L57
2614A4j04L7L4j43J05J13j06%K84k18j76M0K12k6L6K8O8k52n4K99l98L02k52k40
2638c97O38l24o8K57k22%L02l88L50j47j19p8J58M9j49P1L7K07j99J4O0k25M56
$$ y = [-98, -102, 49, 82, 139, 67, -303, 62, -52, 156, -64, 79, 64, -72, -146, -189, 70, -49, 232, 428, 104, 82, 83, 35, 238, -107, 79, -44, 83, 98, 84, -37, 114, -125, -186, -23, 31, -108, 18, 9, 69, 50, -28, -32, 216, -23, 65, -71, 183, 79, 123, 12, -109, -156, -53, -73, -204, -116, 94, -122, -17, 52, 11, -13, 89, -9, -45, 72, 82, 272, -47, -9, 10, -213, 22, 123, -215, 44, 3, 92, 96, -55, -57, 194, -136, 132, -62, 7, 178, -10, -30, 20, -194, -87, 245, -74, 51, 54, -119, 105, -141, -69, 34, -105, -115, 159, -20, 32, 80, -40, 111, 131, -20, 121, 83, -54, 18, -86, -232, 278, -64, -90, -14, -9, 61, 52, -176, 34, -9, 34, 64, 73, 15, 16, -97, -151, -3, -210, 155, 129, -217, -101, 179, -343, 14, -90, -53, -19, -162, -57, 56, -50, -50, 234, 16, -160, -120, 92, 66, 102, 130, 198, -54, -108, 191, -207, 95, -157, -397, 241, -83, -151, 106, -116, -116, 186, -202, 148, 1, -118, -196, -38, 11, -138, -67, -30, 177, -22, -8, 52, -173, 283]
2661B83l87J03j9J76j37P1J0l2O9j58J84j04p8J78k63J79r2LJ4j09LJ29j32P0
2685c9K9j52J16l6M9J72r4q7K39l02J44j08J01k66K09O0Jj57RJ75Q0p6l36M25
2709A56l21K10L1j22N4M8j73J89J34j73O4r0O7J12K2k41N2j20J44j57k03Q0J35
2732a02O7J89k02M5Q3o7mj08j5J21L3J2J02N3k83qp3O5J40j71J77j2q2J23j79
2757i6L54j83j03j06J14Qj28M2j54K44K15l5m6r3k52J90j56L06J7r1Ol2o2m5K34
2782A48j35K08k23k3Q8j25j4R8O1j31K71k64J63q3j47O1j33K98j05J71j70L9q1
2805b8J55l3j34R7j2l2k6k25K30M0J4r0J46L3r1J75j88l3l7K5P1N8r2n5K8J75
2831A71j50J8K17j22j37J27lJ02k87n8K19j90j1L2L5k22K31k9j84K87p0J44n6
$$ y = [283, -104, -1, -20, 156, 19, 90, 100, 68, 137, -21, 163, 59, -19, 159, -104, 75, -17, -14, 0, -109, -106, 23, -109, -39, -10, -162, -46, -82, -33, 139, 45, -42, 197, -105, 39, -69, 32, -234, -25, 35, 36, -121, -112, 63, 143, 67, -269, 156, -165, 45, 76, -46, 8, 56, -117, 72, 206, 33, 97, 7, 74, 186, 208, -33, 19, -101, 43, -114, -317, -237, -102, -35, 154, -48, -3, 80, 13, 9, -99, -114, 7, 40, 52, 154, 207, -76, -84, -157, -92, 48, -123, 54, 42, -40, 83, -96, 258, 75, -28, -134, -20, -12, -140, -98, -252, -8, 207, 172, 126, 33, -219, -29, -185, 121, 138, 47, 53, 21, -41, -86, 148, 13, 221, -2, -25, 63, -62, -76, 22, 83, -48, 223, -41, 122, 39, -108, -47, -180, 118, 13, 184, 14, 53, -28, 127, 94, -40, 57, 45, 13, -13, -238, -8, 32, 46, -44, 102, 135, 44, 219, 31, -2, -39, -14, 57, 115, 23, -32, -4, 171, 21, 39, 256, 134, -3, 124, 121, 223, -64, -122, 97, -93, -104, -72, -37, -259, -28, -57, -241, 46, -24, 120, 64]
2854F4oOj70O4O2L6j95L30r9q7o7K84l46K53j81Q0N4M3o2j40J6Q8o8P8k1K71j90
2881I7l8k43J06M5O2nk06K78k83K63p3K2J52j69P8N9o7J24k24Q8Q5j08m0J38j17
2906B4j38J55k5J5n2J52p2L8R5j09P9j92J94k08J38j78J91O8j67J38k47P4J09
2929H2k6J02j80J8J45k50J49Lm8j4j07%R9J76j16j6p9m2J01K2J1j27J8N3J82k65
2955a09J94k81L22k39J63N5j53J39j7k5Nm6R7o0l7N2j77K45k62J60k11M09l36
2978a12j14J55j04J95lr0nr5J94l3K4k19J10J46K3m0K11m25M1K28m32L90j64J07
3002a2j5m4r6J87K46j61k50q0L65j80N0R6j62j6K55M6m00L28j31j68K99j46j4
3025cJ26n4l57K60O1L62m08L1R8j20J28r3O2j16p8L00k9k13R3k58J26P5J46l58
$$ y = [64, 58, 64, -106, -42, 20, 56, -139, 191, 92, 5, -62, 222, -124, 129, -52, 28, 82, 125, 63, -77, -61, 27, -41, 37, 16, 287, 97, 59, -184, -78, -33, 29, 24, -182, 96, -187, 76, 3, 25, 177, 8, 86, 145, 78, 202, -22, 66, 151, 43, 3, 141, 24, -114, 41, 16, 31, -21, 131, 59, 97, 192, 83, 162, -30, 164, -44, 94, -84, 107, 175, 8, 146, -101, -27, 82, 56, 158, -22, -4, 141, -109, 40, 43, -5, -19, -126, -126, -27, 149, 33, 17, -62, -104, -3, 19, 30, -97, -79, -26, 156, -109, 85, -196, 126, -113, 50, 105, -48, 91, 74, 49, 54, 8, 105, 45, 8, 60, -117, 128, -134, 26, -185, 224, -112, -226, -71, -175, 20, 17, -73, -78, -173, 21, -12, 12, -207, -97, 49, 72, 32, 243, -182, -141, 87, -345, 45, -119, -12, -27, -71, -167, 20, 266, 105, -145, -225, 140, -40, 10, 106, -56, -72, 183, 229, -171, 157, 26, -142, 157, 11, -3, 123, 69, -288, -28, 33, 395, -13, 18, 116, -4, 124, 31, 93, -23, -101, 199, 170, -43, 50, -208, -82, -7, 139, -219]
3049b19J68K57j34j23L2L9K27j60j83J10j37K86ok08j57J60mj81K81L9j3K2j04
3072hJ77K3j96O7j8J36j26q3J59l8o0ok07M47l48K0K7J8J3J15j27Np3jQ8R2r9
3099cj04K17j50L4R9J7j64R0n1L8j65J14K7Lj70J28r6J9K11j94J02q2J39j75J58
3124D2n6K9K8n8J70k05Q0J8j00n8K04q3J1l3J38m1r3LO5j46j47L63p5oj32K19
3150A37r1Q9k36J67J84m49L67j90j4K9p4k4K29o5K5m3k63J40J62j90L08k05J71
3173A64R8k71l2rK21k48K49j45j51J76j32J41o8M3m8N3p4n8M2m5L11m05L14r1
3197C5j95L8P3Qk5J65L3k03J91R0j89j03K7q1J49j5j87L40j90O6K09j27j3j65
3221f9N7l8m5J92j22L0j84j16L22j3Q5lM8k35J46j77K16k7j1J50j81j95J54JP1
$$ y = [-219, -51, 206, 72, -51, -19, 20, 247, 87, -96, 14, -123, 163, 157, -51, -208, -48, -52, -233, 48, 87, 74, 96, -8, 169, 192, -4, 63, 45, 181, 55, -28, 131, 93, 33, 27, -180, 267, -81, -61, -34, -16, -3, 112, -15, -10, -83, -84, 4, 96, -3, -107, 110, -40, -6, 93, 110, -54, 36, -15, 23, -142, -28, -1, 2, -168, -40, -136, -117, 94, -100, 2, -80, 59, -116, 42, -14, 15, 43, -15, 155, -50, 30, 48, -52, -110, 94, 11, 22, -11, 127, 86, -7, -4, 61, -85, -232, 131, 56, 50, -82, 137, 46, 135, -101, 66, 250, -199, 168, -22, -36, -7, -81, -105, 124, 59, 84, 41, -222, -82, 80, -110, 198, -7, 164, 262, -9, -41, -50, 171, -77, 172, 27, -124, 52, -80, 61, -7, 36, -12, 41, -33, -91, -49, -94, 217, -188, 126, 35, -160, -122, -49, -41, -66, 99, 132, -71, 120, 210, 21, -82, -55, -136, 13, -2, -189, 151, -39, 27, 236, 109, 96, -69, -12, -50, -95, 97, -25, 5, -179, -295, 27, 14, 99, 96, 144, -91, 55, -122, 94, 67, 56, 206, 25, -170, -16, -15, 56]
3246E6J31l02kj1Q5j2J32M8J40l01R4l9R9k97K40O7K4k65O0m4m9J19K8n8Q2mj02
3273h1J28km3M6l3q4p7J32j2ln6O0p7J40J97j37Pl76K14kJ02j99RK29j1q8Kk07
3301b22L02M1j62K47l39M5J13o7J38q2%mj77J23j27J46K07k07j98M45k62j73K77
3324F4R6j21J07J04k74J92j25p0J01l09J44J15k64L12j56j06J03O3k60J06J70
3345hk34L12r7J11k9o0N5K06k81M4k4J34Jj43K8k04J64J44j45%r0J36q8K01l5
3370I8k26M3N0J72p2p0J11o6q4O6L1k34K33q9k6q0J51J32o9j60J7O0R5j26J97
3395A54j36J59j54J8j01Q0r7J47j71QJ23j26l1J49j13J73P4n7r3O3N7m71M25J46
3419B26k21j12K85m4o5J85l74K19N9r7k02J91L4J83l80L5J90j67M8j3o3J4K43
$$ y = [56, 187, -115, -117, -128, -43, -55, 77, 125, 265, -36, 58, 19, 118, -179, 61, 128, 152, -113, -53, -97, -146, -27, 1, -57, 25, 21, -81, 47, 45, 2, 48, 15, -69, -146, -14, -26, -29, -85, -25, -102, 38, 235, 98, 105, -271, -57, -59, 43, -156, -147, 82, 71, -17, -15, -222, 80, 121, -41, 206, -133, -88, 25, -42, 96, 14, 14, 10, -167, -44, -171, -25, 182, -25, -223, 222, -40, -213, 64, 160, 39, 146, 250, -24, 168, 43, -27, 74, -235, -91, 24, -240, 72, -84, -190, -87, -24, -284, -178, -8, -242, 70, -27, 84, 55, -5, 50, 256, -25, 19, -5, 129, 130, -13, 15, -189, -25, 119, -26, -26, -116, 20, -68, 133, 98, -128, -85, -35, 137, 65, -5, 106, 40, -44, 22, 53, -181, 52, -37, -63, -143, 8, 140, 71, -89, -72, -12, 83, -43, 154, 18, 177, 23, 41, -60, 20, -77, 70, -101, -93, 30, -96, -127, 22, -91, 82, 156, 99, 6, 69, 126, -345, 80, 226, 5, -107, 178, 134, 69, 254, -120, 99, 158, 61, -141, 50, 84, 267, -113, -78, 112, -55, -7, -20, -83, -69, 174]
3442A74l44J44j6K05j74K6J4K47j51j58K3n1n5J34p8L58k79l34L51M5r9J08L4
3465A24j30J10l7j28K69k17j21J23n5N9k2J25m8Km3r0MJ49o9r5J21K2j15O5j91
3490a88K21J41j87n6J57j28k51M28k63J11K4j87o3K58l5K23k91J66j79j98L14
3511A7J52j01j08l06K77K08j94oJ3M6J37j46k0J40m9j22K04l08K93n6n9o4K2K6
3535dL25m41J35K07l95K27q3j03J00L1m8PM1n7J59L9r9o5j01K44Nk47Q9P2n0M6
3561C4K06m09P5K74m86L81J86l86K58o8lR2mj66N0o1j9L0M8J22j19p3J69n3L0
3586A08O3k88K40q6j65J71k87J52J75k07L38J00l41O6J31j44K10k07l54K26P7
3607b2K09j38n0J16p6j81L5o1K68l8R4j37K14l11M5N9J6m5R9j66J48N1k54K05
$$ y = [174, -170, -26, -42, 163, -11, 15, 29, 276, 125, -33, -10, -61, -116, 18, -60, 298, 19, -315, 36, 81, -18, 90, 124, -6, 104, 67, -61, 208, -9, -130, -7, -62, -3, -25, 100, 52, 54, 11, -79, -75, 74, 5, -90, 31, 53, -62, 3, -188, 33, 174, -13, -69, 88, -40, -291, 137, -126, -15, 9, -178, -241, 17, -18, 205, -86, 80, -99, -297, 17, 169, 68, -40, -346, -69, 139, -55, -61, -48, -2, 135, -11, -31, 109, 60, -62, 142, -166, 127, 71, 12, -52, -30, -4, 321, -120, 15, 222, -173, 54, -29, -132, -32, -1, -49, -42, -1, -58, 101, 140, 41, -24, -125, 119, 124, -123, -34, 38, -12, 34, 240, -169, -94, 180, -306, 75, 261, -125, 133, 65, 62, 154, 150, -16, 34, -27, -46, -16, 32, 154, 35, -38, 131, 78, 108, 171, -117, 123, 37, -128, 43, -244, -92, 83, -124, 214, 314, -27, 39, 170, 26, 236, 29, -325, -99, -22, 187, 49, -1, 115, 39, -142, -107, -168, 100, 62, 156, 19, 233, -78, -33, 26, 42, -3, 96, -70, 78, 129, -125, 80]
3631H0o2MO5J57j28J73n71L48M9j56K72j8k71J38j07M5J03n1j49K53l36J46K0
3654DL1N0j57O1R8L1k46K41L4j6q5k51N06l2l80J01O3m9j4J23k22J9K4Q3j40R7
3680b6j17J59j06K92k07o6R9n6nJ91j24j35K08j33J09k06J55j07J62o9Lj68J14
3703c3L7J63k04J7J21k05L16j57O2k02J7J03J30l4r3l8Mj29K14k27K56l35K72
3726E5k1k2k4j24J70P9J48l86M5N8j7J16n7L2j56LJ68l6j41K32j74N1k02K3K89
3751A09k29J82Q2o3N0J5k79N3q6J54J62k98j78K90J89l02J29j07J08J37O5j60
3773B3K08k93N0q6P4L05l57K4J01L0r5L0M2k65K17j02M0J6J62P0k51j49K14k02
3797a94K33qj37J82J69j79N7P3k06L2r0pL6Q7O6j01M7j26L6N4L82l13j10P5k9
$$ y = [80, 18, 22, 87, 244, 116, 289, -282, 66, 115, -41, 231, 213, -58, 80, -27, 18, 121, 70, -79, 174, -162, -16, 4, 35, 85, -72, -11, 87, 118, -128, 113, 147, 131, 46, -205, 301, 269, -111, -10, 53, 4, -10, 113, -109, -90, -66, 17, -123, -26, -143, 16, -90, 202, -5, -71, 28, -28, -33, 158, 34, -101, 107, -26, 83, -123, 32, -75, 87, 18, 21, -147, -33, 4, 167, -37, -20, 101, -104, 212, 55, 117, -85, -68, 35, 165, 131, 38, 0, 4, -125, 89, -138, 118, -217, 55, 34, 12, -12, -136, 34, 113, 261, -125, -80, -22, -39, 77, 20, 52, -104, -101, 67, 31, -110, 122, -52, -1, -203, -180, 109, -120, 62, 144, 81, 131, 146, -133, -80, -166, -12, 150, -148, -326, -36, 153, -149, -20, -127, -19, 118, 183, 23, 231, -62, -12, -98, -24, 281, -76, -52, 49, 79, -16, 14, 56, -209, 8, -94, -54, -38, 124, 194, -57, -206, 8, -194, 39, 31, -106, 76, 245, 66, 123, 196, -10, 22, -68, -75, -39, 48, 114, 13, 60, -66, -30, 24, 406, 93, -17, 58, 29]
3822B9R7r6k2n7J78m16N11j65j77o9Q7O1J38j09r1J62q1L8J09j05j1m0n5K35J6
3847A67k69M0l0J12k9P9j17M6J26j33M5L4K75k29Oj15j6nl0n8L15r0k97L74j63
3872C8l1o5o7J09J23n2j95n3K70k56L57l70L05P2j53j61R1rJ7JK76j82J07r2j50
3897g0J50j95J33j89J78l58M61q1jj89L42l08L5J29l0K17j05k08K74j80k02L53
3919A56m8K0j50J8Pj02p2L41pp1M9q0j72L0n3K77l72J90J04Nj25MJ53k19J60j60
3945a17j3K94r4j32K87l53J03P1j34J14j5j50K35j87L7M8R5j44J28j03ML1k82
3968b77L08P6n2j46O8J7j20L8QJ42q1m5N3M9r0p6j42K77q4K8K6O5J7j39J23j01
3994e8K21k95R5Q5R8P3j55l8j07R6R2j82o2L01j31Lj63M5P9R9l83L50j14J92o3
$$ y = [29, 126, 30, 8, -49, 129, -287, 224, 59, -118, -187, -100, -39, 99, -10, -101, 61, -20, 18, 127, 22, 11, -29, -84, 151, 167, -102, -62, -92, 20, -9, 70, -47, -1, 125, -8, 37, 71, 346, 117, 123, 8, -8, -13, -43, -101, 214, 124, -173, 201, 38, 7, -58, -125, -16, 107, 55, -140, -193, 77, -179, 178, -192, 113, 185, 32, -129, -38, -47, -30, -29, 247, 65, 172, 80, -70, 80, -115, 18, -171, 7, -351, 110, 29, 28, -161, 181, -127, -92, 37, 7, 224, 119, -89, 185, 5, -197, 156, 108, 128, -22, -4, 3, -99, -171, 170, 163, 92, 141, 61, -111, -81, -134, 143, -229, -39, 65, 70, -55, -51, 102, -117, 43, -117, -130, 164, 70, -62, 225, -128, -25, 46, -88, 26, 11, -139, 96, -91, -54, -6, 89, -55, 73, -30, -26, 5, -277, 31, 107, 55, -91, -23, -6, -126, -88, -80, 62, -19, -64, -11, 38, -52, -128, -270, 7, -77, -49, -23, 42, 59, -80, 43, -58, 163, -132, -37, 48, 146, 219, 64, 26, -81, 15, 107, -75, -137, 164, 33, 36, -127, -82, -3, 96, -287, 63, -51, 141, 78]
4019G8l23J76J71k99J68R4Rj9l4p0qJ02l79L52j55K9K72j06j06J81k02n9J06l03
4043c25J48J96J1J02L1k7L4j57j21K6J04N4j73r4OK1O8J62j01J61j3M7M8l01M3
4068e0K05j71n8J20j9q1pR9J11o5j42q1Q4K1P3J17j44J16k78q4K64m6J71R5l90
4093a40L05k45k8K5K2L2K73l79L06j53k6j19L44k15qP2K18p2j78JL2o1q5J83l38
4118b34K53Mr5J15o7o1RJ7p3N4j3L5m6J23K49l29N4kP0k56K47N7n7K06l02q4K6
4145a00L31k71l7n1N09n54K94lj01K8q9J8J7o0R7K54K7l61K5N9j01R1j11j3P2
4170c0j8K5J44qk90J39j00K67j27oK67l10r9N3l6J77K05m13L35lj88lN4k47J52
4195f0R1O3k08L12n6M5k00n7J51l3R3k21o4L83m42J74J7p2Q7K1O4J62k52m2K17
$$ y = [78, -245, -69, 102, -197, -29, 65, 74, 55, 21, -49, -57, 45, -334, 18, -137, -108, 164, 58, -48, 133, -69, -128, -22, -325, -177, 19, 30, 132, 163, 136, 170, 13, -108, -82, 22, 76, -97, -191, -185, -164, -96, 66, -35, 126, 113, 160, 208, -93, -50, 155, -16, -74, 46, 27, -54, -61, 38, 149, 84, -58, -139, -55, -34, 39, 156, 12, 128, -150, -234, 30, -16, 155, 250, -140, 165, -80, -108, -83, -61, -29, 244, -135, 171, 18, -8, -127, 217, 2, -6, 66, 284, 212, 34, 35, 67, 6, -79, 104, -234, 19, 23, -72, 43, -24, -85, -76, -59, -132, -78, -91, -56, -102, 21, 270, -59, -5, -7, 63, -193, 54, 111, 54, 260, -42, -126, -100, 231, -40, -77, -128, 381, -173, 121, 118, 17, 45, -44, -26, -9, -69, 28, 282, 309, -52, -27, 32, -69, 22, -89, -102, -30, -48, -23, 121, 113, -177, -38, -138, 129, 2, -4, 263, -47, -146, -93, -129, 48, 253, -160, 175, 172, -16, -19, 35, -212, -60, 31, 94, -114, 198, 142, 187, -13, -70, 81, 48, 141, -80, -144, 239, -203, -29, -12, -84, 3, 24, 88, 250, -2, -44, 173]
4220A73k18o7L53j87j51M5K01l53K69k38J53L4r4K97k84J50J82l14P4L3k5j94
4242a61QN4P4L1P3k08L1M1K69k61P5r1J60k7l5l2P9j89K42J31j39j21N2p6J09
4267H9p0m1J97j58r3R5J39k84L01m27Q0J54j00K20o0L4j34k51M75j97l6K3K00
4290A56q2N2l8r0J90j86n0N0j74K83j93l3J71r1j9J24j46l0J92M0k66K28j73J95
4314A10oj56J66J69k99K89l55Q8M5j23Q2J01k47p9K78p8J57j60J20J14l06Q3J
4337fJ01j91J34m7q2J10j85M3K63j22R0j07K7j7j36K75o3O4o3l1o1O5J33l93J78
4362b1o1P9j1j33L28P6l75L42j49j53J84k18O3K08j05r6J78p6j74K37k53K64j85
4385e1J29Lj15j31L74j20o8O4j83L4R0k11M5J16j06R9N5q3l0K21M6o0j53nO5j93
$$ y = [173, -45, -112, 241, 54, -97, -52, 149, -204, 65, -173, -20, 14, -80, 217, -67, 83, 265, -49, 25, 58, 33, -161, -153, -99, -25, 6, 79, -129, -98, -57, 212, -49, 26, -65, 95, 68, 33, 1, 80, -109, 133, 264, 125, 4, 56, -20, 89, 19, -22, 175, 17, -76, 19, 158, -126, 175, -252, -172, -18, -118, 102, 42, 76, -58, -309, 166, -31, -67, -44, 156, 74, 126, 88, -2, 188, 2, -48, 2, -172, 111, -82, -115, 56, -35, -54, 70, -76, -106, 86, 126, -140, 88, -85, 110, 104, -52, 114, 283, -16, 273, -82, 6, 51, -72, 10, 111, -136, -215, 63, -15, 142, -18, 102, 216, -90, -7, -6, 95, -96, 38, -9, -91, 19, -166, -123, 140, 18, 108, 1, 28, 11, -125, 150, 87, 151, 88, 57, -4, 61, 194, -199, -21, -82, -3, -14, -147, 181, 257, -118, 224, 75, -78, 106, -112, -49, 159, 54, -42, 136, 60, -114, 123, -130, 134, -51, 78, 81, -34, -165, 209, 89, 21, 85, -98, -64, 26, -185, -140, -24, -130, -31, 24, -59, -89, 132, 178, 118, -35, -40, 25, -168]
4411a68J11J73j91J34k06J72J15j42R1j96j47J73J30n0o8J83j67O6j00j44L55
4432A24k62J35K49k78k8L4j79L69k08j8J24k29M9K35o2o5J39j81Q2o2K1L6k28
4455b03J85j73K67o1M1j20n8K27j49O1O0rQ5JMj48M2k6J15j33K26l01N6l8j8r3
4481a60K86k09K64j28k43J11J67q8Q4Q0k76K38P3l01O1L25n13L14j65j20J55L6
4503iJ96k68P3O0M3n0O7N6k97J26N1M3Q1k13J28J08l87K13k27K01n6J15j52J49
4527E1J41n9l2j87K9o4rJ00R2j16J17m1j32K78k96J67JJ3j58J49j99K11M9j32
4551b7P0O9k50K83ok20L18m37J6J54M7n7q2O0P3J53j36Q2j2qk2q9J6N0j92j98
4577c45L15L11k73j29Q5J46j02J14j01r9K40j88J23L9m41J50L57k80J27J14l13
$$ y = [-168, -57, 116, -75, 59, -147, 25, 140, -2, 89, -107, -254, -81, 49, -1, -69, 114, -53, 13, -87, -231, 124, -138, -3, 246, -32, -60, -26, -205, 164, -44, -62, 62, -167, -118, 117, 55, -10, 129, -52, 30, -32, -11, 25, -203, -18, -191, 76, 15, 56, -64, -122, 105, -44, 17, 77, 68, 153, 154, 158, 10, 52, 26, 141, 8, 234, -67, -11, -49, -67, -160, 126, -83, 181, 53, -190, -79, 88, 0, 84, 164, -112, 126, 199, -102, -41, 284, -229, 85, -80, -200, -45, -9, 187, -81, -8, 52, 95, 45, 112, 168, -129, -3, 48, 91, 172, -41, 87, 195, -192, 21, -206, -5, -61, 54, -98, 51, 192, 133, 101, -86, -57, -121, -130, -30, 62, -54, 63, 22, -110, 168, -128, 39, 40, 53, -105, 44, -155, 56, 105, -27, 43, 112, -138, 145, 139, -81, 237, -200, -184, -30, 17, -40, -122, -62, 11, 164, 28, 110, 98, 90, 68, -21, -5, 45, -147, -345, -30, 281, 8, -121, -36, 110, 8, 122, 21, -78, 162, -26, 97, 136, -305, -155, 202, -78, 49, 163, -150]
4598a50L71r9j63j40R6O6J13J93k34p0j3j13J67k18K37l8j26K03n5M8R5k38NJ22
4622E9R1j33N4k15L5J56k70J71J1J11n4J8k86L86lk15L1qL7J1j20L7P3j72K25
4647C0mj90K75k12o1Q9J04j52J78l35K64k19K00o7J42k20J70J72q8k09J65n0K29
4670B11j89J64j97J70jll46K90l31J53Lp3K34k16J44m8r8j6K64l63J44J2oJ51
4694E3M8j13j24O9pnj3R4N1k03K80p3r3j65K02j73K34j64K67j04m2J6p3K24j10
4719G6k1j11j87K46j06M3k0O8Oq4M8k2M7j12J43K85j96j45j18L34k25P3o6J58
4743A14m4J8l4P0J16m11K71j74J02Rp0K23k99L16j20MN2j36j0P9M7l2k27J29j40
4768a47K44l6j27N6L5l71M72j96K4N9R4k91N01j21Nj06k27J87L1l39J61J89j95
$$ y = [-150, 221, 122, -41, -181, -85, -19, 94, 287, 53, -17, -30, -143, 24, -194, 43, 5, -121, 82, 27, 75, 170, -68, -63, 59, 150, 17, 71, -144, -109, 47, -223, -52, -41, 70, 16, 34, -252, 134, 131, -84, -53, -61, -24, -13, -133, -96, -23, -195, 30, 26, -164, 111, -101, -162, -73, 31, -121, 57, -278, -14, -233, -33, -100, 42, -178, -8, 164, 76, -133, 32, -18, 211, 22, 186, -11, 159, 158, 155, -191, 99, -232, -79, -76, -149, 85, -131, 13, -35, -133, -149, 115, -248, -104, -92, -98, 53, 101, -12, -136, -67, -74, -79, -92, 2, 53, -150, 130, 57, -36, -201, 1, -172, 62, -102, 165, 61, 19, 35, -38, 186, 76, 55, -56, -243, 3, -103, -60, -80, -12, -6, -90, -42, -64, -17, -129, 14, 299, 103, -42, -160, 174, -51, 22, -44, 114, 70, 88, 54, 124, 240, -171, 100, -74, 28, 37, -33, 190, -109, 207, 87, 91, 143, 7, -3, 76, 123, 91, -136, -7, -147, 97, 61, -66, -10, 25, -346, 126, -70, -46, 13, 107, -184, 317, 196, 201, 95, -132, 55, 86, -253, -92, 97, -98]
4791i8J79J72j20k97K03k8Q3l4j92j5K58kk28J18Q1j41J2M1l4J23M8j63k19J72
4815h1oj3q4L26k84L9J58j46n3K88o1l55N23l59l4r7J70QO9k0P3j69K2K7m3K0
4841h2J72j67M1L8L4L6Rj80P0J25j00j6M0k55L34k9N3P3m46K35N8n2L6m3j93K60
4867E1o2J9j09n5K53pk25N7J99l9j92J80j33J12j16K66j53p9j04K34j57j42L49
4890A47l98K70j30J21J21p6r3J36k05K76k80M2K0n9kj6K05m3k0p1K02j31J2k70
4914b42L39j25j09J71K32k04K1k33K50oK0j65J19j89M3O8J70j36j21j34J64K45
4936A78j5k22J48M3l9j56K28l41K51j11j80J12R5k4j22J26j07J05J98k53K77m02
4958b11M2K5M08j66r7Rm6J36M4k92K37r3k4J2M6p7j59J88m3jL3P7r2r2R6K5O5
$$ y = [-98, 81, 253, 133, -164, 39, 11, 94, 60, -132, -147, 111, 109, -119, -1, 80, -61, -49, -8, -42, 81, 129, -34, -253, -81, -87, -100, -184, 142, -142, -103, 55, -91, -144, 144, 83, -272, 251, -108, -142, -239, -69, -61, 8, -12, 61, -108, -86, -59, -102, -82, 90, -77, -36, 2, 36, 72, 81, -99, -29, 96, -4, -20, 20, -235, 99, 70, 123, 196, -250, -15, 43, -9, 27, -16, -209, 51, -11, 8, -101, -156, 97, 90, -135, -78, 121, 82, -110, 70, -63, 49, -67, 199, 46, -33, -137, 97, -60, -202, 147, -251, 19, -111, 10, 131, 55, -38, 98, -107, 169, -111, -69, -49, -108, -110, -126, 79, 36, 16, -55, 147, 16, 28, -242, 97, -28, -137, 34, 266, 62, 83, -150, 100, 94, 114, -51, 68, -121, -78, -10, 160, 24, -97, -231, -67, 178, 163, -59, 89, 132, 93, -63, 165, -176, 75, -36, -216, -104, -9, -33, -155, -29, -136, -31, 167, -86, 191, -211, -169, -144, 264, 98, 1, 10, -36, 100, 144, -148, 89, -4, -28, -16, 30, -47, -206, -18, -61, -62, -29, 48, -44, -136, -40, -15, 50]
4985E0q4K35k16p2J76j84J34o5K7j0n3j86J35j36J81N5J40j22k9j73L75p9j28
5008b9J00o1P2j89rK43K9l10O8J03J4r2J67k49J90r4k4K74k46J00K13l16L9J7
5032A0O3k7j57L1P5J31j46j25J90k02Kq8J85K38k52j0K26j48P0l4j00O4K02j37
5056F1J22k57o5K10j27j22J49k40M83k68R3K27op8j27j72R5J78l41J77r9%K06
5079I9r4j79J90r7J71p7J4LN3k84L18j50k0J1L3KP0l4j01r8J76M6k0oj65K4P3
5106d2J94j09j4J2l7k38J32J16j1J19J7k82M24l45J55Ok44L19J2j69J26l88J84
5129f3QJ99j89k1K3O2LJ37n8l6l03M74j92n1M1j12J23k09J20Q9Q8j91N1j75J81
5154al1J9J15P2j52j28J27k50K56m9j4O2P4k8m2n1K2J23l30K64n8j53K34M9l51
$$ y = [50, -34, 201, -15, -87, 89, -95, 39, -26, 1, -9, -62, -248, -113, -249, -68, -13, 127, 5, -24, -197, 178, 99, -29, 71, 10, 82, -107, -116, 127, 156, -154, -86, 17, 31, -61, 106, -143, 47, -47, -71, 203, -43, 57, 270, -46, -7, 10, 73, 46, -111, -80, -5, 126, -20, -145, 45, -157, -155, -243, -58, 180, -72, -82, 144, -4, 66, 32, -68, -4, 198, 61, 183, -74, -139, 71, -56, -178, -29, -269, 214, -54, 39, 266, 260, 182, 55, -117, -22, 156, -185, -8, -107, -107, 99, 5, -174, 16, -81, 90, 13, 27, 30, 83, -201, 117, -33, -53, -42, -9, -7, 63, 29, -72, -170, 6, 52, 32, 26, -139, -115, -42, 152, 43, 29, 41, 4, -234, -102, 14, 3, 122, 139, -143, 281, -64, 91, 97, -147, 172, 184, 15, 141, -247, -63, -55, 144, -45, -66, -43, 19, 22, 159, 101, 65, -238, 236, 44, -7, 34, -78, 45, -164, -44, 45, 133, -58, -7, -182, -1, -32, -13, 102, 174, 22, -106, 21, -229, 27, -22, -36, 26, 100, 72, 30, -21, 1, 124, -206, 58, 0, -153, 81, 130, -221]
5179b21L30q7j8J4M5k44K69j11l2J50L4O5l65m4J86N5k03K75j50qK8r8N1K62q2
5204A01j85J80o3K93l53J26k89L33o6j50pJ01j90K44j47K7Q2k1m16M28j20N3P3
5227C4n3M0O2m39K84O7j42P9l3j38J81L13k18n6P0j36Q8j03l4M5k41L74o9q6K21
5252A10J77m41N9J64J3P7j41j46J58J72j64j82J52J11Q8j28J65l41q5L91j26j33
5274e0J03p9K20k3m48N0M14m34M40k95N4P2j30K54k22K30k19Kq5K30p3n8m1k8
5298a16L4O3k25L94m1j01kK9k12K26k61J68M5l43K08l4J50P4p1j44K92j63k1J44
5322I3n8J4j91R4J20J4k23J18j02P0K75k86J25k11L10J2r9MnO1j00j39L04j97
5346CM1J87m51K51j23J45L2k03Q8k0p9K92k01p4J61N8k53K61j05k8j55n8K44j36
$$ y = [-221, 109, 22, 4, 18, 63, -181, 88, -23, -55, 95, 129, 194, -171, -215, -29, 26, -177, 98, -52, -60, -32, -130, -79, 183, 101, -84, 96, 33, 326, -27, 99, -190, 143, 77, -73, -80, 21, -169, 75, -72, -45, 37, 16, -400, 28, -92, -39, 34, -19, 21, 83, -356, -72, -5, -147, -68, -101, -239, -58, 255, 37, -19, 51, -85, 3, -100, -134, -89, -330, 44, -25, -111, 110, 287, -154, -95, 69, 82, 159, 18, -128, 30, 202, 38, -144, 8, 119, 207, 79, 244, -97, -182, 209, 83, -50, 53, -26, 194, 171, -277, -227, 187, -247, 193, -102, -48, 24, -106, 148, -74, 156, -63, -61, -146, 84, 11, -47, -88, -116, -82, -19, -244, 150, 109, 8, 6, 35, -177, 49, -212, -44, 1, -342, -134, -168, -18, 56, -15, -159, 133, -30, -51, 93, 35, 49, -142, -48, 72, 86, -137, -19, -121, -51, 224, -62, 63, -148, 162, 174, 75, 79, 74, 135, 35, -104, 200, 3, 44, 231, -220, 31, -92, 53, 85, -118, -30, -50, -129, 163, -38, -112, 49, 107, -146, 115, 10, -18, -173, -231, 13, -123]
5370a23Q3J94k72L12l05j23K66q7K09J64k60q0j35L32l23L5O5R8J08o5j37J1m5
5393g8j5J64j30j71K90k89J57J33j42j49J73J15K4k11M29k50j8J37l80J75K34
5414A98Q2k47n9j33p2J14J89j88K33j45J2j39J85j5Rl2j16L33k81K25k29J20K4
5437F8q9KJ16j76J28j03k6M73o07K55J21r8k00k5J10L20m50J90q0M1j5o4Q7r8
5461a20K24j58K55l23O6o7J00L6p7L8N2j26J56N2j58K93k26J0k07N0J60o4qj15
5485a57K3j34j8J98M0r7J38K32l11M7j8L7M2p6J84l8j48q2J99o5J93j19J45j10
5509A05k60K46p1Lj01J61j14J02j97J48N7j53J74Q4l9m0J06m70J96J4l2K32l59
5532b08J34L14j40k08K04j33J01J68l09L9J18P8j46Ok25K91j16J3J1N5j28%JJ25
$$ y = [-123, -40, 154, -118, 194, -111, -234, 32, -55, 154, 318, 58, -22, -157, 175, -148, -113, -48, 50, 158, 93, -44, -33, -78, -93, 71, -59, -230, 60, -229, -72, 61, -81, -230, -57, 58, 82, -129, 300, 50, 32, 169, -211, -36, 198, 280, 33, -26, -159, -231, -117, 72, -116, 117, -28, -16, -155, 30, 15, 24, -8, -124, 209, -72, 153, -76, 44, 68, -21, -19, 97, -79, 49, -54, -80, 393, -214, 41, 162, 64, -136, -161, -51, 269, -181, 9, -71, -30, -45, -109, -22, -120, 104, -54, 201, -122, -56, -123, -23, 13, -64, -26, 26, -100, 56, 108, -50, 243, 17, 27, -180, -130, 30, -34, -42, -157, -134, -268, -286, -88, -48, -145, -7, 225, -86, -39, -57, -20, 22, -54, 130, 92, -56, -138, 61, -4, 189, 70, 215, 105, -155, 91, 20, 23, -78, 83, -31, 71, -126, 22, 79, -74, 100, 184, 145, 105, 211, -259, -63, -49, -81, 151, -208, -74, 240, 100, -108, 96, -37, 64, 232, -77, -38, 80, 158, 12, 18, -207, 84, -32, -19, -8, 47, -81, -81, -80, 45]
5556D5q6j94K20P3l77M12l00J55K34k17J83o2J4m8M1j25L8j51K48P7l63K88j41
5579c6K5k5M7O7j96L3K0J77j61p3J63P3n2P9j60R3l05K43K49j59j42J43p8O1m0
5604D6J36nj98J0J6n8j3r5J30K17L0j79Q2n1m14M06k09K32n9R8k26J88m1Q3o9
5629E7q0J62q5k9j01K18k55J28R9j64j5J00J4j79nR8o7j68K59j94K73M1qj33O3
5654B9N7k61L10j35M0j68J13k8M3p9J62l25K73J95l13J79j74k9L03l11J19R3l71
5677b78J94M1O6l2Pk04L50p4r1Kj49J49L2l3j6M7M5j87m9k89N09J75k03O9n3Q4
5703A12j23R7Q3k66J13m1J3n2k3J95l9N7m9l6n9P7k42K23j83J71L7l5J31j81M1
5728B1k5j28m4M45j61k49J51LM2Pj06j5J16k0k6r8o4J84RQ2P6k84J76j3k19J84
$$ y = [45, -41, -235, -15, 58, -319, 93, -207, -52, 182, -35, 148, 86, 100, 52, 93, -32, 6, -145, 103, 180, -183, 105, -36, -11, -36, 11, 78, -118, -85, -65, 112, -49, -122, 41, 114, 62, 141, -19, 74, -231, 12, 261, 102, -40, 103, 25, 86, 46, 182, 177, -21, -11, 5, -53, -66, -161, -31, 186, 216, 37, 119, 68, -346, 60, -149, 83, 24, 122, -104, 84, 43, 126, 57, -23, 139, 54, 25, -76, 142, -113, 15, 114, -50, -65, 35, 49, -130, -135, -37, -104, -272, -13, -207, 66, 107, 99, -34, 29, 86, -175, 135, 0, 40, -128, -15, -43, 0, -79, 83, -242, 31, 226, -87, 92, -82, -111, 192, -119, 0, 93, -278, -84, -43, 23, -9, -2, -206, 144, 70, -21, -19, -168, -19, 13, -20, -36, 11, 56, -131, -180, -469, 40, 215, 12, 81, 28, 112, -11, 86, 169, -97, 16, -25, -12, -64, -87, 108, 69, 126, 77, 41, -18, 59, -183, 40, -143, 28, 65, 30, 161, -20, 21, -4, -132, -176, 269, 108, -141, 10, 13, 55, 62, -44, -59, 57, 37, 11, -87, -151, 33, 42, 124, 200, -84, 92, 79, -140, 44]
5754D4j84J67j52J11j05P4Q1J5m8L3oj21J43N1j30n5K55j29j87J77j0O8j24j10
5778a42K20J98j30j74j80mL73k93o9K70Q8q5j96lQ5J31j75r6J22RJ21j11q4P1
5802e4k7P0J90k38M0J44k01P7lj17J33J8m6l4J53j49N3r0Q6M5ol19J58J59j33
5827i1K30p5J6j2M6N3j15p0L8o6N1J3o6J82k91K12o1J21J1k19O1J60K0j32o5J33
5853H4l7r6ko5J65n5J80l37J88p3M9Mk7R1J8l63J54J23O9j14L3J46k58M4L27j35
5879A13l17K09J4o8J20J76k30k4k45J85j19M34m58P6K02k18K65K4j35n6L03k52
5901aO9K6k01J80j16l7q3J12J49r2k0O2k0o9J83j76n2lJ78j07J90j67J1o9L0J06
5927H3o4m6O5n2j15J01o6J02j93L24p8k77K32L9k98J98J05Kn4K2j57J52l4P3k23
$$ y = [44, -140, 27, -125, -14, -119, -45, 36, 51, 3, 36, 30, -91, 52, 103, -27, -82, 173, 44, -143, 34, 24, 92, -32, -142, 78, 276, 146, -28, -208, -212, 161, -132, -201, 69, 157, 72, -124, -127, -42, 89, -86, -182, -60, -51, 70, -41, -125, -54, -81, -11, 179, -59, -19, 125, -76, 1, -2, -119, 14, 32, -14, -48, 105, -44, 9, -81, 5, 50, 44, -275, -117, 42, -91, 139, 64, 80, 68, 114, 167, 52, -18, 20, -46, 5, 18, -48, 134, -157, 55, -6, 115, 126, -93, -32, 128, 148, 16, -49, 84, 47, -49, -51, -116, 49, -6, 174, -163, 25, -48, 1, 5, -22, 69, 87, -276, -122, 1, 70, -44, -11, 135, -123, -79, 248, 113, -204, 5, 19, -49, 71, 247, 17, -7, -252, -67, -186, 248, -210, -134, 68, -150, 115, 139, 4, -52, 251, -1, 68, 94, -107, 73, -43, -80, -163, -51, 98, 6, -14, 48, 28, -41, 142, -34, -86, -89, 89, -18, 172, 5, 16, -53, -23, 83, 19, -27, 38, -14, -129, -28, -94, 8, -185, 139, 61, -216, 16, 55, -243, -45, 60, 62, 8, 30, -127, 25, -9, 64, -159]
5952a59M4%l3j40L43r2P5j23L1K18r6k6l3J14k01R1M4j95P2J29r7q4J84j63nk6
5978a28K0m8M06k33M3j63m7L84l07J11J8Rq6k1J75k23J80N7m59L53J46j94k8m1
6002g6J50Pk61J94j43K66k36J66j0m0L4O9Rk42J96k09QJ38J07r5O6n4j85P6j65
6027b30K98J4j02j20J88K04j38k38J14m8P6K4k00j63L05J71j16k32L8K83l01M8
6049a25l11M61N5q3K9r5K87m79K56K4J99k53L0r0K48o6j07Rn2J92j36J62n3j08
6073fOoj01O7l0J2K30j06L5M0r3m8J47r2lr1j30K33o6J69k07m4K86j09j1o0M9
6100G1L9k49M03J73k72j41M9j34K53j39M7p3o8J35K7j54J64L9l76K29pM7P8j77
6124c6K6K7kK09j87k8j02M8o5J02j80K82p6M3r6J32j38J4J55k26q7K53J47k92
$$ y = [-159, -115, -115, -148, -288, 55, -37, 38, -85, -54, 164, 68, 42, 9, 123, -78, 13, 57, -138, -66, 63, -34, -118, 66, -97, -102, -128, -108, -156, 250, 17, 60, -103, -150, 234, -73, 38, 56, 65, -21, -42, 133, -90, 90, 147, -312, 41, 187, -7, -35, -76, 74, 81, -180, 14, -129, 137, -99, 67, 57, 17, 51, 120, 129, -113, 83, -126, -118, 20, 127, 32, 98, 44, -141, -65, -230, 68, 82, -20, -140, 48, 252, 114, -124, -10, -58, 18, 42, -158, -321, -16, 155, 39, -193, -155, 128, -173, -125, -436, 25, 80, -3, 26, -69, 218, -261, -5, 19, 218, -35, -5, -95, 153, 87, -20, -11, -63, 129, -7, 155, 102, -6, 0, -6, -107, -40, -70, -58, 172, 66, 101, 141, 48, 0, 147, 55, 52, -39, -169, 64, -2, 167, -40, -84, 202, 93, 82, 22, 71, 110, -139, 264, 437, 165, 24, 73, -61, 192, 53, 100, 27, -41, 94, 121, -33, 131, 170, -206, 23, 16, 63, 141, -36, -10, 17, 15, 224, 37, 9, -93, -45, -110, -8, -188, 94, 18, 61, -35, 97, -41, -27, 128, -98, -185, 68, 215, -77]
6148g7k35M09j1J26j5l82J76J18j22j12K71j90P0n9j66L27J33l12J47o2Q1lJ50
6171B62k74jJ4p9K08r3l9j21J35p9O2m0oM3l00M91k69J09r8J78m7N2j49P3J3j8
6197B7r4o0J22j82K43k7Q3KJ9m07K60p0K75k93K10p5M0J10j25P2jr4j58K43j34
6222a4j30J13o2j37L84j65M6l53K32J23r9R8O5q6J36j48q5K57q9MJ06l03R1N6
6246D0J23m32K84j96K31j25J9J28j60K1J0m5K04K1j80J7J24J39l53K07O1Qn8j90
6270a02K45k02J01RL3j18O6M1p6r7J52J01l57J90o0Qp1P4K1K19l21N1J23l8r6
6295a04m0P3n6R0o6J0m2J46J8L8l05L34k39K19J07j01j10L8L7j15J53k73J53J19
6319H4J54j27jm3J37l22M1J40j78K20k15R8K06j82oP9NJ24j50j79N8J4L5K35m53
$$ y = [-77, -312, 97, 86, 212, 197, -185, -9, 109, -13, -125, 146, -44, 26, -33, -199, 128, 261, -51, 96, 34, 115, 112, 262, -12, -13, 1, -78, 130, 37, -2, -123, 12, -67, -5, -45, -51, -8, -308, 183, -86, 23, -75, 103, 56, 108, -41, 32, 45, 27, -67, -127, -5, -187, 56, 29, 112, 114, 133, -274, -14, -84, 191, -102, 108, 33, 73, 183, 58, 130, 129, 35, -123, 120, -14, -144, -31, -93, -230, 154, -11, 35, -318, -86, 37, -62, 36, 101, 15, 151, 3, -82, 175, 86, 90, 196, -107, -16, 40, 163, -269, 15, -181, 50, -75, -56, 72, -88, -67, -57, -102, 102, 123, -57, -40, 84, 223, -130, 77, 138, 146, 88, -102, 143, -59, 42, 51, 84, -34, 32, 73, -3, -100, 52, 153, -204, -14, -74, -66, -137, -63, -42, 177, -144, -93, 30, -8, -104, -144, -71, -127, -37, -103, -93, -135, 11, 29, 67, -238, 96, -143, 76, 183, 82, -28, 10, 47, -68, 85, -188, -35, 84, 238, 111, 110, 67, 204, -118, -77, 63, -115, 105, -110, -12, 194, 12, 6, 85, 90, 214, 64, -115, -57, -43, -8, 227, -226]
6344b26K47J39J9k90mj20J43L0p9N5K24p7m1j00J2J69N0J15k49j3o0J48r9m7j
6369e5J76k04j6K28M6j92P6L2q5l5r3R0J31m5j03r6J51P9j09j9k1R7lK30j39j27
6395fK6Q1k16J4R6j31L31l31J57L1n4R2j14j28K36O6k37l2L10k54J03l04M44j72
6419HO6r5J68k66M8K08n0q6o2K00rj79JJ50l4J5k3j28j66K58J02k05K5K89k37
6444bJ13l10K44J32j63l8j64K33k65L28l0Q8j67Q7L8j62Q8M1k9p2O1M4k87J48
6468d4J69o7O1Mm1m1n9J6J60k77m5J67o0J36r3j15L05j61J40Oj55n6j98K76r0
6493f2K99l61J17j51K38n8J15K04m23L94l91J50RJ3R7l53K03O7k71J71j07L04
6515B04k52K41l42K35j8r0k39J92M3Q3o2oq1L0J51J88k52j1Q1j03K79j60j67Q5
$$ y = [-226, 21, 160, 179, -111, -115, -235, -92, -62, -141, -86, 138, 61, 20, -80, -68, 101, 151, 266, 17, 4, -56, 92, -7, -54, -55, 121, -83, -99, 129, 175, -17, 59, 91, 6, -29, -122, -32, 99, 54, -49, -145, 6, 85, -24, -43, -64, 33, 30, 260, 121, -6, 20, 101, -115, -101, -5, -136, 195, -136, 21, 52, -2, 90, -24, -152, 84, 150, -87, -119, 191, -63, 40, -264, 180, 8, 74, -21, 147, -119, -71, 137, 87, 1, -61, 139, 130, -49, -48, 102, 68, 83, 60, -68, -234, 24, 126, -79, -54, 235, -2, 111, -199, 45, 177, 14, -24, -188, 45, -220, 108, 78, 166, -1, 86, 124, -38, 50, 91, 62, -10, 51, 95, -192, -44, 125, 58, 119, 123, 82, 41, -18, -2, 158, -119, -164, 3, -57, 79, -14, -129, 176, 15, 155, 161, 6, -50, -248, 28, -62, 237, -124, -7, -158, 80, 22, 137, 341, -82, 312, -79, 71, 80, 93, 190, -163, 40, 107, -164, 7, -100, 204, -48, 193, -149, 86, 68, -22, -261, -69, -26, 57, -5, -11, -92, -62, 89, 277, 25, 14, 95, -8, 271, 111, -56, 29]
6539B9O0q1Q5j67K96l4o5j79k0J12J02n8J2j15P8j95j9J35J6o4M8L1j50J45O6
6564F8p6kq8j8J85n6M9j36M4K3r7J66M9J87l56k0O5n1j68M73r6k20K48k18j10
6589a55J77p3N2J32j81K55j77j1l79M81j79K28k31o7K38k28K92k11P8j87J15M8
6611A7J08k61J88J8j35Qq1J08m1O9OM0nn0K8N8R7j30J55l36J40r1k6j44K65R2
6637I7k08R0J93k12J1J66j75R6n9P5j20j4J47k21K37p3k91L17M8o7MP0m6j4J8
6662F9p8P9j10K00k8j60M9N9%m1k35K24l0j6j09L09j69N8K3M4l1P7k08j0O1p1
6688d4M8n3j0Q4K6p9n4K1O8k51J23K3J03q2J38J56l31J56j62q1K78l05J84J8o8
6713i4Nk3L28j07k90J80J48l37J55K6jo0q0K18O2R0j28l4j93J20R0k47K83j29
$$ y = [29, 89, 8, 93, -74, 222, 188, 123, -56, -76, 36, 138, 80, 92, -23, 55, -140, -159, -24, -8, -72, -24, 7, -143, 2, 68, -8, -10, -98, -116, 69, 13, 62, -74, -30, -7, -104, 62, 111, 298, -58, -78, -13, -64, -232, 241, 145, -75, 173, -45, -155, 22, -51, 1, 133, -48, 207, 30, 19, -360, 121, -58, 170, -61, -128, 110, -118, 174, -37, 41, -146, -31, 17, 125, -136, 52, 70, -65, -57, -138, -30, -71, -2, 4, 44, 39, -11, 17, 75, 172, 42, 197, -139, 1, -90, -116, -260, 5, 97, -111, -21, 172, -40, -29, 137, -38, 58, -1, 74, -46, -60, 87, -134, 103, 30, -261, 56, 104, 37, 41, 111, 65, 51, 69, -9, 70, -40, 160, 132, -28, 21, 80, 80, 39, -196, 28, -2, -18, -127, 182, 13, 71, 94, 138, 107, 184, -24, -34, 27, -44, 4, -49, -59, 25, 51, -28, -82, -61, 7, -244, -121, -98, 5, -77, 61, 217, -114, 42, -120, -201, 77, -228, -44, -26, -94, -89, -112, 216, 109, -181, -1, 147, -190, -35, -9, -10, -70, -150, 68, 130, 220, 92, 58, -135, -15, 75, -172, 111, -18]
6737a8m9Q2K0JN7j50L1K71k31J70q2j8L3r4J38j68M2L3R1l82M76j22j37K6R6k14
6763i8K99k49K31l22R6o0q0K05K3j9n7m1J54o1j00MO9q1o1Q5j08J86n5J2j20K75
6789A27J32k05J8j72K32p3k5K33l26J37q0J3Q1M2k66J52p0K6K60j65m3j35J20
6812A3l9o5m2N2j37L36mP6j75K4N4k96J99q1J50j39j80L75j62j11J47L7P6p4j90
6837a56J00J02p4L2p6nnK76j51J28m7j74P7J12j99K53j95O9J16k21n9J39L6m9
6861B9j27J29J74j86K2k75M39k29j99L69m11J14J39K31k60m3P0J33q4J08j1k58
6883a26L24k95J35p4r1m1K77Lj03K9j92L67l10m5j30J28K86j41Q7j27m0O5O4M8
6907I8J3o0m01L79J33l01J22O3J22k72L2J35j06j54N8PR7R1J68o3j08P2j54m1
$$ y = [-18, -67, 15, 35, 36, 93, -57, -26, 245, 14, 184, 102, 84, 117, 23, 161, -7, 35, 68, 159, -223, 253, 131, -6, 20, 116, -98, 201, -48, 183, -139, -43, -103, -183, 22, 45, 26, -31, -72, 82, 21, -79, -75, -6, -87, -148, -63, -171, 15, -40, -28, -148, 127, 259, 54, 72, -100, 132, 59, 34, 267, -59, 78, -2, 11, 92, 134, -132, 20, -50, -24, 236, 71, 28, -107, 13, -26, -91, -133, -81, -218, 118, 114, 190, 15, 39, 93, -203, -4, -85, 65, -74, -254, 121, -41, -152, -5, 32, 108, 34, -156, -56, 46, -28, 4, -72, -77, -82, 194, 43, 171, 124, -50, 27, 139, -60, 193, -2, 67, 183, -38, -97, 42, 78, 29, -98, 31, 205, 19, 41, -234, 205, -24, -223, 146, -265, -151, -12, 219, -41, -84, -14, 119, 35, 143, 132, -126, 198, -97, 38, -36, -127, -168, 109, 112, 9, 38, -154, 213, -97, -142, -272, -144, 142, 1, 88, -39, -79, -14, 50, 98, 111, 51, -350, 29, 162, -139, -17, 46, 168, -104, -72, 63, -43, -197, -139, -132, -35, 56, 224, 161, 53, 125, -29, -70]
6931g0J76j73J47Q9j7j05Nj38k0J68k33L08m78K50Q1L8o1lJ64J28j00k14K2P1
6955C5o4M6j87L16q6j98M4K01M4l8j94q0J39M4k7JO3r8J02p4K46l16Q2J01j78
6980g6R6k07J3K42R4j6mJ5Jm6j65N6l3o5Nj09J10J42J2j22O9M8J8Jj47o0l0K42
7008H4P9l02j2L11J91m37K03k38j13K07j7l8K29k86p5J64q5K93M7j00j6J5j53
7031d9J78k78J44M2j08K4N2p8J54K29k12j48N6KJ9l8K00j11J08k55J56j5j96K7
7055i7M6l6Q2j48J02oj13K16j44Q7k59R9n5K26o1m7J81M4M3k56K59k17oN4j42
7080a48L57O4j75J53l33J99j59Q8Jj12p8K02k03J89r6m9P4l7j53J36O6j37K3P8
7104e0N6j39J40j94J95J95m44L35r3K5n0J39nj89L35m48O2kL8J9P7J1L5j7l6j44
$$ y = [-70, 106, -67, 80, 169, 152, 47, 52, -86, -106, 62, -171, 137, -341, -91, -10, 28, -33, -36, 128, 256, 156, -58, -36, 35, -29, 17, -170, 146, 60, -138, -94, 107, 151, 113, -81, -161, -22, 22, -5, -4, 59, -39, 63, -11, 235, -81, 1, 102, -76, 20, -187, -174, 68, 162, 146, 142, 157, 158, 112, -53, 3, -30, -95, -90, -199, -89, 53, 65, -57, 12, 60, 78, 79, -68, -128, -158, 84, 163, -139, -151, 160, 351, -86, 117, -121, -234, -27, -44, -82, 147, -139, -214, -50, -135, 158, 205, 105, 89, 104, -49, 129, -149, -5, 37, -71, -47, 5, -73, 81, 310, 98, -50, 6, 8, 27, -11, 189, 78, 186, -69, 87, 72, -124, -97, -51, -87, -5, -153, -51, -57, -170, 46, -98, -11, -270, -171, -226, 0, -61, -108, 73, 117, 160, -96, 163, -54, -60, -6, -148, 209, 273, 98, 251, -82, 117, -42, 46, 47, -65, -143, 59, -144, 45, -51, -100, -26, -63, -216, -80, -14, -151, -128, -50, 6, -133, 7, -187, 8, 203, -241, 94, 1, 26, -24, 115, 110, -79, 256, -192, -130, -132, -94, -75, 2, 13, 48, 31, -5, -149]
7130a49n0L60m8j5q5O1j80KJ08J54ok59j48J40J83Q6j04N9l27J10k4K15Qj11j06
7155a26J5K43j76J4l8Q4k68K67j03j94J47J06J35k49K92k03J44j76J60j25L47
7176B96k49q3J65k37R6q6N7R4l7j04r7J20J66j34K10j14N3j26J66j36j14J37O5
7199A08j34K44l12N1q6K31j84L4M7k8N0Jm4L28j99k58K08K0j87J69j58J31R3j
7223A24j47n4Q6RP4kp8J41k4l4n4J12j51m6j20L3J14J39l52L11r2J37k4j24L0
7248Hq2mM7m7pK05l90L39j28P6Oo2J65q6R3j3j12p6K44l00K06j44m1J13n7PJ32
7275I2j6p3J22r3K6M6j30Q6j2O6j5j50n4L90k87J74j83J00k94J60k48K53K4P9
7299F3o0l0j28K47O1j60P3p0O9j07j3K21n1j37q8M9O3j48k6N5J58P9j33k7L9m
$$ y = [-149, -199, 161, 113, 98, 13, 74, -106, -104, 4, 158, 152, -107, -255, -115, 68, 154, 50, 109, -218, -108, -132, 83, 91, -20, -126, -111, 132, -44, -30, -68, 16, -252, 15, -88, -282, -135, -29, 106, -143, 149, -54, 90, -86, 74, -51, 296, 47, -36, 129, -108, -12, -98, -41, 53, 16, -88, -185, -65, 101, -33, 177, 63, 116, -10, 156, 20, -94, 43, 108, -26, 218, -94, -43, -129, 102, -82, -48, -1, -29, 21, 22, -22, 306, 107, -151, 57, 77, -110, 59, -99, 32, 125, 124, -23, -77, 9, 18, 92, 90, 12, 153, 129, 95, 41, 153, 2, -44, -164, -131, -17, 122, -230, 81, -11, 126, 102, -22, 8, -74, -78, -31, -78, -85, 120, -270, 69, -59, 17, 23, -39, 126, 40, 133, 120, 8, -68, 176, -124, 82, -62, -103, 10, -47, -40, 92, 76, 3, 125, 32, 58, 104, -26, 60, 48, 114, 99, -51, -105, 285, -2, 172, -11, 89, -205, -45, -293, -40, -16, 63, 3, -27, -155, 92, 153, -7, 66, -4, 65, -42, -55, 166, 115, -22, -110, -61, 2, -146, -172, -117, 41, 120, -13, -40, -1, -5]
7325eQ9o5j20l0L25k37O1J18j16j13R4j13K40n5j42L17j25j90K95j32q3J35k45
7348i7N9n8l0J12qJ69j55R1p2P4j99J76Q8j41j40J01j17K12j0J02p7m2l46K87
7372b1J1O5J29j42jq0J08j37N8j37j62K00N6L4J02j24J36j09l2J79k02O3j3J56
7396A37k42K0Jj0K50k5j7j58K69j62j08J30j99j9J16r0M9j7J01j25M5J82r7j65
7420a34N9K43j19q5M7j6j86N5J59Q8o7M5k8j19L1j11K12p1M1jk13N7L48j90j37
7445i2M7k75M13q6q4L4P1j05j37L70l02K27l2p4J49p6p5L9K9K6j40J07j32n0J12
7470c6k97L25J20k16L53j72J4j30J10j36R1mJ2k17J54J03m3K71o27M56M5j19j25
7493f8K27k43mJ63o4j16N0j54J58N1O0j00Q4j5p9N5K27o3k3j58o3n3O9J03O8k6
$$ y = [-5, 84, 19, -101, -131, 194, -43, 18, 136, 20, -93, 1, -112, 128, 73, -69, 248, 123, -67, 228, 96, 13, 148, -97, -38, -96, -126, -14, -22, 147, -8, 83, 11, 85, -114, 62, 150, 9, -131, -30, -147, 65, 55, 157, 80, 38, -308, -21, -10, 55, 184, 42, 41, -39, 69, -68, -10, -147, -309, -109, -53, -19, 83, -41, 95, -14, -46, 133, -69, -6, -19, 137, -105, -85, -84, -94, 156, 131, 114, -44, 225, 63, -45, 85, -114, -133, -17, -107, -58, -75, 26, -99, -54, 128, 31, -134, -75, 168, 49, -36, 11, -5, -191, -136, 23, 111, 44, 89, 61, -58, -27, -138, 74, 3, 44, 43, -170, -113, 235, 45, -92, -45, -320, 93, 7, -77, -43, 28, -77, -214, 156, -146, 81, 49, -25, 124, 48, -27, 12, 41, 67, -73, 34, -98, -148, -36, -333, -8, 112, -104, 249, 77, 91, -39, 71, -65, 26, 22, 34, -183, -29, 74, 31, 302, -325, 131, 176, 57, -68, 159, -84, -88, 75, 11, -105, -55, -209, -51, 0, 60, -40, 44, 29, -50, 5, 232, 169, 146, -12, -75, -128, -59, 44, 112, 86]
7519H6n1O1Pn6j47J29j32J52l6p9n6K30k11J92l25J36K27j41L5j15J93J34O1k27
7543F7l3j01R2K07l27J05P7j76J36j12J39k07K47p3m4o1J37n0k80K52K2j56K23
7566H4r0J22J20k94Oj37JK75p0n3J25j6j33K85m63L69m7q0o0P0J66k39J62j12
7590ip9l1Q2R7K83m59K89j8j71k8J67j11j21K30k52J06J30j8q3M6j06J48K3l54
7614b39J15L31j25m1J51k81j20J74L46j77l22K70J8j82K4K76j95K5j01R2j3j04
7636g8o8J85o7L3n2r0J96m4j22q9L26k6j29N8nJ45q0q4j25qO3J4l7J49J00j87
7662b2k5j25L6NJ44J0j06J36k2l3n6J70k3j34P6j5j8Q1k65M17l78K35%p3j10p0
7688a65J96J24J01j74j76J47O1k30m3L1J24n4j35J63K9R8j66J65J66j58j15oJ26
$$ y = [86, 35, 96, 103, 47, -100, 29, -103, 49, 13, -66, -122, 108, -103, 89, -236, -100, 127, -14, 21, -94, 99, 233, 294, 67, 34, -67, 25, 232, -95, 10, 87, -89, 47, -65, 74, -133, 114, 41, -3, -64, 73, 23, -257, -5, 17, -139, 84, -6, 116, 236, -58, -52, -189, -188, 87, 17, -36, 89, 73, -60, 225, -238, 131, 84, 4, -56, 14, 180, -59, 103, -9, -88, -119, -37, 60, 343, -116, 173, 155, -16, -44, 123, 12, -109, 121, -131, -25, 105, 87, 4, 50, -56, 92, 115, -239, -124, 207, 82, 41, 192, -89, -209, -35, 311, 134, -188, 82, 100, -82, -58, 218, 23, 48, -53, 39, 26, -78, -146, 39, -28, 5, -47, -137, 59, 15, -107, -196, 130, 104, -25, 33, 28, 173, 93, 9, -116, -124, -61, -47, -84, 65, 165, -22, -47, -172, -136, -131, 13, 23, -83, 53, 31, -2, -58, 112, 89, -45, 31, 16, -2, 79, -186, 231, -147, 88, 88, 15, -95, -165, 31, 155, 256, 82, -94, 53, 114, -116, -159, -128, -4, -58, -193, -30, -1, 97, -69, 96, 262, 104, -11, -17, 109]
7711A09j50J71o2J57k90K7k2j5K3J29J19k66r5J23J27j28J54j04k2j17L01j66
7733CK0J22l1k21L22l67j5L12l98K01L5Q3j89P6O4j9J0K1n0q4M2L31l69K72j05
7758F6mK0n8k7p9J03j00J96j9k36R5R9nl6j5k3j36K03j56K0J06j21L22j70ll0
7784A2J07j54L20k77q4J04N3O0k41l5J5K41n1J2M1j55j91k7K54R6p1j21N6Q1j20
7809g5L8M4k4PJ07k30L70r6l06J31J79j78J2J01m4O2o2J23j52J6O5Qk2o5j24K51
7835A36k24o1J01J42m1R8j25j31J99k06N5J1J56R0k03J24j72Qp9J82j49j53K03
7858c9P1j38J15o3N7J65n1n2k22K50j19J9P4j08Q4j7J29m2M3k70NK14j53J36j2
7883G6j10p9R9j02J94o7R2K2l02J53j38K01j02R8k45K35l0J21M1k59J44k2j1J24
$$ y = [109, -41, 130, 68, 225, -65, -38, -60, -75, -52, 77, 196, -70, -165, -42, 85, -43, 111, 7, -15, -132, 169, 3, 23, 145, 114, -107, 215, -152, -167, 145, -253, -52, -17, 66, -123, -47, 17, -2, 8, 29, -21, -105, -63, 268, -101, 171, 66, 62, 82, 24, -3, -82, 21, -79, 117, 98, -138, -43, 56, 51, 15, 0, -23, -159, 44, -112, -92, 14, -107, 215, 45, 42, 12, 119, -35, 285, 8, -76, 28, 81, 141, -100, -135, -120, 121, 70, 82, 123, -32, -223, -250, 4, 100, 29, -92, -36, 45, -75, -37, 7, -17, -10, 97, -133, 237, 141, -165, -34, 145, -33, -21, 80, 36, 98, 36, 159, 7, 23, 88, 96, 74, 9, -115, 136, -88, -149, -48, 94, 53, 151, 26, -105, 94, -112, -57, -46, 110, 200, -3, 121, -51, -43, -122, 60, -89, -242, -39, 32, -106, 9, -54, 3, 168, 117, 65, -157, 93, -26, -7, 67, -41, 43, 26, 155, 113, 156, -114, -109, 105, -48, 88, 76, -34, -113, -14, -116, 78, 11, 103, 125, -177, -24, -162, 39, -63, 35, -210, 25, -5, 116, 157, -102, 42, 20, 9, 133]
7907A33j49M5P1p3j61K97j8j68o4J1R1j4J3o3p8K47j31om50N34j88j28P3O9R6
7932a1J46k39J21K13j34j83J28M2j72J57M6kk15k5K56n9j81J94j42K22k87J69
7954D4O9j44p2R6ML7O7k67P6n1J22k27K99q9J91jk68N9L31k15Qj03Qj26J56l2
7980b8p3RP3K06k28o4M0L0n1k3J96n0j93K48k18M9J94J04j47r0M9Q6j76K63j33
8005G3k60L40n2L5j33J73j74J14j99K44j63J19l47K12P5k8K6Q3r4j30J44p9Q7
8028F6k73N8Q6J80N0l58L06k68J93k22K17r0k0K0J6R5l02K05Q4j13qk26J64O1
8052g9p6R4l0j9R9n2J80m6k14j4R5L7k81M10l4K6ql20K77k5j32K02j4J88k66j16
8078a18J08O1j35k9r2K06j38k2R3o8K65q1L8j2n8K9k48R1PK8O8j26Q8J35o6O4
$$ y = [133, -16, 29, 100, 27, -134, 163, 145, -23, -87, -76, 15, 1, 14, -49, -127, 120, -11, -17, -467, 67, -121, -249, -176, -107, -11, 135, -104, 17, 230, 96, -87, 41, 83, -89, 68, 114, 112, -103, -128, 128, 69, -112, 82, -60, 162, -125, 44, 113, -31, -103, -7, -3, 34, 101, -166, -90, -141, -19, -246, 53, -36, 155, 154, -114, -55, 276, 61, 69, -34, -26, -152, 4, -28, -101, -92, -19, 187, -41, -105, -65, -35, -86, -109, 87, 37, -156, 92, -126, -77, 117, 221, 74, -16, 33, 119, -57, 206, 73, -187, 153, 101, 136, 3, 176, 2, 116, -83, 161, -2, 117, -230, -18, 57, 29, 55, 138, 44, -86, 58, -21, 66, -207, -149, -63, 117, 167, -191, 115, -153, 40, -182, 35, -55, -75, -55, -39, 56, -246, -41, 43, -70, -78, -304, -140, -79, -155, -61, -91, -110, -11, -63, 117, 71, -143, -157, -62, -25, -306, 104, 70, 96, 88, -232, 45, 20, -112, 90, 76, 264, -2, -118, -10, 51, -84, -113, -205, 1, -137, -159, -66, -134, 131, 50, 88, 76, 18, 47, -201, -110, -103, -75, -7, -133, -45, 90, 24, 88]
8104H8k71J82O1j11L6k1K7Q4n0L6q9K8m3N7L25l12M4p9K1j87K59j02P5j73L99
8129B84k72j57kK79q8k66L02J0j23m9J54M9j19j31K59j10j68K16r8R3N3j72J59
8152A03On9J13j6l62K18R3m8m7n0n5K48J1j10J0p7P1o6K63j36O8j34k22K98mj27
8178a1J16k32J72K4l52L44j16K5o1P0n4J2k7
$$ y = [88, -183, -1, 60, -51, -15, -36, -9, 75, 25, 61, -28, 0, -43, 14, 339, 27, 71, -8, 13, -174, 85, -17, 58, -115, 284, 12, -145, -147, 132, 44, -222, 80, 90, -33, -82, 72, 121, 2, -129, 130, 20, -148, 68, -30, 63, 116, -56, 103, 109, 50, 163, 147, -215, 3, 96, 48, 1, -49, -104, 144, 155, 45, 55, -22, 49, -17, 246, 110, 178, 44, -178, 120, 116, -11, 105, -127, 45, 69, -283, 61, -55, -30, -91, -21, -75, -63, -90]
8191i0
$$ Imaginary data points
##PAGE= N=2
##DATA TABLE= (X++(I..I)), XYDATA
0@%%%%%%%%%%%%Qj6J6j6J6k4L2l6M4n6O4p2Q8j04J20j37J60j84K10k42K74l11
34a66L51l94M44m98N58o22O94p75Q59r52J055j165J286j420J565j724J899k090
52a095K302k541K806l103L440l825M270m790N408o158P088q279R872j2118J5542
67H819k1469L4596j18603O5138J82486j42893q5360L5016J08135j0832p0493n331
79b0791J2744l0314O2302K8627o2147l5467L3905O3176J2413r9537k2682P0362
91A2591R105l0671j6766p317L2631J0381M604J4832m7605j7166P2361J908n7744
104a8856j1004K8409L1729j9609k9934L2468k476k8380L3369P18m5737m37K4786
117d954K0224j6573l1857M0168L1939m2477r139K8370K550k0026k5060K8125L8961
$$ y = [0, 0, 0, 0, 0, 0, 0, 0, 0, 0, 0, 0, 0, 8, -8, 8, -8, 8, -16, 16, -20, 24, -32, 32, -40, 48, -56, 64, -73, 87, -97, 113, -129, 145, -166, 185, -209, 235, -263, 295, -327, 367, -408, 451, -501, 554, -611, 675, -745, 820, -904, 995, -1095, 1207, -1334, 1472, -1631, 1809, -2016, 2254, -2536, 2872, -3286, 3802, -4477, 5395, -6723, 8819, -12650, 21946, -96657, -31519, 150967, 8074, -77286, -42270, 65865, 55033, -15460, -20791, -8047, -38361, 23941, 52568, -9579, -45046, -11141, 52035, 64448, -35089, -57771, 12591, 21696, -8975, -25741, -33058, -427, 9954, 14558, 29390, -18215, -35381, 36980, 38888, -18856, -29860, -1451, 30278, 10669, -19265, 13203, 10727, -17653, 15716, 16434, -29303, -29740, -4954, 15270, -1303, -33160, 7008, 38947, -3530, -12669, 15701, 18251, -1775, -26835, 1290, 40251]
130D0251m5983k8568M7302J7445k9218k5686R704L2417j8290k9050K6324P543
142D191j5230J4342P665l582k634l417J2471o452k2485J5433J1242j7306k79P467
156A426N540k306j7718P261J5609j7417q167J1703K810j193j611R860J1574j4883
170B488n733J7489m790j5392j231N603O477n006m758N689n178k609J3692k468
184D273j7002m362J5245J6863j3823k1379J7230K5796m491j9949p972J5336Q333
197A4098j3534p474q9K40Q772L151p267o016K56J2357L369j6634l164J0050N612
212C727L008n146j867P034r05K337K195j4442n104J0053L158m643j2120J682K0176
227I143l424j3758L913J876K891K347p433K951L490j876J0020l190r744R040O65
$$ y = [40251, -5732, -34300, 13002, 30447, 1229, -24457, -14753, 17664, -626, -29676, -3352, 4191, -11039, 3303, 10968, 7386, 4752, 1335, 13806, 7354, -15131, 302, 11544, -5762, -6041, 1426, 6966, 4660, -13058, -5797, 9812, -7605, -15772, -4069, -1259, -2452, -4063, 5797, 17371, 2488, -3245, 14244, 9454, -5938, -7169, -1566, 4911, -95, -4853, 836, -4342, -6951, 6741, 4273, -12729, -17091, -1846, 15017, 1194, -20185, -2955, 22841, 18350, -1599, -9571, 5765, 14098, 564, -6910, -6999, -6759, 2013, 5164, -2103, -8119, -7863, 4494, 7863, -8771, -11935, -1885, 3727, 6735, 1589, -278, 6756, 5851, 8188, 10383, -4059, -9163, 890, 4048, -595, -12715, -11033, 9143, 5719, -8039, -4126, -2250, 641, 2988, -4445, -1494, 1996, 120, 10140, 6950, -2794, 6246, 6911]
242F911n219l52r331M198O304j2136M284Q337o947K804j64N6P578j1052j540J5840
258I571p834m242P756l312M542j16r063O952m445p396J0278p808n881J1880l340
273b458M50L617q375R850M151j2887O926K246m710P648o481J16J0689j1924J33
288a009Q958j2753N33L853o905O466l123m891J3400n678l789J2598q118j080Q295
303F757q223L765K059q713J1115q74j0586R249l983m327O863j0793J525R078j1511
318h599M525P727q812P622J415n705Q984o547l210J1089r243j177R270r483K623
333D79L922r070N977j701p712R253m182n119R920n012J743P575r086N025O205
348H217r790M762O59o237P158l735l792P204p477M21P055j0465J935N230p572
$$ y = [6911, 1692, 1340, -7991, -3793, 2511, -9625, -5341, 2996, -3951, -1147, -1311, -1255, 6323, -4729, -6269, 9571, 1737, -2505, 5251, 1939, 6481, 6365, -2698, 4254, -191, -7587, 2691, -5117, -10998, 882, -2458, -2008, 1609, -6766, 3084, 7235, -5652, 1274, 3520, -1190, 6458, -23, 93, 10782, -1142, -1009, 7949, -4804, -4271, -418, -7323, -857, -3980, -8871, 4529, -1149, -4938, 7660, -458, -1538, 6757, -1466, 2299, 4358, -4355, 6760, 5886, -4700, 4549, 566, -3761, 3102, -7691, -6166, 2912, -8599, -4074, 3653, -5159, 2463, 3878, -1827, 7157, 610, -2600, 8489, -754, -1931, 7339, -2144, 479, 4401, -4669, 1308, -393, -8105, 1148, -3034, -8153, 1767, -3245, -1502, 6073, -3013, 2012, 8217, -1573, 3189, 3848, -2389, 4769, 1034, -2758, 4446, -3031, -2610, 4445, -6020, -4085, 1145, -6427]
363f427M884Q85m238Q682k337k813Q236n552m59N632p380K117L144q472M575J603
379B080n922N023k748k777N153n020L84N111o355L931N471n610L895J189l359
394D46M748k380k874L276m511M36L913o495R73K578l788L556n06m637M389N8q38
411a656L067k816J866M187l083K021J28m543L497L37m444O79j059K20J671l837
427c765J417K047k584J520M51j053K791r61j066M395l9k86n00j525K627r36l629
444a096R39r71r83K127j701j433L03R8L138J06l259J469P26K098K951m727j479
461a694N191J285o96l763k938M749l78l420M36l263J063M409k730o35K70j271
477c385N533J028m994R61L26L374L811p141n22N783k762q21j438l285L822j573
$$ y = [-6427, -1543, -658, -4896, 3786, 1449, -1364, 6872, 1320, 861, 6493, -887, 1230, 4374, -4098, 477, 2080, -3842, 1181, -1567, -4344, 809, -4211, -3827, 1284, -5071, -1140, 4331, -1279, 2616, 3805, 446, 5194, 2814, -60, 3216, -1295, -859, 3054, -3441, -2468, 110, -3678, -122, -628, -5265, -876, -818, -1656, 1411, -1405, 461, 4648, 1565, 3586, 3714, -829, 2668, 3005, -1439, -760, -1819, -1599, 72, -3765, -2348, -301, -2885, -1365, -914, -1967, 824, -137, -1203, 3192, 3153, 2867, 2367, 842, 3469, 2533, -1096, -157, -1128, -2111, 16, -1685, -3118, -2815, -2717, 421, 527, -2732, -1263, -537, 1561, 4512, -215, -1694, 3497, 4782, 4086, 323, -2615, 2134, 1756, -1664, -1228, -4491, -3428, 981, -1749, -2384, -2114, -3385, 2148, 3176, -1818, -857, -531, 2843, 6654, -487, -1009, 4774, 2012, 1191, -247, -3532, 290, -1283]
493a283l040M940k578k336M327j810J989J939n342M313L740m419J788j418j453
508f43N523l644k196M419n655m13L678m268J933r78m056P850M12n861L757j034
524a176K250N502p610r82N965k732K014j124n578N880j86m443M182n944k345P968
540A641l150o43J880m540O370K582p515M166J269j391O066o372k739P445m945
555A24j401L343m613L246m32n944O751j773n727O739j536j327O242m899J037M947
571D777n706K787K450n086L829k457l245P731n144n364O717j835m24N64o340M945
587a801M294m933L587j343k354Q709l434n066N421k535Q95L659o613O73J109l250
603b982N516l349o238P729J27l585L366m313J316N883l674J280J238k892M714
$$ y = [-1283, -4323, 617, -1961, -4297, 30, -1780, 209, 2148, -3194, 1119, 4859, 440, 2228, 810, -643, 4880, 1236, -960, 3459, -2196, -2609, 1069, -3199, -1266, -2244, -6300, 1550, 1962, -3899, -142, -1176, 1074, 6576, -1034, -2016, 3949, 1217, 3231, 2107, -3471, 2409, 2223, -2220, 1962, -3982, -6327, 1641, -1509, -2152, -272, -4812, 1558, 4140, -3375, 791, 2060, 669, 6735, 363, -2376, 5069, 124, -1277, 2066, -2547, 699, 267, -5677, 1074, -699, -6426, 313, -1223, -2550, 3692, -1207, -170, 4777, -929, 1858, 4308, -778, 3051, 594, -2651, 5080, -64, -5428, 1289, -546, -970, -406, -6746, -1801, 2493, -2440, 1147, -196, -2550, 6159, 2725, -2341, 3080, 545, 1440, 5099, -1514, -841, 268, -2982, 2534, -815, -7053, 676, 803, -2782, 584, -3729, -2413, 3470, -204, 1076, 2314, -578, 4136]
618D136j427m217N235l440k876N906l643k643K334k028K895m51m785M954K31l136
634b955M631j536j213M801k586q73L281k870N69j15k373L684k137l963L759j197
650a093k089K982k396J22L400j299M01k68j097M211p48k678L545j304j383K303
666B609k366j123J223j507J110r19k184K759o34j248K288j395L48K628j472L20
682D37J105n89R22j89n23J121k228o35K006k325j234J530n16k39r32K30J931j033
700a161R3K196j116P37J362j731M55Q33l01O03j359p09J368j696m15R2j938J786
718i01L75k027J896L3n34J653j031J273J446k343J631J504l010J405J01j890J906
735A487j639j235J577k513P21J696l331K038J429k060K401j93j554L887j357j312
$$ y = [4136, 2709, -1508, 3727, 287, -2589, 3317, -326, -2969, -635, -2663, 232, -219, -5004, -50, 181, -2955, 1676, 140, -1073, 3728, 1142, 269, 3550, 680, 1249, 1134, -1239, 2445, 308, -3655, 104, -1093, -3182, -200, -2596, -2474, 926, -373, 28, -240, -1337, 2874, 2126, -552, 2993, 1689, 306, 2609, 243, -880, 343, -1164, -54, -973, -3157, -398, -1032, -2280, 8, -1387, -1039, 1589, 117, 437, 1542, 953, 1875, 1686, 1163, 2284, 56, -579, 1427, -898, -2132, -602, -1118, -1357, -2289, -2059, -128, -1161, -1068, 1128, 12, 749, 2111, 380, 835, 1668, 1367, 1970, 611, -98, 1270, -426, -841, -749, -2687, -901, -526, -2553, -657, -624, -1158, 495, -536, 737, 2183, -160, 1471, 2975, -35, 1370, 1471, -419, 1487, -152, -1387, 190, -2323, -1602, 94, -3237, -1199, 230, -1830, 571, 378, -1176, 2711, 1354, 42]
751D2K602k014M64J371l677J873O20l737K941p84k961L026j487p92L396k958J181
768h94K765l275K750J037l147L391n94k797L485k721q09L265m184o2K648l569
784b711K031L58l635M509m00k781M497j946m75L950l402M58K820l804K324P02
800B495m648L758j011l358M034k820j616M445l904M07L683m155K762J423l260
815a765M081q69k638N020k992j563M074l920J52K367m314J882J033l943L396m17
831d16k872M278j967j244M682l417Q39L225l843K111J352l574L036q10l317L947
847B010k495j945L779l467j72L004l829K383J491l360L491N0k072L798k047q40
863b21L707l330j82K799l891J532J079l908K277l89k073L348k074j136L560k457
$$ y = [42, 2644, 630, 1094, 2465, -1212, 661, 1281, -2456, 485, -299, -3260, -234, -1721, -2513, 883, -2075, -894, 1871, -1404, 1346, 2383, -764, 2627, 2033, -764, 2721, 0, -809, 2456, -1728, -1790, 858, -2711, -680, -322, -3957, 552, 152, -2629, 1868, -78, -553, 3397, -5, 453, 3273, -531, 1793, 2495, -2153, 1605, 594, -2764, 1270, -1550, -3166, 1279, -2625, -2218, 1465, -2690, 72, 1495, -1765, 2316, 1447, -1191, 3829, 837, -726, 3348, -572, -420, 1947, -2367, -485, 548, -3395, 1, -416, -3288, 990, -977, -2221, 2461, -956, -117, 3108, -735, 1376, 2728, -846, 2190, 1380, -1937, 2010, -485, -2430, 1349, -2118, -2290, 714, -3115, -732, 759, -2601, 890, 940, -1132, 2666, 619, -221, 3486, 156, -26, 2773, -1118, 414, 1493, -2415, -138, -527, -2600, 748, -1326, -2462, 1098, -1359]
879a359N93K550k889J642J698k488K200l53k094K563j483j425K315k915N0K270
895H75l184J125J505k589K092J56j447K492j090j19K506k072L50J696k256R13
911I53N31k361J434m84j268J602j711o62J660j404P18J363j755J493Q96r83J198
928A220m48l13J216p46j04L71j870Q99N90j760K51k10m58R19q95L0R35o29J120
947A18M72q73J083K53m60R17n10p13J045q38R4n46j251J079k58j226J470p39p66
966a649J080m42O69Q37r77J262L98q97J612j337o84J801j032n70N43j803R64M02
984A77k140J477j96j092K017j177m91K081j286Q56J879k162O11P35q59J687j704
1001D13j750K909j336j566J749k026M50J292k292J774O10k086K391k39j329K776
$$ y = [-1359, -766, 1784, -1105, 537, 2235, -253, 1947, 1594, -500, 2063, 580, -845, 1470, -1445, -1395, 875, -2309, -1184, 321, -2268, -176, -20, -1467, 1025, -65, -184, 2322, 250, 600, 2296, 40, 953, 1484, -877, 557, 73, -1195, 407, -1304, -1966, -306, -1710, -992, 371, -1384, 109, 1005, 22, 1220, 772, 459, 1675, 929, 825, 1196, -674, 225, 815, -945, -694, -904, -1362, -443, -1338, -1308, -373, -1002, 118, 590, -283, 800, 1053, 593, 1510, 1000, 287, 1332, 494, 588, 42, -1209, -130, -388, -1614, -144, -883, -1649, -569, -1011, -342, 495, -482, 780, 1178, 281, 1893, 556, -128, 1673, 641, 71, 614, -1189, -225, 177, -1963, -486, -682, -1774, 243, -934, -1425, 656, -630, 226, 2105, -57, 554, 1289, 430, 2117, 413, -1337, 1572, 236, -1330, 419, -1607, -1157, 135, -2157, -383, 227, -1859, 532, 293, -1036, 1740]
1017A740j594L51K540l012J41J591k377J231j44k077K461j355j667K560j661p53
1033b025K845k412R06K188k390J683M18j905K809j314j487L137k103j181K384
1048A553k673M98J497l060K043J68k828L079l00j603L042k117L49L039l207N00
1064b0K434k662J729k65k409K602j524j690K799k129j146L145k366O00J482k780
1080b200K256P01k078L073o03j629K709j933o75K563k665K32J805l176J498L67
1096B45k588K456n35j676K959k109j74L072k384M81K148k110J389M02k170K157
1112A563p46j864K758j794j201K045k006L61J243k539K070R82k198J961l43j303
1128a011K656j287m07K340j968J96J143k317P10L52j617J712r70j663K281j030
$$ y = [1740, 146, 497, 3037, 25, 166, 1757, -620, 611, 467, -1610, 851, -504, -2171, 389, -1272, -2025, 820, -1592, -686, 1502, -888, 795, 1213, -692, 2117, 803, -684, 2453, 350, -831, 1553, -1120, -622, 875, -2185, -142, 26, -2802, 277, -23, -1626, 1416, -701, -352, 2687, -520, -20, 2414, -248, 1481, 1216, -1193, 1409, -115, -1805, 994, -1135, -2281, 864, -1502, -902, 580, -2200, 56, 757, -1321, 1752, 1149, -480, 2229, 296, -379, 2184, -481, -249, 1556, -1620, -122, 245, -2343, 113, -422, -2098, 861, -1248, -1422, 1650, -734, -253, 1895, -215, 1174, 1576, -594, 1563, 817, -1047, 1711, -83, -1284, 761, -1245, -884, 359, -2180, -110, 872, -1326, 635, 292, -1011, 1645, 358, -49, 2291, 323, 519, 1662, -655, 55, 407, -1210, 502, -468, -2131, 150, -880]
1144h80m28J677j482O58J231j272J187J09q95J578o24r00J423j388k36R77j743
1161a008O28N34j490O93J08q91J291n31j76J650q67N3J427j576O65O58j028R27
1179A067o33o21J066j229m23Q32j165J89O60r76Q17Q6n78J079j56j72R35l84L8
1198D32Q30r35M15K70j155O91m36m92M27j066L19M40q98M77M94m99O07L37n07
1217b49R89m90K66O93j013K64O16j290O92j21j126P24m90n86J054r25K15P03q77
1236i51R76N0q30J384Q6p52J283p08j86R02j192J97P59j905P76L10j765J283k24
1255e07r00J715q82j68J524j312P52R41j596J317K83j358J703q42j265J678j420
1272c37l56J405j961N75P00j692J399L42j662K108m03q31K144j246r1J605k030
$$ y = [-880, -1308, 369, -1113, -455, 776, -496, 691, 800, -95, 1483, 859, -41, 1382, -6, -242, 735, -1008, -380, 154, -1336, -643, -535, -1426, -135, -666, -842, 808, -59, -6, 1421, -155, 510, 1168, 140, 1067, 434, -187, 879, -350, -773, 59, -1106, -917, -257, -1233, -416, -330, -908, 171, 15, -157, 778, 394, 432, 1262, 327, 742, 1012, -143, 548, 112, -380, 47, -1019, -700, -260, -1158, -681, -187, -686, -79, 258, -249, 740, 250, 516, 1209, 196, 460, 1076, -214, 478, 357, -769, -45, -535, -1121, -67, -992, -777, -74, -951, 25, 75, -755, 629, 715, -37, 1246, 538, 352, 1254, 62, 259, 1018, -887, -111, 199, -1566, -283, -507, -1407, 308, -574, -742, 782, -530, 222, 1163, -433, 884, 1167, -191, 1512, 670, -595, 1083, -337, -693, 712, -1249, -674, 26, -1666, -267, 75, -1587, 521, 118, -713, 1431, 185, 94, 1699, -331]
1289c31Q58J144k402J531q9k224J998r17q05J590j523qJ627j721P35J389j988
1306a136J883R0j551K141n89j122J787j218p35J787k089N99N51k212J884J02j986
1323a814K121n53j075K212j284Q4J952j910O94J147k033J371O8j653J713r84j230
1340a174J875j598k15J643j720N85R79j829J791L13j397J864m36q64J722j286
1356B53k52J393k005R00L72j696J265P4j643J276n31q70J815j059N3J668j554
1373e41P25Q07j375J209J44j323J628q25q88J362j272j09Q27j338M26M62j318
1390a399J141K76r84J452l02o86J376p69L27P74j026J77O32j410P99M4j317J242
1408C47p50l50Q38q11k57J149q87P11N68r95J202k4n50O89m74j9J98o46J27L49
$$ y = [-331, 527, 1671, -731, 800, 711, -1513, 485, -432, -1237, 353, -1170, -1178, 449, -1272, -537, 852, -1136, 747, 837, -714, 1427, 838, -284, 1503, 285, -450, 1337, -752, -153, 398, -1814, 70, 172, -1814, 307, -246, -1321, 891, -393, -309, 1643, -267, 427, 1574, -459, 912, 980, -673, 1040, 56, -1174, 701, -897, -1112, 531, -1189, -604, 375, -1454, 337, 650, -747, 1117, 681, -183, 1539, 253, 1, 1394, -611, 289, 661, -1035, 230, 304, -1339, -63, -594, -1464, 351, -708, -655, 1013, -541, 184, 991, -384, 825, 969, -354, 1274, 449, -439, 923, -349, -458, 369, -969, -543, -81, -1399, -258, 18, -966, 486, 184, -502, 874, 105, 432, 1206, 180, 357, 989, -421, 378, 422, -895, 347, -403, -753, 85, -726, -983, 166, -721, -10, 558, -437, 765, 741, 191, 880, 406, 387, 585, -61, 66, 415]
1428D15j056O02q4n96M62k22l34P30l71K23O83n44M72m3o7M11p9l83N61l45m07
1449B8K88m90k7j00n20L44K21m92O10q7m45R59m59K59N33m49L80p9k47P41l14
1470F54j006J031p17m20N54o64J34R2n58O59r1l62R63m56K0R16o66P2O05n39M59
1491F80l15o96P97o18m36J105r42l90R54j080K16Q11q22Q26J38n68P05k81j53
1510f9J079p73j06J048j039K9L27q84M99l62p60J338p92o38J327q42l1J308j130
1529d71P07L62q28R67j15q18J513j139n06J095j167k21Q79r21L66O49j346O95
1547b99K13o75J150m86j92J458r64j77J308j529Q0R17q97N43j25r54J127j098
1565f00m95J462j129K10R17j097L24P88j006J150m7q45J293p92l41J297j019l55
$$ y = [415, -641, -39, -123, -719, -257, -479, -813, -83, -454, -231, 452, -92, 380, 337, 270, 681, 602, 219, 780, 435, 28, 316, -174, -201, -301, -821, -477, -256, -748, -138, -225, -670, 289, -170, 89, 622, 173, 553, 474, 227, 968, 654, -352, 679, -38, -458, 96, -568, -434, -342, -900, -241, -332, -694, 269, -187, -167, 749, 83, 155, 760, 221, 680, 365, -331, 466, -152, -588, 517, -425, -815, 139, -941, -725, 86, -736, 90, 228, -340, 365, 84, -69, 1010, 237, 131, 1179, 140, 169, 496, -388, 111, -251, -1011, 327, -465, -1103, 224, -618, -649, 659, -471, 236, 598, -230, 737, 622, -196, 1317, 178, -328, 767, -400, -621, 258, -663, -297, 352, -994, -299, -86, -761, 389, -97, -289, 1169, 205, 28, 1336, -193, -113, 804, -93, 450, 325, -629, 498, -600, -1095, 367, -762, -552, 365, -732, -408, 380, -626, 524, 477, -368, 925, 133, -208, 1089, 70, -285]
1583b85J158j380L05O03j458R74j02q93J327n34m19J412j034PJ302j032L03L92
1601F46p68P73k41q53J013o05l73R10r74j31P06p79J56N48q76Q31J62m54R24l46
1621B69m69J261q20k68O02o64J47M53j075M04j45n84J166p62k11J002p24j19J049
1640E12p24O69R4p35N68K34p42P60l39n16Q25q11o0N33r19M29J86p16O27p2m23
1661f20N54o2q8N27j95j6O63p92L50Q7n67R03n49n34K83k50j79O50n48R8L60l76
1683c01J74K21k98M46J5k16N13j92j9J75l63K2J54o96L09q3m70M01k66P2K52J7
1705a33p4K73j24J93L09m88P10j86l07N42p27L48J30o47J64n0l90M02l37j08M56
1726d4k82O9L96m78N94P1k38L56k10l59O00m35L9K58m84M3J39n59M05J7m75N37
$$ y = [-285, 873, -507, -202, 401, -1057, -83, -185, -1078, 249, -285, -704, 708, -326, -319, 983, -49, 254, 646, -122, 651, 410, -443, 570, -35, -408, 502, -472, -603, 103, -676, -520, 28, -848, -17, 145, -309, 615, 269, -200, 1061, 241, -27, 575, -89, 58, 511, -564, -160, -305, -889, 277, -485, -696, 306, -418, -537, 512, -212, 457, 551, -184, 384, 618, -124, 636, 297, -219, 606, -205, -265, 268, -651, -222, -36, -752, -125, -197, -620, -66, -128, -216, 311, 116, 100, 763, -29, 321, 408, -159, 744, 195, -339, -56, -306, -485, 165, -383, -285, 75, -301, -127, 94, -204, 242, 257, 41, 554, 362, 343, 518, 155, 177, 331, -365, -56, -139, -609, -208, -474, -402, -150, -133, -207, 66, -58, 135, 444, -44, 666, 480, 173, 715, -12, 336, 466, -181, -17, -67, -457, -55, -392, -500, -44, -326, -257, 139, -339, 255, 326, 88, 444, 234, -125, 475, 40, 79, 337, -147, -104, 35, -524, -119, -102, -577, -40]
1748d0j91m7M75l64q0N95l36M35K84p89L12L9n89O71n05j30N90q44M0M64n99L53
1770b56K89o94P15j14l35P22k68o0O57n13K8J61m72M13K14r31O01j91o27P08k97
1791b50k13M42m51J76Q01q12K09N91p00N13J05o67R67n35k22M58o14o1O85q36
1811d14J33M92q95O45j1m68P69l15n5M64m33L36L93q44M89J28q35P57j80l95N96
1832C57o49k36O45n80J33O26p96M59K50o38O96J00p03R20m42l30R02n88N2L07
1852D85r22M83J57o41M68j05m98N64j42p6M88o37K58N87p21O13J0m81O21j37o77
1873c03O21q9l81M28o28n3M87o56L09K67n13O82r3l00N28k88j83O81n31K06L87
1894E78n52n5K7l74M95k30l33M04k91k1L13k47m9M95m54K48J93j55L13O4l62M32
$$ y = [-40, -231, -278, 197, -167, -247, 348, 12, 447, 731, -58, 254, 293, -296, 375, -130, -260, 330, -514, -474, -10, -609, -256, 33, -661, 54, -60, -395, 327, 59, -1, 656, 143, 171, 332, -140, 273, 487, -444, 157, -34, -661, 47, -250, -463, -21, -472, -296, 505, -307, -98, 493, -207, 306, 411, -256, 711, 176, -46, 412, -202, -263, 422, -414, -281, 211, -684, -39, -50, -518, 251, -64, -119, 345, -88, 248, 641, -203, 286, 414, -421, 336, 156, -239, 357, -292, -528, 117, -463, -330, 296, -500, -41, 209, -429, 267, 367, -336, 584, 142, -188, 714, 126, 178, 485, -437, 46, 203, -438, 30, -75, -573, -9, -151, -227, 261, -376, -118, 469, -252, 361, 371, -110, 511, 374, -303, 318, 229, -152, 276, -352, -405, 82, -574, -265, 2, -511, 171, 78, -222, 306, 18, -165, 516, -15, 191, 578, 26, -29, -2, -376, 119, -111, -444, -40, -331, -352, -39, -286, -335, 160, -294, -46, 147, -8, 305, 369, 7, 439]
1916D39m35j23K36k81j7J42k00l4R8j64L54j38j26L51k19K32J01k24J54J28l08
1937c4L20l1k80L10k91k27M68n91L77l8j64J22J74k67K72k34K21k2m2K07J77n18
1959i1L18J38n34L61n8j23l1k89J34J82l49K74Q5l13K9K57j32L79k13J28L48n72
1981g2L99j0m04L54j89l87M65k66l17N33n14K10K06j51J57m8k64N02lk42O07n06
2003F0k62O25m17L2J62l97J17Q8l87L27k68J19L53l65r6L75k10J51L53m26J54
2024H8K09l37M71k82j30L41j09o09P96q11K38K15n26K77K08m30M15P3k31N45n83
2045a72J67O10p80M04J83n70L14Nm07M25m31l5M56m78pK69k77J32L33n04N31J01
2067B69l74M02N7l16M82l66l10M64o17K50L45m40j08L82o07M48l32lM43n6k51
$$ y = [439, 4, -119, 117, -164, -181, -39, -239, -273, -175, -339, 15, -123, -249, 102, -117, 115, 216, -8, 146, 274, -34, 286, 255, -25, 285, -6, -233, 235, -356, 21, -17, -181, -59, 115, -152, 120, -114, 107, 85, 43, 250, 427, -91, 227, 365, -169, 192, 134, 11, -20, -309, -175, 7, -342, -68, 17, -296, -267, -10, -142, 237, 24, 152, 500, -72, 327, 317, -87, 267, 78, -309, 156, -110, -427, 106, -408, -198, 8, -143, 14, -34, -298, 204, 201, -41, 566, 60, -202, 423, 6, 38, 200, -197, -80, 8, -379, -52, -320, -201, 152, -213, -309, 66, -144, 7, 360, -66, 88, 297, -40, 431, 149, 19, 360, 251, -358, 438, -373, -135, 80, -446, -169, 39, -391, 24, 97, -134, 411, -172, -5, 605, -175, 229, 412, -158, 156, 161, -246, 179, -252, -287, 169, -309, -316, -47, -324, -192, 141, -363, 168, 269, -105, 297, 354, 38, 520, 154, -156, 308, -309, -59, 286, -154, -262, 120, -487, -39, -371, -374, 69, 13, -238]
2088b38N67n76K49L58o10N75l1j88N6r1k89L04l83K22J63l35J26K46o33M46K10
2109A48o28O91j2l65M04k33p6N00l89N8K24n47K09l3m32L61J58k19L07l96K02
2130f8L30k92n3M51m36K06J85l27K76j66j91L11k14j98L37n07M18j68l00N19k3
2151I0l81M95l08o7L68m9j45K54k78k1J47j64K87j50j31J01r8l95M37k47N8L13
2173A16k30J00o4j48J24L08k42K83j88K4K73j43n2m9l34J04J27R1k33J98j06J80
2195A39l40O7J74j22K64r9J19j54P7j02R3k25L33j60j73j9L61n87K91Nj35J0P7
2218a06J54j9n1O3R0k57J97m7N9J74j25j80L20k48j29J35J71k82J2l1MM0r5J83
2242C2o1j40N0K62N2L5k12J05K27l43O7l1k58M06m63R9P3m2J02J61k76K4L33m71
$$ y = [-238, 329, -247, 2, 360, -250, 325, 294, 106, 162, 71, -218, 86, -297, -75, 88, -247, -121, 125, -508, -62, 148, -480, 211, 199, -166, 238, 5, -71, 429, 40, 98, 322, -225, -16, -49, -481, -120, 38, -181, 126, -270, -68, 262, -30, -83, 368, -68, 138, 323, -4, 272, 106, -85, 226, 12, -186, 151, -356, 62, -106, -406, 113, 90, -291, 204, -104, -171, 197, 148, 3, 257, -21, -42, 105, -59, 228, 78, -53, 48, -50, -445, -8, -255, -197, 116, -114, -14, -78, -226, -102, 206, -36, 247, 59, 83, 356, 213, 161, 112, -222, -118, 9, 100, -133, 65, -41, 139, -201, -134, 40, -82, 182, 83, 202, 48, 125, 23, 116, -109, 224, 64, -109, -128, 233, -354, -63, -58, -193, -183, -106, 48, 29, -22, 41, 131, -126, 71, 24, 83, 257, 132, -48, 272, 24, -105, 30, 201, -81, -69, -100, -96, -56, -151, 32, -29, -169, -119, 143, 195, 230, 18, 123, 350, 7, 74, 43, -215, 191, -272, -173, -100, -142, -40, 121, -155, -131, 202, -269]
2266b69L22R2l23L89k00j1K18k14P9J8j62J47O6l03K11j16M8K71n55J0M31k95
2288a46P8J82k46K08J50l49K92kj41J50j22qLk63K34Q0k26K13nl02J80l2QL02
2312B38l42K42N3l09L67q1l61K13r3j36K91j33m3K45l2j15J74l09J42R9l08K34
2334C6M2j43M01n62K49P8k9L8o0j93R9J32l31K49m7j78K88k4k78L17j81k30M13
2357H6J7o1J33k32J47Q8l13L86l28q1J06J15m4J13k64P4J1p8K53J1k72Q5K9q2
2381a01J87j35LK39m4j43J87l48M43l32j99J68J24O3j02j06N6K8p9O9p3pK67O0
2405B25k07Rm5J91j14q5O0R4k16P5k7o9P5J02k84K5pR9P2r5m5J70j5J65j02Q5
2431A36Rj09J2J32j64k22J17j41L78k30m7K19k16J86P7r8R1k21l5J56J62k33N5
$$ y = [-269, 53, 145, -178, 211, 11, 0, 218, 4, 83, 101, -61, 86, 152, -151, 60, -56, -8, 263, -292, -282, 149, -146, -68, 114, -132, 76, 226, -123, 169, 167, 26, 176, 54, 46, 49, -214, 20, 100, -126, 87, 82, -220, -40, -72, -64, 238, -104, 138, 191, -118, 249, 168, -193, 20, -73, -209, 82, -51, -94, 151, 119, 4, 178, -131, 11, 110, -198, 36, 78, -65, 336, -226, 23, 101, 72, 110, 50, -143, -44, 88, -243, 6, -41, -219, 69, 45, -233, 84, -97, -327, 86, 103, 42, 175, -57, 90, 178, -135, 251, -77, -158, -52, 63, 19, 132, -132, -58, -47, -125, 128, 139, -133, -48, -19, -101, 86, -49, -46, 193, 149, 6, 193, -155, 288, -44, -243, -75, 49, 112, 10, -96, -40, -12, -91, -22, -95, -102, 165, 225, 18, 27, -18, 173, 59, -26, 34, 128, -88, -13, -40, -109, -34, 68, -216, -191, -198, -99, -27, -122, -167, 3, -12, 153, 51, 136, 145, 36, 48, 180, 16, -206, -89, -230, 148, -82, -129, 90, -126, 60, 137, 39, 130, -91, -126, 30, 192, -41, 14]
2454A4L7j55j2P8j2N8j75K36j96O7n9M02m87K00J41l34K41O3j14J59j4n5k02M5
2478g4j11M3J90j94L3j02K43j9J04k80J74ONPJ11j98P6P3N4k63M03j82j30oj42
2503a79J91L6j29K58l79J83l0n9O2J48j84J81N9j29j43N3J4J52k0L5l24K7K38
2526F1o2j62R1J12l01K44k0k2J99j69p3K09j15N2J45k70J65r1J22k6j71j13L37
2549A42k47lP1j83J37l6L6J1J87j27J8J41k59M16k08n7J55k18n2j58L53k32O1
2572e2j6J48k44K14P6k82R0l7nK94j49q1j06L03J07ql02j2J87q4j9j10j6J34R2
2597A22m80K06J16q5N9J02l43M77j54r3K38j55J90j18j29J51l7l57L60K9q4P1
2619H6jj0PO6l91L24k24J86r0j73K65J74j99n2Q1k8k22K00k21K14J08PR7m40L51
$$ y = [14, 51, -104, -116, -38, -50, 8, -167, 69, -127, -60, -119, 283, -204, -4, 137, -197, 44, 107, -7, 152, 138, 83, -119, -74, -185, -142, 48, -146, -113, -215, 28, 9, 113, -167, 7, 13, 18, 25, 136, -62, 14, 87, 141, -122, 281, 99, -31, -37, -179, 12, 48, -81, 177, -202, -19, -49, -108, -46, 102, -82, 99, 158, 29, -114, -61, -47, 105, 85, 120, -204, -177, 61, -1, -163, -72, 40, -261, -17, -37, -59, 140, -29, -102, 107, -8, 44, 189, -81, 84, -7, 115, 89, -82, -195, 142, -105, -108, -37, -220, -83, -119, -83, -72, 115, -12, 6, 147, -112, 304, 96, 39, 194, -24, -76, -234, 119, -113, -52, -68, 80, -164, 50, 126, -156, -66, -103, -108, 186, 37, -44, -150, 153, 260, 252, -50, -62, 125, 41, 22, -88, -104, 30, 122, -358, -152, -36, -121, -62, 40, -303, 174, 20, -73, 165, 10, 200, 82, -47, 104, 67, -290, 70, 99, 15, 86, 85, 75, 82, 148, -243, 81, -143, 43, -47, -220, 45, 219, 20, -32, 49, 21, -201, -1, -222, -8, 100, 107, 204, -236, 115]
2644A15j42o2J5L7pJ43K2m4R7p8j2J68m4j16j09J40k35J19l1q9J4K81j23R0j83
2669c4oj%J22p2N1k35J33j7O7K39l17k1N2P7l84L32J9O8j54K31J5j59j15K19N2
2695A62j36L67n34L2L25k87J21N3l48K41r4o7J37Q8N7o3r9J15j24K42q0k24O8
2718d8J25o5K67k69p7K24k26k8q0K34k01q6K41K75l13J62j40R2j92J44l50K85
2740b6P4j52N1J31o1l1o1j75J00K0N7J3J11o8n7J34Q9Q4m31J86J38j66J67n8j92
2765a23O5J39J20j14k31K07k43J26J70k58K97k72O8K8J42l7j34LO2J49n9l0l2
2788D3J52k23K2P6J01r9p6j79J0K07o2J23m6k62K51r7l3J74j70kL6R9P1J06l94
2813a72M2K23k69k0K58j4K3m5j25J05r0k7N7k0J51p6R5J06l43L06j42m2M1j67
$$ y = [115, -27, -89, -74, -37, -44, 99, 121, 77, 174, 96, 84, 252, 208, 92, -17, 123, -112, 7, -24, -113, -99, 182, 59, 149, -34, -40, -41, -41, 81, 9, 60, -175, -42, -59, 8, 247, -70, -91, -39, 38, -346, -14, 5, 73, -81, 150, 165, 6, -109, 110, 162, 26, 393, -141, -109, 216, -71, 50, 103, -245, -4, -98, -165, -28, 60, 117, 54, -45, 70, -54, 188, 108, -116, -48, 77, 12, 279, 10, -67, 157, -69, -97, -177, 57, -144, -230, 11, 286, -27, 135, -5, 87, -105, 39, -311, -26, 48, -104, -53, 78, 17, -14, -75, -250, -150, -130, -73, -60, 51, -17, -74, 60, 149, 233, -198, -12, 126, -40, 127, 69, -123, -58, 81, 201, 87, -144, 63, -180, -54, 116, -142, 155, -117, -49, -21, 121, 84, -50, -47, 15, 164, 105, 75, 43, 195, -28, -6, 70, 171, 72, -4, -183, -173, 34, -28, 95, 49, -213, 38, -59, -92, 82, -88, -90, -54, 45, 116, 222, -172, -130, 93, -176, -196, 62, 48, 71, 26, -99, 6, -84, -111, -54, -74, 77, 1, 96, 202, -141, 165, 23, -19, 22, -145]
2837a45M6K09l68K71j59J06P0M2P1k08J46k37Q3Oq6L16k31P9l9KK30n3j97j47
2861a93J63j54rK02N0j03l1L8J8J12j96lR4k57K77J1qm0N0Q2k17K12j40j07O9
2886h0k9N27k63J5k13kJ21j80J19l51M70j16O5J30k51o1j2K23k97J41K16k00n6
2909h4J56j25j10K31K6O7j24j43n8K14j6j14M2L6j52Oq0O3J21n8J06j46J78o9
2933c3Q0j41jR9N4q9LJ38o4m1j16J89j34m3Q1K8Q9n0j57J81L9r7j50K10l5J10
2959A50j21k0R8k53K05j79J30MO3j74n8K62m7o7J64p5m1j19K08k66J66O8k07K06
2983I7j53l0p2J24k0m5j31K23J04l46L49q3j95K78j41j14j3J78j43L97k88Qp9
3006i5J39J73k33p6k53L38m6m6K9j40K13k13K21M4j33Q4N4Q7j01M6nl9J0j45m4
$$ y = [-145, -99, 110, -258, 13, -146, -40, 30, 72, 143, -65, 81, -156, -73, -67, -153, 163, -68, 11, -28, -26, 204, 151, -46, -193, -30, -184, -193, 9, 59, -44, -75, -37, -19, 93, -103, -106, -12, -269, 8, 19, 11, -29, 21, 103, -114, 98, -42, -149, -80, -109, 418, 155, 170, -43, -45, 76, -104, 15, -336, 134, 18, 83, 213, -38, -99, -111, 112, -185, -44, 172, -28, -84, 72, -53, -163, 68, 94, 161, 37, -106, -164, 50, 34, -80, -38, -2, -154, -148, -228, -165, -44, -102, 4, -142, 36, -33, 47, -94, -95, 4, 58, -31, -28, 110, 46, 5, -111, 78, -56, -99, -18, 10, 99, 49, -108, 73, 112, 15, -135, 75, 40, 150, 29, 9, 107, -146, 59, -120, 10, 14, 77, -97, -155, 107, 60, -7, 157, 82, 41, -78, 130, -136, 30, 98, -109, 97, -56, -86, -158, -34, -54, -99, -230, -7, 97, -249, 100, 17, -178, 100, -41, -155, -168, 10, -133, 264, -24, -16, -95, 44, 217, -16, -92, -345, -7, -53, -99, -70, -210, 3, -210, 11, 55, -78, 6, 60, 147, 46, 92, 87, 48, 58, -87, -131]
3031a31J04j74L80k02O7j49K14j47P3o8K59l47L61j70r6P5N7K1J32l46K24o0j04
3054b7m3J4K71k64j48L17k05R1R0j67J3n0J38j86K33K14l78K9J37j09j8q6j6L
3078a47J47J00K54k84n4l0M2j19J42K9j9m9K3j73J59j10O8J46J50k65j78J32K1
3101a5l2lJ83k60M7K4K08j02j47J27q7L17j77l8K7O9j80j02K36o6o8o6K07l6Q9
3126A55p6j03k34K77O0J9k2kJ0q8J82k16j51J86j54o2L13k79K24j2r7O2j62K56
3150H6j81K08j10K29k48J01r5J77M1k61J31j02M8J1j11rQ1l2K3p6J66k12J47o7
3174e5k7K70m31K32J12j89K28k70K67R3k24N9o1J11j4j53RN5P6j0j86J01qJ3K
3199@mK31k24J6j26J77q1J25j18j43J81j22k15L27r2o8J47J10L9j60p2O7q9N9
$$ y = [-131, -27, -201, 179, -23, 44, -105, 109, -38, 35, -33, 226, -121, 240, 70, -26, 49, 106, 127, 259, -87, 137, 77, -27, -70, -56, 215, -49, -197, 120, -85, 6, 96, -71, -58, -108, 30, -156, 77, 291, -87, -58, 79, -30, -48, -134, -150, -147, 0, 100, 354, 70, 16, -14, 28, -91, 51, 80, 61, 12, 35, -138, 21, -89, -21, 125, 275, 10, -168, -36, -15, -47, -50, 133, -127, -80, -56, 152, 50, -97, 30, -57, 260, 83, 45, 72, 141, -39, -141, 95, 29, -39, -105, 102, 66, 155, 79, -24, -258, 19, 79, 98, 76, 74, 84, -4, 178, -38, -189, -3, -157, -219, 94, -185, 39, 27, -70, -8, -170, 86, -95, 113, 3, 232, -16, 85, -10, 167, 208, -53, 78, -24, 24, 35, -76, -85, -4, -36, -13, -89, 77, -135, 12, -55, -82, 188, -243, -11, 101, -88, 140, -130, 137, 230, 6, 65, 4, 115, 101, -52, -43, 12, 88, 78, -108, -7, -15, -2, 0, -4, 227, 3, 19, -107, 70, -11, 114, -4, -147, 34, -88, -303, 24, -68, -136, 11, 121, 160, 0, -72, -5, -94, -35]
3223c5J75j99K45l58L52j37j09p3j1Q6q5L15k06j67J05K01N0k18P9j63j1L63k13
3246a4Q5n6O0P6l6k98m1K81j14Q4p6L4m5J87j54k6L03k71J36j69j07K47j00M6
3270C2P2j11J9J36k23K91l43N8J2mj23J82j12J69Po2K17j89K8n4J95k59o3J00
3294b5k3M2O6k39K75j25P8l01K06L0J18j04P3k25R2J41N7N8o4m43O14k89K1j78
3318a45n2J64j8J89j85k65K02Q3k5J15K3l3o8J34J03j86J34j48J02J51l13P9j25
3341h4l4J44J28q1j88j03J29Q2K12j74J06j53K1KP6M1Qk86rK14Q5q9j49J83N3
3366A34n0nJ22k42j1J05k7j08KJ53l6L1j5LM4L2l6L7m4j82k36L51k3J69j88P6
3392E6j80m4J11J06k3L4k3r8J57k18J5J2K0N5L5k40J53J89k70J04M0j19J5K68
$$ y = [-35, 140, -59, 186, -172, 180, 43, -66, -139, -150, -64, -149, 166, -40, -207, -102, 99, 149, -69, 10, -153, -164, 199, -14, 71, 15, 75, 151, 115, -183, -224, 57, -57, 27, -49, -15, -60, 127, -27, -53, 250, -21, 115, -54, -161, 86, -14, 32, 104, -7, 12, 148, -75, 216, -127, -69, -57, -61, -184, -2, -114, 55, 62, 0, 217, 28, 56, 2, 197, -62, -125, -25, -48, -6, 60, -179, 96, -29, 49, -252, -46, -16, 102, -2, 71, -154, -62, 79, 136, 194, 130, -313, 301, 12, 33, -145, -197, -33, -51, 138, -47, -312, -110, -27, -52, 63, 86, 53, -15, 119, 222, 36, 170, 22, 124, 275, -38, 41, -84, -118, 26, 154, 73, -115, -218, -89, -7, 205, 31, 137, -16, 5, 7, 83, 124, 132, -154, -163, 51, 136, 47, -102, 81, 134, 84, 79, 201, -41, -52, 53, 26, -82, -80, 73, 37, 68, 53, 56, 100, 132, 96, 133, 89, -93, -329, 22, -1, 168, -20, 56, -124, -168, -57, 49, 26, 60, 37, -61, 96, -122, -107, -95, -75, -20, 15, -225, -72, 117, -153, -49, -9, -128, -113, 155]
3416A55j41m2K77r3k63K47R3j95j73K18j63n8J88J54j9k16p2L5J57m3j38J83j64
3439g3o2K40k31M70m33K00k14L04r3J6p9j53P9o3O6J58k73K12j13j32R7r6K43
3462G0mq4N5J65l71K15l11K68J58p1j63j1j88J65J7Nn6L7K55k15j87J40m2K08
3486E5J20l47L46j77m5R2j20J32N3Q9j51r8P4j48K20k01n2K09K0j37J31k48K95
3509A12j2Pj83q2L58j90J23k66J32r7R9j58J79Op4q2K35j41k7l50M06J10n8p7
3533c0o1M68m03l51L37O7l41L36R2p7j60j8o7J85j69J11P3p3K19k83J98K03n5
3556B01k63K80l7n8L0k25O6J66j29L0k07J89J4l32L7K56k08J61o0J40M9N2j45
3579Gm1L09l38J78k06Q6K32m13M8N6j57J87r5J10K5J26R1j46j4P3K9k8j91R9k40
$$ y = [155, 14, -28, 249, 156, -107, 140, 233, 38, -135, 83, -80, -138, 50, 204, 185, -31, -103, -68, 89, 46, -92, 91, -73, -135, 105, -126, 344, -89, 111, -103, 201, 108, 124, 45, -108, -29, -92, -26, 132, -141, 71, -42, -174, -77, -173, 70, 66, -18, 37, 202, -169, 46, -265, 3, 161, 90, -73, -84, -272, -107, -90, -85, -141, -104, 151, -64, -251, -111, -153, 55, 175, -172, 174, -3, -48, 44, -76, 56, 109, 198, 47, -51, 23, -125, 95, -106, -158, 51, 71, -66, 65, -183, 112, 100, 107, -76, -158, 200, 10, 133, -133, -1, -98, 1, -157, 22, 28, -46, -128, 107, -34, -61, -411, -5, 105, 47, -30, -91, 377, -26, -377, -40, 27, -314, 22, 114, 37, -123, -141, -208, -23, -192, -81, -8, -81, 138, -145, 53, 256, 201, -62, 218, 181, 123, 153, -72, -6, 160, 31, 61, -146, 43, 57, -275, -238, 18, -190, -29, -89, 51, 100, 152, 7, -34, 275, -63, 115, -91, -5, 227, -186, -138, -82, -239, -52, -147, -37, -12, 114, 205, 59, 45, 118, 147, 119, -72, 27, -213]
3604b13J37P6J3L54l74k40M04k02j34J8oP5J31n9jR0j12O0J17j81K50j55J94l41
3628i9J65k04J27k45OJ49J20j32J25m8MJ07q3J15k35L96l29J16J24k66R9j5Q9
3651H6kq7L9J8j52J00J2k28m6K57K8j04K47L7n5o9j01J18j00j20J92r5J05q4J6
3676A2N4j07N0J30k78J4M3j2J34NK47k09Lp0R9j37K34Oqj69m8Q8KP8j90p2N4j25
3704a72J01J1pJ54J95l00R4k1j20j9O5j72R4K59p6J19l71K87m4j62J99j34r0K9
3728h1Kj05K29J8lK97n15J36L95m44m6K82k28Jk0J05J1j86J23KK28k39j24LQ5
3753g4Lr7K78J7n10N48k62P4q1R9R1q8Q8j78j42K9K90j30r7K17J01l3j50M3J5
3778E1j25J65j1O5k43J18l8K03p2l31K40L7j99J53M3R8j73r4J30P1j10Krj39P6
$$ y = [-213, -76, 0, 13, 367, -7, -247, 157, -45, -179, -161, -167, -92, 39, -20, -21, 69, -43, 17, 134, -47, 203, 48, 242, -99, 66, -138, -11, -256, -250, -101, 19, -113, 12, -36, -32, 75, -8, 107, -128, 268, -61, 55, 179, -87, 12, -3, 86, 84, -3, 36, 54, -98, 2, 14, -214, -260, -3, 25, -79, 168, 205, 150, 81, -20, 98, -2, -122, 70, -25, 80, -4, 12, 66, -41, 9, 139, -139, -125, -82, -94, 40, 45, 292, 83, 86, 16, 115, -22, 212, 218, 210, 41, -7, 81, 83, 161, -29, -101, -47, -172, -71, -60, -67, 87, 282, -18, 76, 55, -65, -84, -19, -191, -97, 162, 86, 205, -166, 121, 77, -85, 114, -20, -110, -81, -79, -184, 45, 63, 60, 357, -158, -22, 373, -71, -117, 165, -63, -62, -82, 23, 34, -152, -29, -27, 201, -38, -162, -159, -74, -71, -168, 110, 127, -383, 165, -97, -23, -104, -5, 86, -2, 86, -92, -234, -205, 85, -45, -142, 75, 176, 143, -7, 36, 51, -74, 91, 80, 145, -98, 20, -18, 185, 113, -218, 22, 59, -140, 13, 56, 154, -19, -113, 17, 88, -22, -20, -29, -168, -92]
3803i2J48k29K39L8q9q8J26j34K06k59N2J83k60L04k91J2K84j66j26K73j04p1
3825d4J70k33J87j16PK04j61j40L03m42K71l8J3jkP1q9O4k14L54j06q5J7J35j65
3850d0N8pj13K17n6j49J15j8J4q1J5J93j96r9J95J58j30M5j86M8M2L0j86j7K38
$$ y = [-92, 56, -173, 66, 104, 15, -73, 53, -81, 125, -134, -82, 101, -159, 145, -146, -134, 150, -16, -142, 131, 27, -44, 126, -107, 80, -36, -29, 175, 14, -126, 177, -265, 6, -32, -19, -20, -22, 49, -40, 24, -190, 164, 58, -27, -10, 125, -40, 18, 11, -102, 115, 59, -90, 25, 7, 21, -60, -45, 148, -48, -147, 48, 206, 76, 121, -65, -17, 25, 55, -131, -148, 90]
$$ [...]
8191A06
##END NTUPLES=NMR FID
##END=
