##TITLE=1H_Pr 53-Eth
 CDCl3
 8 sc, 
 13.12.2021
##JCAMPDX= 6.0         $$ Bruker NMR JCAMP-DX V2.0
##DATA TYPE= NMR FID
##DATA CLASS= NTUPLES
##ORIGIN= UXNMR, Bruker Analytische Messtechnik GmbH
##OWNER= root
$$ XWIN-NMR		Version 3.5
$$ Mon Dec 13 12:03:41 2021 Russian Standard Time (UT+4h)  she@DPX200
##.OBSERVE FREQUENCY= 200.131346
##.OBSERVE NUCLEUS= ^1H
##.DELAY= (6, 6)
##.ACQUISITION MODE= SIMULTANEOUS
##.ACQUISITION SCHEME= undefined
##.AVERAGES= 8
##.DIGITISER RES= 18
##SPECTROMETER/DATA SYSTEM= spect
##.PULSE SEQUENCE= zg30
##.SOLVENT NAME= CDCl3
##.SHIFT REFERENCE= (INTERNAL, CDCl3, 0, 15.7039)
##AUDIT TRAIL= $$ (NUMBER, WHEN, WHO, WHERE, WHAT)
$$ ##TITLE= Audit trail, XWIN-NMR		Version 3.5
$$ ##JCAMPDX= 5.01
$$ ##ORIGIN= Bruker BioSpin GmbH
$$ ##OWNER= she
$$ F:/spectra/data/she/nmr/H-F/1/audita.txt
$$ ##AUDIT TRAIL=  $$ (NUMBER, WHEN, WHO, WHERE, WHAT)
(   1,<2021-12-13 12:01:48.03 +0400>,<she>,<DPX200>,
      <created by zg, POWCHK disabled, PULCHK disabled
       configuration hash MD5:
       00 E9 B6 7A A2 85 ED C7 34 08 36 98 17 FE 4E 26
       data hash MD5: 16K
       EF 7F AD BA 0A F9 3C 9A 81 7E 5B B1 2C 28 C0 1D>)
$$ ##END=
$$ 
$$ hash MD5
$$ E1 F4 94 EB F9 FE EA B4 23 F8 72 17 0B 9F 5B DB
##$RELAX= 
##$RELAX= 
##$RELAX= 
##$RELAX= 
##$RELAX= 
##$RELAX= 
$$ Bruker specific parameters
$$ --------------------------
##$DU= <F:/spectra>
##$EXPNO= 1
##$NAME= <H-F>
##$PROCNO= 1
##$TYPE= <nmr>
##$USER= <she>
##$AMP= (0..31)
100 100 100 100 100 100 100 100 100 100 100 100 100 100 100 100 100 100 
100 100 100 100 100 100 100 100 100 100 100 100 100 100 
##$AQSEQ= 0
##$AQ_mod= 1
##$AUNM= <au_zg>
##$AUTOPOS= <>
##$BF1= 200.13
##$BF2= 200.13
##$BF3= 200.13
##$BF4= 200.13
##$BF5= 200.13
##$BF6= 200.13
##$BF7= 200.13
##$BF8= 200.13
##$BYTORDA= 1
##$CFDGTYP= 0
##$CFRGTYP= 5
##$CHEMSTR= <none>
##$CNST= (0..31)
1 1 145 1 1 1 1 1 1 1 1 1 1 1 1 1 1 1 1 1 1 1 1 1 1 1 1 1 1 1 1 1 
##$CPDPRG= <>
##$CPDPRG1= <>
##$CPDPRG2= <>
##$CPDPRG3= <>
##$CPDPRG4= <mlev>
##$CPDPRG5= <mlev>
##$CPDPRG6= <mlev>
##$CPDPRG7= <mlev>
##$CPDPRG8= <mlev>
##$CPDPRGB= <>
##$CPDPRGT= <>
##$D= (0..31)
0 1.2 0 0 0 0 0 0 0 0.06 0 0.03 0 0 0 0 0.0002 0 0 0 0 0 0 0 0 0 0 0 0 
0 0 0 
##$DATE= 1639382507
##$DBL= (0..7)
120 120 120 120 120 120 120 120 
##$DBP= (0..7)
150 150 150 150 150 150 150 150 
##$DBP07= 0
##$DBPNAM0= <>
##$DBPNAM1= <>
##$DBPNAM2= <>
##$DBPNAM3= <>
##$DBPNAM4= <>
##$DBPNAM5= <>
##$DBPNAM6= <>
##$DBPNAM7= <>
##$DBPOAL= (0..7)
0.5 0.5 0.5 0.5 0.5 0.5 0.5 0.5 
##$DBPOFFS= (0..7)
0 0 0 0 0 0 0 0 
##$DE= 6
##$DECBNUC= <off>
##$DECIM= 32
##$DECNUC= <off>
##$DECSTAT= 4
##$DIGMOD= 1
##$DIGTYP= 9
##$DL= (0..7)
0 120 120 120 120 120 120 120 
##$DP= (0..7)
150 150 150 150 150 150 150 150 
##$DP07= 0
##$DPNAME0= <>
##$DPNAME1= <>
##$DPNAME2= <>
##$DPNAME3= <>
##$DPNAME4= <>
##$DPNAME5= <>
##$DPNAME6= <>
##$DPNAME7= <>
##$DPOAL= (0..7)
0.5 0.5 0.5 0.5 0.5 0.5 0.5 0.5 
##$DPOFFS= (0..7)
0 0 0 0 0 0 0 0 
##$DQDMODE= 0
##$DR= 18
##$DS= 0
##$DSLIST= <SSSSSSSSSSSSSSS>
$$ [...]
##$SUBNAM2= <"">
##$SUBNAM3= <"">
##$SUBNAM4= <"">
##$SUBNAM5= <"">
##$SUBNAM6= <"">
##$SUBNAM7= <"">
##$SUBNAM8= <"">
##$SUBNAM9= <"">
##$SW= 18.0517287032376
##$SWIBOX= (0..15)
0 0 2 0 0 0 0 0 0 0 0 0 0 0 0 0 
##$SW_h= 3612.71676300578
##$TD= 16384
##$TD0= 1
##$TE= 0
##$TE2= 300
##$TE3= 300
##$TEG= 300
##$TL= (0..7)
0 120 120 120 120 120 120 120 
##$TP= (0..7)
150 150 150 150 150 150 150 150 
##$TP07= 0
##$TPNAME0= <>
##$TPNAME1= <>
##$TPNAME2= <>
##$TPNAME3= <>
##$TPNAME4= <>
##$TPNAME5= <>
##$TPNAME6= <>
##$TPNAME7= <>
##$TPOAL= (0..7)
0.5 0.5 0.5 0.5 0.5 0.5 0.5 0.5 
##$TPOFFS= (0..7)
0 0 0 0 0 0 0 0 
##$TUNHIN= 0
##$TUNHOUT= 0
##$TUNXOUT= 0
##$USERA1= <user>
##$USERA2= <user>
##$USERA3= <user>
##$USERA4= <user>
##$USERA5= <user>
##$V9= 5
##$VALIST= <valist>
##$VCLIST= <CCCCCCCCCCCCCCC>
##$VD= 0
##$VDLIST= <DDDDDDDDDDDDDDD>
##$VPLIST= <PPPPPPPPPPPPPPP>
##$VTLIST= <TTTTTTTTTTTTTTT>
##$WBST= 1024
##$WBSW= 4
##$XGAIN= (0..3)
0 0 0 0 
##$XL= 0
##$YL= 0
##$YMAX_a= 429594
##$YMIN_a= -514769
##$ZGOPTNS= <>
##$ZL1= 120
##$ZL2= 120
##$ZL3= 120
##$ZL4= 120
##$ABSF1= 10
##$ABSF2= 0
##$ABSG= 5
##$ABSL= 3
##$ALPHA= 0
##$AQORDER= 0
##$ASSFAC= 0
##$ASSFACI= 0
##$ASSFACX= 0
##$ASSWID= 0
##$AUNMP= <proc_1d>
##$AZFE= 0.1
##$AZFW= 0.1
##$BCFW= 1
##$BC_mod= 2
##$BYTORDP= 1
##$COROFFS= 0
##$CY= 11.3945322036743
##$DATMOD= 1
##$DC= 2
##$DFILT= <>
##$DTYPP= 0
##$F1P= 2.36226072786647
##$F2P= -0.459571619588291
##$FCOR= 0.5
##$FTSIZE= 0
##$FT_mod= 4
##$GAMMA= 1
##$GB= 0.15
##$INTBC= 1
##$INTSCL= 1
##$ISEN= 128
##$LB= 0.24
##$LEV0= 0
##$LPBIN= 0
##$MAXI= 10000
##$MC2= 0
##$MEAN= 0
##$ME_mod= 0
##$MI= 1.114404
##$NCOEF= 0
##$NC_proc= 0
##$NLEV= 6
##$NOISF1= 3.799351
##$NOISF2= 2.8
##$NSP= 1
##$NTH_PI= 0
##$NZP= 0
##$OFFSET= 15.70392
##$PC= 1
##$PHC0= -15870.5
##$PHC1= 11.0008
##$PH_mod= 1
##$PKNL= yes
##$PPARMOD= 0
##$PSCAL= 0
##$PSIGN= 0
##$REVERSE= no
##$SF= 200.130013532006
##$SI= 16384
##$SIGF1= 3
##$SIGF2= 2
##$SINO= 400
##$SIOLD= 16384
##$SREGLST= <1H.CDCl3>
##$SSB= 0
##$STSI= 0
##$STSR= 0
##$SW_p= 3612.71676300578
##$SYMM= 0
##$S_DEV= 0
##$TDeff= 0
##$TDoff= 0
##$TI= <>
##$TILT= no
##$TM1= 0
##$TM2= 0
##$TOPLEV= 0
##$USERP1= <user>
##$USERP2= <user>
##$USERP3= <user>
##$USERP4= <user>
##$USERP5= <user>
##$WDW= 1
##$XDIM= 8192
##$YMAX_p= 0
##$YMIN_p= 0
$$ End of Bruker specific parameters
$$ ---------------------------------
##NTUPLES= NMR FID
##VAR_NAME=  TIME,          FID/REAL,        FID/IMAG
##SYMBOL=    X,             R,               I
##VAR_TYPE=  INDEPENDENT,   DEPENDENT,       DEPENDENT
##VAR_FORM=  AFFN,          ASDF,            ASDF
##VAR_DIM=   8192,          8192,            8192
##UNITS=     SECONDS,       ARBITRARY UNITS, ARBITRARY UNITS
##FACTOR=    0.0002768,     1,               1
##FIRST=     0,             0,               0
##LAST=      2.2672688,     0,               0
##MIN=       0,             -514769,         0
##MAX=       2.2672688,     429594,          0
$$ Real data points
##PAGE= N=1
##DATA TABLE= (X++(R..R)), XYDATA
0@%%%%%%%%%%qJ6j6K3l1L9m7N5p0Q6j02J25j48J72k04K42k81L25l79M37m99N69
32C04o47P33q31R37j053J181j323J478j646J831k035K256k496K760l047L362l707
49a943M084m499M957n463O022o649P356q151R059j0111J1339j2796J4562j6755
63h988J9558k3289K8530l6483N0120p9702K56630k64083m44083N69505K91863
74C59578k91187k93605J47230J24906L1851J0387j02453j97262J38504K93585
84B21534m9255l79398m8389L90286J41882l52875j63038K32973J69787j07028
94E6479j19764m770K9631Q2203R3326j46340j67435J65895J84932j45576j54255
105a25674J05673R2901q5418P661P3687j19270o6844J91608P1330k06182j05933
$$ y = [0, 0, 0, 0, 0, 0, 0, 0, 0, 0, 0, -8, 8, -8, 15, -16, 23, -24, 31, -39, 47, -55, 70, -78, 94, -110, 132, -149, 176, -203, 234, -265, 304, -343, 390, -441, 496, -557, 624, -699, 779, -867, 964, -1071, 1185, -1311, 1449, -1598, 1764, -1943, 2141, -2358, 2599, -2864, 3158, -3491, 3865, -4286, 4773, -5338, 6001, -6795, 7767, -8988, 10570, -12719, 15811, -20672, 29448, -50254, 206376, -57707, -501790, 67715, 359578, 68391, -225214, -77984, 46922, 78773, 89160, -13293, -210555, -72051, 221534, 172279, -207119, -255508, 134778, 276660, -76215, -239253, -6280, 163507, 56479, -63285, -68055, -38424, 43779, 137105, -9235, -176670, -10775, 174157, 28581, -125674, -20001, 72900, -12518, -4857, 68830, -50440, -117284, 74324, 145654, -60528, -166461]
116a66461J91102J37730j69779j32584J37835Q7370r8250k1609Q1503n8725r6632
127a08500J55348J21182k35444j29527K66410J35368k46012j41401K02930J25909
137A46263j48834p6402P8977J0828j2797M2890k3134r0123K3643J32839j4082
148G0068j57097M048J47638J1536j19507k5603R3003J7325o1474J5735J7439m4656
160c1545L1824N7772o4223n9548Q3500N6778j02145l9141J15432O072j11965J8096
172c9093R7710k3924r1242K2537Q5944k8252o8115L1671L6553l0085p225L6640
184B3119j7637o0076M8057Q7419p5904j00207Q6605J05043p5433j05749O1328
195b3435R0973m5594n2299K1734M742N215L2414j9077n9853J1377Q2731R21r6149
$$ y = [-166461, 24641, 162371, -7408, -139992, -2157, 85213, -13037, -34646, 46857, -11868, -108500, 46848, 168030, -67414, -196941, 69469, 204837, -41175, -182576, 20354, 146263, -2571, -78973, 4, 10832, -1965, 40925, 17791, -72332, -48689, 84150, 70068, -87029, -82981, 64657, 76193, -43314, -68917, 24086, 41411, -20063, -4328, 13111, -31545, 279, 58051, -6172, -65720, 17780, 74558, -27587, -66728, 48704, 54776, -57189, -39093, 58617, 34693, -56549, -34012, 51932, 23680, -44435, -12764, 23789, -6296, -13521, 23119, 5482, -54594, -6537, 80882, 4978, -95229, -8624, 96419, 20986, -84763, -23435, 67538, 21944, -30355, -8621, -3879, 1336, 33750, 14673, -45180, -33803, 48928, 49849, -46300]
208d6300j1070Q6804K3368o5759l6434M8338L3010l2474q758Q818j8376J6685
220b148L9085k8891n4858L1735O9961l5850o9384M1369M9666l6920k5522K6393
232D636R176k4768L331K9832k0526l0373K9634K3719k5559k2481J8105K5442k1430
245a262j8835K8178J212k7106J4118K5981k0888l0987K9995L6819m1046k7507
257c1328M1721J1025k6453k210J1287k779n235J3967j255k8073J0316L1314j3350
270H947k8693L152L0076O739l6339n449L2469M34j8368m57Q337j035k423J3838
284A1228q457k5176K6313K5418l4394j9427K9532J9358k3880j9755K2029J0423
296A3212j6446J452K382n635N722L176j331r595l964K0278J681k3947J98K0531
$$ y = [-46300, -57370, 29434, 52802, -12957, -49391, -1053, 31957, -517, -9275, -457, -18833, -2148, 36937, 8046, -46812, -15077, 54884, 19034, -50350, -8981, 40685, 3765, -21757, 4636, 13812, -10956, -7625, 22207, 1681, -28692, 942, 24661, -898, -23379, -5274, 20168, -1262, -20097, 8081, 9293, -17813, -3695, 22286, 1398, -29589, 406, 37225, -3821, -31328, 10393, 21418, -5035, -7245, 4042, 1263, -3972, 9995, 8740, -19333, -9017, 22297, 8947, -19746, -16594, 13482, 20221, -16118, -21567, 10902, 11336, -7032, -7489, 848, -187, -2610, 11228, 2771, -22405, 3908, 29326, -5068, -24495, 5037, 24395, 515, -19240, 2789, 13212, -3234, -1782, 600, -5035, 687, 3863, 2532, -7063, -11027, 9251, 10932, -13015, -12817, 7714]
310G714M952k1335n870K5916k978k0002J3386O109j3284L760J0314n394j2240
323h952Q529J4590j6370p914J6015m59p763j189J784O342o046m503Q257j189m794
338c662J361L311J068p929L473J0396j1934j910J3375n661p203O486N109n714
352E66o443J0718K529j3278M645O903o411O58L5j303K704k668M58Q07l258L097
368b41J294m84l622l470J0991J865j5314M643J1798n506n559K191M608k068j500
383c74N451o316l466J1206j871q286J716J907L134j078n561R41K296L093k401
398C91o422N402J984k970L400m139l036Q232M57n524l7L571P83m061M812J684
414D527j0263M416R943p353n251K276L914K242n051k397J153K730K416n215j814
$$ y = [7714, 12666, -8669, -14539, 11377, 8399, -11603, 1783, 7892, -5392, -1632, 8682, 3288, -8952, -423, 14167, -2203, -10117, 5898, 5439, -2324, -3513, -1729, 4613, -1433, -5936, 2321, 1132, -3662, -2301, 1010, 2078, -5851, -2378, 8018, -3916, -5826, 7549, 1888, -5315, 1171, 6280, 566, -5877, 4841, 7370, -5908, -1263, 5640, -771, -113, -78, -1381, 1323, -1345, -887, -80, -3338, -241, 1053, 569, -3053, -6523, 4468, 6333, -8981, -4338, 7460, 1954, -3605, -1414, 3194, 1126, -374, 5077, -1239, -4705, 6501, 4630, -3656, -1940, -33, 3101, 2023, -3538, -2597, -301, 2792, 391, -6031, -629, 1355, -1615, 1785, -2354, -5390, 2842, 3299, -2225, -2262, 1309, 2092, -1969, 2843, 4527, -5736, -1320, 8623, 1270, -3981, -1705, 2209, 4451, -600, -2997, -1844, 886, 3302, -1913, -3727]
429c727M297l263L442M680j0183l548J1027O017q961j0237Q683J0547n385n860
443b471k864M708J0383o242r399M566L694m2r6j154m426l135J1962N337j8111
458g290n154J4951P578p542j3840K334J7223N7j3653l468R510N646p677M60M646
473C781j0539K439J7420m962j9540j55K2032P031k3074j0623J7450J2498q127
486E631j6138J139J5915j551o967K130m756k720J0400R621j2627j9879J4471K6224
500B0893j1610k5255O72K3147J3768k1840k0160J6351J9683n854j6141k565J0729
513A818J920K290K63j7037k292K2412R631k1134k2542J5355L3613r483l5584m77
527b1247L1632J2525k7472j5953K0795J0013q161j258k300o516N150J6198m18
$$ y = [-3727, 570, -2693, 749, 5429, -4754, -8302, 2725, 8742, -219, -10456, -1773, 8774, 3389, -2471, -5335, -627, 9756, 3514, -5885, -1319, 2375, 2333, 2237, 1083, -3343, -6478, 5484, 10821, -7290, -12444, 2507, 10085, 2543, -11297, -8963, 8260, 8317, -5336, -8804, 706, 6352, -1325, -865, 3781, -6758, -4319, 13101, 8139, -11401, -11556, 10476, 17507, -5567, -16190, 1260, 13758, 5631, -10507, -9368, 6547, 4996, -1971, 159, -4597, -7317, 3083, 12704, 77, -19802, -5331, 20893, 9283, -15972, -15300, 7847, 21615, -225, -20385, -4034, 15649, 9795, -6346, -8911, 1818, 3738, 6028, 6291, -10746, -13038, 9374, 19005, -2129, -24671, -9316, 24297, 14814, -20770, -21247, 10385, 22910, -4562, -20515, 280, 10293, 2132, 874, -1426, -7942, -2792, 13406, 12988]
540A2988k6863m131L1191R083k5602j9211J7223K7587j1846k7346N865J8179J419
553H536r520m545K555j452O419R285j3081j3656J0843J7178M4k1641j0142K3892
567D715J5764j7149k0028P892K3238k626j8841L76P310J902K814k528o885n220
581i266Q641J5554j0136k2443O320K4345L649k6437j1888K6247J3823j9648j1537
594a2776R457R394j856l863l27n936J792J4253j589j5452l482J2393J2674j1071
608C611j7767Q188J6581k566j3607m204J1174M204m844j832k934j77P167L63l868
623e11m107j26Q244L432o937p488K808J3324J70j5275q02J0907L180n134n407
638c722R27L688J653J877n554o276N519P890j59j0382p164J3378J0023j1886j0864
$$ y = [12988, -13875, -18006, 13185, 22268, -3334, -22545, -5322, 22265, 10419, -16927, -11062, 7117, 8536, -984, -5529, -2974, -4426, 1993, 11278, -1803, -15459, -4616, 12562, 12606, -9035, -19177, 4715, 20479, 3330, -16698, -8806, 14432, 11806, -7035, -6659, 651, 2553, 5367, 2839, -4046, -9266, -625, 14929, 4793, -17650, -11330, 13015, 16664, -9773, -21661, 4586, 18409, -1239, -12776, -3319, 6075, 4219, 356, 29, -5907, -4115, 10138, 8549, -6903, -10385, 2008, 14682, 3611, -14156, -5968, 10613, 8047, -5560, -9764, 1410, 5614, 770, -1062, -3996, -4173, 2994, 3357, -511, -4618, -4744, 3500, 6932, -5, -7493, -4685, 8639, 8809, -6466, -7268, 3639, 6819, 1685, -3722, -2795, 893, 2546, 4423, -1131, -7407, -1888, 6002, 5843, -4539, -11703, 1675, 11698, -188, -11052]
653a1052O997J1054j611r576q44L539M509L509p377o074O101P250j327p959l878
668f739Q012N666m096p193j418Q052M912q305m194K824M901J776n678l682L391
683a771M687j25n148j438M970q14N28M33m158J535M914q84m376r03M290J542l413
700a31m88K82o9K846k415j688K073j462J483O35l269J21J925K221j191m925L070
717i82L425k220j269k80L73K641o4k207n91J244L329k678k525K419k3M41K44l428
735b151J381L054j476k074p16K226J005k532K20n2P55K548l158k239L827N86j248
752d4o29k15J898J52o17o49j432L215R98m288Q12J832j84N6k993L79K955r19n31
771b04j593P88L068k374j112J639j304J009P73k038P06P99J479j270k163K256
$$ y = [-11052, -4055, 6999, 5388, -4188, -5032, -1493, 3016, 6525, -852, -6926, -825, 6425, 5098, -2861, -6739, 1273, 6939, 2843, -4350, -5768, 2284, 7196, -1109, -5303, -2479, 2422, 4198, -1480, -5162, -1771, 2916, 2791, -2357, -3795, 1175, 361, 889, 1322, -2836, -1301, 3613, 2729, -1647, -2550, 1740, 3282, -131, -619, -337, -406, 2440, 25, -1663, 410, -1052, 431, 1066, -2203, -2082, -157, 2064, 873, -4052, -982, 2443, 223, -1046, -1326, -953, 1688, 1624, -583, -1174, 70, 3399, 721, -1804, 615, 592, 1033, 1277, -2151, -770, 2284, 808, -1266, -1982, 244, 1249, -1283, -1063, -1115, -360, 2188, -970, -3209, 618, 1204, -44, -673, -888, 1010, 1162, 545, -104, -1536, 1679, 2677, -1611, -799, 1033, 849, 905, -2088, -1709, 1246, 327, -204, -1797, -1009, 2059, -315, -1427, 212, -1092, -83, 690, -1348, -642, 157, 1636, 366, -1797, 459]
787D59J032j825J055r32n29K743j765j057J501l92K83q20k65Q38r58J032r4k308
805b002J675Q03j501Q09jJ23M10p67M30m03qJ551j528J25J572j751P24Q85j205
824e9J92J54K65K05j836J338N63j274R07j207k54J667q55l47O17l70j05R22n42
843a9n36o74K341L99l029J085J981j070l14p93Q65J289j355j67n9j32J135q69
861G8l03k24r95K254K13l010J205J454o27o98l69J382l14j010J951j347j099K638
879A179N2j352m66O71J305j042j077J541p85J57J18k40N80j179L8K203j748j895
897a940J746J060p30j579P98J360r04j15Q12j803J070J311j240k42L55M31J50
914E40o11O01k01j137K065k39j840J24R11J291j588k095K653J103k489r19J575
$$ y = [459, 1491, -334, 721, -211, -740, 2003, 238, -819, 682, 290, 573, -247, -512, 326, -632, 400, 306, -2002, -327, 476, -1025, -216, -217, -94, 316, -451, -21, -424, -432, 1119, -409, -284, 1288, -463, 261, 1146, -59, 133, 287, 552, 757, -1079, 259, 822, -452, 455, -752, -1006, 661, -194, -541, 76, -294, -399, 523, -19, -555, -1229, 1112, 1511, -1518, -433, 1548, 478, 164, -629, 236, 1525, 170, 3, -56, -188, 947, 78, -225, -449, -1444, 810, 1023, -1987, -782, 672, 45, -653, -1022, 360, 46, -964, 987, -360, -1459, 1179, 1231, -121, -587, 84, 1389, 347, -730, 811, 26, 183, 301, 61, 641, -538, -500, 1703, -45, -1940, -194, 866, 136, -1443, -645, 715, -189, -304, 508, -1295, -225, 1086, -154, -396, -41, 390, 540, -71, 530, 329, -808, 1257, 1018, -822, -698, 213, 1504, -84, -2179, 474, 1577, -912, -1831, -256]
931b56J739k644r73L833p34m241K543K343p81l052J864L626k793l024L035K081
947B566k449j575J527K229k459k057L841N02l677j20K443J174k996j442L783k33
963A057j967J41J90Q96m62j270J498J096q70p54K02J953j487k913L545K120l512
980e37j147K050K310j513n062L943K870k911k652K759K058l106l038N629J263
995B916o332R34N469p03n367J46O356j441n579K551L458p98k683K88L280k024
1011D71l261L654J715l392r96K436J697l044k370L313J924k690o73L04J312L89
1027G89j714L45O97N34k17j614J418P71k732J250K543j469k428J780K641r50m521
1044b877J794M645k588l183J638K532l86m871K882L734m713j194L706J351m334
$$ y = [-256, 1483, -1161, -2134, 1699, 965, -3276, -733, 1610, 829, -2223, -359, 3267, 474, -2550, 485, 2566, 117, -1458, 69, 2298, -161, -2218, 1623, 2125, -1552, -1672, 771, 1945, -1051, -2493, 1290, 1057, -910, -769, -579, 317, -145, -1415, 83, 1179, 309, -445, -243, 1710, 223, -2690, 855, 2975, -537, -1684, 366, 2676, 1163, -3899, 44, 2914, 3, -2649, 110, 2168, -938, -3976, 1653, 2916, -3416, -2482, 2987, 2284, -3083, -2937, 3419, 1978, -3601, -1050, 2408, 1610, -1073, -785, 2495, 471, -2790, 864, 2579, -813, -1809, 627, 2324, -720, -3090, 223, 2147, -543, -1216, -912, 400, 789, -925, -580, 117, 651, 434, -1180, 238, 1009, -1723, -473, 2070, 601, -1827, -47, 2594, 1644, -2877, -1083, 3562, 974, -2209, -571, 1961, 1575, -3296, -414, 3320, -1393, -2587, 1119, 2470, -1864]
1059a864j136M763R98n147K52M580j149j909k5K281K28l254J586J962k950N91
1075a93J415r78q01n16J621J030k502oN12k49J440l26j241P19L34J188l121K57
1093a417K333k26o82r8M97l21q37J006J408k034p73L054l00l064k0K813M78l537
1111a720P52L250j421l158K692N42j395j450K786N37k914J24L364j126k651Q13
1127i75K559p99k038J528Q88j254o64J244K14p44m78J663k78l124K378J148j400
1144a32q23J701q95j316J271J616j382j700J807K30r05o71K241R3j799O3K139
1161A538j632j305J797Q31r85q84J150R48k340N7J850o96j322R57Q77o60j636
1178a455J175J449k457K71K076n28j468P48J682j074j811J484R35j021KN4M95
$$ y = [-1864, -3000, 1763, 2761, -2386, -2134, 2446, 1297, -612, -637, 1644, 1872, -1382, 204, 2166, -784, -193, 1222, 244, -557, -1073, 548, 1578, -924, -930, -418, -667, 773, 447, -794, -75, 259, 1447, -1674, -1417, 916, 690, 8, -90, 407, 86, -751, 255, 1663, -371, -1144, 1910, 1610, -1454, -1474, 1339, 1817, -1720, -968, 2282, 861, -2297, 395, 937, -458, -1908, 878, 1415, -1499, -1375, 1989, 863, -1788, -975, 1584, 785, -1253, 275, 1163, -91, -755, 489, 703, -41, -519, 1144, 866, -2258, 120, 1268, -132, -955, 746, -149, -1465, -194, 1422, 40, -1660, 147, 377, -528, -1199, 1042, 1135, -664, -601, 1538, -94, -1399, 398, 1229, 244, -640, 510, 1458, -882, -825, 1025, 329, -993, -36, 841, 181, -1455, -280, 1169, -1288, -1017, 1059, 531, -937, -189, 1493, 419, -1392, 92, 1027, 6, 8, 62, 557]
1195E57p25r54K315M66k026J32J497j415n45J671K08j319m00J633m34j873J63
1212a049J995j898N25M69M59j006j33K380j074k291K386J89j282q96J023J000
1228G97j119l1J662j774m25J462L07j078j484J976J657k330j115K841j134j75
1244C7J19J395j497q38O95Q98j031j933K136K96rj871K786J39k273J511O75o66
1262E69o85J265n56J39k185J925O89k680R71J082j128KN52M40n92o65J140kj108
1281h27Q68N27m78l95j94J338n37j310J228Q4n16M52l5K10n42J1O99o78p25J415
1301E95mj147J64N64J11j107J46J382q52o94J162j34m69j3M72J94p45L04Q10m06
1321C33o13L00M91j79r70P16P30j022l10Q05j50l15k20N38q7q61P99K84o80J07
$$ y = [557, -168, -1122, 1193, 1659, -367, -235, 1262, -153, -698, 973, 1181, -138, -538, 1095, 661, -1212, -1049, 946, -952, -427, 42, 501, -505, -638, 1742, 668, -1623, 763, 952, -330, -1226, -203, 797, -322, -353, 1309, -465, -890, 572, 879, -199, -1683, 293, 1950, -380, -1495, 1346, 212, 37, 156, 1551, 54, -784, -89, 809, -222, -2155, -19, 277, 268, -1603, 1183, 1322, -951, 560, 1235, 569, -116, 1149, 593, 732, -1453, 472, 1161, -1519, -548, 534, -594, -592, -40, 400, -192, -857, 283, 281, -827, 41, 568, 90, -305, -499, 839, 302, -1008, 220, 304, -212, 240, 205, 415, -127, -116, 583, -95, -820, 595, 591, -556, -392, 172, 283, -824, -678, 704, -148, -842, 320, 186, -283, -296, 176, 370, -375, -71, 739, 333, -280, 20, 511, 332, -638, 78, 808, -214, -524, 281, 131, -184, -404, 134, 47, -814, -15, 269, -411, -304]
1341c04L47k3Nm8J26o4l95N69j36l09M67p5k56J69l00P63l54m80M59r5K87k60
1363I3q2K05k16k96O56l53m30N28j10j99O4j41N65o52J79O35n18P5R9N7N8j21
1385I6LK05k97J38Lm28L70k02R9K28l09rM73r13N17K81l98j7J8K41o5l98M73J86
1409B95o44K44J76j47K23m82J78N47k32k49J93K2M9p33O49L68p31r2L83J58k71
1430i6j75J89K93m12k06M42K45m53o87Q68O32r81NN25K50l00n03N82N66r35O6
1451h5N24m08k25LN18L81j133K07M26%n25j78Q11K6j162N67M29j21o57M55J99
1472E2M05q81J9Q20m07m81Q0Q20J28j358L35J276r17k31L24N05j05j005K88J047
1492G14r90k75N92N67m22r43O25O78p07m64P49M17o91m70Q08O01j164J30O78j15
$$ y = [-304, 43, 20, 25, -23, 103, 39, -356, 213, 77, -232, 235, 160, -96, 73, -227, 536, 182, -298, 161, 66, 353, 93, 11, 216, 0, -296, 360, 7, -423, 105, -5, -204, -140, -281, 284, -368, -189, 446, -72, 3, 102, 159, 217, 96, 99, 304, 7, 145, 148, -280, 90, -112, -13, 215, -94, -103, 370, -543, -26, 255, -143, -160, -142, 99, 34, -364, 109, 295, -349, -105, 71, -76, 147, -335, -157, 390, 158, -91, 102, 124, 173, -560, 89, 457, -274, -366, 17, 175, -96, -271, -82, 211, -201, -407, 35, 280, -173, -860, 8, 640, -341, -336, 189, 439, 139, -364, 218, 784, -151, -85, 439, 31, -194, -191, 327, 708, -425, -218, 208, 208, -317, -495, 316, 342, -820, -253, 176, 55, -602, -147, 52, 457, -424, -405, 415, 8, -473, -393, 427, 555, -803, -468, 808, -109, -340, -16, 489, 384, -621, -333, 714, -276, -551, 41, 608, 186, -757, -132, 546, -161, -625, 124, 541, -150, -620, 188, 789, -375, -245, 433, 318]
1512C18l37k10J48N58n94J30J42J07p0m26J67M39n86J15K25P0p8l33m6N26m23
1533a58l22J051l16l16l99P94L84r56k23P02K20l99m54O58K77q21o4O19r3l19
1553a35k57O15J12r14M43M18l25n00N71J85k22l48L02K59k94o8K63K16n37L98
1573A82k56K32j3k41J47k8L56k76k31K14r9k73J92O7O6k21k27J64N04p32L67j9
1595a25L82n47l81Q72o6l07K84Q3l68J76J69Q8m29k8N33q4m87M54K05k23n20K31
1617h8N24o21O3J00J07j34l77M25K78n17Q5N00m61k12M37l19J83L4qK23m97K37
1639c8J98k49L37k4o1l78QL76j84m31M67J17l79Q6J4J19K2k51L47Lm58K47J25
1662A3J23k73k09P41p07j70P03K54n32m5J14M80o31J21K83l98k70L75L10l09n5
$$ y = [318, -19, -229, -81, 477, -117, 13, 155, 262, 192, -234, -67, 372, -214, -99, 126, 196, 118, -215, -261, 265, -158, -480, 571, 255, -61, -460, 334, 718, -238, -461, 241, 461, 62, -392, 266, 543, -278, -342, 277, 184, -135, -392, 223, 335, -579, -136, 282, -43, -543, 28, 213, -9, -357, -55, 204, -90, -158, 105, 321, -216, 182, -74, 158, 145, -96, 51, 23, 379, 103, -128, 86, -13, -286, -94, -27, 39, -182, -409, -245, 259, -473, -106, -125, 257, -290, -671, 201, 135, -172, 112, 195, -173, 3, 172, 260, -169, -197, 336, 252, -235, 219, 424, 201, -319, -88, 436, -185, -122, -22, 85, -49, -426, -1, 277, -240, -155, 345, -116, -328, 109, -210, -27, 7, -1, 222, -275, -38, 160, -89, 248, 224, 163, -215, -207, 169, -15, -446, 21, 138, -241, -155, -141, -22, 0, -251, 96, 99, -359, -112, 13, 136, -137, -346, 395, -312, -482, 221, 475, -57, -102, 12, 492, -139, -18, 265, -133, -403, -28, 282, -27, -82]
1683h2J27K52o15r8N05J8l13J77K62j50l56K95M24o08J05K94k97l5K96j17j27
1704d3j12J54K76k42P2J20m39L62m76J80R8k63O9J63m7N1Q4k1M3k10M39J28o44
1727b58K09K51l78K40j72M20l53j58L95k2n48O58k14l3R9l40M15l56l52O61k8
1748A36k32j41O24k30n64L45K17l19k1O03q6k07k88J85K70k40PK9J60k82J00J44
1770B10j40k54J43L85p23L92j64M9O2J6j1j98r4K87m0j21M34j78L0l29N55k04
1792A07K2q7L20l67j88M15L3k28j05k7L09L1o87N90j25k78O6J70N5k01K17k94
1814b52L20k04K08l7k7M3K9J54l11L4L83k61j62K77j7K23m79J72J22k73J33K90
1836C65l50l83L03N6j60J01j76L91n00RN47j68L2m27M50P0k95qJ83K34k36M44
$$ y = [-82, 45, 297, -318, -416, 89, 107, -206, -29, 233, 83, -273, 22, 446, -162, -57, 237, -60, -95, 201, 84, -43, -155, -1, 275, 33, 105, 225, -214, 148, -328, -148, -50, -313, -244, -81, -128, -77, 7, -14, 29, -181, 258, 386, -258, -49, 202, -176, 64, -108, 312, -41, -199, 196, 174, -374, 284, 70, 37, 136, -204, 211, -145, -497, 164, 136, -96, -237, 387, 157, -407, -62, 155, -164, -185, 418, 332, 125, -163, 22, 292, 52, 59, 88, 248, -34, 66, 210, 70, -184, -41, 344, -379, 13, -151, -102, -40, -24, -35, -233, -327, -40, -80, -201, 233, 55, 85, -244, 311, 107, 129, 42, 362, -5, -193, 222, 255, 27, -78, -105, 204, 235, -452, 138, 13, -265, -199, -29, 26, -175, 42, -252, 68, -136, 72, 35, 8, 51, 80, 234, -77, -43, 340, 79, -83, 194, 177, 400, -79, 93, 215, -58, 75, 365, 15, -368, -65, -9, -169, -68, -244, 147, -353, -344, 203, 35, 67, -360, 90, 160, -135, -143, 40, 274, 38, 482]
1858D82n19j31j86L24K60p3J70K18p36rQ1j58j75r4K24Q61j176M91L08P4p35K44
1880b55L38L43o6l59o4l05J02M58l13l42K98L48k74O66o39J35o9K19o1n02k57
1901e99N95K79r5l90J57J46l85Q91o06M57p95N5M59k2k25p7k3J33J98j65J2N3
1923E3k28K72r8N6n68P01L8j15k11j83L50l08J46j02L21k82K73l30L57k22j11
1944a91L05k5J41k8l52K74Q4l67J32K40l94k09N88J00l23J43K13l36l7L49k59
1965D8J73M37j374J21L63K38N93J53o52n18N10j1M35l20m70M00k33j21K90pR8
1986A53k19Q5R3K3j14Q8k86K07j51kK42q0j68K85k27J56n1l85O75k51l89Q9J96
2009c1L2Ok70K92n5o5R1j54J84k57P5R5j4j36M52j72j17J16k2J13k61j52L84O3
$$ y = [482, -37, -168, -354, -30, 230, 157, 327, 545, -191, -200, -119, -277, -452, -546, -322, 539, -637, -146, 162, 236, -499, -255, 83, 426, 360, 1, -63, -368, -266, 192, -121, -463, -165, 183, -91, 575, -64, 71, 2, 221, 160, -342, -599, -4, 275, 180, -210, -53, 93, -292, 599, -7, 450, -345, -290, 169, 147, -78, -155, -178, -45, 153, -12, 0, 53, -175, 97, -1, 55, -513, 188, 226, 111, -100, -283, 67, -241, -95, -197, 124, -158, 115, -215, 142, -80, -191, 114, 89, 230, 202, -150, 124, 208, -159, -27, 213, -181, -390, 198, 298, -25, 118, 331, -5, -42, 307, 48, 221, 658, -716, -595, -232, 6, 599, 752, 100, -418, 92, 81, 516, 196, -274, 126, -107, -228, 62, 55, 153, -66, 19, 112, 135, 21, 109, -177, 30, -121, -123, 119, 39, -129, 156, -71, 85, 34, -351, 324, 73, -316, -227, -31, 1, 7, -263, 29, -26, -91, 0, -154, 30, -227, -152, -57, -71, -207, 245, 73, -44, 72, 50, 163, -98, -250, 134, 197]
2033A97k26k53l6M29m70J06k25R92p49O01k19j1J5o58J193j023J1J286m89l18
2053A53n57j77R16n96l2J29K38j03l27L88J1J04j42r5qJ12K8J3L7JNQ1q9J56m9
2078A97j39R3l50K34K20l43Q1j2K06j67J88m67J07O1J6P0l34L37M11n21l41K20
2100b33K64J6k73M04J41n43O9L22k43j9J30J05k57KJ96R0m14K26J27l27O7j36
2122b86L27k55K6j1K17k88M22j29N8j05k14Q35q11J04L50Q9m21K19j2l4J0k4K42
2145C09k83qJ15k19O5j55K30j03j07j45N98m51J90k7J66j71k64N23j45j78l1L43
2167B52j15j82K3J22J75k63J80k65p1J15k07J28o1n6O03k39n65N96r3j22J3j37
2189a69J61L8k73J69J73l29K76J45j75q7N4K4j43J03L35k3k86Q6p2J88j95R4n
$$ y = [197, -29, -282, -318, 111, -359, -253, -478, 514, -235, 366, 147, 136, 151, -507, 686, -337, -326, 960, 471, 153, -404, -581, 335, -261, -293, -164, 74, -29, -356, 32, 43, 147, 5, -90, -98, 14, 42, 55, 92, 93, 98, 179, 90, 246, 197, 58, 151, -199, 35, 255, -88, -7, -19, 187, 20, 208, -259, -152, -91, -75, -5, -339, -2, 409, -112, -453, -233, 31, 47, -226, 178, 319, -224, -155, 167, -76, -95, 35, 140, -117, -115, 81, 171, -243, -17, 110, -217, -150, -286, 41, -214, -188, -199, 18, -270, 152, 23, 81, -24, -238, 597, -214, -110, 240, 329, -92, 127, 115, 81, 91, 67, 309, 26, 18, 133, -86, -21, -176, 54, -49, -156, -301, 297, -154, 36, 9, 175, 4, -260, 263, 118, -60, -91, 252, 137, -45, -22, 100, 275, 12, 192, -73, -144, -29, -236, -108, -169, -225, 378, 139, -426, 170, 77, -45, -32, -169, -8, 30, -243, -74, 99, -230, 46, 191, 16, -71, -17, 7, -136, -33, 302, 279, -7, 79, 7, 195, 0, 94, 89]
2212H9q3nK46l94J00J02l02N43k58n5L9P0j5q8k4J08l8J87k04j62M85l30j5J40
2236A36r7J21k31j27K73P2l01K4J82oK8j92K39J68n03J27J98r0l7K00k38o0J75
2259F1o2m30K86K85O6k12P0j6J1j54J27Q0j15j95K25P2J9j04O0j30M2l92M53p8
2283c1o0L5J6J76k57JJ42j8j4L21l62K6R2j77Q9J77p7j8j85Q5J90k08m9K09o1
2308D2l1k18J83K43q3Jl14J22j54K13o3P5q8n3K05k56J03O6J80k22J67k01J95
2331A12k57K42n8j12k0j87M40j08l22L74l37pJ36n6J32N3m3K59j66k02K81J7k94
2354a23J14J22j10%j13L17k10m9J86k05J01j64K49nj29K00K7l98J03J49j87K48
2376A23k34K99j73J43k44M3m1O8L21l41J89q9kR3m18M93j56j54J33r8j8J13k94
$$ y = [89, 6, 1, 247, -147, -47, 55, -247, 296, 38, -17, 22, 92, 77, -11, -35, 73, 35, 222, 18, -144, 341, 11, -4, 136, 39, 160, -71, -198, 75, 147, -154, -130, 52, 46, 74, -118, 121, 289, -214, -87, 111, 21, -16, 184, -54, -114, 61, -1, -431, -145, 140, 206, -6, 64, 48, 59, -95, 32, 112, -3, -198, 27, 99, 118, 14, 74, -56, -14, -406, 47, -31, -91, -56, -40, 136, -121, -120, 22, 4, -10, 311, -51, -25, 67, -110, -21, 156, 79, 61, -124, -39, 151, -57, -106, 103, 42, 11, -207, -24, 219, 136, 137, -177, -55, -209, 4, -59, 16, -72, -125, 80, -176, -73, -7, 173, -49, 118, -83, 112, -145, 97, 39, -73, -93, -280, 160, 52, -270, 104, -233, -240, -104, -160, -28, 25, -18, 241, 75, -127, 154, 171, -123, -9, 113, 3, 3, -110, 207, -3, -52, 134, -71, 30, -134, 115, 110, -19, 181, 208, -190, -87, 62, -125, 123, -111, 188, 15, 158, -86, -43, -84, -16, 305, -36, 153, 64, 62, 155, -263, 230, 74, -80, 53, -45, -63, 50, -244]
2399b44N94l65j66k8K69K64m22J8L80k27o1p7o5Q7J13l44K04J84j12M2j00M2j05
2422a19j3K44Om0k7L1p7M0k68L49k4k31Q2m5m5K20j41j18K48l62K61Q4K57l04
2446Hj23M06l5l74L67p8l81J90L29k77K06j84j93J44J53J05m77J98O7M3k44K36
2468H6M1k03l6J67k82L51l06R4J01j9q9J39j85K57ml7j20R4k4j58J07j69M25m11
2492a81L13j44J04k15K10K49p41M35L9j2j54L41j59l37J30P0k58M90J6j37J78
2513B37j77k53O06l51k56K57O6k26k32K04K44q8j08K9l4J99j00K47j63k61J90
2534C0r3O4J97j07J87m8k92r1J55J58k94J76R3m5j30J25J14k18K17l90K62J03
2556A73l40K77j23J11m3K94l66k8j63K72N7j50J15l70M51j12L0k73L79j83R5j02
$$ y = [-244, 350, -15, -181, -209, 60, 324, -98, -80, 300, 73, 12, -65, -130, -43, 70, -274, -70, 114, 2, 44, -56, -14, -119, -132, 112, 118, 78, 51, 82, 5, 45, -223, 126, 102, -129, -47, -92, -137, 83, -58, -176, 72, -290, -29, 55, 312, 8, -115, 291, 256, -118, 249, 171, -210, -20, 309, 32, 238, 54, -139, 5, 158, 263, -214, -16, 51, 94, -150, 86, 127, -76, -112, 55, -227, 124, -182, -88, 13, -6, -95, 44, -141, 116, 112, 75, -45, 49, 25, -133, -26, -195, 230, -181, 132, -12, 92, -123, 87, 336, -405, 30, 69, 57, -97, 244, 85, -252, -122, -52, -310, 180, 196, 59, 237, 60, -193, 413, 62, -194, 63, 129, -97, -329, -125, 119, 31, -77, -48, -82, 117, 17, 264, 101, -160, 30, -63, 1, 198, 91, 278, 230, -62, -153, 2, 160, -134, 42, 135, 90, -40, 85, 199, -19, 198, -192, 70, 173, -167, 110, -13, 98, 55, 349, -17, -45, -208, 64, 121, -29, 86, -284, 167, 55, 85, -188, 191, 8, 103, 1]
2578AJ24j87n3J81k07J57MJ09j0k03J36n0J55l58J38O7m1J30l3k05J37J44j65
2601b9K6Jk67L01J38M3q5k26K39k68J62J19j86K37J62l54j76p9K38J67j74J40
2623A29j15J7Ol40K57j84K35J91k37J11Qk22J92K82l39J41j71n2J98j52L10p7
2645A88j69K09m38o3K17L5OjQ8r9J12k5k02M17k96O1J75j49j18K6J54j67k6K15
2669A50l61K12J43l15J84l2k14J88j18O6L20l67K85j69j94L36L5k9M8k82K49J9
2691A54l61J45J87k19K63j23K25l29j80J99j94K22q2n7ON7o1K77nk11K4p6L78
2714B39l44k9k6o6K95n3K4J25l05K42q6J29k88L72k84j80N08m76J19J14K4j16
2736f2R6j53j1p1K19L6Nk9p9K71k21ol3mJ88j58J53p0j03Q8n2Jm06M19J80j65
$$ y = [1, 125, -62, -115, 66, -141, 16, 20, 129, 119, -84, 52, 2, 157, -201, -63, 4, -37, 93, 60, -145, -8, 136, -29, -3, -2, -269, 32, 170, 213, 128, -98, 141, -127, 35, 154, -32, 205, 367, 13, -163, -242, -4, 163, -11, 129, 14, 31, 37, -303, -46, -230, 5, 196, -41, 70, 78, -144, 48, 330, -9, 132, -39, -91, 107, -45, 265, 188, 19, 228, -210, -273, -56, -21, -15, -16, 72, -27, 85, 60, -142, 275, -21, 40, 215, 66, -52, -26, 128, -39, -65, 150, -211, 1, 144, -171, 13, -19, -233, -45, -163, -97, 223, -144, 141, -28, -222, 114, 149, 120, 168, -114, 135, 154, -207, -62, 125, -94, 169, 46, 271, -58, -238, -39, -233, -11, -93, -150, -144, -87, -148, 129, 124, -87, -63, -139, 239, -105, -134, -160, -226, 69, 16, 40, 165, -140, 102, 16, 145, -143, 229, -55, -235, 273, -203, -84, 30, 54, -62, 34, -119, -130, -201, 18, 54, 59, 30, -49, 222, 1, -5, -38, -42, 146, -12, 141, 71, -32, 56, 4, 5, -401, 18, 198, 33]
2762C3j07K04m5j92J29O4K4j68R2j17p4M6K3N4J08j50M45n07R4K2J54j48j39M2
2786a13J4L8OJ42K2k46J94mM9p3l13M16J9l75N64m36n9J19m7J66k01K20k3m0r8
2811e9J81J2J51m12K80k49P0k0K00n90M00R6q1p6j64L95j38j60J73Lj3j7QN2J04
2836A46m37K85M15m29j4k4j26L53m89L16j01q9qJ17J13n1j58J47J17j96LJ13p5
2859g2l1L4K69l09n2J17M3J89j28l9o6K62k27J44p8j69P5o3M5Ll19L38J91j15
2883D2R4k42R2R2l17J91K30p9k42J27N1K33n03J25K53k23K11n1J7j2o6pR7l41
2907b28K05n3K09l9n6JM8k23lN9N7Q8j07K01j19nk2o0P7K8k13M1k6K66j34P9J3
2934H4j30p9K73O3k62N7j94K62J07k43M4l19N60j96l5j36J73O6J58j94j92l6L62
$$ y = [33, -74, 130, 85, -107, 22, 86, 110, -58, 34, -83, -157, -111, -88, -34, 74, -76, 369, -138, -44, -22, 132, -16, -155, -113, -99, -61, -55, 87, 109, -137, 57, 53, 102, 29, -284, 132, 151, -224, 340, -96, -155, -36, -83, 83, -118, 102, 79, 39, -59, 122, 134, 285, -127, 153, -96, -26, -46, 154, -436, -36, 60, -21, -97, -261, 134, -4, -164, 9, 12, -1, -18, -10, 42, 146, -291, -6, 409, -20, -34, -58, -184, 169, -320, -4, -105, -194, -202, -85, 28, -23, -181, -34, 83, -113, -110, 3, -72, -103, -69, 200, -109, -161, -44, -1, 188, 60, 21, -45, 217, -10, 134, 56, -113, -38, -101, -56, -53, -372, -34, 157, 42, 136, -106, -14, 78, -239, -48, 182, 103, -139, -12, 39, 272, -231, -106, 147, -76, 135, 84, 101, 89, 23, 16, 113, -228, -23, -76, 133, 94, 38, 39, 87, -136, -139, -80, -23, 65, -42, 159, 40, 35, 13, -47, 30, 58, -155, -114, -140, 126, -8, 71, 84, -46, -125, 148, 211, -51, 6, -188, 74, 181, -62, -18, -337, 223, 27, -8, -144, 29, 95, 253, 59, -133, -169, 193]
2957A93k01j56K43o6q7j4M9n5R1J66j53k82M40j75K07l40J52J90k49K4R0j86K19
2980A00K21k90Q1J33m87K88j80K9J23q6N7n1j63J67Q7l4O8N8j77qn4NK13j99K65
3005A66J7j47j18LK08kl54J94j03L3M74l92p8R1J8q1K96k50P8K60k21j22j6k8
3029g4K26k62J79j70K8J93K06m39L97j38j58j04J66j31O1K42j76o0k20K09j61
3050a86L82k31J86N9l23J22j39M1J18K01j40m8nj64L28j57k37J51k7j37J6L01
3072A11l00K85L5l5j15Rp0K58k41J84n9j64J24P6R1k96K1r3J55J40J26k48k16
3095b22L93k49K1j73J16o6J11L0J8J58j86j6L4L1K1j69J84O3qm5j59K9L55l33
3119f2l7J28J01k50P1J42r5j12R0O9l6q5O7J8J00l38J28L35k62J49N2k82J25J03
$$ y = [193, -8, -164, 79, 13, -74, -88, -39, -94, -3, 163, 10, -272, 168, -7, 200, -140, 12, 202, -47, -23, 67, -119, 100, 321, 31, 112, 245, -242, 46, -134, -105, 18, -68, -11, -62, -225, -58, 29, -5, 63, 121, -56, -64, -118, -113, 100, -99, 166, 183, 36, -82, -79, 129, 127, -227, -33, -136, -103, 371, -21, -99, -8, 10, -71, 225, -25, 53, 313, 92, -30, -46, -74, 152, -110, 69, -101, -73, 120, 326, -113, 284, 146, -12, -116, 50, -81, -20, 222, 46, -14, -234, -25, -186, 196, -35, 151, 210, -113, 9, -130, -89, 29, 230, 90, 42, 37, -127, 201, 44, -193, -42, -69, -206, -190, 111, -189, 96, 131, 96, -19, -10, -80, 178, -63, 121, 62, -102, 22, 98, 189, -107, -86, -179, -24, 116, 242, -6, -222, 171, -78, -57, -230, -114, -180, -69, -39, -21, 137, -49, -65, -31, 0, 21, -148, 36, 99, 91, 46, -113, -84, 271, -62, -99, 29, 130, -120, -49, 93, -2, -114, -24, 45, 9, -76, -9, 9, 109, -229, -101, 234, -28, 121, 173, -109, 16, 119]
3143A19o8m6n4J19Oq7J5J18j90J0k5J3K64n07K85J20k07K64j50j50j8K09O5k13
3167a08l9K31j60J29r6j34J74j02K83l5j9J10j40j57J00nP0j46j49K60j0n4J6
3190A9Kj11J25K31k69K76k19l40K13J49q4j16kJ92k52K39k2%K5K07l73L29l31
3213a12K1n2M2j40J83P5j43K3O6P6L6k32J31k3L6m1j37K92o6Q1m9m2P7o8m9J7
3239BP2J68l30J64QJk41J46N1p7m7K6l4J59j63%J50k52J03J98j32R7J0l5m0M3
3265D7Q6j35j77J46L26j87q5j23R2J60j20N6k59K30Kj90nm3K53K11m46J64l3j29
3289a59J00K36l81K98l39L32N9k46J60j22n4l0nK62p7j00J51j4j01lJ36k97K34
3312D0j69J39j04n7L4M26l74M0J24p0O5j43pj47L41j22J98k99j85K23K96j65j73
$$ y = [119, 51, 5, -49, 70, 76, -11, 4, 122, -68, -58, -83, -70, 194, -313, -28, 92, -115, 149, -1, -151, -169, 40, 105, -108, -147, 84, -76, 53, -43, -177, -3, -105, 178, 143, 124, 234, 94, -63, 37, 32, 102, -44, -193, 67, 57, 3, 19, 21, -90, 35, 266, -3, 273, 54, -286, -73, 76, -8, -124, -126, 66, -186, 53, 31, 31, 56, 263, -110, 219, -112, -91, -143, -101, -241, -58, 17, -126, -103, -37, 39, 75, -157, -26, -49, -13, -54, -191, 101, 35, 116, 67, 25, 102, 34, -15, 2, 74, 242, -88, 76, 84, 85, -156, -10, 41, -36, -83, -57, -91, 68, -95, -95, 55, -197, -94, 104, -28, 69, 79, 44, 4, 47, 133, -2, -179, -33, 293, 106, 21, -102, -10, 150, 30, 86, -173, 57, 59, -131, -136, -179, 74, 285, -161, 3, -30, -159, -59, 177, -204, 94, -245, 87, 146, -100, 60, -62, -116, -146, -151, 111, 34, -66, 85, 71, -30, -33, 103, -194, 40, -129, 10, -94, -151, -117, 309, -65, -25, 99, 29, 94, -49, -56, -203, 138, 16, 214, -85, -270, -47, 249, 84, -89]
3335h9N2L3L3j57M3K70m14K23o8K8o1K95j81J12n5M7m9k72L47j22O9j63j42K40
3359A9j45K97j65R8k28K01j64j29J43J05j20R9M6k9j24L6L12j35k02J43j30MJ1
3382e7K57j65m0n0j60K42j0%p2K31k06q7J85L6k29J76m2J26o7k19J46mJq7J75
3407H0q0l10J52K86k9Rj10J75m5Pm1j19M7j80K88q2P2j3Rk56lK64k56Nj1J77q7
3434e1J09j33K8J16k20L94k54Pq5J60N0j83Kj30L91j91q1p2P9k7P8K55l04K28
3458A66j1k41L67j34j33j07P31m32N30m20o20J55l8O8O2O0j49L62j87l56O25k87
3480A1j37L40l59P0J1M2L3j43J77j43K10k67J9J95j44K82r9J20K43j165L49N80
3502B25o21L97J17K23p28M71n11L50m9J35k53K4K74j33N5nM83k73j86k18O5K13
$$ y = [-89, -37, -4, 29, -128, -85, 185, -229, -6, -74, -46, -107, 188, 7, 119, 64, 111, 62, -210, 137, 15, 84, -79, -221, 19, -126, 171, 6, 104, -124, 77, -87, -216, -73, 32, -88, 11, 57, 28, -96, -60, 252, 117, -85, 58, -72, -68, -57, 200, 35, -5, -55, -215, 27, 17, 17, -55, 176, -30, -117, 68, 104, -125, 51, 9, 135, 68, -151, -5, -9, -8, -95, 80, 0, -310, -158, 128, 99, 108, -2, 173, 128, 135, 94, -25, 22, -158, 130, 48, 120, 107, 116, -140, -143, 121, -135, -130, -141, 36, -51, 58, -75, -47, 69, -151, 243, -11, -4, -89, 71, 121, -62, -60, -190, 201, 10, -71, -143, -64, -91, -13, 242, -62, 166, 155, -86, 281, 147, 14, -93, 638, 206, 736, 316, -304, -149, -187, -119, -57, 3, -146, 216, 29, -327, 298, 11, -126, 214, -145, -75, -64, -22, 11, -132, 45, -98, 112, -155, -136, 59, -85, 197, 98, 218, 461, -704, -355, 225, -396, 1, 118, 341, -387, 84, -427, -77, -126, 9, -244, -220, 54, -79, -24, -29, 454, 181, -5, -223, -158, 55]
3524E5l5N4O4n1j0p3M2p3j58K78j47J80q8Kl15N31k78MM2N7j79q9L93k20K89k55
3550B0k0j01M75n43K64O1l39K85j13o3j14J35j37K42K10l11lJ9j43K36J93k04
3572D9k8k05L34j26j34J63MJ24l21l5J58K12k61J62k24L86l14RJ09l28N1Q7K1
3595a07%j62O73K24o29K12j31p04P62q2k05L93m33n14R83k88L00M1l20M9k9j25
3617i2P9K24m24M59n55P8J68J18j1J29k28m1L99j33q0j55R8O8Jkj62J80J01j36
3641H3J79j54j95K15j0j8j48J95j82J83k99n8J89k2j28J28J81l16K91l2j40k05
3663b63K20K43o1J3k60N5m8j65L46j14LM12l72j73k02K34l6K53j73L01J6m8j64
3686A7O1J92k91k89P15o7k91J7l18L71j31k3q7M28r2j82Q0Qj08q3J14l7Q4r9O1
$$ y = [55, 20, 74, 138, 87, 77, 4, 46, -27, -185, 93, -54, 126, 38, 40, -275, 256, -22, -18, 24, 81, -98, -187, 206, -14, 275, 20, 0, -101, 374, -169, 95, 156, -183, 102, -11, -74, -188, -53, -190, 52, 262, -49, -52, -33, -176, 60, 253, 49, 21, -184, 150, 24, -110, 53, 57, 181, -140, -175, -17, 195, -66, 96, -128, 258, -56, -47, 62, -266, -215, -128, -107, -107, -269, 404, 628, -1, 211, 80, -624, 138, 56, -149, 244, -189, -703, 280, -8, 292, 333, 13, 62, 33, -92, -13, 211, -213, 246, -309, -231, -63, 55, 44, 173, -55, -96, 303, 170, 90, -65, 33, 101, 102, 100, -62, 118, 219, 83, 262, 108, -87, 128, 118, 100, -48, 147, -35, 148, -151, -209, -20, -42, -170, -42, 139, -177, 114, 82, -58, -263, -43, 200, 139, 152, -108, -53, -101, -266, 80, -34, -31, 381, 9, -164, -366, -132, -168, 85, -88, 213, 229, 181, 17, 78, 270, -21, -310, 405, 338, 47, 64, -254, 117, -14, -37, -124, 304, 212, 30, 110, 118, 10, -73, 41, 4, 88, -11, 50]
3711E0J59j59P3r6N8p1k34J70J43p1M9pm29M70o5j25K0j58J73N2J27j04%r4K76
3736B07k31P1Rj79K97j47p2L5J25M6j78r9J31J2j86J62J18k55k01K15J99k83K2
3759a82J33K5KK8J61j43NM5k8Rj47J9K15j0Q4m63K63q3K3j17k8L65l35O6R2j58
3785a59J38j66J97N7J11p4o4K49n0l17P7l88M23M9j14J58p1Q7o6J8j42p8J89j97
3809a33L22Qp6k02r8O4K29j51J40j05j73r3L25J07l52K10n5j82J59j7L77k34j49
3832g9K26M3k77K35j91J8K3J32o6k2j99O2P5Q9KM8K3l72L33n0j2Q3K6l15K38j09
3858c6j3j76K98o1J78k0k20N6J61K7m6j80P1P4k17K9K6J96j84J59k05J30k24L24
3882A47j20p3K52k36J65m1j43n9OR4J73O8k08q5J86j80L1J14l7k04l4J57J25j75
$$ y = [50, 209, 50, 123, 27, 85, 14, -220, -50, 93, 22, 71, 64, -365, 105, 40, -85, -65, -223, -50, 2, 129, 25, 25, -69, 207, -24, 47, 56, -123, 174, 27, -45, -10, 115, 161, -17, -116, 15, 27, -159, 3, 121, -134, -335, -120, 79, -204, -182, -49, -24, -22, 6, 167, 24, 29, 74, 46, 55, -92, -73, 142, 132, 216, -247, 16, -67, -44, -161, -189, 176, -159, -93, -1, -159, -21, -187, 10, 67, 178, 104, 40, 289, 239, -78, -1, -389, 34, 83, -31, 127, 56, 143, 77, 95, -47, -125, 64, -133, 189, 197, 121, -81, -179, -115, 114, -37, 103, -2, -175, -268, 57, 164, -188, 22, -33, -215, -56, -73, 304, 70, -79, 147, 190, -87, 148, -43, -25, -2, 130, 64, 42, -157, -95, -20, 69, 71, 119, 142, -230, 103, 53, 41, 124, 150, -165, 73, -36, -49, -225, 73, 12, 190, 170, -50, 6, 167, 194, 148, -32, 39, 113, -104, -75, -49, 147, -37, 122, -83, 47, -177, 147, 27, -46, 206, -30, 135, 94, -49, -108, -102, -8, 165, 233, 25, -60, 126, -54, -23, 91, 54, -150, -184, -27, 98, -77]
3906g7J54N6r3j32J30J00j41l1J66k43l0m9J75L33k56j42K04l26l7L17j6K11n07
3929b34K70j34J81N2Q8l37J2o4J85O0k32M6K20o8j02L2O1R5j25n6J86j08J56N
3953A89k9j42k54K13J01J33k09P9j6j99K4K76j60J12j00l67O3K06n1K17J08k10
3975a6mj67J11Jk7K87n0k36Q2K34l15lJ49j97K17M3j62J36Q0j82j28m0K7L41o1
4000A20k13R4o8r6J77LJ24O7l48o7L9J93j91J90J78k66N6J40j36K6j0k09J42L1
4024b4K61k82J62k27J99j71K11k04q7lJ35%J55l21L13p6j89L64m76J83L32m34
4046a79K7K73k0j71j58K41k17M41j24k74j5q2J41k4L53m37J52O4k5Q2J29j79n6
4069e8K19j20K23k06m2j03J55J76k39L3p3K59l08M0J09q9K02j80J6N3j29rL5K6
$$ y = [-77, 77, 133, 40, -92, 38, 138, -3, -34, 132, -111, -141, -190, -15, 318, 62, -80, 124, -202, -239, 78, 62, 273, -234, 36, -98, 83, 135, 223, -114, -102, -166, 19, 79, -153, -107, 113, 45, -57, -25, 36, 131, 6, -50, 136, 28, 184, 189, 160, 18, -236, -23, 78, 211, 2, 81, 65, -134, -110, 166, 6, 118, 18, -349, -286, -80, -131, 86, 194, -16, -20, -187, -76, -75, -102, 185, 135, -101, -19, 215, -100, -103, 46, -151, 66, 109, -53, 83, 163, -19, -147, -187, -160, 181, 120, -93, 1, -67, -163, 14, 17, 141, 208, -140, -207, -168, 25, -166, 24, 202, -64, -8, 132, -4, 22, 12, -197, -55, -24, 237, -45, 117, -110, 89, -82, 129, -75, -162, -165, -30, -30, 125, -196, 117, 41, -148, 216, -260, -77, 255, -179, -152, 121, 101, -70, -228, 13, -204, 237, 113, -161, -176, -258, -117, -141, 212, -225, -73, -9, -34, 48, 177, -2, -58, 161, 41, 264, 58, 16, -87, 68, 244, 5, 38, -35, 224, -84, -44, 65, -24, 178, -2, 14, 67, -62, -71, -36, -10]
4093a0J06l23K99J61m00M4J96o8r4QL7j40J77J16j08R2qj63K14k74K28j2J50l59
4117a31P3K20j17j90R5L6N7Q7j7k20J13Q3J44k68L30l46l47L24M7m7J62jJ53m17
4141a77J1K34K29j031J003k84k62K56o6M29m58K49k09o3RK70j54j06n6K12JL25
4163C62n08K58N5P7k65J01l18L50k7j36J1j76P9P9j34O6P6J6N4J07L5j49r6K78
4187A95j23l2p8J62j22L0l1q1J8m8K96j78n3J12j41M2j57J31k22L41L6M5q8k02
4211a48Q5PJ5K13k68J51j26P9oo6Q0l4J07j69P1j91K49k85L11J10q9j19m1l0Q2
4236a2o8P2j73K89j04j1K24k83J19p5L6O0k21K01m5J01k38R8j94L79M3k0j34R3
4260A37j31j13L20J04k53r1p4J79K7j23mO1M3k05J88k6l7j94N1L06p5J1j69Q5
$$ y = [-10, 96, -227, 72, 233, -167, -123, 73, 5, -89, -81, -44, -184, -7, 109, 1, 93, 85, -78, 136, -138, 90, 78, 228, -131, -58, 162, 45, -145, -50, -14, 43, 130, 113, -107, 6, 89, 233, -35, 295, -51, -398, -74, -27, -74, 88, 87, 240, -177, -166, 68, 297, -734, 269, -15, -277, -21, -87, 342, -116, 133, -76, -139, -130, 140, -14, -120, -176, 36, 37, 362, -146, 112, 167, 244, -21, 80, -238, 112, 85, -51, -40, -216, -137, -58, -192, -126, -50, -34, 20, 127, 162, 13, -83, 195, 72, 40, -38, 124, 2, 32, 1, -80, -62, -110, 186, 8, -45, 67, -74, -32, -189, -58, -280, 61, 97, 142, 54, -148, -63, -56, -41, 172, -96, 55, -71, 8, 2, -64, 16, -18, 89, -80, -9, -200, 49, -236, 75, 185, 96, -23, -64, -94, -12, -80, -8, -181, 108, 4, -7, 217, -66, 53, -22, 14, 74, -147, 54, 9, 110, -128, -30, -224, 155, 198, 178, 44, 137, 6, -107, 213, 317, 64, -27, -101, 78, 105, -18, -22, 39, 82, -123, 65, 39, 2, -192, -141, 165, 90, 101, -68, 17]
4284A7Ok57L46R1k25j64J82j17J47l1P4J14r3j54K4P5j0O4p6r8J6K48l51L64r2
4309A00k34j40J37J43JN2M4J4k32J42k6j19lJ12j92M6O2P9m8j2LK33m09J83O3
4334aj66K74j72J74k20K30n2k18L24k92P8L27l3l65J06L8m3M8l9j42k24K57K0
4357i1p8J57Lj03K19j37J59l63M04j04J45m1M7n11L43p4j44M39l52P1k20M59l60
4380a32J96j2k8M2k05J63K48m21m4K94k53R7L5J04j72M0j47L07j14P7K15k75O2
4403G7k67K07j3k24K13J19r3j08K28R1l57m3pJ81K03j18l15L00K3l6j15M0j73
4426a87K43k7n3%q9J87N0K06r7k98L07k79o4N3J8k8L04j27j12K7mO1j01j35K47
4451A02N1l3R6j87J27j30N9P7j08K02k52J6k01M7K20k19q9K00J82j41n3J2J92
$$ y = [17, 23, -234, 112, 203, -22, -186, -4, -121, 26, -5, 69, 183, 90, -64, -40, 35, 25, 89, 13, -85, -69, 179, -172, 192, 100, -134, -274, -137, 6, 7, 59, 103, 117, -115, 27, 1, -118, -121, -9, -201, -155, -93, -14, -62, -74, -71, 162, -247, -64, -1, -167, 107, -65, 109, -111, 119, 67, -151, 173, -119, -41, 286, 253, -112, -6, 32, -11, 37, -2, -144, -368, -111, -91, -169, -12, -9, -112, 107, -30, 129, -234, 170, 66, 211, 170, 217, -294, 49, -25, -169, 270, -82, -11, -231, 228, -132, 64, 52, 24, 66, -139, 24, 272, -149, -193, 101, -152, -55, -20, 84, -88, -48, -195, 112, -2, 75, 290, 15, 77, -190, 17, 4, -220, -7, 112, 19, -89, 139, 230, -127, -170, -177, 4, 207, 89, -226, 74, 97, 61, -54, -14, -187, 56, 29, -24, -24, -113, 74, 124, 330, 233, -65, 242, -37, -101, -48, -30, -58, 246, 119, 7, 34, 30, 91, -10, -145, 102, 153, 120, 216, 29, 156, 26, 85, 162, 54, 256, 4, 20, -181, -134, 86, -133, -222, -22, 160, 19, -34, -22, 170]
4474A70k98O6K09j60K89l57K13q1L7j11n1J7lJ41j51J76j06k42k2L18j01R7j44
4497i4K33K2j55L8J9l87L69j84K70j60J52P0j88N5m2q7P9J38m1O9k02j06nJ91
4521E4o2N4K81k50k18K32q2J39m68M76j08RJ74l52r8K51l1j39M8J31q0j5N3q9
4545i0J37k16K21j11K53l34K48K09m94K06J21o3o1j25K25J02l68J31j44J2J92
4566E1j44J46j79M8J05L1k3q3J41j03k82K38J0J66j44m1K08k13qJ49Or4j6M5j73
4591a59R8Q7J10l31J01J49j20J26J8J4o6k70K25K57k77l6k09L80j70Q3k05K88
4613I3p0N3k41L11l03J97j14J20Q1k46K00j81K9L5p3K13J1k22J04k47M30k81r6
4636a97K68n7J34j70K32o9Kj27k56R9P5K55k37N8J86j98j42J04K11O1m33K20K
$$ y = [170, -128, -62, 147, -13, 276, -81, 132, 51, 88, -23, -74, -57, -60, 81, -70, 106, 0, -242, -264, 54, -47, 50, -94, 139, 161, 6, 44, 63, -324, 45, -139, 131, -29, 123, 193, 5, 60, 18, -69, 10, 148, 107, 176, -26, -132, -137, 54, -8, 46, 327, 77, -141, 91, 9, 148, -320, 156, 48, 57, 231, -121, -219, 32, 1, -138, -90, 41, -39, -54, -1, -90, 47, -169, 52, -59, 194, -140, 108, 317, -177, 29, 150, 87, 26, -99, 126, 228, -140, -9, -153, -141, 51, -93, 53, -126, -78, 27, 58, 35, -48, 93, -10, -292, -54, -44, 122, -22, -63, 145, -68, -76, 73, 79, -15, -31, 14, -159, -61, 26, 136, -195, -94, 55, -65, 61, 79, 93, 27, -243, -18, 239, -38, -74, -283, 97, -73, 10, -195, 93, 23, 76, -165, 146, -157, 40, -74, 46, 127, -119, 81, -100, -71, -36, -109, 104, 115, -107, -3, -250, 180, -101, -197, 71, 14, 148, -22, 210, 141, 143, 16, -240, -141, -66, 189, -48, 10, 196, -2, -144, -40, 171, 232, -201, 19, 21]
4659B1O5j7j93K83k39K3J83k61J83N0j76K11k79J60Q6j19j36J62J62j01j14J39
4681I3j17M9m2j6J55J06k04K04l42J39n9j10K21P2m6J58n32M88l51K35lMR9l00
4705i9J96J6J7j24j7Q2m14M35q0p8K25k02K79k79j7k34K85n1J54j33j69J11L28
4728B31k09l3K24m58K19K73k22J29j82R0K37k26Q7j0k86pK43j58J08k18k1M10
4750B21l76J71J01n5o3J20k88P5J06k1K3p6J96p4P3n6r9j40J15K21k68J16N7j12
4774c3j32k9R1J09l7J28R0Nk16K1P8J4m7r8L07m6j46rJ63j70j48K7l28O08j50
4799E2q1l6q6K63k5j03J64j65l9n6Nk40M32q5M6k17K50k21L60k12J7o5J47j27
4823b2J0o2J53m0j02p4l2J90q5N9J06j77K38k20L37k95K09q8l27J48p2J97k76
$$ y = [21, 86, 69, -124, 159, -80, -57, 126, -135, 48, 98, -78, 133, -146, 14, 100, -19, -155, 7, 169, 68, -46, 93, -24, 25, -17, -33, 122, 228, 24, 228, -114, 25, -34, -144, 77, 149, 103, 261, -271, 217, -134, 101, 98, 102, 201, -99, 97, 113, 130, 6, -11, 71, -343, 92, 12, -66, 159, -43, 236, -43, -60, -294, -9, -60, 94, -39, -208, -97, 231, 22, -11, 213, -245, -26, 247, 25, 154, -28, 62, 299, 73, 160, 150, -136, -143, 100, -58, 50, -168, -189, 221, -155, 16, 117, 62, -1, 119, -169, -94, 12, -9, 14, -62, 134, 60, 133, 77, -22, -162, -47, 174, -94, 22, 79, -33, -165, -194, -103, 6, -31, 97, 187, 192, -24, -3, 75, 89, 42, -56, 251, 205, 59, 50, 213, 43, -105, -78, -406, 202, 52, -29, -65, -151, 112, 87, -16, 148, -17, -56, -112, -107, -347, 85, 0, 46, -171, 79, -142, 218, 6, 23, -42, 105, -22, -12, -74, 79, 39, -63, -137, -169, 21, -64, -5, 101, -76, 162, -58, 279, -16, 193, 105, -222, -74, -146, 51, -225]
4846b25j36M50L3j86J9k0L45r9j56%k43K82m5j59Q8P4p2J62o3j80P2o1J73j67
4870a14J58j51Lq1J01P0J94k66j00J44q2L61j81j79L02k14J36j59J11k7J54j64
4892A6p6K89j34j6k17K25k02K72j43q8R5K84m46Q6K45k25l7mj03J96r9M09j74
4915A53j05Q9j23J46l88K02J92j08N8j85Q2j2R0l1jj9j71K49l87L38j72K5j6J36
4939D2L10k37r4P1q3L0m9K3m1J35k21K57l62K45J7k45J55k6J44j72L28k89Q7j50
4963a25K12k3q6nK29j93K8Q6k14L13q7K3k78P2O9N0m6j34J35K02l87K8J40j70
4987a61L25j06j09J52q8l5J04j86J05k36q3L53lq5P8n3M7j9p5J70j86k10L30N6
5011H5m0J0o2q8J52J19j73k9jJ36r9N0k90K06O5j84o0N5q8L09j18M5L2J08k42
$$ y = [-225, -361, 89, 122, -64, -45, -65, 280, 181, 25, 25, -218, 64, 19, -140, -52, 22, -50, 112, 49, -131, -59, -120, 53, -114, 44, -107, -104, -185, -84, -14, 180, -86, -186, -42, -124, 237, 56, -123, 179, -35, 101, -58, 53, 26, 180, 16, -60, 229, 95, 79, -138, 87, -115, 157, 14, -74, 21, 305, -141, -55, 190, -35, -72, -76, -179, 17, -82, 327, 153, 48, 137, 14, 160, -228, -26, 166, 58, 116, -69, 13, 1, 91, 60, 59, 40, -131, 118, -269, 69, -103, -78, -94, 42, 352, 115, 21, 92, 9, 39, -10, 13, -28, 107, -114, 143, -219, 26, 43, -202, -47, -73, 71, -101, 227, -62, 25, -125, 87, 64, -22, -27, 202, 9, 37, 123, -91, 222, 135, 158, -120, -48, 21, 71, 25, -109, 26, 228, -159, -131, 9, -161, 164, 58, -51, 101, 13, -22, 82, -104, 1, -235, -318, 35, 32, -53, 25, -28, 19, 0, -75, 95, -91, -301, 29, 85, 45, 55, -7, -95, 57, 176, 3, -26, -27, 109, 10, 60, -230, -24, 41, -143, -203, -148, -236, 73, -45, 0, 32, 140, -102]
5036a02J57j79N8J33j07PJ94j37k0J57k24P2J07j97M1J26o6j9Q3j14j88K29p5
5059f4QPj09K19m6j11J68q7J43j87M15m26j14J15J03K5J27j59j65J1J4K88m34
5082b59M01l1n7j11J44j33n4l1k0K48j23J69k32Q7Q2j55L19l97P7J41R1j02oo2
5106a4R9j51M08j06l89J40k3j11R6R3k56L69k23j48N19k54P1Q1q2K47m54P3j4
5129b9J17l1J3k46K62N9r4p9j21M2J24q2K3O3N6j2o9J04j90n7L3R6j33L9P8R6
5155F2j52j08j11M32m03K86r1K70l82K71J2n8m7k14J15N5J25l23L92j41J65p1
5177H4J94j04l0l04l2L37q3l3Q8j16Q7k0n4J73j90N8q9Q9P2j41J04K5N1j30n7
5202b1R8r6J99j96j81K21n9O1Q5l14J02m5L36r2J7j60J71j15m6p4Q0j5J35j10
$$ y = [-102, 55, -124, -66, 67, -40, -33, 161, 24, 4, 161, -63, 9, 116, -81, -40, 86, 20, 1, 84, -30, -218, 11, -64, -56, -49, -158, 61, 15, -96, 72, -15, 128, -59, 356, -70, -184, -69, 34, 59, 186, 27, -138, -127, -113, 175, -259, 142, 111, 54, -57, 87, -46, -100, -131, -151, 97, -26, 143, -89, -2, 80, -75, 244, -153, -76, 65, 156, 54, 48, -14, 85, -66, 342, 236, -153, -13, -36, -147, -51, 42, -214, 155, -68, -216, 303, 49, 120, 201, 119, 366, -88, -15, -29, 88, 57, 70, -176, 86, 145, 51, -28, -149, -107, 17, -65, -42, 21, 77, 65, -4, 100, -90, -147, -114, -18, -151, -112, -34, 62, -90, -198, -309, 123, -280, 6, -85, 185, -197, 74, 86, 28, -19, -233, -118, -63, 62, -261, 131, -10, 155, 84, 278, 174, 144, -160, -192, 145, 62, 29, 117, 1, 88, 68, 14, 187, -3, 55, -34, 55, 127, -14, 90, 115, 166, 36, -21, 77, -19, 180, -16, -197, 24, -35, 26, 111, -203, -101, -146, 190, 98, 115, -45, 126, 11, -35, -109, -29, -44, 91, -19]
5226a9K1J48k04Q7J08l86L14l1j76K40j75L6N3j21L25k27O3o3J54j85m5qP2J57
5250A38n87N01l99J82l0J45J77o8o8J36kq3n1j40K92k44K91l27K07K7m5j03j41
5273a92J00K64k86J95l1p6M5m5j8k1L0J62n8k02L08j93j84k66L61J18l1J29L6
5296A45Nj7m5j57J25j41J39l2J79k16J99l52K83j91J57k94R4J96k41N6J70r3r7
5319a28K86j10K48l98J95j26J52k58J09O6o3o5M7M6l5J60q1j54L87m07K5Q0m4
5342f8N0J55j68o1j18J04l2J48j48J74J7j15J39J7L6o3j80P0J63l0J24k72NJ10
5366E7q9J4j02J44M0j1r4K12m7l30J56J47o2L34m77J99l83M45n%q1L5mK19n90
5391b73J96J44L7j7k5J5l19K70J41j84j77M00k10j08j20J10N1o3K47K2k49M24
$$ y = [-19, 2, 150, -54, 33, 141, -245, 69, 38, -138, 102, -73, -37, 16, -105, 220, -7, 56, -7, 147, -38, -83, -91, -19, 138, -449, 52, -347, -165, -195, -50, 127, 59, -9, 127, 125, 42, -9, -149, 143, -101, 190, -137, 70, 97, 52, -51, -192, -92, 172, -114, 81, 50, -26, 19, -26, -44, -65, -35, 127, 69, -133, 175, -18, -202, -468, -107, 11, -20, 109, 145, 150, 133, 88, -69, 56, -85, 54, 22, 201, -15, 184, -168, 115, -76, 81, -213, -119, 77, -164, -108, 62, -31, -128, 158, 48, 296, -102, 93, -33, 119, -139, -30, 36, -27, -92, -45, 1, -34, 126, 45, -109, 278, -129, -104, -24, -68, -18, 137, -31, -92, -210, -106, -138, 10, -138, 36, 53, -62, 77, 94, 130, 67, -113, -43, 120, 90, 214, -58, -53, 57, -32, -18, -120, 24, 64, 53, -41, 171, 124, -206, -50, 97, 35, 369, -108, 91, -292, 153, 148, 148, 67, 102, 98, 317, -273, -77, 67, 104, 87, 62, 77, -242, 28, 169, -15, -192, 208, -2, -110, -230, -120, -69, -132, 115, 137, -112, 312]
5413C12l61j7j32K45k8J32l00M76k62Q4j63J71r2J27j75k6J96J47m27P9K8J3L4
5436F1o0J93j42j57j16J49j30L04Q9j53J33L3k04j26K82j09Pj76J71R8j40L3j21
5459h1K50j50J52l47O9K41j65L4L0q8R1J78K3q3l13P6p4J05P3N6k69n5N56l35
5483b6N4j47j08P2K08k71K86r4kOj4j5L1O3p8q4mL3J11R3j62p7j52K95k03j05
5509b90K43J89j39j41N7J99j14J74k04O8m8L4N0j04j04j07J56p6J33L7k46J55
5531g8J52j90J55k10M55k24N8k89J81M9j92K28k92K65k63L77k35J7J22J96m41
5552a59L04Q6j02r5j82J36j46K67j43J25k86J66J06j32p6N15m25k2L7J7Q3p1O0
5575F3j40j54j3J04J88n5P8k61J94k3L9N9j63J41q9L72m13O5R9j57J71q3k85J2
$$ y = [312, -49, -66, -198, 47, 19, 151, -149, 327, 65, 149, -14, 157, 65, 192, 17, -9, 187, 334, -93, -14, 14, 27, 61, 1, 194, 52, -105, -221, -72, -202, 102, 191, 38, 171, 204, 0, -126, 156, 47, 54, -122, 49, 147, 7, 40, -81, 169, 19, 171, -176, -107, 134, -31, 3, 33, -55, 36, 214, 237, 154, -159, -83, -157, -52, 21, 77, -192, -247, 309, -26, 28, -119, -227, -155, 53, -218, 68, -26, -28, -22, -36, -51, -20, 43, -35, -119, -123, -90, 21, 114, -48, -125, -277, 18, -185, -290, -47, 142, 3, -138, -81, 118, 4, 178, -26, 42, -6, 28, 78, -26, -130, -237, -81, -157, -24, 13, -233, -78, 74, -116, 39, -171, 284, 60, 118, -171, 10, 59, -133, 95, -197, 68, -195, 182, -53, -36, 86, 282, -159, 145, 231, 129, 34, -148, -12, -158, 109, -34, 91, -195, -29, 77, -55, -131, 384, -41, -63, -26, -9, 74, 3, 63, -77, -231, -244, -140, 48, -7, 71, -190, 4, -19, 20, 79, -84, 57, -32, 340, -73, -8, 91, -66, 105, 22, -263, -251]
5599b51J31J01m2K3j73K07K8j90L4J27j8J94j71L05m48K59L30o43K19K8k82N9
5621a73J26J34N3k18K29o4n8k95L24j89J04K18k32j89L14k23L79j22k7%j36J07
5643F2n3N1k90L97k92J22l9j03K89N2K1j56l83J54K47k21J50N9j87J57J28j68
5665ck69K16j55L54l69J66J48K4Q7j07j35L58N13o97R6o25M50k60K09k42M07L9
5687B05m40K75O6k40J97k34M0j79J01L63l14K00J56l33QJ74j02j18J60k05J20
5708a00L1j25J22l8J4K4k2K63k60K96q8R4k89k8J11j16J70l8K28l02j57K46j54
5731a18J48N6Rj78J95j50m6J18r0K87l18J00K09k17q1J10j93Q6QR6J32k90J00
5754b7O3k92K84rL9k89R3J56N6jn0PN5r6J85k41m6K5K59l20L26j16p0L4L8p4j24
$$ y = [-251, -120, -19, -61, -38, -211, -4, 24, -166, -132, -5, -23, 171, 0, 305, -143, 116, 446, -197, 22, 50, -232, -173, -47, 87, 140, -78, 151, 87, 29, -266, 58, -131, -27, 191, -41, -230, 84, -139, 240, 118, 91, 91, -45, 62, 9, 60, -230, 167, -125, -3, -42, -145, 144, 196, 217, 61, -322, -168, 79, -142, 8, 67, -120, 37, 165, -3, -272, -56, -211, 143, -226, -60, 88, 112, 199, 92, -43, 315, 828, 131, 227, -398, 52, -208, 1, -241, 166, 205, -235, 40, 106, -134, 63, -171, -131, -310, -209, 154, -160, 40, 196, -137, -129, 45, -57, -175, -15, -220, -100, -69, -194, -72, -110, -96, -72, -94, 169, -91, 205, 117, 211, -78, -106, 5, -111, 59, 21, 249, -53, -210, 36, -118, 30, 86, 95, -83, 112, -38, -84, 34, -56, 231, -87, 13, 222, 5, -76, 34, -159, -73, -65, 31, 163, -127, -27, 36, -256, 28, 19, 58, -231, -138, 18, 74, 73, 23, 30, 85, -11, 174, -67, -113, -88, 171, -149, 177, 61, -9, 25, 63, -11, -135]
5781a35K55k66L79l56K06J82k19k05K75j02j24K3k4J34j0o4J04l0j43KK61J34
5803B77j55j37kLj35K03q0k80N80k03K4j3m6j81M47l49J82p6j84K0n4J94J56m0
5827A51m7j79K06J03l07J55j42M9K42l31M5J47n7J11j33Mo9J91o3l5p4M1j08K99
5851A99m20M12l67J09Q2m5K27n7%J60n73K99o8m5p3J22OJ43J9p7P0k1K3R0k50
5876c5n8J56j92L43k09O4k55L87l75n1J26L02j15o2n2M2K17k04j8R0k01J56J16
5899A72l37J18J36j55P4q8j52k2o8N03k30j36J45J16q7n4R5J20j65K2q4R9k0m2
5923d0P7mp3k5J4K04n0j53J17j38M0K33l79J82mN7J5k53P2J74k00n7L10k25j0
5948a16J44m5J22m91N63k3j64n1n5J81j32J13J62r2j55J00j51L45l33k3K1K28
$$ y = [-135, 120, -146, 233, -123, 83, 265, 46, -159, 116, 14, -110, -87, -111, 23, 13, -51, 53, 23, -120, -118, 143, 277, 122, -15, -17, -14, -149, 54, -26, -306, 274, 71, 95, 82, 36, -145, 302, -47, 135, 59, -125, -105, -159, 35, 191, 151, 104, -75, 131, 234, -73, 82, -60, -11, 231, -100, -55, 92, 35, 146, 13, 17, -52, 139, 76, 41, -33, 8, -100, 199, -221, 191, -176, -67, 15, -30, 197, 140, 140, 300, -273, 26, -42, -87, -160, -38, -32, 111, 130, 53, 123, 102, 125, 215, -35, -93, 63, -129, 214, 5, 69, -186, 201, -174, -225, -99, 203, 88, 26, -26, 16, 233, 29, 11, 101, -100, 56, 172, -165, -47, 89, -66, 8, -80, -232, -254, -322, 181, -49, -185, -40, 76, -11, -65, 30, 150, -15, 7, -77, 22, 2, -40, 37, 33, -40, -65, -51, 153, 103, -50, 67, -71, -31, 202, -177, 5, 1, 58, 73, -180, -108, 66, -134, -191, 119, -106, -116, 28, -17, 105, -386, 177, 154, -10, -61, -116, 65, -67, 46, 208, 116, -39, 61, -90, 255, -78, -101, -80, 148]
5970A48k09O9j52L8k68N19k06K4J75k48j13L74kr7J0q2J16j80M5OR4j35M21m80
5994a33J78k25J40R5j1Q7j62l8m4P6l0j09J31o4J00j16L77j78J44oj24k22O8K8
6018c8Q6k98K11J66l48J63K05j93J15j39N8K74l48J88L2J1l77J96LM2k11K32o
6041B4j56K29j4m7j22J27k0RMj10J27j99J75j27M3P9Q2J03l06J14K0J5Q3l38K72
6066F7j19L7r6K6K29j63K66j79Q3j41K8M5j9l13L00%k92L79l3j6L5n8j81R5M1
6091B1K58l16j23R0J14j88p5K84m4j00L8J10j37P4L6j9r6J23R6L3J1l41K24j04
6115c1J03J5j20K36n0o2j73j94J83K5O6r2J30k6j61K57j49J14l7J20j06p9J7J09
6139I5j71J07P3N4j43r4R7Mj9N0Pr1l1J87k26J94Q1j61j01R4j78K15k36M1N00
$$ y = [148, -61, 8, -144, -106, -374, 145, -61, -37, 138, -110, -223, 151, 149, 52, 62, -20, 96, -84, -39, -33, 61, -74, 347, -133, 45, -180, -40, 55, 44, 131, -31, -69, -113, -37, -67, -176, -45, -109, -9, -125, 252, 74, 218, 212, 88, -134, -66, -38, 48, -250, -39, 127, -221, -58, 147, -46, 69, -70, -12, 262, -86, 102, 134, 145, -232, -36, -33, 9, -202, 30, 24, -132, 97, 83, 36, -86, 41, 21, 30, 34, -76, 51, -148, 27, -100, -57, 22, 104, 207, -99, 15, 35, 50, 133, -205, 67, -52, -15, -111, -85, 144, -19, 247, 68, 151, 10, 38, 83, 64, -249, 51, 51, -241, 138, 105, 89, 124, 66, -115, -20, 21, 279, -37, -160, -70, 44, -144, -219, 65, 21, -79, -41, 69, -68, 6, 42, 23, -73, 50, 146, 179, 190, -151, 73, -31, 72, 87, -33, 203, 153, 91, -82, -276, -93, -68, -2, -94, 36, 10, -151, 106, -43, 71, 34, 154, 48, -31, -14, 95, -76, 31, 104, 158, 15, -79, 18, 22, 3, 53, 60, -31, -62, 125, -101, 93, 174, 13, -88, 6, -172, 43, -193, -152, 348]
6164C48l04k7J25k82L03r1l2q6j5l9J13J77j21n6J51k63J47j78p3L73o4l43J6
6187b21o6K70j42J60J39k21L4J34j15K28l27J79o3k7J29k35J53j86M64m51L05
6208A41j70K45j41k7k14K90l17J26J9J22k5k03K9J78K0R7k40l9J86j09j28L47
6230A87k39J84k44K14M6j31l4l8j85J47P1r7L2M2J55k61r9K10K6L11k61J4K1j23
6254e2M4O0P5l9j38MK8j29K83k45q1L21j5l63J7K61r3j81R9J68K9P4k62J85L5
6279H5k10N3M12l99J06q2k73ML98k91L51k75j50N39K95k84m17K15l58K39j66J1
6301a97K90j12j78J62q5J00N8j9M4r9j40J98j56J49L0k30J24N5J16K9l33K43j90
6324a41J28K23k08j7j5j02p9L51m7j40j29J08J42J01k93L44K5l00pK38l23M31
$$ y = [348, 44, 17, 142, -140, 163, 72, 40, -46, -61, -100, 13, 190, 69, 13, 164, -99, 48, -130, -203, 170, 106, -237, -221, -287, -17, -159, 1, 140, -81, -47, 87, -28, 200, -127, 52, -11, -38, 91, -144, 9, -177, 287, -164, 141, -29, 216, 75, 48, -166, 124, -193, -67, -48, 74, 49, -154, -125, 53, 73, 170, -70, -109, 77, -32, -160, 187, -52, 132, -112, 102, 148, 17, -17, -55, -240, -93, -22, -119, -87, -45, 110, -151, -250, -40, -14, 297, 36, 50, 71, -52, -8, 52, 127, 88, -50, -46, -18, -147, 136, -109, -190, 131, 116, -247, -230, 31, -62, -243, -144, 24, 53, 127, -135, 50, 85, -125, -72, 340, -59, 47, -35, -308, -304, 94, -197, 154, -121, -271, 268, 563, 279, -138, 77, -281, -42, -208, -197, 93, -19, -197, -35, -120, -20, 38, 19, 63, -36, -176, 22, -134, 15, 45, -185, -61, -6, 110, 139, -194, 49, -141, -13, 210, 2, -15, -30, -132, -211, 140, 93, -47, -176, -68, 74, 175, -118, 226, 251, -49, -56, 182, -141, 290]
6346B90k54o7Mk15J65j65J49J27J63j61J67l14J98m38J84J56K7J06j18m4Q3J5
6368E8k00j95J70J07n7L00j69n6O0n9K16j33r5J51k43J1J47l1j84K72j1lJ73k25
6392Dk71K66p8JJ33j38k59O69n35N8K14J50m20P9J38j58J77j01k21K79K86k26
6414D7k4R4k15J9K7K10l04K34k62N1j6k3J48O4j1r8K16k78J07j60J29N8J62kJ21
6439B94l28K1R1l0k06J12m7J35j97R5k6N5j07L7j81P56p15K89l6N8j35n7p8J17
6463h3LL47M5l72J19j78J02J45k55L68p8k95K05olQ1j03r7l5K04p5n7K17l83J96
6488A2J61l16Q0j9L34l68L26j89r0K65l16J05m2q0J08K25m38K51j64l4K83j97
6510a03O4J51j73R0l73L08J35l12J73J54m4k14j6K28N2m6K3k54k24L57k8j16j2
$$ y = [290, 36, -31, -27, -242, -77, -242, -93, 34, 197, 36, 203, -111, 87, -351, -167, -11, 16, 122, 4, -40, 43, 58, -142, -337, -167, -60, -117, 183, 14, -42, 18, -41, 175, 42, -53, 98, -145, -134, 13, -18, -202, 70, 59, 56, 229, 4, -267, -1, -79, -78, 55, -83, -342, 327, -208, -150, 64, 214, -206, -127, 11, -147, 30, -71, -292, -13, 273, 47, 23, 117, -98, -79, -52, 158, -146, 88, -174, -123, -139, -162, -14, 50, 39, -59, 157, -121, -14, -174, -45, 13, 175, 173, 294, -34, -13, 78, 48, -158, -46, -93, 42, -155, -60, -86, -31, -138, -101, -282, 474, -241, 48, 12, 70, -65, -122, -200, -83, -80, 267, 312, -60, 59, -119, -17, 128, -127, 241, 163, -132, 73, 67, 64, 145, 42, -55, -90, 114, 39, -18, 199, -184, 12, 173, -143, -63, -82, 252, -116, 210, 21, -69, 196, -120, -15, -57, -137, -29, 196, -242, 9, -155, -189, 94, -103, -39, 112, -61, 29, -344, -36, 99, -213, -40, 114, 70, -144, -160, 68, 120, 74, 97, -157, -381, -24, -52, -168, -180]
6533a80J03J60j53P4j72J27J13j19K8J14J12j79k2J03L4j14J56k62J31L03m02
6554d5K9n5J58mQ5j13r8k9J65M2j03k8m6m5l32P28k61j92l4L09l52K39m08p3L90
6579g3K3K56O3l37J25O0J19k05j29%Q0J44k02K60q7J1j95J72kj06R7l76M56j93
6603c9l7R5Q4k06N27m23R0k14J42J33l86K93l50K46J90m7j17J38Pk4k34J90l8
6626B0r1K30j18P2k26J31K1m2K33j06r6L0k0J72m52L92n2l43n7L81n5K66n67L62
6650H5k2j73N0j18L14k04K04K2j71k4R2j57lK43k28J7Q2k30J67Q1j2J24O6O8m36
6675a63O8K13Q2j05o7K3k25J99l38R3N4Q5J7k57J99K45k53J08n6R2p6j04n1J2
6699b05L90k34Q6k6l02L36n9M9Jj19J73n5k71J61n3J68k86J18K22j49J37N2L9
$$ y = [-180, -77, 83, -70, 4, -168, -41, 72, -47, -19, 95, 207, 28, 6, 109, 143, 29, 185, -77, 54, 357, -45, -16, -71, 87, 83, 168, 55, -43, -72, 93, 135, 32, 4, -42, -87, -419, 309, 48, -144, -178, 131, -221, 18, -390, -463, -73, -50, 206, 269, -68, 57, 117, 236, 31, -98, -98, -18, 126, -76, 184, 97, 108, -87, 85, 83, -23, 74, -302, 154, -39, -76, 19, 103, -103, 424, 1, 91, -123, 19, 152, -234, 59, -291, -45, 145, 98, -19, 119, 126, 102, -132, 58, 20, -71, 159, 41, 113, -113, 18, 39, -3, 230, 124, 28, 58, 38, 210, -242, 150, 98, -245, -302, 79, 24, 290, -277, 85, 63, -110, -60, -178, 136, -68, 136, 158, -13, -37, 55, -102, -105, 138, -90, -73, 9, -221, -54, 27, 15, 139, 205, 273, -163, -95, 118, 200, 95, 28, 51, -174, 25, -313, -220, -166, -81, -64, -321, -122, 123, -130, -22, -78, 14, -62, -166, -217, -205, 185, -49, 37, 11, -291, 45, -14, 35, 36, -83, 90, 35, -236, -75, -128, 40, -246, -128, 94, -55, 82, 134, 173]
6722A73k35L4L51j53Ok75j48J96j6l7q3L72j87Q4K4p4l8rj89J63n7L32j92J54
6746A96j40M7L2j43j5J02l0j29n2J14K24l45J44R8k27K34m3K3j56L29j65k35J15
6769b2l3rj33L63n12M76l52K09k04J02L74l3j71r7l4K7q6K83j8K4j61J15l24L54
6793A38j81J25n2q3J06j04L7M0%o0L25k97J20j54m6j55L34r7pn4L73l22M7m5J50
6818A38j34K16k37N8N6R9k91K49l5q5j0J43n6J18l83R5K63qq2k76K12PJ58k90
6842g5J42k87R0K34l12L01J16j15k22O8K06l25K41l2n4J6K0J30o6R2j32j36K4
6865g6K19o1q4K43l88Nj4L12k74j61J15K81k58K19J64n66L36j71J77p0M0O9J30
6888A87j48j7P7j96L56l26mL33k92j70J99Q7kP5k04M3j58J41K37k34M5j87Q4M2
$$ y = [173, -62, -28, 323, 170, 176, -99, -247, -51, -67, -104, -187, 185, -2, 82, 106, 32, -6, -15, -204, -41, -98, 234, 42, 196, 56, 103, 135, -8, -23, 79, 49, -80, -132, -18, 206, -139, 5, 103, -124, 110, 67, 90, -66, 263, 98, -137, -22, -55, -64, -197, 166, -346, 130, -222, -13, -217, -115, 259, 226, 55, -42, -76, -49, -135, 148, 130, 154, -7, 108, -216, 138, -43, 82, 30, -53, 53, -51, -14, 26, 26, -34, 291, -6, 114, -40, -86, -241, 93, -4, -11, -65, 308, -14, 33, -12, 138, 4, 220, -17, 41, 97, 196, -95, 154, 119, 34, 24, 167, 111, 229, -154, -59, 204, 196, 114, -162, 50, 57, 215, -75, 67, -220, -130, 104, -208, 93, 209, 94, -128, -60, 146, -179, 62, 30, -24, -8, 12, 142, 76, 168, 36, -100, -76, 143, 82, -2, 241, -147, -142, -156, 156, -118, -279, -164, 117, -141, 78, 242, -324, 12, -159, 18, -52, -12, 57, 187, 39, 22, 99, -97, 259, -67, -71, 262, -30, -200, -1, 86, 84, 159, -45, -2, -160, -19, 218, -16, 29, -158, -74, -32]
6912c2l9J79q3j06K58J7j82K07m04J76J82J1l74J04K18l06M04l8j74m3J17J0o1
6935D1Km5j64P4J40j49K24J46j9k16J62l35K17L65r28L68M84n89M95k77j58J118
6957I56p80k58N8P19l75n44J12N32q19k62R53j64k9J37q9j04J0k38K16K55l20
6978c4j0j80K40N8K7q2L2j76J89q9L5j05L06q4j09n7J02j35N3Q7k07K36q7k3j28
7003a41L9K07K9o1m2J75LPl80J33l5L9J21n7j76J50j32K64j57l9N3J30j92q2J12
7028c2l4J31k54N8P9k1J26j54k7K18j63l9J61J14j0j65J2j85P3j47J27J16J80
7051A64o2k28J67j01j04K46J09n2k50J04K0J40k31L33r7j53K84k04k1K11k41M1
7073G5l8j20L40l09K40j64r0O2J52o5m2K8Kj0R5q7O5q2j61J23j55J58k70L28M0
$$ y = [-32, -71, 108, 25, -81, 177, 194, 12, 219, -185, -9, 173, 184, -190, -86, 132, -174, 230, 192, 18, -25, 92, 102, 41, 43, -2, -166, -92, 48, -101, 123, 269, 250, 34, 196, -139, 78, 443, -485, -117, 367, -222, 273, -4, -162, 956, 176, -82, -24, 695, 320, -224, -112, 420, -399, -661, 292, 128, 99, 236, 147, 43, 53, -185, 31, 286, -34, -44, -224, 16, 74, 101, 19, 51, -125, 64, -25, 10, -95, 211, 127, 18, -39, 63, -72, -19, 68, -139, 97, 10, -13, -141, -102, 105, 134, 73, 31, 206, 209, 216, -164, -31, -66, -27, 94, 37, -139, 11, -121, 143, -14, -53, 0, 130, -62, -144, -32, -66, 65, -189, -131, -52, -73, 53, -101, -128, 90, -73, -112, 49, 163, 153, -12, 0, -185, -112, -259, -132, -16, 164, 102, -126, 41, -60, -164, 82, 191, 139, -111, -7, 13, 153, -78, 255, 158, 5, 289, 85, 64, 275, 34, 75, 37, -83, 257, -52, 188, 24, -66, -4, 148, 83, 41, 69, 71, 61, 156, 69, 134, 52, -109, 14, -141, 17, -253, 75, 115]
7098A15M0k61J63k39L00j16m5j51K17j25N2Q6Q7l20j12M82j51j1QJ09j18J74j03
7121H1p9J18j92M8J45p1j15o7J39j83K23J1n0Q3jj40Q6lJ8k6r5O0O6j25J4j03
7147a58R9K46O2k34l2J3J11j95K01kK10j51l45K13k2p0j21n8K26J50j17L9J38
7170B03l39j51L10K26n08L26N0k22Q5J22j72j54K01L8O2J03r5j10J23m7o4o9j39
7193b21L04J3j81N2J75ll22L07j24L4k32J21N0J47r9L06m14K54j92K48l46k1K98
7216A54k84k9L39k18MJ71k66K62k3j72m4J21p5J28J42o3M1j93K9q6n3k4M1J58
7240F0M8l34K63r9j6J76p9L32m83r5K42J43l16R6J65j88L61k41j64M7R3j47n3
7263a89K36J38j41J68K1l27J44K31j72M3j40n9J00j51J16j26J01J83l43K9P5K44
$$ y = [115, 155, -106, 57, -182, 118, 2, -43, -194, 23, -102, -50, 36, 123, -197, -309, 173, 22, 11, 19, 128, 10, 184, 81, 2, 120, -72, -24, 121, 50, -65, -132, 7, -176, 47, 58, 8, 91, 90, -50, 36, 33, 51, 25, -70, -10, 56, -69, -55, -158, -59, 187, 249, 15, -17, -4, 107, -88, 113, 111, 321, 170, -175, 38, 16, -54, -175, -233, -7, 143, 26, 65, 203, -136, -287, 23, 249, -259, 67, 117, -105, -20, 102, -70, -224, -23, 15, 77, 180, 85, -25, 98, 51, -13, -82, -221, 83, 96, -85, -33, 142, 139, -183, 124, 0, 34, -198, -77, -27, 120, 21, 327, -87, 167, -25, 223, -123, -144, 154, -130, -159, 180, -38, -34, 137, -129, 133, 110, -62, -106, 15, -60, 68, 210, 147, 188, -5, 24, -62, -115, -139, -98, 60, 108, -226, 37, -62, -78, 98, 19, 351, -132, -227, 15, 158, -158, -62, 103, -85, 276, 35, -129, -82, 11, -136, -189, 47, 185, 44, 212, 233, -94, 50, 281, 109, 152, 12, -47, 53, -98, 18, -108, -7, 176, -167, -138, -63, 181]
7285A81q6n7j42l6m1J87J19l06K31J6j6J20r5m05M36j52K90j84r9P8j2Q1k88L42
7309A62n0l41L65nr4j87M5L87k38J00l0m4j09K76j46pr1m4QK7J49j75k1Om1k4
7335a22J81J20n9L6j74J47o9j5r6l6J71o5m3J81l06K43j13Kr0j32J56nJ81Q2j75
7360@K33k13j70K93k55n9M21l10JN2k7K51m4l44K18m4J10j28j9O7r4q9j31K9L10
7385E8P1k27J50m3N5j09n6o5L03k4j97J34k10PO6o7K42j94L53l36M8o5K59l36
7409a83J21P1r9L17j87Q9j75K6J32k33K30N0k8jk40P5j49J41J37k81K71k62m6
7432b24J42P3J11M6M3l88K15j68L74k49J98m8l6l04J84r6J76J72k73K00j60n7
7454f9n3K09O2j10q4L83m34N74k71m09K72k91N06m83K74j56K0q0K39l59K32j07
$$ y = [181, 95, 38, -104, -140, -181, 6, 125, -181, 50, 66, 50, 170, 75, -330, 106, -46, 244, 60, -39, 39, 27, 108, -180, 162, 112, -229, 136, 131, 37, -150, -105, 282, 44, 144, 114, 70, -39, 237, 91, 84, -7, -51, -43, -16, 133, -42, -63, -57, -98, -122, 59, 179, 120, 156, -18, 129, 60, 45, -51, -87, 84, 19, -24, 157, -149, 94, -19, -17, -107, -239, -83, -88, 93, 175, 0, 233, 20, -150, 143, -112, -171, 250, -60, -59, -7, -34, 217, 173, -171, 47, 3, 113, -15, -34, 33, -61, -150, -281, -252, 58, 129, -98, 52, 9, 64, -45, -101, -166, 137, 113, -84, 50, -160, -153, -87, -154, 88, -106, 247, -89, -41, -106, 153, -183, -62, 9, -90, 227, 40, 129, -46, -20, 112, -121, 109, 159, 131, 130, -110, -35, -184, -43, 94, -187, 84, -178, -224, -82, -9, 102, 148, 191, -197, 18, -150, 224, -25, 173, 125, 89, -215, -31, -127, 49, 221, -52, 148, -12, -69, -122, 87, 149, 39, -45, 338, -96, 478, 207, -202, 70, -221, 285, -198, 76, -80, -60, -140, 99, -260, -28, -135]
7476a35J58m1j5m7J75M1j10M7k04K64N1p6o1p1j2J1P3q6K01k81K7J20k8n0K1O6
7502C8N4o4J9n6o5J79j4J15j76r2K3O0L4J06j23O3m%Jj26K18j8j80n2J%n4Q0j85
7531b18qK85m9r9L18J11m21R2j28j34K31P0j54L4k35L5L12N0k1J20j14j47J52
7554H2K8j47M3k31Q8J15K9k7J08L3k53K43j52P0L7p6K07k20Q0k96L07r6j9q4K62
7579A31j27Q1o1j08J42L6j60J8K37l53P5Jk0pN7Q8k68J87K16j39K0j23j9K36j34
7604Fj03J80j85K51k35K61l18Q7J24o0J21j30j49q8K10j2O9j08J7LJ44Qn5j2j88
7629a62L08R0n2k88P3l3K32Q9j40J04k36J93l64L44j45J2m7J53j42M9J05k36R0
7652cJ8p3J12N4n3n4n7J14L8j40p6R8Ok12L64L4p8k03N4Oj44M8n3OP1J72m10L37
$$ y = [-135, 23, -18, -33, -80, 95, 136, 26, 73, -131, 133, 184, 108, 47, -24, -36, -25, 48, -38, 163, -118, -91, 29, 1, -49, -28, 38, 92, 28, 47, -9, -74, 105, 91, 206, 30, -62, -39, 21, 55, 161, 38, 101, 97, 97, 98, -28, 190, 172, -8, -60, -59, -59, -113, -33, -218, -226, 59, 10, -89, 229, 340, -81, 11, -117, -251, -20, 50, -104, -70, -305, -270, 42, 92, 71, 191, 77, -70, 82, 110, -37, 6, -225, -137, -22, 7, -20, 88, 121, -132, 111, -41, 29, 66, -10, 197, -23, 57, -239, 68, -28, -47, -131, 131, 4, 85, 24, -84, 58, 94, -66, -48, 189, -164, -89, -88, -108, -115, -58, 30, -238, -51, 165, 26, 46, -77, -96, 140, 6, -97, 83, -102, 149, -86, 175, -143, -56, 68, 8, 129, -1, -150, -238, -28, -40, 29, -79, -62, -59, 85, 93, 38, 26, -162, 146, 236, 184, -104, -31, -64, 168, 257, 117, 221, -15, 178, -186, 158, 13, 25, -22, 131, -11, 38, 143, -93, -3, 15, -58, 54, 108, 55, 1, -56, 58, 96, -44, -120, -22, -16, -228, 136, 170, 92, -111, -57, -51, -195, -147, -200, -194, -123, 49, -361, -24]
7680b4K04k22K4N8j03J39q7J5J38j76L5m4j44QK97r8P4l08J68L4J2J07k34L2M54
7705C59k24q9j42K45k96J54j22J57P1O8l4j21J86j25j1j05R0j31N4j16K83k41
7727i0J66k02K8P7O0j21q5J03J34n2J88k42J2O4p8l8J58r6l2J81k54q9L24R8l38
7752a24K03O1q3M5qL9j43K94j27k02k24K51l1j85J33M6K53k79p1J59j02K8J54
7775H7K5j37k73L24k0J17o2l27L96n6j25j7J53o6k34J36J60q3p1J22J59j98j02
7798i2J06J4K49l19J66k37J98j19o6P5K92l40J10k23J06L4k40K77j06J0J75L1
7820A01j46O7q8k4J11k80L37n9L8j94N6J51j8n9kJ94l11J32P3J37J5j64j17j52
7844b02J12R7j47M06l65L36l47J61lJ35j43j04L3L7On5r5J63rj95K01pnJ35o3
$$ y = [-24, 180, -42, -18, 40, -63, 76, -11, 4, 142, -34, 1, -43, -187, -179, 118, 20, 94, -214, -46, -12, 0, 107, -127, -95, 359, 135, 46, -96, 149, -147, 7, -115, 42, 113, 181, 147, 26, 212, 87, 76, -29, 61, -70, -16, -132, 151, -90, 76, -126, -98, -21, 39, -82, -167, -64, 70, 18, 206, -36, -24, 40, -38, -76, 82, -14, -46, 135, -119, -208, 116, 214, -124, 79, 140, 57, 102, 94, 133, -10, 284, 157, -45, -269, -18, -49, -234, -101, -55, 198, -81, -152, 7, -95, -67, 87, 112, -25, -298, 26, 6, 123, 61, -266, 130, 74, -51, -68, 85, 19, -215, -79, 81, -2, -73, 49, 208, 10, -92, 14, 28, 277, -42, 124, -113, 85, -34, -100, -25, 267, -73, 37, -186, -80, -46, -286, -9, -115, -105, 70, 101, -45, 22, -66, -90, 21, -259, 78, 19, 57, -137, -81, 70, 52, -7, -9, 185, -126, 6, 79, 216, 231, 67, -50, -202, -90, 7, -140, 266, -99, 237, -110, 51, 48, 183, 40, -64, -31, 6, 12, -43, -138, 25, 16, -179, 22, 15, 10, 145, 82]
7869H2Q5q0p8P9j44M5j51K68l14K42l10N59j61j4n59N96k75j01L16k4n2o1J59
7892A07q8J65j86j0L7k2L3l32M07q9k80J63J12P9k75J4J56j8N3m06L53q4J04J59
7916A52j6j46o6R5N4k62J58q1j83M09n9j4J70j23p4Q5N4j18l4N0N6m00L00J07
7940A14l50r1L99n3p1oJ83J9j84K13k06K54k12M9n2J27j27J0k0p5L23m59J33K29
7964A47j8j65Q2K11p9j49j8k47P2O1K59Q3m14K45n1J45J72k13j59J24j53L15j43
7987A07Or4J77j1k28K01k33P3R2OM6j41R9J00j90o7k3J00R3r3O3r7l0Q4J60k79
8013g9J35Q0l55L42L6o1k99L65J8k79J38J00k78J07j7K54r4r4J23k17J6K46j42
8036D5j8O8j94K09Pr9oL37l16L1m2J14r2j35L03m98K45J96k99K4l7N2k6K62j68
$$ y = [82, 167, 87, 9, 88, -56, -11, -162, 106, -208, 34, -276, 283, 122, 108, -451, 145, -130, -231, 85, 61, 9, -52, 107, 19, 184, -2, -12, 25, 3, 36, -296, 111, 22, -258, -95, 17, 96, -179, -165, -9, -27, 26, -380, -27, -111, -7, 152, 136, -10, -76, 19, 73, -189, -31, -112, -295, 114, 55, 41, 211, 88, 14, 99, 153, 35, 1, 51, 107, -293, 7, 114, -236, -327, 72, 19, -52, -58, 125, 144, -40, 173, -33, 221, 9, 58, 6, 133, 6, 16, -4, -79, 244, -215, -82, 147, 129, -36, 46, 257, 178, 29, 11, -236, -164, -103, 156, 239, -175, 70, 19, 164, 336, 123, -36, 88, -65, 250, 107, 113, 19, 196, 185, -43, 158, -75, -2, 90, 96, 142, 1, 100, 200, 10, -57, -80, 20, 113, 20, 83, -14, -44, 40, 200, -79, 56, 136, -219, 123, 159, 98, -201, 164, 182, -97, 41, 141, -137, -30, -47, 207, 113, 19, 142, -75, -59, 187, 45, 27, 95, -99, 110, 117, 18, 12, 349, 33, 64, 22, 136, 44, -91, 212, -286, -41, 155, -144, -120, -157, -105, -131, 131, -37]
8061c7Q2Q7j57L9L6q6j60r8M15l18J25J55n1J11k4j60J26R5l91K40J92k97J20
8084D4p5j03K59j9j08p5k82K22j2j59M96j02r3j16Q2P0n9K7N8o4j49J86j61K18
8108H5O1j99P6k00J29P7Pj02K17j43j77Q0K00j58q4K35L0j55J14j61K5N2q2q9
8132a62r3K19K42j47J2J73N5m6j83M3K83k79r2K46l27j42J04K55o8p7J10k31R2
8155a3n2oK35j47j16K01l25L12j75j64J73N1mm7J48j3P8r0%J85k76K29l10J14
8179a2R7p4J15j40j8M2J46k37J47j57J72P1
$$ y = [-37, 45, 132, -25, 14, 50, -36, -196, -294, 121, -197, -72, 83, 32, 143, 119, -41, 85, 180, -211, 29, 221, -76, 44, -31, -134, 125, 106, -2, -77, -359, -137, -149, -308, 188, 86, -7, -123, -41, 29, -30, -3, 55, -9, -158, 28, -133, 85, 146, -53, 23, -177, -48, 29, 36, -66, 151, 8, -169, -89, 111, -47, -131, 104, 134, -21, 93, -68, -43, 9, -73, -162, -255, -36, 206, 59, 71, 244, 299, 253, 70, 113, 396, 117, 25, 271, -56, -198, -94, 161, 93, 16, 126, -105, -13, -65, -71, 164, 17, -99, 102, -223, 89, -86, -250, -77, -26, -30, -77, 71, 58, 136, 46, 46, 231, -45, 184, -126, -12, 85, 11, 126, -14, -32, 10, 156, -81, 66, -91, 81, 152]
8191A52
$$ Imaginary data points
##PAGE= N=2
##DATA TABLE= (X++(I..I)), XYDATA
0@%%%%%%%%%%%%Qj6J6j6K0k8L2l9M7n3O1p2Q7j02J18j36J56j79K05k31K61k98
34a59L36l76M23m74N27n86O55p28Q04q90R85j087J198j321J454j601J765j945
52a020K143k366K618k901L223l596M035m556N185n963O954q270J0098j2804J7232
67A0012k5648M6920j92788l53265O04998L39365m10015l11758K26513K08139m4641
78I7832o7145p0239j14987J35088K46088j01616l45852J991L88493J03392l83773
89a10728j56471K96996J71385j69867j49419M6234Q1843M5577L4025j17621j36978
100a65024J61690J84587j60372j72611J25216J28977r3175m6108P9506o5141p0123
111i2578J63294O5217k05078q6747K00266J24076j81789j41580J55073J13224
$$ y = [0, 0, 0, 0, 0, 0, 0, 0, 0, 0, 0, 0, 0, 8, -8, 8, -8, 12, -16, 16, -23, 24, -29, 32, -40, 47, -55, 63, -73, 83, -96, 109, -122, 139, -159, 177, -199, 224, -250, 277, -309, 346, -382, 422, -468, 517, -570, 628, -693, 761, -840, 925, -1020, 1123, -1243, 1375, -1526, 1697, -1899, 2136, -2420, 2765, -3198, 3756, -4514, 5584, -7220, 10012, -15636, 31284, -161504, -514769, 90229, 429594, 19579, -292179, -65666, 142473, 97832, 30687, -39552, -154539, -19451, 226637, 125021, -220831, -218840, 169653, 273045, -110728, -267199, 29797, 201182, 31315, -118104, -71870, 9973, 55550, 89575, -28046, -165024, -3334, 181253, 20881, -151730, -26514, 102463, 9288, -36820, 42686, -22455, -92578, 70716, 135933, -69145, -155892, 44374, 168450, -13339, -154919, 154, 113378]
121A13378j18149n6553Q5215j6605q5911J06297J10223j99900j26520K58884J32241
132B02600k60291j39087K26649J38381j76853j04568J15460M4041m3512J8135
142B0955j0271o7203K6305J12179j9383j49413Q721J55588K542j34861k0687J05565
154C0037K4879p9010k123M1531l2104Q225N3231m9691n8989P4854N9883r2271
166b1548m9846J11063K3381j15675Q841J04861k3143r3094K2551Q9484k5291p9785
178d8201L0481N2541l1269k1216L0782n892m6762L1811P4561o3278r5826Q4499
190g769J03348q2966j05866O8566J01685n3632p3893L5438K8337o868J5663j4438
202G605m6476J6870P1894n098r1749o141R3577J6171p7089l1177N5946L7206m1522
$$ y = [113378, -4771, -61324, 23891, 7286, -78625, 27672, 137895, -62005, -188525, 70359, 202600, -57691, -196778, 29871, 168252, -8601, -113169, 2291, 46332, 2820, 20955, 10684, -56519, -30214, 81965, 62582, -86831, -78110, 77478, 80020, -54841, -75528, 30037, 54916, -24094, -26217, 15314, -16790, -8565, 44666, -5025, -64014, 10840, 70723, -21548, -71394, 39669, 63050, -52625, -43784, 61077, 37934, -55160, -32609, 56875, 31584, -48201, -17720, 34821, 3552, -17664, 13118, 7226, -39536, -7725, 66836, 3558, -92268, -7769, 95579, 12613, -93253, -24687, 76998, 23366, -50527, -15089, 13248, 6380, 22043, 7605, -38871, -22001, 49893, 44795, -46954, -53095, 40482, 56653, -20436, -51613, 4333, 41539, 17]
215A7k2903K1618n754M332K9858k4481m6900L0877O3509l2982p1944L9661O1342
228D6250m0386l6182L1812J6206k3692k872K7416j2094l1045K6676K7222k9759
240d48k2176K0416K3925j8677k4232K4713J0462k8746P746K5497j8436k7190K4537
253b609L4936l5670l3339M3650J9311l4891n032J8413l44o806P582K922k1594
266a3471N705L1412j3722k9991R393K7624K727l3613p882L5417K494k6187j37
279a0231J2175P00n490O022j411k0585J7741K7249l2076k2025L3457J8819k6012
292a667j9888K3114J6730k0384l685R512n004L265M089m585n406k355J4660L346
306A1742k3816%K1917J576k0376o753K4089K568k4660R067J3737j4472L66J1366
$$ y = [17, -22886, -1268, -7022, -2690, 27168, 2687, -44213, -13336, 50173, 17191, -54753, -15092, 46250, 5864, -30318, 1494, 17700, -5992, -8864, 18552, 6458, -24587, 2089, 29311, -448, -22624, -2208, 21717, 3040, -21192, 3521, 13983, -14763, -7017, 18480, 44, -27146, -2609, 32327, -3343, -36682, 6968, 26279, -8612, -13644, 4769, 4425, -2381, 5201, 8123, -13471, -7766, 23646, 9924, -20067, -10674, 16950, 19677, -13936, -21818, 13599, 16093, -10094, -10231, 1944, 2644, -2846, 3176, 1765, -18820, -1079, 26170, -5906, -27931, 5526, 24345, -1667, -21555, 1559, 18289, -2095, -5780, 3732, -1272, 1993, 6082, 1497, -3909, -6264, 8396, 11742, -12074, -12074, 9843, 11419, -8957, -15710, 8379, 10947, -13713, -4646, 9091, -5381, -5015, 6351]
320F351m372j0431O663J4021j2283j1829J7844L065j2285R05L780L965l507o742
334d855P271J969p711K024K870j21n103l46J0272p990p564J4132k249j0734P256
349h79N626n811n176Q019N187j1808J091J1457p114k801M006k143K446k11k537
364f48K114k352J482J920k791k467j593P270K856j4211J458J5112o381q484M092
379b623M806j473l143L825j796n104J0499L63j0143K760M709P38q86n192J606
394a054L865P79k262n788L870M554n115R09k52m278O516J450p185J30M321Q71
410A331l944J930L712p848J508J0967o436p077N129M509M60m528k677L676K081
425B793R72l911l197N473r80j474M593p638m002J1070L873j0042q060Q431J1040
$$ y = [6351, 1979, -8452, -1789, 12232, -51, -11880, 5964, 9029, -3256, -2351, 1429, 5394, 1887, -4855, 2416, 4385, -3326, -1302, 1568, 1447, -3656, -4002, 6270, -1720, -9284, 4848, 2599, -8135, -879, 4747, -1064, -6240, 1779, 6966, -4842, -3751, 7706, 592, -2209, 1797, -346, 2100, 1889, -648, 1466, -886, 596, 2516, -275, -2742, -4335, 2935, 5791, -8420, -6962, 8150, 1769, -6715, -2623, 2183, 710, -2433, 1392, -404, -5508, 4991, 5354, -4789, -2029, 2680, 3418, 2532, -2660, -1054, 2811, 3590, 1328, -4460, -590, 3964, -1151, -242, -494, -4772, 1744, 3194, -3991, -3861, 460, 1331, -2613, -683, 3029, -4819, -3311, 7656, 1220, -5857, -728, 3781, 4241, -287, -2964, 712, 2793, 3765, -146, -3343, 2130, 1150, -324, 4269, -3369, -7371, 3699, 7572, -2470, -10530, -2099, 8941]
440H941p415q462J944M973P411n160j0581O435O568k192j391j205j866l80Q003
455E623M529j5839n420J7536N296j1469j0688M025J6418j150j6645j566J1167
468A817N100q435l691O991n685j038J5033m469j8620L163K0806M078k2789q967
482a6706K1343J1543j2922j4421M040J6976j357j2552J917P59k095Q270M847j1979
496b337j4635J3413K4211j4291k6384P109K4249O824k2614j8110K0055K0603j0984
509G109j7997R04J4031L297m616o44j0970r63K2165N210k2684j6349J7562K9412
523B5467j3449l4902N010L3215O599k9768j5217K4496J3960j5251n420J971k274
536e563N074J0646k477k1812j908L0547O792k9577j3534K1409K4293j4697k8693
$$ y = [8941, 1526, -6936, -4992, -19, 7392, 2232, -8349, -1914, 4654, 2462, 1071, -134, -2000, -2380, 5623, 10152, -5687, -11107, 6429, 11725, 256, -10432, -6407, 10011, 8861, -7784, -9350, 1817, 6917, -1518, -5209, 1782, -3903, -4941, 10092, 5623, -12997, -9834, 10972, 15050, -7739, -16706, 4637, 16180, 3258, -11163, -7123, 9853, 8496, -4056, -2139, -1380, -3475, 4795, 9642, -2337, -16972, -3559, 20652, 6361, -20023, -12914, 11335, 18159, -4455, -22565, -2510, 18093, 7109, -10888, -9984, 4047, 7344, 2728, 2084, -8886, -9849, 12316, 17526, -5158, -21507, -3945, 25467, 12018, -22884, -17874, 15341, 21940, -7828, -23045, 1451, 15411, 160, -5260, -3289, -5563, -489, 10157, 7680, -14132, -16040, 14507, 21299, -8278, -21812, -403, 23890, 9193, -19500]
549a9500R386K2997k103j3672m211O222J798J617N698j1099j2024J3399J5090
562A3598n906j9324n493K3441J3137k0702j8194J2807K2413m792k2129J816J3293
575C965J214j413k641n768o02P798J0512r810j9682R056K3591k118k5616q496
589b0010K6696J3787k4051j2856J4146J0551m482p467N20n03J165J0600j748j5892
603i544K74J4066Q199j1663j5868J0171J7995n731j5218j555J2634N144q838l391
617c325J143Q67N384r60n606j590J193N877K725q869n085N312J0407p40j5260
632h527K27J4356P30p395m245L028M880L00o42l712m673O421O828l449q899m053
648h825J2191Q704j3209j0575R581J0906m194j1139L48P109K224J94n754n118
$$ y = [-19500, -10114, 12883, 10780, -2892, -7103, -881, 917, 2534, 8232, -2867, -14891, -1492, 13598, 7692, -11632, -17125, 6316, 19453, -1249, -19443, -6636, 15777, 10985, -11144, -9328, 3965, 5179, 3766, 1125, -4643, -5245, 2553, 13065, 3255, -16427, -7371, 16220, 14102, -11514, -20010, 6686, 20473, -3578, -16434, -2288, 8263, 3781, -3686, -3166, -3669, -2504, 8096, 6348, -9544, -9270, 4796, 12995, 1332, -14536, -4365, 13630, 7899, -7319, -8874, 3760, 8904, 66, -3325, -2182, -1315, 4069, 3109, -2497, -4087, -2894, 2983, 5708, -3161, -8246, -2934, 7473, 6733, -8527, -8300, 6056, 6786, -609, -4854, -1826, 3054, 3354, 2712, -1000, -5673, 748, 7576, 4127, -4772, -8825, 3366, 12070, -1139, -11714, -2133, 8773, 4579, -6560, -6212, 897, 3121, 3315, -2439, -7557]
662g557P064P186m032p406j062Q314M685o016o698J318Q642L542r256m613N812
677g7M429m90n506l101M886L560k017m715j274N202J096l137N41j889J40N780
693C428j966m610N55L959J956m269o20J461Q33J451m67l644K671Q31j134J137
709A572j733j581K750J176k046l743K266M407k906k383J629K12P57N15k534K46
725a396R53K762j970l241K890J522r51O29k501Q18L600k040k272K60K307Q23l770
742a577J61J935l79J529j800l070L984K52k551K60L19J233L08j435K72r86K086
759E41J855m056k09L748o42q74r28k13K585j57j680k34M89J828j037k616J875
776B75l88l76J447k011n16K226j13j032j523J296K449k632R4M43p43K456o15k180
$$ y = [-7557, -493, 6693, 2661, -4745, -5807, 2507, 7192, 1176, -5522, -4204, 4438, 7980, -1276, -5889, -77, 4352, 3862, -1644, -4745, 141, 3701, 1684, -3031, -4305, 897, 1993, -1144, -603, -2492, -2352, 3428, 1462, -3148, -2593, 1366, 3322, -947, -1567, -106, 727, 2178, 1711, -1933, 738, 1569, 435, 1572, -161, -1742, 1008, 2184, 138, -3605, -1339, 3068, 162, -2221, -592, -380, 377, 892, -1642, -1396, -443, 2319, 349, -2892, -2, 1520, 569, 1198, -1303, -485, 3115, 1075, -1197, -937, 1370, 2193, -1577, -1416, 519, 140, 1669, -131, -3201, 783, 1035, -1516, -1256, -937, 296, 604, -831, -559, -1545, 541, 2396, -1660, -1869, 1879, 1237, 363, -565, -778, 1807, 1650, -30, -264, 225, 2053, 1016, -1600, 275, -113, -489, 958, -1053, -1569, 657, 544, -488, -2011, -715, 1734, -898, -804, -361, -1104, 1352, 737, -1443]
794a443K109K01m62r4l69Q23n76J41Q83k415R71J782k393L59P29p43J230q41o10
813g18K82k62J291r63j176K311r46o24J969j402J1M73j30Q48j174M8J563j529
831a28L74J4r69J940m45k020J725n44m99Q72o24j88o31J425O84k929O93K845j763
850a68p97J51N24J376r91n76N71j55J040m42j179J123P32m91O40k517N52K334
868A727j273j130r6J181Q3j384J150ok098J969R76k418N05O55R92o32j353J541
886C89R5p34P39n29M34j6n06J772j278j659J451J233j449j175N84J431o50r49
904h17J182j037M2J806j816n30R35N29j66p49J98Q91j421J321P73k135O99J110
922H15M16q51k013J928K154k838j154K295J059k081j540L148M67m443J431L701
$$ y = [-1443, 666, 867, 405, 311, -58, 765, 189, 330, 1213, -1202, -231, 1551, -842, -483, 246, -497, 733, -108, -718, -436, -698, 593, -370, -1546, 765, -181, -805, 1164, -238, -227, 246, 116, 964, -210, -162, 1401, -128, 246, 260, -709, 1231, 786, -1234, 491, -53, -552, 320, -304, -492, -1123, 302, 986, -1943, -1250, 1595, -168, -965, -814, -290, 1086, 95, -481, 90, -65, 975, 533, -646, 477, 1209, 718, 1358, -1159, -607, 1727, 454, -676, -772, 409, 492, -892, 258, 252, -1846, 123, 1099, -1319, -814, -159, 833, 201, -1152, 389, 484, -250, 489, -40, 394, 378, -128, 1644, 366, -1293, 158, 1391, -58, -1233, -649, 782, 132, -817, 365, -672, -630, 1176, -640, -1170, -235, 294, 128, -621, -423, 468, -953, 368, 1141, -994, -295, 815, 1231, 380, -1633, 295, 2449, -389, -1543, 752, 1811, -270, -1810, 1338, 1805, -2638, -1207, 2494]
938B494j972l348K367K583j550m174L851K273l284j014J777J955j565k485L391
953A299J185l712k45K733R07k780j552L751L16l404O35J115k41N41j367N13J093
970G87j093r53Q68J347o91k565K111L013l960j206K538J890j779l604K695L864
986C262l052k950L435K173k790l090N019J408o025p6N999r11n676N17N851p55
1002B339o024J687M828j972l418J076L466j377l081K605K984m154r78L143J373
1017B497k189l335L596K685l478j102J402N41P35k166J33J592n20m27j015P80
1033b71J533k052j29K999k251k501K126K468r86m023J655N283l350l645K384L682
1049B922j233l949J527M297m180j205L704K14l444q22L721P90n135J85N629k213
$$ y = [2494, 522, -2826, -459, 2124, 574, -3600, 251, 2524, -760, -1774, 3, 1958, 393, -2092, 1299, 2484, -1228, -1473, 1260, 2167, -613, -2165, 1586, 1902, -1502, -867, 248, 7, 548, -819, -306, 787, -306, -1259, -391, 956, 265, -2300, -189, 2824, -1136, -2342, 196, 2086, 307, -3297, -602, 3262, 210, -2740, 695, 2868, 78, -3012, 2007, 3415, -2610, -2686, 3313, 2402, -3274, -2757, 3094, 2339, -3685, -1998, 2830, 858, -2560, -1484, 1982, 605, -2476, 129, 3113, -1041, -2019, 1124, 2497, 308, -3027, 569, 3254, -224, -1326, 76, 617, 1352, -814, -681, 911, 391, -36, -1051, -271, 1262, -790, -919, 2080, -171, -2672, -546, 1922, 936, -3087, -1432, 3851, 501, -3144, -760, 2922, 1689, -2260, -733, 3564, -616, -1821, 1883, 2097, -1347, -2169, 1552, 2342, -2793, -2608, 3021, 808]
1065H08k807O84K282r14r66M74J328r24j851K224P69j905j221K384J092k477M97
1082e23J970j490K87j0q84K71P89P03j636j200L370n55k623J213Q90q03m31M95
1100a67J785k565p39L407r5k832k9K750M98l287J72K901o76k821K207N27q96j206
1118a066J737J055l441N55K827q87k218L81J649m57j340J143J015r18o32J691
1134A094j037l66O03J66j83j444J172J272j804l3J130J290k843J037L30J35j635
1151a116J493R28l146J159J542k58j267K81J433q68j588J523O92j192l94J237
1167D59N69j572q04K788n77k173J328O14m98j030J176J412k126j025L041q49j422
1184f89rJ728j072j808J729J281j874q05K419n80j223M34P90J352k366O14J282
$$ y = [808, -1999, -1315, 967, 53, -913, -439, 889, -35, -1886, 338, 1107, -798, -2019, 365, 1457, -1020, -523, 1447, -43, 244, 234, -650, -379, 410, 1113, -523, -1723, 1647, 1092, -1531, -318, 572, -231, -662, -167, 1618, -947, -1686, 1721, 1626, -1206, -1235, 1515, 2013, -1274, -1102, 1799, 1123, -1698, 509, 1036, 140, -1066, 671, 1726, -1715, -1160, 1667, 780, -1438, -1057, 592, 135, -1205, -62, 953, 35, -597, 1094, 57, -309, 294, 460, 277, -1167, 5, 1277, -527, -560, 570, 1860, -983, 54, 384, 519, -1116, 377, 1305, -1841, -682, 860, 602, -665, -384, 1049, 181, -1407, 116, 808, -384, -778, 459, 1028, -544, -1348, 1440, 863, -1310, 18, 632, 134, -896, 280, 1692, -434, -1459, 1582, 733, -689, -698, 1030, -42, -1850, -121, 1160, -714, -1519, 900, 320, -903, -469, 321, 1673, -693, -79, 1203]
1201A203r70q47P61J284j418j498K632N70k620N35J229j156o08R03O68r91n07
1218h30J146L14j550R65O25o94R4J40J126j368j15QR52k374J371J102m17j468
1236i73M78J484o38j955K389K39j324j5J326J71j335K30Q06k125n20K244j480
1253i98Q78q98J044N83k311J290K003j076j440J048K45r41M03O54O32j553m35
1270h72K316n00j152P7Q29k04j494J024L22r34J75J062j171J27j07Q04p90l44
1288h32J046L14q20J56K10K2o9k77Q45m68o48Q02K89q20K66L44K93j114o2J286
1308G63o49q88J158j28n33oM55R56q54j043J372m00p80M31K70M5n56O0R05m34
1328A44m92P46M6l27j79K97J15p12M33N95q55n6M45k89pJ91m2J15o23M6P44o58
$$ y = [1203, 233, -614, 147, 1431, 13, -1485, 1147, 1717, -903, -368, 861, -295, -903, 0, 668, -323, -830, 316, 630, -920, 45, 670, -24, 70, 210, 1336, -32, -147, -139, 813, -1561, -190, 912, 495, -973, -495, 989, 351, -1604, 785, 1024, -300, -315, 1011, 1182, -153, 77, 883, -1242, -1762, 482, -998, -120, -1018, 26, 609, -1702, -412, 1591, 515, -925, 123, 368, -573, -170, 484, 1116, -437, -872, 1444, 944, -208, -131, 698, 494, -1000, 24, 346, -588, -413, 649, -522, -395, -502, 302, -488, -832, 214, 528, -292, -136, 74, 96, 27, -250, 595, 127, -521, 281, 570, -250, 16, 360, 653, -461, -523, 763, 114, -774, 384, 256, -277, -283, 172, 1128, 274, -769, 603, 203, -577, -146, 124, 169, -387, -327, 578, 144, -348, 398, 444, 117, -62, 235, 350, -362, 71, 666, -189, -245, 200, -89, -96, 95, 53, 168, -455, -409, 335, -323]
1350c23K31L40q9L6n97N66J12l00k21N61m34K91l7M28l23o50Q92j35o65M80l0
1371A33j38j88J88M7N4m74K10p9J20L16l03J70j60J64J00ql04L56l66J33K02P4
1393B47j74j3N5L74n55j82P62n18o1o7K27O5l83%L16j78k02K72K24k02m35K73
1415a55L75m53q0J57M84Q1p67L62O67p27k24M21K21Oo80J41P82o97K2J24J67k74
1437d7m80N78M94p23k73P40j33m32l92R62J33j007L87P14n16l61K37L69L00q88
1457c38J23N66P2n26Q3J89L56r97l5J032n99m11M08K72K44r45j06J145l73o27
1477d67J87M99k8n64j94J347n39q28O40K56j07n27L0R54l93o33N91J92q1q92L58
1498a99J051j038n01J012J61n62n69M90N32o53l96Q38J04k88j7J27L44j45m42
$$ y = [-323, -92, 248, 159, 195, -402, 164, 276, -24, -245, 316, -118, 173, 136, 564, 241, -409, 483, 348, -317, 163, 133, -5, -193, -5, 42, 96, -378, -168, -247, -127, 189, -114, 56, -104, 60, 160, 152, -152, 204, -162, -29, 173, 247, 73, 60, 115, 489, -66, -248, 514, -4, -65, -132, 95, 160, -223, -223, 93, -85, -287, -15, 209, 7, -428, -155, 220, -233, -313, -156, 328, 409, -358, 4, 671, -56, -280, 141, 362, 368, -312, -171, 611, -86, -64, 60, 227, -47, -527, 51, 545, -178, -451, 289, 156, -276, -668, 294, 427, -580, -193, 521, 5, -356, -119, 250, 550, -338, -215, 351, 423, -103, -20, 169, 525, -472, -507, 525, -74, -485, -77, 195, 439, -506, -612, 533, 160, -467, -280, 219, 191, -373, -567, 780, 241, -587, 53, 309, 202, -325, -295, 659, 266, -367, 224, 416, 335, -557, -199, 852, -186, -687, 325, 486, -76, -645, -155, 377, -276, -672, 166, 270, -18, -35, 92, 436, 291, -151]
1517a51L02L6j01k01K05M89o40q1L99Q2l77l94K48M50m50m34P45J30o16k58P44
1538A27L41o79m19R90J21p76J13M52p8m77j08R04j11q65N34L05j48m71k02J015
1558E68l17o42N40j3k32k86K72N94n78k96O49k26l04j2K9L19k53n9L61k07J8P2
1580cK08k03R4j50K96j36k00L94m30J22K01k97J28J69r6l70k52P70k02p64N34
1601a87L83m38j88N82K45j99m21M80J17n27J50J54J35l31k8N28p0p89L95L25n1
1622B65l57QL51k54m42N18j4l01K02n7J50l9k38J74p0O3l4k8M28k55J07j80j48
1645a51L62O0m67M31N7l04j6K57j53j87k24M09J99n47k30O22k89k98L74J74m0
1666C9o38P06J41n12N2L53p3l81J54N17o9n17L88J95l17j32l2O23l12m89M77k35
$$ y = [-151, 151, 187, 86, -115, 90, 579, -61, -142, 257, 339, -38, -432, -184, 266, -184, -618, 127, 257, -359, -617, 127, 468, -211, -630, 360, 481, -295, -182, 270, 192, -285, -393, 511, 400, -465, 69, 374, 226, -245, -447, 568, 251, -391, 149, 136, -96, -382, -110, 484, -94, -390, 259, 33, -271, -283, -254, 65, -188, -247, 114, -93, -75, -3, 205, 2, 96, -54, 242, 106, -94, 300, -130, -8, 193, -104, 24, 193, 97, -273, -525, 245, 43, -721, -187, 196, -242, -430, 152, 397, 198, -223, 257, 374, -153, -3, 151, 286, -45, -73, 455, 385, -404, -9, 316, 265, -92, -84, 267, 13, -429, 89, 75, -226, -24, -81, 69, 30, -208, -34, -104, -41, -75, -103, 325, 70, 177, -3, -151, 211, 271, -196, 235, 292, -12, -28, 229, 76, -111, -335, 74, 273, -274, -504, 118, -171, -469, -95, 79, 39, -599, 107, 248, -264, -212, 141, 68, -313, -159, 358, 289, -228, 160, 355, 38, -94, -126, 497, 185, -304, 173, -62]
1688f2p2L8J66p6k3j51K60j60j86K59j04l05N44P1o7k09J17K26l37M9K92l59k5
1711a14O2o9M51k17j90K40j17j42L64j33k21lJ8K61p58O83K47m76J50M4rk6j33
1734h8%J07l74M34J32l77q8K22K24j53l28N28j19m17K36K49k97l2j77M25j00j14
1756a07J00r3j48L04j89L1P8J52J01l48j10M18k13j07L29k83M71m27J59K5Nm37
1778b89K40J59J28j41k07K94l78LL55j26j01Pn1J46k01J56K9r9J17o5p5J13M4
1801E8J23o8l84N12J01k93k9M4j15R6l08N56j86k18K09q2l19J5L99k02k14M9L94
1824A38j32J6j07q7M90k13k87L82%l10L16k2l19J72J36o8j74m6M3P0o0M5J66l55
1848b06L19k11J8j20M31k85N9l74M32J51k99J36l7Q2k57k18O23J55n07p0O8M3
$$ y = [-62, -134, -96, 70, -6, -29, -180, 80, -80, -266, -7, -111, -416, 128, 199, 132, -77, 40, 266, -71, -22, 270, -89, -114, -52, -121, 330, 113, -77, 163, 46, -96, 268, 135, -86, -89, -71, 190, -568, 115, 362, -114, 36, 80, 71, 45, -88, -88, 19, -355, 79, 211, -166, -254, -32, 192, 39, -289, 239, 120, -297, -61, 188, -109, -141, -318, 107, 7, -107, -7, -100, -248, 56, -133, -102, -24, 128, 229, -119, -229, 189, -24, -131, 198, -85, 386, -41, 118, 143, 148, -289, -49, 110, 238, 97, -110, 184, -194, -191, 164, 38, -63, -56, -107, 39, -162, -6, 23, -76, 41, -24, -99, 14, 58, 181, 113, -271, 241, 342, 49, 20, 64, -51, 45, -263, 293, 107, -111, 98, 16, -303, -288, 111, -91, -305, -256, 138, 6, 22, -85, -172, 318, 105, -182, 200, 200, -110, 206, 184, -135, 37, 173, 105, -69, -115, -72, -2, -62, -17, 149, -206, 113, -98, -80, -200, 231, -54, 5, -369, 63, 214, -85, 51, 14, 96, -161, -379, 244, 399, -108, -178, -110, -67]
1870f7n2M58m66K3M53o70M13L67n11l63L37k05jL86NR5k24K9P8M6k20P8j63K63
1894H9j34J11P4K16k37k09L20J30k65l53M61k33p4j59O58n20O7j17L69j10k55
1915a71K06r4l44L89p28Q05k0m41N35M8O5k96N2J55j14m12N23k10J26j26J59k59
1937a52M40p80L57o8R2p0m19M83J12n39N40O4J88R8n53N33j40q62N19M43k91m7
1959e2l70O50l72j7K90q6k60k97L66K75L16n83j87Q45m63n39P77j37l99P7N26
1980C60j83m14J94K25k5k01j6K46j76J54j18N1j01J00k99K90n1k20K44n7k0q8
2002a05j70N03j1l3l68N4L14k39j4J75j19k31M76j39l10K22j97K47J03k85K46
2023A19l46J41K17m12L17q8N8mj44j29l6N06j11m9k47l78O79Q35j208P94j44n50
$$ y = [-67, -119, 339, -127, -104, 349, -321, 92, 459, -52, -415, -78, -283, -284, 102, 107, 202, -22, 7, 85, 131, -89, -11, -174, 89, -45, 66, 140, 356, 119, -90, 230, 360, 95, -258, 203, -30, -104, -263, 395, -125, -58, -175, 194, 84, -171, 35, -59, -403, -14, -742, 63, 43, -398, 137, 185, 250, -46, 6, 161, 47, -365, 158, -52, 74, -52, 107, -152, 288, -492, -135, -203, -111, -181, -600, -117, -5, -544, -4, 60, 248, 346, -207, 326, 186, -676, -157, 286, -5, -52, -422, 228, -144, -161, 129, 43, -217, -514, -148, 127, 443, -140, -327, 518, 55, -484, 293, 156, -243, -166, 360, 177, -237, -43, 182, 157, -44, -60, 186, 10, 164, 46, 97, -4, 96, -203, 87, 36, -184, 60, 3, -17, -105, -275, 228, 217, 184, -184, -130, 184, -55, -69, 106, -13, -244, 232, 93, -217, 5, -192, 55, 158, -127, 119, -227, -86, 131, -281, 36, -52, 6, 2, -142, -271, -307, 199, 88, 39, -208, -586, 93, 928, -280, 514, 370, -180]
2045a80O3m35P41N5n36P92r88M65J85L42N67p02n74L18K35l55j48M16l53J78j37
2066e1n8J69j46l4J87r4J92k54r0K54k59K68o0k01R7K08mJ37q3j95j42M93l75
2089d1o5K65l13K48p2Q8J88k43j08K28J32o07M6J73Oj31j05M34k50q2K58K83m09
2112g7l4K08J93k77Oj28J64j26j14M05j61l16K90q2mj45P7K25K7k70P4j45K67
2135E7K86n69o1O7M16j45m27J39M26j81j48K0J88j98RJ39p8K9K3J76j04p6l7N9
2159A0K06n46J22M36l51j64M71j07k61J77K28k92j45J59R8m6p1K55j75J11r1j89
2181a65N19m12P5O6j63K31M3p4j79j37N1L34m70L20J5j12J40j99p7L28j45K01
2203A90k35j08N14m41j0O6r1J05J84k81L52m40K67k43J27K29j28j84K18l5j27
$$ y = [-180, -117, -552, 189, 244, -292, 500, -488, -23, 162, 504, 1071, 369, -205, 113, 348, -7, -155, 261, -92, 86, -51, -109, 60, -86, -120, 67, -27, 165, -89, -179, 75, -184, 84, 24, -177, -80, 128, 124, 261, 178, -17, -159, 334, -41, -106, 159, -154, 94, 22, 110, 298, 55, -53, 175, 307, -300, -254, -81, -75, -206, -311, 123, -127, -209, 49, 332, -77, -111, 97, 290, 13, 19, -109, 55, -71, -185, 220, 59, -257, 33, -49, -53, -198, -121, 104, 131, -139, -65, -210, 57, 343, -226, -287, -220, 196, 51, -376, -237, 189, 8, -140, -120, 68, -130, -121, 18, -60, -31, -8, 168, 64, -12, -49, 10, 216, -330, -208, 228, -123, -287, 184, 77, -184, -7, 221, -71, -216, -57, 41, -5, -76, 179, 4, 115, 24, -165, 354, -58, 17, 83, -80, 151, 194, 120, -59, -196, -145, 189, -281, 39, 54, -58, 82, -117, -194, 134, -11, 190, -45, -153, 361, -80, -90, -24, -115, -10, 174, -107, 245, -195, 72, -171, -44, 185, 57, -127, 91, 56, -71]
2224g1j5l4l7p2L04K50k74j30N92m99j72M43j93m9q1l4K20k59J27R9j27k42K92
2247C8J28j40J10o5j8k66K32o5R1l4mK34l09O2n2q6J17p6L83j73j88K88Q7j57
2271A37k15J41k74L43k99J91o5J80o8K3j44K5j10J30J56j72m7K71l91J28L59l13
2293a4p8K04kj99J9J22N8k00m0L52k1j83m7K83r9l52L73j36j0k01R5O6M9q5On9
2319i9K01J04L6k70M9P2k66J38k39K66J10r0J71k71K66l7J20k75M09n14K67j13
2341C5k94O1K62j67j3J91k0r3k58M72j70j89J32J7J06j82n2L43m4j78P7J61l84
2364a87J51J2j84K74J6l41K05j00L00L4k85M2K02r8j53K19l9k57J36j44K30M4
2386G7j63L40l53J61j58P7J71k22J39o5R7k4J87k26k36L25M5Op0k13Q5J0j06J79
$$ y = [-71, -86, -120, -157, -229, 75, 325, 51, -79, 513, 14, -158, 285, 92, 43, -38, -72, 148, -111, 16, 115, -12, -254, 38, 166, 26, 136, 71, 53, -213, 19, -46, 45, 11, 7, 241, -68, -6, -58, -144, -27, -103, 280, 107, -81, 207, 294, 137, -78, 63, -211, 132, -167, 24, -41, 139, 71, 94, -50, -25, -135, -5, 151, -21, -68, 203, -188, -60, 299, -14, -92, 112, 110, -89, -70, 52, 110, -90, -130, 222, 201, 18, -29, 254, 155, -197, 176, 40, 30, -171, -76, -10, 39, -46, -40, -99, 102, 206, 242, -28, 21, 93, -173, -35, -274, -8, 102, 12, 183, -88, 178, 141, 261, -14, 395, -119, 148, 35, -259, -198, 64, -103, -116, 75, 55, -38, -296, 176, 6, -183, -51, -34, 72, -110, -162, 181, 137, -41, 36, 197, -187, -36, -24, -208, 66, 82, -259, -54, -154, 146, 180, -105, -63, 139, 41, -112, 107, 68, -189, -53, -197, 33, 77, -86, 254, -99, 62, -96, -19, 152, -70, 69, 4, 101, 77, 264, 38, -198, 127, 172, 178, 108, -105, -20, -10, -116, 63]
2410F3O5l67jK22J28p0K5J89j39l41O4J8K50j45j8pJ10k55K24r3J76j44Q2J09
2434A45k53Q7J70j96J9J64k10J00Lk93P4K65J1k05J77r2M8p1M0j06P7J09n2J01
2458A12J62k69K07k50j5q3O2M9K8j19K1J47J11j50J08j95O6j35N3J70Kk08Q7j1
2482e0J24k80J95J24Jj36NL37k30l45K93J12k64J80k1J9j88O1l8j08J97P8P5j76
2506c5J4R0j33rpK3L26l49K64l62K96mj5l7q5J01j96M5j10M36kj05j15o0J63k20
2532h6L2l0K7r3K02j14J37j82Q4J23l56O7K73K7j55JJ72J8j52p3l9j8K2K77o4
2557A00j21R9%J67j91LL1j67k8K1J47J86Rj63k65K35K04k51j78K59l19K19r4K0
2581g7J48l6q6J29N4M4k74J87KM3j33L1j96L2O0J14J84l44K8k1J90j15q6L59l35
$$ y = [63, 128, -239, -240, -18, 110, 40, 65, 254, 115, -226, -162, -144, 106, -39, -57, -64, 46, -209, 15, -78, 98, -46, 36, 145, -108, -21, 149, -47, -28, 136, -74, 26, 29, -264, -190, 75, 86, -119, 58, -34, 14, -57, -17, -123, -46, 63, 11, 112, 274, 5, 212, -38, -53, -136, -74, -25, 3, -116, -95, 52, 163, 13, 121, -74, -8, -143, -90, 80, 82, -126, -39, -50, 74, -206, -11, 113, 114, -22, -17, 320, 90, -255, 38, 150, -114, 66, 45, 64, -124, -63, -101, -209, -12, 66, 141, -35, -21, 69, -64, -73, -80, -57, 269, -80, 184, -178, 118, 114, 99, 62, -23, 78, -118, -73, -183, 253, 251, 146, 31, -29, 134, -86, -54, -84, -57, -150, 52, -62, 75, -107, -23, 100, -256, -189, 84, 111, -44, -43, 129, 147, -5, -78, -117, -135, -113, 164, 100, -21, 78, 78, 245, 54, 57, 88, -79, -107, -86, 61, 247, 256, 93, -172, 63, 267, 16, -162, 97, -222, -3, -97, -77, 71, 35, -51, 78, 132, 176, -98, 89, 91, 134, 1, 32, -164, -132, -72, 42, 226, -118, -90, -111, 79, -36, -122, 237, -98]
2606i8J58k5J36l51J11M74k39j63J2QJ98m27J52K22k96K43L9q5m0j53K65r9jj21
2630h0J12j58lJ38K2J7j89J86M8j6j01J5J83k04K93k45j37j2L12O7l52N8l7J00
2654A7k06m4L17j07Q5j08J04k56L46j00P5j14oj5n3r7K50j26Q7j98m0M2J95Rj38
2679h1J84l32L25j83M5L70l89J14k17L68J69m16J8NJ2R2l04J13O5j22J07O8J16
2702A27j97J80k06R9Q1k00L8k4J85j51r3K8J31j44J56rm9l4Ok8R7m4J43q5K39
2727B46j56j90K14j46k9J66n5O5j43j09M11k15N4j34PK1L9j54M01j65J28o6j47
2750D3q2K2j64K29J16q4n1j66p6L20k69K35k10L55Q7m13R0J31K41m49o5N3J69
2773F2k40J22L78n19n2L56P8l08R1m4J56ok15l2j50M13j68q3K92m22L77r1j13
$$ y = [-98, 60, 35, 171, -180, -69, 405, 166, 3, 15, 23, 221, -206, -54, 168, -128, 115, 154, 69, 29, -124, 141, 42, 41, -80, 32, -126, -129, 9, 31, 48, -141, 45, 93, 77, -24, -9, 174, -30, 263, 18, -119, -131, 181, 248, -104, -46, -83, 17, -189, -233, 84, -23, 62, -46, 58, -198, 148, 48, 123, 9, 3, -12, -65, -162, 88, -38, 49, -149, -189, -147, 48, 57, -81, 103, -229, 96, -87, -42, 328, -61, 53, -164, 204, 373, -43, -25, -20, -8, 84, -220, -107, -42, -164, -57, 11, 127, -70, 110, -96, 3, 84, -116, -78, -102, 83, -68, -161, -133, -2, -146, 10, 1, -48, -82, -76, -104, -7, -51, 92, 7, 246, 90, -100, 114, -32, -61, 105, 50, 115, -28, -137, 274, 59, 113, -21, -14, 7, 46, -108, 293, 128, 256, 190, 43, -39, -17, -181, 48, 164, 80, 29, -137, -213, 107, -162, 73, -137, 218, 305, -108, -18, 113, 354, -95, -160, -107, 62, -178, -56, 322, -197, -249, 107, 185, -123, -32, -76, 80, 74, -141, -173, -323, 90, -78, -161, 131, -291, 86, -5, -118]
2796a18J00n9k4J71j43J20L2j70J24K24l76j07J60J43k19p0J36j16J64Q9l4j9
2818HP2l7k66J42j9K05l95L00k06m3P7K13j40J18l1J99k15J10j51K13o6j47J76
2841A17R1k92k1J10J89k70m5L22m5j3J61j15j93jN9Pj12k22K76L7r1J40j36j77
2865b24R7K53j94J3J34j22o3P6Q1j39P9j44J98J13k70j93K55K76j33j23N5j92
2887a67K58k9n1j58J66mP8k9j84L46j89P8j49J70Mk44MJ56j69J13O2j56J4J17
2911C7k15K77q5J79m1j49l1OK5q3p2K8L74m24Q3J55l10K00j13J69Lk84K02l9J58
2936E0l0K45k16J97j28j29r6m2N5k04L04PJ08J84l16o6J75j51r5Q1j13K07k0j11
2960a04K8J21j33J39k1j65kP3J08j23j7j00J4J53O8o2j51m9J58Mm8N2O7J16j8
$$ y = [-118, -18, -77, -101, 70, -73, 47, 79, -91, 33, 257, -119, -226, -66, 77, -142, -212, -76, -192, -28, 61, 27, 8, 80, 43, -223, -81, -100, 105, -290, 10, -196, -239, -162, 51, -89, 29, -2, 197, -18, 92, -59, 154, 88, -59, 117, 208, -84, -105, 5, 194, -76, -121, 201, 156, 143, 304, 189, -4, -5, 54, 61, -51, -273, 3, 40, -51, 89, -47, -224, -127, 126, -68, -55, 79, -43, -106, -30, 51, -88, -9, -153, 45, 158, -112, -305, -50, 226, 93, -30, 25, -167, 91, 62, 11, -147, 19, 15, 93, 64, -120, 226, 37, 115, -34, 136, 140, -104, -100, 56, -113, 0, 62, -94, -80, 37, -178, 99, 14, 193, 152, 3, -28, -22, 3, -80, -152, -124, 250, -174, -91, 64, -246, -46, -159, 10, 13, -271, -69, -108, 50, 20, 265, 49, 246, 118, -11, -107, -149, -94, -298, 6, 13, 121, 305, -11, -77, 98, -53, -148, -67, -180, 27, 7, -104, -76, 45, -88, 51, 30, -135, -137, -64, 44, -79, -96, -196, -182, -29, 39, -23, -174, -223, -65, -61, -109, -57, 10, 126, 108]
2985A08j51Qr2o1K41M9J06qj38m0j10J34j01k5J65P8K4k55P4J67l71J06j05K41
3009D4J11r2l50O36m44R3Q2k64M29l75K63k74M7j16J66Q5Q2j68J28K1j97J96m2
3032F1j48K90o8j72q1J54p1L38k87J28k75j00K26J74j16M3j90J37k60K13q8jK96
3055B03j28l18L31l44J22M6J65j09j51L13l03K08p9q8L2k1K79l35K2L0j35J01
3077a59K16k08m0J39J52j64K73j46j30K10M1k97M5O4n8p0J78j17j53L35j04J31
3099A38j09J01j18J39r1j87QQk2P6J57j4k06N6J0m9N1K1M98l38k33K50o5j49K71
3124B03j39j34J88J01q3l1j4P1j23o6K6l4N9j98J29K10j38J75k17K28j95Q6M6
3147A50k08N6l14L06R5j07k07L29j44Ln9l2N3J4J88J1J2j22J02m47L15J33L4K3
$$ y = [108, -43, -35, -127, -188, 53, 102, 208, 200, 62, 22, -88, 46, -55, -80, 85, 163, 187, -68, 6, 173, -198, -92, -197, 44, 155, 63, -287, 349, -95, -2, 80, -184, 245, -130, 133, -141, -94, -210, -44, 41, 123, -45, 83, 104, -93, 103, 61, -87, 203, 135, -37, -118, 36, -35, 303, 16, 144, -131, -231, -5, 169, 53, 96, -94, 43, -217, -4, -92, -93, 203, 75, -243, 88, -256, -134, -88, 77, -32, -183, 130, -173, 35, -44, -132, -100, -121, 158, -177, -155, -125, -260, -159, 57, -151, -191, -52, 100, -64, 209, 63, -67, 143, 184, -113, -68, -4, -62, -132, 46, -71, -224, 111, 7, 138, 29, 130, 12, 151, 60, -127, -119, -111, -133, -57, 100, 86, -120, -64, -54, -103, -52, -31, 467, 129, -104, 146, 81, -68, 203, 64, -70, 118, 219, 136, 105, 91, 162, 39, -27, -1, -35, 24, -174, -45, 165, 27, 202, -15, 213, 18, 104, 150, -58, -2, -316, -10, 85, -22, -229, 100, -44, -41, -100, -132, -79, -65, 123, 134, 146, 24, 126, -321, -6, 127, 161, 184]
3171A84k82K9K29K36m41K81J5j69J53k74J5J37k07K86j76L8K9J23k72J16j56O5
3193d1q3K81j8j92K44l56J74k29J39J85k22J61p0j02J39j26K01K36k88p4N6K0
3215C5M3j66O2R2L9n1n0k3J3L1j83J22J1j3ol7j5j34L07o2J00k6M4j32Nj92K16
3242C0O1j71J7MR0J06j69J08J71j60k51M26l10k7J83j09j22K66j62J34j89j36
3264b10J30Q7j3K00j44q3J69k18K89k71L0J59j57j77K62k9L1j46K67k82M7n5L8
3287g6r1J39K23k25q3N1m6J62J14k12q9M27l01k2J01j4J41j47Q7l05K21j08l9
3310i2J01Q8l38pL54l44K8J27J11p8P6J32mj32nJ51l10p2M5J02L74q2k22K22l07
3335h2K95q7m4m0J92l21r0L90l0j16NK4j50m3K83Mm49M18k5k41j48M51m5k27R
$$ y = [184, -98, -69, 160, 396, -45, 236, 251, 82, 235, -39, -24, 113, -94, 192, 16, 54, 83, 206, -66, 50, -106, -41, -124, 157, 139, -53, 191, -165, 9, -220, -81, 104, -118, 43, -27, -129, 10, -116, 85, 321, 33, -41, 15, 35, 78, -88, -26, 66, 105, 54, 4, -19, -6, 25, -158, -36, -25, -38, -44, -81, -96, -230, 77, 15, 115, 89, 133, 1, 6, -186, 30, 91, -80, -63, -59, 31, 137, -32, 76, 247, 87, -164, 262, -48, -75, 108, -1, -123, 143, -19, 115, -74, -210, -80, 7, -6, 194, 50, -33, 136, -82, 207, -64, -34, 125, -32, -209, 53, 24, 55, -91, 176, -106, -59, -114, -76, -167, -28, 195, -30, -113, -62, -108, 54, 168, -44, -133, 294, -7, -29, 72, 58, 199, 52, 139, -166, 55, -53, -92, 9, 97, -241, -248, 106, -238, -210, -83, 28, -50, 26, 158, 154, 22, 17, 168, -142, -214, -169, -67, 307, 225, 3, 225, -82, 213, 126, 82, 42, 234, -87, -177, 213, 183, 67, 72, 96, -54, -97, 186, 190, -259, 159, 134, -107, -255, 196, 151, -76, -67]
3360f7QJ18l90L33J36j97J90j89p1K60k55J14m7K39m0j94J1P1k27P0m1J33M3o9
3384f1O0qn7j37O2K67K86k94m1o2J10Ll06J05K53k4r5n8O7J6k27M1K19N9j35N2
3410I5k68K30q1J3K9j06P5p3J56l32J25LK18o4n2j45K58Nr7M6Q4o9j08o2K26k50
3436a44J44q0K90j51k41J33o7k64L86J39j59n3j56L21K1j60o5q9N35n51K01N24
3458E14k77j52j48N48j082N48o3j68L47K31m90K34P1Pl46J83N1L64m25M2K1%l5
3481b5j0P4L4k19M6P0M7J08r5K9k00K32l2J26l47J64n4M10m56N75k36k2k56k18
3505b55L76n36K92Ok2r9k30P85m14N7R9r8L01k23Q8j31J55k21m3l2J86j60K03
3528H4k77K22L1j56m3K04mo0q0J60Kml6L7m3j02R3k23K71j68K65Q2l24J02K03
$$ y = [-67, -59, 59, -331, 2, 138, -59, 131, -58, -129, 131, -124, -10, -57, 182, 142, -52, -41, 30, -197, -127, -168, -35, 8, -61, -1, -9, -66, -203, -141, 126, 412, 118, 77, 15, 125, 128, -178, -73, 180, 156, 61, 3, 70, 86, -141, -100, 119, 178, 43, 95, -173, 57, -24, -11, 18, -88, -13, -86, 70, -262, -137, -134, 84, 20, -32, -177, 81, 86, -11, 35, 119, 50, -58, -120, 106, -144, 0, -80, 210, 59, -182, -49, -116, -380, 6, 145, -14, -67, -223, 98, 119, -41, -106, -195, 340, -211, -10, 514, 237, 85, -63, 485, -597, -49, -112, -280, 67, 298, -192, 42, 113, 120, -226, -43, 8, 372, -53, -11, 10, 10, -25, -35, 39, 73, -146, -100, -30, 17, 125, 30, 59, -141, 91, 59, 185, -162, 2, -52, 358, -98, 477, 241, 219, -37, -255, 121, -415, -123, -117, -139, -238, -468, 317, -97, -40, 59, -39, 262, 39, 127, -4, 151, -70, -113, -145, 41, -119, 84, -193, 29, 60, -96, -139, 65, 61, 1, -79, 81, 83, 79, 43, 80, 37, -65, 28, -195, 76, -92, 173, 255, -69, 33, 236]
3553B36j1n54M74j26J36k12J27J45l81P0q6K08q5j59K48J52n6k9k24J97o5j00
3575i5NK6N3j75J8K33k0j03L5M0o5O4mK27k91K66k0j75Q9P2j86K60n5N6k29n87
3601e61O52n95J0O07J85k77o48J139j83l43J24o34M99K44m28J02K38l01N04m18
3621h4mJ57k13L58o8k94R9L23j41m59J98mL18k77j05Q0j07M54n6o1J57l61M8P4
$$ y = [236, 225, -329, 145, 19, 155, -57, 70, 215, -166, -96, -182, 26, -59, -218, 30, 182, 126, 97, -127, 70, 5, -95, -90, -64, -11, -186, -168, 65, 45, -58, -23, 17, -48, 16, 12, 239, -52, 214, 194, 19, 108, 180, -6, 254, 199, 255, 26, -561, 91, -504, -494, 113, 298, 21, -627, 512, 329, -14, 110, -524, -25, 219, -209, -107, 131, -170, 334, -84, -88, 69, -144, 214, 146, -148, -49, 274, 133, -326, -128, -132, 186, -91, -196, -116, -223, 231, 175, 114, 271, -90, -42, 32]
$$ [...]
8191A13
##END NTUPLES=NMR FID
##END=
