##TITLE=1H_Pr 53-Eth-C6
 CDCl3_CD3OD
 8 sc, 
 14.12.2021
##JCAMPDX= 6.0         $$ Bruker NMR JCAMP-DX V2.0
##DATA TYPE= NMR FID
##DATA CLASS= NTUPLES
##ORIGIN= UXNMR, Bruker Analytische Messtechnik GmbH
##OWNER= root
$$ XWIN-NMR		Version 3.5
$$ Tue Dec 14 11:48:01 2021 Russian Standard Time (UT+4h)  she@DPX200
##.OBSERVE FREQUENCY= 200.131346
##.OBSERVE NUCLEUS= ^1H
##.DELAY= (6, 6)
##.ACQUISITION MODE= SIMULTANEOUS
##.ACQUISITION SCHEME= undefined
##.AVERAGES= 8
##.DIGITISER RES= 18
##SPECTROMETER/DATA SYSTEM= spect
##.PULSE SEQUENCE= zg30
##.SOLVENT NAME= CDCl3
##.SHIFT REFERENCE= (INTERNAL, CDCl3, 0, 15.7039)
##AUDIT TRAIL= $$ (NUMBER, WHEN, WHO, WHERE, WHAT)
$$ ##TITLE= Audit trail, XWIN-NMR		Version 3.5
$$ ##JCAMPDX= 5.01
$$ ##ORIGIN= Bruker BioSpin GmbH
$$ ##OWNER= she
$$ F:/spectra/data/she/nmr/H-F/1/audita.txt
$$ ##AUDIT TRAIL=  $$ (NUMBER, WHEN, WHO, WHERE, WHAT)
(   1,<2021-12-14 11:46:46.67 +0400>,<she>,<DPX200>,
      <created by zg, POWCHK disabled, PULCHK disabled
       configuration hash MD5:
       00 E9 B6 7A A2 85 ED C7 34 08 36 98 17 FE 4E 26
       data hash MD5: 16K
       AE 51 B9 9B FD 7D 16 69 CC 36 70 F0 EA 1C F5 AA>)
$$ ##END=
$$ 
$$ hash MD5
$$ 5C E6 54 82 23 96 80 9E 1E 45 25 BB FD C7 9D A8
##$RELAX= 
##$RELAX= 
##$RELAX= 
##$RELAX= 
##$RELAX= 
##$RELAX= 
$$ Bruker specific parameters
$$ --------------------------
##$DU= <F:/spectra>
##$EXPNO= 1
##$NAME= <H-F>
##$PROCNO= 1
##$TYPE= <nmr>
##$USER= <she>
##$AMP= (0..31)
100 100 100 100 100 100 100 100 100 100 100 100 100 100 100 100 100 100 
100 100 100 100 100 100 100 100 100 100 100 100 100 100 
##$AQSEQ= 0
##$AQ_mod= 1
##$AUNM= <au_zg>
##$AUTOPOS= <>
##$BF1= 200.13
##$BF2= 200.13
##$BF3= 200.13
##$BF4= 200.13
##$BF5= 200.13
##$BF6= 200.13
##$BF7= 200.13
##$BF8= 200.13
##$BYTORDA= 1
##$CFDGTYP= 0
##$CFRGTYP= 5
##$CHEMSTR= <none>
##$CNST= (0..31)
1 1 145 1 1 1 1 1 1 1 1 1 1 1 1 1 1 1 1 1 1 1 1 1 1 1 1 1 1 1 1 1 
##$CPDPRG= <>
##$CPDPRG1= <>
##$CPDPRG2= <>
##$CPDPRG3= <>
##$CPDPRG4= <mlev>
##$CPDPRG5= <mlev>
##$CPDPRG6= <mlev>
##$CPDPRG7= <mlev>
##$CPDPRG8= <mlev>
##$CPDPRGB= <>
##$CPDPRGT= <>
##$D= (0..31)
0 1.2 0 0 0 0 0 0 0 0.06 0 0.03 0 0 0 0 0.0002 0 0 0 0 0 0 0 0 0 0 0 0 
0 0 0 
##$DATE= 1639468006
##$DBL= (0..7)
120 120 120 120 120 120 120 120 
##$DBP= (0..7)
150 150 150 150 150 150 150 150 
##$DBP07= 0
##$DBPNAM0= <>
##$DBPNAM1= <>
##$DBPNAM2= <>
##$DBPNAM3= <>
##$DBPNAM4= <>
##$DBPNAM5= <>
##$DBPNAM6= <>
##$DBPNAM7= <>
##$DBPOAL= (0..7)
0.5 0.5 0.5 0.5 0.5 0.5 0.5 0.5 
##$DBPOFFS= (0..7)
0 0 0 0 0 0 0 0 
##$DE= 6
##$DECBNUC= <off>
##$DECIM= 32
##$DECNUC= <off>
##$DECSTAT= 4
##$DIGMOD= 1
##$DIGTYP= 9
##$DL= (0..7)
0 120 120 120 120 120 120 120 
##$DP= (0..7)
150 150 150 150 150 150 150 150 
##$DP07= 0
##$DPNAME0= <>
##$DPNAME1= <>
##$DPNAME2= <>
##$DPNAME3= <>
##$DPNAME4= <>
##$DPNAME5= <>
##$DPNAME6= <>
##$DPNAME7= <>
##$DPOAL= (0..7)
0.5 0.5 0.5 0.5 0.5 0.5 0.5 0.5 
##$DPOFFS= (0..7)
0 0 0 0 0 0 0 0 
##$DQDMODE= 0
##$DR= 18
##$DS= 0
$$ [...]
##$SUBNAM2= <"">
##$SUBNAM3= <"">
##$SUBNAM4= <"">
##$SUBNAM5= <"">
##$SUBNAM6= <"">
##$SUBNAM7= <"">
##$SUBNAM8= <"">
##$SUBNAM9= <"">
##$SW= 18.0517287032376
##$SWIBOX= (0..15)
0 0 2 0 0 0 0 0 0 0 0 0 0 0 0 0 
##$SW_h= 3612.71676300578
##$TD= 16384
##$TD0= 1
##$TE= 0
##$TE2= 300
##$TE3= 300
##$TEG= 300
##$TL= (0..7)
0 120 120 120 120 120 120 120 
##$TP= (0..7)
150 150 150 150 150 150 150 150 
##$TP07= 0
##$TPNAME0= <>
##$TPNAME1= <>
##$TPNAME2= <>
##$TPNAME3= <>
##$TPNAME4= <>
##$TPNAME5= <>
##$TPNAME6= <>
##$TPNAME7= <>
##$TPOAL= (0..7)
0.5 0.5 0.5 0.5 0.5 0.5 0.5 0.5 
##$TPOFFS= (0..7)
0 0 0 0 0 0 0 0 
##$TUNHIN= 0
##$TUNHOUT= 0
##$TUNXOUT= 0
##$USERA1= <user>
##$USERA2= <user>
##$USERA3= <user>
##$USERA4= <user>
##$USERA5= <user>
##$V9= 5
##$VALIST= <valist>
##$VCLIST= <CCCCCCCCCCCCCCC>
##$VD= 0
##$VDLIST= <DDDDDDDDDDDDDDD>
##$VPLIST= <PPPPPPPPPPPPPPP>
##$VTLIST= <TTTTTTTTTTTTTTT>
##$WBST= 1024
##$WBSW= 4
##$XGAIN= (0..3)
0 0 0 0 
##$XL= 0
##$YL= 0
##$YMAX_a= 431243
##$YMIN_a= -866213
##$ZGOPTNS= <>
##$ZL1= 120
##$ZL2= 120
##$ZL3= 120
##$ZL4= 120
##$ABSF1= 10
##$ABSF2= 0
##$ABSG= 5
##$ABSL= 3
##$ALPHA= 0
##$AQORDER= 0
##$ASSFAC= 0
##$ASSFACI= 0
##$ASSFACX= 0
##$ASSWID= 0
##$AUNMP= <proc_1d>
##$AZFE= 0.1
##$AZFW= 0.1
##$BCFW= 1
##$BC_mod= 2
##$BYTORDP= 1
##$COROFFS= 0
##$CY= 11.3945322036743
##$DATMOD= 1
##$DC= 2
##$DFILT= <>
##$DTYPP= 0
##$F1P= 2.36226072786647
##$F2P= -0.459571619588291
##$FCOR= 0.5
##$FTSIZE= 0
##$FT_mod= 4
##$GAMMA= 1
##$GB= 0.15
##$INTBC= 1
##$INTSCL= 1
##$ISEN= 128
##$LB= 0.24
##$LEV0= 0
##$LPBIN= 0
##$MAXI= 10000
##$MC2= 0
##$MEAN= 0
##$ME_mod= 0
##$MI= 1.114404
##$NCOEF= 0
##$NC_proc= 0
##$NLEV= 6
##$NOISF1= 3.799351
##$NOISF2= 2.8
##$NSP= 1
##$NTH_PI= 0
##$NZP= 0
##$OFFSET= 15.70392
##$PC= 1
##$PHC0= -15870.46
##$PHC1= 7.0008
##$PH_mod= 1
##$PKNL= yes
##$PPARMOD= 0
##$PSCAL= 0
##$PSIGN= 0
##$REVERSE= no
##$SF= 200.130013532006
##$SI= 16384
##$SIGF1= 3
##$SIGF2= 2
##$SINO= 400
##$SIOLD= 16384
##$SREGLST= <1H.CDCl3>
##$SSB= 0
##$STSI= 0
##$STSR= 0
##$SW_p= 3612.71676300578
##$SYMM= 0
##$S_DEV= 0
##$TDeff= 0
##$TDoff= 0
##$TI= <>
##$TILT= no
##$TM1= 0
##$TM2= 0
##$TOPLEV= 0
##$USERP1= <user>
##$USERP2= <user>
##$USERP3= <user>
##$USERP4= <user>
##$USERP5= <user>
##$WDW= 1
##$XDIM= 8192
##$YMAX_p= 0
##$YMIN_p= 0
$$ End of Bruker specific parameters
$$ ---------------------------------
##NTUPLES= NMR FID
##VAR_NAME=  TIME,          FID/REAL,        FID/IMAG
##SYMBOL=    X,             R,               I
##VAR_TYPE=  INDEPENDENT,   DEPENDENT,       DEPENDENT
##VAR_FORM=  AFFN,          ASDF,            ASDF
##VAR_DIM=   8192,          8192,            8192
##UNITS=     SECONDS,       ARBITRARY UNITS, ARBITRARY UNITS
##FACTOR=    0.0002768,     1,               1
##FIRST=     0,             0,               0
##LAST=      2.2672688,     0,               0
##MIN=       0,             -866213,         0
##MAX=       2.2672688,     431243,          0
$$ Real data points
##PAGE= N=1
##DATA TABLE= (X++(R..R)), XYDATA
$$ plain form
0 0 0 0 0 0 0 0 0 8 -8 8 -8 16 -16 24 -32 32 -48 56 -70 80 -97 120 -142 166 -193 229 -265 306 -354 406
30 406 -463 529 -603 681 -771 869 -977 1093 -1223 1366 -1519 1690 -1874 2075 -2298 2537
46 2537 -2802 3088 -3403 3751 -4130 4550 -5016 5534 -6114 6764 -7507 8354 -9340 10499
60 10499 -11885 13575 -15698 18446 -22163 27500 -35844 50810 -85923 344611 -117293 -719524
72 -719524 175331 207926 -189314 -59518 165803 -67164 121450 251708 -243822 -413225
82 -413225 183386 267344 -117062 -111118 164623 116984 -84750 -173215 -98361 89538 211815
93 211815 -11751 -172291 -4691 111112 21948 -86769 -131460 26776 196782 76419
103 76419 -137831 -71963 62050 -20062 -17062 101925 -35084 -101343 109029 78504 -155406
$$ packed form
0@%%%%%%%Qj6J6j6K4l2M0n6O4q0J04j26J50j77K17k62L08l59M22m94N71o60P60
30D06q69R92j132J284j452J640j846K070k316K589k885L209l564L949m373M835
46B537n339N890o491P154p881Q680r566J0550j1648J2878j4271J5861j7694J9839
60A0499k2384K5460k9273L4144m0609M9663o3344Q6654j36733M30534m61904o02231
72g19524Q94855L2595l97240J29796K25321k32967J88614J30258m95530j69403
82d13225N96611Q3958l84406N944K75741m7639k01734q8465P4854J87899J22277
93B11815k23566j60540J67600J15803q9164j08717m4691J58236J70006j20363
103G6419k14250O5868J34013q2112L000J18987j37009o6259K10372l0525k33910
$$ plain form
114 -155406 -67912 141319 15615 -130476 59604 119706 -92735 -79952 63454 4351 -44713
125 -44713 56793 56152 -84948 -54689 88062 37261 -58802 -36655 9987 61085 37446 -57604
137 -57604 -46492 37927 30762 -31866 1530 44271 -31979 -34396 42504 -3348 -30591 30383
149 30383 -428 -58291 22160 87520 -41527 -103911 46503 71640 -32725 -15592 3275
160 3275 -26506 26244 54461 -45428 -68654 69352 67467 -80211 -37347 75715 18614 -53211
172 -53211 -17360 33932 18898 -11675 -8112 -22821 -9936 41701 19918 -44334 -44804 32918 66400
185 66400 -29391 -68345 22807 50485 -10584 -30874 10372 14691 -17648 10385 16178 -29023
197 -29023 1786 34281 -9497 -27886 12896 31472 -15338 -27644 19722 10306 -13711 4593
$$ packed form
114a55406Q7494K09231j25704j46091J90080O0102k12441J2783J43406n9103m9064
125d4713J01506o41j41100L0259J42751n0801r6063K2147M6642N1098k3639r5050
137e7604J1112Q4419p165o2628L3396M2741p6250k417P6900m5852k7243O0974
149C0383l0811n7863Q0451O5360j29047o2384J50414K5137j04365J7133J8867
160C275k9781N2750K8217r9889k3226J38006j885j47678M2864J13062n7101p1825
172e3211L5851N1292j5034l0573L563j4709J2885N1637k1783o4252m70P7722L3482
185F6400r5791l8954R1152K7678o1069k0290M1246M319l2339K8033N793m5201
197b9023L0809L2495m3778j8389M0782J8576m6810j2306M7366r416k4017J8304
$$ plain form
209 4593 2021 -15721 -8019 23042 11989 -37137 -8664 32818 -3132 -14883 6401 -577 -10630
222 -10630 9513 22318 -18877 -23240 29563 12798 -22977 -277 13534 2546 -9244 -819
234 -819 10731 -3109 -3225 -404 -4512 7067 -1701 -6575 2216 -7969 3815 11306 -13863 -10003
248 -10003 13355 11214 -17158 -11304 25811 333 -22996 12678 9630 -9181 3033 4769 -5294
261 -5294 -2929 15460 2944 -23541 7438 21400 -10656 -12408 2594 10012 835 -13209 534
274 534 4059 -2401 2528 -6601 -4664 4584 4237 1824 -12797 -1660 18967 -2996 -11680 2770
288 2770 7958 4144 -7562 558 6944 -4080 3355 2758 -5262 1075 761 3389 -3141 -8146 9064
303 9064 526 -11057 3959 4221 -4907 -6537 4374 6387 -12365 167 11610 -9101 -1801 8725
$$ packed form
209D593k572j7742P702L1061j1053m9126K8473M1482l5950j1751K1284o978j0053
222a0630K0143J2805m1195m363N2803j6765l5775K2700J3811j0988j1790Q425
234h19J1550j3840j16K821m108J1579q768m874Q791j0185J1784P491k5169L860
248a0003K3358k141k8372N854L7115k5478k3329L5674l048j8811J2214J736j0063
261e294K365J8389j2516k6485L0979J3962l2056j752J5002P418r177j4044J3743
274E34L525o460M929r129J937R248l47k413j4621J1137K0627k1963q684J4450
288B770N188l814j1706Q120O386j1024P435n97q020O337l14K628o530n005J7210
303I064q538j1583J5016K62r128j630J0911K013j8752J2532J1443k0711P300J0526
$$ plain form
317 8725 -3228 -2583 4159 4839 -3896 -2496 9695 -3067 -4219 7475 -2729 -489 2689 -4142
331 -4142 3085 924 -3779 -1034 366 2647 -5975 -1413 5651 -7603 650 7195 -8880 -1426 7369
346 7369 -625 -4673 337 7553 -2959 -2855 8933 -4294 -2710 8522 -2516 -2520 1703 976 1272
361 1272 -2969 1226 635 -3392 2356 -2845 -589 2889 -6535 1568 2639 -5703 1838 1365 -2079 -977
377 -977 1147 4398 -3985 -822 6728 -3638 963 4735 -3370 1051 1633 643 1285 -2961 2061 81
393 81 -1877 2467 -3882 302 1370 -4917 3278 -471 -5463 3135 498 -2119 -1684 610 3341 -3744
409 -3744 1025 3509 -4621 4317 3697 -4240 1392 712 2370 2677 -3972 -224 1500 3547 575 -7413
425 -7413 2637 2906 -4162 2584 -2708 -4009 3627 302 -1506 -3603 -218 4331 -2586 511 -237
$$ packed form
317H725j1953O45O742O80q735J400J2191j2762j152J1694j0204K240L178o831
331d142P227k161m703K745J400K281q622M562P064j3254Q253O545j6075P454Q795
346G369p994m048N010P216j0512J04J1788j3227J584J1232j1038mM223p27K96
361A272m241M195n91m027N748n201K256L478r424Q103J071q342P541m73l444J102
377i77K124L251q383L163P550j0366M601L772q105M421N82r90O42m246N022j980
393H1j958M344o349M184J068o287Q195l749m992Q598k637k617M35K294K731p085
409c744M769K484q130Q938o20p937N632o80J658L07o649L748J724K047k972p988
425g413J0050K69p068O746n292j301P636l325j808k097L385M549o917L097p48
$$ plain form
440 -237 -2725 7678 -1206 -6202 6082 3032 -1656 -871 1446 2703 -2019 3423 912 -7210 4918
455 4918 3571 -4639 272 -3363 644 4693 -3861 -4212 -953 3808 844 -6621 3220 910 -4836
470 -4836 5340 389 -4186 1757 1628 3015 -1771 -1914 3505 875 2329 -2160 -4209 7635 853
485 853 -5689 1809 -592 -15 1616 -1349 -2718 -5052 5405 5092 -8561 -3154 2036 4120 3844 -8595
501 -8595 -3357 7511 2436 -1144 -3960 602 5104 320 971 -2661 -1551 7410 -126 -3706 -1065
516 -1065 12 7204 -624 -9947 305 7277 3276 -8933 -7625 8040 3542 -2878 -2329 -6469 2669
531 2669 8173 -925 -6459 -4324 7678 6923 -5169 -3805 -314 6248 6172 -9263 -3669 8625 2876
546 2876 -3705 -5268 2115 5715 -975 -2835 -4724 300 8110 -2636 -6702 -1718 1340 7419 -1626
$$ packed form
440b37k488J0403q884m996J2284l050m688P85K317J257m722N442k511q122J2128
455D918j347q210M911l635M007M049q554l51L259M761k964p465R841k310n746
470d836J0176m951m575N943j29J387m786j43N419k630J454m489k049J1844o782
485H53o542P498k401N77J631k965j369k334J0457l13j3653N407N190K084k76j2439
501h595N238J0868n075l580k816M562M502m784O51l632J110Q961p536l580K641
516a065J077P192p828r323J0252O972m001j2209J308J5665m498o420N49m140R138
531B669N504r098n534K135J2002p55j2092J364L491O562p6j5435N594J2294n749
546B876o581j563P383L600o690j860j889N024P810j0746m066M984L058O079r045
$$ plain form
561 -1626 -9446 58 6937 4607 -6415 -4971 7453 1528 -2347 2196 -1367 893 2299 52 -506
576 -506 -2028 4156 2123 -6201 -73 2832 1518 -998 -6435 887 4377 -1773 -1410 -3628 -718 3747
592 3747 197 -1247 -3553 1083 5650 -3144 -923 2390 -1532 2509 1036 -1256 1150 815 1409 -2484
608 -2484 -1113 5916 -1449 -4452 123 684 3438 -2215 -4905 1311 935 1532 -1537 -4979 1010 1868
624 1868 1616 -1106 -5427 4556 4540 -4828 -1062 2625 3018 -741 -2901 1882 760 2610 2325 -7039
640 -7039 -177 6854 -21 -3714 -4316 2137 5468 -3062 -4051 -1920 1838 4223 -3674 -3057 739 829
656 829 3974 -3090 -4416 4913 2728 -1480 -2724 541 5572 -1374 -1818 1123 -1226 4245 1376 -5298
672 -5298 -517 2521 2606 -1485 -4924 1546 1859 -72 -870 -4096 1829 1694 -2543 1286 -2134 -1694 3718
$$ packed form
561a626p820R504O879k330j1022J444J2424n925l875M543l563K260J406k247n58
576e06j522O184k033q324O128K905j314k516n437P322L490o150L63k218K910M465
592C747l550j444k306M636M567q794K221L313l922M041j473k292K406l35N94l893
608b484J371P029p365l003M575N61K754n653k690O216l76N97l069l442N989Q58
624A868k52k722m321R983j6r368L766L687L93l759k160M783j122J850k85r364
640g039O862P031o875l693o02O453L331q530r89K131L758K385p897O17L796R0
656H29L145p064j326R329k185m208j244L265N031o946m44K941k349N471k869o674
672e298M781L038Q5m091l439O470L13j931p98l226N925j35m237L829l420M40N412
$$ plain form
689 3718 -457 -1442 -325 1695 2004 -2758 1520 2029 -2038 2434 264 -2162 2461 691 305 -1404
705 -1404 -1797 2705 -145 -937 -844 -2438 2984 349 -3566 932 -1089 551 1628 -1722 -863 131 2206
722 2206 725 -3075 2569 1123 -2538 2850 153 -973 2210 -511 -261 -34 1110 1066 -2954 818
738 818 1207 -2113 1185 -1715 -1415 1904 -2046 -254 -247 -1594 611 -425 963 -61 -1993 2468 -38
755 -38 -1073 2792 -856 -773 1558 569 903 -1158 730 1173 -2126 1231 133 -1937 1112 -1217 177
772 177 1011 -2470 249 -144 -745 372 -1111 300 -896 -861 2900 -1837 -1160 2754 -975 67 903
789 903 -4 1228 -881 818 1106 -924 1549 -1178 -788 1878 -1459 175 131 -1713 1167 -31 -987
806 -987 -492 -1060 1595 -1276 -1458 2428 -1817 -387 1583 -1119 724 503 241 476 -657 1775 201
$$ packed form
689C718m175r85J117K020L09m762M278N09m067M472k170k426M623j770l86j709
705a404l93M502k850p92R3j594N422k635l915M498k021J640J077l350Q59R94K075
722B206j481l800N644j446l661N388k697j126L183k721K50K27J144m4m020L772
738H18L89l320L298k900L00L319l950J792Pj347K205j036J388j024j932M461k506
755c8j035L865l648Q3K331r89L34k061J888M43l299L357j098k070L049k329J394
772A77Q34l481K719l93o01J117j483J411j196L5L761m737O77L914l729J042Q36
789I03r07J232k109J699K88k030K473k727L90K666l337J634m4j844K880j198r56
806i87M95n68K655k871j82L886m245J430J970k702J843k21k62K35j133K432j574
$$ plain form
823 201 -801 2609 -1328 416 1559 -2047 574 221 -929 861 -1022 -427 -341 -959 1175 -1660 -770
840 -770 1550 -1816 645 661 -1697 1211 83 119 302 -419 2133 -736 -524 2225 -1129 598 1158
857 1158 -1867 1236 -70 -256 400 -1473 837 -265 -1148 449 -2060 928 1302 -2965 1050 608
873 608 -1424 567 -350 356 -227 -160 1936 -1408 249 2258 -1444 533 652 -752 1751 -679 -79
890 -79 899 -834 858 -799 -364 852 -1729 496 214 -2157 1167 -548 -1272 678 -487 217 -710
907 -710 -379 1662 -1649 699 1456 -1616 1308 818 -230 704 -736 1586 807 -1669 1182 -28 -65
924 -65 -276 -1415 1926 -1014 -2127 1826 -893 -1116 572 -156 329 -1552 344 1387 -1904 253 820
941 820 -302 1307 -962 349 1839 -1199 397 747 308 530 -1366 1391 705 -1742 1365 -157
$$ packed form
823B01j002L410l937J744J143l606K621l53j150J790j883N95Q6o18K134k835Q90
840g70K320l366K461J6k358K908j128L6J83p21K552k869K12K749l354J727N60
857A158l025L103j306j86O56j873K310j102q83J597k509K988L74m267M015m42
873F08k032J991r17P06n83O7K096l344J657K009l702J977J19j404K503k430O00
890g9R78j733J692j657M35J216k581K225k82k371L324j715p24J950j165P04r27
907g10L31K041l311K348P57l072K924m90j048R34j440K322p79k476K851j210l7
924f5k11j139L341k940j113L953k719k23J688p28M85j881J896J043l291K157N67
941H20j122J609k269J311J490l038J596L50m39K22j896K757o86k447L107j522
$$ plain form
957 -157 -770 682 -1082 163 545 -1332 -137 -246 833 -710 -1859 2508 -338 -2463 2139 621
973 621 -1083 -448 1122 1792 -1746 -319 2484 -630 -85 259 346 869 -2039 477 2077 -2110 -860
990 -860 779 156 -1133 -2008 2065 509 -2873 676 635 -488 -224 -965 1253 -80 -767 1091 -627
1007 -627 339 681 -430 1298 -848 -680 2090 -597 -284 -225 -339 1979 -1116 -1547 936 353 -216 -2221
1025 -2221 215 2625 -2626 -909 1955 -1043 -545 194 886 -205 -1534 2345 1221 -1953 475 934
1041 934 1463 -187 -2135 2092 828 -1838 722 659 83 -1380 -136 2165 -1900 -1173 2030 -1339
1057 -1339 -811 596 -286 208 -1190 97 551 -345 801 -1096 -518 2525 -885 -302 899 -377 825
1074 825 -112 485 773 -1717 640 764 -699 181 -976 1214 153 -2572 1183 868 -2073 -438 517
$$ packed form
957a57o13J452j764J245L82j877J195j09J079j543j149M367k846k125M602j518
973F21j704O35J570O70l538J427K803l114N45L44Q7N23k908K516J600m187J250
990h60J639o23j289q75M073j556l382L549m1j123K64p41K218j333o87J858j718
1007f27R66L42j111J728k146J68K770k687L13N9j14K318l095m31K483n83n69k005
1025b221K436K410n251J717K864k998M98P39O92j091j329L879j124l174K428M59
1041I34N29j650j948M227j264k666K560o3n76j463J244K301m065P27L203l369
1057a339N28J407q82M94j398J287M54q96J146j897N78L043l410N83J201j276J202
1074H25r37N97K88k490K357J24j463Q80j157K190j061k725L755l15k941J635R55
$$ plain form
1091 517 763 -1344 -1248 2257 -839 -1291 1811 9 -365 -273 486 1676 -1384 -249 1766 -557 77
1108 77 64 646 165 -1698 1336 762 -2326 836 117 -1045 206 -550 182 -715 -417 1005 -1265 149
1126 149 613 -1185 966 317 -458 603 -466 945 528 -575 645 194 223 359 -730 1307 -404
1143 -404 -1483 1431 -233 -1272 73 198 216 -956 382 413 -2378 967 1016 -1373 131 63 293 304
1161 304 -577 779 -104 -177 1333 -181 179 233 -445 1242 -459 -511 1118 -1108 -92 835 -325 -141
1179 -141 -1163 413 408 -1532 755 -4 -1187 425 -158 90 -68 -875 1332 -493 -201 1188 -902
1196 -902 92 232 438 1025 -1196 201 952 -989 117 490 -525 -588 -547 824 -716 -1391 1145 -639
1214 -639 -975 631 -170 -211 -585 -167 1079 -876 8 821 -453 961 83 -110 535 -962 1137 998
$$ packed form
1091E17K46k107R6L505l096m52L102j802l74R2P59J190l060J135K015k323O34
1108G7j3N82m81j863L034n74l088L162p19j162J251p56P32q97K98J422k270J414
1126A49M64j798K151o49p75J061j069J411m17j103J220m51K9J36j089K037j711
1143d04j079K914j664j039J345J25J8j172J338L1k791L345M9k389J504o8K30J1
1161C04q81J356q83p3J510j514L60N4o78J687j701n2J629k226J016R27j160J84
1179a41j022J576nj940K287p59j183J612n83K48j58q07K207j825K92J389k090
1196i02R94J40K06N87k221J397P51j941J106L73j015o3M1J371j540o75K536j784
1214f39l36J606q01m1l74M18J246j955Q84Q13j274J414q78j93O45j497K099j39
$$ plain form
1232 998 -879 271 -23 169 246 -700 827 -611 -961 1771 -876 -832 609 -350 173 -584 27 356
1250 356 -1211 765 585 -797 622 -426 -67 764 -400 702 -391 -603 1256 -37 33 54 -573
1267 -573 763 -547 -283 773 -1303 105 229 -951 336 -717 28 20 -870 1024 -35 -744 680
1284 680 -30 121 295 -648 868 -448 -78 1128 -829 175 262 270 675 -936 243 727 -1151 350
1302 350 349 -957 -79 -499 246 -368 -526 632 -776 -485 1241 -480 128 -130 -406 868 -189 -28
1320 -28 512 -385 840 -56 -206 594 -733 519 469 -1021 552 -32 -595 482 -311 238 -629 -480 785
1339 785 -898 -14 433 -956 283 -130 -81 463 -454 26 599 -330 843 -484 90 496 -287 895
1357 895 4 -641 798 -244 -96 332 -713 267 -281 -123 380 -985 365 118 -951 594 -389 -285
$$ packed form
1232I98j877J150k94J92P7r46J527j438l50K732k647M4J441r59N23p57O11L29
1250C56j567J976j80j382J419j048L59Q31j164J102j093k12J859j293P0K1o27
1267e73J336j310K64J056k076J408J24j180J287j053P45qq90J894j059p09J424
1284F80p10J51J74r43J516j316L70J206j957J004Q7QM05j611J179M84j878J501
1302C50jj306Q78m20P45o14j58J158j408K91J726j721O08k58k76J274j057J61
1320b8N40q97J225q96j50Q00j327J252n0j490J573n84n63J077p93N49q67J49J265
1339G85j683Q84M47j389J239m13M9N44r17M80N73r29J173j327N74M06p83J182
1357H95q91o45J439j042J48M28j045R80n48J58N03j365J350k47j069J545r83J04
$$ plain form
1375 -285 168 -546 656 -364 -257 768 -499 414 495 -472 880 -171 -268 536 -407 329 -29 -403 379
1394 379 -600 349 74 -1158 495 132 -735 273 -679 109 388 -601 269 -394 -17 460 -841 630
1412 630 196 -385 739 -272 49 520 -242 312 -7 -76 632 -721 321 47 -975 736 -443 -565
1430 -565 507 -427 171 -162 -299 439 -727 335 227 -434 450 -283 58 978 -748 17 520 -401 119
1449 119 -336 496 -7 -985 609 101 -684 383 -449 158 -30 -930 710 -155 -457 166 -360 191 -448
1468 -448 -500 804 -751 -531 845 -366 -15 -42 182 912 -695 205 596 -257 571 -269 102 732 -831
1487 -831 258 320 -620 113 -298 -130 30 -806 611 -274 -448 406 -301 367 216 -665 837 14 -535
1506 -535 275 -172 536 -13 -151 911 -539 -37 687 -361 242 -304 -172 599 -557 -293 -139 -440 31
$$ packed form
1375b85M53p14J202j020J07J025j267R13Q1r67J352j051r7Q04r43P36l58l74P82
1394C79r79R49k75j232J653l63q67J008r52P88K79r89Q70o63L77M77j301J471
1412F30m34n81J124j011L21M71p62N54l19o9P08j353J042k74j022J711j179j22
1430e65J072r34N98l33j37P38j166J062j08o61Q84p33L41R20j726P65N03r21N20
1449A19m55Q32n03r78J594n08p85J067q32O07j88r00J640q65l02O23n26N51o39
1468d48n2J304j555K20J376j211L51k7K24P30j607R00L91q53Q28q40L71O30j563
1487h31J089O2r40P33m11J68J60q36J417q85j74Q54p07O68j51q81J502q23n49
1506e35Q10m47P08n49j38J062j450N02P24j048O03n46J32P71j156K64J54l01M71
$$ plain form
1525 31 -436 288 340 -1120 97 409 -376 211 -321 383 202 -463 649 -154 13 511 -200 360 55 -392
1545 -392 575 -88 -95 315 -320 363 -288 -123 540 -392 -110 102 -322 670 -457 -601 664 -431 123 219
1565 219 -91 396 -321 127 757 -777 400 483 -238 479 -444 173 169 -419 570 -21 -211 296 -540 355
1585 355 -62 -813 531 -467 -258 9 -294 90 -283 39 525 -527 163 318 -482 675 -25 87 727
1604 727 -200 422 295 -369 473 -251 115 283 -392 445 -126 -492 561 -414 -207 -116 -621 279 -77 -9
1624 -9 62 -462 611 -14 -431 643 -369 -63 206 58 382 -204 -340 528 -375 335 242 -674 522 -292
1644 -292 73 -65 -880 37 20 -385 318 -361 -199 -39 -558 694 29 -513 343 -19 409 453 -26 382
1664 382 -372 451 761 -639 338 50 -124 318 -428 -75 58 -576 313 7 -426 78 -554 285 146 -567
$$ packed form
1525C1m67P24N2j460J217L12p85N87n32P04j81o65J112q03J67M98p11N60l05m47
1545c92R67o63pM10o35O83o51J65O63r32K82K12m24R92j127j44J265j095N54R6
1565B19l10M87p17M48O30j534J177Q3p21P17r23O17mn88R89n91j90N07q36Q95
1585C55m17p51J344r98K09K67l03L84l73L22M86j052O90J55q00J157p00J12O40
1604G27r27O22j27o64Q42p24L66J68o75Q37n71l66J053r75K07R1n05R00l56O8
1624iP1n24J073o25m17J074j012L06K69j48L24n86j36Q68r03P10r3r16J196q14
1644b92L65j38q15R17j7m05P03o79J62J60n19J252o65n42Q56l62M28M4m79M08
1664C82p54Q23L10j400R77k88j74M42p46L53J33o34Q89l06m33N04o32Q39j39p13
$$ plain form
1684 -567 505 -600 -43 437 -328 44 -257 -96 401 -267 468 -8 -560 779 404 -36 186 -599 456
1703 456 252 -322 386 -334 -99 400 -294 210 -475 -404 420 -502 214 161 -503 101 135 130 300 -406 275 -187
1725 -187 -27 789 -465 -192 394 -218 486 -19 -241 186 -201 263 258 -412 165 -456 -42 547 -581 -71
1745 -71 -38 -517 692 51 -1 67 -356 795 -295 -134 478 -531 439 417 -198 168 -197 111 517 -95
1765 -95 132 -225 -272 512 -299 236 -34 -861 327 304 -277 173 -560 80 302 -115 280 -613 -23 503 -445
1786 -445 275 8 -166 365 -25 179 471 -455 231 -42 149 228 -433 212 80 -355 659 -278 -316 43
1806 43 -212 239 -302 -373 370 -446 399 457 -487 125 -171 -193 297 -287 217 69 -187 626 -113 104 200 -396
1828 -396 257 -59 -66 326 -460 163 451 -115 101 -564 -114 106 -642 117 -196 -316 464 -277 -111 90 -355
$$ packed form
1684e67J072j105N57M80p65L72l01J61M97o68P35m76n52J339l75m40K22p85J055
1703D56k04n74P08p20K35M99o94N04o85P1Q24r22P16n3o64O04L4nJ70p06O81m62
1725a87J60Q16j254K73N86o12P04n05k22M27l87M64no70N77o21M14N89j128N10
1745g1L3m79J209o41n2O8m23J151j090J61O12j009R70k2o15L66l65L08M06o12
1765i5K27l57m7P84q11N35k70q27J188k3n81M50p33O40K22m17L95q93N90N26r48
1786d45P20k67j74N31l90K04K92r26O86k73J91P9o61O45j32m35J014r37l8L59
1806D3k55M51n41p1P43q16Q45N8r44O12k96k2M90n84N04j48k56Q13p39K17R6n96
1828c96O53l16pL92p86O23K88n66K16o65M50K20p48P59l13j20P80p41J66K01m45
$$ plain form
1849 -355 290 136 45 406 -392 418 49 -18 452 -277 36 262 -130 143 -177 -404 288 -172 20 1 -422
1870 -422 444 -305 -243 310 -262 52 133 -154 289 -220 -84 447 -363 213 171 -303 418 -136 354 360 -267 286
1892 286 20 41 164 -555 128 91 -572 191 -161 24 -65 -198 277 -34 -122 351 -276 30 154 -388 373
1913 373 -259 -265 388 -108 245 -174 -152 244 -282 69 280 -288 308 -143 -79 255 -337 -12 65 -565 200 -24
1935 -24 -89 324 -391 324 -179 14 19 -294 217 112 -240 365 155 -134 165 -352 170 225 -339 545 -51 -12
1957 -12 441 -503 117 -72 -300 539 -424 -101 296 -478 332 -169 78 364 -375 51 297 -173 230 -129
1977 -129 217 412 -229 248 27 -83 192 -71 122 116 -581 280 -96 -96 48 -588 154 -119 -450 311 -250
1998 -250 -122 278 -175 311 -7 143 551 -185 119 47 -246 345 -135 -1 743 -659 46 266 -175 45
$$ packed form
1849c55O45j54r1L61p98Q10l69o7M70p29L13K26l92K73l20k27O92m60J92j9m23
1870d22Q66p49O2N53n72L14Q1k87M43n09J36N31q10N76m2m74P21n54M90Oo27N53
1892B86k66K1J23p19O83l7o63P63l52J85q9j33M75l11q8M73o27L06J24n42P61
1913C73o32oO53m96L53m19K2L96n26L51K11n68N96m51O4L34n92L25P7o30P65k24
1935b4o5M13p15P15n03J93Nl13N11j05l52O05k10k89K99n17N22N5n64Q84n96L9
1957a2M53r44O20j89k28Q39r63L23L97p74Q10n01K47K86p39M26K46m70M03l59
1977a29L46J95o41M77k21j10K75k63J93oo97Q61l76%J44o36P42k73l31P61n61
1998b50J28M00m53M86l18J50M08p36L04p2k93N91m80J34P44j402P05K20m41K20
$$ plain form
2018 45 -29 -139 218 -410 194 86 -58 377 -408 -61 -294 -506 443 -140 -245 97 -230 229 -105 -147 357
2039 357 -245 99 315 -138 345 61 -107 405 -384 -27 -106 -145 406 -432 -14 349 -472 150 -85 -439 369
2060 369 -303 -86 217 -340 59 -42 44 255 -349 496 457 -438 321 14 -237 386 -12 310 -130 -336 446
2081 446 -153 -74 -134 -182 456 -350 -452 115 -517 43 -59 -154 217 -371 86 518 -115 457 -302 -113 396
2102 396 -210 -32 85 -102 395 -90 225 -27 -357 382 68 -516 145 -131 -101 74 -317 57 -223 -345
2122 -345 163 -220 -70 288 -309 323 -239 -13 385 -215 249 451 24 158 170 352 23 -487 405 211
2142 211 -303 130 -321 -98 -50 -178 537 95 -198 393 -116 289 -154 -186 386 -418 153 213 -435 149 261
2163 261 -56 80 -170 327 -58 -254 604 -285 -95 581 -142 40 -37 -196 418 -322 2 30 -402 506 -150
$$ packed form
2018D5p4j10L57o28O04j08j44M35p85L47k33k12R49n83j05L42l27M59l34m2N04
2039C57o02L44K16m53M83k84j68N12p89L57p9l9N51q38M18L63q21O22k35l54Q08
2060C69o72K17L03n57L99j01Q6K11o04Q45l9q95P59l07k51O23l98L22m40k06P82
2081D46n99P9o0m8O38q06j02N67o32N60j02r5L71n88M57M32o33N72p59J89N09
2102C96o06J78J17j87M97m85L15k52l30P39l14n84O61k76L0J75l91L74k80j22
2122c45N08l83J50L58n97O32n62K26L98o00M64K02m27J34J2J82l29n10Q92j94
2142B11n14M33m51K23M8j28P15m42k93N91n09M05m43l2N72q04N71O0o48N84J12
2163B61l17J36k50M97l85j96Q58q89J90O76p23J82p7j59O14p40L24K8m32R08o56
$$ plain form
2184 -150 134 193 -281 121 164 -313 19 -226 -18 372 -92 289 -29 -221 352 -142 -33 14 -272 192 -29
2205 -29 -10 -88 -388 480 155 -262 -1 -127 -103 -50 -431 104 -218 -400 360 -147 -200 -15 -54 597 90 84 332
2228 332 -271 160 231 -343 55 157 147 69 -405 520 -197 -280 695 -228 -70 -6 -222 -75 -193 -321 214 -213
2250 -213 207 -160 -2 433 -219 243 348 -161 499 187 -123 86 -258 111 -45 -49 153 -234 -74 330 -81
2271 -81 183 -102 -506 360 -511 72 100 -410 224 -86 -272 148 -531 243 246 -44 244 -112 -137 247 90 305
2293 305 2 38 185 -273 70 158 -293 265 164 -170 4 -417 157 -75 -161 295 -300 -149 124 -362 337
2314 337 -125 -369 366 -159 254 349 -181 374 -14 83 407 -217 339 141 -352 117 108 114 27 -316 123 3
2336 3 -67 127 -305 -208 -146 -134 89 -167 -105 324 -203 96 -17 -343 12 -143 73 251 -317 386 187 -394
$$ packed form
2184a50K84N9m74M02M3m77L32k45K08L90m64L81l18j92N73m94J09M7k86M64k21
2205b9J9p8l00Q68l25m17K61j26K4N3l81N35l22j82P60n07n3J85l9O51n07oK48
2228C32o03M31P1n74L98J02j0p8m74R25p17q3R75r23J58O4k16J47j18j28N35m27
2250b13M20l67J58M35o52M62J05n09O60l12l10K09l44L69j56mK02l87J60M04m11
2271h1K64k85m04Q66q71N83K8n10O34l10j86M20o79P74Lk90K88l56k5L84j57K15
2293C05l03L6J47m58L43Q8m51N58j01l34J74m21N74k32q6M56n95J51K73m86O99
2314C37m62k44P35n25M13R5n30N55l88R7L24o24N56j98m93M69rOq7l43M39j20
2336Cp0J94m32R7O2J2K23k56O2M29n27K99j13l26L55j55K16J78n68P03j99n81
$$ plain form
2358 -394 61 -164 -78 -197 -110 571 -316 -210 -46 -39 283 -201 -270 191 -375 38 42 -334 296 126 36 228 -524
2381 -524 150 -72 -106 448 -69 -44 283 -89 265 23 -183 239 -385 -9 145 -275 35 17 -200 -142 -263
2402 -263 157 -71 -72 361 -159 36 177 -181 117 -67 -114 370 -8 136 283 -37 234 120 -192 341 -77
2423 -77 439 207 -309 308 -106 158 369 -459 210 -72 -315 -144 -455 -2 306 -124 179 -263 41 296
2443 296 -195 69 123 -70 219 -147 214 -3 -320 71 -443 -96 105 -356 -39 49 -347 102 -156 -116 67
2464 67 -110 163 -51 -100 179 -332 110 216 -154 200 107 -114 336 -228 220 215 -62 185 31 21 305 -266
2486 -266 387 89 -509 -20 -258 -73 -17 -335 161 -198 -326 115 -322 63 -156 39 384 -192 -18 466
2506 466 -226 88 -34 -153 492 -368 308 363 -201 308 -42 -371 112 -293 147 -186 -174 -173 -292 -48 -64 -274
$$ packed form
2358c94M55k25Q6j19Q7O81q87J06J64PL22m84o9M61n66M13Ml76O30j70r0J92p52
2381e24O74k22l4N54n17K5L27l72L54k42k06M22o24L76J54m20L10j8k17N8j21
2402b63M20k28jM33n20J95J41l58K98j84m7M84l78J44J47l20K71j14l12N33m18
2423g7N16k32n16O17m14K64K11q28O69k82k43J71l11M53L08m30L03m42L04K55
2443B96m91K64N4j93K89l66L61k17l17L91n14L47K01m61L17Q8l96M49k58M0J83
2464F7j77K73k14m9K79n11M42J06l70L54r3k21M50n64M48nk77K47j54j0K84n71
2486b66O53k98n98M89k38J85N6l18M96l59j28M41m37L85k19J95L45n76J74M84
2506D66o92L14j22j19O45q60O76N5n64N09l50l29M83m05M40l33J2Jj19K44j6k10
$$ plain form
2528 -274 101 -384 -153 238 -289 -202 -145 -153 148 110 34 164 -166 355 240 33 249 -122 171 448 -29 -74
2550 -74 -242 73 219 -283 60 -346 -161 211 -396 -111 266 43 188 -137 -120 367 -230 -28 235 -303 390
2571 390 -5 -69 316 -276 201 55 77 357 -187 -4 74 -220 183 164 -130 57 -176 -47 -12 33 167 -123
2593 -123 25 236 -271 62 189 6 86 -4 -41 188 -139 282 84 -358 18 8 63 22 -231 214 -49 -73
2615 -73 345 -282 170 -157 -381 299 -195 0 -68 -364 202 -126 -205 349 -40 -25 -50 -27 113 -251 30 248
2637 248 -352 301 25 42 296 -63 89 196 -298 -10 -64 -150 54 -443 -84 171 -218 202 -158 192 32
2658 32 9 126 -42 -48 196 -2 190 49 -237 45 -12 65 223 -195 4 51 -301 219 -10 -92 -150 -215 235
2681 235 -9 -195 300 -176 98 164 36 64 -76 90 294 -251 -58 241 -213 448 -186 268 423 -98 222
$$ packed form
2528b74L75m85K31L91n27Q7N7qL01l8p6J30l30N21j15k07K16l71K93K77m77m5
2550g4j68L15J46n02L43m06J85L72o07K85L77k23J45l25J7M87n97K02K63n38O93
2571C90l95o4L85n92M77j46K2K80n44J83P8k94M03j9k94J87k33J29L5M5J34k90
2593a23J48K11n07L33J27j83Q0r0l7K29l27M21j98m42L76j0N5m1k53M45k63k4
2615g3M18o27M52l27k24O80m94J95o8k96N66l28p9N54l89J5k5K3J40l64K81K18
2637B48o00O53k76J7K54l59J52J07m94K88n4q6K04m97L59K55l89M20l60L50j60
2658C2k3J17j68oK44j98J92j41k86K82n7P7J58m18J99M7l52N20k29q2n8o5M50
2681B35k44j86M95m76K74O6j28K8j40J66K04n45J93K99m54O61o34M54J55n21L20
$$ plain form
2702 222 -46 157 96 69 119 -52 -161 195 -104 -116 37 -328 190 -20 -28 127 -266 -93 12 -72 270 -77
2724 -77 -283 401 -271 33 10 -166 511 76 -161 405 6 186 -163 144 406 -494 -258 392 -267 109 -15
2745 -15 -313 299 70 41 -43 -265 151 -85 -107 180 -244 196 261 -149 176 -161 158 264 -186 -208 83 130
2767 130 252 -306 449 208 -148 147 -228 147 94 -287 -20 -381 -193 202 -153 -77 77 -157 163 -71 43
2788 43 173 -371 -54 218 -177 384 -150 -52 -105 -427 183 -173 -107 107 -49 -65 274 -65 379 -231 29 204
2810 204 -47 50 64 0 130 -146 -114 115 -159 -92 94 -143 157 -88 -87 124 -134 286 -25 92 239 -337
2832 -337 169 -84 -158 220 -211 28 77 -21 -136 23 -476 138 -112 -292 -186 -226 63 -56 -4 125 -34 186
2854 186 42 -184 121 -137 -10 151 -148 26 -8 16 437 -223 195 -201 -228 105 -288 -69 76 -261 107
$$ packed form
2702B22k68K03o1k7N0j71j09L56k99j2J53l65N18k10qJ55l93J73J05q4L42l47
2724g7k06O84o72L04k3j76O77m35k37N66l99J80l49L07K62r00K36O50o59L76j24
2745a5k98O12k29k9q4k22M16k36k2K87m24M40O5m10L25l37L19J06m50k2K91M7
2767A30J22n58P55k41l56K95l75L75n3l81K67l61J88L95l55P6J54k34L20k34J14
2788D3J30n44L17K72l95N61n34R8n3l22O10l56O6K14j56j6L39l39M44o10K60J75
2810B04k51R7J4o4J30k76L2K29k74O7J86k37L00k45JK11k58M20l11J17J47n76
2832c37N06k53p4L78m31K39M9r8j15J59m99O14k50j80J06m0K89j19N2J29j59K20
2854A86j44k26L05k58J27J61k99J74l4K4M21o60M18l96k7L33l93K19J45l37L68
$$ plain form
2875 107 -56 -179 104 -162 268 222 -245 200 130 -30 221 -142 177 -23 -124 386 92 -44 29 -216 117
2896 117 113 -100 268 -178 87 -75 -150 205 -72 141 92 -174 -219 222 -27 374 -101 74 195 -258 324 137
2918 137 -132 6 3 178 -66 -39 208 56 -8 143 -70 -129 -147 -242 72 -87 47 58 -256 -63 -214 115 -71
2941 -71 -130 63 100 -28 162 -297 52 123 -27 98 -26 -81 32 -78 108 307 -158 239 -189 -131 97 -197
2963 -197 -184 165 -151 -121 17 -42 151 -260 -66 -30 -90 408 121 -13 -18 112 263 69 170 314 -368 289
2985 289 159 -92 103 -166 -262 126 -9 38 -215 -130 212 -219 -114 53 -88 181 -24 105 200 -46 197
3006 197 -7 208 348 -217 -62 243 -273 266 7 254 127 -213 181 259 -341 3 -78 -119 16 -175 402
3027 402 29 -246 175 57 32 -9 -2 115 109 -334 -9 -109 -119 96 82 121 -150 -158 93 -193 177 222 -186 124
$$ packed form
2875A07j63j23K83k66M30m6m67M45p0j60K51l63L19k00j01N10k94j36P3k45L33
2896A17mk13L68m46K65j62p5L55k77K13m9k66m5M41k49M01m75J75J21m53N82j87
2918A37k69J38lJ75k44K7K47j52o4J51k13n9j8r5L14j59J34J1l14J93j51L29j86
2941g1n9J93L7j28J90m59L49P1j50J25j24n5J13j10J86J99m65L97m28N8K28k94
2963a97J3L49l16L0J38n9J93m11J94L6o0M98k87j34nJ30J51j94J01J44o82O57
2985B89j30k51J95k69r6L88j35M7k53Q5L42m31J05J67j41K69k05J29R5k46K43
3006A97k04K15J40n65J55L05n16N39k59K47j27l40L94P8o00L44q1m1J35j91N77
3027D02l73k75M21j18k5m1PJ17om43L25j00j0K15j4L9k71qK51k86L70M5m08L10
$$ plain form
3051 124 -94 134 186 -139 37 45 -194 332 -210 -201 107 -177 4 78 106 50 -199 265 -49 -111 187 -172 -76
3074 -76 -123 -28 105 83 -123 129 -187 160 0 -18 294 -162 100 90 -159 -69 -205 -275 4 -349 -104 -33 142
3097 142 344 -30 -13 128 257 -259 180 -111 454 -101 22 143 -41 105 -79 -228 395 -84 -124 110 -78
3118 -78 -39 -196 -224 97 -218 198 1 162 -59 -380 182 216 -232 158 94 -112 197 -209 28 -25 -38 5 -198
3141 -198 126 152 -112 191 -59 56 68 -70 -117 204 -65 228 -115 -44 192 62 -21 135 -127 184 7 -69
3163 -69 213 -209 -40 25 -104 209 -145 114 94 -281 15 -86 -180 265 -173 -123 202 -79 -66 -235 74 347
3185 347 -107 272 131 -95 56 -416 -23 27 -320 107 194 -34 110 308 108 -46 -41 -5 -56 -33 -2 -284 22
3208 22 -96 -141 104 -168 -50 256 -271 172 -299 169 -9 -256 24 -142 -122 -114 -151 78 287 -139 -15 92
$$ packed form
3051A24k18K28N2l25J76Qk39N26n42RL08k84J81P4K8n6k49M64l14o2K98l59R6
3074g6m7R5J33k2k06K52l16L47j60j8L12m56K62j0k49R0j36p0K79l53K45P1J75
3097A42K02l74J7J41J29n16M39k91N65n55J23J21j84J46j84j49O23m79m0K34j88
3118g8L9j57k8L21l15M16j97J61k21l21N62L4m48L90o4k06L09m06K37n3j3M3k03
3141a98L24K6k64L03k50J15J2j38m7L21k69K93l43P1K36j30q3J56k62L11j77p6
3163f9K82m22J69O5j29L13l54K59k0l75K96j01r4M45m38N0L25k81J3j69L09K73
3185C47m54L79j41k26J51m72L93N0l47M27Q7k28J44J98k00j54NL6n1K3L1k82L06
3208B2j18m5K45k72J18L06n27M43m71M68j78k47K80j66K0Ql7K29K09m26J24J07
$$ plain form
3230 92 -55 257 -102 41 146 -78 95 49 -27 284 14 139 -139 -26 389 99 -66 243 26 -232 -94
3251 -94 -8 194 -164 31 153 -168 165 -29 88 77 -146 282 -55 -96 356 88 10 -27 -461 -85 -128 -227 197
3274 197 -271 137 40 -64 116 -328 38 315 -288 44 -11 -62 -61 86 216 59 -72 144 165 23 155 -23
3296 -23 72 -11 -258 96 189 -166 -168 -443 31 -116 -200 12 -254 -162 99 -307 -30 -154 -170 212 12 -232 145
3319 145 -173 -9 18 -40 224 38 34 27 -130 205 44 -280 58 -222 170 -89 56 128 -184 193 -5 -205
3341 -205 151 -96 -17 85 0 -11 21 -162 87 -55 78 95 -264 190 201 94 90 149 155 -21 -248 148 -247 -247
3365 -247 -131 -70 240 -9 90 39 -353 45 34 -178 6 -88 68 -132 65 166 -43 -199 174 -175 -62 -17
3387 -17 216 115 -126 538 191 96 -24 91 243 692 -133 -19 225 -340 -63 3 2 233 -327 -214 90 -32
$$ packed form
3230I2j47L12l59J43J05k24J73m6p6L11k70J25k78J13M15k90j65L09k17k58J38
3251i4Q6K02l58J95J22l21L33j94J17j1k23M28l37m1M52k68p8l7m34L76m3r9M24
3274A97m68M08r7j04J80m44L66K77o03L32n5n1JJ47J30j57j31K16K1j42J32j78
3296b3R5q3k47L54R3l55kk75M74j47q4K12k66R2K61m06K77j24j6L82k00k44L77
3319A45l18J64K7n8K64j86mpj57L35j61l24L38k80L92k59J45P2l12L77j98k00
3341b05L56k47P9J02q5j1L2j83K49j42J33J7l59M54J1j07mN9Oj76k27L96l95%
3365b47J16O1L10k49R9n1l92L98j1k12J84r4J56k00J97J01k09j56L73l49J13M5
3387a7K33j01k41O64l47r5j20J15J52M49q25J14K44n65K77O6jK31n60J13L04j22
$$ plain form
3409 -32 94 -63 -105 217 -115 106 126 -12 82 -130 46 445 19 168 53 -364 -129 139 78 -49 -41 -44 -42 -80
3433 -80 43 -8 270 -147 -175 219 -162 122 314 -40 -160 67 -56 125 33 272 113 -174 -12 192 139 253
3455 253 -152 106 219 -136 3 -111 49 114 -297 71 -184 -8 166 -154 -81 91 -55 88 -69 93 95
3476 95 -291 1 -161 -75 168 243 216 110 -353 -86 136 -17 278 -211 210 69 -35 88 -214 106 4
3497 4 -125 44 60 -104 260 -151 47 284 -110 5 -52 -141 1 114 -50 -37 -364 117 93 -207 -17 32 9
3520 9 -162 98 42 -133 51 252 52 112 292 -150 52 -54 34 -15 -76 126 -14 -38 -100 -117 182 98 -19 42
3544 42 51 79 27 -239 -5 -74 -221 128 -172 -58 -239 -114 16 -235 -131 118 -161 137 -1 38 260 33
3566 33 239 367 -288 -179 -51 -202 26 -73 176 111 1 153 -3 112 -149 42 169 -230 -160 -29 -24 199
$$ packed form
3409c2J26j57m2L22l32K21K0j38R4k12J76L99m26J49j15m17K35K68o1j27QlKl8
3433h0J23n1K78m17k8L94l81K84J92l54j20K27j23J81r2K39j59k87J62K04n3J14
3455B53m05K58J13l55J39j14J60O5m11L68k55J76J74l20P3J72j46J43j57J62K
3476I5l86K92j62Q6K43P5k7j06m63K67K22j53K95m89M21j41j04J23l02L20j02
3497Dj29J69J6j64L64m11J98K37l94J15n7q9J42J13j64J3l27M81k4l00J90M9k3
3520Ij71K60n6j75J84K01k00O0J80m42K02j06Q8m9o1K02j40k4o2j7K99q4j17O1
3544D2RK8n2k66K34o9j47L49l00J14j81J25J30k51J04K49k79K98j38L9K22k27
3566C3K06J28o55J09J28j51K28r9K49o5j10J52j56J15k61J91J27l99P0J31NK23
$$ plain form
3588 199 87 -136 20 -25 -257 85 -207 -122 -215 -13 216 -79 -108 44 -114 -1 239 -21 34 78 91 1 -21
3611 -21 250 -212 -150 -6 -50 187 -38 -26 104 -173 -47 83 -104 204 -91 -302 -53 -21 76 141 -127 169
3633 169 -127 0 -221 -105 69 73 -229 215 -84 -149 121 -222 -23 -356 -19 155 -132 -66 80 -52 20 142
3655 142 87 -62 -211 -6 -21 -69 215 -68 -20 106 57 -101 -244 32 -130 76 -55 347 -57 -21 -204 16
3677 16 135 -132 196 -150 -266 99 -72 -189 -89 -254 302 115 196 135 -81 70 62 -161 110 230 -231 130
3699 130 -64 28 6 -82 274 -158 -36 167 -37 -155 54 50 121 -415 32 139 -143 12 83 -72 116 -248
3721 -248 53 -106 -140 226 -25 56 41 78 54 40 -73 34 2 -188 -71 64 11 -26 -173 -49 -62 39 -267
3744 -267 -115 179 7 290 -66 -189 18 -65 -77 102 -10 35 83 -22 210 106 -211 -114 70 16 -249 -163
$$ packed form
3588A99j12k23J56m5k32L42k92Q5r3K02K29k95k9J52j58J13K40k60N5M4J3r0k2
3611b1K71m62O2J44m4K37k25J2J30k77J26J30j87L08k95k11K49L2R7O5k68K96
3633A69k96J27k21J16J74Ml02M44k99o5K70l43J99l33L37J74k87O6J46j32P2J22
3655A42n5j49j49K05j5m8K84k83M8J26m9j58j43K76j62K06j31M02m04L6j83K20
3677A6J19k67L28l46j16L65j71j17J00j65N56j87Q1o1k16J51qk23K71J20m61L61
3699A30j94R2k2q8L56m32J22K03k04j18K09mP1n36M47J07k82J55P1j55J88l64
3721b48L01j59l4L66k51Q1j5L7k4j4j13J07l2j90J17J35n3l7j47J24j3J01l06
3744b67J52K94j72K83l56j23K07q3j2J79j12M5M8j05K32j04l17R7J84n4k65Q6
$$ plain form
3766 -163 77 65 37 -35 -48 -65 -303 71 -154 -135 -7 59 -48 15 -83 214 201 -173 -87 -13 49 171 223 -25 -107
3791 -107 -277 12 194 -177 83 -103 -10 -50 -93 293 217 -236 26 123 -54 -337 -158 37 -89 -46 -295 100
3813 100 -59 17 -38 74 -174 -98 141 15 -67 27 86 69 -155 27 -53 66 -82 -64 -82 -50 172 248 -78 97
3837 97 179 57 282 9 -33 68 16 170 222 -152 43 72 -242 -56 -79 82 34 154 52 -264 -39 78 -11
3860 -11 5 -3 -60 -51 185 45 37 -23 90 -145 -107 -264 -232 112 -36 -47 -40 -54 -149 -62 53 -17 65 -81 -96 101 21
3887 21 -77 195 221 -62 107 222 -294 159 123 -134 79 43 -182 40 -15 159 -124 -104 -14 54 40 15 -77 117
3911 117 -161 107 -44 72 -58 7 -16 143 -165 169 19 -63 -68 -48 123 7 -27 97 145 -33 269 -128 76
3934 76 -40 -56 17 -256 121 -36 -193 87 -155 189 39 -147 -97 -37 -174 146 -71 -383 200 -2 -21 129
$$ packed form
3766a63K40j2k8p2j3j7k38L74k25J9J28O6j07O3r8K97j3l74Q6P4O2J22N2k48q2
3791a07j70K89J82l71K60j86R3m0m3L86p6m53K62R7j77k83J79J95j26M3k49L95
3813A00j59P6n5J12k48P6K39j26q2R4N9j7k24J82q0J19j48J8j8L2K22P6l26J75
3837I7Q2j22K25k73m2J01n2J54N2l74J95K9l14J86k3J61m8J20j02l16K25J17q9
3860a1J6qn7RK36j40qo0J13k35L8j57L2L44j48j1Pj4r5Q7J15p0Q2j46j5J97q0
3887B1r8K72K6k83J69J15n16M53l6k57K13l6k25K22n5J74k83K0R0O8j4k5r2J94
3911A17k78K68j51J16j30O5k3J59l08L34j50q2nK0J71j16l4J24M8j78L02l97K04
3934G6j16j6P3k73L77j57j57K80k42L44j50j86N0O0j37L20k17l12N83k02j9J50
$$ plain form
3956 129 -103 -101 -99 -29 260 -160 214 39 -92 91 62 -136 17 -76 -149 -290 -20 183 -51 -40 103 19 133
3979 133 -87 124 -125 160 38 -37 217 237 119 -158 -75 -107 266 25 -123 28 0 -65 -41 -145 51 -17 111
4002 111 -83 227 -124 61 -9 -141 -136 127 25 338 -68 103 182 32 -109 32 249 -94 -57 -72 16 -50 -126
4025 -126 3 188 -18 45 20 137 90 -220 -92 42 -53 104 -60 -10 205 150 334 98 -41 -136 -91 87 -128
4048 -128 77 131 40 89 -30 -153 269 -125 -239 224 8 -88 181 -27 -93 -184 225 -249 -198 -243 59 36 -82
4071 -82 -30 -36 -115 204 216 -126 -6 25 -166 -25 -6 -116 -2 -146 62 114 -157 -128 -190 115 -58 -77 155 195
4095 195 -51 -40 80 -192 125 -55 -28 102 97 401 33 95 57 -201 -105 -84 -28 -98 -141 -15 143 -100 -99 -84 244
4120 244 -128 -129 -261 5 21 147 94 -182 -88 -187 -106 -207 -234 182 88 23 -191 -40 206 70 -116 1 127
$$ packed form
3956A29k32KKP0K89m20L74j75j31J83k9j98J53r3p3j41K70K03k34J1J43q4J14
3979A33k20K11k49K85j22p5K54K0j18k77Q3l2L73k41j48J51k8o5K4j04J96o8J28
4002A11j94L10l51J85p0j32NK63j02L13m06J71P9j50j41J41K17l43L7j5Q8o6p6
4025a26J29J85k06O3k5J17m7l10J28J34r5J57j64N0K15n5J84k36j39r5M5J78k15
4048a28K05N4r1M9j19j23M22l94j14M63k16r6K69k08o6r1M09m74N1m5L02k3j18
4071h2N2op9L19J2l42J20L1j91J41J9j10J14j44K08N2k71K9o2L05j73j9K32M0
4095A95k46J1J20k72L17j80K7J30nL04l68O2l8k58R6K1N6p0m3J26J58k43JJ5L28
4120B44l72jj32K66J6J26n3k76R4r9Q1j01k7M16r4o5k14J51K46j36j86J17J26
$$ plain form
4143 127 88 -86 6 40 42 -15 -53 153 -110 229 -213 100 107 -97 -67 -68 264 -195 -33 44 -27 -74 -110 -47 105 -272
4169 -272 -67 337 196 56 -192 39 141 88 -11 98 104 -98 -250 66 118 7 -109 7 24 118 -125 128
4191 128 201 19 -134 155 -82 202 174 11 6 39 90 -36 67 21 -31 103 96 58 40 -209 32 -31 -86 -16 222
4216 222 89 193 -182 -3 -12 213 130 -154 197 -20 -93 -58 43 -209 -102 -132 -88 -203 -408 -61 -228 -259 97
4239 97 30 -223 4 -271 -160 148 -11 -118 -155 272 38 43 9 12 187 -148 -332 -51 126 1 -37 -365 180
4262 180 -183 114 80 30 -225 167 192 203 36 100 -50 82 126 -177 -59 -152 -213 13 39 198 91 -13 53
4285 53 125 91 -53 -50 27 108 -6 112 -152 -19 161 200 114 -155 -12 -29 101 -2 111 123 -312 7 -98 119
4309 119 169 226 -121 23 79 66 -39 93 74 -55 186 -142 10 -39 19 129 -53 -72 221 141 -117 -39 -87 -177
$$ packed form
4143A27l9j74R2L4Kn7l8K06k63L39m42L13Pk04L0jL32m59J62P7p1m7l6O3J52l77
4169b72K05M04j41j40k48K31J02n3r9J09Ok02j52L16N2j11j16J16J7R4k43K53
4191A28P3j82j53K89k37K84k8j63nL3N1j26J03m6n2J34pl8j8k49K41o3n5P0K38
4216B22j33J04l75J79rK25q3k84L51k17p3L5J01k52J07l0M4j15k05L47j67l1L56
4239I7o7k53K27k75J11L08j59j07l7M27k34Nl4LJ75l35j84K81J77j25l8l28N45
4262A80l63K97l4n0k55L92K5J1j67O4j50J32M4l03J18r3o1K26K6J59j07j04O6
4285E3P2l4j44LP7Q1j14J18k64J33J80L9q6k69J43j7J30j03J13J2m35L19j05K17
4309A19N0N7l47J44N6j3j05J32j9j29K41l28J52m9N8J10j82j9K93q0k58P8m8r0
$$ plain form
4333 -177 -17 119 45 135 6 -31 -252 59 122 0 32 255 101 231 -56 8 107 76 -208 37 223 223 -72
4356 -72 6 -119 -104 -67 -102 -92 97 -94 152 114 -182 -100 -300 111 -58 -118 242 -9 0 -140 -35 119 0 -77
4380 -77 177 88 -172 312 156 -15 72 135 115 -276 -11 -168 31 69 -259 83 -2 -80 141 175 -145 -261 -310
4403 -310 5 -146 109 251 63 -124 -166 -3 210 73 -79 73 -47 -58 -17 -137 203 -174 162 -78 -223
4424 -223 -104 106 159 188 -12 -116 52 89 169 -206 -28 -61 -113 -24 -115 -119 77 -48 121 -213 -88 170 113 -125
4448 -125 220 118 153 217 -1 118 -1 -25 -154 -92 74 -186 149 128 77 80 79 31 52 119 -58 -44 -237 162 -65
4473 -65 -117 -35 -7 -354 72 34 27 -20 8 34 -163 -165 -39 63 28 -124 10 55 23 209 -221 77 144 7 -84 126
4499 126 -25 104 -122 -48 395 109 -57 66 148 63 44 2 81 -30 25 -37 3 120 14 41 183 -220 -32
$$ packed form
4333a77J60J36p4R0j29l7k21L11O3j22L2K23j54J30k87O4R9l1k84K45J86%k95
4356g2P8j25J5L7l5J0J89j91K46l8k96Q2k00M11j69o0L60k51Rj40J05J54j19p7
4380g7K54q9k60M84j56j71Q7O3k0l91K65j57J99L8l28L42q5p8K21L4l20j16m9
4403c10L15j51K55J42j88j87m2J63K13j37j52J52j20j1M1j20L40l77L36k40j45
4424b23J19K10N3K9k00j04J68L7Q0l75J78l3n2Q9r1mJ96j25J69l34J25K58n7k38
4448a25L45j02L5O4k18J19j19k4j29O2J66k60L35k1n1Ljm8K1O7j77J4j93L99k27
4473f5n2Q2K8l47M26l8pm7K8K6j97kJ26J02l5j52J34M5l2J86m30K98O7j37r1K10
4499A26j51J29k26P4M43k86j66J23Q2q5j9m2P9j11N5o2M0J17j06K7J42m03J88
$$ plain form
4522 -32 64 -109 106 -189 -136 -165 -2 -128 -62 -146 -155 37 50 -69 -159 103 -30 251 -30 26 -14 -3 -21 -112 -190
4547 -190 -54 12 -29 71 -325 -33 132 -10 251 -62 53 -214 56 -28 60 -58 -77 62 -263 -30 -69 86
4569 86 191 -62 84 -113 38 54 185 223 -259 194 -199 -165 39 162 49 -102 -33 141 92 -146 49 86
4591 86 -247 49 -108 76 -58 -169 62 99 -30 116 -120 120 -105 1 111 -87 183 153 -74 176 -209
4612 -209 132 166 -107 -127 89 -34 45 140 -8 -174 55 106 -117 -279 128 -230 249 -80 133 46 -235 104
4634 104 158 6 38 46 135 -234 -30 91 -146 -132 -238 39 -8 55 3 325 4 236 2 -49 -83 153 88 55
4658 55 -45 -7 305 -37 -39 115 152 -81 202 76 219 -237 90 105 165 79 -31 9 -66 -323 -41 -190 -14
4681 -14 57 -212 -53 116 -196 -98 -105 -62 -110 -221 -87 102 41 -62 -133 -209 42 -149 -61 14 85 13 47 89 223
$$ packed form
4522c2R6j73K15k95N3k9J63j26O6q4rJ92J3j19r0K62j33K81k81N6m0J1j8r1p8
4547a90J36O6m1J00l96K92J65j42K61l13J15k67K70q4Q8j18j9J39l25K33l9J55
4569H6J05k53J46j97J51J6J31L8m82M53l93L4K04J23j13j51O9J74m9k38J95L7
4591H6l33K96j57J84j34j11K31L7j29J46k36K40k25J06J10j98K70l0k27K50l85
4612b09L41L4k73k0K16j23P9R5j48j66K29N1k23j62M07l58M79l29K13q7k81L39
4634A04N4j52L2QQ9l69K04J21k37J4j06K77m7O3n2L22l21K32k34n1l4K36o5l3
4658E5j00L8L12l42kJ54L7k33K83j26J43m56L27J5O0q6j10M0p5k57K82j49J76
4681a4P1k69J59J69l12R8pM3m8j11J34J89o1j03p1p6K51j91Q8P5P1p2L4M2J34
$$ plain form
4706 223 -54 291 66 54 112 -112 -144 -149 79 -152 -11 -11 -18 -21 236 4 -138 -75 70 -20 113 -3 -5 127 4
4731 4 95 -102 -17 -93 107 -95 -139 125 129 -45 153 -26 -1 -72 78 167 -221 -153 -74 35 50 193 62 88 111
4756 111 148 30 62 41 17 3 41 -59 -43 17 -230 49 121 -63 -67 -23 63 -52 -108 -70 -2 -80 254 -312 -83 -175
4782 -175 109 181 -82 179 42 89 219 60 -202 5 -137 159 212 -57 185 -170 102 100 -70 -106 169 50
4804 50 105 -29 83 -123 -183 -74 80 -2 21 -12 -50 12 -88 72 31 -135 142 45 -85 115 46 153 112 55
4828 55 131 111 -181 -75 4 -5 -125 118 -109 36 -99 -65 -43 74 -225 5 38 -248 235 -197 -168 11 174
4851 174 116 -68 39 96 63 5 74 31 -77 128 4 171 -147 93 -57 -198 70 -22 202 68 -13 70 -9
4874 -9 -325 29 -157 17 -16 -197 -216 -58 142 39 -85 68 131 -172 -134 122 -119 238 163 78 -109 -219 -98
$$ packed form
4706B23k77L45k25j2N8k24l2nK28k31J41%plK57k32j42O3J45r0J33j16kJ32j23
4731DR1j97Q5p6K00k02m4K64Mj74J98j79K5p1J50Q9l88O8P9J09J5J43j31K6K3
4756A11L7j18L2k1k4j4L8j00J6O0k47K79P2j84mM4Q6j15n6L8O8p8L34n66K29r2
4782a75K84P2k63K61j37M7J30j59k62K07j42K96N3k69K42l55K72kj70l6K75j19
4804E0N5j34J12k06o0J09J54q2K3l3l8O2j00J60m1j66K77r7j30K00o9J07m1n7
4828E5P6k0k92J06P9rj20K43k27J45j35L4K2J17k99K30L3k86M83m32K9J79J63
4851A74n8j84J07N7l3n8O9m3j08K05j24J67l18K40j50j41K68r2K24j34q1Q3p9
4874il16L54j86J74l3j81j9J58K00j03j24J53O3l03L8K56k41L57p5q5j87j10J21
$$ plain form
4897 -98 -147 -87 -42 -67 -243 72 -77 106 -96 -26 -14 -145 73 -65 135 165 195 117 103 -149 351 -123 80 41
4921 41 -91 83 124 21 -108 190 135 35 -116 246 21 -142 79 -164 -111 140 -99 -154 9 93 59 -47
4943 -47 90 -84 11 -26 -153 -173 49 -204 -69 102 -169 -57 -269 97 51 -196 238 209 15 -203 -173 -126 -164
4966 -164 -140 -37 -39 156 -43 123 -36 -19 59 -129 -12 67 50 66 38 -66 33 -115 13 179 -238 -85 88
4989 88 -93 261 -61 -98 6 -147 222 75 -63 65 -25 10 49 -55 144 320 -94 223 95 161 117 -2
5011 -2 -87 -76 213 89 -108 -39 48 13 190 105 -279 -208 -199 112 111 -258 95 -225 -26 18 -29 17 26 64 -73 -239
5037 -239 159 68 129 32 -62 -45 92 -99 14 -72 25 47 248 -126 -10 -195 -72 -93 15 148 230 -118 -20 -24
5061 -24 9 272 -6 138 -130 -246 404 -139 -168 66 44 135 69 13 -27 295 -17 12 -46 17 -97 208 31 147
$$ packed form
4897i8m9O0M5k5j76L15j49J83k02P0J2j31K18j38K00L0L0p8j4k52N00m74K03l9
4921D1j32J74M1j03j29K98n5j00j51L62k25j63K21k43N3K51k39n5J63Q4l4j06
4943d7J37j74R5l7j27k0K22k53J35J71k71J12k12L66m6k47M34k9j94k18L0M7l8
4966a64K4J03kJ95j99J66j59J7P8j88J17P9j7J6k8j04R9j48J28J66m17J53J73
4989H8j81L54l22l7J04j53L69j47j38J28r0L5L9j04J99J76m14L17j28O6m4j19
5011bq5J1K89j24j97O9Q7l5J77q5l84P1RL11jl69L53l20J99M4m7M6RL8j37j66
5037b39L98r1O1r7r4J7J37j91J13q6R7K2K01l74J16j85J23k1J08J33Q2l48R8m
5061b4L3K63k78J44k68j16O50n43k9K34k2R1o6n6m0L22l12K9n8O3j14L05j77J16
$$ plain form
5085 147 -25 -117 131 57 -90 -119 -165 45 -159 30 130 46 -15 74 8 19 34 -223 219 -215 -97 43 -53 -84
5109 -84 6 -69 219 -126 -243 -10 67 -30 -229 46 223 -41 -94 22 -87 -85 -261 9 102 -246 -2 -121 232
5132 232 7 114 -87 166 -37 232 76 -33 41 60 195 15 163 -53 -10 150 48 -149 64 19 -8 73
5154 73 -113 13 176 -122 36 62 -45 -38 -104 204 102 100 17 150 198 -16 -171 179 -7 -63 249 -231 -75
5177 -75 -104 -36 -222 -129 -302 143 -153 282 -56 180 -5 -108 -43 199 28 64 -12 -38 58 -3 54 88 -2 -15 -233
5202 -233 31 171 -110 -120 169 -14 31 124 31 -118 -14 -48 -123 -111 79 46 135 -80 -274 -68 38 -80 201
5225 201 23 -49 -85 104 17 128 -65 42 -17 4 271 -180 104 -95 28 -76 -115 191 15 -158 155 -5
5247 -5 -168 25 -326 167 139 32 266 -170 184 81 289 123 -54 33 106 339 27 -26 416 -42 -39 237 193
$$ packed form
5085A47j72r2K48p4j47k9m6K10k04J89J00q4o1Q9o6J1J5k57M42m34J18J40r6l1
5109h4R0p5K88l45j17K33P7r7j99K75J77k64n3J16j09Kj76K70R3l48K44j19L53
5132B32k25J07k01K53k03K69j56j09P4J9J35j80J48k16M3J60j02j97K13m5k7Q1
5154G3j86J26J63k98J58K6j07Po6L08j02kq3J33M8k14j55L50j86n6L12m80J56
5177g5k9O8j86R3j73M45k96M35l38K36j85j03O5K42j71L6p6k6R6o1N7L4r0j3k18
5202b33K64J40k81j0K89j83M5R3r3j49J04l4p5J2J90l3Q9k15j94K06J06j18K81
5225B01j78p2l6J89q7J11j93J07n9K1K67m51K84j99J23j04l9L06j76j73L13j60
5247ej63J93l51M93k8j07K34m36L54j03K08j66j77Q7P3K33l12n3M42m58LK76m4
$$ plain form
5270 193 -212 81 -32 30 30 -46 -36 166 -87 132 9 -38 14 -55 -100 25 218 166 -41 53 -9 75 89 -226 200
5295 200 -153 130 84 112 -184 -76 -177 323 -63 -92 59 -35 -90 -28 -73 71 -59 158 133 -350 -10 124 -163
5318 -163 -60 15 239 57 -118 64 66 -247 146 -59 -152 15 -90 -63 -241 65 81 33 134 -73 51 -72
5340 -72 -188 104 280 -154 90 -87 -45 -11 -152 -167 91 -306 -147 -21 21 35 -8 107 -88 -259 193 51
5362 51 4 -154 43 30 121 -110 -40 -17 -151 46 35 218 -42 39 176 12 168 114 241 139 -24 97 -55
5385 -55 142 -157 7 -131 99 277 116 -98 -137 242 201 31 298 0 191 190 -126 -82 -128 -31 146 23 -50
5408 -50 189 -10 -169 -4 29 -190 136 -91 -170 -180 27 62 -23 266 24 61 12 17 -56 -290 146 -114 -28 17
5432 17 -148 -39 -247 -169 -46 -192 102 20 -275 119 54 145 14 -68 55 -48 -66 -13 -43 -107 -87 -31 -130 199
$$ packed form
5270A93m05K93j13O2%p6J0K02k53K19j23m7N2o9m5J25J93n2k07R4o2Q4J4l15M26
5295B00l53K83m6K8k96J08j01N00l86k9J51r4n5O2m5J44j30K17k5m83L40J34k87
5318a63J03P5K24j82j75J82Kl13L93k05r3J67j05K7j78L06J6m8J01k07J24j23
5340g2j16K92J76m34K44j77M2L4j41j5K58l97J59J26M2J4m3J15j95j71M52j42
5362E1m7j58J97j3R1k31P0K3j34J97j1J83k60Q1J37j64J56n4J27j02j63J21j52
5385e5J97k99J64j38K30J78j61k14l9L79m1j70K67k98J91jl16M4m6R7J77j23p3
5408e0K39j99j59J65L3k19L26k27p9j0K07L5q5K89k42L7m9Np3k34M36k60Q6M5
5432A7j65J09k08P8J23j46K94q2k95L94o5R1j31q2J23j03j8N3l0o4K0N6r9L29
$$ plain form
5456 199 -32 185 -35 227 -110 -278 47 -138 -126 88 67 -78 30 -137 31 91 21 219 100 42 -18 -140
5478 -140 75 -191 -103 50 -34 193 41 90 216 59 57 -29 66 -225 136 48 1 -172 5 113 -189 94 61
5501 61 -16 90 131 -24 -62 45 11 -121 155 171 86 84 -161 234 125 -223 -18 -27 -110 130 -40 -41 -25 -141 -101
5526 -101 -179 127 181 8 -280 40 113 226 57 22 85 -13 -130 166 61 -108 -338 -105 158 37 184 63
5548 63 -55 25 -199 77 -7 -210 29 -9 69 -35 -255 12 128 -168 135 63 -91 -85 90 367 340 38 150
5571 150 -132 -45 178 -166 155 125 -94 281 -123 198 139 43 9 -79 -76 97 -60 47 101 -159 101 7 -72 -117
5595 -117 -189 -100 -202 -239 362 45 -71 -247 165 146 92 -15 -181 -36 178 46 48 36 -104 -205 -24 -322 102
5618 102 -393 132 47 -12 249 1 -91 -233 -225 -16 191 -18 30 73 -10 -147 -26 61 13 195 16 167 -104
$$ packed form
5456A99k31K17k20K62l37j68L25j85J2K14k1j45J08j67J68O0p0J98j19n8o0j22
5478a40K15k66Q8J53q4K27j52M9J26j57kq6R5k91L61q8m7j73J77J08l02K83l3
5501F1p7J06M1j55l8J07l4j32K76J6q5kk45L95j09l48K05rq3K40j70jJ6j16M0
5526a01p8L06N4j73k88L20P3J13j69l5O3r8j17K96j05j69k30K33K63j21J47j21
5548F3j18Q0k24K76q4k03K39l8P8j04k20K67J16k96L03p2j54OJ75K77k7l02J12
5571A50k82Q7K23l44L21l0k19L75m04L21n9r6l4q8LJ73j57J07N4k60K60r4p9m5
5595a17p2Q9j02l7O01l17j16j76M12j9n4j07j66J45K14j32Kj2j40j01J81k98M24
5618A02m95N25q5n9K61k48r2j42QK09K07k09M8M3q3j37J21Q7m8J82j79J51k71
$$ plain form
5641 -104 -26 -41 44 29 102 206 72 80 -40 -106 84 -136 -95 -109 -51 -11 235 -29 106 -255 -244 69 -258 -159 -15
5666 -15 -99 12 -46 -32 78 -54 93 -48 17 112 -121 -41 -29 -6 -58 33 320 -113 -315 -82 109 138 -49 -160
5690 -160 38 -94 41 24 -53 306 319 222 25 37 -49 204 -97 -267 -118 -155 363 50 -48 149 -273 39 -139
5713 -139 -26 -96 -140 -16 115 -124 -2 48 108 74 78 13 -36 -165 417 -30 70 -89 84 107 0 -73 -36 6
5737 6 45 -192 31 -26 -132 -159 309 -48 15 -248 15 207 -39 -29 272 -165 -166 404 141 136 -62 -155 -225 71
5761 71 23 159 -40 71 -229 -40 161 2 249 222 -84 -139 -5 86 -78 -25 52 0 116 -34 -256 101 -59
5784 -59 154 35 52 136 22 97 -55 117 -24 81 -71 -140 191 -7 249 21 -15 -29 -72 -272 -141 -122 13
5807 13 -18 243 -249 -165 3 169 113 179 -71 129 153 -281 -331 -93 51 93 270 172 134 -1 117 96 188 16
$$ packed form
5641a04P8j5Q5j5P3J04j34Qj20o6J90k20M1j4N8M0K46k64J35l61J1L13l27R9J44
5666a5q4J11n8J4J10j32J47j41O5R5k33Q0J2K3n2R1K87m33k02K33J91K9j87j11
5690a60J98j32J35j7p7L59J3r7j97J2q6K53l01j70J49l7N18l13r8J97m22L12j78
5713a39J13p0m4J24J31k39J22N0O0l4Mo5m9j29N82m47J00j59J73K3j07p3L7M2
5737FL9k37K23n7j06k7M68l57O3k63K63J92k46J0L01m37jN70k63nj98r3p0K96
5761G1m8J36j99J11l00J89K01j59K47k7l06n5J34R1j64N3P7n2J16j50k22L57j60
5784e9K13j19J7Q4j14P5j52J72j41J05j52o9L31j98K56k28l6j4m3k00J31J9J35
5807A3l1K61m92Q4J68J66n6O6k50K00K4m34n0K38J44M2J77r8l8j35J18k1R2j72
$$ plain form
5831 16 68 45 -67 -236 142 100 -130 140 23 -13 -209 144 23 -207 -129 90 -404 163 -209 61 -97 41
5853 41 152 -157 6 37 -82 7 357 -6 -152 15 -139 -129 -42 166 -76 33 -12 96 89 -8 -142 174 7
5876 7 235 -89 -55 47 181 253 -51 -61 189 115 -138 131 59 252 -76 46 -88 46 -210 106 51 -229 54
5899 54 -82 149 43 75 -36 280 199 -17 -184 38 1 -89 -90 -83 18 -194 47 51 85 274 -173 -31 -86 -122 -13
5924 -13 -79 -250 5 187 -85 -19 21 -46 -100 35 27 29 -53 259 -27 2 79 57 168 -61 83 -2 204 -169 -25
5949 -25 145 46 -125 -193 -85 -158 42 14 252 49 88 -220 -184 163 -63 -144 90 54 68 150 82 53 145 -121 116
5974 116 -66 -178 205 197 72 47 -8 248 7 -45 -58 78 -55 114 -193 151 62 -51 -53 -172 -117 169 9
5997 9 42 27 89 -168 19 -135 -70 118 -211 41 92 140 7 13 67 -69 260 12 -167 161 199 75 -18 146
$$ packed form
5831A6N2k3j12j69L78m2k30K70j17l6j96L53j21k30P8K19m94N67l72K70j58J38
5853D1J11l09J63L1j19Q9L50l63j46J67j54J0Q7K08k42J09m5J08pr7j34L16j67
5876GK28l24L4J02J34P2l04j0K50p4k53K69p2J93l28J22j34J34k56L16n5k80K83
5899E4j36K31j06L2j11L16q1k16j67K22l7r0jPJ01k12K41ML4J89m47J42n5l6J09
5924a3o6j71K55J82k72O6M0o7n4J35qKq2L12k86K9P7k2J11k29J44q5K06l73J44
5949b5J70r9j71o8J08p3K00k8K38k03L9l08L6L47k26q1K34l6J4Q2o8k9R2k66K37
5974A16j82j12L83qj25k5n5K56k41n2j3J36j33J69l07L44q9j13kj19N5K86j60
5997IL3j5O2k57J87j54O5J88l29K52N1M8j33ON4j36L29k48j79L28L8j24r3J64
$$ plain form
6021 146 78 -19 -106 103 73 138 158 200 207 53 195 -90 76 129 -8 -182 -48 -217 249 255 -206 213 132 -123
6045 -123 -1 -57 -131 -105 40 160 81 -30 -20 85 54 -185 -131 181 143 -231 110 68 90 -163 -161 -309 138 203
6069 203 -7 151 -93 45 275 21 -149 116 -64 147 246 -28 28 -413 102 57 -106 30 -60 91 -38
6090 -38 -58 13 258 -128 -84 -89 -13 115 -83 175 -53 -213 -216 179 -156 149 -83 -15 -21 -80 146 -48 -141 -4 1
6115 1 49 -231 60 168 -132 -156 -138 -52 -27 -130 147 10 67 57 70 109 -141 143 -90 260 38 -106 -117 95
6139 95 154 -34 0 34 101 -78 168 49 -60 -9 63 -62 92 125 -278 3 53 -124 -46 79 100 -18 0 31
6163 31 95 110 159 49 -162 183 -281 -137 38 -116 11 -195 80 -197 -171 -18 -128 -95 21 -211 62 -1
6185 -1 -130 33 -120 124 31 -116 22 -71 -4 -35 -322 -21 63 -71 71 87 204 182 172 333 11 69 -152 187
$$ packed form
6021A46o8r7q7K09l0O5K0M2Pj54J42k85J66N3j37j74J34j69M66Om61M19q1k55
6045a23J22n6p4K6J45J20p9j11J0J05l1k39N4L12l8l74L41m2K2k53Kj48M47O5
6069B03k10J58k44J38K30k54j70K65j80K11R9k74N6m41N15m5j63J36r0J51j29
6090c8k0P1K45l86M4nP6J28j98K58k28j60lL95l35L05k32O8on9K26j94r3J37N
6115AM8k80K91J08l00k4J8Q6K5j03K77j37N7j0J3L9k50K84k33L50k22j44j1K12
6139I5N9j88L4L4O7j79K46j19j09N1P2j25J54L3m03K81N0j77P8J25K1j18J8L1
6163C1O4J5M9j10k11L45m64J44J75j54J27k06K75k77K6J53j10L3J16k32K73o3
6185aj29J63j53K44r3j47J38r3O7l1k87L01Q4j34J42J6J17k2j0J61l22N8k21L39
$$ plain form
6209 187 121 -288 -145 -36 -92 34 88 -125 72 -21 -28 34 -301 126 -79 -116 14 150 23 190 -6 -15 181
6232 181 46 155 173 -84 155 1 130 -38 -140 43 -89 -82 136 -348 6 -282 128 71 -209 41 -182
6253 -182 130 -24 149 16 -53 -59 37 196 -19 -56 -18 116 59 22 -67 37 -57 -254 -4 -175 12 -78 -20 -40
6277 -40 -51 26 17 2 120 -314 132 196 37 34 171 102 -121 38 127 129 108 42 -217 231 2 -55 -223 67 245
6302 245 -37 -160 162 -47 262 81 251 -283 -18 65 -89 -107 47 56 104 -322 -7 -34 -70 -177 105 171 -254
6325 -254 64 164 -32 279 41 11 126 54 -98 -17 96 155 0 -139 -253 46 -6 -39 76 -209 -239 62
6347 62 19 -79 81 -175 -48 -76 -115 -100 106 -19 140 -36 -120 -82 -39 -81 18 333 93 -131 232 105 125 -85
6371 -85 105 31 133 163 -59 -75 -66 36 52 -121 79 51 -188 -44 -4 54 -146 -4 81 156 -32 49 47 -39 146
$$ packed form
6209A87o6m09J43J09n6J26N4k13J97r3pO2l35M27k05l7J30J36j27J67j96rJ96
6232A81j35J09J8k57K39j54J29j68j02J83j32PK18m84L54k88M10n7k80K50k23
6253a82L12j54J73j33o9oR6J59k15l7L8J34n7l7q9J04r4j97K50j71J87r0N8k0
6277d0j1P7rj5J18m34M46O4j59lJ37o9k23J59Q9Kk1o6k59M48k29n7j68K90J78
6302B45k82j23L22k09L09j81J70n34K65Q3j54j8J54RM8m26L15k7l6j07K82O6m25
6325b54L18J00j96L11k38l0J15p2j52Q1J13N9j55j39j14K99n2l3J15k85l0L01
6347F2m3r8J60k56J27k8l9J5K06j25J59j76q4L8M3m2R9L15k40k24L63j27K0k10
6371h5J90p4J02L0k22j6RJ02J6j73K00k8k39J44M0N8k00J42Q5P5j88Q1kq6J85
$$ plain form
6396 146 -171 -75 172 -15 93 40 -94 60 211 -278 -127 -98 85 146 226 151 29 -74 -199 116 -56 -83
6418 -83 -64 194 -13 129 -92 7 110 -50 48 116 69 168 -216 -157 -75 -111 -10 77 -76 80 156 -189 125 13
6442 13 -205 -73 -24 80 247 -155 246 -34 150 -75 73 133 91 114 342 23 113 218 -53 -31 -33 -27 75 -300
6466 -300 -15 95 -273 251 -209 26 -51 46 77 -140 -307 111 9 36 73 -27 109 116 30 92 -86 97 232
6489 232 116 -32 -9 -227 82 -36 -8 -89 -287 260 -138 49 -95 -116 62 56 -32 152 120 -10 114 -91 -134
6512 -134 -353 -2 -78 -161 -12 -6 91 -26 -47 -91 -23 -48 99 -76 -59 -133 292 48 21 -74 302 137 -11 64 195
6537 195 -87 105 -202 43 -5 88 143 128 115 178 -43 103 201 16 126 -115 -16 80 -271 72 131 -244 -107
6560 -107 -133 222 -93 94 -27 -34 -43 84 61 269 48 66 310 80 152 105 30 155 -25 -3 -5 63 132 58 -227
$$ packed form
6396A46l17R6K47j87J08n3j34J54J51m89J51K9J83O1Q0p5j22j03j25L15j72k7
6418h3J9K58k07J42k21R9J03j60R8O8m7R9l84N9Q2l6J01Q7j53J56P6l45L14j12
6442A3k18J32M9J04J67m02M01k80J84k25J48O0m2K3K28l19R0J05k71K2kOJ02l75
6466c00K85J10l68N24m60K35p7R7L1k17j67M18j02K7L7j00J36Pq6O2j78J83J35
6489B32j16j48K3k18L09j18K8q1j98N47l98J87j44k1J78oq8J84l2j30J24k05m3
6512a34k19L51p6q3J49OR7j17k1m4O8k5J47j75J7p4M25k44k7r5L76j65j48P5J31
6537A95k82J92l07K45m8R3N5j5j3O3k21J46R8j85J10k41R9R6l51L43N9l75J37
6560a07k6L55l15J87j21prJ27k3K08k21J8K44k30P2m7p5J25j80K2kO8O9p4k85
$$ plain form
6585 -227 -193 -138 -112 -142 -99 171 -97 -164 -147 -63 19 -187 -160 157 -181 -3 -149 79 28 -126 -53 25 70 -40 -132
6610 -132 189 102 156 -4 -118 -194 -89 15 89 44 8 169 -62 223 -27 58 9 -142 -83 65 -2 110 158 116
6634 116 89 -81 203 -19 -127 -120 41 -144 128 -13 -66 61 -10 -24 53 -71 -41 -240 -89 177 -14 154 61
6657 61 -27 75 159 40 -174 -50 79 102 -140 230 100 -166 8 -62 305 -53 -186 2 -41 18 -13 41 -220
6680 -220 -238 -53 -104 -138 157 -55 -57 71 -20 -9 219 -217 57 66 -114 60 -91 55 -138 -93 110 61 89 -100
6704 -100 -52 -119 -66 16 96 -52 -13 -211 61 -211 -60 -156 -162 -76 106 -79 290 -28 -44 45 90 -58 25 41 53
6729 53 34 -143 50 68 36 291 88 -113 -123 -38 376 264 106 -94 -56 121 -6 101 133 -184 -49 124 101
6752 101 68 9 -73 -56 -135 63 198 -250 299 358 -56 352 141 251 88 -58 57 -243 2 -72 -16 67 36
$$ packed form
6585b27L4N5K6l0M3K70k68o7J7Q4Q2k06K7L17l38J78j46K28n1j54P3P8M5j10r2
6610a32L21q7N4j60j14p6J05J04P4m5l6J61k31K85k50Q5m9j51N9J48o7J12M8m2
6634A16k7j70K84k22j08PJ61j85K72j41n3J27p1j4P7j24L0j99J51K66j91J68r3
6657F1q8J02Q4j19k14J24J29K3k42L70j30k66J74p0L67l58j33J88m3N9l1N4k61
6680b20j8J85n1l4K95k12kJ28r1J1K28m36K74Rj80J74j51J46j93M5K03m9K8j89
6704a00M8o7N3Q2Q0j48L9j98K72k72J51r6oQ6J82j85L69l18j6Q9M5j48Q3J6J2
6729E3j9j77J93J8l2K55k03k01j0Q5M14j12j58k00L8J77j27J07L2l17J35J73k3
6752A01l3n9q2J7p9J98J35m48N49N9m14M08k11J10j63j46J15l00K45p4N6Q3l1
$$ plain form
6775 36 -6 -77 211 46 40 72 -110 -11 -1 67 -169 49 196 164 260 117 78 12 -90 342 -77 253 221 6 16
6800 16 -113 205 192 -264 -175 23 -14 144 67 87 142 -13 78 -58 -311 136 169 149 31 57 67 -28 78 184
6824 184 0 -374 -41 -208 -20 189 -161 -32 16 235 -56 176 181 47 -102 -121 -39 -251 209 -62 -165 57
6846 57 -68 116 -22 207 -74 -74 88 -133 21 17 -233 -253 -124 167 53 -260 -18 -28 -136 298 17 155
6868 155 -10 -184 -186 182 19 -43 12 -179 411 51 59 16 -228 -13 -210 51 62 -153 -52 -47 -178 4 -59 -95
6892 -95 144 24 60 31 -30 -183 142 -26 -213 94 285 -27 116 -214 -140 -50 -261 -8 1 -140 -78 300 -48
6915 -48 60 47 2 177 55 233 -41 -17 -195 71 -74 -155 17 101 36 14 -122 -4 134 123 84 -131 -330
6938 -330 -35 111 -93 116 46 -262 248 185 -171 26 55 46 35 -27 1 -21 266 287 52 203 -149 -10 -189
$$ packed form
6775C6m2p1K88j65oL2j82R9J0O8k36K18J47l2R6j43l9o6j02M32m19L30l2k15J0
6800A6j29L18j3m56Q9J98l7J58p7K0N5j55R1j36k53M47L3k0j18K6J0r5J06J06
6824A84j84l74L33j67J88K09l50J29M8K19k91K32Nj34j49j9Q2k12M60k71j03K22
6846E7j25J84j38K29k81%J62k21J54mk50k0J29K91j14l13K42j0j08M34k81J38
6868A55j65j74kL68j63o2N5j91N90l60Qm3k44K15j97K61J1k15J01Nj31J82o3l6
6892i5K39j20L6k9o1j53L25j68j87L07J91l12J43l30P4R0k11K53Rj41O2L78l48
6915d8J08j3m5J75j22J78k74K4j78K66j45q1J72Q4o5k2j36J18J38j1l9k15j99
6938c30K95J46k04K09p0l08N10o3l56J97K9rj1o2K8k2K87K1k35J51l52J39j79
$$ plain form
6961 -189 -141 121 49 -294 -82 12 -23 -59 4 82 -195 21 28 -141 13 61 58 261 46 49 39 -158 129 -16 -138
6986 -138 -200 22 172 113 -85 83 -203 -47 -123 16 148 -181 -141 -24 -151 112 149 123 119 -14 -8 -59 224 -136
7010 -136 50 -116 -1 145 46 122 -2 38 144 -43 -101 -158 214 -194 -22 -15 141 111 16 -38 26 128 42 57
7034 57 -2 5 23 -40 46 113 91 34 -174 95 -76 40 136 196 46 19 -43 0 115 -74 166 -115 -108 29 -104 -210
7060 -210 -160 -217 -224 -52 -66 52 -9 -4 -195 38 -129 43 299 91 -70 40 233 -86 -91 38 -153 -85 132 -247
7084 -247 46 -38 88 95 119 -41 -68 -72 29 -36 -200 132 -262 -99 159 -151 -101 82 173 -10 231 -91 138
7107 138 97 205 -29 -121 -31 182 -5 45 -106 23 -27 -190 -17 249 -13 58 95 -319 120 -60 131 127 -29
7130 -29 51 177 -35 42 62 136 139 309 -25 109 38 63 -54 82 -79 -231 153 15 -3 -219 -38 -47 67 -146
$$ packed form
6961a89M8K62p2l43K12R4l5l6O3P8k77K16Pj69J54M8lK03k15Lj0j97K87j45j22
6986a38o2K22J50n9j98J68k86J56p6J39J32l29M0J17j27K63L7k6mj33On1K83l60
7010a36J86j66J15J46r9P6j24M0J06j87n8n7L72m08J72PJ56l0r5n4O4J02q6J5
7034E7n9PJ8o3Q6O7k2n7k08K69j71J16R6O0j50k7o2M3J15j89K40k81PJ37j33j06
7060b10N0n7pJ72j4J18o1Nj91K33j67J72K56k08j61J10J93l19nJ29j91O8K17l79
7084b47K93q4J26PK4j60k7mJ01o5j64L32l94J63K58l10N0J83R1j83K41l22K29
7107A38m1J08k34r2R0K13j87N0j51J29n0j63J73K66k62P1L7m14M39j80J91mj56
7130b9Q0J26k12P7K0P4LJ70l34J34p1K5j17J36j61j52L84j38j8k16J81rJ14k13
$$ plain form
7154 -146 -36 -103 -79 118 86 24 -28 -76 40 72 -54 -80 98 -59 -138 -117 87 1 318 18 115 145 -302 198
7178 198 -217 33 289 147 -40 -50 62 220 -3 35 -30 -279 -2 43 126 75 -273 118 -2 -9 -30 -130 -131 241
7202 241 80 242 42 -205 65 -131 -38 -237 126 -75 67 -64 14 -116 -160 -201 -139 21 5 -220 25 93
7224 93 99 -33 104 21 -166 -115 -13 -339 257 67 -78 98 -145 165 -85 -113 -137 82 -142 -19 -38 -62 19
7247 19 168 -319 -112 285 -87 24 256 1 52 258 70 161 171 -91 13 -154 103 -42 -52 82 0 90
7269 90 -7 -177 -88 61 -142 83 29 -164 45 -31 -152 79 -183 -79 -408 144 -21 0 -90 0 -3 192 -140
7292 -140 -188 -182 -139 3 -343 -31 150 -394 118 280 85 182 -56 48 -16 -65 33 130 -7 221 -162 58 -211
7315 -211 -236 242 38 45 142 -34 207 -73 22 77 43 -137 -131 130 108 -47 -31 37 -184 -148 -58 -16 135 -208 -89
$$ packed form
7154a46J10o7K4J97l2o2n2m8J16L2j26k6J78j57p9K1K04q6L17l00R7L0m47N00
7178A98m15K50K56j42j87j0J12J58k23L8o5k49K77M5Q3n1l48L91j20pk1j00jL72
7202B41j61J62k00k47K70j96R3j99L63k01J42j31P8j30m4m1O2J60j6k25K45O8
7224I3Oj32J37q3j87N1J02l26N96j90j45J76k43L10k50k8k4K19k24J23j9k4Q1
7247A9J49m87K07L97l72J11K32k55N1K06j88R1J0k62J04j67K57j45j0J34q2R0
7269I0r7j70Q9J49k03K25n4j93K09p6j21K31k62J04l29N52j65K1r0R0lJ95l32
7292a40m8OM3J42l46L12J81n44N12J62j95R7k38J04o4m9R8R7j37K28l83K20k69
7315b11k5M78k04PR7j76K41k80R5N5l4j80OK61k2j55J6O8k21L6R0M2J51l43J19
$$ plain form
7340 -89 10 -18 136 -148 -21 -40 246 -244 -12 -117 -110 207 147 11 95 -39 -31 -151 -112 35 -12 85 50 -172 -24
7365 -24 72 97 182 -45 223 128 -102 106 -40 317 20 40 -270 63 -93 -51 25 79 25 58 -138 242 87 164
7389 164 126 -45 76 128 175 -99 -45 -70 87 -153 55 107 -136 -7 69 187 161 38 126 243 -253 -91 -114
7412 -114 79 229 -98 -204 58 18 72 18 -11 119 5 -218 189 68 34 -92 8 63 -132 104 -103 2
7434 2 -46 15 -49 46 -67 -25 -228 86 -81 187 93 -17 96 -23 -23 71 23 -70 9 78 -78 -95 32 6 115 141
7460 141 47 -129 -16 170 -118 52 107 -160 -217 -123 -61 174 -25 -72 -177 -112 44 -103 36 -25 -88 135 -382
7483 -382 84 187 -321 16 -118 -68 252 67 -257 -54 28 41 -297 141 76 17 -106 -6 51 14 -10 -182 -5
7506 -5 -87 -2 -211 -117 -243 66 -155 51 193 91 138 -111 159 92 11 -69 -52 -21 -173 -151 -7 -10 68 -25 -110 -1
$$ packed form
7340h9R9k8J54k84J27j9K86m90K32j05PL17o0j36Q4j34Qj20L9J47m7R7l5k22J48
7365b4R6K5Q5k27K68r5k30K08j46L57k97K0l10L33j56M2P6N4n4L3j96L80j55P7
7389A64l8j71J21N2M7k74N4k5J57k40K08N2k43J29P6J18k6j23Q8J17m96J62k3
7412a14J93J50l27j06K62m0N4n4k9J30j14k23M07j21l4j26J00N5j95K36k07J05
7434Bm8O1o4R5j13M2k03L14j67K68r4j10J13j19%R4m8r3P9O9j56j7J27k6J09K6
7460A41r4j76J13J86k88J70N5k67n7R4O2K35j99m7j05O5J56j47J39o1o3K23n17
7483c82M66J03n08L37j34N0L20j85l24K03Q2J3l38M38o5n9j23J00N7l7k4j72J77
7506eq2Q5k09R4j26L09k21K06J42j02M7k49K70o7q1q0J7L1j52K2J44lP8r3q5J09
$$ plain form
7532 -1 38 193 147 18 58 37 -304 -42 59 -34 282 48 -73 97 31 -129 33 2 -42 -59 -131 162 -39 -100
7556 -100 -60 25 -164 70 -141 38 28 58 -128 -37 -236 -133 126 -1 -49 -50 8 157 -38 -209 86 -62 134
7579 134 -5 -186 -19 -101 -104 110 150 -97 186 -77 35 -117 -72 30 107 19 -211 -157 220 -133 -98 219 77
7602 77 75 -52 -35 -205 81 -72 32 -106 -69 -126 -342 92 -163 62 -120 318 -6 11 195 -78 48 -170
7624 -170 -12 178 -46 93 106 96 135 2 146 -56 -18 -89 172 45 -62 -48 -116 93 59 -26 50 114 24 39
7648 39 -123 -155 -65 -186 37 -45 -29 8 -133 -205 57 220 -159 204 -135 34 77 -84 266 -38 -139 -107 144
7671 144 51 14 220 -119 74 26 79 127 147 52 -56 30 -71 147 30 90 -197 28 -46 -168 416 72 -136
7694 -136 66 -158 317 19 -260 -79 -17 -47 -172 -50 -48 219 22 -93 61 134 201 47 -36 -129 84 -19 15
$$ packed form
7532aL9J55m6j29M0k1l41K62J01r3L16k34j21J70o6j60J62l1m4j7p2K93k01o1
7556a00M0Q5j89K34k11J79j0L0j86R1j99J03K59j27m8jN8J49j95j71K95j48J96
7579A34j39j81J67q2lK14M0k47K83k63J12j52M5J02P7q8k30N4L77l53L5L17j42
7602G7kj27J7j70K86j53J04j38L7n7k16M34k55K25j82M38l24J7J84k73J26k18
7624a70J58J90k24J39J3j0L9j33J44k02L8p1K61j27j07J4o8K09l4q5P6O4r0J5
7648C9j62l2R0j21K23q2J6L7j41p2K62J63l79L63l39J69M3j61L50l04j01L2K51
7671A44r3l7K06l39J93m8N3M8K0r5j08Q6j01K18j17O0k87K25p4j22N84l44k08
7694a36K02k24M75k98k79J81O2l0j25J22KK67j97j15J54P3O7j54q3r3K13j03L4
$$ plain form
7717 15 -172 -16 109 -94 120 -62 98 -152 -77 4 104 -12 -65 127 -75 -79 281 -85 -61 -24 -87 355 -248
7740 -248 -15 83 154 -80 119 -37 -140 41 -170 214 33 -81 -148 -112 -19 -126 -58 145 -114 -105 77 -58 -267
7763 -267 -48 -52 219 -246 217 126 -134 203 89 -16 130 -89 91 -123 -157 129 19 -39 -73 3 96 317 23
7786 23 75 277 38 -29 -87 17 55 111 200 9 20 185 -40 -56 55 254 11 -112 60 93 85 -77 -61 162
7810 162 31 15 56 203 -66 63 132 92 313 13 13 274 119 -37 47 -93 215 115 65 -236 26 25 124 -250
7834 -250 -222 155 92 -173 -104 -98 -344 -46 -85 -92 -116 92 64 13 -72 12 -49 61 -68 39 77 44 -36 83 88 52 -140
7861 -140 -25 125 -161 86 -27 -113 -131 -195 140 -73 -37 61 -59 336 -4 46 -119 52 -264 2 113 34
7883 34 116 -52 105 121 -100 171 206 -219 76 39 -109 -18 -81 -74 34 74 50 67 -22 -285 21 -31 -96 218 146
$$ packed form
7717A5j87J56J25k03K14j82J60k50P5Q1J00j16n3J92k02mL60l66K4L7o3M42o03
7740b48K33R8P1k34J99j56j03J81k11L84j81j14o7L6R3j07O8K03k59RJ82j35k09
7763b67K19mK71m65M63r1k60L37j14j05J46k19J80k14l4K86j10n8l4P6R3K21k94
7786B3N2K02k39o7n8J04L8N6Q9j91J1J65k25j6J11J99k43j23J72L3qj62J6K23
7810A62j31j6M1J47k69J29O9m0K21l00%K61j55j56Q4j40L08j00n0l01K62jR9l74
7834b50K8L77o3k65O9Ok46K98l9pk4K08k8n1q5Q4o1J10j29J07L8l3q0J19Nl6j92
7861a40J15J50k86K47j13q6j8o4L35k13L6R8j20L95l40N0j65J71l16K66J11p9
7883C4Q2j68J57J6k21K71L5m25K95l7j48R1o3PJ08M0k4J7q9k63L06n2o5L14p2
$$ plain form
7908 146 -100 -7 143 -133 -122 -105 20 -99 -11 15 20 156 -30 93 45 92 16 37 -67 287 186 -173 -107 -21
7932 -21 89 191 -150 233 16 -109 -295 179 -81 -177 3 29 58 -26 81 49 -65 -113 -108 -111 55 -173 90 7
7956 7 236 123 177 171 384 -80 28 292 -35 298 80 -187 267 9 -2 -69 14 -84 -244 100 -262 -142 -51
7979 -51 230 156 107 -116 23 -67 142 -97 -106 -334 -59 -15 91 -51 41 -261 -137 173 55 -16 -55 163 -169
8002 -169 -25 -20 253 151 -160 -98 -239 -182 -2 -72 1 -88 55 -23 29 -50 269 38 72 -137 7 -40 -29 235
8026 235 162 219 -123 164 -33 38 36 -14 22 -217 -175 20 170 95 39 54 29 -77 244 -40 -58 52 89 -235 84
8051 84 -74 22 -86 -206 76 154 71 101 120 157 153 -101 93 255 -184 -23 -72 90 54 -270 -100 62 73 -6
8075 -6 20 -24 135 123 98 248 129 -59 -49 32 -125 -20 -132 -86 30 180 36 69 -84 -51 -20 -154 133 -73
$$ packed form
7908A46k46R3J50k76J1J7J25j19Q8K6NJ36j86J23m8M7p6K1j04L54j01l59O6Q6
7932b1J10J02l41L83k17j25j86M74k60r6J80K6K9q4J07l2j14m8NlJ66k28K63q3
7956GK29j13N4oK13m64J08K64l27L33k18k67M54k58j1o7Q3r8j60L44l62J20R1
7979e1K81p4m9k23J39r0K09k39rk28K75M4J06j42R2l02J24L10j18p1l9K18l32
8002a69J44NK73j02l11O2j41N7J80p0P3q9J43p8N2p9L19k31L4k09J44m7J1K64
8026B35p3N7l42K87j97P1kn0L6k39M2J95J50p5n6J5k5j06L21k84j8J10L7l24L19
8051H4j58R6j08j20K82P8q3L0J9L7mk54J94J62m39J61m9J62l6l24J70J62J1p9
8075fK6m4J59j2k5J50j19j88J0Q1j57J05j12M6J16J50j44L3j53L3L1j34K87k06
$$ plain form
8099 -73 167 173 90 0 10 -369 -24 56 -6 -79 134 -1 152 52 103 75 169 -49 -24 106 119 -57 -43 7 231
8124 231 196 125 190 215 -104 94 117 69 -223 37 228 35 -32 -159 66 58 -102 -41 131 149 -41 -8 80 2 -213
8149 -213 -78 -46 -94 53 -100 -92 -75 -112 35 -79 61 -56 -102 21 327 -123 131 -18 45 87 69 224 125 -57
8173 -57 11 171 -341 31 -61 80 162 130 -88 -31 -122 78 116 -167 74 84 213 20
$$ packed form
8099g3K40Oq3r0J0l79L45Q0o2p3K13j35J53j00N1k8R4k18K5J30J3j76J4N0K24
8124B31l5p1O5K5l19J98K3m8k92K60J91j93o7j27K25qj60O1J72J8j90L3Q8p8k15
8149b13J35L2m8J47j53QJ7l7J47j14J40j17m6J23L06m50K54j49O3M2j8J55r9j82
8173e7O8J60n12L72r2J41Q2l2k18N7r1K00L8k83K41J0J29j93
8191B0
$$ Imaginary data points
##PAGE= N=2
##DATA TABLE= (X++(I..I)), XYDATA
$$ plain form
0 0 0 0 0 0 0 0 6 0 0 -2 8 -8 8 -8 16 -16 24 -29 32 -40 48 -56 66 -79 93 -106 125 -142 165 -189 214 -244
32 -244 276 -311 350 -391 439 -492 549 -611 678 -755 834 -921 1019 -1122 1240 -1365 1504
49 1504 -1655 1823 -2011 2219 -2449 2711 -3008 3351 -3744 4208 -4764 5442 -6292 7386 -8857
64 -8857 10939 -14107 19457 -30146 59434 -300699 -866213 161125 431243 -156928 -107801
75 -107801 226022 2515 -17438 146260 -206363 -365154 232889 363730 -131968 -175573
85 -175573 143070 91893 -143821 -157675 -281 143500 177514 -43456 -205041 -7095 133441
96 133441 -2039 -101010 -75497 64072 176667 28371 -178438 -89529 97203 34202 -34575
107 -34575 72882 -3000 -107832 72814 89227 -139539 -73906 152730 49183 -133282 24072
$$ packed form
0@%%%%%%Oo%kJ0j6J6j6K4l2M0n3O1p2Q8j04J22j45J72j99K31k67L07l54M03m58
32b44N20n87O61p41Q30r31J041j160J289j433J589j755J940k141K362k605K869
49A504l159L478l834M230m668N160n719O359p095P952q972J0206j1734J3678j6243
64h857J9796k5046L3564m9603Q9580l60133n65514J027338K70118n88171M9127
75a07801L33823k23507j9953J63698l52623j58791N98043J30841m95698m3605
85a75573L18643n1177k35714j3854J57394J43781L4014k20970j61585J97946J40536
96A33441j35480r8971K5513J39569J12595j48296k06809Q8909J86732o3001o8777
107c4575J07457p5882j04832J80646J6413k28766O5633K26636j03547j82465J57354
$$ plain form
118 24072 127312 -85021 -105818 81442 42763 -51064 28091 46206 -77213 -61734 87001
129 87001 43269 -79526 -34095 35508 49314 17448 -62534 -44762 49743 43571 -28768 -13140
141 -13140 41048 -16102 -41902 41719 17448 -38601 18983 15479 -44503 11144 71398 -33843
153 -33843 -101338 45077 92003 -43756 -44893 17880 -9072 11454 40909 -36892 -63906 56548
165 56548 70677 -77347 -53819 81074 26263 -63508 -14424 45694 22420 -21595 -12681 -3415
177 -3415 -176 35465 14924 -46060 -31935 37290 55475 -32210 -72238 25563 59351 -17848
189 -17848 -40854 7971 22691 -14690 -3336 18736 -21968 -8155 33353 -7284 -30282 12633
201 12633 30100 -12145 -29505 20377 22175 -16467 -242 8413 -10018 -3201 18315 10454 -31799
$$ packed form
118B4072J03240k12333k0797J87260l8679r3827P9155J8115j23419J5479J48735
129H7001m3732j22795M5431O9603J3806l1866p9982J7772R4505o172p2339J5628
141a3140N4188n7150k5800Q3621k4271n6049N7584l504n9982N5647O0254j05241
153c3843o7495J46415M6926j35759j137O2773k6952K0526K9455p7801k7014J20454
165E6548J4129j48024K3528J34893n4811q9771M9084O0118k3274m4015Q914R266
177c415L239L5641k0541o0984J4125O9225J8185q7685m0028R7801L3788p7199
189a7848k3006M8825J4720l7381J1354K2072m0704J3813M1508m0637k2998M2915
201A2633J7467m2245j7360M9882J798l8642J6225Q655j8431O817K1516p861m2253
$$ plain form
214 -31799 -13357 36451 1079 -25847 4176 4859 -8373 4477 15452 -14343 -25919 24769
226 24769 18785 -28571 -5331 17986 1334 -9547 -1568 11865 290 -6278 4269 -388 5459
239 5459 3134 -8254 3995 -604 -366 10729 -10663 -11673 12964 9006 -15278 -13568 20742 6194
253 6194 -27549 6528 16195 -12933 -2427 6157 -4299 -2611 10094 4623 -19303 3053 25329
266 25329 -9458 -15363 8721 11169 1103 -11581 -99 9981 -2435 120 -2772 -5093 6335
279 6335 2410 -2376 -8983 -4062 15869 -1951 -17246 3342 8071 642 -7409 -2924 8568 -2484
293 -2484 -1427 5413 -4691 863 4207 1575 604 -5849 6792 6183 -10672 3030 7814 -4966
307 -4966 -5116 2933 6675 -9429 -5454 12445 -6453 -8284 9084 -3016 -5989 3357 2781 -3176
$$ packed form
214c1799J8442M9808l5372k6926L0023O83j3232J2850J0975k9795j1576N0688
226B4769n984m7356K3240K3317j6652j0881P979J3433j1575o568J0547m657N847
239E459k325j1388J2249m599K38J1095k1392j010K4637l958k4284J710L4310j4548
253F194l3743L4077R667k9128J0506Q584j0456J688J2705n471k3926K2356K2276
266B5329l4787n905K4084K448j0066j2684J1482J0080j2416K555k892k321J1428
279F335l925m786o607M921J9931j7820j5295K0588M729p429q051M485J1492j1052
293b484J057O840j0104N554L344k632r71o453J2641o09j6855J3702M784j2780
307d966j50Q049L742j6104L975J7899j8898j831J7368j2100k973R346n76n957
$$ plain form
321 -3176 -4495 7641 359 -7534 7312 1115 -4056 4883 -2098 1008 3931 -3429 662 2048 2405
336 2405 -2703 -2947 6668 -3694 -4379 7730 -6753 -5050 7870 -1699 -6642 -432 5250 -1692 -6467
351 -6467 6516 -769 -6404 8212 34 -5016 3800 1678 1244 -894 523 3630 -2164 2338 1163
366 1163 -2363 3946 -3356 -1234 5154 -5463 -810 2753 -3879 -1434 -255 1924 -2914 -4474 5833
381 5833 -2212 -3806 5451 -2698 -1149 3316 -590 1324 -1179 1174 3070 -1847 2907 -186 -1053
396 -1053 4264 -2931 1023 2944 -5553 2186 2226 -3755 -1481 -291 1941 -2728 -2950 3561 -4320 48
412 48 4623 -5913 -618 2677 21 2228 -2976 -390 4047 1762 1191 -4704 1414 7200 -3738
427 -3738 498 1547 -4004 4048 1906 -3044 -1846 -769 3768 -2159 -3089 1150 -3559 3142 622
$$ packed form
321c176j319J2136p282p893J4846o197n171Q939o981L106K923p360M091J386L57
336B405n108k44R615j0362o85J2109j4483J703J2920r569m943O210N682o942m775
351f467J2983p285n635J4616q178n050Q816k122m34k138J417L107n794M502j175
366A163l526O309p302K122O388j0617M653L563o632K445J179K179m838j560J0307
381E833q045j594R257q149J549M465l906J914k503K353J896m917M754l093q67
396a053N317p195L954J921q497P739M0n981K274J190K232m669k22O511p881M368
412D8M575j0536N295L295k656K207n204K586M437k285n71n895O118N786j0938
427c738M236J049n551Q052k142m950J198J077M537n927r30M239m709O701k520
$$ plain form
442 622 -8641 4327 4069 -4715 -1459 1344 2374 -975 537 3075 -5125 3107 7186 -4929 -133
457 -133 1355 256 5416 -2477 -4533 1378 3202 1136 -6486 251 3647 -5667 1820 1978 -6398 558
473 558 2001 -130 -1443 -3141 3035 1191 -609 -51 -3588 6237 3697 -7270 1952 3262 -113
488 -113 2535 -1118 -1677 -1467 4025 5511 -8346 -4464 5663 2279 837 -7390 -4893 8148 1566
503 1566 -4881 -3430 -432 5022 -470 -2193 -687 -1877 6177 1346 -5412 1164 2030 4784 942
518 942 -8853 1629 9101 1671 -7304 -6167 9200 5806 -6671 -2705 -2523 1563 7459 -3508 -7722
533 -7722 -2355 5784 5976 -7203 -5550 2720 4227 4055 -7520 -5214 9999 3198 -5419 -3243 2994
548 2994 6625 -1192 -3589 -786 1300 7506 -1631 -8353 940 3507 4271 -1562 -10056 540 7410
$$ packed form
442F22r263J2968k58q784L256K803J030l349J512K538q200Q232M079j2115M796
457a33J488j099N160p893k056N911J824k066p622O737L396r314P487J58q376O956
473E58J443k131j313j698O176j844j800N58l537R825k540j0967R222J310l375
488a13K648l653n59K10N492J486j3857L882J0127l384j442q227K497J3041o582
503A566o447J451K998N454n492j723J506j190Q054m831o758O576Q66K754l842
518I42r795J0482P472p430q975J137J5367l394j2477L966J82M086N896j0967m214
533g722N367Q139J92j3179J653Q270J507j72j1575K306J5213o801q617K176O237
548B994L631p817k397K803K086O206r137o722R293K567P64n833q494J0596O870
$$ plain form
563 7410 1472 -6662 -6239 6709 3426 -5605 833 -254 -614 2839 -761 -613 -547 2540 3311 -5095
579 -5095 -62 5561 688 -745 -4084 926 6297 -1880 -2677 -1267 -449 3717 -252 -3263 -2417 48
595 48 4727 -2901 -4257 2929 -1000 -118 1644 -2511 767 1393 323 -681 -1498 5422 595 -4903
611 -4903 2285 2804 2193 -546 -4549 2498 3017 21 -948 -4159 930 3106 -1051 -1602 -4550 2065
627 2065 5366 -5715 -3056 3590 1275 -1161 -3064 1464 2476 208 1469 -4706 -640 8566 -404
642 -404 -4929 -1078 3121 5719 -2660 -4982 972 2495 3379 -2997 -4611 2088 1067 975 -2209 -5503
658 -5503 3662 2906 -4042 -2792 378 4465 -891 -4245 2095 311 1896 2349 -5072 -16 4479 1400
674 1400 -1008 -3814 2108 3937 -700 -526 -2563 714 3548 -2957 -378 -377 -2642 2934 -253 -3353
$$ packed form
563G410n938q134M23J2948l283r031O438j087l60L453l600J48O6L087P71q406
579e095N033N623m873j433l339N010N371q177p97J410Q18M166l969l011Q46K465
595D8M679p628j356P186l929Q82J762m155L278O26j070j004q17O920m827n498
611d903P188N19o11k739m003P047N19k996r69l211N089K176m157n51k948O615
627B065L301j1081K659O646k315k436j903M528J012k268J261o175M066R206q970
642d04m525L851M199K598q379k322N954J523Q84o376j614O699j021r2l184l294
658e503R165p56o948J250L170M087n356l354O340j784J585M53p421N056M495l079
674A400k408k806N922J829m637J74k037L277K834o505K579Jk265N576l187l100
$$ plain form
690 -3353 -200 757 1211 -2732 -556 3173 -2345 718 1470 -2918 1967 1909 -726 -303 -706 2905 1315
707 1315 -1779 580 -874 2058 1683 -3947 317 1086 -848 1454 -1963 -1752 756 558 373 -3399
723 -3399 455 2492 -3276 950 1528 -2256 1997 195 -830 895 606 1414 -1617 -45 2674 -1482
739 -1482 667 755 -1634 2287 -226 -1347 1223 -1419 -51 332 -505 -19 -2235 1085 561 -2805 1663
756 1663 -266 -2364 1710 334 -92 -316 -172 2201 -852 544 1929 -1802 1279 654 -601 2050
772 2050 -1410 -618 1389 -825 313 -633 -392 269 -1411 1826 -705 -2855 2353 -666 -1809 867
788 867 -731 307 -478 -152 1555 -751 830 644 -1027 2453 -12 -681 1723 -1153 940 908 -1135
805 -1135 89 -450 847 -207 -2307 1669 -801 -2046 1801 -1525 -633 689 -1195 249 -591 506
$$ packed form
690c353L153R57M54l943K176L729n518L063P52m388M885n8k635M23m03L611j590
707A315l094K359j454K932l75n630M264P69j934K302l417K11K508j98j85l772
723c399L854K037n768M226N78l784M253j802j025J725k89Q08l031J572K719m156
739a482K149Q8k389L921k513j121K570k642J368L83q37M86k216L320n24l366M468
756A663j929k098M074j376m26k24J44K373l053J396J385l731L081o25j255K651
772B050l460P92K007k214J138r46K41O61j680L237k531k150N208l019j143K676
788H67j598J038p85L26J707k306J581j86j671L480k465o69K404k876K093l2k043
805a135J224n39J297j054k100L976k470j245L847l326Q92J322j884J444q40J097
$$ plain form
821 506 808 -1893 1230 392 -1200 2289 -783 -206 1901 -801 937 180 -432 1002 -686 1017 -678
838 -678 -1435 2159 -1219 -960 1408 -1697 244 345 -1336 -110 -897 838 -219 -2101 1848 -349
854 -349 -604 1697 -1305 665 1488 -926 1005 -163 459 1410 -1208 1030 -426 -190 1681 -2323 -6
871 -6 1882 -2077 51 113 -688 19 -1088 721 -1002 -1426 2173 -1020 -631 1353 -940 1013 157 -945
889 -945 1661 -213 409 659 -760 1921 -395 -140 1398 -1599 770 801 -1845 897 -171 -528 -130
906 -130 -1148 946 -900 -1056 1694 -1802 -305 1345 -1412 274 -371 330 1450 -1706 830 1524
922 1524 -549 681 -397 1347 889 -2030 1783 653 -1930 1106 -143 -251 -502 -618 1427 -1751
938 -1751 -1132 1610 -1315 339 -774 -1186 1814 -897 -923 1096 -205 652 -594 701 1619 -1648 890
$$ packed form
821E06L02k701L123q38j592L489l072N77K107k702J738p57o12J434j688J703j695
838f78p57L594l378K59K368l105J941J01j681J226p87J735j057j882L949k197
854c49k55K301l002J970Q23k414J931j168O22R51k618K238j456K36J871m004K317
871fJ888l959K128O2q01P07j107J809j723m24L599l193L89J984k293J953q56j102
889i45K606j874O22K50j419K681k316K55J538k997K369L1k646K742j068l57L98
906a30j018K094j846j56K750l496J497J650k757J686o45P01J120l156K536O94
922A524k073J230j078J744m58k919L813j130k583L036j249j08k51j16K045l178
938a751O19K742k925J654j113m12L000k711k6K019j301Q57j246J295R18l267K538
$$ plain form
955 890 1491 -969 977 -133 -189 1128 -1232 129 644 47 -144 -1835 1626 635 -3249 1350 1247
972 1247 -2146 -633 387 816 -1227 -1332 2418 -595 -1196 878 191 1087 -1212 -236 2456 -1149 -859
989 -859 1740 487 -521 -1174 1179 1448 -2856 107 1607 -1154 -360 -907 173 666 -1543 359 18
1006 18 -593 859 -484 520 142 -889 1856 329 -712 764 -42 1339 53 -1528 1561 600
1022 600 -325 -896 70 2710 -1469 -2332 2255 -500 -1396 551 -53 -489 -1760 818 1624 -2624 -324
1039 -324 1310 197 -16 -1705 1152 2096 -2023 436 1444 -100 -432 -132 2279 -669 -1609 2610
1055 2610 -404 -1637 1123 12 -215 -778 -826 916 -413 -226 -375 -1240 1946 -632 -1944 1158 -153
1072 -153 -55 337 60 1000 -771 170 1826 -385 -61 -8 505 1337 -1834 556 1977 -2070 -488 1124
$$ packed form
955H90O01k460J946j110n6J317k360J361N15n97j91j691L461r91l884M599j03
972A247l393J513J020M29k043j05L750l013o01K074o87Q96k299R76K692l605K90
989h59K599j253j008o53K353K69m304K963J500k761P94n47J080M93k209J902l41
1006A8o11J452j343J004l78j031K745j527j041J476q06J381j286j581L089r61
1022F00r25n71R66K640m179q63M587k755q96J947o04m36j271K578Q06m248K300
1039c24J634j113k13j689K857R44m119K459J008j544l32L00K411k948r40M219
1055B610l014j233K760j111k27n63m8J742j329J87j49q65L186k578j312L102j311
1072a53R8L92k77R40j771R41J656k211L24N3N13Q32l171K390J421m047J582J612
$$ plain form
1090 1124 312 -810 -1466 1784 -204 -2438 1233 132 -1292 196 -168 1368 -898 -1232 1848 -349
1106 -349 -382 890 178 591 -896 872 1523 -1838 273 1533 -1103 362 -13 -256 1 -548 872
1123 872 -856 -1023 1155 -1469 -187 502 -972 330 -243 -53 682 -965 418 626 -357 637 -438
1140 -438 748 741 -1337 1974 840 -1619 618 472 -106 -641 9 1132 -1613 -78 1871 -1604 -843
1157 -843 912 -298 393 -838 30 -59 -1018 949 23 -617 287 -239 925 358 -831 1526 -296 -549
1175 -549 1300 70 313 -113 334 1156 -1219 507 930 -1514 94 578 -496 -386 -901 584 -225
1192 -225 -868 779 -817 -456 793 -56 523 -485 -435 1701 -485 -130 1146 -426 95 133 651 468
1210 468 -1482 999 445 -1299 915 -187 -807 67 -286 644 -702 -851 832 -845 -142 366 -761
$$ packed form
1090A124q12j122o56L250j988k234L671j101j424J488l64J536k266l34L080k197
1106c49l3J272p12M13j487J768O51l361K111J260k636J465l75k43K57n49J420
1123H72j728j67K178k624J282O89j474J302n73J90P35j647J383K08r83R94j075
1140d38J186pk078L311j134k459K237j46n78n35O50J123k745J535J949l475P61
1157h43J755j210O91j231Q68q9r59J967r26o40R04n26J164n67j189K357j822k53
1175e49J849j230K43m26M47Q22k375J726M23k444J608M84j074J10n15J485q09
1192b25o43J647j596L61J249q49N79j008N0K136k186L55J276j572N21L8N18j83
1210D68j950K481n54j744K214j102o20Q74l53R30j346j49J683j677P03N08j127
$$ plain form
1227 -761 534 -764 305 1315 -854 31 955 -160 497 -513 504 247 -874 1540 81 -1323
1243 -1323 814 -291 -172 -111 -337 589 -1062 -220 961 -1014 -8 -148 -782 982 -194 -300 115
1260 115 -1085 1277 299 -495 475 -370 621 317 -436 1154 -430 -191 1263 -722 53 101 -459 309
1278 309 -753 314 476 -1372 411 67 -608 320 -560 -56 165 -435 1129 -524 -461 967 -192 692
1296 692 -294 -313 1379 -822 -173 1298 -735 295 -149 -107 489 -822 456 -303 -1063 1188 -483 -845
1314 -845 340 -606 300 -74 -953 473 -487 410 440 -638 406 -418 374 1039 -779 353 556 -483
1332 -483 413 -108 107 -79 -604 866 -244 -794 557 -866 -299 554 -591 0 -528 -598 585 -776
1350 -776 165 55 -341 631 -262 525 789 -837 623 479 -195 592 -202 479 354 -278 744 -326 -13
$$ packed form
1227g61J295j298J069J010k169Q85R24j115O57j010J017k57j121K414j459j404
1243a323K137j105J19O1k26R26j651Q42J181j975J006j40o34J764j176j06M15
1260A15j200K362r78p94R70q45R91l04p53J590j584K39J454j985P75M8n60P68
1278C09j062J067J62j848J783l44o75R28q80N04K21o00J564j653O3J428j159Q84
1296F92r86j9J692k201O49J471k033J030m44M2N96j311J278p59p60K251j671l62
1314h45J185r46R06l74q79J426r60Q97L0j078J044q24P92O65j818J132K03j039
1332d83Q96n21K15j86n25J470j110n50J351j423N67Q53j145N91n28p0J183j361
1350g76R41j10l96R72q93P87K64j626J460j44o74P87p94O81j25o32J022j070L13
$$ plain form
1369 -13 776 -993 275 267 -979 192 -120 -25 -60 -942 404 -174 -454 366 -456 472 221 -527 746 254
1389 254 -217 682 -163 544 -75 -289 639 -588 227 663 -778 226 -136 -525 354 -754 -98 -47 -445
1408 -445 348 -537 45 481 -651 278 12 -340 585 -478 236 520 -229 721 -23 -101 452 -535 789
1427 789 162 -586 538 187 -330 86 -487 533 -455 -704 620 -612 51 81 -669 809 -261 -449
1445 -449 711 -534 -152 245 43 564 -685 538 744 -896 451 304 -118 598 -488 359 298 -858
1463 -858 412 -1 -6 -50 -559 652 -374 -727 841 -181 -435 209 -301 622 -596 -407 700 -347
1481 -347 176 108 -333 901 -280 -296 851 -408 7 317 187 383 -499 426 65 -827 303 -304 -322
1500 -322 174 -746 229 378 -856 184 -11 -49 43 -671 760 123 -611 735 -189 142 357 -14 779
$$ packed form
1369a3P89j769J268qj246J171l12R5l5q82J346n78k80Q20q22R28k51p48J273m92
1389B54m71Q99q45P07o19k14R28j227Q15M36j441J004l62l89Q79j108O56N1l98
1408d45P93q85N82M36j132R29k66l52R25j063P14K84p49R50p44p8N53r87J324
1427G89o27p48J124l51n17M16n73J020r88k49J324j232O63L0p50J478j070j88
1445d49J160j245L82L97k02N21j249J223K06j640J347j47m22P16j086Q47o1j156
1463h58J270m13nm4n09J211j026l53J568j022k54O44n10R23j218J89J107j047
1481c47N23o8m41J234j181j6J147j259M15L10j30J96q82R25l61q92J130o07j8
1500c22M96r20R75J49j234J040j95l8R2p14J431o37p34J346r24L31K15l71P93
$$ plain form
1519 779 -165 -133 540 -273 -185 7 -371 575 -983 -279 677 -579 -102 -185 -239 245 -702 20 284 -661 374
1540 374 -249 -106 427 -589 476 196 -480 686 -172 92 366 -271 494 -28 -408 544 -339 296 32
1559 32 -732 333 -6 -388 39 -401 38 -351 -264 225 -696 -202 499 -413 67 191 252 510 -347 426 426
1580 426 -397 286 -429 71 329 -516 306 372 -398 353 -242 -164 -160 -579 430 -404 -642 348 -304 225 153
1601 153 -480 381 -61 89 340 -115 391 98 1 442 -146 32 172 -439 744 43 -227 545 -415 509
1621 509 137 -300 108 -553 -166 236 -596 198 -63 -460 442 -56 -33 -132 -72 390 0 -51 634 -339 287
1642 287 478 -155 467 -266 66 763 -301 47 -148 -293 435 -381 287 -49 -562 269 -4 -299 50 -476
1662 -476 127 -35 -309 909 -595 -230 614 -141 565 37 -259 327 -195 354 180 -280 288 -20 525
$$ packed form
1519G79r44L2O73q13Q8J92l78R46j558P04R56j256M77q3n4M84r47P22K64r45J035
1540C74o23J43N33j016J065k80o76J166q58K64K74o37P65n22l80R52q83O35k64
1559C2p64J065l39l82M27m40M39l89Q7M89r21M94P01r12M80J24O1K58q57P73%
1580D26q23O83p15N00K58q45Q22O6p70P51n95P8Mm19J009q34k38R90o52N29p2
1601A53o33Q61m42J50K51m55N06k93r7M41n88J78J40o11J183p01k70P72r60R24
1621E09l72m37M08o61L87M02q32P94k61l97R02m98K3r9O0M62l90n1O85r73O26
1642B87J91o33O22p33L32O97j064L48j95j45P28q16O68l36n13Q31k73k95L49n26
1662d76O03j62k74J218j504L65Q44p55P06n28k96N86n22N49j74m60N68l08N45
$$ plain form
1681 525 468 -758 -18 -214 -554 747 -333 -621 -202 -182 144 -241 -278 280 -697 235 530 -417 165 -257
1701 -257 167 333 -164 510 -71 -55 443 97 84 154 -554 426 -226 -348 509 -428 -202 103 -111 88 -649
1722 -649 -268 483 -184 278 -219 -584 634 56 350 301 -310 350 -3 214 380 -463 174 34 -103 608
1742 608 -233 -68 161 -464 75 -44 -461 53 -136 332 -153 -466 145 -105 41 879 -660 3 26 105
1762 105 517 -343 219 149 -266 679 82 29 331 -721 446 565 -431 149 24 -177 364 -463 -26 -459
1782 -459 -446 508 -256 -122 19 -432 350 116 -119 238 -478 65 21 128 382 -250 174 485 -143 321 155
1803 155 -207 410 -167 295 299 -449 358 -94 -191 156 -334 58 104 -569 448 -41 -441 87 -365 565 260
1824 260 -434 223 -337 183 516 -266 215 -52 76 637 -274 6 282 -244 520 -41 -202 154 -590 406
$$ packed form
1681E25n7j226P40j96l40J301j080k88M19K0L26l85l7N58r77R32K95r47N82m22
1701b57M24J66m97O74n81J6M98l46j3P0p08R80o52j22Q57r37K26L05k14J99p37
1722f49L81P51o67M62m97l65J218n78K94m9o11O60l53K17J66q43O37j40j37P11
1742F08q41J65K29o25N39j19m17N14j89M68m85l13O11k50J46Q38j539O63K3P9
1762A05M12q60N62p0m15R45n97n3L02j052J167J19r96N80j25k01N41q27M37m33
1782d59J3R54p64J34J41m51P82k34k35L57p16N43m4J07K54o32M24L11o28M64j66
1803A55l62O17n77M62Mp48Q07m52r7L47m90L92M6o73J017m89m00N28m52R30l05
1824B60o94O57n60N20L33p82M81k67J28N61r11K80K76n26P64n61j61L56p44R96
$$ plain form
1844 406 104 -415 107 -437 130 294 -209 19 -394 -250 448 -243 190 47 -318 344 -90 91 252 -408
1864 -408 705 184 -59 358 -434 233 137 -354 286 -368 -329 155 -406 241 -261 -253 449 -356 87 447 -351
1885 -351 240 -265 -121 246 -242 126 258 -148 520 -48 260 439 -336 501 -115 -407 47 -472 76 173
1905 173 -376 -25 -74 -96 127 -295 -143 -2 -295 623 -38 -124 48 -269 270 186 -19 541 -44 -79 129 -241
1927 -241 289 -78 -154 328 -338 -11 189 -400 262 -264 145 97 -388 70 -92 -251 259 -635 73 565 -166
1948 -166 56 -145 227 192 -266 262 208 -259 375 7 44 254 -318 562 -31 -214 269 -129 105 1 -170
1969 -170 375 -349 -80 323 14 -27 -82 -59 530 -332 9 160 -341 278 -197 -2 393 -272 134 259 -171
1990 -171 314 -275 48 226 -419 228 -10 -365 235 -155 -16 4 -250 360 -139 -585 363 -49 40 -298 96
$$ packed form
1844D06l02n19N22n44N67J64n03K28m13J44O98o91M33j43l65O62m34J81J61o60
1864d08J113n21k43M17p92O67r6m91O40o54L9M84n61O47n02QP02q05M43L60p98
1885c51N91n05J44L67m88L68J32m06O68n68L08J79p75Q37o16k92M54n19N48R7
1905A73n49L51m9k2K23m22J52J41k93R18o61q6J72l17N39q4k05N60n85l5K08l70
1927b41N30l67p6M82o66L27K00n89O62n26M09m8m85M58j62j59N10q94P08M92p31
1948a66K22k01L72l5m58N28n4m67O34l68L7K10n72Q80n93j83M83l98K34j04j71
1969a70N45p24K69M03l09m1n5K3N89q62L41J51n01O19m75J95L95o65M06J25m30
1990a71M85n89L23J78o45O47k38l55O00l90J39K0k54O10m99m46R48m12Q9l38L94
$$ plain form
2011 96 474 -235 25 574 -172 -15 -104 -45 472 -276 67 359 -308 271 -206 -133 234 -243 72 269 -548
2032 -548 306 -205 -170 238 -135 254 -178 -244 427 -520 88 151 -435 500 -83 -38 340 -154 244 27 -404
2053 -404 395 -99 -181 309 -251 331 -36 -218 220 -396 -129 258 -555 259 -226 -117 516 -639 -44 59
2073 59 -366 425 243 -6 240 -406 698 65 -170 483 -234 299 178 -201 158 -423 -227 244 -333 75
2093 75 -67 -289 177 -535 -153 132 -594 253 -13 -334 447 -408 37 321 -205 410 -226 175 638 -496
2113 -496 193 363 -154 128 -283 145 222 -325 226 -30 -359 -1 -105 144 53 -644 380 -131 -187 235 -194
2134 -194 32 -200 468 459 -276 150 243 2 113 -38 -103 193 -81 283 214 -364 224 -65 -338 336 -601 174
2156 174 86 -371 197 -484 31 116 -406 84 -86 -45 133 -326 365 -19 -152 402 70 -84 71 -109 417
$$ packed form
2011I6L78p09K60N49p46J57q9N9N17p48L43K92o67N79m77P3L67m77L15J97q17
2032e48Q54n11L5M08l73L89m32o6O71r47O08O3n86R35n83M5L78m94L98k17m31
2053d04P99m94q2M90n60N82l67j82M38o16K67L87q13Q14m85J09O33j155N95J03
2073E9m25P91j82k49K46o46J104o33k35O53p17N33j21l79L59n81J96M71n77M08
2093G5j42k22M66p12L82K85p26Q47k66l21P81q55M45K84n26O15o36M01M63j134
2113d96O89J70n17K82m11M28P7n47N51k56l29L58j04K49r1o97J024n11n6M22m29
2134a94K26k32O68rp35M26R3k41J11j51o5K96k74L64o9n78N88k89k73O74r37P75
2156A74q8m57N68o81N15Q5n22M90j70M1J78m59O91l84j33N54l32j54J55j80N26
$$ plain form
2177 417 -131 -260 368 -91 405 197 -496 223 -322 176 311 -214 -60 -118 -258 272 -46 39 23 -518 421
2198 421 46 -44 247 -108 121 338 -192 141 -190 290 492 -443 50 145 -81 140 -436 -59 -253 -358 225
2219 225 -186 -381 44 -162 289 -37 -180 629 -372 -94 590 -70 114 126 133 449 -235 40 139 -285 490
2240 490 -20 -51 369 -80 262 -93 -292 260 -294 -207 368 -223 377 -288 0 333 -208 23 422 -469 157
2261 157 -66 34 406 -249 241 90 0 648 112 14 -55 -188 366 162 -129 237 -287 6 288 -160 -87
2282 -87 -337 -15 194 -403 40 -20 -519 361 60 -43 -7 -88 239 18 -62 251 -123 351 116 -96 208 -428
2304 -428 35 426 -175 99 159 -215 245 9 55 -108 -265 272 -137 -466 94 -170 -136 26 -267 322 -162
2325 -162 4 314 6 -15 229 -300 57 -118 208 289 -268 396 -71 49 233 -130 50 -155 -597 613
$$ packed form
2177D17n48j29O28m59M96k08o93P19n45M98J35n25J54n8j40N30l18Q5j6n41R39
2198D21l75r0K91l55K29K17n30L33l31M80K02r35M93R5k26K21n76L77j94j05N83
2219B25m11j95M25k06M51l26j43Q09j001K78O84o60J84J2PL16o84K75R9m24P75
2240D90n10l1M20m49L42l55j99N52n54Q7N75n91O00o65K88L33n41K31L99q91O26
2261A57k23J00L72o55M90j51r0O48n36r8o9j33N54k04k91L66n24K93K82m48P3
2282h7k50L22K09n97M43o0m99Q80l01j03L6q1L27k21q0L13l74M74k35k12L04o36
2304d28M63L91o01K74O0l74M60k36M6j63j57N37m09l29N60k64L4J62k93N89m84
2325a62J66L10l08k1K44n29L57j75L26Q1n57O64m67J20J84l63J80k05m42J210
$$ plain form
2345 613 -112 -123 33 -369 140 141 -34 303 -287 -2 330 -315 252 -162 -68 219 21 341 58 -190 279
2366 279 63 89 187 -174 296 167 -189 127 -399 -47 161 -300 92 -74 -174 220 -278 84 117 -93 454
2387 454 -1 13 357 -407 -13 332 -25 384 -214 86 248 -118 -49 -231 210 -244 -149 -33 110 -341 352
2408 352 -77 -50 23 -301 358 -155 -293 6 -60 95 -77 -136 223 -352 -42 502 -163 319 240 -7 491 -220
2430 -220 181 275 58 158 -156 60 -2 -140 223 9 -86 232 -381 -167 222 -315 -1 -44 -184 247 -294
2451 -294 65 44 -203 372 -382 -197 262 -41 53 -9 -305 52 -223 19 15 -382 197 -121 -188 155 -200 61
2473 61 30 -147 -175 -233 95 213 -250 59 215 -303 204 54 192 168 -114 73 25 206 103 -191 401 41
2495 41 -421 37 -325 41 30 -125 17 -290 -255 207 -303 -316 47 -128 199 -146 -219 249 -64 306 121 -230
$$ packed form
2345F13p25j1J56m02N09Jj75L37n90K85L32o45N67m14R4K87j98L20k83k48M69
2366B79k16K6R8l61M70j29l56L16n26L52K08m61L92j66j00L94m98L62L3k10N47
2387D54m55J4L44p64L94L45l57M09n98L00J62l66O9j82M41m54R5J16J43m51O93
2408C52m29K7P3l24O59n13j38K99o6J55j72n9L59n75L10N44o65M82p9k47M98p11
2430b20M01R4k17J00l14K16o2j38L63k14r5L18o13K14L89n37L14m3j40M31n41
2451b94L59k1k47N75p54J85M59l03R4o2k96L57k75K42ml97N79l18o7L43l55K61
2473F1l1j77k8n8L28J18m63L09J56n18N07j50J38k4k82J87m8J81j03k94N92l60
2495D1m62M58l62L66j1j55J42l07L5M62n10j3L63j75L27l45p3M68l13L70j85l51
$$ plain form
2517 -230 468 254 87 357 -281 111 160 -338 281 -251 139 100 -191 21 42 -308 90 -116 242 49 -363
2538 -363 276 -100 102 304 -307 104 -31 133 243 -1 99 164 -15 218 -124 -119 78 -217 351 58 -275
2559 -275 -27 30 -154 367 -20 101 52 31 44 -334 98 104 -341 193 -88 -91 285 -343 73 -40 -51 62 21
2582 21 83 234 -91 385 155 -353 150 -63 -240 -47 -334 103 -192 -23 -9 -350 -75 -84 58 -41 -242 -231
2604 -231 331 -94 283 3 -166 112 -254 224 -78 -288 50 66 -108 113 -315 167 107 -147 54 -71 -126
2625 -126 123 -346 -23 99 -200 96 -210 110 27 -189 81 -65 42 190 -159 341 194 -21 259 -63
2645 -63 87 364 -80 224 -252 23 150 -166 49 205 -127 348 81 189 93 -349 -2 -275 -134 103 -330
2666 -330 286 108 -200 289 -163 -15 176 -337 229 163 -365 -3 -148 187 70 -200 149 -70 -212 144
$$ packed form
2517b30O98k14j67K70o38L92M9m98O19n32L90l9k91K12K1l50L98k06L58j93m12
2538c63O39l76K02K02o11M11j35J64J10k44J00O5j79K33l42NJ97k95N68k93l33
2559b75K48N7j84N21l87J21m9k1J3l78M32Om45N34k81lL76o28M16j13j1J13m1
2582B1O2J51l25M76k30n08N03k13j77J93k87M37k95J69J4l41K75rJ42r9k01J1
2604b31N62m25L77k80j69K78l66M78l02k10L38J6j74K21m28M82o0k54K01j25n5
2625a26K49m69L23J22k99K96l06L20q3k16K70j46J07J48l49N00j47k15K80l22
2645f3J50K77m44L04m76K75J27l16K15J56l32M75k67J08r6m42L47k73J41K37m33
2666c30O16j78l08M89m52J48J91n13N66o6n28L62j45L35j17k70L49k19j42L56
$$ plain form
2686 144 -126 -194 173 -322 83 -373 -83 -4 -181 261 239 -67 -156 -168 -44 147 -241 323 147 -45 170 -199
2708 -199 147 101 -274 230 -51 -136 137 -121 135 197 -29 15 -201 20 255 -11 20 -246 -298 -67 -85 120
2730 120 -57 -77 -18 32 154 139 -174 207 -14 -96 198 -294 203 35 -137 308 4 -70 -31 -124 -29 -100 -307
2753 -307 67 -179 5 102 -272 27 -127 -375 323 -80 20 -24 -126 190 -174 406 207 -79 -35 275 -245
2774 -245 96 -112 -170 193 -134 99 -407 -195 -91 -78 -161 -122 -247 -19 -88 -125 276 -70 12 146 -151 13
2796 13 -265 236 101 -260 118 133 -39 261 137 121 145 -148 282 -62 11 293 -187 -126 -130 -76 129 -253 -216
2819 -216 -76 -218 143 120 -111 102 -136 219 -132 -108 289 -59 -27 32 -25 -2 -194 111 309 -48 -153 -91
2841 -91 -75 122 -1 -259 124 -57 136 91 -69 94 -188 0 -89 -138 118 114 -27 246 -148 118 354 22
$$ packed form
2686A44k70o8L67m95M05m56K90P9j77M42k2l06q9j2J24J91l88N64j76j92K15l69
2708a99L46m6l75N04k81q5K73k58K56O2k26M4k16K21K35k66L1k66n2K31j8K05
2730A20j77k0N9N0J22j5l13L81k21q2K94m92M97j68j72M45l04p4L9r3R5p1k07
2753c07L74k46J84R7l74K99j54k48O98m03J00m4j02L16l64N80j99k86M4L10n20
2774b45L41k08n8L63l27K33n06K12J04J3q3L9j25K28o9l7M01l46Q2J34k97J64
2796A3k78N01j35l61L78J5j72L00j24j6K4k93M30l44P3K82m80O1mN4K05l82L7
2819b16J40j42L61k3k31K13k38L55l51K4L97l48L2N9n7K3j92L05J98l57j05O2
2841i1J6J97j23k58L83j81J93m5j60J63k82J88q9m9K56mj41K73l94K66K36l32
$$ plain form
2863 22 387 30 -76 146 -6 -36 -12 -69 382 -29 60 36 -114 -83 92 -219 62 -206 -62 243 -194 77
2885 77 92 115 217 69 -38 -87 -59 185 -135 290 15 -93 217 -47 -262 130 80 28 148 -178 78 -71
2907 -71 -130 156 -284 -78 -177 4 -51 -93 -180 245 -54 378 173 -139 -55 -357 205 52 -179 92 47 34 40 -285
2931 -285 221 121 -28 238 -230 -11 -102 -180 53 -9 -92 345 -118 -41 -71 -147 41 -177 -43 89 -152 203
2953 203 45 -132 -57 -63 144 92 -238 178 61 -68 188 -217 103 -15 -151 284 -235 -26 93 -210 -42
2974 -42 66 -88 108 -98 190 51 -43 160 -341 -130 163 -152 89 -85 50 17 161 -39 96 -77 71
2995 71 44 -228 406 -30 83 144 -165 346 -193 2 207 -261 235 -174 2 111 -198 121 52 -243 79
3016 79 78 -216 282 -210 89 -89 -229 441 -187 80 121 38 52 -61 -85 298 -379 91 113 -119 83 -25 -235
$$ packed form
2863B2L65l57j06K22j52l0K4n7M51m11Q9k4j50L1J75l11K81k68J44L05m37K71
2885G7J5K3J02j48j07m9K8K44l20M25k75j08L10k64k15L92n0n2J20l26K56j49
2907g1n9K86m40K06r9J81n5m2q7M25k99M32k05l12Q4l02N62j53k31K71m5j3Ol25
2931b85N06j00j49K66m68K19r1p8K33o2q3M37m63P7l0p6J88k18J34J32k41L55
2953B03j58j77P5oK07n2l30M16j17j29K56m05L20j18j36M35n19K09J19l03J68
2974d2J08j54J96k06K88j39r4K03n01K11K93l15K41j74J35l3J44k00J35j73J48
2995G1k7k72O34m36J13O1l09N11n39J95K05m68M96m09J76J09l09L19o9k95L22
3016G9jk94M98m92K99j78j40O70o28K67M1q3J4j13k4L83o77M70K2k32K02j08k10
$$ plain form
3039 -235 146 -187 -150 45 -409 163 164 -15 62 -247 75 -151 57 326 -151 57 -39 -267 182 28 3 143
3061 143 -274 101 -200 -86 238 -221 -222 471 -126 300 17 -274 32 -202 108 -35 -249 148 -95 202 124
3082 124 -80 257 -83 103 182 -254 -202 141 -83 -279 -32 -190 131 -161 -133 50 25 254 -338 -37 316
3103 316 -432 41 65 159 247 16 -32 -36 3 236 -175 -103 -73 -144 319 302 -285 305 -287 -145 -271 -42 -63 4
3127 4 -99 254 -282 51 -38 130 300 -185 17 192 -99 -2 -162 -66 188 30 25 26 -91 153 295 -16 214
3150 214 53 61 343 -84 -105 -115 -70 155 -158 55 6 -72 147 -36 -88 208 -249 -151 -232 -54 30 34 -103 142
3174 142 -281 195 217 -61 97 -193 32 -247 0 181 17 3 321 -116 11 -154 -291 48 -279 -74 -198
3195 -198 -151 353 -17 52 -47 -88 368 -167 -242 218 54 262 246 50 61 -191 -88 -128 -362 -37 80 -248 253
$$ packed form
3039b35L81l33L7J95m54N72Jj79P7l09L22k26K08K69m77K08r6k28M49j54k5J40
3061A43m17L75l01J14L24m59jO93n97M26k83k91L06k34L10j43k14L97k43K97p8
3082A24k04L37l40J86P9m36N2L43k24j96K47j58L21k92K8J83k5K29n92L01L53
3103C16p48M73K4R4Q8k31m8mL9K33m11P2L0p1M63j7n87N90n92J42j26K29k1O7
3127Dj03L53n36L33q9J68J70m85K02J75k91R7j60R6K54j58nJj17K44J42l11K30
3150B14j61QK82m27k1j0M5K25l13K13m9p8K19j83n2K96m57R8q1J78Q4Mj37K45
3174A42m23M76K2k78J58k90K25k79K47J81j64j4L18m37J27j65j37L39l27K05j24
3195a98M7N04l70O9r9m1M56n35p5M60j64K08j6j96J1k52J03m0k34L25J17l28N01
$$ plain form
3218 253 -65 122 179 -136 -43 31 38 -15 -291 -62 -64 -160 49 20 163 297 -43 34 -52 -103 128 -107 20 63 -261
3243 -261 140 -49 -114 108 78 -139 14 -309 63 -39 -98 -220 -244 -2 76 -235 175 -30 69 180 -115 129
3265 129 41 17 84 -18 128 54 30 57 109 88 301 -77 -37 -10 -59 144 -109 -71 73 -176 -197 53 -104 170
3289 170 -88 -47 45 -272 167 167 -98 414 34 -141 47 -157 97 91 11 -93 94 193 -202 126 6 -172 -85
3312 -85 141 -83 139 -169 86 197 -107 -139 69 41 353 -115 1 83 65 290 -41 -78 -160 -52 -51 321 -118
3335 -118 -159 -75 165 180 -91 66 175 20 169 -130 -41 -1 -29 82 -398 140 175 -303 195 -28 -147 235
3357 235 7 40 115 -262 138 206 72 457 -160 260 166 -313 90 -11 -119 49 -186 48 7 -90 131 -467
3379 -467 -273 8 -255 58 46 -150 -47 -45 9 309 91 583 237 -247 144 -254 -137 -331 36 217 -199
$$ packed form
3218B53l18J87N7l15R3P4Pn3k76K29kr6K09k9J43J34l40P7q6n1K31k35J27M3l24
3243b61M01j89o5K22l0k17J53l23L72j02n9j22k4K42P8l11M10k05R9J11k95K44
3265A29q8k4O7j02J46p4k4K7N2k1K13l78M0K7m9K03k53L8J44k49k1K50j57K74
3289A70k58M1R2l17M39%k65N12l80j75J88k04K54oq0j04J87R9l95L28j20j78Q7
3312h5K26k24K22l08K55J11l04l2K08k8L12m68J16Q2j8K25l31l7q2J08JL72m39
3335a18m1Q4K40J5k71J57J09j55J49k99Q9M0k8J11m80N38L5m78M98k23j19L82
3357B35k28L3P5l77M00O8j34L85o17M20r4m79M03j01j08J68k35K34m1r7K21n98
3379d67J94K81k63L13j2j96J03KN4L00k18M92l46m84L91l98J17j94L67J81m16
$$ plain form
3400 -199 -3 137 -370 36 -146 -79 32 18 206 -141 -202 59 -115 -121 42 -50 34 -102 -200 200 -50 235 39
$$ packed form
3400a99J96J40n07M06j82O7J11j4J88l47o1K61j74oJ63r2Q4j36r8M00k50K85j96
$$ [...]
8191a60
##END NTUPLES=NMR FID
##END=
