##TITLE=1H_Pr 53-Agr
 CDCl3
 8 sc, 
 25.10.2022
##JCAMPDX= 6.0         $$ Bruker NMR JCAMP-DX V2.0
##DATA TYPE= NMR FID
##DATA CLASS= NTUPLES
##ORIGIN= UXNMR, Bruker Analytische Messtechnik GmbH
##OWNER= root
$$ XWIN-NMR		Version 3.5
$$ Tue Oct 25 15:34:06 2022 Russian Standard Time (UT+4h)  she@DPX200
##.OBSERVE FREQUENCY= 200.1313499994
##.OBSERVE NUCLEUS= ^1H
##.DELAY= (6, 6)
##.ACQUISITION MODE= SIMULTANEOUS
##.ACQUISITION SCHEME= undefined
##.AVERAGES= 8
##.DIGITISER RES= 18
##SPECTROMETER/DATA SYSTEM= spect
##.PULSE SEQUENCE= zg30
##.SOLVENT NAME= CDCl3
##.SHIFT REFERENCE= (INTERNAL, CDCl3, 0, 15.7039)
##AUDIT TRAIL= $$ (NUMBER, WHEN, WHO, WHERE, WHAT)
$$ ##TITLE= Audit trail, XWIN-NMR		Version 3.5
$$ ##JCAMPDX= 5.01
$$ ##ORIGIN= Bruker BioSpin GmbH
$$ ##OWNER= she
$$ F:/spectra/data/she/nmr/H-F/1/audita.txt
$$ ##AUDIT TRAIL=  $$ (NUMBER, WHEN, WHO, WHERE, WHAT)
(   1,<2022-10-25 15:32:52.01 +0400>,<she>,<DPX200>,
      <created by zg, POWCHK disabled, PULCHK disabled
       configuration hash MD5:
       00 E9 B6 7A A2 85 ED C7 34 08 36 98 17 FE 4E 26
       data hash MD5: 16K
       50 91 08 36 EE D1 F3 1E CC 69 B9 41 33 06 F4 FA>)
$$ ##END=
$$ 
$$ hash MD5
$$ D3 97 DE F0 64 F7 A9 35 F4 E0 E2 87 BB 57 5E 8B
##$RELAX= 
##$RELAX= 
##$RELAX= 
##$RELAX= 
##$RELAX= 
##$RELAX= 
$$ Bruker specific parameters
$$ --------------------------
##$DU= <F:/spectra>
##$EXPNO= 1
##$NAME= <H-F>
##$PROCNO= 1
##$TYPE= <nmr>
##$USER= <she>
##$AMP= (0..31)
100 100 100 100 100 100 100 100 100 100 100 100 100 100 100 100 100 100 
100 100 100 100 100 100 100 100 100 100 100 100 100 100 
##$AQSEQ= 0
##$AQ_mod= 1
##$AUNM= <au_zg>
##$AUTOPOS= <>
##$BF1= 200.13
##$BF2= 200.13
##$BF3= 200.13
##$BF4= 200.13
##$BF5= 200.13
##$BF6= 200.13
##$BF7= 200.13
##$BF8= 200.13
##$BYTORDA= 1
##$CFDGTYP= 0
##$CFRGTYP= 5
##$CHEMSTR= <none>
##$CNST= (0..31)
1 1 145 1 1 1 1 1 1 1 1 1 1 1 1 1 1 1 1 1 1 1 1 1 1 1 1 1 1 1 1 1 
##$CPDPRG= <>
##$CPDPRG1= <>
##$CPDPRG2= <>
##$CPDPRG3= <>
##$CPDPRG4= <mlev>
##$CPDPRG5= <mlev>
##$CPDPRG6= <mlev>
##$CPDPRG7= <mlev>
##$CPDPRG8= <mlev>
##$CPDPRGB= <>
##$CPDPRGT= <>
##$D= (0..31)
0 1.2 0 0 0 0 0 0 0 0.06 0 0.03 0 0 0 0 0.0002 0 0 0 0 0 0 0 0 0 0 0 0 
0 0 0 
##$DATE= 1666697571
##$DBL= (0..7)
120 120 120 120 120 120 120 120 
##$DBP= (0..7)
150 150 150 150 150 150 150 150 
##$DBP07= 0
##$DBPNAM0= <>
##$DBPNAM1= <>
##$DBPNAM2= <>
##$DBPNAM3= <>
##$DBPNAM4= <>
##$DBPNAM5= <>
##$DBPNAM6= <>
##$DBPNAM7= <>
##$DBPOAL= (0..7)
0.5 0.5 0.5 0.5 0.5 0.5 0.5 0.5 
##$DBPOFFS= (0..7)
0 0 0 0 0 0 0 0 
##$DE= 6
##$DECBNUC= <off>
##$DECIM= 32
##$DECNUC= <off>
##$DECSTAT= 4
##$DIGMOD= 1
##$DIGTYP= 9
##$DL= (0..7)
0 120 120 120 120 120 120 120 
##$DP= (0..7)
150 150 150 150 150 150 150 150 
##$DP07= 0
##$DPNAME0= <>
##$DPNAME1= <>
##$DPNAME2= <>
##$DPNAME3= <>
##$DPNAME4= <>
##$DPNAME5= <>
##$DPNAME6= <>
##$DPNAME7= <>
##$DPOAL= (0..7)
0.5 0.5 0.5 0.5 0.5 0.5 0.5 0.5 
##$DPOFFS= (0..7)
0 0 0 0 0 0 0 0 
##$DQDMODE= 0
##$DR= 18
##$DS= 0
##$DSLIST= <SSSSSSSSSSSSSSS>
$$ [...]
##$SUBNAM2= <"">
##$SUBNAM3= <"">
##$SUBNAM4= <"">
##$SUBNAM5= <"">
##$SUBNAM6= <"">
##$SUBNAM7= <"">
##$SUBNAM8= <"">
##$SUBNAM9= <"">
##$SW= 18.0517283424941
##$SWIBOX= (0..15)
0 0 2 0 0 0 0 0 0 0 0 0 0 0 0 0 
##$SW_h= 3612.71676300578
##$TD= 16384
##$TD0= 1
##$TE= 0
##$TE2= 300
##$TE3= 300
##$TEG= 300
##$TL= (0..7)
0 120 120 120 120 120 120 120 
##$TP= (0..7)
150 150 150 150 150 150 150 150 
##$TP07= 0
##$TPNAME0= <>
##$TPNAME1= <>
##$TPNAME2= <>
##$TPNAME3= <>
##$TPNAME4= <>
##$TPNAME5= <>
##$TPNAME6= <>
##$TPNAME7= <>
##$TPOAL= (0..7)
0.5 0.5 0.5 0.5 0.5 0.5 0.5 0.5 
##$TPOFFS= (0..7)
0 0 0 0 0 0 0 0 
##$TUNHIN= 0
##$TUNHOUT= 0
##$TUNXOUT= 0
##$USERA1= <user>
##$USERA2= <user>
##$USERA3= <user>
##$USERA4= <user>
##$USERA5= <user>
##$V9= 5
##$VALIST= <valist>
##$VCLIST= <CCCCCCCCCCCCCCC>
##$VD= 0
##$VDLIST= <DDDDDDDDDDDDDDD>
##$VPLIST= <PPPPPPPPPPPPPPP>
##$VTLIST= <TTTTTTTTTTTTTTT>
##$WBST= 1024
##$WBSW= 4
##$XGAIN= (0..3)
0 0 0 0 
##$XL= 0
##$YL= 0
##$YMAX_a= 326801
##$YMIN_a= -435361
##$ZGOPTNS= <>
##$ZL1= 120
##$ZL2= 120
##$ZL3= 120
##$ZL4= 120
##$ABSF1= 10
##$ABSF2= 0
##$ABSG= 5
##$ABSL= 3
##$ALPHA= 0
##$AQORDER= 0
##$ASSFAC= 0
##$ASSFACI= 0
##$ASSFACX= 0
##$ASSWID= 0
##$AUNMP= <proc_1d>
##$AZFE= 0.1
##$AZFW= 0.1
##$BCFW= 1
##$BC_mod= 2
##$BYTORDP= 1
##$COROFFS= 0
##$CY= 11.3945322036743
##$DATMOD= 1
##$DC= 2
##$DFILT= <>
##$DTYPP= 0
##$F1P= 2.36226072786647
##$F2P= -0.459571619588291
##$FCOR= 0.5
##$FTSIZE= 0
##$FT_mod= 4
##$GAMMA= 1
##$GB= 0.15
##$INTBC= 1
##$INTSCL= 1
##$ISEN= 128
##$LB= 0.24
##$LEV0= 0
##$LPBIN= 0
##$MAXI= 10000
##$MC2= 0
##$MEAN= 0
##$ME_mod= 0
##$MI= 1.114404
##$NCOEF= 0
##$NC_proc= 0
##$NLEV= 6
##$NOISF1= 3.799351
##$NOISF2= 2.8
##$NSP= 1
##$NTH_PI= 0
##$NZP= 0
##$OFFSET= 15.70392
##$PC= 1
##$PHC0= -18036.48
##$PHC1= 14.8007
##$PH_mod= 1
##$PKNL= yes
##$PPARMOD= 0
##$PSCAL= 0
##$PSIGN= 0
##$REVERSE= no
##$SF= 200.130013532006
##$SI= 16384
##$SIGF1= 3
##$SIGF2= 2
##$SINO= 400
##$SIOLD= 16384
##$SREGLST= <1H.CDCl3>
##$SSB= 0
##$STSI= 0
##$STSR= 0
##$SW_p= 3612.71676300578
##$SYMM= 0
##$S_DEV= 0
##$TDeff= 0
##$TDoff= 0
##$TI= <>
##$TILT= no
##$TM1= 0
##$TM2= 0
##$TOPLEV= 0
##$USERP1= <user>
##$USERP2= <user>
##$USERP3= <user>
##$USERP4= <user>
##$USERP5= <user>
##$WDW= 1
##$XDIM= 8192
##$YMAX_p= 0
##$YMIN_p= 0
$$ End of Bruker specific parameters
$$ ---------------------------------
##NTUPLES= NMR FID
##VAR_NAME=  TIME,          FID/REAL,        FID/IMAG
##SYMBOL=    X,             R,               I
##VAR_TYPE=  INDEPENDENT,   DEPENDENT,       DEPENDENT
##VAR_FORM=  AFFN,          ASDF,            ASDF
##VAR_DIM=   8192,          8192,            8192
##UNITS=     SECONDS,       ARBITRARY UNITS, ARBITRARY UNITS
##FACTOR=    0.0002768,     1,               1
##FIRST=     0,             0,               0
##LAST=      2.2672688,     0,               0
##MIN=       0,             -435361,         0
##MAX=       2.2672688,     326801,          0
$$ Real data points
##PAGE= N=1
##DATA TABLE= (X++(R..R)), XYDATA
0@%%%%%%%%%%qJ6j6J6k4L2m0N1n9P2q8J04j27J51j76K08k40K80l28L76m28M88
32B60n56O31p14Q06r06J017j140J271j415J574j749J940k146K373k620K892l188
49a670L510l867M261m694N176n715O318p002P781q680R734j0984J2495j4370J6765
64I058j9947K4406l1150M2668o7489K16041k41631l33791M99891J76666k67003
75G719j58847J41496o70L5727Q2755j08229j95288J43894K32658j02396k48757
86a69938M4975K13261L9374j76218p6407J02175J16049l4947r3590k4060M1547
97a7779O4382L3675q4716j00963Q5626J38568q0362j21346O2221O9500o6576R968
109g802P7987r9380r0339J63253R4880j98421q7571K01644O3468j75654k3589
$$ y = [0, 0, 0, 0, 0, 0, 0, 0, 0, 0, 0, -8, 8, -8, 8, -16, 16, -24, 27, -32, 40, -48, 56, -71, 80, -96, 112, -128, 152, -176, 200, -228, 260, -296, 335, -379, 427, -479, 538, -602, 669, -746, 828, -921, 1019, -1127, 1246, -1374, 1518, -1670, 1840, -2027, 2234, -2460, 2716, -2999, 3319, -3683, 4098, -4582, 5152, -5832, 6663, -7707, 9058, -10889, 13517, -17633, 25035, -42454, 173587, -68044, -401835, 98056, 274722, 7719, -151128, -9632, -10302, 25425, 108180, -49, -195337, -51443, 181215, 78819, -169938, -124963, 88298, 127672, -48546, -124953, -22778, 93271, 58324, -35266, -59326, -17779, 46603, 80278, -4438, -105401, -19775, 118793, 38431, -82915, -20694, 48806, -17770, -7802, 70185, -29195, -119534, 43719, 138599, -59822, -147393, 54251, 117719, -57935, -81524]
120h1524J44129k8255r7573P9215M8087j20157j3248J57094k115j78041J8J76838
132H4468J9000j56407m3615J14378O2578o8847o4187K6423L6981O630K471k2065
144b192m1175K4040P5211k1681r6991K1345J02763k8406r0481M0369O5413m7046
156A169l2997M9841m491m7040M6105L2511q0833j1461R7970j3878r9763L8307
168b4560R1209n6507p5246P0183N8193p3587m1020O0001K6614l9603j1914K2622
180F385o856j2271K9247J2081m9481k2252O0057L7349o6803n4029O8665N7803
192E9895o4597m6786N6793K9862m4532o329K9952j9627j3059M4849n776o1906
204d1261K5661O9231l6291o5195M0736N2432m2829l3200M0559N638l7087J6142
$$ y = [-81524, 62605, 34350, -63223, 15992, 64079, -56078, -69326, 87768, 85653, -92388, -92370, 84468, 103468, -52939, -96554, 17824, 80402, 11555, -52632, -26209, 10772, 17402, 19873, -2192, -43367, -19327, 55884, 34203, -62788, -41443, 61320, 32914, -57567, -17198, 48215, 1169, -31828, 18013, 13522, -33518, 12587, 45098, -35735, -47196, 50774, 36896, -62867, -24560, 66649, 10142, -65104, 5079, 63272, -10315, -51335, 8666, 35280, -4323, -16237, 6385, -471, -12742, 16505, 28586, -20895, -43147, 16910, 54259, -12544, -66573, 2092, 59895, -4702, -51488, 5305, 35167, -9365, -15694, 14258, -5369, -18428, 26421, 20645, -41261, -15600, 53631, 17340, -47855, -7119, 45313, 2484, -30716, 9843, 15481, -21606, -5464]
216e464K8977l0037k0920L4218J3464l3298m379K8504n791k1545J2435J7242j2681
229G25j5058J3885K0706j4489k4126J8331K7350k0844k9622K2463K7004k7205
241h80j7824K7946j382k4011K1703J5864m1955r735N4625J092o1210P690N5530
254B7453j4657l7749K0381J6964j8314M876J6344j9933j2512L1654Q860l5352
266a1985m943L2077N214k2864j0673J3644J4822q565j8119J632J5041n66j2330
279g615J872M228o401Q311R663k0288p728L0239L961l3500J444L4474p102k8807
293a7249J6509J9390k0884m136K1428q021j9720J5948J3570k2451r102K3989P5
306I346k1702P482J4060j1438p301R981K034r064P54O421k504q02L156j815J981
$$ y = [-5464, 23513, -6524, -27444, 6774, 20238, -13060, -17439, 11065, 5274, -16271, -3836, 13406, 725, -14333, -448, 20258, 5769, -18357, -26, 27324, 6480, -23142, -679, 26325, -880, -18704, 9242, 7860, -16151, 5552, 21416, -20539, -30274, 24351, 25443, -35767, -28077, 27453, 12796, -24953, -4572, 12392, -5922, -1046, 15298, -4635, -17147, 14507, 23367, -11985, -16928, 15149, 20363, -2501, -13174, 470, 15292, 6727, -11392, -9760, 5281, 4715, -7615, -5743, -1515, -7916, 395, 10058, -10230, -17958, 12281, 16242, -17258, -15814, 18660, 11558, -17249, -740, 18650, -2234, -6370, 15058, 7037, -12683, 3265, 16835, -5616, -14718, 9271, 9346, -12356, -4874, 9186, -2252, -9553, 428, 2462, -6602, -5848, 573, -1931, -2733, 423, -1392, 589]
321E89M269m860p95O302l694m329P542J099j2068M240J5361j1875j4940J8927
335E768P878k2667r94J9236p512j4820J3287O864j7885M131J9325j4139j4247
348a5775K1098P234k1266m76J7011l368r493O413J908o127Q018L428j3396J046
362c745J1656m069p797K711M46q09O360k197j2624O333J5129j0567j2766J1949
376A0M742r876L874N844j1175j062J7513j732j9279N750J5650p591o414O463m104
391a387m133J2558K592j7786j509J9634M10j5859R66N567j686M470R18j3138k116
406a0499J7328M110j6804m964J1322M754n11m581j2118M336K1319l728k3650J496
420a2190K2043Q78j3636j07J029j032J2516J859k2850l157K4773O506k0724q793
$$ y = [589, 4858, -2, -797, 5505, 1811, -2518, 5024, 6123, -5945, -1705, 13656, 1781, -13159, 5768, 13646, -9021, -10015, 9221, 1709, -13111, 176, 7040, -10845, -6714, 12611, -1528, -15775, 5323, 12557, -8709, -9185, 7826, 4458, -5035, 1378, 3286, -2841, 5177, 8605, -4791, -3745, 7911, 3842, -3955, -1244, -798, -1607, 4753, 2556, -10068, -3735, 11394, 827, -11939, 10, 4752, -5124, -1250, 4594, -6581, -7643, 9870, 8138, -11141, -5391, 10259, 2668, -3746, 2717, -1387, -5520, 7038, 9630, -8156, -9665, 9969, 10379, -5480, -4514, 1053, -633, 3837, 4755, -8383, -10499, 6829, 10939, -5865, -10829, 493, 5247, 4736, 155, -11963, -7627, 13692, 9964, -13686, -12190, 9853, 10731, -2905, -3012, -1983, -3015, 9501, 11360, -11490, -14647, 10126, 16632, -4092, -12885]
434a2885J1856Q687J437q177j5880O305K4123n837k5435L766J9105o92p678P33
448e72n761k414J8844N561k6943q405K5617J2869j5828j4955K761J6571J0088
461A7433j2816k0076P695K2394n309j5908J931J809j643J3538L216k5561q170
474b1467L2072J3280l2496j6689K4011J7296j0252j5070l845J1794J4981l807
486I808j7853l405J4696Q322m402p620j2200M130K6853L490l5846j2590L6167
499I550J9543l0190k3601J8586J9144o350j2551m791N004J0565J339p858o177
512g787J503P867R405n340k1397P84L4164L665m0281o047M0064R662l2539j0280
526a6557K0161N317p653J309l672r215P568J3419m132j4556n464J3228J5176r472
$$ y = [-12885, -1029, 7658, 9095, 918, -14962, -8657, 15466, 9629, -15806, -12040, 7065, 6373, -1305, -572, -6333, -8747, 10097, 15658, -11285, -19690, 5927, 18796, 2968, -11987, -9226, 7345, 17433, 4617, -15459, -7764, 14630, 9321, -6587, -4656, -2847, -4490, 9048, 12264, -13297, -21467, 10605, 23885, -8611, -25300, -1289, 16007, 5755, -9315, -13160, -1366, 13615, 9808, -8045, -11450, 3246, 11568, 7166, -454, -12654, -8524, 18329, 21819, -14027, -26617, 9550, 29093, -1097, -24698, -6112, 13032, 6682, -5869, -10660, -5656, 4909, 6248, -1610, -7787, -6284, 1583, 10988, 5648, -15749, -14965, 19199, 22864, -17417, -23464, 16600, 26262, -6277, -16557, 3604, 8921, 1268, 2577, -1095, -10310, -2742, 10677, 6545, -8011, -13475, -247, 14929, 5457]
540E457k4015L419K9895K58l0846N95K7164q23j7390K528P345l694K550P058j0162
555f61j1111J1516J4044n769j4651o101J3616J8396j1248k8514N720L1345k995
568A3587k9496L329K1973p124j1808J2097M115j4781J372J6189m108j5623O102
581d176J4413n639j1701K505J2176K887j3116p391J3283R662j3024j0449J1063
594D93P410j1965j788J2760m446j2009P055R353o803o090M694J533l384L189K908
609B910m448j68K474k138N238L731j1607n654J5416O174j6462l909J5860k043
623E374j3180Q859R599j2510p583J1051N081q883k961M688L28r40Q53j290J994
638D80J657o383J12R724j525j0152K552P617l896j903Q422m195j1447R046J1578
$$ y = [5457, -18558, -15139, 14756, 15014, -15832, -15237, 11927, 11104, -6286, -3758, 3587, -107, 2443, 9501, -661, -11772, -256, 13788, 8019, -6632, -12733, 883, 19279, 8031, -20483, -14763, 16582, 13587, -15909, -12580, 9393, 2269, -9539, 2558, 6673, -8108, -6736, 9453, 5345, -10278, -4176, 10237, 4598, -7103, -4598, 7578, 10465, -2651, -10042, 3241, 12903, -121, -10570, 493, 7903, -4062, -5850, 6910, 2464, -9545, -2490, 6863, 60, -6030, -1336, 197, -3187, 2, 2910, -1538, -1706, 768, -1370, 3868, 7599, -4008, -9662, 5754, 11928, -4534, -8443, 7417, 5374, -7806, 1053, 10652, -1858, -9441, 1610, 6691, -2192, -5153, -465, -137, -1077, -224, -1514, 480, 2137, -4246, -4134, 5590, 4065, -6087, -3535, 4082, 186, -1717, 6705, 2510, -8937, 109, 11687]
653A1687r064r861N105N442j648j43j638n143M629P640p586o562Q740K640q596
668d358q54O687l50l045K650k353l521Q582N368j1168o169R240O134m277m950
683b384n11J943N330J676p495k792P568K09o410K814L020n512j443N661m55m788
699c569L764K232p255J531Q603m334o710M234L612l716Q54M156l698k886O152
714B970J059n327K353J880n459J042O117j995n565J927L298k684J255K008n795
729b916j782O925l12o137K528K547l635P89N258k633m551M540J965m842K502L797
745D043n855j274P254n8o055J961M267m287j495M654j873m327L446R26m639K105
761a207M450m143m426M950L725m856j095K104j853J353M307l513l632M538L491
$$ y = [11687, 2623, -7238, -2133, 3309, 1661, 1518, -120, -5263, -634, 7006, -580, -7142, 1598, 4238, -4358, -5212, 1475, 1125, -1920, 730, -1623, -5144, 3438, 8806, -2362, -8531, 709, 6843, 2566, -2384, -2895, -952, 4378, 6054, -1441, -4233, 3335, 3544, -2866, -52, 2968, -2544, -3987, 1674, 1219, -3569, 195, 2427, -4828, -3297, 5306, 972, -5738, -1504, 2108, -1608, -754, 3402, -296, -3182, 2970, 4029, -1298, 1055, 2935, -2524, -1482, 4635, 2640, -2925, -998, 2300, -384, 871, 2879, -2916, -4698, 2227, 1915, -4222, -1694, 853, -2782, -1993, 3265, 632, -3919, 621, 2586, -2256, 246, 4043, -1812, -3086, 4168, 4110, -1945, 16, 4283, -4, -1499, 3155, 1282, -3045, 401, 1327, -3312, -1207, 3243, -900, -5326, -376, 3349, -1507, -2602, -498, -2351, -998, 3309, -204, -3836, 702, 4193]
776D193l477j885L744j105k395K809J42m206K934K402m240j200M859K53n152K10
792b114L329k390j031L187k900k689N491J496m835K32M554j624l238L795N86m203
808b354K404L138l811j20M517j900l898L329K392m393p31L417k381k373M366r62
824F40m015K851K430l678j35L601k446l765M899K047n847Q68N559k534k536M193
840B132K24m075K244L346m163k756O148k05n446K172K708k121n06J581j632k195
856b544L008J326m475l57L939q16j173N99p29O25K368o36l294M63M295j202k999
873a602K268O86j923K846J209m776m77N331l41n923M28M450j990j729K767j867
889f43k082M323J271n507j375N210L73m290J395J736k487K072L549l748l130M490
$$ y = [4193, 716, -1169, 2575, 1470, -925, 1884, 2026, -2180, 754, 3156, -1084, -2284, 2575, 2828, -2324, -2114, 1215, -1175, -2206, 981, -1919, -4608, 883, 2379, -2456, -2224, 2330, 706, -2532, 1263, 1849, -2354, 50, 3188, -623, -743, 3774, 1874, -2024, 1305, 3697, -696, -1427, 1990, -391, -2764, 1602, 640, -3375, -524, 1906, -1772, -1907, 1694, -752, -4517, 382, 2429, -3418, -2550, 3009, 475, -2061, 2132, 2356, -1719, 525, 3871, -292, -3048, 3100, 2895, -2551, -379, 2329, 208, -298, 1283, -349, -2544, 464, 1790, -2685, -3042, 897, 81, -1092, -493, -1222, -597, 1771, 1135, -2159, -1696, 2599, 1397, -1602, 666, 1352, -571, 2275, 3484, -1292, -1769, 3562, 3221, -2702, -2274, 2176, 186, -1543, 1224, -643, -2725, 1598, 2869, -2638, -4013, 1197, 1570, -2720, -1325, 411, -2076, -4, 3545, -203, -3333, 1157]
905A157L074l838k771K260K106j55j589j928J505L606k428k784K523L09l345J789
921e09L347m978l362P505K661r098p06Q961j123o870K434M152l064j264L231m42
937H75k827K939J581k298p2R46r97R36J008k553k229L614K587m744k175M788J077
954B456l658j050J811J209j976j222K094J285k504j093L892K441o126j824Q598
969D333J015j0193P47R840j642r271L379Q792n883o447P526L659q354k179P440
984B762O84o825p42N521M34l614k51J573J744j325k537J984K444k835j872L916
1000A061K302m413k155N603J604m074j328K182J041j40k471r33L272O72m157J17
1016a817N098k107o762N351O399r138n667J1499L988j2246k286J2154J637j1123
$$ y = [1157, 4231, 393, -2378, -118, 1988, 1833, 244, -1684, -179, 3427, 999, -1785, 738, 1047, -2298, -509, 2838, -2140, -5502, 2003, 4664, -4434, -5140, 3821, 2698, -4172, -1738, 2414, -650, -1914, 1317, 875, -1952, 987, 2568, 270, 198, 1144, 147, 1083, 2091, -462, -2691, 923, 3510, -1234, -3409, 1379, 2456, -1202, -2252, -441, 768, -1208, -2430, -336, 949, -1555, -2648, 1244, 3685, -2441, -4265, 4333, 5348, -4845, -4098, 5742, 4100, -5171, -1792, 7000, 1117, -5330, 2196, 5855, -2499, -4678, 2762, 3446, -3379, -4121, 1400, 1834, -1780, -2031, -458, 1286, -39, -2576, -592, 1852, -983, -2855, 1061, 3363, -1050, -3205, 2398, 4002, -72, -1400, 782, 1823, 1683, -788, -1721, 1551, 2223, -1934, -1817, 3281, 1174, -5588, -237, 6162, -2976, -8643, 2856, 6844, -5402, -7688, 4466, 6103, -5020]
1030e020J070R036l096n321L124L854l577l521N208L466m921m101M156N190m129
1045A418o205L430N442m041l941L865J827l266n19L080j394k241K669R12l052
1060b016Q29J712j323R40J735k793j503N570K141q167j779R443J90q783J015O800
1076D011k799m621M490L096o638j986P417Q13p824o58O244J244n590j205N657
1091A651J267m603j078M306P78m388M31M749l274l484O085K757p249j851P485
1106C582J041o613LM092k558j200M469k385m891L829M399m114k947M069L25m029
1122b928J735L485l368k042L944J168l326L13L867p50l971P13L780j17l508j186
1138b191L275J090k611MK684k800k285M189K627o652k352O620J091o275J576N188
$$ y = [-5020, -3950, 5086, 1990, -3331, -207, 3647, 70, -3451, 1757, 5223, 302, -3799, 357, 5547, 1418, -4787, -1357, 4085, 44, -3897, -32, 1795, -1471, -1990, 1090, -304, -2545, 124, 1036, -2016, -1187, 525, -798, 142, 1877, -916, -2419, 3151, 5292, -2875, -4654, 4789, 4979, -3804, -2789, 4011, 1212, -3409, 1081, 4177, -2461, -4447, 2970, 3783, -4041, -4699, 1545, 2789, -2801, -4006, 1651, 2918, -1685, -2763, 1543, 2321, -2067, -1636, 3113, -161, -3645, 2440, 5197, -2052, -3903, 3582, 4623, -1990, -1987, 2105, -453, -1653, 2816, 431, -4460, -631, 3768, -346, -3293, 776, 1101, -2928, -1193, 2292, -1076, -3118, 826, 1994, -1332, -1019, 2848, 2098, -1873, -1160, 2620, 2503, -1005, -2191, 1084, 2174, -437, -433, 2251, -549, -2834, 1355, 3982, -2670, -5022, 1598, 2689, -3586, -2010, 3178]
1154C178m032l344N869K084o235p34O028j485m417M146K589n174r64N274R19m444
1170g42k23K669j242j510K129N7k668QK071R78j533j653Q47J231j355j67J669
1187E66k50l010P33M631j245l767K489J868l213K59M557k226n159L401N055m093
1203E96l269M516K73m451K162L797l687l969L699K700l735q98L485j204k642K138
1219d89K279j239k670P57K080j36j319R23M97j018l70K640J271m193r43L757N38
1236B365l699P44K425k286k037M350Q49m939j88M390j455l335K810J366l688p35
1252c063M822n5m199J500L179k385j080L160j71l495N41L534q02k494Q03J320
1268A115p07j9N78m40j162p01J623M87j463j098J103J447j399o76K869j093l425
$$ y = [3178, -854, -4198, 1671, 3755, -2480, -3214, 2814, 1329, -3088, 1058, 3647, -1527, -2491, 2783, 3702, -742, -965, 1704, 462, -1048, 1081, 1138, -1530, -1522, 549, 1527, -6, -1659, -812, 419, -936, -1103, 566, 316, -2694, -1961, 2670, 1425, -2342, 147, 2015, -1198, -939, 3618, 1392, -3767, -366, 4689, 596, -2673, 1843, 2116, -2335, -173, 3624, -63, -4032, -333, 2367, -1368, -2266, 1219, 15, -2627, -489, 1790, 551, -2119, -1362, 718, 582, -737, 186, 683, -335, -705, 1935, 3206, -987, -1930, 1827, 2365, -1334, -590, 1835, -451, -2488, 1862, 2711, -2228, -2416, 1974, 519, -2816, -6, 1360, -2328, -3063, 1759, 1704, -2495, -995, 2184, -201, -1281, 1879, 1708, -1787, -1246, 2288, 1486, -1008, -205, 1115, 408, 389, 967, 527, -635, -1336, 287, 774, -689, -1787, -684, 763, -636, -1312, 1557, 464, -2961]
1285b961K183L147k582k249L000P11k781J258L595k534l451L992J778l651m44
1300i89K301p96j836J758J659k733p01J849j66q96L47k87n63k25N62P74k98l19
1318e59k20R60Q38j069k13R94p73n01J753M01k413L04K401o51k407J526J593k803
1336h39q24L268r04l079J397K285j647j602K662L36k728M23K360j366r66J332
1352A08k7p12O20J153m73r93R63L00o40L88m09o32Q10K00p10J36J82m61l08P89
1372B84j40j450J009O86j855M72J826j214j253J754J369k215n06K240m39j778
1388a210J237J128j404j36J213l45n78J154l36j351Q93O14j480j50J406j036j026
1405a407J819M04j624l41J697l33j457P31P62q20L62M96q33O87R48q74l78J094
$$ y = [-2961, -778, 2369, -213, -2462, 538, 1249, -1532, -274, 3321, 787, -2664, 1328, 3106, -545, -989, 1312, 516, -1320, 438, 2097, -636, -1337, 512, 346, -550, -203, -490, -1053, -1278, -716, 58, -240, -559, -779, 181, 1019, -50, -263, 731, -42, -543, 1210, 1611, -802, -498, 1903, 1252, -1155, 371, 1964, -839, -1663, 1605, 701, -2378, -981, 1304, -343, -1945, 717, 1053, -1675, -1252, 1108, -258, -1224, 108, 81, -631, -11, 1142, 669, -324, 639, 939, 299, 687, 278, -354, 456, 656, -54, 82, 264, -197, -505, 284, 144, -1306, -297, 389, -1466, -994, 832, -382, -1635, 119, 1488, -727, -1233, 1007, 568, -1210, 27, 1155, -249, -385, 828, 483, -95, 1059, 723, -628, 265, 879, -601, -751, 655, -381, -1407, 412, 816, -808, -1149, 548, 215, -1242, -511, 251, -569, -207, 289, -544, 143, 1091, 217, -161, 933]
1423I33J25j594P02J790k266q14K302N33k397P1J769l52j856N15J148j143k87
1440h21K51j92N54q0n66N97J071r87j101J679P26k266n39L325J6l366J032K986
1458B319j446j555J204J368j747q98J350j07j001j0L10Q61k13j422J18J697o76
1475A52k040Q36K266j208k069J662J482j334p05J815J89j149j8P96L6n65m41M90
1493A95J199k61k015M11K574j314k784J611K314k483j794K681J017l022PK798
1509A134n37k011L30K131l86k069O37J848l59j102m21J799P22j921k11J863J67
1526A614k116k59J746n08k022J117J752j598j091J195P99j006p91O57O13n46k61
1543g05j6M01J030r83o65J905L16k060M77J714m51k141J196J987j723j465K022
$$ y = [933, 1058, -536, 166, 1956, -310, -1124, 1178, 1711, -686, -615, 1154, 802, -1054, -539, 609, -534, -821, -570, -762, -208, -288, -854, -257, 814, -173, -1274, 405, 1131, -1135, -1674, 1651, 1667, -1699, -667, 2319, 873, -682, 522, 1890, 143, -755, 595, 488, -513, -523, -213, 648, 435, -987, -869, 828, 152, -1888, -1052, 1214, 6, -2063, -401, 1081, -253, -958, 857, 1046, -103, -121, 675, 711, 146, -295, 195, 1394, 1133, -882, -471, 2103, 789, -1995, -384, 1930, -553, -2347, 334, 1351, -1671, -1664, 1134, 597, -1414, -1084, 1047, 661, -1408, -771, 1077, 718, -384, -805, 994, 1716, -205, -416, 1447, 1614, -502, -761, 985, 477, -1545, -428, 1324, -274, -1365, -170, 629, -377, -1168, -511, 102, -444, -705, -721, -320, 710, -273, -938, 967, 1283, -777, -300, 1414, 963, -1178, 18, 2005, 282, -1183, 839]
1560H39R39j823p63J212q4p83q35J130K34k03o93M73J248j339j014J809P59k217
1578a111k87K509l25j837Q37K168j509j221J973oj471L54Q57j009l48R97k42q85
1596e56O91K74j124O20O77j162q69J303K55j064K01R18O3o77N39L84m29j40p6
1615a72N35K46m97n83J162K12j068J33J210m10j752Q78J199j538p12J553J72j541
1633i73L01J453p76j516J268J155j431l46J094l57m60M93Q17n79n45Q60J43J33
1651G34m79K5l11L52n6q7M4m61J58J07N42n44n60L74J13r74P84M40j325J56J297
1672C29J81j313P08P87j376k68K033l35j821R54J385j218l56J266J10j845N22
1689b57J568j031j366J116L37m43o3L63k77p31O33M89l48l15l94L3Q00j14m30
$$ y = [839, 1778, -45, -808, 404, 320, -463, -1298, -168, 66, -137, -830, -357, 891, -448, -1462, 347, 1106, -1111, -1398, 1111, 786, -1051, -214, 1954, 445, -776, 1197, 1191, -280, 74, 931, -78, -426, 571, 329, -556, 135, 409, -715, -95, 582, -580, -1449, -146, 109, -955, -754, 164, 227, -450, 89, 473, 44, -96, -172, 363, 609, 112, -471, 691, 903, -165, -32, 1178, 768, -984, -106, 1093, -445, -1157, 396, 568, -973, -672, 781, 5, -1511, -243, 912, -519, -865, 229, -128, -588, -95, 722, 143, -402, 458, 601, 734, 255, 280, -31, 321, 265, 178, 222, -239, -81, 26, 568, 24, -536, -162, -49, -1023, -239, 201, -1124, -968, 329, 510, -803, -95, 692, -684, -952, 1081, 746, -1075, -121, 1264, 46, -310, 956, 1066, -779, -257, 1311, 280, -1086, 30, 367, -76, -139, 224, -53, -784, -151, 338, -10, -325, -719, -686, 114, 0, -430]
1708d30O28q3p10J067R17p78j075N20R66r56N8P93j062n56R87J113j722m00J272
1727E49p79o80J156K92j596o2J195R5p01Q5N17n24R0R73k01r02K62J82M86K34
1747F71k82j64J07J99P2N6l94o45j81R14J76j048J95P00r13J43J140l60j858M70
1767a002J560q45q03J271K34r77M28J264n87p65K5R02m64Q5M24r26j64P36M66
1786H62l40k93l67n4mN32l25r37L33L23j27M46l6o51K09L61l5K02j71p4l58Q05
1808C01N04r77l54J234l55l61P43L84j557L4J040J82j270J10P03p07Q9M45r1q63
1828g66j59O86K63l53L6k40K86M75j04k42M59l88J58K56L30o30m51M51P20p58
1848B9O53q7o86j1P70m84n39K67qn70J8J138p00r57J225L66j120J80R20m81j059
$$ y = [-430, 198, 115, -595, 472, 1389, 611, -464, 56, 1022, 66, 124, 917, -145, -701, 286, 1399, -323, -723, 549, -230, -910, 246, 538, -1058, -1120, 75, 170, -531, -446, 71, -453, -363, 610, 409, -493, -231, -49, 437, 671, 389, 225, 332, 531, 603, 659, 265, -380, -561, 353, 529, -519, -324, 376, -537, -394, 746, 386, -1472, -1002, 558, -287, -1090, 181, 415, -562, -134, 1130, 543, -222, -197, 705, 241, 326, 750, -176, -340, 396, 862, 522, 229, -138, -192, -196, 336, 11, -926, -593, -270, -397, 49, 13, -638, -429, -68, -103, 99, -72, -146, -504, 301, 805, -172, -526, 708, 353, -8, 735, 1119, -438, -404, 636, 818, -452, -342, 361, -346, -257, 188, 97, -766, -925, -239, 24, -329, -293, -533, -247, 228, 124, -118, 341, -47, 111, 367, 697, 67, -384, 67, 787, 29, 682, 595, -91, -102, 668, 184, -355, -88, -96, -666, -648, 490, -210, -1167, 58, 424, -696, -516, 404, -77, -1136]
1869a136R96R14o66l27N51J66k8n0j01k48J45j35J55q3J32l73j13N24q7l81l7
1890a82J9l58K9L35k48k74J73J81p2O96Q9o58l1J210m62j001L90Q30p73m38J225
1911F80J78j339M77J021p02q29L02N09l93l35J33M08l54K5k60K71K57l00q89J172
1931C2J63q51K39P94L7r01N83Q15o40l73M82K16n39mM2R5q4j66MJ53L48m61n20
1954e36P26j40j025L29Q52l42j011Q58R12r31o21J214J52o29n7K97M91m18j10
1973A1J19N84k85l81K58M83k50r41N51M31r12l25J103o2r23l38R84M9o90O9M51
1994a4o4l74L2N25K11n17j49P90M25j135k1J066L2j253J26J116k26j053M85R02
2014I04q95k76N32Kr69J13M49l62K00j14J08M1L66l19j53L10M88n69m85R81J27
$$ y = [-1136, -140, 774, 108, -219, 332, 498, 470, 420, 319, 71, 216, 81, 236, 153, 285, -88, -201, 323, 236, -145, -182, -163, -521, -492, -157, -405, -679, -506, -325, -397, 299, 388, -270, -301, 909, 447, -554, -164, 666, -107, -545, 680, 858, -481, -4, 1017, 315, -514, -212, 297, -96, -431, -298, 110, -244, -219, -479, -208, 49, -251, -1140, 32, 195, -656, -417, 377, 414, -487, 96, 911, 271, -102, 380, 596, 57, 53, 95, 190, 106, -60, -56, 97, 445, -16, -536, 190, 50, -975, -646, 206, -136, -1147, -289, 623, -308, -929, 285, 437, -192, -249, 48, 539, 121, 11, 130, 714, 429, 48, 306, 789, 539, -402, 149, 580, -332, -657, 446, 384, -539, -877, 107, 156, -534, -465, -14, -78, -452, -420, 105, 316, -201, -350, 440, 865, -270, -291, 775, 807, -446, -320, 796, 570, -483, 2, 904, 9, -267, 265, 267, -702, -589, -140, -502, -302, -416, -308, -267, 99, -220, -373, -63, 425, -144, -629, 352, 479]
2035D79q91N69K70l06m83Q49N29q41m41M44K78l20l60m7Q67p12m65M96O52r40
2055c73l88O29O04j345P1J233j84q32Q07P15n53q98P70L83r02K02N21k47j02J74
2075B85N9k10K18p1j31j81j37J11j99K85o2l67J79J12r1J95n60N08M24n39o04
2096g76N21P09n18l83Q25N05r91j3J054l45j070K50J118r48p78R53Q03j197m08
2115f89J115K8j172M73O49m90o30P43L3m45kN10J58l15M2j1L27m43K07K02k05
2136H5K0J80J11l35K6M79k86o82K35O33r25k88P20L52j081K20R02l98q23R66N51
2157F62j208j23Q37K44j123M53J137n23n71O22L42k30o45L15O19j061J85M68l60
2176D0k16M3J55J86m49N4J55l23l87M00K02k79R7M69o3m84N13M76m53n57R34R8
$$ y = [479, -412, 157, 427, 121, -362, 487, 1016, 175, -266, 178, 456, 136, -224, -271, 596, -116, -581, -85, 567, -373, -761, -132, 472, -873, -802, 431, 247, -585, 222, 937, 384, -514, 256, 639, -263, -61, 460, 213, 111, 285, 344, 134, 352, 281, 150, -31, -168, -57, -256, 29, -33, -400, -221, -109, -200, -5, -565, -57, 367, -172, -776, -255, 454, -64, -447, 378, 883, -108, -121, 933, 588, -482, -232, 886, -62, -840, 113, 916, -281, -689, 426, 454, -718, -245, 404, -86, -716, 27, 60, -385, -387, 123, 281, -34, 8, -3, 324, -119, 88, 290, 85, 105, 285, 396, 61, 87, 566, 280, -402, -167, 466, -459, -747, -27, 325, -756, -536, 366, -32, -855, 111, 662, -546, -669, 168, 412, -711, -258, 879, 356, -215, 407, 749, 519, -126, 189, 808, -253, -68, 400, 40, -176, -133, 22, 208, -241, -187, -32, -355, -742, -342, -140, -419, -322, 147, 84, -400, 113, 589, 136, -421, 513, 611]
2198F11j049M07Q60l73j189J057P37j103k15Q77j99j092M62M23m45n39M84M58
2216A72o25m4N64O3p64OO72P4m22R8N14j26j31J76m2j91k80Q86or59K30O05l60
2239A10m43N86K76n74n25J068j88j229M09O35l42n40Q09K51q44K79Q11j62q89
2258e02N78K74m70j11P59pm92j35P58O2p33K57j50p1j32m2K63k84k66M54N02o07
2280i5n92M61Q2m17K39N51m90o19P44P56p74ON14o4o79N54O15p17n20O39N50o33
2302A11P3K33n2p43M15O41r97l61M99J50l07KK5K41j03j43M59J8o43L51L37q9
2324A17k07K15J57n13L11M11r1n88J51P24o65m58R47k82q82L33Q15l37p64M82
2344a24N06o14p1M69j41n39Q4M17O1k45L02K67j99j70L44k5m67n5K65N08k61p07
$$ y = [611, -438, -31, 829, 456, -733, 324, 1061, -42, -257, 620, 421, -671, -209, 214, -231, -770, -286, 172, -453, -497, 67, 130, -634, -628, 44, 118, -304, -206, 308, 182, 51, 227, 185, -6, -286, 600, 594, -365, -135, 470, 110, -333, 253, 529, -45, -570, 498, 310, -919, -510, 125, -217, -757, 52, 303, -541, -262, 549, 387, -502, 76, 350, -120, -231, 528, 521, 29, -106, 652, 714, -19, 238, 88, 17, -115, -157, 106, -178, -444, 10, 512, -95, -687, -226, -144, -561, -322, 229, -261, -880, -136, 620, -154, -148, 366, 302, -377, 177, 792, 75, -445, 194, 744, 111, 184, 417, 365, -378, 37, 678, -319, -680, -181, -31, -338, -336, -311, -70, -173, -316, 143, 161, -482, -131, 206, 117, -90, 125, 282, -231, 80, 491, 400, -188, -37, 687, 22, -436, 511, 229, -653, -320, 495, 158, -606, -124, 382, -232, -303, 166, 25, -514, -430, -13, 48, -197, 105, 372, 173, 3, 347, 322, -145, -200, 65, 573, 312, -395]
2366c95N31j6o9J01k87l1m95N04L83n20k43M34l87K79M68J8n81j13P32r7n81K82
2388h3L21l97l90J087L18r86mM75L02o37K55j4k90l62L86K53k44m25K36P56r1
2409D66p95J14J40K3m92O22j18k37j12N42oj6J68o7j60o6M24l34p4J92j09p7J12
2432A40K11l71l37P75r6o32n0M54k23o01Q69K55k92o06N79nk64n5J23K05r6j92
2454b09L62K11N6n20M05R3q6n48J25M62p15j11N65K57o13L53k0j31k07n3K33K8
2476f3l12L3K55O7K3n02L68N44m07o0J76J80j76j07K51J71m66J41K83l19l10R7
2498a33K60p6k88P0J60k06N5k45L15R1k70j44M23o3l96R8M37o5k48M45K31l08
2520A43m4L17j34o3Pk14J34J56k56l38M69k73Ok10N38n70O5JL11l46l53M17J15
$$ y = [-395, 136, 120, 51, 152, -135, -166, -661, -157, 226, -294, -537, -103, -490, -211, 257, 275, -306, -419, 313, 216, -365, -83, 238, -159, -549, 538, 856, -130, -134, 341, 643, 6, 261, 247, -43, -405, -19, 234, -10, -435, -199, 557, 466, -329, -215, -75, -52, -544, 78, -40, -277, -389, 153, 147, 131, 299, 232, 72, 6, 430, 96, 22, 214, 105, 28, 140, 351, -20, -357, 418, 322, -310, -360, 94, -129, -730, 139, 394, 102, -504, 75, 70, -194, -249, -126, 79, -17, -209, 153, 364, 420, -100, 305, 398, 312, -236, -111, 351, -364, -475, 90, 347, -266, 87, 67, -64, -271, -324, -91, -63, -375, -342, -87, -20, 3, -499, -131, 413, 6, -54, 122, 302, 126, 19, 270, 441, -25, 116, 399, 80, -230, -133, 127, 51, -237, -167, -7, -213, -158, -403, -88, 3, -267, -411, 12, -51, -447, -349, 88, 23, -225, 220, 451, 143, 99, 416, 282, 219, 226, 12, 146, 302, 46, -292, 177, -96, -90, -300, 238, -332, -267, -266, 45, -301, -654, -237, -122]
2543a22o4p3M31k26j96J66K98j50J20r2J00j57K16%k23J34p1j79L2K89m11O9n8
2566a67L58m59J57j89J46l7j08J86J71k3l80K16M8J08m97N55M56n31k3L27K58
2587E72p62o2O73j43m22M44K8l57j27K33K08m28J51l89L2J1N8K43j94J48j78J47
2609a14K00k9j14o2K11J55o2p0j35J39J47K1Q5k82O3j24Q1L62l85p27N00L06j49
2632A7j33K55j63m43J74N00k58m39M01K34m15rK26L24l30L6L02j19p1j34J09O5
2654A29M7JK66n23N6N13m89r8k88L54j82j54m2L64jl84P79n76j06J32K23j68j22
2677b69N46l8n55K31L25j40k16M82J5l59l23O18Ro18J16K37J14l0k32R0K07n68
2699c58K74K97l14J0Q0j12J65k84N83p1r1j03M27m50k60M61n8j50JJ68j84l53
$$ y = [-122, -186, -259, 172, -54, -250, -84, 214, 64, 184, 92, 192, 35, 251, 251, 28, 162, 91, -88, -56, 233, -178, -109, -167, 191, -268, -111, -300, -154, -191, -299, -113, 58, 35, -345, -129, -81, 27, -470, 85, 541, 10, -13, 314, 572, -190, -252, 421, 278, -144, 300, 328, -29, -156, 77, 285, -143, 8, -381, -349, -338, -280, -37, -231, -83, -261, -114, 86, 57, -57, -119, 92, 247, 185, 115, -20, 119, 266, 287, 372, 90, 153, 29, 110, 472, 87, -640, -140, 166, 17, -116, 139, -24, -467, -293, 207, -51, -490, -89, 145, -270, -279, -53, 271, -59, -23, 279, 160, 89, -45, 64, 129, 176, 177, 443, -80, -24, 489, 0, -98, -386, -32, -214, -368, -410, -46, -47, -431, 348, -228, -334, -202, 21, -147, -269, 277, 239, -316, -85, 240, 100, -116, 366, 381, 22, -301, 317, 326, -292, -176, 61, 175, 145, -87, 3, 210, -358, -84, 213, -101, -91, -11, -123, 42, -242, 341, 270, 179, 76, 503, 53, -207, 254, 196, 46, 47, 215, 31, -322]
2721c22O77J33k61k37J24L20p44P4J13K36n23J27M73k93l01M95J4l79J79J29o
2742B8m35K51M87J24n53J57L23j30n60O59P2o03K96K9j87o8m0K38K6l85K83Q3
2764I5o42J01L27K4k90L29K42l71k1P31k83m54J17K90Q4n17M08J49j67k24K17
2785A45l9q9j52M72k37l62n9J78L2r3j9K58m5l68N45R8m77j89L58M8p5L2K99m40
2809a79q3L59K38m72J05L93lk53J39j15j75j60M82j08k88q3K93o1k57K80j10k66
2831c24l00O17M7j85K6J67J62l34J02K86l90j83K42N57k42n3j63J65j67q8K21
2852A63o2k35K66M0m42P4K39p8j51J20L56l09k81J4N07m62K89K34n98J44K98L44
2874D70k31k13J40K62k56l49L43q6j55J45L59l40k12M4l1j42o6K02O6j45n1O7
$$ y = [-322, 355, 488, 227, -10, 114, 434, -310, -236, -123, 113, -410, -283, 190, -103, -404, 91, 105, -274, -95, 34, 28, -407, -156, 331, 455, -98, 59, 382, 252, -308, 351, 423, -180, 116, 145, -42, -110, -150, 88, 114, -271, 12, 95, -547, -446, -119, -95, -385, -56, 186, -185, -206, 525, 242, -212, -95, 195, 279, -238, 170, 319, 152, -72, 145, 106, 17, -135, 337, 100, -262, -321, -143, -111, -204, -223, 35, -10, -378, 167, 265, -212, -401, -43, 5, -70, -38, 261, -179, -262, 97, 335, -137, -32, 361, 358, 105, 244, 129, -46, -206, 276, 168, -120, -203, 90, 29, -228, 52, -58, -324, -624, -7, 40, -145, -119, 48, 210, -124, -22, 264, -126, -309, -67, 490, 248, 195, 32, 197, 30, -58, 163, 101, -134, 132, 172, -270, -196, 43, -35, -186, -66, 290, -19, -300, -286, 221, -241, 48, 282, -316, -172, 126, 470, 239, 26, 166, 428, 172, -177, 166, 80, -75, 70, 429, 89, -123, -79, -110, -252, -318, -116, -50, -195, -246, -179]
2896a79K90p7l98L70K98l77r4J99l01K27K35K6j16lL7J48m7J51m08j20J60K75
2918B96m80j8K85K64m69k8K22ll51r6M25m4k40r4K95M9j94m3N17j70l40K64N71
2941F18o77P9J53p0l05M21K8j70j19J69Q0j68l02J60r4NK97m29J55J47l0j3p2
2964a37M4K26n13K36K69K26m90K16M4j04j3K86j25j25j86J80M0rk22J36J82o1
2986A00k26J0J84k47l31K82L03k92j26J90J62p6k3J26o6J11k42J79J53Lk85J9
3008i2K77N9k85R3J36n2j53K78o3q8k33K34k22j06j2J34J37J0k48J37J48r0k99
3031c00QM13Ql05L5N77q9r7k71J47j32J00L08m00pQ8Q3l10m0J46n8M2L35m56n7
3056b32K25p2m4J2K74k21N8p7N1j99L01K67k44o7rL33k62k14J60J11K06l86o8
$$ y = [-179, 111, 34, -364, 6, 304, -73, -167, 32, -269, -42, 193, 219, 103, 100, 137, 285, 238, 389, -19, -139, 21, 296, -184, -202, 83, 347, -122, -150, 72, 69, -282, -378, 47, 3, -237, -331, -36, 13, -181, -224, 293, 123, -217, 47, 618, -59, 20, 173, 103, -202, 219, 247, 77, -42, 127, 207, 39, -263, -103, -197, -192, 105, -324, -169, -22, -52, -65, -137, -93, 133, -380, -144, 125, 351, -139, 77, 121, 17, 4, 290, 165, 40, -146, 34, 74, 65, -157, -21, 161, 100, -126, -116, 68, -179, -510, -228, 75, -217, -343, -153, 9, -67, -90, 36, -30, 81, -161, 18, 171, 174, -111, -92, 185, 244, -41, 52, 188, 136, -17, 261, 198, 110, -123, 111, -111, -217, -229, -95, 42, 52, -196, -59, 89, -1, -300, -292, 121, 129, -176, -141, 436, 347, 250, -21, 126, -6, 94, 402, 2, -5, 83, 166, -144, -184, -38, -96, -54, 281, -175, -232, -7, -79, -123, -111, 163, -58, 0, -77, -26, -225, 76, 343, 99, 32, 23, 356, 94, -120, 40, 151, 357, -29, -97]
3079i7M2J41j17k90J10M36n18N3J18J69l37J79R3m3j57J73M3J24j94lJ06J06j93
3102e6q8L45Q5k83J00R1j12j95P3K63j84k48L26ok13R8J37L3l13o9K47k01Q7J
3126h2LL01k92m7J37n4O1O7J28Jm0Jj6r6J81%k68J14o0j51L07m01j06K02J80k79
3152b09J46J5k69N29l02j03K09j01K47k3L4N8k73J76j4j86o5J09q9N4k8J18J60
3175A93j85l8j0K72k84k60K50Kj63N3K77l62M2J70K02j70j76L39J73l25j31P3
3197e8K38p5j20L7p0J94l7l7m55L03L42m22%M14l86jj09M57Pl00o9K83k04k76
3221c44K06K22k12m6P4N1J61k1J31j27j24mK07j31j78J60J52k51k01N35j43k17
3243a00K2K17l36K36o6l00K52j55M22n0m15L53M9k43l0K77k00P0PK46j20q4J12
$$ y = [-97, -55, 86, -31, -321, -211, 225, -293, -240, -122, 47, -290, -111, -18, -61, -218, -45, -2, 122, -72, -75, 31, 137, -56, -144, 201, 286, 3, 103, 194, 82, -113, -40, 223, 39, -209, 117, 111, -102, -4, 133, 166, -147, -216, 31, -170, -83, -82, -79, 222, -70, -117, 20, -34, 27, 94, 222, 223, 183, 184, 168, 72, 253, 253, -15, 99, 39, -112, 195, -206, -312, -110, 70, -209, -63, -48, -317, 212, -90, -193, 16, -85, 162, 139, 173, 231, -42, 134, 120, -66, -131, -22, -111, -57, -85, 33, 193, 8, -30, -40, 232, -52, -312, -62, -60, -223, -170, 107, -255, -213, -43, 159, -11, -187, 152, 325, 0, -131, -58, 180, 105, -15, 22, -48, 146, 109, 72, -383, -80, 262, -160, -160, 254, -132, -133, -242, 215, 222, -78, -147, 136, -68, -344, -138, 84, -128, -174, -100, -49, 112, 91, 222, 95, -29, -33, 174, 43, -135, 25, 177, -74, -275, 260, 117, -100, -78, 139, -197, 39, -27, -327, -75, -230, 192, 142, -273, 80, 129, -114, -144, 133, -67, 3, 10, 256, 136, 52, 164]
3266A64K3k59r8L69o7k47J20Q2K45m45P4J06j94J27K33j78m6l57K29O9j17K29
3288F2j96J21j8J16j32j09J37J34r1l88N91j15j37j12J62K4J19j38Q2j64r1l3
3310a76K6J09o9RJ18j76J90r1J07k48P5Q3J14k5K00j36K61k36jj03QMJ00j34Q7
3335I6j59J01Nk02j5M13k19k65L41j28p7j43K84j5j08J21J09k23K39j68L00l27
3357d0L3R0j25L8m8J06N5j87J09K17k45j94N45m62N7j90K30K1L4k91M62k19j08
3380a12k57J83J12j57L02k23j04L94j19p2P8J64k33J12j72K66j09k03K26j98K8
3401i4J57k8p0o2q9L1J23j77J69Om03M40q3M2J89l22K62N5k51L43j26k30M1J24
3425D7J08Q5l37K35r5J57p4K46l22P3j2Nk83J05K00k53K64q9j41l1j90K04K42
$$ y = [164, 187, -72, -170, 199, 132, -115, 5, 87, 332, -113, -39, 67, -127, 0, 233, 55, 9, -348, -119, -50, -167, 62, -134, -13, -31, 85, -47, -156, -19, 115, 24, -364, 227, 112, -25, -137, 25, 49, 168, 30, 112, -52, -143, -176, -150, -41, -110, -101, 17, -159, 31, -60, 47, -201, -126, -43, 71, 46, 246, 110, 371, 135, 134, 31, 39, 43, 143, 9, 96, -63, 38, 43, -159, -174, 239, 20, -245, 96, -32, -109, -252, 32, 17, -91, 30, 139, -84, 155, -13, 287, -40, -7, 83, -42, -4, -52, 54, 109, -78, 31, 248, 3, -191, 354, -108, -51, -241, -11, 10, 44, -247, 215, -4, -112, -369, -186, -74, -231, 71, -152, -256, 138, 19, -53, 25, 189, -44, 68, -104, 162, 53, -150, 76, -122, -94, 63, 35, -35, -97, -186, -155, -32, -209, -40, -34, -437, 3, -80, -38, 151, -171, 91, 146, -105, 238, 112, -118, -77, 47, 155, 240, -97, 138, 43, 200, 126, 372, 50, 123, 111, 116, -167, -62, 138, -115, 149, 60, -81, -112, -302, -98, 144]
3448A44n41J74L13M0n6j60J33O9n8j10L14l01J87J15j4m88J52N7L05m41RK06n8
3471ij53K5J89j24j53J80J24j52j23K08O7k68L1J73M5l21J42R3k49N51j4j46l0
3494H6r8J0l9j13N2K07k28K67m17M05k5j67J89j46J13O8m9l24J44R8o1j23L22
3517A71j07l8M4J41k67J02l00L67M4j97M0Q2o7J96k69k1KJ16j03N4k78K66N2k63
3541b33J78J26L6k00J99k14QK31k95J44j00J81j13oJ51q1J47j72l28L52p4K22
3563A59k04r0L11k81M1j30L26m70L32JO4j40J27j51K41j65Q1m7j27K09QP8p6Q5
3587A82k06J68q9p7k15L01p5M0j72m5j9k1L95k73Ok04M57j96j42Q0J75j07K37
3610B00j71k22O3K0M03Mn41K92J1N6j72L10m06M8L44l28O5m6J3J09l9p7K7M3k48
$$ y = [144, -397, -223, 90, 130, 74, -86, 47, 116, 58, -52, 262, -39, 148, 263, 249, -239, -87, -30, 275, -166, -157, 49, -9, -162, -137, 52, -72, -225, -45, 79, -73, -196, 12, 79, -189, -158, 15, 60, -261, -119, -26, -275, 276, 262, 116, 86, -12, -2, -41, -154, -102, 105, -123, 144, -273, 132, 107, -60, 129, -17, 96, 164, 115, -209, -65, 33, -28, -151, 171, 64, 26, 70, 211, -56, 46, -254, 113, 157, -40, 0, 82, 15, 211, -58, -79, -77, 39, -64, -10, -288, -22, 30, -233, -55, 71, 107, -93, 106, -108, -100, 131, -164, -20, -120, 61, -52, -58, 93, 12, 159, -13, -341, 11, -63, 159, -45, -135, 176, -105, -64, -194, 132, -338, -6, -5, 59, -81, 46, -105, 136, -29, 52, 5, -122, 87, 95, 173, 97, 182, -24, 144, 55, -22, -237, 64, -11, 29, -143, -188, -207, -228, 167, -106, -100, -304, 153, -43, -185, -105, 70, -37, 200, 29, -193, -130, -110, 293, 297, -244, 48, 59, 115, -57, 253, -153, -105, 239, -89, -24, -70, -57, 52, 13, -64, -37, 6, -242]
3635b42K73j14K82j59k2mj86q3M00j73J20L4J67j75P7l24m7L22o0j00N2K7j97
3658a32L51k59j5K42l03L7J43m55M77k75J34J9n5Q8k92K17Q3J18M3l5m1L2Q1r5
3682A08J55j18K81n41R9N2j20L27l14J96j61r9J51J87o2r8k14q0J42p2K38j34
3704g7K97j28k90L74j16j00J14Pm1k62K99j12l2J51p7J52m91K99K5j27N5K36l06
3727a50J80j36j3K04K2P4j57m9k35L21l38L87N8o9q4M4K13k61j05L24o3p3J1q6
3751A9N5Kj08K25j44K24k70J33K8j52K0j41J28q2l6L1J08p0q3J09j96j3K95o2
3775B0K6oQm0J74k74J71lj75J29k21K39Q1q3j9L8n5o8r0J73l99K78P3j20P9K06
3801A42k84r1L45k25J14k48K89p8M4L2J48j67o3J14J81j49J06k73o6J09K14L9
$$ y = [-242, 31, -83, 199, 40, 18, 14, -172, -255, 145, -28, 92, 126, 293, 118, 195, -129, -176, 146, 86, -14, 38, 65, -132, 219, -40, -55, 187, -116, -79, 64, -391, 86, -189, -55, -36, -91, -3, -295, -78, 5, 123, 166, 131, 90, 122, 203, 108, 263, 145, 426, -115, -16, 36, -84, 243, -71, 125, -36, -135, 16, 203, 141, 43, -171, -251, -109, -181, 57, -77, 220, 92, -198, 176, 60, -40, 74, 81, 40, -222, 77, -35, -67, 84, 7, 159, -332, -33, -8, -135, -80, 156, -150, 30, -106, -119, 85, 107, 181, 24, -25, -260, 61, -277, 110, 168, 99, 15, 59, 272, 11, -94, 230, 167, 94, 105, 19, 74, 76, -32, 193, 49, 273, 3, 136, 164, 12, 32, -109, 19, -63, -99, -68, 40, -30, -113, -4, -200, -213, 82, 20, 46, 40, 48, 8, 182, -92, 79, 76, -99, 30, -191, 48, 129, 46, 27, 65, 10, -58, -148, 25, -374, -96, -23, -143, -64, 142, -142, -233, 112, -113, 1, -247, 42, -36, 8, 40, 188, 21, -42, 72, 253, 104, 210, -63, -129, -20, 194, 233]
3823B33l57J00O1l74L93j64K90k53p7M7J71j69J21K5p1R3j0J65k71J24k18J56
3845A5m9j24M59l29K0j11Q9l8J4j32L28l22k9J35O5L0k26J85q8k2K62k43N9J85
3869A33q2%P5k96K37N1N4j09pk54K99j20m8K9K42j02j28J57r3j63K12l55L17M0
3893H9p7m9R1L7k16P9J44j75j00K43n0l28K97R3k55L14q7j46rm1J89j30LM7J6
3918b1Q2k27Q1J57l31L16o8Jj35K79k23N7j98K7Q9J80mp7J34j2k43K61l51J65
3942f1P1J64J28l02n7O9K52r0k3r0Rk07M3mkK46J3n25M57n2Q2j54O2j68J13j33
3968a59j00O1N37r3j56M5j43J21j22j36kj56L39k02jK73l1j31k00J44M0O3kJ46
3992A35m29%NK42j24J67J15j28O2K22k72l0K5k88K27J26J26j28k23K39K62k95
$$ y = [233, -124, -24, 37, -337, 56, -108, 182, -71, -148, -101, 70, -99, 22, 47, -24, 69, 59, 224, -47, 77, -141, 15, -34, -158, 301, -28, -8, -119, -30, -68, -54, -186, 142, -180, -209, -74, -9, 21, -205, -20, -108, -130, 132, -111, -52, 133, 51, 51, 126, -170, 67, 118, 172, 63, 56, -198, 101, -19, -67, -38, 204, 102, -26, 131, 38, -125, 87, -268, 49, 89, 12, -37, 54, 91, -125, -46, 98, -77, -177, 66, 16, -312, -15, 78, -177, 137, 50, -96, -105, -146, 43, -87, -84, -37, -21, 61, -166, -85, 72, -259, 57, -11, -10, -145, 134, -89, -32, -230, -203, -114, 66, 62, -15, 119, 107, -136, 125, -226, -61, 10, 174, 302, 0, -57, 12, 264, 174, 151, 61, 70, -137, -94, -98, -100, 146, 159, -366, 91, 39, 121, -33, 29, -139, -26, -159, -259, -198, 339, 246, 90, 135, -8, 113, -9, -145, -147, -303, 36, -166, -167, 106, 75, -56, -256, -112, -72, -9, -11, 135, -294, -294, -289, -47, -171, -4, 111, -17, 45, 267, -5, -35, -10, -298, -71, 55, 181, 53, -170, 69, 331, 36]
4014C6k28R5L8J7J29J36m47J85P4k01K29j92n7J63n6L1N0R4p5OJ77j5n3j95Q4
4039B5J40j48j28J20m8L0N8m8J25m2l74M79j42K04l99K19k3k23J34J4K36j66J29
4062A72j62J99J17m21j17K16K84l97J88j09N4K00k55jJ18l5L7J19k23p4M3K98
4084B51k29j55j0N3j04J28J51%m6k43L44l6k70J15J61%j17J74J73k25k2M4j31
4107FK08j00Pj01J37l25L93j60j0l0k51L88R0l32j32J77j40K89l37K29K60j62
4129A04O0j45j62J26l7L8K22K5j43n1j90K30J46q7m05K77L0j71Q3j07J04j27J06
4152g4J9J13k62Q3LJ31K8j54J15K8j04L74k73J55q4r7k7J07l9j79K68j8k43L52
4176B22L93k37n14M3J62j85K29m88M58k15J86J5k3j58Oj06K46o4PnL18l79L1L33
$$ y = [36, -192, -97, -59, -42, 87, 223, -224, -39, 35, -166, 63, -129, -186, -23, -79, -48, 2, 96, 21, 27, 204, 189, 136, -59, 25, 165, 17, -111, 9, -39, -9, 49, 1, 126, 84, -290, 189, 47, 251, -148, 71, 48, -175, -41, -27, 209, 43, 172, 10, 209, 326, -95, -212, 4, 288, -109, 79, -30, 24, 224, -31, -32, 86, 51, 88, 207, -16, -90, -47, 251, 22, -133, -143, -90, -194, -66, 85, 85, 39, -204, 140, 104, -166, -51, 110, 110, -7, 167, 340, 115, 93, 137, 6, 214, 114, 121, 20, 157, -168, 225, 65, 55, 25, -226, 162, 252, -80, -212, -35, -175, 114, -223, 6, 266, 104, 164, 19, -143, -17, -54, -16, 206, 231, 88, 37, -153, 77, 223, 136, -269, 8, 38, -133, -50, -157, -53, -180, -74, -55, 58, -204, -121, -118, 13, 41, -113, 2, 30, -74, 300, 27, 182, 98, 1, -26, 81, 42, -137, 131, 113, -130, 222, 615, 378, -136, -93, 69, -116, 113, -375, 83, -132, 54, 69, 46, -112, -106, -212, 34, -30, -23, -28, 290, -89, -58, 275]
4200B75k39J54k70Q7j09q8R2k8O0K47j75J56j78J67k29j90J42r9j03M08k70J18
4222g2L25k40p4K35k54O7L7K50j02k56J41R8j01j14P0r1K06O9k29p1m7n1J08J86
4246I0m9m0J9j84P0J99Qr9j6K7r2K57k97L53l39K41J26n93N79k02l25K55J72n7
4270A03LL8j19R6j20p2J97j19o3J45J7k99J72j00J28j82J57Q0j49J41P5m1M7k54
4294a19K05PP4Mj02k9l3J46k01M3J58k12P0j81K84k74J68K16k45j01J15M3n1j53
4318a68K05p4k45P9K50K15K67m93r3L0J23K22l44K81ll46J69p5O2j10P5j8K37
4341B46j92j38J1P3j85o4K51P0m08K58n7J18m7J75l0j98K71j75j8l14K79J67K8
4364A21p1o6J15o0J92j48j38R2N8m4J22m11J93pn4M36l22j53l7L20n5j56J03j17
$$ y = [275, 36, 190, -80, 7, -102, -190, -98, -126, -66, 181, 6, 162, -16, 151, -78, -268, -126, -225, -328, 80, -190, -72, 253, 13, -61, 174, -80, -13, 24, 274, 172, -84, 57, 155, 54, -60, 10, -81, 125, 194, -35, -106, -153, -204, -96, 90, 41, 1, 20, -164, -94, 105, 113, 14, -2, 25, -67, 190, -107, 246, -93, 148, 274, -319, 260, 58, -267, -12, 160, 103, 106, 144, 25, 121, 1, -71, 126, 7, -56, 89, 106, -193, -21, -121, 7, -175, -18, 62, -87, 54, 129, 88, 135, -119, 86, 93, 167, 171, 69, 40, 7, 153, -48, -5, 153, -59, 11, -170, 114, -160, 8, 224, -21, -122, -7, 36, -15, -168, 37, -37, -282, -203, 47, 262, 529, 36, -57, -27, 96, 318, -26, 255, 252, -94, 75, 0, 62, -48, 27, 9, 246, 54, -84, -73, 0, -185, -249, 2, 72, -336, -78, -135, -17, -64, 111, 81, -117, 154, -21, -39, -353, -74, 93, 121, 50, -16, 99, 39, 231, 83, -55, 37, 95, 51, 173, -238, -45, -52, -106, 330, 8, -145, -182, 138, 83, -73, 30, -87]
4388h7R5J36O0j48rP1K33m89L08r7J44l03j8j12K48j11p5j66L30R0K2k8q6P6m5
4413C9j08k1N9p1K2K68J27m21K73j48Q2J81j18m31L27k45L63j55k2j28K89k17
4435e5K10j5m4q4K8p7q5L52j47L2oj15j89J50k24L45pQ8j45Q4j47J67j11p5K69
4460A99k39m1J21j19mP8P4l5j95K45o3N2j35j79J51K16j21n4j0j48K61p2J37K62
4484C81k99l6l3J1K1L06j78k76J18j06j10J90K48m28Q3K58L8l02J63q7Q1j55j9
4507a31J90j71R0k5K08m29J65L8K82j69J0R8j24n6J07O6n7L1k36R0R2R6j09j9
4531C7J28l50J89r4J61j85J40j20k0J17m7j40J29J42K5j4j96J5P7K16k82R3j3
4554HJ42r7m4j71R6J11L1J03p2k03j12J88r3J29r8no7R7J21k94M33k68J7K3k61
$$ y = [-87, 8, 144, 204, 56, 47, 118, 351, -138, 170, 73, 217, -86, -104, -216, 32, -79, -154, -320, 10, 100, 122, 94, 8, 84, 39, -69, -90, -31, -102, -80, 188, 315, -106, 167, 19, 101, 282, 164, -267, 60, -185, 178, 23, 1, -127, 162, -55, 155, 140, 96, 12, 40, -37, -122, 230, 83, 115, 109, -6, -195, -45, -269, 76, 69, 157, 12, 96, -51, 116, 5, -70, 199, -40, -81, 40, -79, -83, -5, 69, 34, -161, 84, 21, 73, -62, -241, -90, 126, 5, -49, -59, -207, 54, -18, 119, 381, 82, 46, 13, 24, 45, 351, 173, -103, 15, -91, -201, -11, 237, -191, -108, 150, 188, -114, 49, -38, 43, -112, -131, 59, -112, -22, -47, 161, -268, -103, -65, 217, 48, 58, 156, 32, -24, 83, 149, 92, 123, -113, -23, 69, 165, 56, 37, 165, -185, 4, -90, 71, -114, 26, -94, -114, 3, -44, -184, -55, 87, 112, 98, -98, -83, -6, 210, -72, 21, 8, 150, 53, 9, -162, -66, 45, 76, 179, 107, -96, -208, -20, -113, 16, -82, -87, -154, -57, 64, -230, 203, -65, -48, -25, -286]
4579b86L29J49j22M1k8Q4M7l64K45q9R3k04l8L64m08K83p8K56j15j3j06M6ql00
4603b22J60m0K78k52l6jJ90k09K73j16k01L25j60J20j45j15J86j27K81j13Oj16
4625c4K51m16n1K97N9k2K8k8k45j8K6L05k92K54j15Jj63J09N9r1K06j60k40K55
4649b5L24j92J86m47L09l6j69O8nj9o8j5L6K17P6k22k39K63p1L53m91K22m9j6
4673a0l9j53rR3J64Pp7K05k32j0J45r6L03n24J91M4r2O1j58l0J06J41j10P2j96
4698b04L95k84K97m35K34j19J82m3m8m7J62J48k29J9k4K53l9k54J0KQ6Q1k31K49
4722A61l53N04n00J34K0K8J04j86J64n3k33J78M6k7o1R6o6J69j62J25M6r7n2M9
4746C4K7r3K36k42J96j48n4q8J77q5O4k9k07L12n3j56J27l46N56k18m4k2Q0j4
$$ y = [-286, 43, 192, 70, 111, 83, 167, 214, -150, 95, 6, 99, -105, -143, 221, -187, 96, 18, 274, 159, 146, 40, 86, 78, -222, -62, -102, 176, -76, -112, -113, 77, -132, 141, 25, -176, 149, -11, 109, -36, -151, 35, -92, 189, 76, 82, -34, 217, -199, -250, 47, 106, 84, 112, 84, -161, -179, -153, 152, -140, 114, -1, 0, -163, -54, 5, -86, 120, -40, -280, -25, 299, 107, 293, -154, 155, 119, -50, 18, 13, -6, -74, -89, -53, 164, 240, 18, -221, 42, -29, 324, -167, 55, 6, -10, -49, -202, -211, -118, 46, 53, -24, 181, -51, -61, 84, -12, 291, -233, -42, 2, -90, -29, -187, -217, -111, 30, -80, -8, -204, 191, -93, 204, -231, 3, -116, 66, 23, -25, -72, 90, 238, 9, 28, 4, 257, 218, -36, -26, -24, 62, 143, -88, 161, -192, 312, -188, -54, -34, -6, 98, -88, 76, 23, -210, -32, 14, -13, -74, 22, -44, 125, -37, 88, 134, 37, -15, 34, 61, -32, 204, -38, 158, 10, -44, -132, 45, -40, 24, -5, -212, 100, 47, -109, 18, -328, 228, 10, -34, -56, 24, 10]
4770A0P3j41k12K17J52j5N2n00N09J05n2N1J2j70j80R5o0q3J00j11K07K06l49
4793h4L98k47l2l39J24L29l25K05K20q9L3j19kK5n0K1k3L0J38m64K62q7N0K1K2
4818A7J47l37K29R6j11o2k12J19q2K74j39N3R7k00l9j22L62o1P0j03m5l0q0J68
4842Iro4j26L39N2l25L57k46K37r3k43J7J94j58L2K6L8j73J12N2k02J43K46k88
4866g3O2O0J59j26k06J11N1K25l39K6J06j39p8J58K0K29k59o4R4j35K75j77N3
4889C3K09k46j9J33j82K57k6j88J32l28J99J24j92M9J34j15J64k68M89l80J93
4910A72j52k08M6O4o5J41J64l73L67jk23l9J55k29J83P9j39P2K11l30N6q8J53
4933A6K20k47l0R7L5J3n7P4q2Q9k41J53j26K27M8o2r4J28j49l61M48j44J70q1
$$ y = [10, 83, -58, -270, -53, 99, 84, 136, -364, 145, 250, 198, 249, 261, 91, -89, 6, -54, -137, -37, -148, 59, 265, -84, 314, 67, 35, -304, -180, 149, -176, 29, 249, 160, 193, 74, 72, 97, 47, 68, 45, 75, 213, -251, 11, -76, -26, -5, 17, 164, -173, 56, 152, 41, -21, -233, -114, -196, 78, -61, -8, 89, -111, -150, -272, 90, 29, 99, -4, -49, -79, -159, 9, 0, -64, -190, 149, 201, -124, 233, -13, 224, 131, -112, -95, 99, -59, -27, -1, 37, -136, -24, 28, -174, -31, 215, -73, -11, 49, 208, 82, -124, -13, 38, 263, -76, -50, 56, -83, -161, -3, 17, 246, -13, -77, 17, -118, 157, -20, 33, 242, -4, -23, 110, -72, 185, 159, -29, 103, -225, -26, 98, -94, -45, 89, -26, 138, -130, 359, -21, 172, 20, -188, -142, -78, -143, -2, 162, -211, 156, 155, -68, -107, 48, -181, 2, 81, -58, 14, 225, -105, -49, -137, 16, 236, -11, -41, 56, 91, 104, 47, 121, 39, 128, -113, 40, -86, 141, 189, 127, 33, 161, 12, -349, 99, -45, 125, 44]
4957D4J32l08J03Ln6K46j64L9J14l47J92J6np6M9K05k32J32R1J52m39O4l1j2K31
4982A43k01k29M29j07m2k89L80J41r3k36%J06j22K16O3r4J78p8j58J47Rl11KJ68
5006B2J85l61RJ90p3J12Pr3l5m6Q9l4j30K14k0J85l04j15M49j99rk4n4J5j58o9
5032b47K1J76o7J47J57l44L57j61q2J71j65R9K16l48L6K7K13m48QL5L22j85k0
5055h2k7J22j3j18o8J35r0J85j93j09M52l12L19j96J51j35J92j46M4j74L38l53
5077g8oJ43l0j00O7j15P0l1KK41m5k64J78j9J64k89J37k1J01k28O4N3J1M6J14
5102A65k42J2K31k28K73k64J06M9k0K6j2j18K23k19J38k35l1ll5O4J23pJ85j99
5126a8j45n0P3N22m04j7r0M5oL94k57j98K04k75M12m2l18q5P3K43j80mR0r5o5
$$ y = [44, 176, -132, -29, -26, -82, 164, 0, 39, 153, -194, -2, 14, 9, -67, -18, 187, -45, 87, 178, 330, -109, -45, -76, -88, 143, -58, -287, 142, 35, -7, -296, 84, 225, 132, -104, -104, 2, -120, 96, 159, 65, 243, 165, 7, 154, 163, -148, -146, 22, 207, -154, -145, 45, -28, 84, 91, -2, -37, -83, 6, -28, -158, 56, 36, 221, -83, -198, 251, 52, 43, 19, -35, -20, -178, -247, -226, -50, -117, 30, 187, -157, 200, 39, -43, 128, -37, 62, 278, -70, -34, -7, 206, -242, -234, -199, 123, -62, -82, -109, 13, 0, -118, -186, -51, -141, 44, -149, -258, 194, -118, 201, 5, 156, 21, 213, 67, 111, -63, 275, -78, -84, 59, 29, -71, -4, -119, -49, -80, -78, 163, 118, -146, 32, 13, 177, -112, 25, 4, 105, -123, -59, -6, 5, 51, 165, -77, -65, 166, -62, 211, -53, 53, 102, 82, 108, 96, -22, 201, -18, 120, -115, -146, -149, -184, -120, 3, -4, 181, -18, -163, -213, -140, 382, -22, -39, -129, -84, -90, 304, 47, -151, 53, -222, 190, 148, -170, -255, -182, 61, -119, -123, -33, -128, -193]
5151a93M12l85pL03k58R4K05j21K19k14j22j3L07q9l80L19k21R2K17k95J76Q4
5173A30j43K4o2L45m76M31l01J81k89R9R2J30r1j34r1L47j31q4R6j60L05m73K02
5196e3J0R3j38N6J44l79K93j07j6L09l9j64jQ8ql31N2J42J4K58k88j1J02J5r6
5221e5n4j6P1J0j15K30j29J75j98jP2J96k41K1J11m5K78j78j04O6n3J0R0k02R9
5246C8j59L18k98l1J28K92l69J82L1k46L2K81k55L5q4K03j50J20Q1k0j82k2J30
5269E5K5J30j08p2j83L9J08j28O1j7K35q7l54L23r9L06n3j02k23O3K10N3l58l5
5293b11K37m8K56k41J4o8J80l4k38K20Jj42j2K26j51O5l7j11K99j93o9K28k6j89
5317d4J76j56K56l48K20K7O1k99K99j58k6j84Lj93L82O6k1J33m04K02J9j48N0
$$ y = [-193, 219, -166, -173, 130, -128, -34, 171, 50, 269, 55, -67, -80, 227, 138, -242, 77, -144, -52, 165, -130, 46, 130, -13, 11, -51, 294, -182, 249, -52, 129, -160, -61, 31, 161, 70, -64, -155, 192, 61, -23, 73, -87, 218, -255, -53, -43, 50, -88, -32, 112, -267, 26, -81, -97, 212, 173, 9, 8, 96, 88, -243, -191, -49, -35, 223, -65, -76, 26, 41, -55, -109, -125, -54, -44, -159, 71, -58, 117, -81, -82, -10, 186, -55, -34, 77, 32, 310, 132, 28, 94, 41, 51, 141, -61, 38, -121, 197, -101, -132, -4, 288, -81, 101, 132, -114, -82, 199, -56, -21, -105, 98, -52, 68, 149, 129, -53, -75, 55, 80, 210, 102, 30, -153, -114, -6, -134, -73, -90, 145, 58, -296, 27, -72, 234, 181, 79, -144, -81, 129, 182, -176, -211, 26, -22, 234, -7, 7, -61, 119, 85, -153, 67, 68, -74, -86, 140, -11, 54, 17, -94, 205, 12, -57, 171, 145, -44, 132, -24, 232, -116, 104, 131, 192, -107, 192, 34, 8, -176, -173, -366, 16, 82, 61, 194, -210, -8, 11, -137, -87]
5340h7J76j53J90j68K9m6K66m46J90J57k01L42n53L82m8P6j38J6k6j48J46K21
5362A77k66q6L00j33J24j50j61M08l10O7J44k29L29j31Jj98R1j24Rj9J79N2K54
5385C28k58j20K52j70m8J52m3J41j82o7J51j09J67l48N7M4L45l03n4J80k72K60
5407A03j85j55K74j68L7j2OP1n2J5J60j92p8J86j20N2L8Q0O0j56L20j12k9p9j53
5432h9K1J37K17k47k51O5J5J19j14L9K24j57J9o3n3K78j51K1L4k01K19j79L9n0
5456a08J23m1K35k98k43L29m2j00J60n5j94K42K14l92q2K97j45K9L24j09n6l25
5478b37K41m9N5j40o4K10n2K95P6k41j58K49o0Q6j95j73N9J41P8j40r2O7K23l07
5502a28J14J84j88M1J47l88K9M11m07L4R9K56J8P9k85J7j48O4K47k28q1J0M0N8
$$ y = [-87, 89, -64, 126, -42, -13, -59, 207, -239, -49, 108, -93, 249, -304, 78, 30, 106, -32, -16, -42, -190, -44, 177, -89, -175, 125, -8, 116, -34, -195, 213, -97, -30, 114, -115, 214, 83, 84, -114, -23, -147, -138, -157, 22, 74, 328, 70, -50, 202, 32, -16, 136, 93, 234, 52, -15, 136, 27, 194, -154, -97, -53, 292, -11, -65, 115, -157, 103, -82, -237, 37, -131, -94, -106, -100, -29, -81, -66, 94, -98, -176, 10, -110, -58, -20, 60, 120, -36, 284, 172, 143, 64, -89, -68, 69, 286, 39, -212, -147, -132, -13, -127, -88, 136, -21, -2, -65, -118, 160, 9, 30, 64, -137, 82, -97, -58, -108, 15, -26, 209, -89, -332, -3, -45, -145, 15, -40, -234, 8, 222, -170, -252, 45, -100, -71, 253, 144, 88, -237, 4, -45, 10, -130, -194, 16, -36, 259, 335, 94, -64, 185, 125, 211, 16, -157, -98, 43, 121, -19, -111, -44, 179, -128, -14, 170, -18, 23, 170, -218, -189, 222, -185, -151, -52, 204, 222, 301, 16, 33, -115, -51, 196, -32, -113, -103, -63, -5]
5526er3K54j59m6J12o5L43l88qJ05k60J80n3j49O5J45J20j55l0R8j27m0K00p6
5550c2j0J29m3J49k92L4J06j3O1P5l6J2j21j18J17J98l87M80m50j54L84l4r7j37
5574a79J07K16j18j50N06l35j45J53k7j2K3J58j60o1K0K76k50q3O8j05M2k6m3
5597a25j09K44j01l5P7K37j53o1L1p4J65l4r1p0K49j78J64l49L55q3j91j37J90
5620g9K05r2k07L52k42O6J84l90J26j1J91k17J29o6o9p8J65j43kK30N6m38J18
5643b12K20oj83M07k06k4p6K33k99K10j87J64J76l43L03n9j41p8R6j62P8rj60
5666b58L67K96l60j06Q4R4L3k13j18N9j06K30j7O8O7j52M09l20N7j21L8O8M2k37
5690i6OR1j35K75p2K03l42Q4k31J14L83l71J21q5K79k01l34N49l51J45j0j27N3
$$ y = [-5, -98, 156, -3, -49, 63, -2, 341, -47, -55, 50, -210, -30, -83, -232, -167, -22, 98, -57, -87, 11, -116, -156, 44, -32, -42, 87, 44, 193, -99, -65, 41, 28, 89, 164, 128, 140, 19, -99, 18, 216, -171, 309, -141, -295, 89, 55, -42, -179, -72, 144, 26, -124, 382, 47, -98, 55, 28, 16, 39, 197, 37, -24, -4, 272, 22, -61, 7, -98, -56, -82, -125, -234, 10, -91, -126, -49, 188, 35, -26, 5, -69, 96, 62, -29, -99, 150, -28, 136, -213, 142, 59, -132, -269, -79, 126, 34, -173, 179, -63, 3, 187, -203, -77, -88, 103, -114, 15, -51, -120, -198, -33, -176, -178, 52, 108, -330, -212, 8, 2, -181, 226, 20, -4, -80, 153, -146, 64, -123, 41, 217, -126, 177, 118, -23, -101, -5, -167, -89, -98, -258, 109, 405, 45, -61, 23, 117, 150, -63, -181, -122, -228, 2, -15, 53, 120, -32, 377, 57, 114, -7, 31, 99, 141, -96, -90, 1, -134, 141, 69, 272, -70, 14, -217, -103, 280, -91, 30, -55, 224, 23, -311, 238, -113, 32, 22, -105, -52]
5713e2N0P5Q5j37K33O6k84j82K54k05J39j50L30j55j29J03k08J64J2j18J90p7
5735DJ75k85J5m4K18p2J3j69K46l1p5J6L5j46q5J79n1J14k72K09M5j49K22J03
5759B15k56K56l55J00J07j66K55l03K26j15L5p4O9J02j50J85r7J37j69mj25l9
5781a66P1Q3P7j58J09J58k7k88P2QK03j19M9j10n3J21J63l45K4J60j2r1J83k34
5805a22L4m9K97k03K18l26J19k82K87j20Q5k0jL06l21K74k42J82P0j03j6J6k7
5828E6q0O1L4L6k65J63N5jP0r8O7j32j60K83m0q3r7K63l16P2j06K34j03j07J79
5853a5J98j49l3j91K53n2j77k3K63N2j6j56O1J16l45L16k6J06k58O1r9pJ38n2
5877c5K55j84k26K77l56J04L33J25k82o8j78K62P5k28l2J08K39mn03M48Rn3K58
$$ y = [-52, -2, 73, 158, 21, 254, 320, 36, -146, 108, -97, 42, -108, 222, 67, -62, 41, -167, -3, 9, -109, 81, 4, 179, -106, -91, -135, 83, 11, 24, -145, 101, 70, -5, 11, 46, -100, -185, -6, -57, 57, -215, -6, 39, -110, 112, 215, -41, 215, -140, -40, 67, -99, 156, -147, 79, -36, -1, -75, -6, 96, -54, 131, 34, 171, 2, -2, -127, -166, -95, -12, 65, -93, 16, 174, 147, -141, -69, -61, 142, 23, 72, -38, -91, 30, 193, -152, -128, 32, 20, -71, 112, -122, -88, -137, 160, -43, 175, -151, -32, -314, -27, -147, -62, -82, -83, 223, -98, 176, -66, 116, 186, 83, 67, 83, 56, -24, 37, 71, 107, -158, 5, 60, 59, 129, 31, 98, -34, -194, 89, 49, -34, -131, 132, -184, -112, -218, 16, -87, -194, -15, 183, 34, 1, -190, 63, 11, -166, -189, 74, 126, 110, -46, 15, 131, -214, 102, 76, 182, -76, -15, -114, -121, 17, -35, 220, 36, -190, 87, -269, -165, 168, 293, 11, -57, -235, 27, 102, -126, -158, -50, 189, 185, -318, 130, 139, 86, 344]
5900C44k20k2k36L30l30K72k36J17j41O7K78j27Ol55J86J69l17J2L41l06J65J64
5922A61p6l5oj52K09l42J83J82k79J23PJ73k34R0J22j54j8j4N4O9J9K02k05j29
5946e0L10m75Q7L28n1pj86K08k49K10k77J53q8j48Q3J54J3Q1p2J29n1k3j50O9
5970bL4j43L39m11P1J30j20K25l96K92q8j87L44MLK4p0qj77J14r3O0k78L36k2
5995a9J10j8J3p5k4k4j00L40j05j01j11J52J12k32J82j43J69k56j73L46Mn0k3
6018b6n4J72j44j02K51O8k3J09j95n8J77m63OM13l9j26j46J17m6L91k44PN7q7
6042A5J4j20J74k76J44j14K68q4M5n5qN7J12m44L04j13J55j04J91p1j7K27l57
6065e7J19j17p7J62j15J75P0j35n5J2K81l85J65L5j44J36Q8l73J83j00K3J90k54
$$ y = [344, 124, 102, -134, 196, -134, 138, -98, 19, -122, -55, 223, 96, 102, -253, -67, 102, -215, -203, 138, -168, -3, 161, 85, 50, 44, -108, 101, -241, -58, 124, -155, -32, -25, 148, -86, 4, 126, -28, -46, -60, -6, 63, 82, 284, 79, -50, 260, -215, -128, 200, 149, 142, -44, 164, -85, 125, -152, 1, -87, -235, -152, 2, 15, 96, 24, 153, 102, 79, -71, -2, 32, -111, 228, -183, -112, 18, -102, 123, -273, 19, -69, -256, 88, 92, 95, 119, 49, 41, -136, -22, -115, -55, -333, 3, -19, 91, 73, 86, 11, -13, -37, -137, 203, 98, -3, -114, 38, 150, -82, 100, -43, 126, -130, -303, 43, 47, -3, -26, -80, 92, -52, -154, 97, 165, 142, 251, 56, -2, 175, -288, -282, 131, 92, -34, -180, -63, -109, 282, 38, 45, 102, 15, 29, -91, 83, -193, -49, -163, 105, 21, 66, 11, 3, 60, 172, -272, 32, -81, 74, -30, 161, 90, 73, 300, -57, 62, -55, -132, 30, -85, 90, 160, 25, -30, -18, 263, -122, 43, 78, -66, 70, 158, -215, -32, -132, -109, 81, -173]
6088a73M1J89N6k24K4j04L5K47O7o7j92j69M59j93p0K65m34L16R5m8n9j89Nq2
6112b05K65j8j39J64oK2j20k2p4K77N1k73L36m77J37J04j83L09Ll56L03m0k68
6135b10K70J44l59J52q8J17o2J62j47M1j33N3PQ0j88J46K5m4Q1P8p7j9L7j99J32
6160ajq1J73l45K55j0j61L05q3j42K56m66J15K3K09P3k8k05O5j64K77L4o7O8m4
6185E5L7j26m8K43m03J86Q7l19K85m5O4J3Jj09K53j45p2L3m8J35k2N9r0j08m8
6210a32R5L38j37k31P6k22J18N5q0N7O6r7J76m8j86J14p2K43k61J4L79q1k62j09
6234a87J74J67j00J22k94K39k37p8L16m21L73j21J16o9l9K39k5m9J2j11J69J8
6256B14j85P9p7j29J37j95J69J0j17K03j97jO9L9K45j76N4j39P2P6J0j55K25k3
$$ y = [-173, -132, 57, 113, -111, -87, -191, -156, 91, 158, 91, -101, -270, 189, -4, -74, 191, -243, 73, 168, 120, 61, -128, -123, -205, 60, 42, -97, 67, 61, 83, -37, -59, -133, 144, 195, -78, 258, -219, -82, 22, -161, 148, 151, -205, 98, 58, -210, 60, 204, -155, -3, -91, 26, -36, 126, -21, 20, -113, -60, -53, 27, -161, -15, 10, -34, 47, 125, 48, 29, 66, -133, -1, -2, -83, 90, -255, 0, -10, -171, 134, 51, -91, 165, -301, -186, -163, 46, 119, 91, -114, -49, -213, 64, 98, 31, 99, 55, 92, -34, -82, 161, -242, -56, 31, -288, -3, -48, 16, 29, 30, -79, 174, 29, -43, -10, -58, 77, 55, 114, 24, -84, -132, -37, 301, 164, -67, 9, -213, -95, -40, -120, -63, 3, -94, 82, 34, -152, -38, -110, 133, -128, -114, 265, 184, -78, -187, -13, 154, 54, 176, -118, 121, -116, -194, 122, -299, 74, -47, 69, 0, -39, 200, 175, 126, 138, 27, 196, 214, 29, 108, 31, -98, 39, -156, 13, 23, -94, 109, -88, -89, -20, 19, 264, 88, 142, 3, 75, 151, 161, 6, 231, 208]
6280B08j74n8j6J58j05k11J52J10j3j60pq8L43j09J17j56j83P3N4Q8j06Q9R9k0
6304H5j4lj23J02j6k7pR0J42j40j24N4q9p8L56j38o1J31l5j05r8K17j77K86k53
6329b5j07K01J03j89pL1K20j15N5k99K5K38l53m3P6n3M38l39j3J65KJ01Q8j41
6353E9P7O5j48j95N94j85k11LK82j77j41L5k14LJ44L6k8p2J47Lk32J14k3k3O5
6378b2P3l5J78k76KK9j45L53m73K17L91j51j21Rm5jq7j29K22j00O9m4J74p0J52
6403A70j51j09K43r5m4j40m7K22k23J16N5M0k3r2Q9k70PM08j7j79J64k66K14J83
6427B55j18k02K70k39j4J48R7k29K9P5k40J79M2j95M5Q2N5rj28J51Ok71K55k13
6451a69K22L8m7k50N08j17q2N0j41J95m10L08j27j45L02k87K9K54j24j35m3J42
$$ y = [208, 34, -24, -40, 118, 13, -198, -46, 64, 51, -109, -116, -204, 139, 30, 147, -9, -192, -119, -65, 23, -83, 6, 105, 85, 71, 68, -55, 47, 31, 4, -3, 87, 229, 89, -35, 19, -70, -148, 208, 70, 9, 140, 105, 0, -98, 119, -58, 228, -25, -132, 69, 172, -17, -24, 7, 227, 112, 167, -132, -107, 131, -222, -265, -189, -242, 196, -143, -156, 9, 11, 112, 200, 59, 136, 201, 53, -142, 452, 267, 56, 59, 341, 164, 23, 58, -156, -153, -9, 27, -1, -73, 74, 77, -155, -41, -64, -87, -22, 51, 16, 194, -82, -80, -51, -196, 157, -316, -99, 292, 141, 20, 29, -16, -17, -104, -233, -11, -111, -42, -86, 88, 18, 170, 19, -90, 153, 58, 14, -126, -173, 49, -174, -58, -3, 37, 14, -78, 11, -259, -252, 156, 139, -40, 124, -142, 72, 255, 137, -65, 205, -34, -48, 100, 197, -32, -3, 72, -168, 11, 53, -142, -97, -15, 40, 31, -97, 54, 60, -211, 44, -169, 53, 91, 44, -206, 302, 185, 103, 153, 12, 207, -203, 105, -22, -167, 135, -152, -123, 131, 7, -128, -171, -29]
6473b9p4N5q5J33L1n2o6J75k41J16m1O5p5L26l49K10Nl31J32Q7o2J5r2J25K16
6498A94l73K24k6m2j84P8p1J16J27p0mJ75k97Q9J77k45J38Q9o3J24j85J98n25
6521c56N73l92q2L87j5m2j76J81lNj80L3O7J53J1l46K60j47Q3MKN3m8p5L33k13
6547G0k04L99k11p8J10j5K14j37k81K3J27J14j2k7R5m25L44l5j68K14K60l02M8
6570A23J2m46K83j4L3N8o0K9j34K28j80n7O1j00R4J0K62l69J59q4J66k3j43j43
6594b35R3k0J55M1k25J69N1mQ9k33j0J34P0j82J09Q3l26K00J20J86l21qr5K11
6618E2j49J6K29q0K01j83lK4q5n1R1J52k53J27k26%L2K2J96L8k36j40J43J61j68
6643i0K36j81K9oM6J5n4P5O1j50m5o8J02L0j2j0J12j23L1q6K46k21J47k73J93
$$ y = [-29, -103, -48, -133, 0, 31, -21, -87, 88, -153, -37, -78, -13, -88, 238, -111, 99, 104, -227, -95, -8, -70, -55, -147, -22, 194, -179, 45, 19, -23, -207, -129, -200, -84, 43, -27, -31, 144, -153, -64, 113, -132, 6, 95, 32, 156, -29, 169, -356, 217, -175, -257, 130, 115, 73, -103, 78, 75, 80, -100, -67, 0, 153, 164, -182, 78, -69, 14, 18, 20, 73, 25, -50, 283, 70, -134, 265, 54, -24, 86, 71, 285, 148, -133, -110, 17, 131, 119, 92, 187, -238, 106, 71, -97, 117, 377, 75, 123, 135, -311, -28, -42, -9, 49, -11, 18, -116, 112, -68, -125, -64, -164, -70, -60, 202, -167, -8, -92, 74, 51, -92, -235, -142, -162, -7, 34, -191, -22, 29, 25, 114, -119, -129, 5, 75, -107, 2, 85, -241, -41, 79, 265, -56, -64, -159, 52, -97, -81, 148, 68, 269, 86, 83, 107, 22, -29, 62, 214, -39, 88, -138, -138, -106, -84, 112, 150, -86, -226, -83, 78, -90, 146, -35, -6, -12, 34, 49, -5, 70, 131, -19, -64, -132, -30, 0, -12, -22, 90, -33, -2, -88, 158, -63, 84, -189, 4]
6668Dj77K34n0j81P8K1L4q0K90j70m5J38R1k5q8k09m9K17R2r0l01M01J29l50N7
6693b9K34k25J05k43ML21j75N8n4J81j58J23j11R1q4N6j66J50oJ09m98M20j86
6716h3L40l68J2J12k21K72l6qJ0P8j23J97k49K26j53m4L2O9o9K07j00l3Q4k20
6740f8P2R3Q9l0l8m8q6O7j77R3J67p7N0n4j17m7k0N2J38l1j59M67k56r3r1j08
6766b12J87l6J52n2K75l37n0k11K94j57K77k11J11J92k56k35L49L1J13k42Q3p7
6788a2j38N7NJ01j61k7P7O6Q8O8j74K10k39m5J41j81J95j65J17j0J9K69l00oP9
6813C4q9k44M27o3l0N1O1l22l1N5J4q7M5K16j03o5J12J08l33J14J18%N3L6L9m1
6839G5P9l2j45M9m7J86p0j77K19j51J02p8K63j69k01P7r7K47k59o3M3l4J70k5
$$ y = [4, -173, 61, 11, -170, -92, -71, -37, -117, 173, 3, -42, 96, 187, 162, 74, -135, -184, 33, 125, 35, -266, 135, 264, -86, -29, 205, -20, 85, -158, -154, 167, -8, 50, -4, 177, 19, 142, 31, 122, 38, 94, -72, 78, 72, 181, -317, 103, -83, 257, -111, -99, 13, -208, 64, 28, 20, 30, 108, -15, 182, -67, 159, 6, -38, -6, 63, -6, 201, 101, 68, 152, -68, 4, 97, 186, 156, 118, 70, -16, 51, -126, -33, 134, 57, 107, 53, -64, -111, -131, -79, 59, 28, -131, 336, 80, -13, -104, -212, -25, -61, 91, 39, 314, -23, -73, -284, 10, -147, 130, -81, 30, 222, -34, -269, 80, 111, 224, -18, 65, -12, -150, -93, -88, 13, -148, -175, -98, -32, 56, 124, -50, 160, -79, -124, 17, -164, 31, -134, -17, -27, -8, 261, -39, -45, 34, -55, -299, 128, 65, 35, 86, 147, -175, -206, -151, -137, -224, -179, 37, -66, -131, -19, 89, -244, -130, -12, -12, 41, 77, 116, 75, 154, 122, -23, 26, -21, 165, 95, -82, 137, -14, 88, 10, 273, 104, -97, -20, -117, 130, -129, -192, -149, -183, -13, -38]
6863c8o7Q2K55l31J14Q2j03k51M19m3J75l10J56j00p5k73N65j18j53o9k02J69
6885a16J29M8k49K72j19P3j26K96j78p7J05O1l38K72K8MJ46j27p5k17K75o9Q8
6908A06Q9lM6j17j99P6O3j53K8k7k9J41%J16k23J48n8j00J90q7J01j87R2J19k07
6933g5m7J76j5k6k99M00P1o1l04K96j74O8J15J98l31O4n4P3q8q9m9J66m1j3mo
6959d9K66k67Q0j46R3j93M10k24JO7m6J32j02P9j85J67m3j46j8K4K12J67j17k12
6983e0K5K87k92K03k46O7K6N5q1J05j54K4l1M0J01m7l1k0lj39J10K3J2J48j13
7008A9j2%j09R8Pj32L0J25L4j0m1K36k59N3r7J7m9J14k46J49L31n13J57J40o6
7033b4J00L9J95P0l32J76j96J54j54J49l3r9j82K62j72J44j40N9P4Pm47N73k47
$$ y = [-38, -105, -23, 232, -99, 15, 97, -6, -257, 162, 119, 294, -16, 140, 40, -35, -308, 257, 139, -14, -83, -285, -116, 13, 61, -188, 84, -35, 38, -88, 208, 30, -47, 58, 119, -219, 53, 81, 85, 231, 104, 29, -188, 87, 18, 106, 195, 192, 238, 121, -78, -2, 61, -92, -64, -91, -120, 21, 21, 137, -86, 62, 4, -96, 94, 7, 108, -79, 13, 132, -75, -122, 54, 39, 13, -286, 114, 185, 124, -180, 116, -58, 10, 125, 323, -8, 56, 2, 75, -13, -102, -151, 15, -26, -39, -43, -49, 217, -50, 30, -116, -23, -216, 194, -30, -29, 38, -8, 124, 22, 101, -84, 83, 40, -106, -124, -100, 112, 279, 162, -50, -25, 262, -30, 173, -73, -6, 20, 75, -6, 99, -55, -31, -62, -22, 79, 32, 1, -19, -22, -161, -51, -28, -16, 132, 19, 7, 7, -102, -4, 3, -129, -99, 26, 60, 50, 9, 245, -14, 39, -58, -41, -90, 24, -222, -73, 258, -255, -98, 42, -24, 76, 115, 310, 380, 48, 224, 28, 182, 28, 177, 144, 45, -137, 125, -47, 97, -43, 16, 90, 97, -350, 223, -24]
7056b4Mm3J9q2J97j5q1J25N2k40q7J73R8p2k33K93N5l6O4l80J99J57l63K89j21
7081e2J61J03j59P6j19P0j49J55J74l33K23j36P5j34J22k41M9j37L91k94m5J83
7103a7n9J09M1O4k87J88J51n3p2M8nj77O5jj27M2L1O8n1K87k91K74m08L65r5R2
7129A82M2j84K43j57O5j81j04N6j01N7J61m4k3j52j1M9Q6K80m55J03K9K22j29
7152C4k79M68l85L08j27K1o2K04r7k27l0J54J83k8M4j97R0Jj95J50p3M6Q4k28
7176a41J79j65K36n4J6l72M11k71J69L4J72o8o8j74K64k01q9K88q5qj83K14N5
7199A59k51n4J53lN6J2k84L98k46R0J66m43L12j4J4LJ98k21j8j72K27r5j71J63
7223b1j20LJ41m1j01J84J47q3j98P2mLk7q1j2J52J97l35K70k15O4N2j5L0r7J56
$$ y = [-24, -20, -63, -44, -126, 71, 56, -25, 100, 152, -88, -175, -2, 96, 24, -209, 84, 139, 103, 167, -213, -14, 143, -220, 69, -52, 109, 212, 53, 129, 10, 80, -69, 86, 260, -73, 150, 14, 89, -45, 77, -164, -115, -252, 139, -155, -200, -17, -76, 33, 74, 138, -149, 39, 190, 137, 65, 113, 108, -69, -4, -5, -132, -90, -59, 9, -42, 245, -46, 228, -180, 185, 90, 182, 224, 40, 283, 126, 191, 10, -94, -38, -139, -82, 79, 35, 12, -140, -151, -102, -16, 264, -191, -88, -59, 163, 34, -245, 223, -162, 146, 19, 40, -22, 182, 85, -142, -172, -18, 165, 137, 181, -16, 74, 75, -120, 30, -43, 3, 87, -141, 38, -127, 109, 55, 71, -301, 110, -161, 8, 42, 214, 146, 78, -96, 168, -33, -122, 166, 81, 73, -110, 104, 159, -92, -146, 7, 4, 60, 72, -212, 186, -60, 30, 196, -247, 65, 51, 65, 68, 266, 45, 27, -145, 82, -13, -184, -21, -141, -138, 3, -38, -139, 45, 192, 109, -89, -17, -21, -18, -45, -126, -138, 14, 211, -124, 146, -69, -5, 47, 32, 62, -35, 121]
7249A21k62K00k5j32l5r4K77J06k58n2R6J10j22JrJ92Lk79K64l27J32J29r1L4
7273b1j9J79j30Q1j10j80M10k25P9j25o1J98K1l8N0J89q5j91k80M44qk12o3J28
7297C1j17P9n0k1J45L0k05LK87k44Q3Lj2p4L30j29O2n12L19l26J74J40o2J97l88
7322b57N60j34k69J39j18j19K00R7k48L04j47J83k80KJ00J2J60l45K98j04J6J67
7344B17m3j96K51k74o1OJ14L5K9q1M2jK3j73j27K15P8K8N3k81mN01n6j79Kk96
7370a78K93k47K22L7l29J55n1rm7O3N2j19O9J17K85k74j74P1K64n44L25o9m4K41
7394A09j78k6J38R4k31J30M2L7m0Q4l00J14Rk08L91J35n09M5J37L2J4O7r2l7k9
7419g2P0n6R3n5P3j4j62J43J05j51K79k14K8N6j30O2J05q8Q1j58L7m8K60l95J1
$$ y = [121, -141, 59, 34, -98, -133, -227, 50, 156, -102, -154, -58, 52, -70, -69, -78, 114, 117, -162, 102, -225, -93, 36, -55, -21, -40, 139, 9, 90, -20, -200, 210, -15, 64, -61, -122, 76, 97, 59, 109, 298, 213, 22, -258, 186, 178, -34, -97, 31, -86, -7, -57, -78, 67, 97, -108, -105, 182, -62, 21, 24, 12, -62, 268, 139, 201, -311, 8, -318, -144, -4, -66, 131, -257, 303, 169, -100, 39, -79, -198, 2, 99, -149, 155, 8, 191, -89, -87, 13, 25, 185, -160, 138, 34, 50, 217, 174, -22, 229, -45, -106, -100, 14, 49, 78, -3, 39, 38, 61, -112, -239, -24, 54, 82, 135, -146, -150, 351, 295, 116, 118, -178, 115, -132, 90, 127, -202, -47, -98, -107, -154, -91, -39, -158, -89, 28, 313, 39, -135, -64, 200, -344, -19, -88, -132, 109, -69, -95, 43, 137, -94, 36, 78, 115, 75, 159, -141, -27, -18, -226, 165, 300, -209, -164, -27, 5, 19, 86, -6, -43, -72, -2, -58, 35, -20, 53, 39, -123, 20, 125, -26, 253, 39, 67, 123, -7, 55, 160, 72, 153, -5, 32, -16, 244, -151, -140]
7444a40o6K7J69j32M5k04L62q8RJ90k94K50j20n2J8l12J49J3K21L7q6J36k28L4
7468f2NK25j54J14m2mL8q2J9o6j95J16K53j26Q8j90J02k68L34j55M1P8k69l6J58
7493g8K05k32J83j80K06p6j04J98j91j1O4m1p5R1R2m4j43L83l96R1RK7L4j60j
7518a49r5M13j15K25l06j38O1J96k9J77p0j24o8p8K75j95J9J35k77j2K70m87N64
7541A92k43J8K4K04o2l73K16j27J32K02k69J84p2R2j82j10J93Kr6K54k41J29l62
7564b95J82L41j75l00K31j51K25M0k6J05j56R3j36K07k60P9J41k67J97j32J14
7585E7j03J4K23j77L2O1J9J20m9o6j1K18m23J02J1j07K84k46j42J28J75k75LR7
7609e5J10j49j5J87k05J94p3J92l06l3J61o8O1j1J42O0k91N2R8j62L21m83L35
$$ y = [-140, -206, -179, -10, -142, -97, -301, 61, -27, -18, 172, -122, 128, 8, -44, -26, -338, -189, -176, 45, 82, -4, 132, -96, -62, -57, 168, 14, 128, 86, 82, 120, 38, 57, -9, -204, -88, 165, 39, 127, -63, 39, -229, 105, -50, -9, 69, -200, -236, -78, 127, -105, 78, -102, 104, 28, -76, 122, -69, -80, -16, -57, -132, -41, 51, 7, -136, 247, -149, -58, -49, -22, 12, -148, -149, -244, 169, 54, 279, -27, -165, -104, 92, 63, 240, 170, 46, -22, -100, 175, -20, -1, 134, -143, -155, 115, -372, 192, -51, -33, -9, 195, 133, -240, -24, -151, -19, 183, -86, 98, 26, 118, -64, -174, 19, 21, -75, 179, -62, 67, -295, -113, 228, 53, -247, -16, -167, 58, 98, 72, 177, 21, 114, -22, 185, -75, 4, 145, -122, 75, -57, 57, -46, -32, 191, 14, 46, 107, 126, 246, 197, 131, 120, 338, -85, 17, 28, -79, 205, -41, -183, -55, 120, -155, -152, -55, 55, -94, -109, 78, -127, 67, -6, 186, -120, -153, 8, -60, 1, -10, 132, 192, -99, -47, 51, -111, 210, -273, 62]
7632F2j32L2J14l26L08k78K64l8k6K48k15M5k26K7L77o1k15n2j53N35k03j0r5
7655a8J5p7K50j47J25j13M4k00j4M28m38M8L82l99R5k5J21PkkLj22P2N6k00P1
7681d0J89k20j27J41q5o8M1K33J8P5k65Q7L0m5K45J5l32J27M0O2mq9k40L14J2
7706A14M3k56n4J22M8j42L30j81M3j84J09k51M22k00J29kk07pK1K34j51p4J33
7729C9L35l93N2j06M9N1k00L21j98j7j3O9J28r1k32J78k60J68j59J64PJ17r9o9
7753a59J99k96R9J47l9J52Q2Q9k59R8Ql35L31k37K09l58N58k89J18m5o4N5k82
7776b18L17k51P8J07J42j27j3j09J00j5j0J70k84J56M6M3k95qL3M41l61K7L37
7799C06j5j93j91J0O3n8k27K87O6j00J85j82J16k49K36k58K29j47P6n2J3J1P6
$$ y = [62, -70, -38, 76, -250, 58, -220, 44, 6, -20, 228, 13, 58, -168, -141, 236, 175, -40, -92, -245, 290, 87, 77, -18, -3, -80, 170, 23, 148, 35, 79, -121, -135, 293, -145, -97, 285, -114, -19, -44, 77, 84, 82, 80, 83, -39, 33, 89, -111, -40, 149, -71, -198, -57, -142, -210, -169, 64, 82, 157, -108, -21, 9, -36, 209, 224, -108, 19, 59, 121, 117, 28, -212, 102, 114, 157, -99, -153, -31, 17, -125, 205, 24, 67, -117, -8, -259, 163, -37, 92, 90, -117, -124, -103, 131, -20, -94, 39, 374, -19, 33, -73, -24, 27, -173, 148, -50, -67, -80, -11, 117, 26, -206, -28, -288, -120, -279, -115, -108, 9, -90, -159, 40, -256, -157, -10, -49, 103, 185, 274, 15, 113, 121, -214, 117, -120, 89, -269, 289, 0, 118, 73, 9, 64, -218, 99, -152, -74, 33, 175, 48, 35, -74, 26, 11, 1, 171, -113, 43, 89, 132, -163, -171, -138, 303, -58, -31, 306, 291, 98, -93, -83, -20, -78, -305, -18, 48, -52, 133, -49, 67, -182, 54, -204, 25, -122, -46, -98, -85, -74, 2]
7822Bo8J02M3L4l7pM4l52K02j9R9J21k32k6J10Q3j62J59j14j78J68Q1N5o4j04
7847f0J51L9k7O2k83J07R7n0j3p1k3L56j12j56k41J69R1K57k73M3j72J54j19K3
7871e1J70Lp2jj50l4J39J52j89n3j7J54L0r2j1j53kL12r8K02k17j3P7Q2j93J21
7897I6j10k11M53j10j75j08k8J81M3m5j19j3J40k18K72q7M13k75j17K1j0j95L51
7920A49k29RMK39l14J10R5r6K08l91K02j92K86k6j40K71m10K17J51k94O5M6K67
7943B27k23k46N34j22j27J33o3k29K15o9n7M0k18J27r3J96P7j52Mp7P9mK0j71
7967a99j0L24k03J03K52k88m1n1J47L4k32J42P3m3j11k1R1J51p1J7j85J21M6j22
7991g6J69O2k26l09M74l36N6QR0N8p9K10j89J54k6q6J4K1J67K5j59n8%j0j27J51
$$ y = [2, -66, 36, 79, 113, 76, 69, 113, -239, -37, -56, 43, 164, -68, -94, 16, 99, -63, 96, -18, -196, -28, 53, 108, 44, -60, 91, 130, 103, 165, -118, -11, 86, 36, 23, -48, -71, 285, 173, 17, -224, -55, 36, 293, 20, 63, -109, 45, -74, -51, 119, 122, 50, 49, -101, -135, 4, 156, -33, -86, -103, 51, 81, -11, -22, -175, -177, 135, 37, 239, 22, 9, 86, 168, -25, 96, -14, -225, 228, 118, -57, -165, -193, -12, 31, -14, -133, -146, -6, -224, 48, -39, 374, 99, -18, 3, -7, -202, 149, -80, -71, -67, 172, -142, -32, 63, -33, 175, -216, -14, -206, 80, 54, -86, 185, -225, -8, 143, -151, -86, -40, 227, 4, -242, 292, 170, 43, 176, 113, -116, 99, 30, -27, 13, -205, -78, -171, 25, 102, -50, -46, -123, -44, -48, -28, -199, -209, 115, -88, 15, 267, -21, -62, -113, 34, 68, -164, -22, 51, 8, -103, -124, -33, 118, 47, 64, -121, 0, 46, -76, 93, 155, -71, -380, 94, -242, -186, -178, -88, -30, -109, 101, -88, 66, 40, -46, -32, -11, 156, 181, 22, -36, -36, -46, -173, -22]
8017b2J51k75Q0p1J68k47J21p6J62R8k48J03J43n4q8k41J4K61j22K57m33M21k96
8040a94K80l53M45j82k05K00m9q1Q7J19j3j34J48l58K02kP1j13J82J39p9k63L64
8063B11k40m7L75m32M3N4L4k6K35j80l24K68J17J00r7j23R1j27K6J27q3nn3rJ18
8088E3k9J05J0p7k37L2Q9q6J21J34k1j26J83n3j80R4K8j38L1j50J74J06j10K02
8112A55l31K31N1J19k13j17K44j00Q9j3j90J38j87J65j7J35L2l35Q7R9p5J21j26
8135c8r1k97N79o1j79q2K81k96J53N8k23J60L3k03N6L03l32N1J67J35j17L9l07
8158b11K32Ml5R8q9k50K64J31l01J8L53p9j16L1R8l6j22K29j54J03k87J60k1k7
8182gJ14k40j31K63j52J95N1q2j28
$$ y = [-22, 129, -146, -66, -137, 31, -216, -95, -171, -9, 89, -159, -56, 87, 33, -55, -296, -282, -21, -143, 114, -319, 102, -194, 86, -267, 178, -4, -209, -9, -58, -139, -52, 67, 54, -80, 68, -290, -88, -90, -19, -132, 50, 189, 110, -153, 211, -29, -76, 299, -133, -90, -36, -2, -28, 207, 27, -297, -29, 88, 188, 91, -32, 59, -68, -42, 85, 2, -3, -56, -65, 53, 24, 129, 139, 62, -175, -143, -54, -140, -19, 115, 94, -32, 151, 98, -82, 12, 40, -98, -67, -217, -43, 63, -47, 155, -176, 55, 106, 225, 12, -105, 139, 39, 128, 115, -75, 63, -124, 41, 24, 159, 191, -144, -57, 42, -33, 88, -38, -129, -426, 153, 92, -87, -169, 112, -184, -31, 27, -196, -36, -3, -206, -150, 153, -179, -128, 39, 174, 57, 96, -211, 21, 25, -10, 88, -1, -251, 13, 144, -157, -139, 214, 135, 19, 50, 148, 112, -10, 219, 65, 168, -119, 41, 20, -7, 107, -133, -264, -1, -153, 42, 93, 11, -117]
8191a17
$$ Imaginary data points
##PAGE= N=2
##DATA TABLE= (X++(I..I)), XYDATA
0@%%%%%%%%%%%%Qj6J6j6J7k5L2l8M6n3O1p2Q8j04J20j36J54j78K05k32K62k96
34a57L36l78M22m72N28n90O56p30Q09q94R88j091J205j327J461j609J772j953
52a024K153k377K629k912L234l606M041m556N176n942O918q199R965j2570J6786
67I716k4708M4465j79321k85513N28259K33903l71732j82642K14145P0982l4051
78B3503L1316o7587j52113J42563K16146j26467k44448P4414K36878k789j96600
89f5184n9584J37138J04158p3901j06553k009P3710M3972n113p5195p2586R0346
101a0801J23401q2571j35598O9482J02728o4399k8105O9752n3452q4421J35320
112D1336R5895j86526r0695K02002P8861j91767m7160J61609m822j21326N1753
$$ y = [0, 0, 0, 0, 0, 0, 0, 0, 0, 0, 0, 0, 0, 8, -8, 8, -8, 9, -16, 16, -22, 24, -29, 32, -40, 48, -56, 64, -72, 82, -96, 109, -123, 139, -157, 179, -199, 223, -249, 279, -311, 345, -385, 424, -470, 518, -573, 632, -695, 766, -843, 929, -1024, 1129, -1248, 1381, -1531, 1703, -1903, 2138, -2418, 2758, -3184, 3734, -4465, 5500, -7070, 9716, -14992, 29473, -149848, -435361, 92898, 326801, -44931, -227573, -13428, 57554, 23503, 54819, -12768, -164881, -22318, 193828, 67361, -177087, -102673, 134205, 131416, -65184, -124768, 12370, 116528, 42627, -63926, -65935, 7775, 51747, 46634, -28561, -101147, -10801, 112600, 30029, -105569, -36087, 66641, 2242, -25863, 43889, -9563, -93984, 41336, 137231, -49295, -139990, 62012, 140873, -50894, -98054, 63555, 58733, -62593, -10840]
123a0840P2846j01859k9389J40204J297j68880J705J81393P697j69812k9353J36122
135C1131N7053r1407o4860M8042N4073o559j7935j4766k3061K5370N8437k3497
147C2021q7346J8799J02431k5485r9048L3428P7860m4605n1829M9168J3873m9702
159c0435K4662M0663o4237k3251R2786p51r9225K7884R7063m6791q3070O5254
171E52O7044p3078m8907O8536L3908n0248j9522L0247K403j6886J7070R913m1140
184b0108j6934N4684K9050o4971m6944O8418N7659o7010n3553O1787L8874n0787
196i835j7634L7418n016k1222L3955M591n4434J7155O6910l1873o8243L8975N9504
209E0251m2545m4084M1270J9123l9487N422L2851k4776k5418L2134J7227l4889
$$ y = [-10840, 62006, -39853, -69242, 70962, 72259, -96621, -94916, 86477, 94174, -75638, -104991, 31131, 88184, -3223, -68083, -20041, 34032, 27473, 9538, -5228, -28289, -2919, 55518, 32021, -55325, -36526, 65905, 40420, -58628, -25200, 52660, 8055, -43774, 5394, 19267, -30435, -5773, 34890, -29347, -52598, 40188, 39437, -59788, -31904, 65159, 18368, -64702, 552, 67596, -5482, -54389, 14147, 48055, -2193, -21715, 8532, 10935, -5951, 11119, 21032, -20108, -37042, 17642, 46692, -18279, -65223, 3195, 60854, -6156, -59709, 2078, 40952, -9835, -27469, 9949, 4933, -16289, 17666, 22257, -32177, -15022, 51888, 20015, -48228, -9253, 50251, 7706, -36378, 4892, 24015, -15472, -10050, 22801, -1975, -27393, 4741, 21968, -12921]
221a2921r175L1445j245k4797J0682J9380j2555j5142J3748J8668j3834k2686
233a8432J6595K6365j9351k8909K1897K9267k5498k3151K8152Q787k7123J0758
245f43J9915l3292j3179M8705N521n8973K806O0015j1319m7941J8383K7448j9538
258b092n546J7260j2516j4171K6787J0996l4503n655L4841M590k7680p685J8042
271B668J2674j0930j6828M380J6985n40j4324R14Q919m620J284Q669j4729r884
285a5362K5552N941l2298j545L4587l851l2352J2201K5105j9240j1885K1972k490
298F335k0908J2979J6930j9326j1372K3999M877k3049M304J7902j0022j1101J0874
311B422M160r966p36P962j904l910L212j286j025L173l920k901N863j598n393
$$ y = [-12921, -22096, 9349, 8104, -16693, -6011, 13369, 814, -14328, -580, 18088, 4254, -18432, -1837, 24528, 5177, -23732, -1835, 27432, 1934, -21217, 6935, 15722, -11401, -643, 19272, -14020, -27199, 21506, 27027, -31946, -29140, 30875, 19556, -28385, -10002, 17446, -2092, -7638, 9622, -2894, -17065, 9722, 20718, -13785, -19440, 15401, 19991, -7689, -15374, 2668, 15342, 4412, -12416, -8036, 8949, 8409, -5915, -5001, 3918, -702, 582, 9251, -5478, -15362, 10190, 16131, -16167, -17712, 16875, 13024, -19328, -7127, 17978, -1262, -13147, 8825, 6335, -14573, -1594, 15336, -3990, -15362, 8637, 13514, -9535, -5231, 12671, 2649, -8452, 2422, 6582, -3384, -4120, 3842, 1938, -1972, 1240, -46, -1071, 2102, -1818, -4719, 1144, -454, -5847]
326e847O203K874r354J672J4170p552j5431J5816J2474k1655m409K1909l319j7100
340i549J0409J1390j5900j676J9022j0059j7829J7955R996k2294l923J9513j794
353E261j3841N229N982o626K921N739j1395r31J3454k415r757M260M514j123L315
368D587n7r848L988J4880r001j4989J1299Q936j1535n96P590q392l409J4074m63
383G064j9356L162J7940p240j1133P068J537m816R092L674j5123j439J9502J402
397A1334j8279Q07J1320j633k30J465r283j185J5368K958j7575n410J4031M450
411H138o858n168o504M683J6867m450k2716K715K3777K97j8680q49Q174q8O288
426E626J983j8249k011K5195N466k3088p736J6300R367n757r006r139O800K0487
$$ y = [-5847, 356, 3230, -6124, -4452, 9718, 2166, -13265, 2551, 15025, -6630, -11039, 10870, 7551, -9549, 860, 12250, -3650, -5326, 13696, 3637, -14192, 3763, 13759, -8535, -12458, 7055, 5261, -8580, -3351, 2631, -3995, -1074, 4665, -6730, -7661, 5793, 3378, -6379, -2119, 2395, 1272, 4587, 4530, -5318, -1330, 13550, 4549, -10440, 859, 9795, -1740, -2336, 5254, -3138, -6547, 7527, 7064, -12292, -9130, 8810, 1570, -9563, -2495, -958, -5774, 3318, 6992, -8131, -9570, 9932, 11334, -6945, -6138, 5182, 3549, 3319, 4784, -4499, -5684, 9684, 12642, -4933, -10343, 3688, 8138, 1280, -3888, -10392, -5709, 11158, 6708, -16008, -13293, 10484, 10781, -7899, -8748, -574, -662, 5626, 7609, -10640, -12651, 12544, 18010, -5078, -12814, 3486, 12853, 7096, -1910, -11049, -4249, 16238]
440A6238o550k5782M503K2930k487j4254K55P82j322J1982M193k4028o249K7814
454H025J0624k0983j3613R935J6500L996j4858j5739J0497K2638o510k0052L531
467f009R467j669O140J572k0626n786K9374J0366l3594j5643K9131J7135j7745
480B113j6295L186J3642J0174p913j7377L8J7249O971r994q515l003O651K0335
494A7262n02l2543p524L6663J6512l3905k2569K4685K1726j2482j6144m12R071
507a62Q242k035j0362m406N154P434L386o945j5243L448K8269J955l8195m693
521b4153M1611Q375l6883j0512K7004Q151j3591j951J549n580O736J1658o490
534E924j4739l05J4133R639j1703k0412N898K8151j842l0976k31K9931p85k3047
$$ y = [16238, 9688, -16094, -11591, 11339, 8852, -5402, -5147, -4365, -5687, 6295, 10488, -13540, -19789, 8025, 18649, -2334, -15947, -6012, 10488, 14484, -374, -16113, -5616, 17022, 10512, -9540, -6009, 3458, 1789, 7929, 9501, -11125, -16911, 12463, 22829, -10765, -26408, 2723, 19858, 2113, -14182, -10996, 2646, 12820, 4907, -12470, -12432, 4817, 11788, 1794, -6721, -9724, -3073, 17262, 16760, -15783, -23307, 13356, 29868, -4037, -26606, -1921, 19805, 7323, -8821, -9233, -162, 8080, 6045, -4317, -8723, -3569, 3865, 7251, 306, -14937, -11489, 16780, 18735, -19460, -24153, 17458, 25833, -11050, -21562, 5442, 13593, 2, -1949, -400, -5980, 756, 12414, 5924, -8815, -9120, 5013, 14652, 2949, -17463, -11565, 16586, 14744, -16232, -16463, 13468, 12683, -10364]
548a0364J688J2259k851k121N332o484q803J1808J3319r366j4232M36J4525J2469
562A7615j2926k4172Q587L0567m048l0781K219K6286m873j7433R402P284j3892
575f165j408J5408l331j6123N656J5193o206j2912M811J1536L55j2333n345J3901
589C037Q777j3212j0045J2691R254j0751m824J2287j422j2991N885J0527o785
602B428q946N818L696m508R08L361m537j985M275j365J218K713q494m942J4270
617C910O642j6103n171J6877J498j4664O103J1543j1206q725J2722O271j0875
630a178l727P014J512l110M06j068j7J491m582j050Q151j109j0222J597R451k259
646A300m964N806j040r967P261J2049r306j0640P623P725k534k893q1k397L373
$$ y = [-10364, -8676, 3583, 732, -1389, 3943, -2541, -11344, 464, 13783, 4417, -9815, -9379, 5146, 17615, 4689, -19483, -10896, 19671, 15623, -15158, -12939, 13347, 8474, -8959, 443, 7727, -6165, -7573, 7835, 4504, -11619, -5963, 9230, 3024, -9888, -5077, 6459, 6814, -5519, -10864, 3037, 11814, -1398, -11443, 1248, 10502, -249, -5073, 7214, 5792, -7199, -1314, 9213, 2428, -6518, -700, 2996, -1512, -604, 2757, -1780, -3765, 510, -855, 363, 3076, -5418, -10360, 3910, 10552, -5551, -10722, 6155, 7653, -7011, -908, 10635, -571, -9296, 3426, 9697, -1178, -4905, 2109, 3621, 511, 917, -151, -168, 1323, -3259, -4309, 3842, 2733, -7489, -5892, 3559, 1300, -3664, 2142, 1102, -8865, -1604, 10445, 1139, -9501, -1878, 5847, 3313, 420, 339, -2058, 1315]
661A315O422o354p225P678M048q995j355P777n68m939J155K96l016N194M629j0835
677d773n858J1217O320o842n457K015M120L564k2o770j887Q177J276p241J404
692g57M887m431k131N685M51n415J201L573n680q62P928l106q141M191N293l828
708a142j249L878k168l463N201K338n909R25L651l749m8O277j430o039K339M645
724D057k557j035K215m200k032P042J26p058J240M501l109q08L909j967n322L691
740a307L676m992M60M517m305k294P132P93o404P93N360k755k816M479R3n289
756b859L362K845m113P90M124l444m836M756L719n305k785L284m01k15L254k960
772g84l960M191M103l990k928L630M23k968K479J353l384J863L641l631k019N153
$$ y = [1315, 7737, 1383, -5842, 1836, 5884, -3111, -4466, 3311, 2743, -2196, -1041, -745, -3761, 1433, 6062, -4773, -10631, 586, 6906, 64, -5393, -3378, 742, 4306, 4284, -2486, -4373, 3804, 5080, -2161, -757, 4130, -301, -2432, 3253, 3704, -1711, -510, 3063, -2617, -3479, 4449, 1343, -6798, -2607, 2686, -1142, -2391, 1487, -681, -4144, 1057, 3395, -2514, -1589, 2062, -1687, -1735, 4542, 3112, -2927, -588, 4057, 1500, 465, 2680, -1520, -3552, 3490, 3616, -3442, -2202, 2299, -810, -1618, 2291, 324, -4998, -1307, 2369, -2623, -2163, 2354, -1951, -4245, 2887, 3680, -2724, -1931, 3429, 674, -2142, 2337, 2430, -2859, 503, 3348, -765, 25, 4149, 705, -4131, 625, 4344, -961, -3746, -462, -863, -1078, 2176, -784, -4744, -553, 3550, -440, -3368, 262, 685, -2283, 196, 1549, -1835, 28, 3669, 38, -1981, 3172]
788C172N98n303j55M560j972k287L087j335l127M201K059n556q66M657j057l844
804c168K088J994l819J091L731k984j307M247o43l848K955K814l900j275M219
819B195q77k746L549R22m447J695L108l325j659L326j305l813L347L027n682n10
835c195N862j927m369L889J239m091P05M225l158l061N833J459n752J223M436
850C318k003j779J938o83j619K176J488l940r34M530j58l274O55j0q65J972p05
867A07l324N03L891n60l956K137K381k201J309J692l993n18N504O2n706M93N645
884C466r40l292K468m42k586L493J477n390j711N443N46m886J00L196j718k21
900i97L107l145l497M344L184m298k925L377K836q80j588o83J203L097j434l389
$$ y = [3172, 3770, -1533, -1688, 2872, 900, -1387, 1700, 365, -2762, 1439, 3498, -2058, -2924, 1733, 676, -3168, -1080, 914, -2905, -1814, 1917, -1067, -2374, 1873, 1230, -2618, 337, 3151, -749, -2024, 2195, 1318, -1428, 2121, 3043, -1404, 291, 3399, 74, -1585, 1741, 436, -3377, -30, 2997, -2685, -3195, 2667, 740, -3629, 260, 1499, -2592, -1887, 2338, -820, -3881, 1952, 3411, -2341, -1118, 3318, 1315, -464, 1474, 791, -828, 1348, 2836, -1104, -2038, 2492, 2334, -940, -285, -295, -1160, 812, 107, -3217, -2714, 1177, 617, -3339, -1202, 1179, -1022, 287, 1979, -2014, -2532, 2972, 3034, -2672, -2179, 3466, 2526, -766, 1702, 1260, -1326, 2167, 3644, -1746, -3457, 1986, 2532, -2354, -2254, 942, -776, -997, 2110, -1035, -4532, -188, 2996, -1302, -4227, -850, 1986, 1106, -482, -1165, 38, 3135, 1701, -1688]
916a688K603J543l391P76L335l455l316O496K628q453k034Q996n23q012J263N379
932B147k364k859K869O77k866J931K331k426j056K165o52K09J218j546j348L060
948A490K772m404k500M953J650m663j257K568Q87k121j073K246O73k473j128L364
964I84J637n284k201P472J384r356j42J0298r86r215K516R447m677p635O696N401
980F339q286k638P896J223p006n79O173K12m402n17K440O50j606k542J635K506
996A498k752j968L648K073m009k328N144J988n108j367L617J234q27j677k73L061
1012A954J168m151j74M630j115o375L817O715p497o173J0248M480j1840l310J2393
1027D770J715j2130k35J0065k287p179L501M509l183l405M787L474m871l806M938
$$ y = [-1688, 915, 2458, -933, -157, 3178, -277, -3593, 2903, 5531, -2922, -4956, 4040, 3517, -4495, -3232, 2147, -217, -3076, -207, 470, -2396, -465, 1866, -560, -1616, 549, -103, 106, 1324, -222, -1570, 1490, 4262, -142, -2642, 2311, 3961, -702, -1959, 609, 1496, -625, -1698, 548, 1221, -1252, -2380, 984, 2621, -2663, -4864, 2608, 3992, -5364, -5506, 4792, 3806, -5409, -2893, 6554, 1877, -5758, 938, 6339, -1947, -4585, 3311, 4534, -2472, -3051, 3122, 3334, -1068, -1585, 855, 1505, -101, -2643, -1008, 1498, -1254, -3222, 426, 2499, -1510, -3838, 1306, 3294, -1814, -3181, 436, 1670, 843, -834, -1107, 1954, 3122, -1029, -1203, 3427, 2312, -4063, -246, 6469, -1028, -7201, 3047, 7527, -4313, -7623, 4770, 6485, -5645, -5880, 4185, 1898, -5281, -1780, 2729, -454, -3859, 928, 4402, -469, -4275, 663]
1042F63M454m068n701L606O349l904m605L990K824l846r57K834o91k920J826J635
1058A489l048n35K758p29q40J591j612j675M129J928p100j734R168J324r501Q58
1074c529Q035k127n204L419M055n893k556P344Q55p741n26O808R51o031j665N646
1090A841J260n233j364M483Q62m414k64M506j535m060M999L408p080k041P851
1105C219J113o856n96N805j204k597L679p90m774L274M496m134m027L768J956
1120B332m541O46L933l129k759M377J299m136k4L291n23l725P93M224n69l322
1136a833m98L605J586k838o77K585j370k632L819K357n588k879O675J914o685
1151b459K85N748l178m277M944K249o433j543O503o03n034L038L618m541j729
$$ y = [663, 5117, 1049, -4652, -1046, 5303, 1399, -3206, 784, 3608, -238, -1195, 1639, 948, -1972, -146, 1489, -1559, -2094, 664, -65, -905, 686, -926, -2601, 1528, 3456, -3644, -5378, 3790, 5114, -4387, -3529, 4506, 2379, -2825, 594, 4649, -1244, -3800, 3544, 4399, -3342, -3868, 2940, 3891, -2140, -3805, 1841, 3101, -2132, -3496, 987, 1849, -2565, -2829, 1677, 142, -3918, 1081, 4489, -2591, -4632, 3219, 4332, -2524, -3120, 2685, 1481, -1116, 2563, 1773, -3001, 273, 4769, 635, -3392, 376, 2332, -2209, -1563, 2370, -759, -3518, 859, 2158, -1978, -2002, 1289, 766, -2959, -2166, 2058, 1489, -1833, -2331, 1274, 2860, 22, -655, 1930, 560, -2072, 1747, 4104, -1484, -4363, 2312, 4226, -2459, -2174, 3574, 396, -3881, 1063, 3312, -3121, -4664, 1839, 1236, -3798, -760, 2858, -1683, -3412]
1166c412N457Q44m658n12L614k07k092J982O43k299K8K228P69j872j685J306J109
1183A243j405p60J371j71k397O15L780q93m367J796K826l071m38L755j609m253
1199c978L023N357l533m319M762J691m339Q73M079l211l814L735L404l845j740
1214a855L603n04k835J227K545k215k446P74K735q97j787O88Q91o73J10J423Q01
1231A585l487q67M414P16l523j44L119j038j924K945J800m965q51M975r47m012
1247b204K134K175l393j600M851L18m928N68L847k129k072L091r6k987M92L945
1263B012m88l371Q13K368n29n70P29j29q41p79J666J134j756j257J226J252j441
1280C9r15K337q53l237J575L492k527l197L090J529k813J06L245j873l365L278
$$ y = [-3412, 2045, 2889, -1769, -2281, 1333, 1126, -966, 1016, 1659, -640, -612, 1616, 2385, 513, -1172, 134, 1243, -162, -922, 449, 278, -2119, -1504, 2276, 1383, -2984, -1188, 1638, -1433, -1871, 1884, 275, -3978, -955, 4402, 869, -3450, 1312, 3003, -1336, -463, 3616, 405, -3409, 326, 3730, -115, -1855, 1748, 1244, -1591, -364, 2181, -34, -2480, -1706, 1029, 132, -1655, -967, -76, -749, -639, 784, 1585, -1902, -2769, 1645, 2361, -1162, -1306, 1813, 775, -1149, 1796, 3596, -1369, -2220, 2755, 1808, -2204, -70, 2105, -1288, -2888, 1963, 2281, -2647, -2079, 1768, -361, -2433, 658, 562, -2425, -1933, 2012, 1524, -1847, -1034, 1334, 805, 235, 964, 835, -6, -785, 881, 2015, 259, -998, 228, 1480, 39, -876, 1461, 608, -2629, -1054, 2438, -89, -3286, -196, 1333, -1480, -1374, 1871, -2, -3367, -89]
1296h9K777l373j268L161k21j828J163K250k539j111K258L65j706j5N70p16J08
1313b14P09J2l20q96q8R76J33j109o48J242l79p68J813M78k679M23L006k37k587
1332a133J068K021k437j068L600m19l091R18K971j770j953K243N64k807K75K182
1348A164j328j486J229P36j164K31R83p48o58P59L74n50K80R6n01R75N55p72L87
1367E62K98m69l2N31k53j061O04J033j499l31J492l27j822J064J393j854j107
1384a778J940N4k114J061J671j579l03J389l46j84M20L05q48L25J011j021j67
1401a64J268n34j289J595P13j662l85J594o24j760J069P56j263J3Q86o65j28J065
1419D85r78o31J171K28j323K63J886j292j193K462R22k572Q9K108k81j935M38
$$ y = [-89, 2688, -685, -1953, 1208, 987, -841, 322, 2572, 33, -1078, 1180, 1545, -161, -176, 394, -322, -214, 495, 507, 187, -709, -797, 179, 312, -797, -1445, -203, -582, -1350, 463, 941, -1738, -1315, 1691, 1454, -1133, -65, 1956, -481, -1549, 2051, 1632, -1459, -541, 2430, 660, -1293, 950, 1514, -1293, -1018, 1164, -164, -1650, -421, 315, -849, -618, 365, -383, -1041, -282, 92, -458, -178, -82, -583, 392, 947, 175, 562, 860, 391, 359, 890, 637, -424, 180, 1213, -286, -617, 875, 548, -1274, -210, 1183, -671, -1778, 162, 216, -1898, -837, 834, -745, -1048, 341, -5, -189, 231, 536, -312, 13, 1024, 3, -164, 1104, 570, -719, 876, 1589, -73, -458, 1136, 512, -1248, -179, 577, -686, -673, 213, -452, -580, 485, -493, -1124, 47, 275, -1048, -785, 1101, -191, -1384, 1078, 2000, -572, -483, 1625, 1344, -591, -153]
1436a53J120m37j188J313k20k04M1o01J27P56q51j176J497O69k030p77L072O8
1454A026k893N79L130j043k340J179J864j667p40J553M62r02%O08J76j24j426
1471e58K24J521n14k395Q02K164p32k525J447K145j873j290J676J43j240j81J243
1488E7j30o82M26M29J107l16j833Q04K333j131k760J516K128j649k193K425J758
1505B289l004p25K635k13k614L97K241n01k317N09K150l60j476R2J415N61j654
1522e75q29K172L27k093M48J611o7j930J104J982j475j755J373R75j239p42P86
1539G3L83l58p43J87M87N01r38p48J204O00j972K6K002k89j744O42K433j487j748
1558a489J948J245j569j204J692N03j016k96N42O73q34n38L96Q88r82j372J538
$$ y = [-153, 967, 530, -658, 655, 435, 231, 272, -329, -202, 554, -297, -1473, 24, 693, -1337, -2114, 958, 1026, -1867, -1288, 1842, 799, -1541, -362, 1502, -165, -905, 648, 1110, 208, 208, 816, 992, 868, -558, -334, 1187, 673, -1722, -920, 1244, 512, -2013, -566, 1579, -294, -1584, 92, 235, -1005, -1186, 57, -73, -755, -329, 100, 1207, 891, -942, -138, 2195, 1064, -1696, -180, 1948, 299, -1894, 531, 2289, -715, -1440, 1195, 982, -1632, -1235, 1006, 505, -1812, -1303, 847, 487, -989, -897, 518, 1079, -575, -1404, 768, 1095, -998, -550, 1061, 994, -936, 168, 2150, 675, -1080, 293, 1268, 29, -713, 73, 456, 98, -645, -458, 29, 530, -408, -1156, 48, 648, -1324, -1298, 704, 415, -1329, -687, 1746, 259, -1489, 459, 1704, 135, -1069, 623, 1126, 110, -186, 356, 1029, 195, -343, 53, 941, -41, -1413, 125]
1575A25Q68j868r21K284j8k103O65K151j186j513J489Q24j633K42J387p24n29
1592d60J220J6o41M80O46j241K0R69j144n28J079K74j051j75J188k78j051M73
1610b04M68p19j95K99R5N06n50l34Q73k2l13K64Q68o64j351P19J707j387q34J279
1630E05P78j378j68J353o60j608R28J528j956n57J241R9j057O38P08o78p08J085
1648I3K60o32k98L23p9M38Q8K37j18R5l32J94P43p13o64P27O6p14J99O77q65k91
1670e66J010K14j612K28J203j419o44J936j9j877Q03K013r93j030J157J34j137
1687e99J01J581m61j625J088J123q09r2K55M5p33J62M46j83p09l84N06N42j96
1706E8p23K09K73o90O40P22o86r64N68J289j062J51P95m22p13R27J141j426o01
$$ y = [125, 993, -875, -1796, 488, 470, -1633, -968, 1183, -3, -1516, -27, 797, -836, -594, 793, 69, -460, 760, 776, 135, 615, 1261, 20, 40, 1009, -135, -663, 416, 690, -361, -536, 652, 374, -677, -204, 264, -455, -650, -351, -256, 250, -300, -634, 239, 217, -96, 168, 1036, 372, -979, -260, 1447, 60, -774, 505, 1283, -95, -263, 1090, 430, -1178, -250, 1278, -678, -1235, 6, 105, -952, -314, 394, -284, -992, 93, 353, -279, -577, -254, -333, 105, 193, 430, 312, 407, 75, 269, 1012, 299, -365, 362, 428, -286, -87, 590, -275, -566, 444, 658, -954, -726, 477, -942, -1586, 350, 331, -1546, -743, 1270, 277, -753, 404, 538, -599, -498, 1083, 622, -1003, 85, 1208, 399, 307, 562, 607, -126, 36, 482, 299, -410, -794, -288, 254, 58, -665, -456, -183, -873, -233, 489, -197, -1161, -593, 696, -366, -215, 580, 158, -555, 372, 1513, 87, -514]
1725e14R61K80r58N20N96j364m10J819q0j316P9M65l68j86L96k8p37J50Q22J56
1745B83j88j55l25J82N80j96p4q4l66J32J161K46j448K1J251o67m57P65k99j277
1765i15P5J508l66j338Q24P73j267K94R45o00j281P63R32n90l92O29j04k00P92
1784D82N32o84j50rl1K87J65m81n30O11K74j00k30r6l90O4M63l23j92j20l54K17
1806e95Q28K12j071k37J049K52q51N90L22j089k7J319K17r34l30J349m88o31R15
1825H00k04j128K85N09j46k41r0qm5L95l9n81J73R2l85N05L30n82n23N90N61j0
1847B58k19M73n51R1O73j20p56L68K84p45M80P49l80j334N88R91j179k07Q32o87
1867c91m64M90R31q81n44R11L81n84q8J22k92J36K61J40J91O7l11R0M41r0m33
$$ y = [-514, 447, 727, -231, 289, 885, -479, -889, 930, 850, -466, -387, 78, -290, -476, -80, -108, -845, -695, 127, 283, 95, -60, -385, -203, 377, 181, 107, 23, -343, -211, 950, 1196, -252, -231, 1020, 353, -104, 661, 362, -915, -840, 668, 302, -1036, -212, 561, -706, -412, 533, -67, -1348, -585, 347, -243, -635, -6, -110, -310, 482, 1014, 330, 180, 171, 140, 427, 592, 111, -419, 192, 466, 366, 136, 40, -350, -286, 177, -146, -338, -458, -812, -595, 233, 445, -626, -863, 186, 438, -413, 177, 499, -590, -617, 702, 919, -15, -345, 1004, 516, -115, 800, 596, -532, -247, 262, 116, -125, -215, -223, -268, 127, 88, -493, -320, -228, -613, -108, 222, -360, -883, -293, 268, 258, 39, 512, -39, 52, 725, 605, -151, 217, 501, -244, 236, 985, 605, -729, -141, 850, -329, -536, 296, -391, -855, -365, 566, -315, -859, 52, 433, -151, -239, -117, -409, -273, -12, 128, 319, 386, 75, 165, 606, 516, 83]
1888H3J57J23m96o0K61j28k43L80M6k03j21L32q22K5Q26J08j352P69P83q74j99
1909f05O77N94j350M01J235m55j090M62O34l49k57M31M41p24P5j13J67J4k64o52
1929g28O10L76q67j35J034k16q64L99R97j042n02Q67J98l70J02K44P2N06l92k9
1949B60J79K54m34l37P94p3j347M20Q06p69m97P36Q29j210p97J011M31j007J9
1968g32L88L07k99l3N01R4j78l38R6P20l81o57N36Q42p18o17J421J9j176k8O42
1989D09k0r26J35O18n35j28p3L20J01r8l46Q65J05j014J60O95R5q59J2J144k39
2010D21p63L95Q25k44j030O38N59r98p5O67j92k67N8Q0j09L34m10j83Q9M3o66
2031h28P2R26Q9r54L96M81J5q56Q94M43p55m51Q73K10n84j27L76N63k91p67O22
$$ y = [83, 240, 363, -133, -193, 68, -60, -303, 77, 123, -80, -201, 131, -691, -666, 160, 268, -1084, -315, 468, -406, -605, 72, 666, -684, -283, 952, 497, -593, -131, 503, 154, -103, 328, 769, 45, 120, 7, 174, 188, -76, -728, -118, 258, -609, -744, 290, 74, -790, -391, 606, -436, -938, -71, 127, -243, -141, 103, 175, 681, 289, 260, 439, 693, 259, -78, 716, 643, -704, -284, 522, -247, -744, -8, 821, -389, -1186, -175, 256, -751, -732, -344, -37, -336, -369, 132, 226, 48, -290, -194, 526, 145, -512, 24, 866, 148, -469, 952, 971, -205, -233, 409, 389, -537, -402, 216, -319, -447, -520, -200, -99, -197, -543, 322, 427, -587, -427, 268, 363, -496, -484, 660, 421, -342, 53, 878, 634, -396, 242, 801, -197, -272, 395, 203, -64, -6, 74, -35, 299, -111, -294, -205, -162, -828, -756, 170, 259, -695, -299, 182, 197, -659, 235, 678, -77, -528, 345, 555, -29, -156, 220, 783, 492, -275, 347]
2052C47P93j207n45N16N34q95l54J260J48j421N38Q00o71q65Q67M54r64N2J097
2071D84k31n51J82N96m7m0n3l0k04j3K3r1L00j48Mk79L07j98j59j66J27L46n53
2094c94k30L08L46j44l37K51O38q34k00J057K1q19K6R42l14q90R97P82j117o56
2114e67J452j38r22k54J026l81q79O55L73q71K80K78r6k30k19K80n4k08j1N52
2134F6m0j30Q6K52q9k78L57K44p67L92M50l38n65N60O53q32m80R25j33j030M15
2155b82P42q03m28R97J24q71j03R80j63p02M94M76o70m29M68O88n64k51R02j68
2175D37k07rL7r3r8n5L80o03j80L72J90n82J42J98l06o7n5P51l31p58N68L97n86
2198d58J60Q35k4j332P72R85j055l01J198k80p87K06R67m30q64P01N53p94m30
$$ y = [347, 1140, -67, -612, -96, 438, -457, -811, 449, 597, -824, -286, 514, -157, -1022, -155, 299, -665, -613, 484, 253, -298, -116, 480, 433, 393, 340, 310, 106, 93, 116, 25, 325, 177, 181, -98, 209, 11, -148, -314, -187, 159, -394, -624, -316, 30, -114, -451, -200, 438, -396, -596, 461, 482, -337, -311, 631, 317, -573, 424, 1206, 89, -567, 885, 747, -175, -429, 597, 216, -663, -8, 365, -506, -226, 52, -44, -274, -493, -213, -267, -475, -486, 66, 26, -104, -18, 234, 145, -133, 224, 468, -299, 93, 543, 205, -360, 200, 853, 21, -459, 466, 333, -697, -282, 460, -343, -771, 226, 350, -521, -624, 356, 193, -509, -15, 461, -209, -638, -170, 518, -46, -297, 605, 437, 230, 221, 258, 165, 67, 12, 392, -211, -391, -19, 171, -411, -269, -71, -377, -444, -499, 252, -79, -837, -269, 128, -458, -298, 537, 513, -819, -47, 938, -117, -418, 780, 500, -287, -81, 886, 456, -408, 293, 846, 52, -378]
2217c78P35l60m17O6M02Q2n47O5N20j32l66l7K79n3l97M07M78o68o9Q41M2n47
2239e4N5N56n21k85P37R9j130L12R24n88o49R68K33j088k63J225n60r80N18Q10
2259C19o20l67O66M58p25J10M75K8l51j32R1K08J12j69J50Q9m46M49K08l09m78
2280b34K74J52n22KN22m79l36O40M66q52k25O94k3q27N75P79p95k81O27M59o74
2301e8M8O44k46n20M58M41m25q61M84L66j04l95l1K97q2j06J58n4p01K48N43n3
2323E1k75k45L21k59L25O49l96k97j19N96j75m59O63Q4p38L41R82o83n95J35N97
2344E03m07o08Q10J98r21L53K76j28n13j7M63k04K1lJ69k94K4L19K71l75l52M84
2366F9M33j94j63k3k39k15P02J62k79k90L54j84k20K70O2q11L6N00j40m95J92
$$ y = [-378, 357, -3, -420, -354, 48, 130, -417, -352, 168, 36, -330, -367, -88, -141, -538, -131, 347, -321, -390, 451, 493, -54, 1, 557, 36, -249, 488, 587, -543, -231, 693, 105, -544, 424, 657, -431, -694, 531, -29, -1009, -491, 319, -301, -668, -2, 456, -269, -159, 316, 344, -7, -139, -48, 160, 272, 103, 253, 342, -104, 345, 553, 244, -234, 40, 192, -330, -328, 194, -285, -621, 19, 485, -367, -592, 102, 79, -748, -173, 606, -189, -470, 157, 616, -58, -10, 634, 388, -132, 326, 767, 342, -519, -35, 331, 227, -168, -199, 98, 16, -90, 68, 14, -687, -439, 104, 51, -224, -469, -148, -407, -82, 567, 171, -126, -245, 351, 176, -283, 380, 464, -274, 67, 1049, 366, -229, -94, 503, 96, -512, 298, 496, -425, -72, 204, 76, -437, -454, 9, -195, -174, -177, -8, -302, -278, 41, 312, -63, -415, 69, 502, 308, 145, 122, -117, -332, 370, 532, 253, -37, 317, 133, -87, 183, 245, -566, -530, -30, -170, -665, -473]
2387d73O47m43m73J230j11o30k8M47K52o26o0O84l63K49K41r5k06k04J02J71k96
2408A5l75J08L3K08k28N2L01l1k26J92K02m77Lk3j47K44M0J85k83L17K88n30M12
2431B80K66m38m97Q68L39j167j2P57j86k95M29L03p82l96L20J32q0n52M53M49
2451A91o48L61k2J09l5l18J63O84n54k64M54K91j14m09K96K6j35M7J50j26k04
2472e7j7m2K76n14K13L6J00Q8k51k03N31l46m60M41L02j30k78L77M07l57k04L20
2494B32j48k85K68P9J49j70k28M38k3k34p2o8K70l81j53M40j95l49J83K0K12m18
2516d33M76N9k30o8q9P0J03J26O0k1J85j21q7K60J71m47q5L29p6n41K86K45p9
2539I3m40L43L01o45J28L26j30m06L64j52L62r8k83M02j59l0K86j30J02J46k86
$$ y = [-473, 174, -269, -742, 488, 377, -253, -281, 166, 418, -208, -268, 416, 53, 302, 543, 448, 242, 38, 140, 311, 15, -360, -252, -219, -11, -239, -187, 114, 83, -143, 49, 251, -226, -223, -246, -393, -149, -109, 76, -207, 110, 398, -132, 280, 546, 108, -389, 479, 818, -349, -361, 396, 210, -85, 344, 647, -135, -531, -211, -79, -159, -711, -258, 191, -457, -96, -118, -9, -44, -362, -199, 485, -69, -333, 121, 412, 298, -111, 185, 211, 76, 123, 273, 147, -57, -74, -116, 160, -354, -141, -105, -5, 83, -168, -371, 160, -186, -646, -205, 97, -33, -311, 66, 473, 116, -88, 232, 84, -201, 67, 146, 295, 125, -103, 335, 312, 78, 6, -62, 208, -173, -326, 114, -81, -430, -247, -227, -15, -433, 43, 102, -128, -196, -285, -215, -112, 14, 74, 53, 238, 117, 30, 290, 461, 14, -71, 258, 182, -359, -73, 172, 93, -347, -4, 297, -348, -220, 106, -24, -430, -66, -218, 144, 46, -237, 165, 6, -24, 262, 132, 234, 380, 94]
2560I4k49L11M2l10M37R7k82k00J28K16l46k15R3J98k84J6j34K85l6j87L04p7
2582i9j15p1K02M01o59r4N78P1l79K10K63o9m46L61J79k33j42M84l90j12n0j40
2604b50K86j26K70k33j64j12L31k17J34l5m01M78k71K57K20j33N3q2o1n6R1M17
2626C96j25m45K58L12l93j29O06k65l19J05J28k75l45L93J19l90N6M55j11m54
2646d23L0N51l31j45J64jJ01j6Q3K96k00L3P8J9k62M9o4L28l76J88k7L3m73M33
2670F8m5l29j9M60k75k25L26K40o30J15M32j39o1J60L55o55N5K77K48o19J03O10
2692D52l05K3n3L2J24n29L25J61o44N26j92K9%k54L22K84m02P1j27r6p8K1L50
2715D0p3O6J45l4n70M38M22l10j62J34L92o22J64K35K13n63K31J30l44j07M8K15
$$ y = [94, -155, 156, 198, -112, 325, 422, 140, -60, 68, 284, -62, -277, -184, 14, -270, -254, -388, -103, -139, -326, -22, -99, -214, -285, -83, 318, -341, -435, 143, 214, -165, 45, 308, 239, -207, 154, 333, 100, -42, 442, 52, -60, -110, -250, 36, -90, 180, -53, -217, -329, 2, -215, -81, -116, -517, -39, -310, -53, 167, 34, 87, 5, -56, -112, -21, 396, 271, -174, 84, 396, 3, -126, 480, 215, -104, 1, 129, -146, -491, -98, 21, -369, -313, 142, 31, -423, -393, 158, -173, -318, -154, -155, -54, -70, 13, 309, 109, 142, 220, 239, -23, 26, -38, 290, -86, 102, 75, 108, -365, 68, 23, -306, -325, 135, -140, -365, -39, 201, -429, -314, 118, -21, -82, 78, 433, -222, -167, 110, 358, -261, -158, 452, 147, 170, 117, 149, 273, -256, 69, 230, -414, 112, -80, -51, -51, -305, 17, 301, -101, -30, -157, -253, -331, -310, 40, -33, 33, 178, 144, -426, 12, 434, 124, -38, 96, 488, -134, 30, 265, 478, -85, 146, 276, -68, -175, -127, 88]
2737H8l08l28L80R7l68M03L87k07m58M05R1j60l31N38J40l46P6J88j64k41K28
2758A10p5J39k05J41r2M0j77J34j52K14k84O11l43n32K61L06m17j25O54j86n69
2779e47O00R4j53j73N15K11n15K24K21p8m50j06L61O3J6k72K68K8l28L5K04j00
2801A18n18M15l5r4J4K37n63O5M98L2k57n5L29j20j35K48K08k90j15L67L45q19
2823a25K47K74k81l04J81K7J08l39M16n6k58j85L68k8l5P0k79J14l86M75K83l43
2845e6J51k02M12j80N3N5k24m04M87J94p8k22K30j74o4J07j0j91k13M21j03l57
2867c68K98L90l69k78K77L56q47J44P9L97J28m60M09J33j87k6M61k74p8j70K85
2888C00k10j50p2K59m8k07K6J28l4j03l0N7m2j41L32l55q4K94j17K17q5K37k1
$$ y = [88, -220, -548, -168, -71, -439, -36, 351, 144, -314, 91, 182, 22, -309, 229, 369, 23, 99, 287, 123, -118, 110, 35, 174, -31, 110, 18, 58, -119, 15, -137, 77, -207, 404, 61, -471, -210, 96, -321, -446, 208, 22, -547, 53, 147, -6, -179, 336, 547, 32, 256, 477, 399, -51, -157, 204, 267, 283, 11, 279, 307, -21, 14, 218, 118, -400, 15, -20, -114, -100, 137, -426, -361, 137, 169, -88, -143, 186, 66, -69, 179, 387, 97, -18, 349, 694, -125, 122, 396, 115, -189, -8, 19, 127, -212, 204, 148, -110, -295, 73, 45, 10, 80, -199, -85, -471, 4, 287, -56, 95, -107, 305, 125, 178, 233, 9, -395, 92, 286, 208, -14, 216, 42, -22, 85, 75, -116, -329, 92, -11, -368, -70, 320, -49, -327, -50, 306, -541, -397, -318, 79, 207, -253, 156, 289, 102, 76, 537, 263, 185, 15, 300, 90, -60, -132, 127, 79, -128, -102, 26, -8, -111, -141, -84, -126, -267, 65, -290, -374, -80, -197, 20, -65, 172, 151]
2911A51k14K40J1p6K03k34J91k00J02r4j28K01L5J20l15R3k4j07l2j76K87N7k61
2934a70K82J62m05k3n1N89m00j98j6N84k36L3J98k56J56k91J56J52n96K89J23
2955H2j69K5o4j5J55L4J03j72k31J15j16RK50J0k25J36K51Qj47q5J12j01j71L23
2979A17o1L39l83j3J35L58l93k40K44j51k88K41N06o44K2J81p2N7K38k72m5k46
3001c70L63k30j3M5R8J66J08R1l0k69J78j7J03j64l9K07k87J63P8j6J73k02k9
3024A07r4p3J52k31j5J42K8J52K28n96J85J32j51k28L94l00R4RM23k71J86k47
3046B6j99L66m17K95P5j59K09k43Q2O7k78R2M3Q7j93j05M30m2m23O1M73k55j68
3069a76L08k8P2q3J55j54l5O2j5K11k06j64J11p8K64l22mK9J50m64L61M8k33O8
$$ y = [151, -63, 177, 188, 112, 315, 81, 272, 72, 174, 80, -48, 153, 188, 308, -7, 86, 62, -45, -77, -253, 34, 91, -170, 112, 274, -131, -154, -205, 384, -16, -214, -230, 354, 118, 151, 349, 93, 249, -42, 114, 266, -330, -41, 82, -87, -62, -126, -141, 14, 48, 151, -21, -252, -137, -253, -244, 6, 16, -209, -73, 178, 186, 39, -46, 66, -35, -206, 117, 56, 395, 12, -1, 134, 492, 99, -141, 103, -48, -336, -95, 411, -233, -211, -30, -102, -45, 193, -79, -124, -370, -7, -237, -250, -205, -107, 59, 167, 258, 228, -41, 137, 120, 223, 59, 20, 227, -60, 103, 181, 165, 338, 136, 107, 13, -60, 92, -139, -154, -12, 16, 168, 396, -200, -15, 117, -34, -262, 132, -168, -74, -65, 358, 87, 273, 26, -173, 193, -224, 71, 146, -13, 196, -47, 35, 102, -176, -84, -41, 46, -147, -252, 178, 136, -287, -226, 247, -8, -176, 132, 104, 176, 93, 248, 94, 59, 121, 106, 317, 111, -53, 58, -20, 244, -78, -82, -53, 97, -367, -6, 42, -191, -123]
3093a23K14k12O0j79j5K57m4m2k57q0M00l0L9K75p6k86J82J32r8r4J56l1l88J50
3117i0k12N13k92J02r0LM6o4m3j08M3r5J35R5k23J73K10o7k24J00L69j40j94n5
$$ y = [-123, 91, -121, -61, -240, -255, 2, -42, -84, -341, -421, -21, -51, -12, 263, 187, -99, 83, 215, 117, 23, 179, 148, -240, -90, -302, 211, -81, 21, -69, -66, -20, -84, -127, -235, -192, -287, -152, -57, -280, -107, 103, 36, -188, -88, 281, 141, -53, -108]
$$ [...]
8191A65
##END NTUPLES=NMR FID
##END=
