##TITLE=1H_53-91
 200.13MHz, CDCl3,
 8 sc
 
 30.9.2025
##JCAMPDX= 6.0         $$ Bruker NMR JCAMP-DX V2.0
##DATA TYPE= NMR FID
##DATA CLASS= NTUPLES
##ORIGIN= UXNMR, Bruker Analytische Messtechnik GmbH
##OWNER= pz
$$ XWIN-NMR		Version 3.5
$$ Tue Sep 30 15:54:11 2025 Russian Standard Time (UT+4h)  she@DPX200
##.OBSERVE FREQUENCY= 200.1313
##.OBSERVE NUCLEUS= ^1H
##.DELAY= (6, 6)
##.ACQUISITION MODE= SIMULTANEOUS
##.ACQUISITION SCHEME= undefined
##.AVERAGES= 8
##.DIGITISER RES= 18
##SPECTROMETER/DATA SYSTEM= spect
##.PULSE SEQUENCE= zg30
##.SOLVENT NAME= CDCl3
##.SHIFT REFERENCE= (INTERNAL, CDCl3, 0, 14.3821)
##AUDIT TRAIL= $$ (NUMBER, WHEN, WHO, WHERE, WHAT)
$$ ##TITLE= Audit trail, XWIN-NMR		Version 3.5
$$ ##JCAMPDX= 5.01
$$ ##ORIGIN= Bruker BioSpin GmbH
$$ ##OWNER= she
$$ F:/spectra/data/she/nmr/H-C/1/audita.txt
$$ ##AUDIT TRAIL=  $$ (NUMBER, WHEN, WHO, WHERE, WHAT)
(   1,<2025-09-30 15:52:52.78 +0400>,<she>,<DPX200>,
      <created by zg, POWCHK disabled, PULCHK disabled
       configuration hash MD5:
       00 E9 B6 7A A2 85 ED C7 34 08 36 98 17 FE 4E 26
       data hash MD5: 16K
       CB E8 37 3E 01 E6 2E 11 6D AC 88 D1 3B 17 91 8A>)
$$ ##END=
$$ 
$$ hash MD5
$$ D1 1D 6B BC 35 57 10 BD 79 F4 E6 FD 86 46 A6 CE
##$RELAX= 
##$RELAX= 
##$RELAX= 
##$RELAX= 
##$RELAX= 
##$RELAX= 
$$ Bruker specific parameters
$$ --------------------------
##$DU= <F:/spectra>
##$EXPNO= 1
##$NAME= <H-C>
##$PROCNO= 1
##$TYPE= <nmr>
##$USER= <she>
##$AMP= (0..31)
100 100 100 100 100 100 100 100 100 100 100 100 100 100 100 100 100 100 
100 100 100 100 100 100 100 100 100 100 100 100 100 100 
##$AQSEQ= 0
##$AQ_mod= 1
##$AUNM= <au_zg>
##$AUTOPOS= <>
##$BF1= 200.13
##$BF2= 200.13
##$BF3= 200.13
##$BF4= 200.13
##$BF5= 200.13
##$BF6= 200.13
##$BF7= 200.13
##$BF8= 200.13
##$BYTORDA= 1
##$CFDGTYP= 0
##$CFRGTYP= 5
##$CHEMSTR= <none>
##$CNST= (0..31)
1 1 145 1 1 1 1 1 1 1 1 1 1 1 1 1 1 1 1 1 1 1 1 1 1 1 1 1 1 1 1 1 
##$CPDPRG= <>
##$CPDPRG1= <>
##$CPDPRG2= <>
##$CPDPRG3= <>
##$CPDPRG4= <mlev>
##$CPDPRG5= <mlev>
##$CPDPRG6= <mlev>
##$CPDPRG7= <mlev>
##$CPDPRG8= <mlev>
##$CPDPRGB= <>
##$CPDPRGT= <>
##$D= (0..31)
0 0.7 0 0 0 0 0 0 0 0 0 0.03 0 0 0 0 0 0 0 0 0 0 0 0 0 0 0 0 0 0 0 0 
##$DATE= 1759233172
##$DBL= (0..7)
120 120 120 120 120 120 120 120 
##$DBP= (0..7)
150 150 150 150 150 150 150 150 
##$DBP07= 0
##$DBPNAM0= <>
##$DBPNAM1= <>
##$DBPNAM2= <>
##$DBPNAM3= <>
##$DBPNAM4= <>
##$DBPNAM5= <>
##$DBPNAM6= <>
##$DBPNAM7= <>
##$DBPOAL= (0..7)
0.5 0.5 0.5 0.5 0.5 0.5 0.5 0.5 
##$DBPOFFS= (0..7)
0 0 0 0 0 0 0 0 
##$DE= 6
##$DECBNUC= <off>
##$DECIM= 32
##$DECNUC= <off>
##$DECSTAT= 4
##$DIGMOD= 1
##$DIGTYP= 9
##$DL= (0..7)
0 120 120 120 120 120 120 120 
##$DP= (0..7)
150 150 150 150 150 150 150 150 
##$DP07= 0
##$DPNAME0= <>
##$DPNAME1= <>
##$DPNAME2= <>
##$DPNAME3= <>
##$DPNAME4= <>
##$DPNAME5= <>
##$DPNAME6= <>
##$DPNAME7= <>
##$DPOAL= (0..7)
0.5 0.5 0.5 0.5 0.5 0.5 0.5 0.5 
##$DPOFFS= (0..7)
0 0 0 0 0 0 0 0 
##$DQDMODE= 0
##$DR= 18
##$DS= 0
##$DSLIST= <SSSSSSSSSSSSSSS>
$$ [...]
##$SUBNAM0= <"">
##$SUBNAM1= <"">
##$SUBNAM2= <"">
##$SUBNAM3= <"">
##$SUBNAM4= <"">
##$SUBNAM5= <"">
##$SUBNAM6= <"">
##$SUBNAM7= <"">
##$SUBNAM8= <"">
##$SUBNAM9= <"">
##$SW= 18.0517328524113
##$SWIBOX= (0..15)
0 0 2 0 0 0 0 0 0 0 0 0 0 0 0 0 
##$SW_h= 3612.71676300578
##$TD= 16384
##$TD0= 1
##$TE= 0
##$TE2= 300
##$TE3= 300
##$TEG= 300
##$TL= (0..7)
0 120 120 120 120 120 120 120 
##$TP= (0..7)
150 150 150 150 150 150 150 150 
##$TP07= 0
##$TPNAME0= <>
##$TPNAME1= <>
##$TPNAME2= <>
##$TPNAME3= <>
##$TPNAME4= <>
##$TPNAME5= <>
##$TPNAME6= <>
##$TPNAME7= <>
##$TPOAL= (0..7)
0.5 0.5 0.5 0.5 0.5 0.5 0.5 0.5 
##$TPOFFS= (0..7)
0 0 0 0 0 0 0 0 
##$TUNHIN= 0
##$TUNHOUT= 0
##$TUNXOUT= 0
##$USERA1= <user>
##$USERA2= <user>
##$USERA3= <user>
##$USERA4= <user>
##$USERA5= <user>
##$V9= 5
##$VALIST= <valist>
##$VCLIST= <CCCCCCCCCCCCCCC>
##$VD= 0
##$VDLIST= <DDDDDDDDDDDDDDD>
##$VPLIST= <PPPPPPPPPPPPPPP>
##$VTLIST= <TTTTTTTTTTTTTTT>
##$WBST= 1024
##$WBSW= 4
##$XGAIN= (0..3)
0 0 0 0 
##$XL= 0
##$YL= 0
##$YMAX_a= 680098
##$YMIN_a= -647759
##$ZGOPTNS= <>
##$ZL1= 120
##$ZL2= 120
##$ZL3= 120
##$ZL4= 120
##$ABSF1= 10
##$ABSF2= 0
##$ABSG= 5
##$ABSL= 3
##$ALPHA= 0
##$AQORDER= 0
##$ASSFAC= 0
##$ASSFACI= 0
##$ASSFACX= 0
##$ASSWID= 0
##$AUNMP= <proc_1d>
##$AZFE= 0.1
##$AZFW= 0.1
##$BCFW= 1
##$BC_mod= 2
##$BYTORDP= 1
##$COROFFS= 0
##$CY= -3
##$DATMOD= 1
##$DC= 2
##$DFILT= <>
##$DTYPP= 0
##$F1P= 0
##$F2P= 0
##$FCOR= 0.5
##$FTSIZE= 0
##$FT_mod= 4
##$GAMMA= 1
##$GB= 0.15
##$INTBC= 1
##$INTSCL= 1
##$ISEN= 128
##$LB= 0.25
##$LEV0= 0
##$LPBIN= 0
##$MAXI= 10000
##$MC2= 0
##$MEAN= 0
##$ME_mod= 0
##$MI= 1.114404
##$NCOEF= 0
##$NC_proc= 0
##$NLEV= 6
##$NOISF1= 3.799351
##$NOISF2= 2.8
##$NSP= 1
##$NTH_PI= 0
##$NZP= 0
##$OFFSET= 14.38212
##$PC= 1
##$PHC0= -1720.684
##$PHC1= 21.19226
##$PH_mod= 1
##$PKNL= yes
##$PPARMOD= 0
##$PSCAL= 0
##$PSIGN= 0
##$REVERSE= no
##$SF= 200.129724274929
##$SI= 16384
##$SIGF1= 3
##$SIGF2= 2
##$SINO= 400
##$SIOLD= 16384
##$SREGLST= <1H.CDCl3>
##$SSB= 0
##$STSI= 0
##$STSR= 0
##$SW_p= 3205.1282051282
##$SYMM= 0
##$S_DEV= 0
##$TDeff= 0
##$TDoff= 0
##$TI= <>
##$TILT= no
##$TM1= 0
##$TM2= 0
##$TOPLEV= 0
##$USERP1= <user>
##$USERP2= <user>
##$USERP3= <user>
##$USERP4= <user>
##$USERP5= <user>
##$WDW= 1
##$XDIM= 8192
##$YMAX_p= 0
##$YMIN_p= 0
$$ End of Bruker specific parameters
$$ ---------------------------------
##NTUPLES= NMR FID
##VAR_NAME=  TIME,          FID/REAL,        FID/IMAG
##SYMBOL=    X,             R,               I
##VAR_TYPE=  INDEPENDENT,   DEPENDENT,       DEPENDENT
##VAR_FORM=  AFFN,          ASDF,            ASDF
##VAR_DIM=   8192,          8192,            8192
##UNITS=     SECONDS,       ARBITRARY UNITS, ARBITRARY UNITS
##FACTOR=    0.0002768,     1,               1
##FIRST=     0,             0,               0
##LAST=      2.2672688,     0,               0
##MIN=       0,             -647759,         0
##MAX=       2.2672688,     680098,          0
$$ Real data points
##PAGE= N=1
##DATA TABLE= (X++(R..R)), XYDATA
$$ [...]
1088b089L313J435l550k03L305j021k990K117J749l392n59L194j189k325J842
1103c63J781k526n75K933m78k301J778J773k470k06K596j091k063J536J431k473
1119g18q99K707p68k818K174J967l258m64L536n24k984J761K917k762j661L904
1135B110j36l921J602L116k741k115K823O46l220M97K858j950k115L124P32k832
1151a522O39K442j287j429K399N13k851P18K822k247k072K897L20l231J098K332
1167A541k322j654L106R25l753O14L620j853k074L047P59l045M51K991j383k882
1183a912K197J956l077o67K767r06k478J856J503k280o01K531p8k316J450J725
1199A670k112k68K419p62k021J441J007j792n84K094o78k231J679J439k542m92
$$ y = [-2089, 1224, 2659, -891, -1094, 2211, 1190, -1800, 317, 2066, -1326, -1885, 1309, 120, -2205, -363, 1418, -1108, -1683, 1250, 772, -1529, 249, 2022, -448, -654, 1942, 851, -1212, 324, 1755, -718, -1617, 1090, 322, -2496, -322, 1645, -1613, -2077, 1459, 935, -2049, -288, 2629, -133, -1794, 2110, 1974, -1947, -345, 2771, 30, -2085, 738, 1384, -1836, -1339, 1519, -431, -2546, 578, 1310, -1522, -883, 1559, 272, -1157, 1242, 1755, -1096, -378, 2444, 197, -1875, 1022, 1342, -1889, -791, 1541, -781, -2435, 671, 1596, -2157, -1543, 2077, 224, -1850, 1197, 1956, -1089, -638, 2353, 970, -1912, 285, 2241, -836, -1503, 1264, 358, -2120, -264, 1239, -1041, -1642, 889, 811, -1505, -55, 1670, -442, -710, 1709, 947, -1074, 367, 1374, -418, -1002, 1092, 414, -1817, -138, 1301, -1241, -1733]
1215a733K722m29k222J328J966j688j357K702N71k952O49K302j465j741J964M44
1231A061k231J66K186j188j913K052Q71k202N25J803j124j040J773O84j872Q8
1247c61J963j022j528J546M26k104L77J828j321j566J752R29k090k05K538q84
1263B78j832K160J028k226k08K430o49j867J152J222j872o45J954n08j833J149
1279b67J001j449m74J406j4j242R34J116j262k42J503k48j315R58P04j252m75
1296f18J351j60j813Q14J369j641o55J791j71j445P93J335r24p87J446L70j536
1313d81M16J335j117p90J212K14j442l1J227m26j337R98P01j296P4J282m64p78
1331g03Q53P48r82k13J190k77j097R33M85j453L8J206p30r03O90P06j126l55J516
$$ y = [-1733, 989, 560, -1662, -334, 1632, -56, -1413, 1289, 1860, -1092, -443, 1859, 394, -1347, 617, 1061, -1170, -1004, 1182, -6, -1919, 133, 1004, -1198, -673, 1130, 6, -1034, 739, 1423, -449, -361, 1602, 580, -948, 598, 1024, -1080, -703, 1125, -196, -1762, -10, 919, -1171, -1376, 1162, 278, -1554, 606, 1634, -592, -800, 1630, 981, -886, 266, 1488, -384, -1029, 925, 417, -1416, -267, 734, -715, -1189, 217, 203, -1039, -105, 1011, -251, -493, 1010, 762, -553, 405, 1109, -143, -618, 733, 573, -1240, -426, 943, -698, -1353, 438, 267, -1178, -385, 950, 26, -761, 685, 1055, -481, -65, 1270, 153, -637, 575, 789, -653, -684, 543, 117, -1220, -222, 479, -817, -743, 539, 75, -703, 150, 898, -84, -297, 893, 616, -481, 452, 937, -516, -478, 728, -2, -905, -215, 491, -635, -990, 526]
1350E26k46j223Q18J277j308l93J450o2j299N06J106j116q40J417J8j536L83J056
1368E34r50n64R93K46j044K77J313q16p10J391J44j316O06Q46n89p61P87K28j169
1387e54J49J090j043p09J251J17j100K50J137m51q22Q54O82j066K4J191n35r40
1405d75P96L92j021j45R26m08r36O16P31j034k84J185k22q44N61P69n98l03P96
1424E02J45q20J60R12q43m82P87k09p15L48M50n68o03J057L46j254K81J235o89
1443D0n52R77K89q91M1Q92k99r25O01M73j048k8Q53n77p35P92M19q60j92J269
1463E39k37j101Q77R11j132l19J240l10r28M96Q98r74n88R44j12r88O47N44r80
1482e73j36J067j92p94O12P71p61n06J221j5j089M80Q07q10n62P88K9r55J53Q53
$$ y = [526, 280, -943, -125, 1152, -156, -549, 901, 839, -460, 46, 1152, 36, -804, 613, 631, -905, -522, 534, -416, -980, 13, 259, -785, -508, 805, -11, -721, 670, 814, -502, 104, 950, 361, -400, 387, 615, -554, -405, 685, -358, -1067, 184, 301, -799, -549, 588, 137, -685, 169, 851, -215, -191, 1000, 465, -475, 321, 713, -308, -453, 473, 65, -871, -255, 476, -558, -842, 343, 121, -723, -162, 607, 9, -294, 502, 647, -173, -13, 899, 56, -426, 361, 152, -563, -215, 235, -333, -936, 121, 467, -787, -506, 729, 40, -512, 465, 754, -137, -96, 796, 497, -428, 173, 646, -402, -430, 423, -154, -889, -97, 322, -538, -730, 539, 302, -799, 78, 989, -143, -462, 778, 468, -460, 36, 934, -40, -628, 316, 204, -784, -137, 407, -573, -709, 358, 166, -628, -16, 755, -6, -512, 709, 694, -395, 85, 892, 82, -480, 308, 337, -618, -465, 388]
1502C88o74l94Q54j04p66N53P14o22m21R14L65j093K30J029o90p14P29J96q83
1521c89p5O73o9o90K48M87n87kP47k50n69P06K60o27M7P12k27o61L30O43r77j78
1543d48P83j82p80J51O71l46n45P19K66p18J79Q35o23l47Q85O1p10J40O54n28
1563A17o37O99L86j085O9R59o16o65P46K27o82J52R43m12o36N83L81q13J89P09
1583F14l98o81O77K37p80j57R63n21q11R27K31r02J67Q49l78n01O85M75q24j27
1603b55R80k98r56O88L77p87j49P84l26o54M43M85o67k33Q56k34n24M19M91n61
1623a21n5N73Op26M79N26p36l31Q15k61p79M33L70n31k69P47j3o38K34P78n29
1644b8l29O63J21o46K38N59l68m87M99J76p62n9P10l40n51N66K03o10J02N66k28
$$ y = [388, -286, -680, 174, 70, -696, -143, 571, -51, -472, 442, 807, -286, -56, 973, 283, -431, 298, 494, -389, -464, 209, 140, -550, -302, 185, -402, -404, 343, 93, -476, 230, 490, -137, -90, 622, 395, -266, 64, 707, -270, -448, 335, 153, -627, -476, 195, -151, -696, 23, 289, -429, -250, 585, -38, -385, 500, 561, -149, -9, 645, 117, -520, 179, 565, -520, -451, 508, -108, -773, -27, 200, -482, -330, 613, 201, -435, 148, 529, -284, -95, 614, 216, -465, 212, 449, -331, -488, 475, -46, -857, 70, 301, -601, -434, 415, 37, -464, 221, 696, -128, -255, 725, 427, -529, 159, 536, -251, -400, 384, 58, -596, -153, 332, -335, -568, 288, 54, -470, -51, 440, -121, -176, 397, 403, -323, 156, 682, -54, -385, 430, 169, -610, -177, 193, -338, -607, 140, 127, -511, -277, 501, -28, -357, 306, 427, -219, 19, 578, 210, -277, 222, 398, -364, -423, 287, -53, -604, -38, 165, -445, -343, 223, -5]
1665em22N41M03o75K9O55l89n42O97J16n48j25M75j08p95N13M12o29q9P41k07
1686D8m89M21M40n03j70P74j12q66M87N27p22j71O75j53n46J56L50l40k74O91
1706B23j33m84K55M95m66p9M96j27m14J46M97m34k25M90Ko05K66M23o09k24N84
1727G7J31o67R8O00k97l27N86J64n09J85M86m04k84K80K18n05JM41j38m87M11
1748F0J0m31J06L07l2l68L89L85n57J8M63j06m84L68J63l36j76M91j14n03J86
1769a61M21m98j47N53m5n02K23O17m78k56M68Q8n04K22N20m90j91M05Nn42R9L22
1791A29k52k03L31N6m79J28N23l23j42L99R3m87K78L25k40k55K86J88o21K04L40
1812B78l51l44M65J40n25L2N04k71l04N08K11n70J33M37j83k40J12L21m16nK46
$$ y = [-5, -427, 114, 517, -158, -129, 526, 137, -405, 292, 408, -140, -265, 210, 102, -693, -180, 232, -397, -486, 255, 48, -441, -20, 420, -83, -253, 521, 409, -457, 30, 557, -165, -336, 339, 186, -360, -204, 146, -194, -468, 223, 90, -394, -139, 356, -110, -189, 307, 180, -234, -88, 409, -25, -250, 240, 242, -363, -97, 326, -283, -507, 77, 208, -459, -361, 239, -58, -385, 201, 365, -144, 41, 527, 123, -161, 119, 337, -168, -167, 274, 136, -351, 60, 70, -361, -255, 52, 20, -348, 41, 426, -131, -113, 350, 244, -240, 128, 291, -45, -221, 270, 156, -347, -161, 260, -238, -385, 168, 123, -379, -156, 461, -17, -273, 195, 283, -221, 1, 521, 31, -160, 245, 250, -292, -193, 129, -123, -326, 5, 61, -418, -290, 233, -90, -232, 167, 260, -227, 51, 376, 136, -119, 167, 355, -266, -62, 278, -73, -417, 48, 188, -337, -305, 199, -72, -376, 132, 343, -227, -94, 343, 160, -80, 32, 353, -63, -68, 178]
1833A78r1m49M02m6k75m5L80j92j80L13J86l19o5N11j96k01K96l6k64J01K56j05
1855A59m07J98K14k96l18M92l3k01M0K05r6p1K21J90l91J99J58j95j32L49m7l06
1877f8J06J46j33l56L17J44m64p6M78j81j91L90j0k07qM37k81j54J98J94l42o3
1899a24L79k40l47L04J93m01M2K66n3k93K57J47k64O7L16j1k53K10O7k66rK46
1921B33j72k76J26K78l28j83M19p3l79K15J86j25j36L54j26j90J99J14r5o0L03
1942B84j28l34J97J19k23r2K19o4k57J95J75j16o2J08P4j02J3K27j91j17K69j06
1964H8j18L7K10k75j59J28K16k93K8J63n6j62J12J73j24j14L38l7j65P4J46j49
1986F1p6J36K3k03J03J52j99j75K85lj70j9J35k52M6L91j36j55N5J34j28nJ50
$$ y = [178, 87, -362, 40, -6, -281, -326, 54, -138, -318, -5, 181, -138, -203, 308, 112, -89, 207, 171, -93, 8, 264, 159, -248, -50, 164, -132, -450, 42, 9, -192, -152, 53, -43, -114, 107, 297, -94, 105, 263, 68, -64, 285, 238, -68, 38, 184, 51, -305, 12, 156, -308, -384, 94, -87, -278, 112, 102, -105, -113, 324, 43, -111, 87, 281, -61, -124, 255, 15, -332, -28, 165, -236, -194, 72, 19, -274, -17, 130, -134, -67, 249, 238, -15, 195, 262, -4, -13, 233, 61, -215, -89, 189, -139, -322, 97, 24, -355, -140, 46, -79, -215, 139, 13, -177, 22, 136, 41, -19, 284, 156, -178, 19, 138, -85, -177, 42, -22, -279, -84, 91, -25, -87, 21, 95, -7, 6, 233, 42, -75, 194, 88, -30, 7, 217, -58, -217, -89, 127, -166, -138, 25, -31, -193, -81, 92, -32, -146, 192, 155, -10, 64, 210, 61, -15, 121, 144, -59, 44, 196, -3, -178, 107, 104, -66, -85, 50, -202, -156, 235, 99, -56, -1, 133, 5, 0, 150]
2009A50j13j86J62J57j49j48Q3M4j72m2K89j90o1K21Q5l55K09K30j52j88L08J2
2031A94l53J52J51j05k54K77Kj13p6K21j76j50K29L5q2n0L14j92j02K52o7k02
2053i5rK14q4n3J15r0q6n6K31j29j82K79P3l32J27K29k3k61J87J23j15j25J73
2076A11L3j52J24q9j4l1K9N8k43M8J94j05oR5nk54J95Q8j42L4J94o5k45K15K36
2101C03l72o1J59m0j56R8N0k6j65K09j3j48Q4J66r0oJ30J02j93p0J22o9m9J71
2125A36n9j92K0K93k49O5J2K6j37RJ47j12k0J86P5l29J91O8j87j35K24J8j56J12
2149FJ50p9l04J97Nm9o3J81M1q7JR9j41M4J00l0j65J35P1q3m4O4p9o4J84J5l00
2176a95J24R4j37M6L1K32k10k8J28l7j33J99J0l9r5J35j53j13J06K2J1j03Q8L7
$$ y = [150, 37, -149, 13, 170, 21, -127, -44, 0, -172, -214, 75, -115, -176, 45, 130, -225, -16, 214, 62, -126, 182, 194, -159, -7, 144, 39, -215, 62, 64, -49, -125, 96, -80, -230, -1, 34, -48, -98, 216, 24, -78, 174, 107, -95, -104, 110, 26, -27, 88, -2, -88, -144, 87, -42, -224, 55, 128, -204, -77, 152, 129, -132, 55, 178, 63, -62, 111, 144, -8, 116, 27, 13, -18, 11, 69, -174, -126, 68, -37, -43, 52, 47, -207, -12, 76, -66, -32, 162, 97, -148, 67, 303, -69, -130, 29, -11, -167, -69, -19, -45, -210, -1, -14, -162, -78, 88, -2, -8, 122, 224, 31, -39, 83, 14, -35, 136, 77, -115, -95, 198, -51, 14, 26, 52, -85, -76, 71, -41, -61, 125, 200, -129, 62, 130, -57, -192, 32, 50, -106, 6, 156, 77, -227, -30, -25, -74, -137, 44, 85, -2, -1, 98, -43, 1, 101, 71, -94, 41, 112, 29, -15, 49, -30, -94, 90, 105, -195, -71, 23, -114, -68, -37, 195, -15, -43, 85, 48, -85, 114, 124, 85, -10, 125, -28, -141, -35, -13, -2, -105, -17, 20]
2200B0j78Q7J82j19o3J72M5l8o1N1r6n8R3P5k00o0J21q4JL1R8k5p6P2J09j81J96
2227A14j00j40J23J34k10L4J37j9p5j09K94j60j92M7J06o8p9K12l1n8K8R2n0q7
2251e7J25P5k32J80L8k17J81J1p0r6K1O7k10O6K63j93p8J59l1j14pJ95m9j95K25
2276E7J10j07j46J17R0k42L4J89k06mJ85r6J8j66K36k08J56K7J74j45n7N2ro5
2300fJ16M1k64J76L4j05p3L9J7q5L7Q5l9r3K09l0O3j65J18pk25K57M4k28J02J03
2326A21M8k45M8Q6j17NO4o1j70R8J92l4q9J32k4q6P9J11j12k1M7k1j21J09m6p8
2352h5R8P2j27k3K5J44r5j44J71K3j90J44J04j37NK18j05j78K55j74j3j9R1q0
2376b0p6L7L1l7m9J68n7j27J65L4r8k5Q7J44j90l4J89k00QO7Oj33J1K08j11o0
$$ y = [20, -158, -71, 111, -8, -71, 101, 146, 108, 47, 98, 2, -56, 37, 112, -88, -148, -27, -111, -110, -79, 19, -6, -82, -10, 99, -82, 114, 14, -126, -3, 131, -79, -45, 92, 73, -2, -111, 183, 23, -169, -122, -16, -84, -163, 49, 18, -40, -12, 80, 30, -57, 68, 143, -89, 91, 129, -88, 93, 104, 34, -62, -41, 26, -184, -118, 145, -48, -126, 33, 2, -112, -119, 76, 27, -168, 57, 167, 60, -86, 31, 121, -121, -87, 102, -104, -108, 77, -19, -1, -167, 69, -139, 17, 44, 218, 73, 16, 68, 59, -6, 110, 151, -113, 63, 97, -8, -81, -42, -25, -110, -73, 12, -27, -120, 89, 59, 122, -43, 75, 68, -157, 100, 144, -84, 18, 121, 169, -76, -28, 58, -59, -54, 10, -51, -221, -123, 69, 35, -54, 78, 54, -32, 47, 158, 46, 25, 72, 51, -70, 39, -7, -85, 13, 85, -42, -65, -40, 104, 9, -135, 36, 59, -131, 13, 117, -20, -15, 203, 98, -80, 175, 1, -12, -31, 60, -20, -96, -59, -28, -65, -114, 54, -3, -130, 35, 69, -29, -54, 33, 177, -13, -47, 142, -58, -50, 17, 23, -110, -99, 109, -2, -62]
2402f2K9O5n4j17K80j58K0L0R4m7LPm9n7O4k0j41RK23m6j54P8J3l5n7O4Q0n4J3
2431B1J08k24J09Q2M6r9n4R9k11M8Q1M5j71J59J9r6o8N2L5m9j4K47p0j40J91k42
2457i6R2l7J86k04j19K85m4j65lJ75j32j16K23q5M1J6K5L0q5J77j51r2N5J13j72
2482h3J33r5M5onJ33j11j26P6O5o7k0J33j09K3P1J8jp5J01Kk5l6J02j61j7J20
2509H5j40L6j13J08J9q1R3l6O0L7l7o5O7o6J14n8J9j0M5j36Q1pk03J04J44j31
2535g1MP8j02pK2J87Qj53P7j32J08M2M3j87L4J00pj36pJ06j4p2O8j7o0nJ86j45
2563e2j7J05m3O6j11K07j39qJ5K7q4J7P2j85QQ3J45k73J07N6j06j0J79Mj44J96
2589A15K1j35k4Q3j7q6M3J27j52J4J11j88O4l7K2M1p4k8J65o2p7J70M8j58O5M8
$$ y = [-62, -33, 32, -22, -139, 141, -17, 3, 33, 127, 80, 83, 90, 41, -16, 48, 28, -113, -104, 119, 73, -81, -3, 10, -25, -82, -18, 62, 8, 21, 129, -95, 14, 96, 142, 43, -11, 88, -123, -75, 6, 51, -120, 39, 58, -38, -106, -54, -19, -68, -82, 165, 95, -45, 146, -96, -4, -41, 145, -59, -178, 107, 63, -102, -105, 70, -62, -178, 45, -40, 1, 17, 42, 72, -13, 164, 13, -79, -24, 89, -83, 50, -45, 0, -6, -11, 122, 11, -115, -39, 26, -41, -61, 72, -37, -14, 57, 75, 74, -1, 100, 102, 77, 41, 143, -18, -35, 85, -55, -19, -132, -24, -5, -86, 7, -29, 31, 68, 31, -34, 33, -33, 81, 23, 42, 32, 77, -59, 22, 15, -188, -84, 60, -71, -67, 11, -91, -98, -76, 111, 119, -34, 43, -89, 19, 61, 104, -83, -49, 51, 44, -92, -99, 7, -7, -79, -11, -28, -88, -93, 93, -52, -69, 36, -7, 59, -52, 155, 16, 8, 23, 50, -34, -17, 55, -130, -122, -39, 106, -167, -60, -4, -110, -120, 59, 63, -81, 115, 136, 1, -23, 60, 43, -43, 0, 127, -25, -11, 100, -88, -24, -61, -39, 2, -72, -100, 65, 3, -74, 96, 144, -14, 51, 99]
2615I9j06P3o1M1m0K6K2j45m8J81j57K4L7J08k1K7J2K3n8q2O1O8m7Q3o7oq4M2
2643EoJ7jj5P4r1oOO3o3L0Po1O8oq3K12j68j7l1J61n8j71J11P2l9j26J11p1R7
2673B1k0k2M8m0P2J2j10J01Rnr6J16o4m5J39j14m3O3J26j90M3j06M9R7r0j6LP8
2701A6m7N0Ml2n1J84j78Q3J7j89L5J64j06n7Q6j39J75j09J34n8K8l3J42J7j69
2726c3P4j3L1r1K3Rm9O7j76J09K9J11j19rj9Q4K4j01J11J9j19N2N8r3k5J75q4
2753D5m8m3J70q2j65J26K6m2q2K20j97K7P3J2p3l2J94p1j67J84m6l2J57j37n9
2778d2K0K4jK4o5M0J42k00J8L7j7NN8J7k8Q7N1k23N1m1J0q3Q8O4j17N4M1k9p0
2807h5j3J05L0j03P7Q1k41K55p7n1J3L4O8j85Q0j2j6o4J07Mq7J32j19l2J15qJ2
$$ y = [99, -7, 66, 5, 46, 6, 32, 54, -91, -139, 42, -115, -91, -54, 54, 33, 60, 72, 95, 37, -45, 16, 84, 37, 120, 53, 47, -37, 5, -1, 16, 15, 0, 74, -17, -23, -17, 46, -17, 13, 20, -41, 27, 21, -62, 150, -18, -35, -66, 95, 37, -134, -23, 49, 10, -116, -5, -76, 21, 1, -21, 27, -13, 59, 71, -39, 62, 71, 66, -30, 86, 22, -23, 116, 2, -41, 22, 148, -42, 1, -105, -56, 41, -49, -65, -62, 16, -31, 19, 23, -9, -60, 124, -54, 29, 46, -143, -108, 56, -50, -107, -21, -160, 15, -94, 40, -18, 10, -23, 119, 136, -33, 41, 28, 59, -32, -9, 0, -49, 18, -158, -49, -20, 91, -28, -37, -56, 28, 52, -49, 62, 81, -38, 14, 72, -21, -46, 129, 45, -3, -46, 124, 42, -123, 3, 29, -13, -95, 125, -72, -45, 28, 40, -33, -65, 129, 58, -109, 75, 29, -3, 154, 17, -42, -22, 2, 1, 25, -40, 0, 142, -58, -40, -3, -20, -15, 43, 60, 32, 119, 170, -53, -2, -43, -33, -116, -28, 36, -81, -27, 14, -15, -85, -98, 7, 37, -66, 11, 92, -149, 106, 29, -22, -9, 25, 93, -92, -12, -24, -40, -104, 3, 7, -80, 52, -67, -99, 16, 8, 20]
2834B0o9J7N3J43k35K22j10m9K5K7j1r9J15m9o5J3k3J52j00K0M8j0j4L4l4J9k9
2861A1O4r7J9j2n9P9K7n6j24J08m6o5J05P7J3p7J7m6P1m1M4L5o0P9j9Q8j79k1
2889f5J19j96l0K40j02m2L5M0N3k06K74o8n6P9N5j04o6J16l4k5j3L5j20k7M2J
2915f5n6J44l6J6m5L4J63j96K8J03j16QJ48p1P7j06J9O0k23M4J58l7j02P8j02
2940g5J37r1m5k7J97q7Q5p7kQ8N2j70J02j02o7K9L5p6M0mjp4J58r0%m5J92L1l0
2969H3K3l9m2J61Lj39J3q2J19J1j22J24r0r7J60o0k4k09K51m8p7o0J45M7o6J6
2995AQ8j57O2Rl6j36J58K7l9jl1J02j57M4Q8k2o7J72Rj55P4j2j49J57M4L7j27
3022a7o1K35r4n7r0J15o0l2J17j35J4M0L1n0O5pM7j83J61n1p4P0K9lm6k1O6p1
$$ y = [20, -49, -32, 21, 164, -71, 151, 41, -8, 17, 44, 33, -66, 49, 0, -65, -52, -75, 77, -23, -3, 45, 35, 21, 55, 21, 40, 11, 75, -22, -3, -15, -74, 5, 32, -24, -148, -40, -86, -151, -46, 31, 44, -33, -16, -62, 9, -32, 12, 47, -13, 66, 47, 135, -44, -65, 54, -142, -172, 68, -34, -76, -41, -1, 52, -154, 120, 52, -4, 75, 130, 26, -40, 76, 42, 17, 4, 39, -81, -108, -66, -65, -121, 23, -13, 3, -42, -8, 155, -41, -13, 90, -26, -18, 130, 59, 136, 30, 49, 109, -114, -70, 88, 51, -51, 27, -75, 62, -29, -74, -101, 96, 9, 94, 17, 15, 103, 155, -15, 87, -15, -82, -53, -18, -94, -54, -58, -59, -133, 25, -65, -65, -110, 82, 113, 83, 106, 67, 25, 186, 189, 50, 63, -19, 100, 111, -11, 113, 23, -74, 86, 26, 2, -207, 44, -4, -81, -141, 4, 51, -15, 1, 89, -68, -6, 3, -33, -169, -11, 16, -23, -24, -55, 47, -110, -66, 22, 0, -67, 105, 114, -41, 33, 21, -128, 29, 73, 110, -17, -78, 157, 63, 6, -84, 31, -29, -61, 56, -79, -65, -25, 6, -44, 21, 14, 61, -122, 39, -12, -86, -16, 13, 10, -36, -57, 9, -62]
3050f2m7J46KL6j8J01j98P1L5K3j4m5M7K9j34J63p3o5J0m7np3J03J6j21K30o0
3077E0j20P3L1N1j01P7j7l9N9J1j9j30J55J2j63O0r9R8j3M7L1r2o8J07K4K3m6
3104BRjkl4N8m0N8J04j24j47J6J36j88J45p1Q3j4m2p0O6J62j08O1o5J60l5n6m2
3132B1J11j61O2j0j00m2R7J16k40J72O6o0n6L4Rn0j6J25j7j09N0K0m6M5j47M0
3158h6J8l0J22j11J49j6n5n7P4M4n5m3Q2QJ11m7J8r3l4n6J25o6j39K41nj42j2
3185e5O5r6Q5O9j0j17J90Lm5q7Q1j52J05K0j04J40j04P3j03p3J35L7j93J64j31
3210a03J74o1j11J28k4N0q1J06m0j04J26j3j88J36K6no5J10l2k1L3Q8j41QR2j60
3236g2R2j07J91j03l4n1O7K2j5Or1O8N1j90qJ34J24j79J87l3jj95J71m6J4R0j21
$$ y = [-62, -109, 37, 39, 75, 57, 158, -40, 31, 66, 89, 75, 30, 77, 106, -28, 135, 62, -3, 7, -40, -45, -118, -15, 1, -120, 110, 50, -70, 3, 34, 85, -16, 61, 44, 5, 64, 75, 56, -74, 81, 93, -70, -10, -109, -11, -24, 23, 54, -38, -106, 1, 25, 48, 2, 11, 10, 8, -26, 32, -8, 50, 154, 30, -117, -101, 35, -153, -8, -79, 4, -10, -52, -122, -56, 106, -2, 59, -6, 154, 119, 63, 21, 132, -29, 33, 23, -77, -119, -22, 94, -146, 26, 92, 32, -24, 10, 19, -31, -47, 78, 61, -48, 2, 22, -24, 21, -126, -86, -68, -98, 24, -87, 62, 46, -9, -66, 8, 52, -3, -46, 36, 44, 155, 108, 126, 33, -1, -57, 68, 2, -137, 104, 99, -43, -55, 10, -86, -1, 68, 58, -59, 131, 134, 89, 2, 83, -69, 36, 56, -48, 92, -12, 61, -42, -115, 20, 57, -136, 28, -103, 71, 10, -101, 27, 3, 53, -28, 78, 38, -66, 60, 47, -141, -5, 21, 16, -49, 61, 29, 8, 41, 129, -12, -4, 88, -72, 20, -87, 104, 1, -33, -84, -17, 5, -10, -4, -95, -27, 24, -166, -174, -40, 84, -95, 92, 59, 58, -137, 34, -12, 2, 92, -29]
3263b9J70j35l3L7k2k9M9o7J10l%r7K6l6J04p4Q4o4N1j6L7l7q3L1j5J09n2J3O4
3292I3p9q3R1j14Q2j0L2j64J72l4L9o4O0L1p7o6J21J13j68k9J69m2j06pR6L0N
3319I1j23M6Q3o4p8L7M7O1j00n1J16j1Or4Q0p8p8kK2J0j8J00M8q5O1n8L8kM9q1
3349b8J41l5P1j19j12J45mm6J09j38N6j05m4P4p3Q2nML5M8l5J2O0r7J8l4OR0q8
3378a2M1Km1q3Q9m9J20j11j3j4J9J06n2L9p5J2J8J2J17j36KJ4KM1o4rK8j8M0J1
3408C6k3rP1l4r1M4K9j2J3M5j04N6O7j24r0N7R6j35J63j2o9k3k0J92k02M6L1o
3436hj5K5J33j00j25K01l4n3P0rj08N6L4n9p0Q7n1n7Q6o3R1K4j73N1K7P6n5K8
3464IK2q6K5M8n6N1n8L5P1n5n0k1J1L9k2M2o1J12j53JJ32J8n1Q2j3l6r6l7J21
$$ y = [-29, 141, 6, -27, 10, -12, -41, 8, -59, 51, 48, 48, -49, -23, -59, 45, -29, 55, -9, 42, 26, 63, 26, -57, -26, -41, 68, 16, 29, 93, 14, -69, 22, -92, -10, -20, 12, -152, 20, -14, 25, -39, 21, 52, -25, -91, 30, 143, -25, -54, 115, 73, -33, -40, 56, 86, 91, -32, 14, 97, 33, -45, -8, 39, 100, 0, -51, 65, 54, 60, -34, 46, -32, -110, -112, -90, -80, -98, 2, 50, -35, 26, -32, 6, 4, 53, -28, 113, 78, 149, 30, -82, 63, 59, 13, 122, -16, 40, -65, -109, -35, -108, -26, -31, -27, 8, 56, 21, 33, 93, -4, 14, -20, -14, 76, -12, 29, 31, -10, -93, -4, -53, 67, -44, -57, -71, -52, 54, 2, 41, -34, -22, -4, 8, 125, -11, -9, 5, 7, 48, -16, -25, 3, -15, 25, 36, 13, 4, 75, 41, -50, -6, 23, 11, 24, 69, -35, 21, 88, -36, -126, -69, 27, -108, 55, 43, -26, -49, -69, 123, -79, -33, -2, -8, -23, 2, 135, 35, -90, 111, 77, 24, 94, 85, -23, 33, 67, 8, -62, 25, -26, -83, 3, -60, 31, 55, -118, -67, -40, 36, -19, 9, 31, -55, -30, 18, -38, 13, -45, -10, 61, 6, -44, -65, -54, -15, -37, 5, -56, 56, -97, -96, 36, 54, 3, 85, 72, 36, -60, -97, 24]
3493B4J0q4M3j7r1K25j70K1J06j04K3J2J3L7k9N7p0p9Q0L6n0L0R2k64J10Q6p2
3520b5nn0J17M7p1j01K0K2k1J21K8l4L1j58J63l6%p4N8r5M7J11j94L7O6R2j90
3547i4J40j19R5j03J27m0M8m4m9OP2n8K9r3J33M8j84J07O2j9o4L4k8j06M9O4P2
3574H5n6K3j16P7J14j65N6j6o1J09j12rK02j36P5j02Q2N6p0n2J6o1N6K2m3p6N4
3601d8n2oJ13k2J4J5o9M8jq6J33p0p5J06J33j94J70k40J80p1M5K8o8K7k3j2q5
3628a10q5K15n4J09j22RJM6k4P2q6L0N2n0M1R6p9r7J69j98O6j4K0j5m1j02K13
3655F2r8J76j62J04K0j02J0pJ0M1j06Q0Q9n5J7j51Q8k1M1Kp2j0J7m2P0j32J52
3682B1Joj7J04p4r8J50q7k5K1R5n8j7j00J17q0O1rp6J32J0J3p2N3Q0l8m7L6m1
$$ y = [24, 34, -50, -7, -24, -115, 110, -60, -39, 67, -37, -14, -2, 11, 48, 19, 76, 6, -73, 7, 43, -7, 23, 115, -149, -39, 47, -25, -30, -80, 37, 84, 13, -88, -68, -46, -67, 54, 82, 48, 79, -79, 84, 48, 48, -26, 32, -63, -16, 95, -99, -62, 4, 96, -94, 46, -73, 22, -81, 46, 6, 54, 10, -39, -33, 39, -19, 10, -83, 50, 98, -86, 21, 83, 64, 0, 34, 6, -100, -51, 13, 85, 29, 52, -64, 13, 127, -38, 18, 2, -59, 50, -62, -71, 131, -5, 70, -32, 50, 106, 36, -16, 0, -61, -5, 17, -26, -102, -48, -100, -106, 7, -15, -1, 14, -55, -7, -8, -94, 39, -31, -106, 0, 133, -61, 109, -131, 49, -22, 23, 51, -17, 10, -13, -25, -110, -195, 20, -34, 75, -47, -38, -37, 9, -15, 57, -29, 1, 53, 3, 44, 140, 61, -36, 133, -65, 1, -13, 7, -8, -49, -151, 62, -36, 140, -22, 82, 102, 0, 10, 3, 13, 54, -52, 28, 117, 62, 79, -72, 16, -5, 36, 38, -34, -44, -27, -69, 1, -131, 21, 22, 16, -1, 103, 29, -69, 81, -6, -31, -10, 85, 27, 10, -90, 27, -53, 8, -1, -77, 55, 65, 78, 6, 59, 139, 101, 54, 90, 49]
3711D9J28p6p3m0R0j03M4r6R2l6L0J8p0k6P9J08o9n7l1J69p9n4m7K9J59q7o7p6
3739i2J8K5j6K28j50l8Nn2J92l4q1m5J09j12M1k8Q8l4L3j0j25M4O8k5j96J17j19
3766a89J41J23o5j54J44M7n7K0j4l4J8M7N5r7Nj8N5ol1J22j65J7M7j4M0o5R5%
3794F7K2j74K18j13m%jN1n1N9K6j45P9L1l1j1j26N0J7p2J25L5p6OJ16L6j30M1
3822D5Mo4L6m9M0P2j37M6O0o9N8j16K7J12j62J4k8P3k3N1L4M0j82J91k1r1J1R3
3850F5L4j67J73n8p5J11o5Pj00m7J22o4R4l3OM6l8P8j74J04j8l3m0J43j1j28N6
3877a2Q7m2n8j3j4QK8o3K15j39o8J9J14j1ok2k4l1n9J00R4j13L2Jj38J25p7L4
3905c3j2J40j26N1Qj54J91j24K0O1m6N6r0J07q9Kn3J56r7L9k6L3J2j33J68p4R
$$ y = [49, 177, 101, 28, -12, 78, -25, 19, -77, 15, -21, 9, 27, -43, -69, 10, 118, 49, -8, -39, 130, 51, -3, -50, -21, 138, 51, -16, -92, -74, -49, -65, 163, 13, -25, -20, -72, 120, 86, 5, -40, 69, -43, -2, -30, 58, 24, 57, 47, -78, -34, 34, 9, -187, -70, -189, -48, 75, 10, -144, 0, 47, -10, 10, -4, -38, -20, 27, 82, -15, -10, -28, 27, 21, -10, 112, -53, -36, 11, -3, 37, -28, 67, 67, 89, -85, 133, 20, 16, 16, 15, 66, 15, 74, 100, -45, 34, 65, 34, 23, -103, -53, -36, -108, 17, 52, -24, -18, 98, 134, 4, 45, 49, -15, 21, -28, 12, 84, -53, -7, 53, -16, 42, -74, -47, 65, -97, -83, -111, -38, -61, -10, 24, 64, -118, 73, 52, -39, -28, 65, 99, -68, 105, 47, -28, 83, 18, 25, -75, -122, 0, -64, 30, -3, 3, 49, 11, 89, -85, 19, 1, -32, -72, 71, 60, -68, -12, 75, 33, -25, -38, -52, -44, -16, -79, 136, -3, -71, -52, 62, 51, 45, 23, -1, -32, -91, 9, 103, -10, 22, 23, -115, 10, -67, -33, -45, 95, -31, 20, 28, -126, 65, -59, -39, 22, -24, 32, -58, 49, -40, -38, -91, 65, -32, 7, -19, 14, 26, -107, 61, -13, -4]
3932do9O0Rl3lJ47j07j3k8J1J81j41Pk4o1R9j02n9K41j51j5J32o8m4J27j18R3
3959F7q9J10m1q0J19j17l1L3N6l4Oq7R4q0K1J13q6k1P3m9J08k6q5P6j1kj34J07
3987A0O4jl1q2J17j20k9J4P9o1m8P2p2J59j7j77J86n4k0R0p0n7J7JJ28o0l6q0
4015g8N0k7q9J73j66R8K1P0j10M5l8J30r6q4Q3J9j9Q2p2K7o8Q4l2k6J07r5j1m9
4043g1M6L6N3k1l5R2o0j0l1j06K05j43k8N5M6j4p8p3J38M6j52Q1N2J31k36M0O9
4070C2l3L5KJ25j90L8N1k4j11L1Q1J5M7j40K1j1j5P1ML4N2j31Q5o7J34j26J27
4097A37j53J00J4j22J40j17j3p3J33j42J06j38O6R9L0j68J44j3m2n1J10Q2j86
4120e7J55l8j00l7K6N6Q4j33M4o4M8J24k93K14j16J52n1J8J07j73J0J10n3M1q1
$$ y = [-4, -73, -13, -4, -37, -40, 107, 0, -13, -41, -30, 151, 10, 17, -7, -68, 31, -71, -130, 111, -40, -55, 77, 9, -35, 92, -26, 67, -22, 88, 47, -33, 86, -31, -62, -29, 27, -7, -1, -88, 6, -74, -53, 60, -26, -47, 26, -23, 85, 59, -26, 50, 39, 37, -97, 10, 74, 73, 42, -40, 77, -43, -72, -58, 21, -40, -88, -16, -88, 71, 54, -123, 63, 9, -11, 79, 9, -48, -31, -30, 98, 38, 2, -78, -28, -55, -144, 29, -137, -39, -18, 52, -58, -13, -51, 79, -17, -101, -18, 1, -18, 64, -8, 19, -49, 35, 3, -23, 84, -11, -22, -71, -25, 11, 64, 43, 8, 100, 40, 30, -1, -107, 98, -45, -73, -18, 28, 14, -64, -137, 1, 47, -105, -24, 28, 159, -77, -37, 32, -1, 34, 36, 161, -29, 9, 60, 36, -75, -44, 37, 52, 99, -41, -20, -31, -46, 25, 29, 63, 115, -16, 69, 2, 136, 10, 137, -16, 84, 98, -24, 116, -1, -14, -87, 46, -96, 10, -128, -62, 37, 67, -101, 43, 30, -12, -63, 47, 129, -57, 98, 60, -40, -77, -51, 5, 89, -44, 0, -64, -16, 108, -185, 29, -87, 65, 14, 32, 139, -34, -24, 86, 33, 74, -7]
4145gJ4M8l7k8l6L6o8J35nj47J28j7lL0O2q9K4j69O0P6k3J15j18j44K15J7j44
4172g5J0J33m2M3p8j1K0j6N5l0J19j00qr6J24nn4j10J05j1qk4P1k0j01P9j11J45
4200Dj13R8J15j65J3j8J15j23J46M3j03Jq3O1R5l4l4R8j48p4J46rQ1j83M8N1L1
4227E9n0L7q5J17r8n7J41n7j5p5J13K3m8N7j57l4Q5LO0j45J81MJ3N6q5j1k8l3
4255b9M0J1J62k24o1L7R6m1K5k2k5O7q2l7M5J04Nj05J32j31N4M0q6k5J9L9l1J
4283b2n9L7n4R8JO5k9o4%J23j31J06o4o7J14o9O5m2P0j18j5k6k3M4m5J6J33J3
4311E7o4m2K5KJ36j67L1J05j07o2K19j71qr6N6O6r5J09j02J93q2L5k7k6P1o5N4
4338D5mr6J34o5k6J99j71q3J00L8j57M4K5KRn1q9J21N7J7k9j6j4N7J3kn5j0J1
$$ y = [-7, 7, 55, 18, -10, -46, -10, -78, 57, 52, -95, 33, 16, 13, 43, 105, 16, 40, -129, -69, 7, -16, 99, -19, -163, 52, 69, -75, -65, 68, 26, 69, -9, -20, 0, -16, 39, 9, 128, 28, 20, -76, 48, 43, -11, -121, -16, -27, -35, -59, 12, -8, -109, -30, -141, 4, -109, -11, 104, -61, -48, -66, 49, -74, 72, 115, 12, 13, -70, -9, 86, 52, 18, 116, -32, -106, 40, 31, 112, -71, -23, 28, 59, 9, 46, -39, 78, -20, -77, 64, 7, -8, -83, 30, 53, 5, 62, -95, -129, -44, -41, 19, -126, 55, 59, 72, 128, 43, 32, 4, -29, 11, 22, 184, -40, -101, -64, 32, -9, 16, -6, -31, 36, -46, -83, -38, 66, 71, -34, 98, -33, 21, 61, -25, -50, -31, 8, -23, -22, -81, -44, -98, 0, 1, 66, 37, -27, -27, 96, -35, 71, 7, -60, 54, -15, 50, 8, 78, -40, -55, -81, -104, -60, -105, -89, 44, 57, -7, -49, -24, -22, 114, -53, -22, 83, -24, -86, 133, -38, -46, -142, -86, -20, -115, -6, -108, 85, 3, 38, 11, -15, 56, -9, 45, 41, -55, 79, 14, -12, 187, 16, -67, 33, 71, -86, -42, -17, -15, -6, -57, -146, -25, 32, 49, 20, 4, -10, 47, 60, 58, 3, -7, 4]
4367DK8qoj32N9J1m9J86j45JR7J1r3J12p7pJPj2j8J10L6j34J0L7r4PO3o5O4p1
4398f7mO2q5L0K11j60R4j03L2p9m0R1J02J3j21P6k0J5j34%N4k0O4%n2N1l2R2j8
4427E2rj8J5qj3j3kl3J33k01J39j6l9Q2j18Ql2M8J4J1j08K32Qj61j5L2P6Q2o8
4456G8n6o3K3k3K7k7RJ33r6Lr6R6q4l6O3R3kMj6J30k23N1N8o2P6n3m0P7J6j22
4486f2O8K2p3p9J01j3l4M1K8J44j50O7r2O6l0Jo5OM4Po4r2J34J1M5lk5N7r3N2
4516A9M3j5j07Q2p5P0QJ1p1j4J32q0J7j10J30r3K6M4jkn6R0o6P0m8N9o0k6O8J01
4546A46j94J4L6j10Q2L2k3J13m3J9j04P1R4p2l7Q3m6n5m5K7ll0O8n4K5l2p3m5
4574a56j8J79o4NN8j23J2J18l7J46q7m8j8q0J75P5j80J14n1j5P0k8mRn3J7O2j59
$$ y = [4, 32, 24, 18, -114, -55, -44, -93, 93, -52, -51, 46, 57, -36, 76, -1, -8, -7, 0, -12, -30, 80, 116, -18, -8, 29, -65, -58, 5, -60, 4, -67, -71, -9, -94, -64, 147, -13, 81, -22, 10, -69, -109, -18, 84, 97, -24, 52, 32, 47, -87, -87, -33, -53, 11, 11, -41, 10, -22, 70, 52, 43, 25, 40, 32, 19, 6, 4, -29, 104, -97, 42, 26, -13, 69, -49, -41, -73, -25, -11, 0, -108, 124, 132, -29, -44, -12, 64, 146, 78, 22, -41, -18, -41, -14, -41, -32, 101, 5, 8, -88, 8, -76, -112, -49, 44, 42, 46, 30, 160, -63, -12, 46, -16, 60, 7, -33, 44, 60, -62, 6, 28, -45, -124, -23, -36, -70, -29, -1, 143, -7, 60, -32, 34, 4, 5, -60, -54, -10, -3, -67, -159, -25, -14, 31, 28, 3, 60, -33, 19, 62, 47, -60, 22, -53, 17, 25, 36, -35, -49, 83, 3, 20, -90, 40, -53, -27, 17, 16, 14, -42, 48, -18, 52, 4, 63, 3, -23, 45, 146, -48, -34, 2, -108, -26, 6, -17, 96, 53, 72, -32, 39, 133, 61, 24, 107, 61, 6, -39, -12, -15, -45, 23, -31, -6, -38, -111, -156, -174, 5, -59, -54, 4, -119, -107, 11, -26, 120, 33, -15, -33, -113, 62, 137, -43, 71, 20, 5, 75, 47, 43, 52, -1, 16, 78, -81]
4602h1Pj4j8P4M6p9J73q0pK8m6k6Nn5J33j12j5N1k9N8j51M2M4J26j33J22K5j26
4630c8O2r4M9P9k7o2R5J8j34J32r6O1rj07O8m7k6k4K3O1l2P2PM6p7l0m9J24o9
4659b4p9O6MRKMM0l4K5P9r9J2K3L7lj47K12m2Nl9n2O4j21K31k37Q7j4O4k15J72
4689C0k6m8q3L5J31k8qpK4J5k3q5O1N0jl8j9Q2p8mm1K8L3o6l4J60Q3j80L7M9m0
4720Io7J27r6NJ21J6r9j02M6L1L9j68P1J9Q7K8n6r0J27k7J8J6Ln4L3j56J21r6
4748i4M8N3o0P3o5R4j33J24N5j04M4n7J5L6%p1K0K2J88j12r3%nJ4Q4j35J13j11
4776e7j29J53l7J25J4k5m6j2Qq1R5mJ4%L1K0j34J12j32N0P1j78P1jQ9n6M8k0J7
4805Fl3R1n3K7qj22K07j52qK1J21p6m8N6Q8q5j08P7l3J0j03J17O3o2N1j20K7R9
$$ y = [-81, -74, -88, -106, -32, 14, -65, 108, 28, 21, 49, 3, -23, -18, -73, 60, -52, -67, -16, -45, 13, -138, -96, -52, 74, -59, 63, 88, -38, 24, -70, -21, 58, 31, -31, 64, 82, -52, 80, -16, 45, 36, -71, -3, -50, -76, -100, -77, -16, -48, 24, 31, 77, 0, -30, -79, 45, -24, -103, -37, -33, -24, -22, -18, 22, -12, 13, 92, -7, 5, 28, 65, 62, -85, 127, 85, 90, 51, -1, 63, -58, 173, -64, 23, 9, 73, -142, 30, 4, -44, -127, -92, 39, 11, 3, -4, 20, 35, 12, -73, -12, 38, 37, -1, -20, 62, -16, -20, -61, -33, 0, -66, -100, 60, 143, -37, 0, 49, 9, -58, 69, -27, -22, 99, 115, 16, -86, -40, -9, 30, -138, -67, -48, 39, 67, 11, -79, 48, 21, 39, 55, 58, 4, 37, -119, 2, -94, -46, 7, -53, 20, -45, 49, -84, 40, 95, -9, 35, -22, -7, 29, 29, -42, -22, 0, 188, 76, -17, -17, -22, -8, 76, -59, 54, -57, -186, -33, -70, 55, 69, 44, -2, -14, -6, -87, 8, 4, 18, 18, 49, 69, -65, 47, -85, -35, 36, -142, -71, -72, 17, -39, 9, -11, 6, -27, 64, 11, 38, 30, -92, 115, -37, -45, -24, 97, 21, -27, 29, 117, 32, -76, 1, -32, -22, -125, -8, 55, -7, 44, -76, -49, 50]
4833E0k7l8jN4j26M4J15o4m5N6j03K1M9q4R4k7R9ll4K0j7O4j02j0L6Nk3M5o6r1
4863a09J57L5j03q8O6Q0j08NN1J8k2j6J08l2r0N3J06l9n1o3N3n9J38o5k6r3J30
4890C6j29J03J7l9k2Q6p6J38j14m0J18K9l8j13J00j08l5J21l8j01J13Op6j5K2
4915e5O6jm1J26j38J9J63k38J01Q6j3n7j15J04p3j2OJ18Nj73K9J67r5J1j1o2L8
4942d5P1k0k7l9J27mkL0K4k73K9J78j0j0l5N5l5n9K03j69j9J38q1m6r4K20j19
4969a2j1J6P7j57N9k6o4R9O7J06j12q7O4lRn1J11p4k6M0N8r5P7p1j73J50O0j70
4997a39J67K6j52M2J5J82k08J04n8M7lrJ16k04P8J2M0j9p4L5P7k7n2J35j57m7
5023g3J48k6o3O3Qj0M6r8n2Q4k6n3R7l7j0J10k36J00P6n4m5K4L4o8N2J1l8k3J10
$$ y = [50, 23, -15, -16, 38, -88, -44, 71, 7, -38, 18, -85, -64, -15, -99, -5, -32, 67, 64, 30, 50, 33, 97, -5, -15, 21, 26, 3, 48, -18, -109, 48, 83, -20, -108, -42, 38, -70, -65, -14, 4, -18, -34, 74, 42, -48, 5, 111, 72, 21, -42, 11, -48, 90, 25, -1, -94, 36, -93, 10, 27, -12, -34, 52, -24, 114, 0, -40, 78, 107, 69, -44, 56, -52, -87, 34, -4, -105, 8, 14, -62, -77, -55, 11, 10, -31, 95, -43, -24, 139, -99, 2, 88, 75, 18, -97, 7, -66, -78, -72, 46, 51, -122, -93, 74, -21, -10, -21, -83, -45, 26, 6, -21, -60, 67, 63, 61, 91, 115, -158, -129, 49, 39, 29, -6, 49, 14, -45, 158, -11, -30, 108, 27, -19, -113, 107, -12, -23, -7, 70, -87, -28, -54, -118, -19, 48, 154, 42, -45, 19, 16, 25, -26, 85, 11, -15, 25, 83, -12, 65, -6, -179, -29, 31, -139, 28, 54, -98, -56, -41, 141, -67, 37, -21, 26, 23, 14, 130, -74, 4, 16, 56, 37, -37, -2, 75, 48, -4, 131, -26, -73, 75, 49, -14, 49, 57, 47, 93, -5, -57, 27, 1, -52, 45, 8, -2, 108, -128, -28, 48, -6, -51, -27, 7, -61, -9, 2, -36, -59, 51]
5052E1N9j31P8Nl8K7M6m3j34R2Q2p1j40R5M9J5k5j15O6j7pO4j0l2R5o3Pq8J25
5081D2o8J15l3j63J75m2l9j9m3K2P2j50Q2k9J29J54k71J22Q1j16n4J06j06K9Q2
5106G8j04r2M0J79j09l3M1P4j85J10n0L1J1n6J44l5RO5r9l8J04j96J68qm8L4k0
5133A5Lq1L9No4K4J69o0l3Rr2J09k7n2pJ20j53N3OJ5K0L2p8k5L6K1j4j0L9N2j09
5164c8R8j6r9M4J43j13r5N5K5j2P2j58P1J1q6K43j23J2J8k8K2R1j30L6N3j33k6
5191f3J10L3k6Mq2J9j5P3m5op6P2jj06J01P7k9l5P0pj09J40j27N1j90K06m3o3
5219f7M8L2o3k4J15k6m8L3Q9k19J35r8J91j10J19j6j22J48p6J02j50L3J3K7j26
5244f0P0%l8M0n2R0j17P2l5M6O2q9J60j65j38R8P9M5L6j06j51J74nn8R9k5o6J03
$$ y = [51, 110, -21, 57, 62, 24, 51, 97, 54, -80, 12, 94, 23, -117, -22, 27, 42, 17, -98, -32, -49, -56, 8, -2, -34, 61, -2, 5, -83, 42, -26, 89, 56, -107, 68, 26, -13, -32, -75, -53, 19, -131, -49, -78, 51, 205, -66, 56, 137, 21, -33, 73, -33, -4, 78, -26, -118, -78, 101, -8, -41, 0, 74, -111, -1, -51, -20, -9, -65, 79, 44, 53, 118, 19, -19, 85, -111, 57, 49, 1, 35, 15, 18, -63, -24, -19, -83, -59, 110, 50, 17, 26, -66, 43, 16, -36, -43, 77, -76, -23, -17, -2, 18, 50, -28, -53, -17, 4, -10, -20, 19, 71, -38, 60, 44, -55, -11, 132, 19, -76, -21, 4, -8, 64, -94, -23, -12, -98, 145, 22, 34, 52, 24, 46, 137, 7, 43, 96, -37, -63, 47, 80, 54, 58, -24, -5, -20, 53, 8, 2, -74, -2, -3, -109, -8, 69, 40, 5, 75, 68, -41, 99, -28, 23, -167, 39, -4, -67, -19, 13, -50, -74, 41, 15, -33, 0, 89, -130, 5, -93, 98, -12, 107, 91, -31, 117, 41, 143, -7, 26, 39, 66, -60, 10, 10, -28, 12, -40, 50, -67, 5, -30, 16, 78, -11, 149, -16, -154, -56, 23, 68, 104, -2, -153, 21, 16, -42, 57, 32, -34, 69]
5272F9j2J1j46J19o1M9m6L7Q0j73J20m1%m9J29k10R7l2J11j37R0o7L0k5M7q8Q6
5299a2J09j23K6QO7l4J0m7m1%NJ48j41PN2m4K2p0lJ22o9J02o6m7Q0jJ4j00J9l5
5329d2K7Nrj0k7m2N5J53r0M3n1J9k0K5R4r5j5r1KO3M0j63J16Q0j80J99r2%l9j2
5359e7K2j8O5q5O6M5l3j9j27K72p4Q1n5k5j78M7O0L6m7J2o0N6K3m8R8n7R5n8J9
5388E6j07L5l0L3K9J64k28Q4k2lkk3K7J1j10J76j01J08r8No1JK32k40k2J03M7
5415F4Nm9K2qK5n1o4P0o4k6J03j17J35q5P5j70J71l2l2N0J5p0R3K1j40Q4M5l5
5443C5m9J15l6n8k7l8M7L1j26J49j55J18k4Q9n0l9P7l1r8Q6Rm2K1l4o2J57q7J11
5471H9K6q6j12M0J18j57J26j29J04Ll0K03k36J3J31o9k2P1N5j37M4o8N0j23kQ4
$$ y = [69, 57, 68, -78, 41, -20, 29, -17, 20, 100, -73, 47, 6, 6, -43, 86, -124, -27, -59, 52, -85, 5, -62, -32, -57, -10, -98, -12, 97, -26, 0, 8, 75, 41, 51, 4, -37, -37, -32, 116, -25, -18, 34, -10, 12, -58, -61, 61, -8, 94, 28, -19, 61, 60, 74, -26, -7, -42, -15, -10, -19, -29, -56, -98, -43, 110, 20, 63, 12, 31, 11, 36, 130, 35, 20, -71, -69, -6, 34, -129, -13, 67, -113, 86, -6, -6, -45, -57, -35, -53, 12, -73, -7, 38, 5, -14, -141, 131, 57, 138, 83, 58, -120, -73, -13, 23, -24, -12, -72, -16, 7, -41, 57, 0, 95, 37, 56, -51, -16, -46, -13, 16, 180, -48, 36, 14, 11, 9, -14, 13, 24, -86, 90, -11, 97, -1, 4, -57, -56, 176, -64, -86, 17, 64, 69, 20, 42, 34, 59, 8, -56, 14, -50, -76, 27, -90, 45, -40, 35, -135, 36, 4, -28, 22, 37, -33, 60, 81, -59, 25, 70, 35, -14, 101, 65, 7, -20, -58, -11, 20, -106, 43, -112, 6, -18, 71, 21, -18, 59, 28, -70, 16, 25, -17, 4, -30, -92, 65, -22, 89, 115, 29, -83, -43, 75, -82, 44, -85, 19, 22, -8, 195, -41, -28, 103, 34, 12, 83, 138, 1, 45, -23, 27, -96, -98, -14]
5497a4K9r2O2O4j07J2J9L6J1j4p4O3K4L7k33J76k6%k7Q5j07J26m5p4J06l1P8k2
5525F2p0R9L9j28J5O3K2k20O8oJ30N5j42J03m9M0r6R4Rr0l5R3J5o6P7k4j53O6
5553b9j4J6K2pk1NQ6q7N9O7j63L7l0j4R7J2n6R7j59J69o1q0J04j23M7m5N9Q3m7
5582B4p1j1o7L8J97j83j0J03K3l3n6MP1J3M6j78rJ16m1j8l9J36L2j02Pm3J02j7
5610C4p2K2M4n6L7mm2j0P7l5l7N7R6o7J6j05O5j03Q4J5J6j38J17k5j9n0J21K0
5638E8p8J29j37k3%M5P3j12K7Q9Nk1mn4j4L0K2m1K21j73q9O3q9K7Q5j34J92k0
5666G7k9P0j25j06O3L4m9P4r8R3n3k5J27P0r3N1j01Q8K5j85J00O6j15N9M1m4k7
5693a2J18n8r5J43o6r9K12n3p4J4l3j8J35j48L1N2pk5nPm0O3q1k7M2P8l8o3P4
$$ y = [-14, 15, -77, -15, 49, -58, -46, -27, 9, 20, 6, -68, -5, 19, 56, -177, -1, -27, -27, -54, 31, -76, 50, 5, -69, 37, 6, 84, 62, -8, 91, 130, 2, 17, 80, 102, -118, -50, -56, 74, 129, -13, 90, 41, 81, -15, 79, 88, -2, -37, 56, 71, 5, 82, 58, -95, -29, -43, -27, -5, -12, -33, -28, 58, -29, 30, 97, -66, -29, -59, -73, 24, 36, -20, 77, -82, 87, 26, -54, 50, -73, -26, -71, -12, 71, 24, -47, -58, -125, -87, 110, -73, -83, 20, 43, 10, -46, -42, 29, 42, 88, -90, -99, 17, -24, -42, -81, 55, 87, -15, -8, -51, 51, 34, -38, -16, 28, -28, 9, 5, -37, -47, 30, -5, -42, 15, 111, 44, 60, -45, 20, -83, 1, 16, 32, -106, 11, -14, -33, -83, 38, 58, -20, 109, -28, -51, -51, -6, 67, -45, -18, 71, 76, 55, 51, -3, -17, 13, 35, -6, 215, 42, -47, 16, -73, -46, 39, -95, 97, 77, 48, 118, -7, -113, -50, -16, -65, 9, -89, 4, -49, -74, 53, 123, 30, 81, -20, 68, 93, -92, 8, 74, -41, 18, 59, 15, -12, 106, 48, -47, 96, 30, -69, 143, 90, 16, 30, -3, -21, 114, -34, -3, 49, 42, 17, 12, 19, -21, 42, -39, -66, -24, 54, 16, -47, 27]
5722B7m2l7M9K1q8J50j84J63l4J4n7J33r9K1p3O0j6o4P6M6q1pO9j03R1L9j24O9
5750A9M8j28k9k2J46N4l3r8L3M7j05J03j27K0N9OlP1j44K33j27j8N7p7N2m3k7
5777c3om5K9N4J08J2k06J20j8p4N9R3j54J5M2j2QK6r3J1K4O4j44O9N2o5J30o0
5805Fj27J34L6n3mM2r3J85o2r4J7K3k5O3Mj05L8nN2q2O6l2q7J60j42J29n5K3k7
5834a5J44q8n8O9jn9N0k4j0j24O1K7L1J0Mq2ln7J9J34L2k2r0Q2O2j89O1O4m7M
5864a5M0M4n9m6L5Q0j54N3N2n8N7k4P1j14P9Nq7K0J43j55jN7L9K4r6J26j15j4
5892a3Qk5Qm1N0N1m9J1J1L2Q5j55L3L1j09L0K9M1nPj3L4k5m5J9N8j01j2P4P5j07
5923a3l8RJ19lo3k8p0L8j24R5j7O3k6K6m4M7oQ3r0RM5k3RL1J3J2j42J16M6l1P0
$$ y = [27, -15, -52, -3, 18, -70, 80, -104, 59, 25, 39, -18, 115, 16, 37, -36, 24, 8, -56, 20, 66, -15, -22, 47, -56, 35, 74, -50, 19, 67, -61, -90, -112, 34, 88, 55, -43, -10, 37, -68, 35, -92, -72, -13, -7, -10, 61, -83, 150, 23, 5, 62, -15, 37, -6, -33, -39, -84, -55, -1, 107, 119, -87, 33, 15, -59, 0, 93, -61, -46, -4, -16, -8, 18, -75, -64, -40, 24, -120, -51, 1, -64, 66, 6, -121, 13, 49, -4, -8, 34, -59, 126, 64, -30, -13, 10, -15, 48, 52, -53, -15, -20, 32, -50, 16, -16, -103, 57, -85, 44, -11, 12, -15, 129, 41, -17, 52, 51, -8, 42, 18, 8, -116, -55, -28, 3, 13, 17, -65, -68, -125, -106, 28, 60, 38, -52, 30, 92, -97, -36, 28, -19, -15, 25, 69, 10, -36, -1, 79, -75, -22, 30, -28, 29, 5, 76, -38, 41, 46, -41, -21, 122, -33, -34, 23, 62, 86, -10, 116, 1, -13, -5, -30, -22, -63, -13, 38, -11, 0, 11, 43, 128, -27, 6, 37, -72, -42, -13, 28, 23, 30, 17, 51, 26, -19, 0, 58, -43, -55, 19, 94, -13, -51, -42, 77, 74, 11, -17, -87, -49, -173, -78, -95, -32, -58, -32, -76, -29, -35, 48, -42, -33, 12, -11, -2, 29, 42, 54, -88, 28, 74, 43, 113]
5954A13j37J08j11Q1pj2j05J45j33M1k9R0r8N4m2J38j47M4J8oj0M7q9p9K48j13
5980IK2n5J3O8j39K0J00j03O5j9k3q6J52m3m4J93r1r6J66l21L08j49N2O4n4PM5
6007F1J2n5m3J20j16M2M1J6J06r9p3j9n5L8O0r9J35j90M1K0J03n6R2q9q3J64r7
6034b3L8K6q2J3J25o9q1J52j06LJ28pj51N9ll0M4j44N7MJ0Q2j0j51J34N0j26J95
6062A37k02L3J27j36j9L0j5L3l6J75j16J56j95kO1j4j13J8R1n8k1J39o0q2k4j1
6088a04J40q6J08l3N6r0K4M6o5N9n5p4J14Qj44J04pK5k2q4R8j7P1o6n1j6J07k9
6116A7k7J4k1M3Pm0n0P2L5k8J13j10j0J4K7p3K9O6p0p1N1k9P5j6q0K8p8J52j95
6145a55J43m8K9P3n2Lj6JJ36q5lm1j26J26r8J78m1ooq0J39r6J19j66L0R9jp5K8
$$ y = [113, -24, 84, -27, 54, 47, 35, -70, 75, -58, -17, -46, 44, -54, 0, -42, 96, -51, -7, 11, 5, -5, 42, -47, -126, 122, 9, 31, -24, -11, 57, -82, -62, 38, -65, 0, -19, -42, -128, 24, -19, -63, 130, 39, -57, 109, -212, 96, -53, -1, 63, 9, 16, 61, 73, 18, -25, 95, -21, 21, 62, 78, 184, 85, 12, -7, -62, -24, 36, -63, 72, -118, -77, -57, 46, -10, 82, -7, -90, 74, -23, 15, 41, -41, -28, 97, 28, -53, 99, -7, -4, 124, 117, -34, 25, 22, -8, 36, -108, -51, -47, -37, 45, 35, -116, 18, 68, -58, 137, -65, -32, 95, -41, -60, -30, -45, -12, -48, 127, 11, 167, -28, -30, 31, 17, -96, -78, 13, -45, -66, 73, 13, -69, -93, -104, 36, -50, 58, 25, 81, -9, 15, 61, -4, 55, 0, -74, 40, 48, -96, 8, 1, 26, 4, -80, 18, 1, 72, 6, -45, -61, 46, 17, -10, 4, -17, 26, 33, -7, -57, 15, 50, 22, 135, 25, 15, 29, 56, -17, 12, 78, 8, -63, -12, -41, 34, 18, -62, -34, -112, 40, -155, -12, -60, -31, 42, -10, -7, -23, -22, 114, 29, 26, -15, -141, -15, -113, 65, 24, 18, 12, -68, 71, -25, 94, -72, -42, 57, 56, -19, 9]
6174IJ4O4l0j02Q3n0o2O9l0J0M3j1n6l0J32q0J3nl7J6J6m3L2Q2j7Op6J88k12O1
6204cN0r7J41j57J95q8r3M4J1L9j8j4Po5O4K3k3l5mk0P4J5j1pk8qJ1L9l3m8Q5
6235D6k6k0m0KL5n1j4Q0O0ql5N8j20Q3j2k5LJ7l5j5LP4Rq0J20j56N5j8J80j25
6265D5m4m7L0J08j28o0O1R6r5j3O0j6M6n3K3j42R3K9Jk7M3m9j0J98p3Q0k08o9
6293a21l9J85N6r6p2j6J35P5p9m5n4J34lm7N9q1r8P1R1m3%o7kP9j9n3J5o1J57
6322F1m2q4Q3j8N3q5N2n1n1J51k6Mm9R7r8N8q3JQ8r0J4m5J5N9j2om4j0N8o8J10
6353D2o1j3Q1j57P8Kn2J8J61j84N6J24j61N9q4o1J83q1m3J37o8L6M1o4K4M0j13
6380f0J68n8k01J8J79%k8m3k1J81j56L0M5o3O0j2M1j64J10j43K18j64J41j03j2
$$ y = [9, 23, 87, 57, -45, 38, -12, -74, -5, -35, -25, 18, 7, -49, -79, 53, -27, -14, -19, -56, -40, -24, -67, -35, 47, 30, 36, -40, 148, -64, -3, 47, -50, 91, -66, 129, 41, -52, -8, 3, 42, 24, 10, 17, -48, 16, 39, 16, -19, -23, -43, 31, 46, 35, 28, 0, -8, 3, 42, 9, -39, 46, 20, 0, -40, -38, -3, -54, -68, 12, 72, 64, 29, 87, -33, 50, 38, 13, 16, 33, -2, -17, -14, 60, 69, -11, 109, -47, 8, -10, 170, 45, 1, -46, -16, 92, -36, -96, -35, 61, -34, -47, 13, -3, 43, -10, 13, -129, -36, -7, -6, -33, 10, -39, -49, 149, 76, 156, -52, -121, -160, 25, 81, -15, -87, -103, 32, 107, 28, -17, -71, 63, 60, 13, 72, -9, -107, -36, 55, 12, 12, -55, -57, 22, 3, -50, -35, -96, 61, 19, -65, 18, 0, 53, -32, 20, -31, -82, 69, 43, 47, -2, 95, -3, 55, -28, -27, 61, -29, -15, -60, -45, 14, 2, -4, -48, -58, 0, -68, 42, -19, -32, 49, -108, -30, -28, -80, -62, 99, -85, -29, 95, -66, -7, -91, -152, 31, -50, -93, 44, -24, 12, 53, -11, 13, 53, -60, 108, 50, -151, -133, 46, 46, 18, -25, -46, 135, -21, 9, 54, -9, 51, 39, 80, -84, 26, -117, 101, -63, 78, -25, -37]
6405c7Q0J5o1M6J1q1m4J18j19N6p3K0J31j05k2J38P8j99J50j15Jp2K10j00K2m9
6431aP6j50k1J07o9M6QJ5L7k0o6qN5K6p3pn7P2J2joj10J22j9kN0j1Rl1j03J25
6462EJ16j28P6l5p4N1O3n8Q1m3k0M1j5p0L9J3r8N3L5lM3j24P3j7k2J5K9j00L6
6491c8JJ81j83L4K9M5j36rJ32j11O0J6m3n6PN9QQj09k9J21K0J37j55m0N4o8J21
6519E6j0m8L9mr7P9J2j4K4j7Q4j97k6M3J26j4j32J70j05Q5J08k97K21Mj16O0p4
6546d0p4J29r1J25J29k06J33k7p3P4j12P4l3K3n1Lr2J19k2Q6j59Q4j00P3j5l7
6572h0L0P6M9n9j04J2J07Po9M6L5o6m1J15Lk1o3j6RP7m8j5M8K4r9J82j35J3O5
6601H2j29j8R2J5L0m6J6j39J22o0J10r7m0J19J7o0o0R7l4rr7L7M7k1R1jj76N1
$$ y = [-37, 43, 58, -3, 43, 54, -27, -71, 47, -72, -16, -89, -69, 62, -43, -65, 73, 151, -48, 102, -13, -12, -84, 126, 26, 48, -1, 75, -75, -96, 11, -58, -12, -4, 11, 48, 28, -38, -46, 9, 35, -38, -45, -102, -30, -18, -19, -25, -135, -13, -32, -34, 16, 5, 14, -17, -120, 5, 121, -7, 69, 34, -40, 11, 74, 16, 97, 54, 34, 75, 60, -10, 29, 42, -56, -3, 32, 29, 72, -52, 21, 4, -18, -3, 26, -74, -38, -37, 144, -39, -5, 24, 69, -67, -76, 56, -55, 5, 21, -22, -78, -71, -12, -4, 4, -105, -134, -13, 7, 144, -11, -51, 3, -65, 56, 46, -2, 37, 33, -64, 15, 27, 13, 37, 20, 104, -93, -119, -76, 50, 36, -96, 74, -31, 54, 162, -135, 86, 90, -26, 34, -40, -114, 15, -76, 49, 178, -28, 105, 78, 5, 79, -33, 41, 8, 31, -20, -17, -109, 10, -12, 74, -85, -1, -101, -28, -43, -80, -50, 26, 75, 16, -88, -76, 31, 38, -31, 15, 50, -16, -57, 58, 61, 40, -23, -39, -30, 47, -1, -16, 32, 56, -43, 139, 4, 17, 82, -47, -65, 27, 42, 72, 26, 42, -97, 25, -35, 75, -22, -62, 57, 74, 14, -46, 51, 17, 8, -89, -52, -5, -26, 65, 64, -112, -61]
6629f1J61mm7o3N6Q9o6o5m5Q1n3m8O3Rl8J5J07q1N4r7QR2l3NOj08J40l1K4o3K4
6660C1O3j61Q4K1n1O1J1j50N0o4J64j95K78j85J31l5Jr2M7K7j1n7N9j2Q4j52M6
6687gkK6L1j67J08K7j10OP4j9Qk9Q8p4j22J49lQ6qk7m9lO3q3l1m2J95o6m5P2o4
6718a8L3j3j0k9L8j3MJ0j0N7j68R1J23o3n0Q0k5q7L0j6J7L2M4Pq2N3k2q1P2rj24
6749a29O9n4J13j00R1pO8o4Q6R3j44PQ1n5n0K3k4k4M8N3p8kr8O5N5l6K5nM5k8
6779B4l3Q2j62O1jN3OL5j05M5K0J3L7k3j2p8O7j8pj7Q0m8P8n9rp0J44p6P6j29
6809b6o9J55%O3j08l5m8K4R3lp1J73q8m2N1q9RJ0N7L6j29L9n1J20j18l0P8l0k9
6838e8O6O2K3j30J13l6p7k3J08p2l8P3J00pn0K0L4j39K4p0P4l1m3O6N7K1j14K9
$$ y = [-61, 100, 96, 49, -14, 42, 131, 65, 0, -45, 36, -17, -65, -2, 7, -31, -16, 91, 10, 64, -33, -25, 67, 34, 39, 45, -63, 77, 46, 70, 7, 31, 94, -67, 17, 38, -13, 48, 59, -91, -41, -105, 59, -136, 142, -43, 88, 53, 54, -38, 9, 36, 25, -32, 27, 15, 99, -53, -7, -9, 17, 48, -119, -11, 16, -94, -88, -14, -33, -25, -54, 34, -40, -162, -13, -16, 70, 62, 35, -14, -17, 46, -37, -68, -110, 85, 19, -26, 46, -18, 15, 2, -8, -37, 1, -12, -8, 2, -8, 49, -119, -28, 95, 32, -18, 62, 37, -50, -20, -36, -19, 13, 57, 64, -18, 35, 13, -68, 4, -5, -129, -60, -114, -1, -101, -10, -17, 51, -13, 73, 166, 22, 29, 110, 55, 5, 28, 4, -20, 28, 81, 3, 1, -97, -32, 23, -13, 12, 7, 52, 24, -9, 73, -89, -28, -29, 24, 30, 65, -40, 5, 25, 38, 75, 52, 40, -38, 29, 11, 4, -13, 67, 19, 97, 38, 29, -41, 103, 27, 103, -26, -95, 60, 60, 123, 15, -20, -68, -44, 49, 46, -25, 148, 60, 18, 69, -20, -11, -1, 56, 92, -37, 2, -49, 71, -47, -77, 1, -29, -58, 8, 70, 93, -37, 76, 40, -37, -60, 48, -24, -62, 11, 111, 104, 54, 74, 108, -31, -7, -77, -3, -34, -77, -11, 46, 67, -47, -18]
6866a8Ro6P6K8M5o8r3J04mJ1o4M7n0J19j28m5O2j29J70m6J32p1K1K7q9J0lj1K0
6895dlK00j43JL4j15K9M2j31J87o6j25K7k6N5m3J04L1j0ok3q8J28j6n7K2K3k5
6923Bn3N5N9Kj8L5j11P9m3K3l6p5L9R1o9J48Qj46K0p5L6L9j03N0n9O8N6K7Qr2
6953c5J6j25J40N9j68J39m7M1j6J6m4L7l0K1l2M1j2m6J19j71J22K7o5J05n8J0
6979D4q6J04n9L4k9l5M6J1j05J70r8r9R4J78k12l3K8K5J39j89j6N7P8m6PK8j33
7006i7J13P6p2n7lR2M3n7k20K12Jjm0J24p5n6P3q0J19k6J9j33M4J40j06n1l2J01
7034E1q3m3J03r0J7J9l7J44n2k7o4j24J62Q6j29RM0m3J30j81J42K5l6J29k05M0
7060a7J46p7m4q8J73o6m0J13%j7l9j4l2J17j34k2Q3j29KR5L9j7pJ7l0p8Q8l1K4
$$ y = [-18, -9, -75, 1, 29, 74, 6, -87, 17, 13, 24, -40, 7, -43, 76, -52, -97, -35, -164, 6, -40, 92, 21, 42, 69, -20, -10, -13, -24, -4, -7, 193, 50, 51, 85, -30, -1, 41, -90, 97, 31, -94, -67, -93, -38, -81, 23, 54, 44, 38, 15, -73, 55, 39, -18, 4, 27, 2, -51, 4, 63, 65, 47, 82, -29, 50, 7, 30, -6, -81, -42, 49, -20, 128, 136, -10, 10, -65, -29, 10, -93, -43, -102, -34, 22, 49, 57, -35, -19, -144, -4, 55, -113, 26, -21, 20, 4, 20, -24, 13, -17, 4, -28, 13, 1, -45, 74, -97, 25, 52, -13, 92, 34, 44, -42, 62, 3, 37, 8, -27, 19, 30, -75, 95, -3, -102, -8, 170, -42, -75, -47, -22, 117, -72, -88, -31, 47, 1, 8, 36, -97, 16, 92, 20, -37, -40, 52, 95, 38, -182, 30, 31, 30, -10, 114, 39, -17, 56, -24, 95, 69, 88, -45, -1, 139, 33, -18, -50, 51, -32, -75, 28, -62, -45, -26, -63, 81, 29, 2, -62, -186, -24, 62, -67, -58, -18, -61, 69, -112, 30, 55, 19, 148, -57, -17, 129, 52, 8, -80, 93, 27, -13, 100, 100, 83, 44, 30, -2, 115, -19, -41, 42, -87, -85, 10, 49, 32, 25, 42, 12, -66, 22, -9, 15]
7089A5r7O8R4n5r3J33n2p6M3J15j04p8J29Q0K9k14QJ37j4j03M4LQoj24J07j1k6
7117d0m1L2Q8L3j23O6N3l7jn6J9kL1p5L6j08Q2j9J04n0k1Rj8L1J01j17k4O4P9
7146I6j31K8p7oR9p5N6Q5L0J0L9j61j7J31m2n0J6j14P8N3k4M1k0J5j15J5J6Q2
7174E8N5j70J09j0Ro7k5K1n7J10j3j1K3p5N4q8J04l1M0j01J33q8o8J22j6l8k8
7201d8J26r2R1j71J17j06O4O1p4N2j24K9N6p7J7J21l4oL9o5J60j30J6O6k16K18
7227I0j49mM7P1j1p8M2P9j51P0j11J23R5o2Nj06q1J41l5qMK7mJ02j64L6K0p8K14
7256A24j58k3R6r5P1p9J23oj54J26mn0j0qJ69r3K0j85K00p5k5Q5j20J12N3r8j0
7283a4OP5Kn1l8o5J20r5Q%J0K0l0J12j01o2J52M1q7m1Q2m4J30r9j1o4j6P9J5O6
$$ y = [15, -82, -14, 80, 25, -68, 65, 13, -63, -20, 95, -9, -87, 42, 122, 151, -63, -55, 82, 68, -35, 9, 12, 20, 14, -110, -3, -14, -40, -81, -49, 39, 72, -51, 15, 68, 31, 30, -26, -7, -9, 22, -53, -17, -125, -43, -62, 42, -8, -29, -20, -38, -7, 94, -23, -47, 17, 96, -35, -7, -84, -90, 9, -66, -10, 75, 105, 115, 154, -7, -24, 107, 65, 15, 31, -83, -5, 48, 24, 65, 45, 60, -55, -40, -24, 58, 113, -57, 52, 42, 51, -16, -41, -20, -77, 33, 20, 9, 32, -43, 11, -77, 27, -4, 36, -65, 68, -20, -88, 34, 18, -20, -48, 78, -14, 77, -94, 23, -83, -19, 42, -32, 20, -104, -75, -19, -96, -79, 42, 8, 2, 41, -24, 136, 6, 22, 88, -128, 90, -59, -63, -16, 55, 44, -34, 8, 87, -64, 6, -105, 18, 113, 51, 56, -50, -131, 10, -25, -33, -29, -2, -6, 96, -68, -32, -12, -90, 124, -34, -57, 39, -56, 15, -64, 59, 53, -101, 25, 21, -29, -39, -47, 122, 29, 49, -136, 64, -11, -36, 49, -71, 41, 94, -4, -14, -8, 67, 69, 18, -20, -85, 35, -60, -52, -52, -42, -22, -52, 60, -41, -103, 49, 90, 3, -38, 44, 0, 130, 31, 20, -44, -60, 19, 34, 100]
7313A00j38k9J22m3PN6L7r8n3J0M9R3j12n3L1J9M5M2j16J04q2o4P8L2O7j18R9
7340H5o8J3j31J22M0j48Q3l0O0l9J00j15J03L7j51m3J09o3Q9Ro7n7J44l0j62J04
7366fm7J72k9K8j06j25P4m5rK19j95Q1n1K8m4J30n8j21Q1p8J41j8j1M1k5jk6J4
7394A4Q4j02Olo1P6q6J18J9j58J07j05R0pNl0N3o0R0j6o3jq0J53j2l0Nj02J39
7423D3j8M9Rn9j45j9J27N6k6j58R9P0J0k03K06r6qJ49q3J9Q4j33J77j79L0J6o7
7450e0J25j9P6j14J5k6Nn6rK2l5R0m5j0mo6J14Rj4j12k5J36q2O5K6P9j63LQ7N0
7480G2P8j84J62j28P5M1k01N8L3q3R3q6J60j34M2l5J45j29lk5Q4L5m1J4l7j24
7506a18J95j19k3M4K6k9m1R8p0O6k0L7j15J65j20N5o0l4J67m7j06J00r3P8l7L8
$$ y = [100, -38, -67, 55, 12, 19, 75, 112, 14, -39, -29, 20, 113, 1, -52, -21, -2, 43, 85, -31, 73, -9, -73, 5, 37, 104, -14, 85, 17, 30, -101, 21, 61, -87, -4, -34, 26, -13, 87, -28, 75, 112, -39, -82, 27, -36, 53, 62, -5, -62, 82, 52, -110, -6, -53, 119, 90, 118, 12, -113, -39, -84, -93, 126, -69, 12, -39, -11, -55, 75, 17, -104, -23, -101, 40, 22, 11, 52, 27, 26, 0, 14, 98, -4, 2, -1, -62, 14, -72, 46, 65, -93, 14, -91, -1, -8, -3, -33, 20, -40, 50, 34, -29, -30, -110, 43, 31, 1, 6, -96, 43, 25, 74, 83, 24, -121, -140, -13, 43, 17, -141, -42, 28, 38, -165, 41, -55, -63, 86, 3, 22, 106, -27, 150, -29, 1, 17, -50, 75, 56, 132, 18, 33, 7, 12, -44, -53, -31, -66, 24, -21, -31, -35, -101, 13, 22, 8, -104, -129, 7, -75, -10, 16, 95, -68, -65, 22, 72, 150, -34, 128, 0, 75, 116, -85, -27, 6, -77, 16, -70, 90, -44, -2, -37, 108, -21, -24, -49, 35, 70, 29, 43, 6, -118, 77, -42, -65, -21, 5, -24, -65, 33, -37, 29, 9, 46, -69, 96, -24, 31, -29, -63, 104, 57, -49, 51, -42, 36, -1, 37]
7532C7j27J26m1K1k0P5m5J8o8K9O1j19L3Q5j07N0k9k4k2R6m8QrP2k8pmj65J95
7561D3q5k3J00j05K1J15P3q0Pj06J4n0J05r5jQ5P2j03P6p8Q8p4J14j04j08N4O3
7588A8J5o3L8p7J14p3J9p0o2J65m5J24j90R7k1O2j2j14M1k1J09j16J78j09o6L3
7614b6J19j32M7j8KJ09n8pj19K1N3o7N7J72j29k8m6J1R0k6L9m0j3j14J75o2l4
7641b4K1M0p6M7p3k9J8J21l7K9k7M7o3R0j67J82O6k19k7J13j01J2N6M4q6J9n0
7668g4k5J82j2l4N2j58J24N1l9Mj22M2R1j4Qj12J1j16J92k02J97noL0k13K19j09
7695c8O6Q5j19m1R3J4M9j99N6OO2m8M7J0oOK7k4n7%jO1q2J43n8q6J24r3K7j23
7725i9P1q9Q5P2j9r7P7l6n1J8o4J31m5q6J89m6k9J9mQ7j68J78j05J8N5q0R9j21
$$ y = [37, -90, 36, -5, 16, -4, 71, 26, 44, -24, 5, 66, -53, -20, 65, -42, 8, -21, -45, -67, 29, -19, -11, -20, 52, 24, 17, 13, -152, 43, -42, -65, 35, -70, -49, 66, 139, 59, 66, -40, -26, -76, 29, -66, -67, 18, 90, -13, 63, -15, 73, -1, 113, 9, -99, -45, 18, 33, -30, 8, -69, 45, -28, -9, -79, -141, 24, -21, 103, -87, 10, -11, 51, 39, -75, -34, -55, 54, -62, 116, 7, -59, -26, 93, -39, 8, -10, -8, 101, 43, 36, -83, -62, -9, -76, -19, 153, 24, -4, -50, -39, 51, 25, 64, 24, 11, -103, 72, 10, -24, -3, 37, -39, 8, -65, -94, -76, 45, 8, 37, 10, 57, -6, 84, -83, 99, 165, -54, -81, 32, -69, -57, -1, 43, -43, -24, -74, -99, 83, 71, 37, 89, -69, 55, 106, 67, 71, -51, -9, 82, 68, 76, -36, -25, -141, 51, -151, 46, 41, 35, 65, -148, 71, -38, 28, 113, -6, -47, 46, 60, 109, -90, -34, -28, 34, -14, 33, 43, 37, 43, 70, 46, -11, -11, -12, 49, -33, 110, 52, -34, 90, -3, 24, -99, -28, -117, -32, 40, 21, -76, 1, -35, -86, -68, -132, -1, -46, -132, 57, 11, -18, 1, -3, 84, -84, 94, -11, 7, 62, -18, 81, -40]
7753d0K4jJ25n4j73P1O1M5K6j25Q6p7O7l2qL4j07R6Pk1l4p0N0o4J67j13m0J27
7781B7K7K7j13J44k17J05L9K0n1j20N6K9MK2N5k53O5J36r5N5N3N7r2M2k9J00j6
7808G7jkj48NL2J5n9J51r5J5N7r5j7M5k5L0N7j06O5J2N3Q0j19J2q4J8P6q2L8n3
7838d8J31k5l1m6K2j0K2K6k3rp4Q3o5j3L0R3k9j49J44N1n1m1J34Jj46J3M3j07
7866g4QJ27j14nJ02q8J24k5J6q5K5Q0j51M4o7J38j42P2q0R1M3j9j6j28N7P0rk7
7894c3O5J0p1J09j69J52j18K6j5M1r0J15%Qj16PJ99j51K0J91j26p6p3Q5N6M8p0
7921B4k9j25J67p6J50j34l4N8J7o7PM2o5Q0p0JM8Lo2Q6Jk2R8l4Pm4j07O6k4L5
7951cO0k4Kkj26M8J76j46N4r6L0k5P1q8K12r7K4Jr3M8l6K0q6R7l1L8j40J42j51
$$ y = [-40, -16, -17, 108, 54, -119, -48, 13, 58, 84, -41, 45, -32, 35, 3, -5, 29, -78, 18, 25, 4, -30, -100, -50, -114, 53, -60, -100, 27, 54, 81, -32, 112, -105, 0, 39, 59, 8, -112, -56, -27, -23, -1, 54, -199, -134, 2, -93, -38, 15, 72, -20, 22, -7, 93, 77, 76, 74, -74, -69, -37, -22, -81, 70, -25, -10, 47, -48, -65, -20, -45, -15, 42, -64, 1, 13, 66, 146, 27, 39, -45, -27, 49, -33, 5, -48, 83, 58, 27, -19, 3, -7, 15, 41, 18, 9, -65, 18, -47, -60, -30, 63, 34, -115, 29, 80, 29, -12, 122, 123, -23, -10, 33, -74, -66, 61, -53, -58, 44, -44, 80, 55, 71, -14, 11, 91, -60, -16, -83, 55, -87, -15, -95, -4, 39, 20, 4, -124, -67, 3, -6, -33, 32, 42, -29, 80, -89, 63, -55, -29, -44, -3, -93, 22, 22, 30, -86, -79, 120, -31, -11, 180, 54, -22, -95, -10, 46, 94, 24, -5, -130, 37, -39, 111, -23, -57, 1, 18, -49, -42, 0, -65, 15, -55, -54, -6, -3, -65, 21, 22, 0, 98, 64, 71, 27, -80, -14, -38, -3, 57, 33, 35, 33, -93, -45, 131, -15, 39, -57, -27, -52, 19, -69, 143, 46, 70, 71, -22, 26, -10, 10, -76, 21, -10, 28, -112, 30, -121]
7980a21Q7o3P2OJ03l7r9J13J8n3m1J05o6Pp4P7l4N0n8J30q5q6Q6q7K3J8O3l8p0
8009e4J27K5r1l6M9J4m7P8r0P6qQK2k9p6K9qL3j0n9K3O7m6j18J68no1O3q5K3O4
8040D6j59M4J13m8L0m8Q1J4m2j5nM0r8J95j72M6QN1n5ml7M7j02J0O4N5r6j0K9
8069a8J67j49j03M4R1J06j86Q2J06L2j82n8P0J8k2M2j32P1L5M5o7l0J12L3L9j86
8095d0J22Kk6j25nN1J02j05n0L1J15m1j6K9rl7p7n0J04J22j68J13j55K15l1o6
8121Ep1Q0lM6l2n1P9nm5k7J05p3J8k0j08N1N9m4N6kk3K2Ok2P1L4j13K7q1J28r8
8152c1l8OJ67j19l3o2L1J34j01L7K0J22j53L5j8k3JQ8j42J60k2j2r7j1J09n8j02
8179a12J87J3j05l9M3O0q0j6J29k29J52k7
$$ y = [-121, -34, -97, -25, -19, 84, 47, -52, 61, 79, 26, -15, 90, 24, 31, -43, 34, 0, 50, -8, 122, 37, -49, 37, -50, -27, -9, 54, 16, -54, 73, 98, 7, -29, 20, 34, -13, 65, -25, 51, 43, 51, 73, 44, -32, -3, -11, 22, 12, -47, -24, 43, -3, -121, 47, 42, -19, 44, -41, -18, 46, -113, -69, 44, -4, 26, -22, 59, 73, 31, 16, 11, 51, -47, 148, -24, 22, 30, 81, 26, 22, -15, 32, -70, -60, 4, 59, -37, -47, -18, 149, 0, -103, -59, 32, 138, -48, 34, 140, 172, -10, -68, 2, 20, -2, 40, -92, -21, 14, 59, -8, -38, 74, 107, 146, -40, 82, 84, 58, -67, -72, -21, 81, -24, -74, -43, 72, 31, 15, 44, 35, -2, -79, -129, -25, 97, -71, 42, -113, 102, 71, 5, -66, 14, 11, 57, 25, -26, 53, 48, 3, -24, 81, 8, 26, 6, -102, -51, 8, -36, 20, 18, -5, 17, 23, 1, 72, 106, -7, 20, -61, 67, -31, -69, -63, 104, -15, -48, -110, -79, 55, -46, -9, 11, 133, -20, 15, -3, -26, -25, 63, -79, 81, 59, 47, -50, -61, 48, -10, -112, 75, 88, -17, -56, -13, 47, -33, -49, 80, -149, 3, -24]
8191b4
$$ Imaginary data points
##PAGE= N=2
##DATA TABLE= (X++(I..I)), XYDATA
0@%%%%%%%Qj6J6j6K4l2M0m8N6p2R2j16J41j71K06k40K80l30L86m52N24o04O96
30C72p98R10j033J171j324J495j682J885k108K354k624K916l235L586l969M385
46B301m840N340n888O486p144P873q678R571j0569J1691j2964J4421j6108J8086
60I578k0441K3307k6882L1486l7667M6444n9982Q3760j37409M70290q5431r44812
72f47759N42746M75778l21272k36345L03564j55517j77842L71583J83506n27539
82a89097j16414M64225O6622l90074j0577J96915J6263J7926M3765k24375q1711
93b06532L24366J11751l37899p6711K29007j3096r3972J51847q629k25832P4922
104g0778K26499j39910j47230J98935L6883k36339Q0297K29548j58341j54613
$$ y = [0, 0, 0, 0, 0, 0, 0, 0, 8, -8, 8, -8, 16, -16, 24, -24, 32, -40, 52, -64, 77, -94, 112, -128, 152, -178, 208, -244, 280, -324, 372, -426, 484, -549, 622, -702, 793, -889, 996, -1112, 1242, -1382, 1534, -1701, 1885, -2084, 2301, -2539, 2801, -3087, 3399, -3745, 4128, -4550, 5021, -5548, 6143, -6821, 7600, -8508, 9578, -10863, 12444, -14438, 17048, -20619, 25825, -34157, 49603, -87806, 382484, 297053, -647759, -105013, 370765, 49493, -186852, 116712, -38805, -216647, 154936, 338442, -189097, -305511, 158714, 225336, -164738, -175315, 21600, 37863, 55789, 99554, -124821, -206532, 117834, 229585, -108314, -185025, 43982, 30886, -63086, 88761, 80132, -145700, -70778, 155721, 15811, -131419, 67516, 104399, -131940, -51643, 177905, 19564, -135049]
114a35049K33659N3841l02889J7311L20017p9229k90095J13007K00705j35682
124d404q0278J61771j7553j81908N6543J52961p2076r1192P7427L9374l9539N081
136F207k3354j9038J08458J3652j97249k0275K38806K0726k14514J5973J46808
147G6200q4719o2824J57032j6178k07574O8814K11283j03334j63100J47609J02782
158A25991j77424m0096J69372k9443j32211Q7684O8474j34081m606J56791m9771
169D0680j45645R3932R8580j31896m2656J44574p00j11978L7806N4340n7104K4636
181D569P7055r3138r1810J22874P4038j16699k1999Q5866m8768m9204J10201J2282
193F5267j50376K0528J56567n6924j31667R3148Q7181j09228k2174J09614m2328
$$ y = [-135049, 98610, 152451, -150438, -133127, 186890, 107661, -182434, -69427, 131278, -4404, -84682, 77089, 59536, -122372, -65829, 87132, 15056, -76136, 1291, 40665, 1126, 6207, -17147, -36185, 72273, 85925, -111324, -131599, 107207, 127933, -86581, -70608, 76200, -8519, -71343, 85689, 69511, -138063, -69249, 142034, 38700, -124400, 23209, 125991, -51433, -91529, 77843, 48400, -83811, 3873, 72347, -61734, -66340, 90451, 40680, -104965, -11033, 87547, -44349, -87005, 57569, 56869, -55109, -17303, 37037, -20067, 4569, 81624, -11514, -103324, 19550, 93588, -23111, -45110, 40756, -8012, -57216, 52985, 65267, -85109, -64581, 91986, 35062, -96605, -3457, 83724, -25504, -47678, 61936, 19608]
204A9608r7505R0202P3600j16678m4931J08365L114p1011M6510J9565r2425K1021
216d0565J12834m4629j01359N7130O6575n7857q145N9344m8057m8395R1236K5622
228F3734j15123n01J13597k5004r2921M5781N3286o4492m541P2255m7704p0088
240g1721Q4071N6341r4490k7713R1489l365p3899L5230M8504n9410j6932O5795
252C3900j8193n8361M4334M0115n9736k0462O0477k881n2440K5909L4131m2709
264a5916o400N2070j6350m3816L6481K8719m9145j0149N4304j0727n1117K9762
276b284L4663m6183j2764M9240j2056m4117L0478L0715m2980j2761N2527m896
288A9582m9401K4790L8096l5695j7727L7482m568l2618K2518K3453l7306j2909
$$ y = [19608, -77897, 12305, 85905, -30773, -75704, 32661, 35775, -35236, 11274, 30839, -61586, -40565, 72269, 27640, -73719, -16589, 49986, -7871, -16016, 43328, -4729, -53124, 38112, 63734, -51389, -51890, 61707, 36703, -56218, -10437, 42849, -21643, -26184, 46071, -1633, -71721, 12350, 68691, -25799, -53512, 37977, 34612, -39287, -4057, 44447, -14963, -31895, 33900, 15707, -42654, 1680, 41795, -17941, -38403, 22074, 19193, -33247, -7338, 26793, -15916, -22316, 29754, 13404, -30412, 6069, 34788, -14357, -24506, 29798, 19071, -32046, -2284, 32379, -13804, -26568, 22672, 10616, -33501, -3023, 27692, -15288, -28049, 24478, 19582, -29819, -5029, 33067, -2628, -20355, 17127, 12559, -20059, 2459, 25912, -11394, -24303]
300b4303M2504m056m1284J9105K8253k8852r032L1762q287k6885K5235K1309l5316
313i847q831M0226o543l5699K1274K1478l0864n998L1586j0591k9520K1751K0398
326A8820l1198p236L5013p323k8948K1549J8069k6688l005K7882q420k3080J8819
339D254J3841k7141j863K7892j2929k3157K1023J0757k4737N72K2536j1328j6359
352a6639K2212Q358k6916M440K6431j4158j6895K0937N199k1915N827J7962j6502
365a659j3609K2860L916k5827N599K0073j4734r479J9671j049j9188J1489J8360
378A6423j7656j2219K2608L461k1158P914J4350j8028o268K1471l150k2861R018
391f095J8831j5632j1008J8915p59j7316J3699J3602k0685n768K4055l77k1727
$$ y = [-24303, 18201, 14145, -27139, -8034, 20219, -8633, -17665, 14097, 5810, -21075, 4160, 25469, -9847, -18678, 21548, 15005, -20694, 580, 22058, -8806, -14804, 16782, 6191, -23329, -1578, 18820, -12378, -19614, 15399, 8076, -20872, 677, 18746, -7942, -10947, 16935, 8515, -14565, 4254, 18095, -9046, -10909, 16983, 4054, -19103, 1920, 12677, -12060, -11488, 11048, -280, -16639, 5573, 13931, -12985, -8545, 17886, 3728, -13167, 7770, 12969, -8946, -3119, 14843, -1659, -15268, 7592, 11508, -14319, -8720, 11353, -3381, -12860, 6811, 5762, -13426, -1937, 16423, -1233, -13452, 9156, 12617, -8541, -627, 13723, -4305, -10573, 10898, 7748, -15113, -6095, 12736, -2896, -13904, 5011, 4252, -13064, 635, 14237, -6448, -12216, 11839, 11462, -10265]
404a0265Q320J6273j6093p404K0944m910k2681J2476J7559j7628j0926J8254J462
417E381j6762R474J3836j8685n903K5280j509k3270R751J6994j5749p534K0165
430A1469l305k4184J2465K2037k0889j6477K2178N878j8501M493J2673j3515m863
443a0541K2338j510k5162R896K2565j5484j1971J8129j905j8532J4441J6603k6345
456g478j5264L1723Q969l1638l62K3725q674r729J5715l337j8338J5462J9524
469B0298k2437j4548K5391M690k2108Q919J2163k3254k330L2466p210l8220J2342
482a3838L6451j6572k6786J9949J1458j9108O545J7041j9206j1523K6158O474
494A7043k5945Q42J9282j0515p726J8280q688k4909K0522K5656k6347k2246K5725
$$ y = [-10265, -1945, 14328, -1765, -9169, 11775, 6865, -15816, -3340, 14219, -3409, -14335, 3919, 5381, -11381, -1907, 11929, -6756, -12659, 12621, 11112, -12158, -2407, 14587, -1162, -8696, 11469, 8164, -16020, -3555, 18482, -2407, -18884, 3294, 9172, -9329, -4836, 7837, -5678, -10541, 11797, 10287, -14875, -4979, 17586, 2102, -9869, 8260, 6355, -12177, 2264, 18867, -7478, -22742, 8981, 17950, -13688, -14050, 9675, 1001, -8728, 6987, 3650, -14688, 774, 20298, -2139, -16687, 8704, 13394, -8714, 205, 12368, -10886, -13216, 19250, 12040, -26180, -13838, 22613, 6041, -20745, -796, 10662, -8446, -1901, 15140, -4066, -15589, 10569, 17043, -8902, -8060, 11222, 707, -7019, 11261, 2573, -22336, -1814, 23842, -2505, -24751, 974]
507I74J4326k1350n69J6019j2760q581K3957K442k5466K977J9787o968r972R902
521D718l589j4503J6314J5228k8465j2691L3581P022l1112N58K4148q203j4054
534a1048J8044N312k3851L174K4475q460j7910J0138O853j0612K538Q013j2081
547e415n178J8130l82k1281Q781K0110j6023j4396K0839P820k1452J709K1404
560A4666r597j8416J6152J0922k0022j367J7930r404j3742J5788O389j9045J853
573g893J9114j1192j5426K0403R569k4518l24K4535p511j9555J5218J3255k1170
586e495p079K2818j197k0353Q128J1319j4367j291J6956p496j5909J4683J1723
599A2440j9054l202K1125n886j6896J5476J0130k1902k106K3379n778k2232J0993
$$ y = [974, 15300, -6050, -6619, 9400, -3360, -11941, 12016, 14458, -11008, -8031, 11756, 4788, -5184, 4718, 1129, -13374, 2940, 18168, -10297, -22988, 10593, 17615, -13497, -12939, 11209, 3006, -11048, 6996, 12308, -11543, -8369, 16106, 7646, -10264, -126, 6727, -3885, -1347, 6666, -5415, -10593, 7537, 7155, -14126, -5345, 14765, -1258, -15654, 5185, 13005, -8447, -6738, 14666, 5069, -13347, 2805, 13727, -6295, -7662, 10268, 864, -12878, 2910, 9299, -9746, -7893, 11221, 29, -15397, 5006, 14575, -9943, -10267, 14268, 6757, -12798, 2420, 15675, -5495, -12574, 10244, 9047, -11306, -3178, 8141, -6226, -7517, 9439, 1943, -13966, 717, 12440, -6614, -9816, 11309, 5423, -11473, 4003, 14133, -7769, -9875, 13504, 7726, -14506, -3513]
612c513J5880j5528o633J7293n082j6976J3999J4217j7416q133J7953M93j4557
625h003R880J0828j8589m630K2677k514k1665P721J5212j2442p615J4642k028
638C474j5863J1159J3762j7129q440J8904K478j4797M548R895j0531l292J6084
651A0252k321j8874O641J5552j0737r135J2366N87j3481N556J2900j0721j0095
664a1510J4344N230j4148K403J1996q303o819J2477K268j4230J974J3406o386
677B702j0657Q803M223j0557K381R558q164p924J1273N632j1694j455J1881l043
691B959r160Q448N166j0723j2J0271m719q842Q050N649j1410k427J1870k450r787
706g117O292M886q234M95R174m077p976P932O862r972l598J0160o77p821M548
$$ y = [-3513, 12367, -3161, -9794, 7499, 2417, -14559, -560, 13657, -3759, -11892, 6061, 6554, -8003, 1877, 12705, -5884, -10514, 12163, 9649, -12016, -4295, 10917, -1525, -9140, 5502, 3474, -12389, -1230, 12532, -4597, -13037, 5867, 8345, -6452, -1904, 7991, -2540, -5832, 10252, 7931, -10943, -4302, 11250, 513, -8622, 3744, 4331, -9150, -3594, 9306, -1415, -11510, 2834, 8064, -6084, -3681, 8315, 12, -6807, 5670, 7938, -6292, -4318, 9088, 2702, -7955, 848, 5071, -5486, -3105, 6453, -1711, -9635, 1638, 7270, -4424, -5879, 6002, 2959, -6201, 2247, 7413, -3310, -3322, 6949, 2230, -6612, 1438, 7087, -4323, -6750, 5120, 2670, -7117, -825, 4061, -4173, -3678, 5496, 1419, -6557, 1375, 8237, -1735, -5333, 4827, 4150, -3671, 877]
721H77L306p966L1R026l224r942N442Q071p400l585Q398j629o708O573N143q412
737a999k291R356o58q561M033N819p650k021Q256k474p750M517N438n826k981
752d792O475r0o032M370N251o699k234P907l02o660K462M735m633k855O021m24
768B500p218L234N440n820l008O364L16n467J796N265l337l353N693J096n479
783a978J653M686l817l242M362J431n048n29M466j621l987L429J636m434Q41M705
799B553k158l373L414K870l688j245M465r23l767K965J925m424n83L970j026m096
815c121J824K961l073j833M240Q1l798K116L246k573j537L202Q75l549O05L438
831C104k541k726L336N14l690N86K670j931k110K680J203k949M03L362j657j807
$$ y = [877, 4183, -3783, -3752, 5274, 2050, -7892, -2450, 5621, -1779, -5364, 3034, 1405, -5303, 1270, 6413, -1999, -4290, 5066, 4408, -4153, -120, 5699, -1951, -3972, 4284, 1810, -5940, -1423, 4015, -1811, -4792, 1683, 1593, -4439, -69, 5182, -1517, -3751, 4156, 3854, -2806, -344, 4391, -242, -3097, 2924, 2500, -4718, -1484, 3956, -1864, -4872, 1492, 1808, -3659, -1863, 3402, 65, -3288, 2405, 3501, -1978, -325, 4361, 544, -2698, 1664, 3095, -1953, -2482, 1984, 363, -3624, -195, 1441, -2993, -2152, 2553, 395, -2978, 436, 3306, -382, -1627, 2838, 1915, -1852, 1113, 3038, -1386, -1969, 2001, 975, -3121, -1297, 1664, -1409, -3242, 998, 1079, -2719, -603, 2643, 70, -1467, 1735, 2610, -939, -334, 3104, 563, -2163, 1173, 1687, -2003, -1417, 1253, -678, -2788, -108, 1095, -1854, -1451, 1911, 254, -1553]
847a553K876P89k682M09K367j044k432J664J471k895m68K483j362j978J948J235
863H28k269o46K639N71k251Q25J958j480m16K150o58j833O84J783j203k222J202
880c38J170j612m92J312q81n60J279O29j088o85J905Q99j595K19J143q35o4J046
898A452q84j567R35J390j531j787J804O96k356Q52J925j836r86K673J035k534
914g19m51K958J76k569R55J292k012K35J761j508k229J860J503k435j189K809
930D37j14k303K174J334l039L31L376n35k902R77K670j491j655J776m67j904J884
947E49N21k822j12K607m20k385J303K155k287r00L875m28l761K028L447k408k809
964a847K427J813k864p79K568j190k055J927N47k148K11J824n95r03J487N18k159
$$ y = [-1553, 1323, 2112, -570, -161, 2206, 1162, -1270, 394, 1865, -1030, -1498, 985, -377, -2355, -407, 828, -1441, -2087, 552, 1123, -1128, -303, 1655, 175, -241, 1909, 1251, -582, 102, 1885, 682, -1540, -338, 832, -780, -1272, 40, -841, -1401, -122, 507, -581, -1266, 639, 1538, -57, 162, 1305, 470, 406, 1452, 568, -999, -64, 1326, -205, -1992, -188, 508, -1848, -996, 929, -907, -1893, 780, 1815, -719, -1170, 1788, 1964, -605, 350, 1642, -370, -135, 1626, 118, -2111, -251, 1252, -1183, -2372, 437, 323, -1980, 194, 1528, -1511, -1180, 2196, 1661, -1241, -264, 2406, 915, -740, 1036, 569, -1335, 549, 1070, -1752, -1864, 743, 323, -2062, -759, 1396, -891, -1791, 2084, 1656, -2105, -77, 3370, 962, -1847, 580, 2393, -471, -1250, 1318, 128, -1927, 0, 547, -1601, -1390, 434, -161, -1064, 423, 941, -1218]
981a218R57K813j898k350K683J501k869p77K276l05k676J467J849k797j084L290
997H62m84k329J725J472j982j02K850p51l204K515K979l754j952L948J26l644
1013a725O21K669j860k291K894J046l519L72L319j278j488J946J16j826J619J870
1029B485k854j221L913n4m507J443L135l146j759L764o3m108J234M216k512l068
1045c102L727J567l477Q86K777k348j677L609P44m338J08M015j664l477K770J190
1061A310l404N10L232j816k518K645J903k632l06K759j250j410K518K14l043J042
1077b46K683k269k481K650J251l482K31L499j824k944K956J967l253o26L582p3
1093A621l148J535K618k787j185L162m00k980J442J803k397j187K396J52k717
$$ y = [-1218, -261, 2552, 654, -1696, 987, 2488, -381, -1158, 1118, 813, -1863, -396, 1453, -1344, -2428, 862, 378, -1951, -226, 1246, -736, -838, 2012, 1261, -1943, 572, 3551, -203, -2155, 1793, 1919, -1725, -1104, 1565, -295, -2586, 308, 1354, -2165, -1793, 1526, 248, -1240, 706, 822, -1004, 615, 2485, -369, -1590, 2323, 2269, -2238, -795, 2340, -806, -2565, 1199, 1136, -2972, -1738, 2478, -34, -3102, 625, 2192, -1285, -399, 2378, 30, -1647, 1962, 2706, -1632, -1524, 2491, 827, -2650, 120, 1310, -2094, -1584, 1648, -168, -2686, -41, 1862, -770, -1076, 1683, 433, -977, 1541, 1755, -1288, -246, 2437, 168, -2313, 337, 1588, -1894, -1663, 1836, 12, -2932, 24, 1991, -1262, -1888, 1694, 1621, -1527, 8, 2626, -161, -1346, 1816, 1416, -1564, -122, 1681, -716, -1903, 493, 645, -2072]
1108b072J285K144k207p54K677j60k047J348J734j720j221K389J02k827J290K144
1124B105k857j407L266q9l368J153L086k343k246L474J111l970J143L781k170
1139F69k431K801J225l038l03L069j295k854K564J245l243j51K820j104j871J985
1155H8J111k425J20L064j322k459K794J330l218M66K648j987k081K582J196l545
1171a638l78L706j402k913K630J613l007j13L210p68k742J873K503k512j393K914
1187A583k71k680J262J839k154j216K240J74k584P89K065j734r33K543j87k144
1203a408J356J716j722o30K119j31k363J027J920k262j205K484Rk503P26J957
1219A090j367j829K508R76k682J05L023j192j917J816J083k030k43K204p87k277
$$ y = [-2072, -787, 1357, -850, -1604, 1073, 913, -1134, 214, 1948, 228, -993, 1396, 1498, -1329, -39, 2105, -752, -2159, 1107, 1018, -2350, -1197, 1889, -454, -2700, 774, 1885, -2085, -942, 2839, 669, -1762, 1039, 2264, -774, -1077, 1992, 697, -2157, 407, 1652, -1591, -1742, 1078, -26, -1897, 88, 1199, -1226, -1106, 1958, 636, -1823, 971, 2301, -917, -451, 2197, 210, -1871, 711, 1907, -1638, -2016, 1690, 288, -2625, 5, 1618, -1389, -1502, 1708, 940, -1802, 71, 2574, 62, -1331, 1583, 1312, -1368, -106, 1733, -421, -1637, 603, 777, -1807, -1018, 1047, -687, -1620, 923, 736, -1408, -52, 1664, -58, -688, 1431, 1300, -1063, -36, 1884, -378, -1583, 901, 910, -1593, -867, 1090, -277, -2106, 402, 1378, -1304, -1199, 1824, 632, -1285, 531, 1614, -416, -659, 1545, 758, -1519]
1235a519J524J365k221l79J976r18j387J510R24j700l02K078l40j688J375J212
1251A510j959K7J944r31j650J381J153k057p10K176l71k341J431J571k156n20
1267a502K557j88k113R32J843j337j067K049j7k102Q80J297j377q26J360L2j393
1284i72K57J291j020q76J688J13j474P79J296j080n75J495J28j637N50J477j399
1301D1j032J575O9j758N58J343j035j081J229P70j439pJ736p02j076J212P88j221
1319c0k73J225j37j349M66R74j274l72J135l99r99P63O28r18k86J161j6j082Q94
1338A11J016j384n4J373m35j219P79Q00j099p48J370j4j595O11J196j080p82J465
1356C11J80j134K05J446o90r48J275L88j510L50J288j043p79R28J71j191R6J183
$$ y = [-1519, 5, 1370, -851, -1230, 746, -172, -1559, -49, 875, -825, -1127, 951, 611, -1077, 298, 1510, -449, -422, 1522, 591, -1059, 322, 1475, -582, -1292, 884, 513, -1828, -397, 1174, -982, -1502, 1055, 867, -1246, -314, 1529, 192, -875, 1174, 1157, -945, -65, 1232, -145, -971, 389, 421, -972, -715, 576, -444, -1320, 368, 481, -993, -214, 1082, 2, -573, 922, 1050, -587, -37, 1440, 41, -991, 584, 653, -1105, -547, 796, -239, -1320, -91, 679, -760, -767, 969, 267, -809, 403, 1191, -30, -303, 922, 785, -564, -98, 876, -398, -770, 365, -34, -1033, -270, 358, -560, -846, 315, 299, -783, 111, 1127, -257, -311, 1062, 627, -592, 187, 987, -112, -860, 510, 496, -1099, -488, 708, -372, -1154, 311, 491, -643, -438, 1008, 318, -630, 645, 1033, -477, -127, 1161, 118, -661, 267, 438, -753, -657, 526]
1374E26o53r96J085M35j165L20J190n34p43R68M82j081J1J190n77j128J055L14
1392F99j372L7J018k76j162P67Q40j002l75J280k70q74P97P44r86k01J204l93
1410D75o57J91Q04q99n53R83j27r96K51Q75p00l49N68N07q72J74J079m83o97R66
1430E40J79q06N6O36m99o44P88K52j109OJ004m72r20Q52M71p51M4P97N8r51N18
1451D9Q66r40k83J086l18q51N39M40r29m31J057oj264N87J042j066l41J211R6
1470E44j116N15R01o00o54J046K38j206L04O56p87m39Q58m8q33K82O67m95o16
1489g83R78L27j150M81R52o71n44Q72L36r36p0Q46l37q18Q73kr92J86P44n04o15
1510h27Q68L24q00kJ043l50p28P25N15p68k35Q49j55p71K51N46n93m06P20k59
$$ y = [526, -127, -1123, -38, 397, -768, -448, 742, 208, -535, 433, 915, -166, -155, 1035, 458, -670, 385, 699, -673, -636, 382, 106, -1056, -289, 551, -451, -826, 454, 184, -690, 107, 851, -135, -336, 868, 475, -182, 9, 813, -86, -639, 344, 217, -779, -528, 347, -353, -702, -134, 373, -499, -325, 754, 271, -426, 540, 719, -87, -31, 605, 106, -538, 250, 502, -607, -601, 403, -69, -989, -137, 334, -417, -373, 424, 482, -469, 49, 915, -25, -308, 778, 460, -391, 148, 588, -341, -772, 285, 279, -985, -398, 644, -422, -763, 448, 544, -572, -57, 844, 244, -410, 636, 874, -332, -28, 628, -159, -598, 260, 212, -621, -339, 328, -167, -783, 195, 522, -628, -147, 805, 134, -410, 462, 798, -138, -208, 638, 301, -517, 356, 354, -638, -452, 292, -212, -827, 41, 365, -435, -437, 606, 256, -472, 253, 768, 0, -235, 614, 459, -312, -61, 485, -108, -514, 206, -53]
1530e3n06L16N25o11j81O99Nn36K77P38o75k24Q01N5r28K20O10m87n54M29L76
1551B96q84O0Q96n65m42Q25J46p56K98O36l02n85Q45L62j100M5Q90m01q40N21
1571e5N31q90j84P52j33p06N48L88o81R3Q06l02n18O12L17o89j21Q82k62r61O87
1592A14M33j015r0J019n20o80N39O54p50l17R94o1q59O21N73o95j72P14j17n93
1612b08K41M60n33n58Q49j67p20L39P31o80k94N55J83n40K43N46k98n06P86O5
1632D94q06L17N84o90k82O33J43q58J13O91n52m33P70J13o72J03O30j51m37M13
1652A23N09n86k53P82l03o02M26K51p16RN67k63m13L76L42n71p1P47l37l54N73
1673B36K85n49j76N98qp30L65M78n06k62N03k13n74M00M32n30l27Q53K0p61K55
$$ y = [-53, -559, -243, 282, -329, -510, 189, 194, -342, -65, 673, -2, -226, 575, 630, -298, -78, 532, 45, -509, -80, 296, -588, -528, 368, -197, -639, 186, 332, -424, -126, 510, 208, -377, 468, 830, -270, -225, 665, 264, -576, -55, 476, -414, -598, 154, 21, -685, -137, 251, -430, -337, 469, 167, -351, 261, 578, -111, -232, 650, 388, -573, 114, 547, -468, -558, 461, -59, -739, -200, 454, -296, -613, 381, 320, -539, 82, 655, -40, -212, 502, 385, -208, 33, 493, -40, -598, 251, 84, -636, -297, 434, -246, -540, 15, 198, -342, -99, 447, 149, -357, 429, 494, -312, 5, 589, -101, -383, 250, 393, -465, -352, 339, -213, -646, 124, 237, -435, -332, 298, 147, -290, 123, 632, 46, -207, 575, 272, -330, 96, 347, -369, -360, 207, -56, -469, -93, 249, -322, -393, 354, 17, -337, 236, 521, -28, -204, 394, 386, -344, 21, 499, -7, -269, 234, 21, -553, -153, 279, -251, -578, 275, 295, -466, -211]
1694b11O54n05l33Q70%o59J17M56k78n25N29J64p44J60N60m26l82N82P3m43J27
1715b14N36k83k22L50K02o02J65N44m77j92L63K41p04NN30k98n82N87K61n32N5
1736b67M84r8l81M09K68n11p2M89l5n59M25R2l67j54M14r2m05K20K40l08j62N22
1758A52r3l31K85L43l33p3L08M1l68M3M42m17k67M75n2m47O3M38m41j74M57K08
1780B59n67J02M62k69k58M24K60m73n4M26j70m04L90J84m64n3L38k80k09L24K13
1801A81m11j6M46k22k51L87L93p42J30M76k14l16K93J60m71m8M31k69k63K13K00
1822H7m12M5M17o6m29M72K00l80p1L81Jl88K32J27m15P6K97j14j99J45J4l16J1
1845b85L45q8k36K49Q9jj34L89l4l24P6K65j89k47L33K8l32Q7K19j97l34L15J45
$$ y = [-211, 443, -62, -395, 475, 475, -184, -67, 389, 111, -414, 115, 279, -465, -305, 255, -171, -553, 29, 102, -341, -214, 322, 39, -183, 167, 369, -233, -68, 476, -1, -193, 170, 411, -293, -288, 242, -56, -638, -51, 210, -322, -267, 217, 119, -262, 147, 415, -96, -168, 321, 286, -273, 152, 244, -123, -277, 137, 45, -360, -140, 100, -208, -370, 152, 59, -272, 13, 356, 23, -50, 258, 299, -69, -26, 416, -1, -268, 207, 155, -292, -229, 209, -232, -406, 51, 259, -308, -206, 256, -13, -271, 153, 413, -60, -114, 312, 142, -262, 128, 312, -152, -205, 133, -147, -356, -32, 181, -230, -246, 200, -22, -273, 114, 507, -235, -105, 371, 157, -159, 134, 294, -177, -225, 206, -63, -326, -113, 87, -325, -280, 137, 71, -358, 114, 314, -66, -137, 244, 245, -143, 89, 216, -199, -123, 174, 60, -139, 6, 20, -296, -285, 60, -28, -264, -15, 74, 73, -61, 328, 294, -30, 46, 311, 122, -125, 208, 236, -96, -9, 210, 13, -321, -6, 139]
1868A39m11J37K56j97p5K27J35j86J4K09j15j39P0K44m17j32M86k67l37K79J76
1889I6k57p6L24q1k38L12J45k75m9K90j03l22L28J92l19l6J61l6l30K13L19m16
1911a58j04K58j3k30K35J1j06n8M19j4l87J12K77l52p4L77l0l53K6K57j97k90
1933c94M99m5k98K09L06m23J21J92r0j14M6K75k28j13K37j8l54K04J1j04p9J69
1955Io9j17M8J93j09j44K27k7j87J98Q9o1j22J94J33m30J10L26j78k71K22j9j43
1978a28p5L34j72q0K1J33o3r1K55n6j26N9R9n9j62K48j43k3l9J40j15j65J95L2
2002A9j77j6L55k17r2K43P5k62j3J51j22J02J73j09j77K7J18j32r9K91k9k44l8
2025a73L91k99j16K73P6k45P9K30j84r7K26Q4k21p4J29k57O3J99j09j60l6L59
$$ y = [139, -272, -135, 121, -76, -151, 76, 211, 25, 39, 248, 133, -6, 64, 308, -109, -241, 245, -22, -359, -80, 96, -161, -237, 87, 6, -232, 80, 225, -50, -99, 191, 88, -234, 94, 286, -33, -69, 92, 56, -274, -61, 258, -158, -262, -4, -17, -247, -12, -1, -107, -165, 254, 240, -147, -35, 242, -110, -184, 193, 163, -190, -164, 93, -104, -394, 105, 60, -238, -29, 277, -146, -25, 167, 77, -37, 9, 284, 56, -57, 180, 162, -192, 12, 23, -81, -160, 9, -60, -177, -129, 64, -45, -189, 38, 11, -176, 22, 111, 50, -72, 122, 255, -175, -65, 261, 83, -188, 34, 15, -128, -203, 131, -41, -121, -100, 33, -30, -121, 134, 78, -48, 11, 110, 51, -111, 137, -6, -29, -68, 72, -43, -208, -13, 19, -158, -174, 181, -36, -128, 115, 190, -72, -85, 66, -56, 46, 219, 110, -67, -40, 78, -54, -153, 138, 109, -135, -173, 218, -81, -197, 76, 152, -93, -14, 216, 32, -65, 161, 245, 24, -50, 79, -178, -115, 84, -25, -185, -221, 138]
2047A38k13j03J69j1j39L2L37r9j95K34q4N3k83L79p3k76J83J10k56o6R2k5p8
2070a74K09k5j28o3K62n8k00K49N6o6r9O0Q2p5Q0J1j21j49J66j9q5J05j2j86O2
2095a18J34J00k69J49J88k59j9J24O8q6pJ99k32m6J71M1k02k5K08j56k32J97R8
2118B6j41N6K29ok51K45j11r5j5J61k57R1J7J25j91l4K93j20n9P0m0j37K6J96
2142G8j30q7K38r1j8o1J52L3j53J18O5k90P9J50j22n5J28k4N6j23J8R9m6OJ27
2167A47p6l7LN1q6J3J56k29r7K47m9j78J35L7j16J03q5J5p3R6J30j67P4K7N1p8
2193A4L9Q8j12Q5k2n9m1K4M4k65M9J91Q1j48K0K1j29L7J2J28j09R5K24k01j23
2218e7J56N9j74o0P1j0r2J08M2r2k9Q0j9l1J6J15k03O0J26p1jL7J95l37J01J17
$$ y = [138, -75, -178, -9, -20, -159, -127, 210, 111, -84, 150, 66, 119, -164, 215, 142, -134, 49, 159, -97, -163, -71, -96, -174, 35, 10, -118, -181, 81, 23, -177, 72, 128, 62, -37, 23, 105, 30, 110, 121, 0, -149, 17, -2, -87, 18, 6, -180, -118, 16, 116, -153, -4, 184, -75, -94, 30, 98, 12, 5, 204, -28, -74, 97, 138, -64, -89, 119, -37, -269, -72, 26, -115, -59, 170, 164, -87, 158, 47, -48, -63, 98, -159, -68, -51, 74, -117, -151, 142, 22, -37, 33, -7, -144, -118, 78, -52, -139, 99, 8, -10, -71, 81, 114, -39, 79, 144, -146, -67, 83, -39, -94, 34, 10, 66, -57, -39, 60, 14, 20, 147, 71, 34, 37, 88, 2, 15, 171, -58, -155, 92, 43, -135, 0, 37, -79, 24, -61, -46, -119, -23, 107, -60, 14, 41, 92, 14, 53, 141, 29, 114, 92, 33, -8, 16, 60, -205, -156, 35, 116, -32, -12, 9, -120, -83, -71, 57, -52, 43, 267, 66, -57, 99, 158, -16, -76, -5, -15, -107, 1, 43, -49, -78, 2, -17, -48, -32, 83, -120, -60, 66, -5, -6, 31, 226, -111, -10, 107]
2244A07m4j79Q3k4k6n3J12Ok6rNj4N4L8q3N6K2J11j98O4J23r7k88K61R5j82J74
2271H8mr6q5L9K00k44M1J08N3q4J22p4j5m8Q3Rj32r8J27o7J14k4o7J3r5K23j15
2298b8l6N1K9k8R9j8j37K1J05j11J38k38J94R0j93P5k7j13R7R6l9j18J64Lo8j
2324GM6P0p7m5J51j11n3Q1J7l9lJ3l3j14P5o9r3Q7J60j04j9J57m0L3j38J33q1
2351A1L8j4j07J04j14J69j71O8J47j06j42L0R9n7l4J54j56R1K0R8q4K8l3j2J4
2376D1q0J89j62r1J60j18o4R3OK6ln4J34m7r3J3O2r6M5J62j24l9j3J7qK09j45
2403B0k07Q3O7j05QK38r6k4l5N8K27l33J18K3K1j23J91n3j21O9L1p1k30K45M1
2428D2k99K40M5j56o4K79j97O1M8J04j59r5K32k4k22K20J9j69R7O5m3r9kJ82o0
$$ y = [107, 63, -116, -33, -57, -83, -136, -24, -18, -44, -53, -48, -62, -8, 30, -53, 3, 25, 136, -62, 2, 125, 28, -260, 1, 96, -86, 88, 84, -12, -97, -58, 142, -102, -61, 47, 100, 16, 138, 64, 49, 1, 84, 93, -39, -137, -10, -77, 37, 13, -54, -41, -136, 87, -28, -64, -13, 16, -12, 87, 69, -68, -47, 58, -53, 85, -153, 41, 131, -62, 13, -14, -127, -30, 66, 27, -91, 73, 76, 8, 7, 53, 123, 46, 1, 152, 41, -12, 69, 86, 47, 44, 57, 24, -90, -15, -84, -177, -90, 70, -34, -53, 104, 64, 97, -41, 92, 11, 49, 35, -72, 32, -82, 87, -84, -16, 131, 25, -117, -87, 12, -45, -79, 75, -81, 10, 30, 128, 44, 72, 39, 27, 41, -39, 150, -12, -103, 57, -61, -125, -32, -26, 0, -3, -57, 77, 30, -63, -50, 12, -84, -39, 123, -1, -40, -53, -36, -44, 165, 20, -187, -104, -37, -142, -134, 104, 8, -16, -51, 7, 234, -99, 19, 42, 63, -60, 131, 78, -43, 26, 57, -14, -244, 1, 42, -257, -17, 28, -128, -192, 87, -110, -49, -1, 103, -56, -151, 81, 57, -165, 55, 74, -95, 2, 67, 24, -75, -77, 105, 45]
2453D5K7j14R0q9r2K00r2O7O1n7j64K8J40j50J65K1n8o9j57J52K2j48K0J20l0
2478f2l9K26j26m8J36L2j62L6L0N5p1O5Q8j94jN6r2j21J93k5n8J23o2O4l0L0j9
2505B4L1j3J34j31j18J48M5k19J08J44j77J6k2K2j51R6L3j4qJ02K9j01k9R6N2
2530I7j33l8K40j27o6J1O8j69O7P9j22J6P9M2j1q8J37p2K7Q0j03k3N8N1o5o0n9
2557h4J53j62q2J68M4j47O2J23j59J35M1lr5n4K14j50q5K57q2p5R4P0j16q1J0
2582dJ14k26R2Q8j61J18q7J84j62LK4J03n8n4N1r9K19p9l2r0J04K3j31m5J63j14
2608e6q8N5O3o1M1J53K4j20J21q3m8P0L7r6J1R7J5k47J3M5R5Nl6j04k3J21o1L7
2636b0l2K34j02r6nJ1K6j32J66o6n6m9J42j07%JJ92k60KJ40Kn3K7J40j07N9m1
$$ y = [45, 72, -42, 48, -41, -133, 67, -25, 42, 103, 46, -118, -90, 50, -100, 65, 86, 28, -41, -198, -46, -24, -172, -152, -32, -62, -101, 125, -1, -49, 87, 119, -43, -7, 23, 78, 7, 72, 160, -34, -35, 21, -71, -192, 1, -24, -82, 41, -21, 43, 13, 43, 24, 55, 42, 176, 45, -73, 75, 120, -99, 9, 153, -24, -8, -30, -8, -159, -63, -30, -44, -52, 50, 79, -22, -51, 45, 97, -36, -74, 166, 39, -27, -16, 52, -117, -50, 29, -93, -77, 2, 44, 33, -55, 82, 10, 37, 117, 14, -9, 49, 100, 35, -25, -84, 69, -93, -175, -7, 37, -110, -48, 75, -84, 51, 92, 89, -6, -60, 154, 4, -81, 176, 94, 19, 113, 183, 67, -14, -4, 110, -116, -24, 64, -97, 21, -66, 118, -44, -41, -17, 86, 28, -26, 25, -74, 145, 66, 34, -56, 48, 71, -60, -105, 58, -56, -144, -89, -26, -87, -46, 107, 131, 11, 132, 49, 1, 71, 108, 12, 23, 120, 135, -112, -99, -54, 41, 46, 10, -94, -117, 4, -57, -20, -52, 182, 80, -16, -21, -10, 16, -116, 50, -16, -72, -121, 21, -86, -86, -85, 107, -153, -151, -11, -9, -62, -35, 105, -2, 57, 16]
2663A6J18j69O0M4m3N4rp9L9q5K0L4r5Q8k3l4QP0M6j45J25j9Nj13Q3l7l6Q4J6
2692B3j12J85k2j70j41K38o2l4O8M4m4K5J12P3k16Q0R6o6o2J63j97K5m4j4K20
2717A68k74M0R0p6p3J07j4q0Q4J40o6q6J05J2j6j04K23n4q5lp2Q7p5RM7j80J31
2744a5M0o0L3M5j99J25J70k8r0q2R6%M4q0M5j60L1J72k32N4L4J09j3j53Q6j8n1
2771i7M8J15j07K4J38j00n0Q2M7m3o3J4n3N8J67m6j99qP7Oq6J08K1l0q5J05J13
2798A56j16R7m1j85M8rj0j3j12L14j75J19p6N4j15Q1j09M3R3p9J30l4L1q4n6k2
2824g0J41ql8N5r3k8O1j62J45l7J59p6L4j88K27j01l9rJ66l2j31O5k7l1l8J17
2850F2q2q3J09N9j04l5N6N6o2M0R5j83N6J26j23k6RK8o8K5O1N3p4q8K04k25K7
$$ y = [16, 134, -35, 25, 69, 26, 80, 71, -8, 31, -54, -34, 0, -95, -7, -30, -64, -56, 14, 60, -85, 40, 21, 26, -87, -4, -41, -77, 7, 23, -89, 96, 74, -96, -237, 1, -61, -95, -27, 17, -27, -2, 110, 183, -33, 47, 143, 77, 15, 178, -19, 6, -38, -52, 168, -106, -66, 24, -52, -125, -18, -32, -112, -28, 112, 46, -40, 65, 77, 61, -43, 180, 126, 41, 38, -34, 53, -22, -13, 34, -146, -15, 25, -35, -2, 43, -156, -31, 139, 111, 21, -61, 35, 35, 79, -1, 44, -116, -85, 87, -145, -91, -57, 52, 39, -114, -28, -46, -97, -49, 66, -41, -17, 121, 21, -29, 53, 100, 57, -6, 8, -45, 13, 180, 134, -65, -73, 4, 10, -76, 32, 53, 23, -62, 43, 156, 40, 137, 96, -89, -41, -50, -60, -73, -185, 129, -46, 73, -3, 51, -64, 17, -92, -49, 44, -35, 95, 61, 92, 8, -48, -70, 71, 63, 25, 80, -13, -41, 20, -142, 3, -34, 125, 49, 83, -105, 122, 21, -18, -27, 139, 107, -24, 41, 14, -17, -55, 62, -20, -103, 6, 65, -39, -74, -18, 38, -24, 16, 111, -72, -16, 110, -13, -39, -30, -2, -70, -45, 16, 69, -5, -93, 111, -114, -87]
2877h7J6p3N3O1O6M7j42J02O7j06o3K02k29J61P2o7j07RJ03n0j25J01j5k8R0l1
2903B7m8L0k0J22j58N9N0n5M2m7l9o4K4R1n7K2m1J11j82Q8RLK8L2mJ6j9qJ9K0
2933E1j6l5l1J3L3l8j05L9J2j9O3L3k7K7jj11J05k6J46j33L6P4Q9p2j01O3N5j35
2961a1j8O4q7j48K24r9N2k0O4J7j8M8P6k05l8R0J62k21K01q7n9K0K1r4l0Q0N8
2988D2q5p9J78k5j30J88j2o5R8n7K4j00Q0j70J17k1l9N0l8J09Q7k72k2K64j47
3013b5P4r9K1Q3j40Q5R4j26mP4k0Ql5K1j54J87o5K2j24O7J03j14O2j9N2Qm8k1
3041c3L7L8P2p4o7P0%m0R5j01O7r6Q9p4M2J5p6O5K2o9P1J1j04J14j37J73p0k3
3069A7j54J93l8r1k5qJ69k68J85jn7K23j53M8pj58K99j50p8L6J80J9j27j27J85
$$ y = [-87, -71, -144, -91, -30, 36, 83, -59, 43, 110, 4, -59, 143, -86, 75, 147, 80, -27, -18, 85, 35, -90, 11, -4, -32, 58, 27, -21, 9, -11, 111, -47, 12, 62, 7, 49, 2, -37, -101, -77, 14, -43, -21, -62, 49, -133, -45, -36, -33, -5, 27, 23, 39, 20, 12, 31, 51, 35, 0, -31, -18, 15, -23, -128, -89, -77, -96, -33, 0, -27, 0, -1, -112, -7, -33, 113, -20, 16, 90, 179, 107, 6, 69, 124, -11, -29, 35, -52, -200, 24, -75, -23, -43, 21, 38, 20, 68, 144, -61, -99, -9, 153, -68, 133, 46, -13, 7, 28, -66, -96, -16, 42, -43, -122, 56, 31, -99, 89, 77, 12, 110, 53, 77, -23, 57, -113, 4, -17, -56, -6, -44, 65, 152, -120, -142, 122, -25, 49, -50, -29, 54, -86, -1, 93, -33, -37, 37, 17, 25, -10, 11, -143, 44, -21, 1, -123, -56, 47, -67, -5, -24, 28, 36, -12, -33, 4, 42, 114, 40, -27, 43, 43, 3, 98, -3, 64, -32, 57, -17, 25, 40, -36, 29, 51, -18, 53, 64, -40, 74, -63, 110, 40, 17, -137, 56, 18, -73, -98, -106, 63, -205, -20, -21, -78, 145, -8, 40, 33, -125, 174, 24, -54, -18, 162, 181, 54, -73, 112]
3094A12j60N2L0l8L6Kp7Q9j24L9PR2M6m3j23J32K4m3r7N2R0n2j01J20r5K0j9K8
3122ap6J5J58o4p9J18j7l8m7J12n9j4L1N3j52N1m6P2o9P2J04j59k8l0P1K5j5J55
3150A43j26m2J10q3q1N0P7j1q7mO4L9m8m2n6J06j58J2J13P1r9JJ1Q7J14k13J12
3177F0m1p7K6L3M1M2q8ONn8J04n8l0J30k01P9j6k8Q8O6j34P5M0o0K0P1o3j44J73
3206F1o6J4J4J5j79J83j9O6o4n7n5J25Oj4m3L1M9q9L5J7j5R1j03J6J5j40p2J75
3234cp8O4M1o6Q4o8M1L5q7PP6m7Mj5O8j44O8L7oJ3j6j26K0m4J59j46J14kM8n7
3264b6nJ39j53NM2J2K1p6L3L1m2N0p1jj0J67j21j03N3O0N2kj8q2r%J92j25lJ2
3294B2%j5l7R9q4Q5l1j07Q1k9J19j61L7M6j0N5l8N5j27L5j1J06o9Q0l7n9p7J31
$$ y = [112, -48, 4, 34, -4, 32, 34, -43, 46, -78, -39, -32, 60, 106, 63, -60, 72, 96, 53, -44, 8, 98, 46, -55, 65, -30, -10, -29, -1, -77, -62, 96, 32, -47, 71, 54, 16, -31, 81, 22, 8, 39, 92, -60, -9, -55, 17, -52, 20, 124, -35, -63, -93, -22, 3, -12, 143, 17, -25, 85, 2, -79, -29, 48, 37, -50, -54, 10, 49, 1, -41, -97, 9, -149, -137, -24, 47, -52, -51, -40, 47, 161, -52, 60, 19, -58, -32, 1, 42, 84, -4, 2, 7, -51, 53, -5, -35, 95, -106, -27, -43, -71, 17, 83, -51, 24, 64, 4, 24, 95, 32, -112, 61, -5, 9, 23, 38, -141, 42, 23, 89, 25, -32, -87, 38, 44, 30, -13, 18, 67, -22, 13, 30, 15, 106, 3, 19, 34, -106, -178, -3, -81, -17, 24, -42, 42, -26, 15, 50, -37, -30, 46, -1, 3, -12, 56, -88, -20, 17, 11, 24, 8, -118, -98, -142, 17, -129, -15, -17, 31, -26, -31, 108, -45, -40, 2, 14, 35, -41, -8, 23, -19, 31, -40, -41, -51, 116, -5, -108, -55, 5, 57, 55, 37, -45, -54, -54, 138, 13, 10, 22, 22, 7, -30, 69, -15, 70, 39, -68, 13, -16, 103, -58, -21, 25, 15, 70, 32, 87, -40, -5, -16, 90, 21, 101, 64, 5, -72, 59]
3322E9k1j43N6L0K5o5R9l6KjP1p1J14n9n0l4Q0j39M4P5L0j36N9J5n4m5j7J65Q
3351F1j12R4r0M2M2o2Q4j64J50n1m3N2No3P6j27J10m2k4M6r9K28n0j36P7J2P6
3378I2k09L6J58j28K4J22q4N1j7j13J02K7j61L6Q7p3j5l4J28p9K4Q9o2m8L7N7
3404D7j10N8qM5j77K94k18l6K1J72j19j07R1L6k8n9J53j4l0O5j07J23q7j16O4
3429d7N4M0M4Pj73J31k8j45M4N9P7j0j39K30j19j21J07L5K3L2n0l5J8m7J7J05
3455A09j02K8n0L5o1m3R5l9OKJ2N1j19K7L2N8l0J82k66J14j28J62l1k5K1j58J10
3482hOR1r7J07o7N0r9J0J6Km5L0N4k2OK3j27Q1k1J9q6P5k8J42j47q0K09p5p5K02
3512A46j41Q1O2k11O7O2r5Om2o8R8j5j49K20l6l2P3l2j6J11%j9mj10OO9P2m2m9
$$ y = [59, 38, -105, -49, -19, 6, -59, 40, 4, 6, 5, 76, 5, 119, 60, 10, -24, 56, -83, -39, 36, 66, -70, -11, 4, -50, -95, -112, 53, 61, -51, 43, -47, -5, 37, -25, 59, -105, 45, -6, -49, 3, 8, -55, 21, -106, 4, -38, -62, -16, -115, 113, 63, -73, 4, 16, 92, -117, -81, 77, -51, -27, 95, 11, 62, 45, -68, 34, 61, -100, -64, 23, -50, -65, -99, 29, -50, -26, 63, 1, -47, -10, 47, -63, -5, -13, 32, -145, 149, -69, -105, -84, 88, -31, -138, -47, -11, -39, -98, 55, 41, 11, 76, -31, 92, 5, -111, -47, 7, 47, 91, 98, -75, 56, 28, -117, -73, -14, 63, 53, -86, 144, 25, -96, 11, 46, 69, 101, 51, 16, 34, -13, 4, 109, 7, 35, -15, 20, -41, -84, 11, -28, -22, -20, -8, 43, -76, -49, -17, 41, 11, 193, -73, 41, -87, 75, 44, 19, 40, -118, -8, -2, 89, -8, 99, 32, 82, -17, -7, 9, 11, -34, -4, 50, 28, 34, 57, -70, 11, -10, 9, -77, -2, -30, 112, -35, -115, 94, 19, -56, 146, 5, 86, 148, -63, 4, 66, -29, -23, -65, -133, -35, -50, -199, 21, -15, -47, 26, -6, -22, 89, 89, 70, 66, -44, -38, 31, 103, 61, 12]
3541A2o7ML6J34j28K6M6k2n2rJ54j94J7M0j5k1P3J14j51Q3J2j36K7j2M5K5k6L2
3569D7o6k2J3j38J27J40r1J0mm1Q2q9j0P2po3M9Ll9J6k8N0n4Q7p5Q4O8j24R8q4
3599A1Km6O5O6o8J1j6J3n5o1l1J06n0l5pK9O6j15K15r3p8O6L2r8L9M1O9l6J3r1
3629c6m4R7R6k03P6Lr1K2N3m4P8N0j32J13q4N4K5lp1O4Mk9j1n9Q1p2k8R5Q7q0
3659A1j0Mk8J73j20L4K8j00L4j26J40J4l2p3O1oR7j50J39j05M0j9mp3N2N0p1M9
3687IN3Q6j90N9N3K0j08K7n8O2M6j7Jj61J26l7O0j55nJ30n7R1m6K5j26J73m8j02
3715h9J02K6o7pL9m3R7n6K5K3j06O2m8R9n9l3L8j1P0J1j63P2J01p7p4J07R3j83
3743e1J05j10M9O9j22O1k6M7j5k8k5L2l3N4J2O7Lr4J53o7j38J08P0j64J11J4J8
$$ y = [12, -55, -51, -15, 119, -9, 17, 63, 41, -11, -20, 134, -60, -43, -3, -18, -39, 34, 148, -3, 80, 92, -44, -17, -29, 16, 41, 15, 47, -19, -41, -28, -166, -39, 101, 10, 20, 16, -25, 57, -32, -42, 30, 23, -40, 9, 12, -27, -11, -39, 11, -43, 44, -31, 53, 121, -3, 95, 11, 13, -33, 32, 98, 30, 41, 25, 38, -17, -78, -109, -3, -53, -88, -95, -66, 0, -115, 100, 7, -71, -5, 27, -71, -32, 9, 78, 42, 55, -36, -80, 17, 113, -90, -14, -11, -102, -80, -27, -71, 7, 57, -75, 38, -46, 8, 33, 30, -41, 23, 27, -2, -13, -72, 9, -63, -91, 4, 91, 11, 1, 5, -23, 150, 30, 64, 92, -8, 26, -100, 40, 54, 22, -51, 10, 4, 101, -49, 90, -15, 25, 6, 2, -71, -19, 31, -40, 9, 62, 148, -42, 17, 70, 90, -18, 9, -49, 13, 59, 42, 43, -118, 8, -29, 31, -124, -129, 1, -56, 35, -11, 14, -112, 61, 13, -89, 13, 39, -28, -35, 4, -39, 58, 2, 27, 50, -56, 6, -42, 57, -2, -35, 3, -8, 62, 73, -90, -18, 83, 6, -68, 39, 132, -51, 54, -56, -7, 62, -60, 1, -25, 22, 7, -21, -46, -14, -47, 7, 19, 86, 89, -5, 148, 81, -57, 51, 121, -43, 68, 82, 100]
3770A00l3p1Ml8j13J63Pj34J35n4M5L4M7j05J8K6K7m0N0r3n8P9r5J46j2l3o0K7
3798c1qj3M7P9j25L3l9J02J20j33j09j5J45Lj10j1P9pj1l7MM6l3L5o1L3L4m3Q8
3827F2p2pJ00K8j8qn1k09J09K9o8J91l9K0k9m9K0kjmk2Q3p8QJ13n4l8l3L8n1J31
3858I9n8k1J13j15NJK3j8n9P2j59Q9k7J32kon3N4j34R7mJ06j72MJ10j03J36j12
3886bj26K62j0j95pJ01M2j11J18q7k2J10N5j9l9r0L1N5j07O3m5Q3ql2R0p9L1m5
3914A7o1J4J25m1n5J5O5j04M9qjq0RQ8n8pl8R7o8N7j00K1j1J34k6o6P8%k0m4M6
3945B7J8m5l5J05K2M3k31J01j06KP8p7P6M6j53J75m1Q7j63R2p2L2l5J8R4j42Q6
3972Br4j9J25j2o0O9j5j8O7l1j5J79k22J16o1J36j07l3Q4r2l8l6M8p4J08J6J6
$$ y = [100, 67, -4, 0, -38, -151, 12, 19, -115, 20, -34, 11, 45, 92, -13, 5, 31, 58, 18, 68, -25, -83, -4, -99, 47, 35, 2, -58, -31, -39, -52, -5, 74, -51, -18, -57, 45, 165, 32, -77, -92, 53, 56, -54, -65, 14, 7, -4, -41, -37, 9, -24, 11, -50, -17, 17, -26, 62, -10, -17, 83, 111, 93, 85, 34, -175, -66, -37, -105, 86, 47, 67, 38, -11, 9, 7, 6, 2, -20, 63, -15, -7, 106, 52, 14, -19, 19, -32, 99, 41, 20, 133, 18, 23, 24, 47, 29, -30, 42, -117, -28, -55, 77, 75, 69, 16, 70, -64, 33, 29, 135, -37, -33, 77, -26, 110, -2, -128, 134, 124, -71, -78, 23, 65, -46, 72, -15, -37, 73, 128, 109, 70, -20, 11, 66, -41, 22, -23, 60, 52, 20, 110, 31, 62, 17, -44, -30, 95, 54, -1, 14, 79, -25, 24, 16, 15, -65, -56, 32, -26, -33, -71, 26, -42, 15, -85, -64, -75, 59, 33, -33, 45, 45, 25, -19, 27, 45, 0, -35, 70, 92, 135, -96, 5, -101, -99, -21, -98, -22, 24, -129, 46, 5, 92, -71, 21, -51, -19, -54, -36, 58, -84, 2, -92, -111, 14, 2, -58, 11, -4, -22, 45, 14, -1, 178, -44, 72, 11, 147, 40, 7, 91, -1, -39, -75, -27, -101, 7, 23, 39]
3999C9j24K1n2Q2k1P4K5kj9N2r5Q6n9K1n3q6J97k4p5r9J16nj2k7O7p8J21r5J3
4028a2Q2o6J31n7J9o4M7%j13MO8q8K9r8N9qP2L7r2K2l1J60r9O6k9q5M2j18R4O6
4058C8o4lJ74j58q1J37Q2q3j40J17K2j31J88j18N7j9R6o2r0J02L1m8L3lq4j0o
4085b3M8o9lJ2J3n2l9J30k8J4L6m9R5j84O6J13n8pJ3j66J14Q5q4k5J15o2l5P4
4113D4o5k9O1nk0lj12J78j8Rl4n0J60j35P3p4q4Q0L2j26J23m7L1N1q6O9N6j03
4141b4J38k46N9J63p4rk8J17o6N7m8j21J12j10K2K0%O2n3J8j73L15j47P7j41J47
4167F7J6j01k9Q2m0N6j34J7P7m4J14j54J62o6o8J12j90J23p8QJ25m9n9J28J14
4192A89k06l0R9j03m2Q1l6J0J6M6J7n5QJ6o8J51k4l8K9N0j30O9n4n0J17l8q7N8
$$ y = [39, -85, -64, -116, -34, -55, 19, 44, 42, 23, 75, -20, 66, 7, 28, -25, -111, 86, 62, -13, -112, 4, -1, -13, -40, 27, -51, 70, -25, -12, 70, 4, 135, 78, 97, 33, 80, 80, -33, -29, 39, -49, -20, -118, -59, -67, 5, 42, -50, -28, -59, 101, 2, 68, 39, -46, -4, -122, -28, 38, -26, -29, 145, -13, -94, 43, 125, 42, -98, 19, 41, -90, 98, -20, 37, 18, 114, 52, -38, 64, 95, 47, 80, 77, -7, -17, -23, 25, -44, -47, -35, -22, -74, -113, 17, -11, 3, 39, -10, 85, -99, -33, 80, 22, 15, 28, -138, -24, 61, -23, -48, 67, 5, -30, 44, -21, -50, 11, 6, -14, -17, -129, 49, 31, 40, 6, -44, 116, -19, 54, -20, -104, -24, 8, -118, 5, -42, -11, 40, -46, 23, 79, -24, 114, -132, -73, 90, 16, 7, -21, 96, 30, 87, 39, -82, 30, -80, -58, -38, -38, 24, -29, -11, -184, 131, -16, 61, -80, 67, 83, -18, -47, 35, -5, 51, -83, -66, 11, -33, 81, -73, 89, 23, -45, 67, -123, 0, -78, -70, 55, 6, -53, 75, 189, -17, -47, 52, -51, -93, -12, -48, -38, -22, 24, 41, -14, -6, 10, -58, 93, 69, 31, 60, 110, -20, 49, -5, -55, 62, 24, -63, -5]
4220eP5q2PK6n2POo0Q3j4J86k37Q1R3q8M9nn8J3j27J01J10o8j22O9j6M9K1K4n5
4250A1p3J23j8k6j9R9p4M9r6L2m8L3N1r3JL3Rp6R6L0m5%j16Q9l7RK16j83O9m3
4280CM5qp6M5Jj3J1J1m2Q9L4j10L9l0J22k19J9J22j52O1M8RO8j48K29L4k43J01
4308E0j04K4PP3j13M8K1k3M3n2K01k14J10j75J53j76J85Ro0K9J5j8k9m6J24j92
4334a10MN0nJ02j43Q9k0J1R6j40j6Q7R2j78J70j2k1k8L1j16O6m9N5r2l5O7N0o3
4362e8J54j58Q0o6J21K0r4j9mJ43j02qO2lp7J4P9j13J67k36R4j14L0J9J87j11
4388GQ1n0Q9J8r7n0rR2j05L3K4o9k6m0Q7L3n2J13j37N1m3O7O2l8M4Pl8q3J9j06
4418a16J79j4L7r6r9J32k1k9nj7l0O2K7kJ0J05k1o7q1J07n6m5N9K9j37J60q0m2
$$ y = [-5, 70, -12, -5, 21, -31, -24, -18, -78, 5, -9, 177, -60, 21, 114, 26, 75, 70, 12, 25, -102, -1, 109, 41, -81, -12, -28, 21, 42, 66, 11, -62, 61, 43, 17, -2, 97, 23, 72, -24, 8, -40, -7, 44, -49, -48, -15, -6, -82, 14, 44, -1, -1, -117, -28, -65, -56, 160, -23, 46, 3, 48, 40, -36, 9, 10, -3, 8, 19, -23, 66, 100, -10, 29, -1, 121, -98, -79, 43, -109, -48, 0, 9, 77, -71, 158, 192, -51, 50, -54, -30, -23, 50, -63, -15, 6, -17, 26, -26, 175, -39, 71, -104, 49, -127, 58, 67, 7, 36, 51, 33, 4, -42, 82, -110, -106, -56, -61, 41, -102, -13, -33, -22, 74, -66, -82, 5, 97, -81, 89, 77, 56, 28, 59, -57, 9, -40, 15, -77, -112, -45, 5, -58, 96, -62, 18, -48, 73, 93, -1, -20, -24, 119, 17, 9, 71, 68, -9, 5, 84, -29, 138, -98, -4, -118, -88, -69, 118, 7, 88, 38, 127, 145, 48, -2, -11, 81, -24, 9, 33, -36, -62, -102, -15, 18, -34, 79, -58, -7, -50, 17, 79, 41, 85, 92, 54, -29, -10, -116, 63, 49, 86, -10, -109, 23, 2, -27, -32, -49, -79, -17, 10, 8, 18, 123, 102, 35, -46, 61, 5, -40, 19, 48, -89, 71, -9, -51]
4446e1K1k5L5J0MR0j66J63l8j66Q8J15R6j26m9r0J03J0M2l7L9n6o7J12p8L6m5
4473c0J0p5J50L3l5Nj52J48J12o2n5m8J1K6q4N0l8Q1q1%Ql6Q2pO3q5J7O6o0J3
4503B7l9L9l3M1j7R9j47n1NJ9M1L3K6jm4J18q2nj2J19k06J44j08O9j21Q8Q8j08
4531a8K1j26Q6J7J1n1J08J4j10M6o6J44r5J5l3J02or4j0kO5lm4qJ07q5L6n6o2
4560i7J89r5j54P8rkj7J55p7J05p4M3j24NJ23l2q7J26n1l8PlL6j00J81j45N2N9
4588E4j33J57j03M2O5J9r1k8J8P0o6j30R7rP2q5n9O7l7J54m0j1M5Mk03K17k6M
4616F4J4m6Jk4N2j29J98j74J38j03l2j14J40j7k3J34m8k2k6J37k00J00M4r6ko1
4642i5MP7m2J34o6n2j07J14l0k0oO7j4O3n7Q1lr9P5r2J50k6K6r8J5J02j3Kq2n7
$$ y = [-51, -30, -55, -20, -10, -6, 84, -82, 81, 43, -123, -35, 80, 176, 50, 1, -89, 14, 24, 66, 29, 68, 12, -55, 57, -21, 15, -30, -20, -95, 55, 88, 53, 58, -94, 54, 166, 104, 49, 1, 12, 38, -46, 4, -34, 47, -34, -34, -26, -62, 20, 13, 76, -9, 8, 74, 14, 27, -12, 27, -6, 35, 18, 117, -30, -81, -76, -57, -16, 17, 43, 42, -2, 116, 34, 29, 17, 136, -70, 74, -34, 35, -86, 2, 90, -18, 3, -123, -37, -20, -9, -60, 48, 62, -48, -2, -68, 76, -19, -4, -37, 65, 59, -35, -45, -47, 18, 15, -29, -37, 70, -15, 21, -35, -97, 92, -3, -157, -79, -88, -90, -107, 48, -29, 76, 2, 45, -79, -74, 49, 17, -70, 56, 5, -33, -26, -29, 7, -93, 88, -57, -5, 54, -79, 78, -25, 17, 82, 101, 10, -18, 0, 70, 4, -126, -29, -38, 34, -51, -110, -43, -80, 74, 34, 23, 68, 72, -131, 86, 60, 64, 78, 32, 33, 9, 61, -68, 130, -44, 94, -9, -41, -155, -15, -32, -55, 79, 31, 9, -17, 120, -80, 20, 64, -32, -34, -95, -91, -14, -56, 78, 12, -40, -147, -33, -63, -83, -89, -22, -36, 27, -30, 51, 48, -51, 24, -68, 82, 56, 82, -16, -1, 101, 88, 90, 8, -49]
4672d9KM1L9m7M4k9P6n3KrRm4L5M0k3j26J19p8J30j80qQ2L1q2mL8rQ3k3O2K5k6
4704F8NmJ1k0J4q3jln6Q9j02J43rm3k9n9K6J49j77J03j5j6J32%j64oJ02O6j41
4733b0Q6j33j0K32k26J60k25J64o3L5q1M5O9pk1O7J9J9k7r8Nj5P4k8n7N8o9K0
4761b7m2K3o2K18j50J27O6j43R8K8k2j53P1j0l3j08J38j10Q1L2o0J95j40k9j9
4786c1l7J10p2J06l3lN3j61J37n1J9n4J9J06j44P5p9N2j4o9J69j27pJ2K6N4r6
4813d0R9O0M3j08Rj12nM5pQ9kl0K1j38M3O7m6N2j09J02K5j01J26j8o7O2p3L9j6
4842A0R7k7j00N7M1j22P0l8r9R7%M7O2j46QJ6j3P6lQ4o1j73J19M2j40N7J9J3l2
4871c9p1M3L3p3O1M5R2n9l0M0J2n0q6Q6K8pM5l0J7n5P0Rqj04J03no0j0J2rm6K1
$$ y = [-49, -47, -6, 33, -14, 30, 1, 77, 24, 26, 17, 26, -18, 17, 57, 34, -92, 27, -51, 79, -101, -109, -27, 4, -78, -82, -44, -53, 30, 7, 69, 94, 68, 73, 69, 80, 60, 74, -9, -10, -13, -69, 20, -82, 61, 52, 9, -20, -79, -53, 96, -81, 22, 7, -9, 123, 123, -41, -47, 55, 121, -20, 66, -67, -77, 155, -71, 89, -136, 28, -35, 0, -81, -36, 33, 26, 5, 72, 91, 110, 83, -15, -10, -25, 49, 21, -36, 22, -47, -27, -69, -46, -108, 110, -40, 87, 153, 10, 108, 136, 114, -39, 32, 22, -11, -119, 19, -91, -10, 22, -38, 157, 17, -12, -31, -68, 42, -30, 76, 43, 40, 93, -68, 69, 18, 37, -17, 2, 108, -36, 39, -40, 12, -2, -71, 98, -29, -36, -24, 2, 56, -40, 59, 119, 162, 54, 63, -49, -54, -9, -16, 73, 71, 41, 62, -76, -33, 34, -12, 40, -69, 33, 58, -43, 83, 65, -2, 60, -13, 26, 10, 107, 80, -20, 37, 78, -44, 26, -12, -111, -14, -14, 33, 95, -51, -43, -27, -40, 36, 33, 117, 56, -117, 2, 44, -96, -39, -20, -7, -39, -110, -67, -34, -107, -46, -1, 91, 32, 2, 42, 54, 4, -82, 4, 32, 25, 70, 40, 57, 2, 72, 81, 73, -31, 72, 67, 7, -3, 9, 0, -46, -25]
4903b5n8J62j42Q6J11k43J85j04j1l7P0P5j05L7n4O6m1on9n3J05L5l2R6n4K22
4929B26k24o4J77p6m8Q5p0l8N6N1k5K6p6lK4O8j29j3J16K0j32J02k1jkn0P8p8
4957b1l9L1m4J52q8Q5o2j17J07m5J2O9J0q3j9Q0J5mj1R6j69J46j91J63j30J2l3
4984g8J20mL2j01o3P0O7K9k05J31J4O6n7N4No7K7n7R5o7k9r2J80j03R3q2J02j34
5012e4n4P2P2jm2OJ00r5M8l5K1p9P1r8jJ03j40M6J75m0j17O7P7n3J6j17J92j21
5040A9l1O7Oj15m8J08o0J26j10RM5K3k2o1l1J42j17R1l6n6J68j63J72r7no1J45
5067A08j04j23Q6m4Q9Q2q4r7N5k8r0R1PJ24j21J01r1lJ42j1j95P0J45j45R5j51
5093i2Q6j2N2k4Rk0j0N1m2K0jO7j06l2P6r5N5l5m3K5N4J3O3j51Q4J0J00j56R5
$$ y = [-25, -83, 79, -63, 23, 134, -109, 76, -28, -39, -76, -6, 69, -36, 1, -53, 13, -28, -34, -93, -146, -41, -6, -38, 58, 4, 226, 2, -62, 115, 39, -9, 76, 6, -32, 24, 75, 50, 76, 0, -3, 21, 89, -40, -53, 63, 83, -49, 53, 32, 31, 29, -21, 57, -21, -60, -29, -73, 79, -9, 76, 14, -103, 4, -41, -29, 40, 50, -33, -52, 28, 43, 39, 28, 124, -45, 101, -90, 73, -57, -45, -78, 42, 38, 70, -31, -94, -24, 43, 72, -133, -2, 12, 78, 21, 75, 80, 13, 40, -17, 78, 11, -18, -110, 70, -33, 60, -22, 80, -54, -108, -36, 36, 35, -7, -1, 99, 4, 52, 17, 38, -41, 30, -68, -69, 34, -106, -60, 115, 75, -42, 25, 102, 49, 65, -52, 140, 19, -12, 55, 61, -54, -102, 6, -54, 72, -38, -29, 16, 39, 17, -44, -75, 67, -50, 41, 5, -51, 117, -46, 126, 29, 24, -37, 108, 4, -119, -33, -77, 12, 94, 10, -87, -32, -60, -150, -59, -52, 72, -49, 52, -39, -42, 100, 89, -106, -36, 109, -36, 59, -92, -6, -18, 34, 10, 19, -1, -11, 40, -2, 18, 17, 84, -22, -54, 22, -73, -18, -53, -96, -71, -17, -4, 59, -92, -8, 2, 102, -54, 41]
5122D1r3o0P4J0J0K4M8o2k9J56K8j94K8R2j98J8R1j3j6K2J8O6no2P6po3j4N2R
5152D7o7O3k7o8l7L9r9J39Qn1m8P2NJ0j74K22M1j4j62J97o1o7J09ql9lK2J9q9
5181b1n3J22j70k5K69j6j00o5O7Ol0J51j53M1ml9MJ51q8Jj81L1J15o3M4N2q4n3
5209i1J27k7M1n5N9j07O9l9Q9l1q3J04l3J3L7l5j50J68k1J9J7j22J3L1j9M%N8
5237C6j39P8J00j24J16k3M3m1pJ3j10O4O8j52N8k8O8J4p1r1N5N6J33mk1q4n8P1
5265B0q0J16r7J00j1j4j2N9q3j9O7l3J8L5o9l5M7K9k4N7p7l4J39j81Q5Ol0n0m
5294g5k1Q5R0O5j23j7m5k7Q0J18l2j08Q3l3k9M0qj10J36j16J05j08J2O6m5O2j67
5321a22N2Q6j9J8r4J22j7j12J24m1K9m1kK5k5J13q2j23J87j55J62j49J44o5r4
$$ y = [41, -52, -112, -38, -28, -18, 6, 54, -8, -37, 119, 147, -47, -19, 73, -125, -107, -16, -29, -45, -23, -5, 61, 56, -6, 70, 63, 0, -14, 38, 47, -20, 43, 16, -52, -89, -50, -149, -10, -2, -53, -101, -29, -24, -14, -188, 34, 75, 61, -101, 96, 35, -32, 77, 69, 30, 27, 49, 68, -21, -74, 48, -122, -147, 122, 106, 6, -59, 8, 14, -16, 135, -18, 23, 19, -20, -16, 135, 47, 48, -133, -102, 13, -50, -6, 46, -38, -91, 36, 9, 50, -5, 54, -53, 16, -23, 66, 35, -48, 56, 23, 36, 73, 38, -112, 56, 35, 54, 71, -51, -38, -7, -26, -22, -22, 36, -103, -25, 75, -49, 67, 44, 87, 46, 39, 52, -58, 6, 74, -78, -20, -48, 20, 34, -37, -128, -73, -17, 116, 112, 91, 7, -51, 20, -60, 56, -41, 59, 48, 34, 22, 81, -2, -21, 46, 13, 31, 66, -3, -38, 9, 38, 14, 71, -6, -40, 99, -82, 3, 9, -21, -71, -75, -96, -11, 79, 144, 21, 4, -41, -68, 12, 130, 98, -10, 73, 40, 11, 51, 43, -67, 69, -47, 58, -50, -38, 28, -17, 45, -122, -70, 16, -3, 15, -79, 43, 26, -86, 38, -3, 26, -15, -17, 8, -17, 96, 14, -109, 78, -77, 85, -64, 80, 15, -79]
5346g9Q3R8o7n8pP4np7O3j57J98lj7j2nJ8j2p3q3J92r9K6M9J0j30L9P3j7j28J55
5376D9n8K3Lk0rO4j5k5o3K8N1j07J31k1O3k2o0m9kJ1N0n0M1L5L9j52M6J07q4K1
5406B5l8J70j13j03L5m3M9O7n6m4J03j45J01rj6j5N6l0R1%q6Np4L7R9j29J32n1
5434A8L3p8KJ7J3m1P2n4N2K2N7k22J32k2n3L5Q2p9J03Kj99J55l9q2J18p8m2M4
5462c2K3K9m4m5R8M0Pj43O2kk1kM5l1KM7K3l4k5Q0p7J00j47J4n4J62n8O7n9nL2
5493E2P0p5n9L5q6p6J19m5O4K5o5J12o9Jk6O0o6O9J1j51J19q3K11r1o3N3Mn8L4
5522B6LO5n8r5M4n3J5P3J4l9N7o1O6j14J76q2l9L4mr8O2Q4p4o0R4l3k8K3m8N7
5552Gj13J49QN3k17MR2J37j62k5L9L5K2q3Lo0L7J1K06j04J19j65r1P1q3K07n2
$$ y = [-79, 4, 102, 35, -23, -30, 44, 39, -38, 25, -132, 66, 63, 46, 34, 29, 47, 35, -38, -121, 71, -28, -2, 47, 57, -73, -34, 39, 22, -106, 49, -9, 14, 17, -3, -12, 52, 37, 12, -51, -23, 28, -79, 52, 31, 94, 72, 12, -37, -39, -28, 22, -28, 13, 48, 87, -65, -19, 88, 4, 25, -13, 157, 44, -59, -24, -67, -18, 49, -7, -51, 52, -93, 8, -1, -17, -32, 24, -6, 85, 85, -1, 4, -70, -33, 66, -63, 69, 18, 51, -27, -25, -8, 5, -36, 36, -18, 34, 56, 113, -109, 23, 1, -52, -17, 65, -14, 89, 91, -108, 47, 8, -74, 44, -34, -76, -32, -9, 20, -24, -69, 29, 69, 76, -67, -5, -7, -28, -30, 15, -16, -14, 33, 56, 22, -3, 77, 0, 100, -47, -33, -87, 75, 17, 84, 25, 20, 52, 122, 47, -12, 23, -63, -139, -20, -65, -1, 24, -41, 71, 2, 3, -23, 37, -29, 40, 51, -100, 19, -64, 147, 56, -7, 46, 50, -8, 26, 29, 94, 36, -59, -15, -68, -53, 20, 34, -5, 52, -9, 57, -57, 119, 37, -2, 32, 28, -70, -8, 76, 2, -58, 36, 3, -25, -2, -50, 7, -106, 43, 51, 104, -113, -109, -17, 120, -42, -67, -28, 7, 29, -54, -51, -111, -74, -63, 143, 39, 158, -7, -98, -27, -110, 97, 45]
5579D5m8J19m4j16Q7o9P5j34J71r9L6k8o1J4j17K53l8Kn7J00j00p8nJ06M1l4k0
5606An8M4R0j03L6l4L8L3jk7j6mJ52j23N2l8n5pk6J17p5p0l7R6l1j1J41j51K4
5635d3J04n9l6Q3N1j39N6J12r7P4j16k5kN4nm8P5k4N2r8J66j8r1p2m2J21p5R4
5663E2R2j06j13K21j25P1j77J25j1q9j17K20K1j08P5l9J4o6Q1P2j19k2j5O7No7
5689e8O4l2k4O2p0J33o8J7Q3j33R5j36M4l5L8N2o2O7oJ1O2o7n8L4P3j77K8k1J7
5718f7j4O3nNK8k1r9J17J08Pj43j5O9J37j11q9j4N4P6q2oJ3Knj1J2j24K08j11
5747a8k8J6O7K2j1j66P4L2r3R4J3jm4K16j59k3n8Q2O6O8j40l8K3J4N6j22K5R0
5775E7N7q5q2J90q1n2k0N5l2r3J31m6J2M9k13J57n2N7rL7m2O3q2J72j38jL4M2
$$ y = [45, -3, 116, 72, -44, 43, -26, 49, -85, 86, -13, 23, -5, -66, -52, -169, 84, 46, 48, -9, 91, -9, -87, -92, 14, 55, 21, 1, -57, -13, 77, -26, 10, -24, 14, 47, 46, 19, 3, -1, 151, 28, 80, 42, -13, -20, -46, 71, -4, -74, -111, -15, -46, -57, 84, -67, -43, 61, 2, -34, 49, 100, -39, 17, 129, 32, 106, -10, -35, -37, 17, 12, -36, 39, 15, 67, -31, 135, 117, 26, -46, -88, 33, -42, 52, 144, 38, -75, 146, 21, 92, -85, 40, 29, -60, -177, 43, 64, -44, 31, -8, 6, -60, 21, 93, -26, -48, -63, 4, 9, -58, 6, -26, -50, 12, -58, 75, 7, 24, 107, -26, 69, -67, -23, -58, -20, 32, -30, 37, 31, 42, 104, 37, -21, 13, 86, -91, -63, -84, -67, -81, -18, -23, -18, 10, -11, -110, 7, 115, 122, -21, -36, 33, 170, 59, -30, -44, 10, 86, 4, -2, 11, 13, 8, -3, 9, -115, 93, -18, -46, -30, 37, 59, 48, -118, -44, -12, -105, -11, 2, 1, -43, 173, 14, -9, -67, 15, 81, 149, 9, -29, -6, 8, 64, -58, -33, 57, 114, 29, -53, 137, 56, 4, -16, 39, 7, -86, 45, -1, 11, 60, -153, 4, -48, 9, 0, 37, -5, 58, -24, 148, 10, 9, 43, 85]
5803H5j63J35j03K8K4n7M0N2k01J74r5R6J7K1m9J9Ko0J11p2n4P2k4r1J85k8q7
5830b3L0o0O1j08K8J37l8q7%ok7R7N4r8J17j32J24m6L9q0J7J8j9O8m1OM8k5r0
5859c6L4L9q0N6M7o1lR7j22K2J7j0j6P9j27k6P1R2j67J14m2L5K6M9m2n9NP7j08
5888c9N5p0J15j61Q3J33k33J35kM3k0m8N1m4n9Q7m5P8r9j6J0J25q3K0Q5m4K5j82
5916a00J53K4J6r0k0J6Lj00R1N7kj31N0J19l8j55M4J76o5n4rN0j03J40o7m2J25
5943H8j37P5k6Q3j33k6P6J12j17jL1O7o3j1N1o9l6m5Q1O5Rq7j0k6P6k4n8l0L7
5972d8kR9j69m9K39q5N4j7J7N7j34R0q5qN4j35k5O4O2J03o9pP4k1o2r6M1J37p2
6001Gm3J5P9r1l9k2J32n2o3RP7lo8M7Jj0ln3N4P3j3m4k6K0Ql5J8M4n3N2q5J53
$$ y = [85, -78, 57, -46, -18, 6, -51, -11, 41, -160, 14, -81, 15, 32, 53, 4, 23, 25, -35, 76, 4, -50, 22, -2, -93, 92, 64, -23, 7, -53, 8, -100, -72, 65, 27, -60, -60, -66, -93, 4, 58, -40, 77, -55, 69, 23, 62, -18, -1, 17, -2, 66, 25, 31, 79, 54, -36, -2, 37, -43, 13, 60, -1, -4, 93, -29, -7, 10, 0, -16, 63, -64, -90, -19, 73, -94, 20, -22, 13, 39, 88, 46, -13, -8, 69, -39, 16, -54, 61, -100, -17, 116, -117, 18, 16, 59, 39, -9, 42, -2, -61, 26, -19, 59, -40, -56, -46, 79, -4, 16, 101, 57, 82, -100, 53, 77, 93, 3, -17, -1, 2, -98, -7, 50, 48, -83, -33, 86, 48, -107, -63, 113, 48, -6, -15, 35, -68, 72, 5, -37, 88, -49, 26, 0, 83, -50, -76, 0, 112, -5, -6, 25, 92, 29, 18, 69, 0, -36, -81, 0, 65, 74, -13, -23, -49, 27, 3, -55, -85, -48, -50, 49, -120, -169, 70, -15, 39, 22, 39, 96, -38, 52, -33, -41, 13, -122, -147, -83, -21, 82, 13, 6, 80, 59, -3, -99, -58, 79, 7, -36, -21, 58, -33, -72, -94, 38, -14, -77, -68, 9, 6, -62, -15, -14, -24, -27, -80, -26, 47, 34, -10, -36, -16, -8, -43, -25, 19, -34, 18, -67, 86]
6033H6j46N2j18J05P8j46J54j00R0m5ok1J55p9m1p5J8R6k3M1r2k8L8Q3n9N4q3
6060a2K8n7j1M7J16j0kj43lJ08l1K3j09O9q4OP7QN1j05O8L9j30M4K9l7K1J2j20
6089a08N4J63j87R5l6kMJ72j15j36L6O8l1k0KN8m1K3qO0j70K89j76J5Pr4J29q3
6117c2O7j22pN9n3J23l9Q0N7k27J11JP1q7j06N3oJ07k0r6L0k4R8p2J52j41L9l
6145A3J0j06J01K1J0P1j25j16K8J82j58K1J22j37J44l8o6J33K0j24l6J39j24M7
6169C2J8lj44J04N7K8j80J57m3j5K6J08j02m5N3j09J05p3J22j20M1l7J13j24n7
6194h8R3L4r1O5R3j98R5mQ9j24J10n5kR9j25Q3o6j37J13M7j3l8j7O1J4p0J31j5
6222H4j11J11k1j63Q7M8j21J6O5mM0q9P8J5j54O4J03j12R7M1n9R1o3Q3j16n9K4
$$ y = [86, -60, -8, -126, -21, 57, -89, 65, -35, 55, 10, 4, -17, 138, 59, 18, -57, -39, 57, 34, 75, -17, -45, -7, 76, 17, 71, -12, 16, -41, -52, -5, 111, 101, 99, -44, -47, 61, 30, 53, -56, 13, -71, -65, 12, 20, 71, -34, 34, 73, -57, -13, 16, -21, 0, 12, -108, -54, 109, -78, 17, -19, -21, -17, 155, 40, -96, -60, 8, -23, -43, -41, 17, -24, -1, -9, 51, -119, 170, -6, 9, 16, -78, 51, -32, 35, -87, -94, -35, -88, 35, -4, 76, 133, -94, 17, 18, 89, 2, -104, -51, -57, 50, 30, -66, -36, -60, 38, -34, 118, -23, 16, 13, 23, -83, 18, 39, 49, 120, -5, -121, -93, 89, -69, -48, 74, -63, 81, 43, -23, 110, 130, 6, -30, 109, -15, 32, 50, 47, -97, 7, 64, 92, -88, 69, 26, 11, 37, 145, 43, -2, 51, -58, 47, -26, 96, -24, 17, -20, 93, -31, -88, 5, 39, -52, 13, 106, -92, 3, -1, 88, -36, 74, 19, 17, 116, -9, 74, 8, -129, -16, 31, 18, -20, -37, 24, 38, -32, 99, 84, -27, 84, 63, -100, -13, 35, -86, -70, -5, -9, 31, -58, 20, 35, -119, -55, 48, -64, 33, 74, 15, 106, 43, 126, 10, -49, -25]
6249b5Lrl6J59j57J21Lk0n6Jk9j7J04o6P6l9Q5j83P4J04j07J20r2o0K7M2l6L8
6277B5J04j76Q8J23q1J6j69J72j84J53m6p5N3M5n2Q7p2n5Q5K5l5J8p9J79j74J06
6303H1k25Q0O8p4N2k9k0Q9J3qL3j82K8Q8l3o8J62Qj54J40q0N1Pj61J27Oj9J6j1
6332a5P1NjQ3j12RN6j15J77o1j69Q9m1p7J32j9l0l1J09j55J51J0k27O1K0O9j4
6359b5JN5o3O4N3j6n9mq3R3j61J67k2o2O6n6Jk4O9J4qK1J55j95oL8k4J8l7K7O6
$$ y = [-25, -22, -31, -67, 92, -65, 56, 59, 39, -17, -16, -45, -62, 42, -24, 52, 13, 98, -85, -11, 93, -14, 106, 14, -46, -19, 23, -13, 25, 129, -47, 41, 164, 83, 99, -70, 102, -82, 71, 25, -50, 3, 48, -4, 83, 11, -44, 41, 66, 31, 49, -30, 149, -25, 81, -144, -64, 4, -70, -18, -47, -67, 22, 35, 27, 60, -122, -94, -6, -39, -107, 55, 63, -91, 49, -31, 20, 27, -134, -7, -1, -20, -4, -15, 56, 61, 60, 143, 31, 40, 96, -19, 158, 97, -72, 17, -24, -101, 31, 12, -18, -49, 60, -95, 56, 66, -161, -100, -80, -11, -25, -24, 31, -32, 32, 85, 69, 10, 6, -77, 16, -145, 22, 0, -62, 4, -52, -51, -75, -6, 8, 0, 21, 176, -19, -25, 13, -11, 7, -30, -3, 63]
$$ [...]
8191e1
##END NTUPLES=NMR FID
##END=
