##TITLE=1H_Pr 53-6g
 200.13MHz,CDCl3.
 8 sc
 
10.3.2026
##JCAMPDX= 6.0         $$ Bruker NMR JCAMP-DX V2.0
##DATA TYPE= NMR FID
##DATA CLASS= NTUPLES
##ORIGIN= UXNMR, Bruker Analytische Messtechnik GmbH
##OWNER= pz
$$ XWIN-NMR		Version 3.5
$$ Tue Mar 10 15:17:48 2026 Russian Standard Time (UT+4h)  she@DPX200
##.OBSERVE FREQUENCY= 200.1313
##.OBSERVE NUCLEUS= ^1H
##.DELAY= (6, 6)
##.ACQUISITION MODE= SIMULTANEOUS
##.ACQUISITION SCHEME= undefined
##.AVERAGES= 8
##.DIGITISER RES= 18
##SPECTROMETER/DATA SYSTEM= spect
##.PULSE SEQUENCE= zg30
##.SOLVENT NAME= CDCl3
##.SHIFT REFERENCE= (INTERNAL, CDCl3, 0, 14.3821)
##AUDIT TRAIL= $$ (NUMBER, WHEN, WHO, WHERE, WHAT)
$$ ##TITLE= Audit trail, XWIN-NMR		Version 3.5
$$ ##JCAMPDX= 5.01
$$ ##ORIGIN= Bruker BioSpin GmbH
$$ ##OWNER= she
$$ F:/spectra/data/she/nmr/H-C/1/audita.txt
$$ ##AUDIT TRAIL=  $$ (NUMBER, WHEN, WHO, WHERE, WHAT)
(   1,<2026-03-10 15:15:59.35 +0400>,<she>,<DPX200>,
      <created by zg, POWCHK disabled, PULCHK disabled
       configuration hash MD5:
       00 E9 B6 7A A2 85 ED C7 34 08 36 98 17 FE 4E 26
       data hash MD5: 16K
       76 52 73 28 C0 6C FC D5 0E C9 E9 4A FE F0 59 0E>)
$$ ##END=
$$ 
$$ hash MD5
$$ 2A 84 DE 58 33 01 28 7D 03 CA 5A 0C 7F CA D4 0C
##$RELAX= 
##$RELAX= 
##$RELAX= 
##$RELAX= 
##$RELAX= 
##$RELAX= 
$$ Bruker specific parameters
$$ --------------------------
##$DU= <F:/spectra>
##$EXPNO= 1
##$NAME= <H-C>
##$PROCNO= 1
##$TYPE= <nmr>
##$USER= <she>
##$AMP= (0..31)
100 100 100 100 100 100 100 100 100 100 100 100 100 100 100 100 100 100 
100 100 100 100 100 100 100 100 100 100 100 100 100 100 
##$AQSEQ= 0
##$AQ_mod= 1
##$AUNM= <au_zg>
##$AUTOPOS= <>
##$BF1= 200.13
##$BF2= 200.13
##$BF3= 200.13
##$BF4= 200.13
##$BF5= 200.13
##$BF6= 200.13
##$BF7= 200.13
##$BF8= 200.13
##$BYTORDA= 1
##$CFDGTYP= 0
##$CFRGTYP= 5
##$CHEMSTR= <none>
##$CNST= (0..31)
1 1 145 1 1 1 1 1 1 1 1 1 1 1 1 1 1 1 1 1 1 1 1 1 1 1 1 1 1 1 1 1 
##$CPDPRG= <>
##$CPDPRG1= <>
##$CPDPRG2= <>
##$CPDPRG3= <>
##$CPDPRG4= <mlev>
##$CPDPRG5= <mlev>
##$CPDPRG6= <mlev>
##$CPDPRG7= <mlev>
##$CPDPRG8= <mlev>
##$CPDPRGB= <>
##$CPDPRGT= <>
##$D= (0..31)
0 0.7 0 0 0 0 0 0 0 0 0 0.03 0 0 0 0 0 0 0 0 0 0 0 0 0 0 0 0 0 0 0 0 
##$DATE= 1773141358
##$DBL= (0..7)
120 120 120 120 120 120 120 120 
##$DBP= (0..7)
150 150 150 150 150 150 150 150 
##$DBP07= 0
##$DBPNAM0= <>
##$DBPNAM1= <>
##$DBPNAM2= <>
##$DBPNAM3= <>
##$DBPNAM4= <>
##$DBPNAM5= <>
##$DBPNAM6= <>
##$DBPNAM7= <>
##$DBPOAL= (0..7)
0.5 0.5 0.5 0.5 0.5 0.5 0.5 0.5 
##$DBPOFFS= (0..7)
0 0 0 0 0 0 0 0 
##$DE= 6
##$DECBNUC= <off>
##$DECIM= 32
##$DECNUC= <off>
##$DECSTAT= 4
##$DIGMOD= 1
##$DIGTYP= 9
##$DL= (0..7)
0 120 120 120 120 120 120 120 
##$DP= (0..7)
150 150 150 150 150 150 150 150 
##$DP07= 0
##$DPNAME0= <>
##$DPNAME1= <>
##$DPNAME2= <>
##$DPNAME3= <>
##$DPNAME4= <>
##$DPNAME5= <>
##$DPNAME6= <>
##$DPNAME7= <>
##$DPOAL= (0..7)
0.5 0.5 0.5 0.5 0.5 0.5 0.5 0.5 
##$DPOFFS= (0..7)
0 0 0 0 0 0 0 0 
##$DQDMODE= 0
##$DR= 18
##$DS= 0
##$DSLIST= <SSSSSSSSSSSSSSS>
$$ [...]
##$SUBNAM0= <"">
##$SUBNAM1= <"">
##$SUBNAM2= <"">
##$SUBNAM3= <"">
##$SUBNAM4= <"">
##$SUBNAM5= <"">
##$SUBNAM6= <"">
##$SUBNAM7= <"">
##$SUBNAM8= <"">
##$SUBNAM9= <"">
##$SW= 18.0517328524113
##$SWIBOX= (0..15)
0 0 2 0 0 0 0 0 0 0 0 0 0 0 0 0 
##$SW_h= 3612.71676300578
##$TD= 16384
##$TD0= 1
##$TE= 0
##$TE2= 300
##$TE3= 300
##$TEG= 300
##$TL= (0..7)
0 120 120 120 120 120 120 120 
##$TP= (0..7)
150 150 150 150 150 150 150 150 
##$TP07= 0
##$TPNAME0= <>
##$TPNAME1= <>
##$TPNAME2= <>
##$TPNAME3= <>
##$TPNAME4= <>
##$TPNAME5= <>
##$TPNAME6= <>
##$TPNAME7= <>
##$TPOAL= (0..7)
0.5 0.5 0.5 0.5 0.5 0.5 0.5 0.5 
##$TPOFFS= (0..7)
0 0 0 0 0 0 0 0 
##$TUNHIN= 0
##$TUNHOUT= 0
##$TUNXOUT= 0
##$USERA1= <user>
##$USERA2= <user>
##$USERA3= <user>
##$USERA4= <user>
##$USERA5= <user>
##$V9= 5
##$VALIST= <valist>
##$VCLIST= <CCCCCCCCCCCCCCC>
##$VD= 0
##$VDLIST= <DDDDDDDDDDDDDDD>
##$VPLIST= <PPPPPPPPPPPPPPP>
##$VTLIST= <TTTTTTTTTTTTTTT>
##$WBST= 1024
##$WBSW= 4
##$XGAIN= (0..3)
0 0 0 0 
##$XL= 0
##$YL= 0
##$YMAX_a= 186208
##$YMIN_a= -226563
##$ZGOPTNS= <>
##$ZL1= 120
##$ZL2= 120
##$ZL3= 120
##$ZL4= 120
##$ABSF1= 10
##$ABSF2= 0
##$ABSG= 5
##$ABSL= 3
##$ALPHA= 0
##$AQORDER= 0
##$ASSFAC= 0
##$ASSFACI= 0
##$ASSFACX= 0
##$ASSWID= 0
##$AUNMP= <proc_1d>
##$AZFE= 0.1
##$AZFW= 0.1
##$BCFW= 1
##$BC_mod= 2
##$BYTORDP= 1
##$COROFFS= 0
##$CY= -3
##$DATMOD= 1
##$DC= 2
##$DFILT= <>
##$DTYPP= 0
##$F1P= 0
##$F2P= 0
##$FCOR= 0.5
##$FTSIZE= 0
##$FT_mod= 4
##$GAMMA= 1
##$GB= 0.15
##$INTBC= 1
##$INTSCL= 1
##$ISEN= 128
##$LB= 0.25
##$LEV0= 0
##$LPBIN= 0
##$MAXI= 10000
##$MC2= 0
##$MEAN= 0
##$ME_mod= 0
##$MI= 1.114404
##$NCOEF= 0
##$NC_proc= 0
##$NLEV= 6
##$NOISF1= 3.799351
##$NOISF2= 2.8
##$NSP= 1
##$NTH_PI= 0
##$NZP= 0
##$OFFSET= 14.38212
##$PC= 1
##$PHC0= -3702.259
##$PHC1= 8.19232
##$PH_mod= 1
##$PKNL= yes
##$PPARMOD= 0
##$PSCAL= 0
##$PSIGN= 0
##$REVERSE= no
##$SF= 200.129724274929
##$SI= 16384
##$SIGF1= 3
##$SIGF2= 2
##$SINO= 400
##$SIOLD= 16384
##$SREGLST= <1H.CDCl3>
##$SSB= 0
##$STSI= 0
##$STSR= 0
##$SW_p= 3205.1282051282
##$SYMM= 0
##$S_DEV= 0
##$TDeff= 0
##$TDoff= 0
##$TI= <>
##$TILT= no
##$TM1= 0
##$TM2= 0
##$TOPLEV= 0
##$USERP1= <user>
##$USERP2= <user>
##$USERP3= <user>
##$USERP4= <user>
##$USERP5= <user>
##$WDW= 1
##$XDIM= 8192
##$YMAX_p= 0
##$YMIN_p= 0
$$ End of Bruker specific parameters
$$ ---------------------------------
##NTUPLES= NMR FID
##VAR_NAME=  TIME,          FID/REAL,        FID/IMAG
##SYMBOL=    X,             R,               I
##VAR_TYPE=  INDEPENDENT,   DEPENDENT,       DEPENDENT
##VAR_FORM=  AFFN,          ASDF,            ASDF
##VAR_DIM=   8192,          8192,            8192
##UNITS=     SECONDS,       ARBITRARY UNITS, ARBITRARY UNITS
##FACTOR=    0.0002768,     1,               1
##FIRST=     0,             0,               0
##LAST=      2.2672688,     0,               0
##MIN=       0,             -226563,         0
##MAX=       2.2672688,     186208,          0
$$ Real data points
##PAGE= N=1
##DATA TABLE= (X++(R..R)), XYDATA
0 0 0 0 0 0 0 0 0 0 0 0 0 0 0 0 0 0 0 0 0 0 0 0 0 0 0 0 3 -3 7 -7 8 -8 8 -8 8 -11 11 -13 15 -17 19 -20 22 -26 27 -30
46 -30 34 -38 41 -46 50 -54 62 -68 76 -84 95 -108 123 -142 166 -196 241 -306 408 -582 929 -1772
68 -1772 4687 -35367 -226563 -91628 155279 114178 -52587 -86794 -4457 15389 101 59533
80 59533 36505 -61721 -79050 34230 89355 -3360 -62516 -18916 28291 -11201 -11579 30095
92 30095 1986 -37106 -16936 46590 18959 -35761 4060 47351 -3169 -55424 19700 67285
104 67285 -8645 -74282 -7296 72127 -7251 -74734 -10898 56448 5368 -60171 -11170 41624
116 41624 14628 -22704 12487 22495 -25805 -7074 53228 45576 -47961 -60630 37204 61291
128 61291 -20001 -63331 -4400 24746 -8426 -23933 1011 8701 -22516 -3062 25131 3761
140 3761 -14535 15350 44312 -2119 -40746 4348 62733 21223 -51933 -33997 18352 25693
152 25693 -14071 -22793 -7180 -21784 -19340 18272 33041 -14472 -40593 932 43689 28013
164 28013 -12601 -1238 13889 3410 1727 12454 14461 -11462 -24040 -9985 1410 -4258 -2600
177 -2600 -2084 -28857 -30224 9639 44422 13905 -44565 -24593 40659 50684 678 -23506 1460
190 1460 21492 8693 -4802 6549 -6176 -24742 -11691 7783 3590 -23109 -23809 2129 7898
203 7898 -6798 -2775 11766 6317 1492 7308 19801 13562 -4972 4715 14230 2214 -9606 -4136
217 -4136 754 -9248 -17778 -7534 3624 -14264 -20472 2005 12720 1242 -13389 1895 23478
230 23478 15179 -636 5353 12384 6099 4852 5120 1454 -10490 -12952 3812 -1812 -21142 -16527
244 -16527 1845 1477 -15260 -13982 10476 19056 -3533 -7580 11778 19774 12945 2507 4972 4747
258 4747 -1802 4393 9528 -7899 -23428 -11102 5196 1039 -18665 -18788 660 1758 -2177 4131
272 4131 6428 1776 1591 14189 21423 6258 -6966 7186 15229 790 -9239 -5443 708 -8837
286 -8837 -17994 -5402 754 -11016 -14477 -1789 5424 2461 -1043 6296 10992 2996 8876 17850
300 17850 8415 -3334 -576 10556 6779 -11026 -14008 -968 -3671 -13859 -10902 -5213 -3752 -9025
314 -9025 -4752 7653 4596 -1377 7019 12995 8009 5252 8539 12399 3258 -6713 2401 5409 -6669
329 -6669 -12092 -9286 -4405 -6596 -11187 -6065 -2519 -7398 -1396 9027 6436 1359 2212 12728 17354
344 17354 4424 -89 7041 6520 670 -2314 -4775 -6262 -9885 -8946 -2747 -8603 -13292 -4500 330
359 330 -370 -1202 2503 9860 8463 2539 8846 13198 7917 3820 827 1476 1567 -3743 -3652 -5906 -13247
376 -13247 -10972 -4204 -3679 -6105 -8947 -4311 3879 4124 6230 8733 4384 4564 9123 11497 9766 1627
392 1627 -3200 344 -1039 -3465 -3594 -8413 -11307 -11033 -7213 17 -2115 -7813 -3245 3287 7572 8629
408 8629 5644 6392 8381 6449 7462 6398 2515 1546 -2343 -6634 -6424 -6313 -4750 -5784 -11424 -10616
424 -10616 -4853 -517 4493 3065 -2239 -44 6360 15474 15864 2641 -3636 3170 9913 8937 -2512
439 -2512 -10707 -6582 -4594 -6432 -6026 -7315 -7497 -8019 -7872 980 6966 3422 1356 2674 7845 11485
455 11485 7579 7068 9455 2296 -4384 -3162 2816 5401 -7506 -19415 -12126 -381 1277 -5493
469 -5493 -11230 -5439 1568 1147 6655 12750 8286 -519 -2710 10503 22851 10326 -10248 -12660
483 -12660 -967 9527 3064 -13056 -16156 -11356 -6021 983 1309 -3770 -8744 -7979 7275 20170
497 20170 10300 -3614 -2902 10104 18866 7123 -6314 -2240 4180 1592 -7572 -13586 -5776 737
511 737 -6665 -12639 -9837 -1728 5255 2768 -66 1960 1490 6254 14850 14333 5467 -5153 -5610 8745
527 8745 13954 251 -15042 -18589 -5098 5811 -1107 -10983 -12889 -9371 5 6939 8130 5087
541 5087 -3520 -3640 10852 20398 14854 -2193 -12247 1163 14698 6743 -9008 -15343 -8153 -1119
555 -1119 -5604 -7848 -4164 -5710 -6733 -1912 5678 8715 1177 -1191 10029 14194 4901 -1466 3805
570 3805 12867 5503 -12214 -12124 1640 6191 -4491 -17914 -15431 -783 2957 -1476 -3735 -3068 59
585 59 3039 9020 16556 8828 -5027 -2951 10616 18081 5656 -13924 -13003 1247 4319 -4238 -12442
600 -12442 -11070 -4606 -6029 -4123 4481 2965 -3747 -2921 6403 15873 10373 -933 982 8415 9246
615 9246 3650 -4824 -3882 800 -4611 -9343 -7893 -5777 -3285 -5319 -6825 -2781 -1032 1466 6594
630 6594 5164 3701 4547 5171 9755 10405 3163 -2080 -3492 776 4882 -3041 -11417 -10652 -6852 -1935
646 -1935 -1816 -7117 -6241 -2231 999 6456 6073 3568 3856 4814 8756 9645 2949 844 2119 -16 -1992
663 -1992 -4575 -5045 -3986 -7958 -8452 -5100 -4558 -2436 -299 -302 515 2243 5476 9805 6977 2930 4737
680 4737 5625 5235 3444 -834 -2835 -5153 -5671 -1679 -4049 -10284 -9161 -4011 -839 -1617 -3515 1250
696 1250 5251 3235 5023 7919 6933 5319 3432 4700 5361 -186 -2957 -2022 -4128 -5607 -6124 -6366
712 -6366 -5607 -6488 -4486 35 -1540 -1692 3341 5787 5528 4360 5501 8750 5680 1912 4434 2827
728 2827 -1920 -3612 -3422 -3007 -5970 -9180 -4964 -3342 -5763 -3918 -1160 632 1951 1976 5811 7194
744 7194 4120 5875 7652 3988 2035 1727 1966 -66 -6498 -6004 -2074 -5661 -8337 -6697 -4618 -2058
760 -2058 -2705 -2037 2807 2608 2441 7140 6817 5020 4687 4842 5848 2272 -1893 -221 -1354 -5478 -4741
777 -4741 -4925 -6104 -6438 -6475 -2295 -412 -3605 -426 4175 4403 4432 4251 6357 7829 3840 3034 4390
794 4390 1177 -1316 -1992 -3408 -4071 -6199 -6803 -3928 -5594 -6184 -2239 -650 38 1480 2699 5868
810 5868 5325 3684 6850 6277 3275 2707 1461 1136 -862 -4982 -4116 -4063 -6927 -5891 -4819 -4626 -3229
827 -3229 -2877 -206 2521 1232 3628 6883 5485 5175 5152 4907 5268 1656 -579 34 -2877 -4488 -4014
844 -4014 -5135 -5700 -6387 -6284 -1863 -1189 -2168 334 1815 3634 5698 5526 6216 5030 3122 5082 4501
861 4501 847 -1081 -2779 -3612 -3554 -5363 -5486 -4979 -6877 -4654 -1724 -455 859 793 2067 5484 4759
878 4759 5309 6853 4122 2935 2876 1697 1738 -1562 -4401 -3506 -5486 -6414 -4002 -4201 -4713 -4591 -3391 1825
896 1825 3147 976 3461 5089 4914 5843 4888 5864 4461 -1174 -730 1410 -1198 -3589 -6290 -6708 -3908
913 -3908 -4679 -4277 -2154 -3720 -1889 1738 2515 4273 4951 4269 5271 4230 4650 6517 2483 -1373 -1054
930 -1054 -1443 -1869 -4723 -6130 -3439 -4916 -8373 -4053 1062 991 -1670 -2782 3727 8419 4719 3611
946 3611 4686 4298 3954 2815 2623 1722 -3429 -5403 -3034 -2727 -3470 -5882 -8087 -4696 -1149 -19 253
963 253 -1320 1419 6060 4809 3732 5628 6181 4640 97 188 4598 1031 -6636 -5834 -2076 -2467 -6656
980 -6656 -8145 -1387 312 -5348 -4177 2800 6238 4172 411 3437 7937 5085 3651 4202 1978
995 1978 65 -1807 -1517 67 -3779 -7484 -6870 -5204 -1256 -500 -4634 -5146 -592 5160 6488 1760
1011 1760 758 6386 6858 3333 3295 3505 2379 -2294 -4462 831 -428 -7478 -8147 -3686 -1105 -3619
1027 -3619 -6384 -1416 3480 632 71 3523 5846 6108 3543 3612 5067 1913 1345 2359 -1280 -3437
1043 -3437 -3493 -4409 -3908 -4891 -4160 -2554 -5449 -3881 2778 3846 771 -202 3077 8518 6572 1362 3759
1060 3759 4826 859 -477 258 952 -3584 -8979 -4375 245 -4024 -7232 -4835 -1132 967 -482
1075 -482 1318 4223 2767 3390 6186 4707 3477 3320 2366 1926 -1240 -2633 -555 -3717 -6030 -4405
1091 -4405 -3470 -3918 -4843 -3043 1500 -189 -2461 3312 6932 3942 1798 3346 7023 5069 -607 1235
1107 1235 3225 -1546 -4561 -3615 -1801 -3400 -7479 -5223 -749 -2623 -3305 112 1795 1933 1703 4283
1123 4283 6791 3509 1979 5285 4341 825 -324 -92 -453 -3843 -5160 -2287 -3774 -6815 -4103 -1516
1139 -1516 -1431 -2464 -1025 4151 4036 907 3587 6648 5031 2487 1885 3503 1968 -2601 -1822 -11
1155 -11 -4005 -6013 -4279 -2675 -3379 -5755 -2705 1833 -629 -722 3243 4651 3377 2860 4562 6377
1171 6377 2598 207 2722 1446 -2365 -3082 -2842 -2350 -5123 -6524 -2188 -1881 -4635 -2092 1446 1606
1187 1606 1288 1515 5330 5730 1674 3358 5819 2428 -112 36 823 -658 -5133 -4368 -1271 -4378
1203 -4378 -5974 -3301 -1615 -1398 -1862 40 4059 2445 1365 4935 5736 3630 2635 2920 3339 442
1219 442 -2444 3 -885 -4948 -4792 -3304 -3053 -3977 -4616 -940 676 -1728 490 3902 3507 3119 2855
1236 2855 5008 4970 1188 1346 3060 128 -2376 -2658 -2235 -2629 -5379 -4658 -1985 -3279 -3951 -600 820
1253 820 966 1074 2378 5261 4008 2276 4347 4317 1595 690 366 72 -2005 -4555 -3157 -2358 -4923
1270 -4923 -4281 -2867 -2108 -1675 -1455 990 2879 1460 2758 5066 4047 3364 2622 2976 2832 -727 -1592
1287 -1592 -303 -2321 -3920 -3872 -3683 -3311 -4204 -3627 -92 -371 -994 1758 2932 3376 3508 2931 4539 4093
1305 4093 1342 2528 1744 -646 -1447 -2292 -2646 -3209 -5052 -3753 -2264 -3892 -2677 -533 145 1364
1321 1364 1436 2876 4683 3065 3076 4558 2947 1709 495 -81 77 -2079 -4021 -2338 -3169 -4389 -3432
1338 -3432 -2962 -1858 -1310 -1616 1548 2462 1700 3335 3917 3505 3822 2841 2704 2011 -528 -463 -374 -3069 -3238
1357 -3238 -3413 -3536 -3146 -3920 -2393 -438 -888 -295 2027 2536 3300 3046 3211 4466 2914 1688 2606 1215
1375 1215 -721 -1321 -2530 -2142 -3196 -4759 -3094 -2882 -3580 -1538 -425 -28 1150 1251 3243 4130 2543
1392 2543 3557 3880 2498 1590 633 566 -207 -3053 -3382 -1953 -3313 -3904 -3386 -2841 -1598 -1516 -837 1747
1410 1747 1753 1941 3363 3378 3907 3458 2316 2447 1254 -208 217 -1489 -3293 -2681 -3153 -3308 -3315 -3385 -1437
1429 -1437 -946 -1686 675 2388 2535 2431 2396 4031 4578 2079 1788 2456 1050 -584 -2064 -2306 -1638 -3427
1447 -3427 -4308 -2854 -3050 -2489 -1620 -1309 617 1483 1359 3188 3051 2892 3707 2652 1811 2388 1360 29
1465 29 -1705 -2817 -1372 -2314 -4746 -3565 -2415 -2277 -2250 -1973 464 2136 391 1504 4041 3900 3258
1482 3258 1872 2319 3667 1107 -847 -419 -1327 -2283 -3134 -3902 -2510 -2642 -3703 -1914 -1085 -319 965
1499 965 1045 2204 3352 3080 3406 2905 2216 3160 1676 -408 -475 -867 -1193 -2977 -4309 -2590 -1878 -3611
1517 -3611 -2978 -754 -238 194 227 2045 3836 2545 2239 3409 3578 2541 965 81 555 -995 -2581
1534 -2581 -2152 -2840 -3311 -2816 -3096 -2155 -1327 -1488 571 1009 1013 2878 3146 2701 2757 2927 3203 1989 -177
1553 -177 477 218 -2362 -2821 -2719 -2383 -2779 -3935 -2636 -477 -1550 -1102 1019 1878 2173 1860 2840 4276
1571 4276 2427 1844 2523 1517 303 -739 -1763 -1512 -2736 -3603 -2341 -2844 -3282 -1940 -1198 -412 360
1588 360 537 2690 2833 2078 3182 3475 2312 1622 1181 1306 340 -2338 -1729 -1206 -3318 -3692 -2804 -2085
1606 -2085 -1892 -2318 -890 1346 568 883 2863 3040 3190 2633 2314 3175 1629 -238 483 -315 -2065 -2424
1624 -2424 -2862 -2340 -2799 -3611 -1607 -878 -1659 -214 1220 1629 2010 2050 3426 3433 1764 2222 2748 875 -372
1643 -372 -759 -769 -1345 -3404 -3164 -1797 -2978 -3430 -2060 -726 -207 -192 876 3143 2632 1706 3202 3264
1661 3264 2292 1479 1026 1424 -322 -2063 -1354 -1647 -3158 -2771 -2597 -2281 -2010 -2142 -41 831 323 1444
1679 1444 2867 2800 2181 2203 2798 2743 618 275 904 -478 -2245 -2308 -2036 -2198 -3677 -3052 -893 -1569 -1739
1698 -1739 -296 1331 1536 1464 2065 3808 2842 1487 2458 2222 896 -160 -898 -627 -1729 -3284 -2461
1715 -2461 -1988 -3147 -2486 -1533 -716 -445 -509 1644 2779 1493 2064 3328 2687 2084 1276 1359 1389 -885 -1718
1734 -1718 -743 -2047 -3216 -2851 -2389 -1752 -2249 -1984 457 666 257 1643 2536 2597 2444 2069 3159 2395
1752 2395 193 1053 507 -1136 -1987 -2261 -2114 -2315 -3500 -2510 -1010 -2145 -1261 276 912 1451 1203 2398
1770 2398 3546 2066 1544 2920 1720 402 -109 -657 -595 -2333 -3155 -1748 -2285 -3383 -2111 -1275 -442
1787 -442 -566 -376 1956 2358 1338 2511 3245 2702 1929 1179 1497 964 -1281 -1178 -888 -2407 -2707 -2417
1805 -2417 -2209 -1804 -2289 -1311 569 -72 550 2150 2487 2318 2130 2436 3121 1459 356 1205 154 -1358
1823 -1358 -1745 -1952 -1684 -2559 -3167 -1773 -1536 -1905 -700 253 974 1214 1248 2655 2983 1544 1975 2269 1533
1842 1533 546 -247 -290 -638 -2567 -2509 -1699 -2642 -2540 -1800 -1141 -523 -670 182 2054 1399 1393 2566 2804 2135
1862 2135 1494 1197 1629 323 -1434 -768 -1030 -2374 -2742 -2486 -1982 -1924 -2105 -960 296 -148 1245 1693
1880 1693 1885 2481 2045 2443 2674 904 928 1098 -458 -967 -1607 -1846 -1665 -2779 -2631 -1201 -1777 -1496 -348
1899 -348 192 1171 1135 1263 2847 2407 1676 2217 1916 1174 453 -759 -275 -1088 -2504 -2220 -2082 -2695 -2020
1918 -2020 -1656 -1495 -472 -367 784 1804 963 1868 2861 2155 2103 1590 1462 1361 -245 -808 -272 -1686
1936 -1686 -2403 -2080 -2351 -1562 -2160 -2169 -381 -123 157 984 1510 2208 2151 1893 2318 2161 1104 1160 228 -472
1956 -472 -507 -1630 -1909 -2056 -2492 -2001 -1528 -2243 -1076 -283 144 871 962 2128 2576 1832 1855 2453 1862 794
1976 794 273 -422 -101 -1672 -2319 -1621 -1940 -2191 -2201 -1885 -894 -283 -619 827 1456 1419 2265 1976 2171 2189
1996 2189 1120 1249 904 -61 -217 -899 -1726 -1781 -2132 -2274 -1934 -2154 -1064 -93 -675 465 1497 1518 1797
2015 1797 1740 2146 2654 1533 788 1176 214 -487 -1089 -1937 -1318 -1718 -2528 -1617 -1633 -1550 -922 -692 474 1151
2035 1151 770 1874 2286 1820 2246 1785 1138 1256 260 -390 -525 -1783 -1647 -1612 -2497 -2089 -1523 -1433 -744 -946
2055 -946 -175 1491 1105 1305 2058 1728 1965 1591 1257 1568 645 -646 -339 -634 -1802 -1862 -2186 -1879 -1750
2074 -1750 -2091 -997 -342 -348 515 1137 1328 1991 1638 2097 2272 1290 1206 922 -12 -314 -889 -1441 -1577 -2633
2094 -2633 -2112 -1365 -1961 -1615 -515 -262 326 602 989 2173 2001 1578 2041 1594 1026 807 -32 26 -506
2113 -506 -1910 -1560 -1591 -2189 -1937 -1851 -1353 -591 -696 210 1013 809 1617 1849 1784 2029 1407 1624 1135 0
2133 0 -117 -212 -1274 -1681 -1863 -1821 -1400 -2030 -1795 -248 -613 -193 766 866 1671 1589 1443 2241 1655 781 1359
2154 1359 879 116 -530 -1312 -977 -1380 -2369 -1723 -1505 -1767 -1180 -519 -204 500 531 1454 1996 1405 1798 2163
2174 2163 1465 940 689 281 14 -1319 -1513 -891 -1835 -2080 -1816 -1692 -856 -798 -1127 620 987 974 1668 1642
2194 1642 1791 1813 1326 1405 1252 -344 -202 -378 -1313 -1465 -1774 -1764 -1297 -1988 -1256 -376 -617 321 836 915 1629
2215 1629 1343 1946 2327 1279 1021 1244 418 -282 -504 -1180 -890 -1839 -1974 -1235 -1493 -1632 -872 -459 191
2234 191 351 525 1623 1696 984 1938 1891 1626 1085 219 258 -15 -1316 -1094 -1117 -1732 -1821 -1592 -1282 -788 -785 -346
2256 -346 814 537 1153 1533 1571 1891 1585 1268 1373 406 -243 166 -540 -1107 -1338 -1695 -1360 -1949 -1712 -830
2276 -830 -519 -763 115 761 994 1313 1439 1725 1980 1114 1177 956 379 -11 -809 -797 -827 -2093 -1798 -1352 -1656
2297 -1656 -1221 -777 -618 208 346 847 1783 1485 1413 1790 1381 1323 1053 297 496 -306 -1294 -922 -1133 -2024
2317 -2024 -1478 -1462 -975 -715 -1073 -71 531 376 1161 1489 1532 1849 1088 1417 1382 236 131 -361 -840 -1154
2337 -1154 -1297 -1594 -1377 -1557 -1472 -599 -1054 -537 448 853 988 1404 1372 2160 1637 1010 1235 941 156 11
2357 11 -523 -562 -1084 -1986 -1417 -1138 -1495 -1177 -997 -329 236 329 825 1467 1164 1377 1797 1258 1454 579 241
2378 241 383 -568 -908 -621 -1568 -1406 -1235 -1632 -961 -1125 -609 378 141 448 1356 1643 1564 1445 1339 1348 1121
2399 1121 81 210 -184 -662 -1093 -1614 -1264 -1234 -1892 -1264 -745 -901 -406 69 463 998 1288 1224 1790 1097
2419 1097 1422 1440 794 460 -188 -707 -727 -1328 -1401 -997 -1453 -1436 -900 -938 -97 144 283 1124 1478 947 1467
2440 1467 1642 1231 997 446 400 450 -702 -688 -1037 -1455 -1225 -1431 -1400 -964 -1160 -479 464 192 669 1206 832
2461 832 1254 1246 1243 1416 727 120 389 -425 -776 -918 -1403 -918 -1313 -1498 -829 -615 -927 18 263 547 959
2482 959 1011 1408 1533 1162 1224 943 452 250 -334 -646 -616 -1254 -1396 -984 -1623 -1146 -777 -864 -218 187 357
2503 357 1037 881 979 1474 1486 1122 836 375 639 16 -774 -492 -1064 -1388 -1211 -1422 -1203 -855 -1093 -140 132
2524 132 317 624 877 1221 1362 1009 1312 1058 514 245 201 -267 -702 -1114 -1350 -1131 -1487 -1360 -520 -850
2544 -850 -467 92 65 853 753 1071 1655 1279 1136 1252 704 529 176 -484 -392 -704 -1407 -1122 -1039 -1339 -922
2565 -922 -1022 -419 30 -24 701 962 994 1217 1287 1126 1129 643 504 225 -175 -417 -812 -1212 -1140 -1186 -1351 -855
2587 -855 -1096 -776 81 -15 229 832 870 1201 1300 939 1533 1072 205 342 60 -502 -461 -921 -871 -1008 -1447 -1139
2609 -1139 -884 -1215 -245 -41 251 667 722 1054 1397 1065 860 1377 529 493 2 -504 -323 -1035 -1220 -843
2629 -843 -1070 -1170 -974 -714 -444 -41 -11 853 960 841 1061 1085 1071 1091 681 486 144 -198 -259 -629 -1265 -1055
2651 -1055 -1157 -1184 -747 -879 -564 -78 62 131 836 939 1169 1005 1020 1345 725 475 214 -267 -426 -797 -1011
2672 -1011 -915 -1079 -1286 -743 -747 -825 -276 249 318 791 516 1117 1350 740 1233 787 807 403 -36 -103 -418 -1116
2694 -1116 -974 -827 -1261 -1201 -1085 -909 -273 -213 330 819 596 963 1219 846 1103 940 664 733 106 -516 -365
2715 -365 -753 -858 -1113 -1239 -798 -611 -1082 -398 42 -243 528 499 1013 1103 876 1122 1031 709 484 307 -457
2736 -457 -476 -802 -841 -631 -1164 -1050 -671 -781 -622 -415 -61 317 352 654 1358 1080 753 1052 668 582 345
2757 345 -159 -127 -469 -1079 -618 -960 -1490 -789 -950 -446 -221 -379 624 702 600 748 1074 1101 1033 788 620
2778 620 721 -66 -354 -436 -667 -945 -926 -1191 -759 -965 -665 -203 -310 130 728 672 925 1055 734 1154 802
2799 802 605 411 171 -224 -441 -662 -800 -825 -1074 -780 -803 -752 -408 -419 136 516 392 811 1341 774 986
2820 986 865 646 565 123 -195 -25 -393 -927 -649 -1045 -957 -758 -631 -305 -346 35 318 518 690 887 975
2841 975 832 1040 612 770 375 -266 -16 -359 -702 -838 -928 -949 -706 -912 -428 93 -332 91 429 555 1192
2862 1192 627 747 1144 515 532 412 -212 -124 -346 -760 -502 -881 -1283 -632 -818 -760 -218 -374 240 158 385
2883 385 953 848 809 999 881 327 522 -35 -50 -196 -774 -816 -642 -843 -785 -858 -713 -276 -417 -46 470 288
2905 288 807 895 911 891 615 675 539 268 -57 -20 -390 -930 -724 -1056 -686 -880 -730 -536 -209 -312 270 406
2927 406 548 749 477 964 929 461 463 199 40 22 -505 -519 -661 -893 -904 -615 -741 -587 -297 -166 256 441
2949 441 603 893 772 719 1074 628 631 305 -107 -21 -247 -723 -398 -721 -873 -872 -580 -488 -380 -290 4 441 487
2972 487 671 565 941 1191 442 398 437 116 46 -284 -431 -489 -642 -813 -417 -951 -505 -277 -302 17 44 255
2994 255 707 792 648 1050 829 472 546 293 -31 105 -502 -477 -586 -866 -855 -620 -650 -409 -362 123 306 263
3016 263 341 967 714 800 822 536 633 252 80 204 -298 -528 -587 -771 -705 -728 -819 -394 -226 -313 213 214 365 673
3040 673 698 945 662 457 711 363 -47 225 -309 -489 -414 -606 -638 -716 -873 -424 -279 -306 -82 171 390 828
3062 828 738 679 709 597 542 342 358 -132 -141 -363 -417 -577 -869 -579 -560 -603 -315 -226 80 76 142 705 762 534 765
3087 765 893 684 678 125 149 -4 -504 -464 -419 -957 -790 -742 -645 -362 -488 7 243 231 571 419 692 809 743
3110 743 647 471 232 113 -85 -288 -449 -432 -660 -520 -905 -714 -374 -355 -317 139 191 435 713 808 686 503
3132 503 581 601 390 362 217 -312 -288 -375 -713 -573 -485 -715 -391 -282 -468 172 204 188 824 669 714 629 609 624
3156 624 521 75 234 103 -479 -494 -779 -734 -591 -575 -492 -206 -477 166 81 266 579 409 588 625 296 711
3178 711 667 107 30 -32 -289 -541 -508 -641 -594 -511 -433 -167 -287 -77 146 156 409 635 659 763 599 429 541
3201 541 239 -33 94 -318 -134 -203 -753 -519 -525 -695 -423 -457 -156 149 62 517 566 355 518 817 615 575
3223 575 248 52 152 -190 -330 -400 -603 -566 -563 -715 -330 -380 -148 35 100 239 567 322 712 687 303 544
3245 544 161 42 58 -218 -244 -244 -670 -575 -325 -585 -606 -466 -465 31 79 116 605 355 569 647 234 499 462 193
3269 193 -77 -114 -217 -370 -501 -508 -144 -442 -492 -485 -355 81 8 32 643 548 619 572 447 653 524 328 176 115
3293 115 -291 -417 -428 -678 -497 -683 -557 -165 -383 -251 11 -102 254 429 533 668 465 319 741 346
3313 346 107 98 -207 -96 -301 -598 -478 -541 -524 -398 -342 -311 -69 -193 264 198 245 764 416 350 496 499 71 28
3337 28 -115 -204 -290 -532 -346 -380 -595 -541 -457 -404 -6 -148 137 453 271 436 612 389 264 142 173 231 -114
3360 -114 -241 -216 -473 -486 -515 -436 -343 -492 -418 -91 -83 208 206 345 297 631 597 401 655 242 384 14 -234 -345
3384 -345 -415 -462 -590 -566 -692 -319 -434 -159 83 -67 343 215 291 511 423 513 528 226 106 143 -155 4 -233
3407 -233 -335 -532 -589 -434 -476 -363 -119 -11 -189 209 407 389 703 596 486 612 254 148 121 -1 -256
3428 -256 -217 -474 -275 -567 -763 -275 -364 -48 -180 72 153 503 504 407 396 334 698 321 201 276 54 -121 -304
3451 -304 -349 -431 -556 -377 -447 -302 -372 -380 -164 -133 291 454 655 511 495 442 589 69 109 166 -93 -253 -144 -180
3475 -180 -412 -554 -441 -305 -364 -49 -125 -63 272 434 312 379 534 549 357 197 236 -32 8 -156 -13 -415
3497 -415 -338 -285 -331 -394 -286 -197 -191 -75 279 235 278 333 136 204 447 179 287 -20 -204 -157 -273 -446 -211 -415
3521 -415 -445 -229 -319 -184 -208 -54 115 131 335 362 626 361 464 129 378 87 83 -129 -70 -291 -258 -157 -461
3544 -461 -457 -405 -509 -68 -53 148 310 201 300 533 316 569 469 149 272 164 -202 -241 -108 -176 -452 -590
3566 -590 -64 -270 -267 -166 -196 -73 114 326 356 436 358 412 237 -68 342 -47 56 -3 -360 -142 -259 -427 -377
3589 -377 -210 -543 -123 -93 36 98 -2 153 369 235 208 344 338 230 108 -289 90 -436 -286 -255 -580 -244
3611 -244 -347 -320 -94 -129 -71 7 -42 115 317 426 178 355 103 165 36 -23 -135 -199 -95 -396 -320 -479 -286
3634 -286 -193 -332 -369 -191 -109 239 195 351 289 451 398 259 259 145 36 56 -15 -101 -115 -306 -550 -214 -439 -324
3658 -324 -147 -191 42 325 94 339 201 267 506 130 173 15 -77 41 57 -233 -135 -252 -410 -404 -297 -216 -221 -162
3682 -162 120 -213 155 164 140 74 408 116 233 257 74 -128 12 -145 -426 -169 -357 -417 -364 -98 -79 -230 28
3705 28 65 70 -17 166 169 449 409 250 328 96 91 26 -73 -212 -340 -517 -333 -411 -247 -283 -19 53 64 91 0 289
3731 289 428 293 472 162 272 149 158 179 -39 -121 -24 -267 -379 -263 -270 -180 -218 -2 271 99 126 293 424
3754 424 264 138 332 182 27 -158 -4 -163 -199 -174 -135 -528 -262 -305 -246 -16 -86 8 52 103 350 289 137
3777 137 266 120 169 145 85 -43 171 -348 -233 -399 -254 -149 -371 -321 -202 -66 21 120 32 161 241 188 435
3800 435 381 317 280 330 274 -108 -186 -216 -64 -338 -136 -374 -188 -124 7 -229 87 -18 136 399 193 160 514
3823 514 241 118 266 122 29 -6 -277 -174 -130 -310 -246 -354 -312 -47 96 -75 -30 226 131 369 341 127 198
3846 198 331 393 -21 112 -184 -36 -152 -393 -235 -84 -104 -277 -223 -255 152 188 160 119 232 257 26 259 88
3869 88 178 77 131 -130 -260 -61 -98 -248 -326 -93 -285 -197 -228 26 -11 13 146 245 229 234 103 59 43 27 201
3894 201 -98 -393 -264 -141 -166 -76 -297 -275 -218 -64 82 0 84 113 304 338 210 309 252 201 82 6 104 -207
3918 -207 -110 -93 -161 -310 -153 -144 -89 -19 -158 30 186 -40 67 60 81 263 123 221 125 69 18 -113 -60 -177 -176 -158
3944 -158 -512 -114 -81 -194 -195 -92 296 170 -78 -95 368 276 238 182 151 137 -30 -19 -102 -28 -162 -321 -327 -118 -228
3969 -228 -11 -247 59 124 72 126 79 128 249 288 39 87 187 66 -57 -82 16 128 -67 -132 -249 -291 -278 -127
3993 -127 6 160 123 230 -51 118 339 232 99 -121 34 43 146 -69 -223 -161 -174 -70 -180 -217 -95 -194
4015 -194 26 36 -121 -2 82 106 30 255 170 178 21 156 -46 -37 -49 -234 -242 -84 -46 -127 -155 -256 48 6 -30 -19
4041 -19 360 159 155 207 153 279 179 15 126 6 -86 -142 -64 -137 -138 -96 -190 -105 -288 -230 -28 128 110 129 98 111
4067 111 170 110 82 107 40 -178 54 -125 -93 -165 -325 -385 -316 -80 -216 308 95 -16 113 366 127 210 134 41
4091 41 51 136 -45 88 -71 -292 3 -169 -42 -82 -275 -212 83 -288 -41 140 183 12 18 177 141 159 215 43
4115 43 146 -74 172 -88 -176 -176 -239 -118 -270 -163 -197 -176 -139 97 -138 72 203 321 45 57 247 33 -43
4138 -43 -3 -71 -44 -209 -7 -11 -159 -261 73 -19 -307 -70 28 -26 -44 125 127 126 257 -122 140 -143 43 -93 118
4163 118 -16 -128 25 -88 15 -119 42 -139 -230 -289 -69 5 90 -44 56 97 75 157 -13 152 -229 -68
4185 -68 48 -83 -178 -50 -71 -328 -96 -193 -147 -99 -156 -20 128 3 135 137 96 -129 -88 46 64 50 -34 -25 -77 240
4211 240 48 -14 -46 -155 -107 -96 -6 49 -75 81 262 -31 333 137 -152 30 43 178 113 -141 143 -71 29
4234 29 6 -75 -7 18 138 91 202 145 -76 230 -1 30 118 117 -48 124 58 17 -18 -202 -55 -106 -222 -61 -99
4259 -99 -79 -24 81 -3 113 -133 56 84 41 76 5 -20 78 -3 -30 167 33 -85 -112 -199 -75 -61 -9 97 150 4
4285 4 -39 133 -25 66 2 67 105 103 -15 -202 -99 -21 180 -426 -62 -188 -99 -56 21 2 -57 -113 -96 -101 159 114 -1
4312 -1 104 119 138 -58 -61 -62 -27 -37 -46 74 -228 -148 6 -113 -378 178 -144 67 165 46 161 21 -43 239 380
4337 380 -69 -8 -55 15 60 -56 16 -101 -209 -82 -71 57 -4 89 -6 149 -36 87 -115 43 210 227 -43
4360 -43 -25 33 -48 -116 -190 -146 0 -106 -83 -245 294 17 -176 -117 139 -57 184 104 50 -70 -43 166 246 -3
4384 -3 92 -24 -76 -215 -104 285 -85 -80 -245 -19 -22 -14 -49 -38 275 78 -94 -8 -44 -120 206 29 -263 -151 -24
4409 -24 5 -3 -77 -223 23 -109 -150 139 -20 47 6 -19 -110 -36 71 215 59 39 26 -11 99 -74 -115 -88 23
4434 23 -30 65 -196 -134 -85 -6 -19 164 -72 -181 14 -54 -267 -78 187 155 -141 85 49 120 -17 -139 47 4
4458 4 -18 -63 27 39 21 121 222 143 79 -43 192 169 56 46 -84 -26 -225 111 -67 40 5 -44 -230 -179 -141
4483 -141 -123 -133 -74 -24 -132 168 5 -95 6 31 72 37 -154 33 -243 2 14 -2 -56 -274 -93 55 -11 -137
4507 -137 -106 -140 100 25 -55 -34 173 -138 -36 147 -28 -130 114 53 205 98 -27 -38 -81 -30 -2 -163 -61
4530 -61 -13 -4 10 37 -27 -91 4 -34 94 110 -8 -157 -120 -97 -49 -87 29 -13 215 -1 -43 -134 -203 116 5 37 23
4557 23 120 76 -8 272 -66 54 71 -67 31 87 -130 16 -46 -223 -37 11 109 -71 65 -38 150 43 -229
4580 -229 -116 -114 29 -2 217 85 118 -171 -59 -14 -79 -184 -54 73 178 -114 -64 236 8 133 41 -93 -9
4603 -9 -117 -204 -26 -57 64 250 -152 -2 36 -49 12 -56 -162 92 92 2 158 131 -31 -149 10 -105 311 -198
4627 -198 -235 -6 -62 140 27 -13 -16 41 138 120 108 82 -65 16 111 -81 24 -82 61 18 -88 11 29 200 191 91
4653 91 -70 -5 -42 66 -227 -3 -15 -57 100 73 36 171 -198 -121 21 -12 -11 -81 -44 37 -53 140 189 21 -158
4678 -158 53 67 -13 43 -56 229 79 32 157 -231 -21 -98 234 -30 -3 -197 -254 -67 -158 -22 55 -28 -70 49
4702 49 28 -51 10 -21 101 -51 75 142 -141 -88 42 10 4 17 89 100 -48 31 71 58 103 42 149 27 -84 137
4728 137 240 128 -296 -10 -21 45 -24 -54 -33 173 9 60 -32 9 -32 -12 -178 169 -121 89 -50 -77 -1 48
4752 48 -80 -70 -177 -41 8 45 0 -26 47 -70 175 72 129 -9 28 214 206 -88 -133 175 -34 -104 -83 2 72
4777 72 66 -136 -8 -84 97 -4 252 -20 56 215 -82 -2 -90 -73 196 185 -18 52 213 81 205 24 125
4800 125 160 -89 70 247 -50 16 -104 -166 -65 -143 -8 13 161 -97 198 13 -4 155 72 -135 -164 -136 11
4823 11 -147 -245 -8 -47 172 22 -141 180 -27 -16 80 61 -47 -132 -13 -39 172 24 -32 -29 247 18 -92 -109
4847 -109 -123 17 22 38 118 135 -97 85 -58 99 -22 68 163 204 -66 -54 32 -29 15 -136 -46 -20 59 156 137 6
4873 6 82 50 -63 -30 -56 12 -61 101 -140 -8 8 151 77 -130 -90 -51 126 -159 -91 -7 -149 120 102 43 220
4898 220 112 -74 141 108 -105 -44 114 -5 211 -61 27 -50 2 -202 -8 -36 -255 80 -61 -117 -114 -5 -47
4921 -47 38 233 3 0 -71 193 211 -52 -5 13 260 -153 -128 -73 139 1 128 -242 -67 -295 97 125 -110 122
4945 122 88 217 -139 160 -193 67 -109 -162 48 5 -122 19 -137 -89 -38 48 -107 0 76 -48 93 -89
4967 -89 -7 -57 22 5 129 261 -18 221 -11 66 -57 21 -140 -86 -171 -306 -95 68 -83 -115 26 55 -75 -37
4991 -37 11 -16 155 32 42 167 -72 2 -73 -112 30 48 -82 -62 -14 -38 20 -59 -128 14 -21 -24 97 167 -63 -218
5017 -218 158 253 4 61 -105 136 -77 10 -146 -138 -189 85 -14 -360 -66 -115 -144 25 104 54 -107 -136 -3 32
5041 32 -11 199 -77 -58 263 162 9 -158 -95 -159 -113 -102 190 -63 -83 62 -36 -152 57 -256 -191 240 -150
5064 -150 -33 107 191 -159 183 9 -325 65 -78 72 -153 -65 -241 5 86 114 111 -32 116 247 -27 -7
5086 -7 120 -69 -37 -82 118 -129 120 -297 -80 -4 -106 -123 187 -54 -135 111 149 85 55 -174 -48 49 88 276
5110 276 -53 117 -37 -169 -43 -222 -44 -31 107 42 6 -81 110 -12 -170 189 -33 184 -49 -24 -117 32
5132 32 -44 -53 34 15 -67 -11 16 116 -14 90 -60 -163 34 173 66 89 73 -17 -39 -102 183 58 -127 -192 -101
5157 -101 -197 -67 -22 -137 9 101 -14 -67 -179 185 -267 -80 43 -65 71 -74 128 116 -39 98 39 -104
5179 -104 13 -58 36 32 372 -142 -155 -75 -113 -95 103 197 -143 101 158 -27 -121 -34 -14 -76 -2 -136 -103 146 34
5204 34 -138 -68 -64 -156 -106 248 29 -186 99 -122 172 -60 -117 -82 58 110 75 73 -6 -46 -60 -85 26 -93 -57 -32
5230 -32 21 -16 -42 211 -52 -23 248 89 257 93 71 -29 -4 -45 -31 46 121 139 -76 -108 -92 48 -47 176 78
5255 78 52 -67 -171 -86 86 101 21 91 -21 111 181 -84 39 -112 -18 -48 -81 21 31 -83 -166 -50 -64 -273
5279 -273 -230 150 31 -186 -53 -1 216 83 -139 -70 -240 -75 55 67 167 -125 -334 -180 -197 111 -142 -41
5301 -41 173 198 -44 -61 71 181 -16 124 24 30 -42 132 -216 11 135 31 105 75 -258 72 188 -36 50
5324 50 66 -13 146 229 252 60 220 -56 237 54 48 91 -162 -80 -19 -21 -180 -35 -43 2 107 66 123 302 -95 138
5350 138 87 -92 -105 110 -76 7 103 -138 -151 -193 -30 -130 -113 33 -146 54 9 96 58 -213 4 -6 178 -18
5374 -18 46 -89 -82 37 19 -267 -191 -19 -16 -171 -197 -103 96 -196 15 -35 385 2 70 230 -25 147 9 82
5398 82 66 -91 -66 55 -62 -152 -268 -232 -11 -38 -38 -64 3 -121 -91 -39 251 184 -51 208 23 -246 -197 -73 -255
5423 -255 30 49 -53 -171 -66 46 76 -76 -19 99 11 -91 65 -198 16 317 -17 -16 133 26 -101 -53
5445 -53 47 59 -161 95 -3 -131 96 -95 38 81 57 118 98 71 207 -13 -18 -8 182 135 -50 -17 44 213 -61
5470 -61 94 -132 129 89 -74 -132 51 -20 65 52 -105 -21 118 48 85 -47 -128 57 62 -101 -94 147 130 -247 -262
5495 -262 4 7 55 67 -84 -93 39 -140 135 -115 -7 -139 95 178 -38 43 -30 64 33 154 186 -39 -159 64
5519 64 -61 79 201 -181 49 -117 -134 -62 7 140 68 148 41 100 -54 -104 -128 106 192 32 -113 -42 10 -14
5543 -14 32 46 185 148 155 32 197 -17 2 49 7 -66 -48 -178 -55 141 -70 -87 -137 121 -107 -15 80 38 -5 39
5569 39 79 137 11 -32 154 -84 -52 -191 -72 -126 -140 74 -57 -146 -17 51 -134 90 -199 -185 47 -33 -115 70
5593 70 19 187 81 -112 206 -78 -99 -34 157 -90 -59 28 -88 38 -154 102 31 -273 25 -59 -79 44 33
5616 33 142 -30 -60 56 25 14 -59 -74 37 -137 -135 -211 18 -123 64 -234 74 137 81 235 45 171 19 -4
5640 -4 145 151 35 169 -57 -221 1 -7 195 139 -211 61 -147 62 -136 41 -37 71 -33 28 -104 191 73
5663 73 -30 73 -182 42 -26 -55 181 -113 -110 -184 -123 30 88 -106 -90 189 25 27 -30 -26 115 -62 -128 41 -119
5688 -119 -211 -35 -85 146 -182 -50 -46 -53 -147 -105 7 178 219 54 197 164 84 -182 141 26 -74 135 -19 97
5712 97 10 62 -175 -12 26 92 -229 -127 -37 127 165 8 74 2 7 -8 3 93 -54 380 21 -128 -67 205 170
5737 170 -168 -4 -125 11 -37 -227 -54 -199 -94 64 127 -49 42 86 138 -40 -34 85 -273 -46 -233 72
5759 72 -71 -48 20 -8 -142 -16 -68 -71 110 -31 -110 -21 146 65 206 118 118 -33 -16 82 32 -23 196 -31 -196 86
5785 86 -4 4 204 -33 13 -2 197 248 10 20 -31 -134 63 47 81 37 -35 -113 -421 -39 -116 -94 234 -125 -53 -42
5811 -42 45 -127 -213 -76 -8 218 134 -123 162 67 -143 102 106 -83 -162 -46 -74 -49 -174 0 11 -164 0 137
5835 137 3 120 31 -97 4 53 9 -4 -61 6 -16 -9 -14 43 95 -10 -260 2 88 -39 -112 7 -84 243 -24
5860 -24 -54 38 -333 -108 -8 105 -36 -51 181 104 -211 -216 -193 12 -178 45 -420 -273 -43 83 5 -100 -22
5883 -22 41 35 165 102 98 -10 -55 -65 83 2 -233 -77 26 -115 -136 102 -272 13 -214 20 67 -75 -83 -69 111
5908 111 180 -135 82 -109 106 -93 141 -151 144 -55 -37 -33 131 -11 2 -15 -250 115 -123 135 -123 60
5930 60 49 -15 71 16 -10 -103 -175 106 -10 -6 -41 -97 -30 71 -12 130 144 99 -83 -288 -69 -128 29 51 -105 22
5956 22 -39 -220 -67 81 -119 2 17 -39 -26 -200 -87 31 129 -57 -97 136 127 -95 134 263 -45 -173 -125
5979 -125 -157 67 57 16 63 44 -112 29 7 120 64 49 91 152 279 33 64 62 36 285 -63 -64 13 -272 90 26
6005 26 -59 128 28 -62 -165 13 -75 -28 95 39 135 -80 55 360 169 88 14 -128 -4 -14 -38 -47 20 -177 79
6030 79 -247 0 28 92 -105 -251 51 162 -25 21 97 182 120 126 -198 -126 49 -20 31 -43 -130 -81 42 91 6 7
6056 7 68 -92 -3 48 -7 4 -1 13 -136 -35 -230 46 -3 -59 -92 -184 101 -54 24 178 -201 -28 -105 68 -123
6081 -123 42 40 -17 124 12 31 90 -27 -109 -30 -63 -212 -170 -100 -107 -29 -183 -69 80 35 -93 76 -37 273 148
6106 148 212 128 -42 -67 65 -81 -73 105 7 -134 99 -142 -37 139 58 7 4 51 78 -28 107 194 -114 -62 114
6131 114 143 -54 39 -192 -59 -148 10 -39 -234 -100 -22 -172 -220 86 -24 122 -118 -70 152 -20 -46 128 39
6154 39 32 72 -50 -65 70 83 -296 30 -115 -127 -1 -135 -88 -171 44 -40 74 3 -5 208 158 -127 -213 33 35 154
6180 154 -159 -81 -171 -169 -44 -140 -75 17 -18 58 -61 -62 -53 -297 63 41 -155 -93 -175 158 86 175 -54 -144 30 126 -140
6207 -140 -76 -135 -100 39 124 110 54 238 55 37 3 -54 -82 -21 -56 -130 -3 -128 95 -126 -30 57 -41 -131 83 -119
6233 -119 64 -1 53 26 164 182 34 87 142 12 45 253 -102 30 -115 -48 63 -97 -97 -97 21 131 14 -153
6257 -153 139 66 68 80 55 254 143 162 42 -36 232 23 -145 68 -122 -86 -138 25 -73 -151 -294 -118 -129 -111
6281 -111 159 34 -83 -67 76 70 -33 19 -60 145 127 -5 -134 -156 -129 -145 26 -294 -1 -250 142 33 22
6304 22 183 52 145 140 -86 -134 -186 -12 293 136 -102 -133 -138 -220 171 -246 -10 27 154 -12 171 61 21 139
6328 139 108 -90 139 1 32 292 198 50 -168 -85 57 -211 -22 158 -24 -19 -272 -130 -59 -139 42 135 22
6351 22 66 -124 197 -53 65 153 35 107 46 -68 -67 -102 32 -20 -129 73 129 24 -183 -107 42 5 -153 99
6375 99 137 -137 -82 -149 54 51 -6 -57 -127 93 85 126 119 38 90 -89 15 11 -136 138 -1 -9 226 227 173 208 -270 96
6403 96 124 -210 -57 62 16 51 -115 107 -99 -114 -201 -48 101 43 -144 55 -65 -70 76 46 86 196 -128 154
6427 154 -85 -45 -87 -6 65 -248 21 -51 221 -111 -63 -135 59 269 -38 205 43 146 -10 177 -86 -126 -180
6450 -180 43 -3 169 -135 -50 28 -76 5 154 1 -58 107 143 166 100 73 58 178 60 -37 -101 -8 -132 -166 -294
6475 -294 -184 40 7 -64 -10 -101 -1 79 44 4 101 -104 105 116 -233 197 76 164 -269 -288 106 -4 34 47
6499 47 -48 -68 -35 61 62 58 98 44 -79 72 -142 -60 -52 -127 -115 5 -55 -288 -29 102 -97 -70 158 -38 -102 -171 125
6526 125 135 25 123 -48 -26 29 275 -46 -208 8 67 -159 27 -237 -96 -224 140 -58 67 -84 -27 91
6548 91 134 -80 80 44 89 47 170 128 -89 88 -307 -90 -134 85 -133 -63 112 -196 18 73 154 -35 129
6571 129 -89 100 -50 278 -23 194 -12 -68 33 80 91 -108 -79 -74 74 133 61 -204 -40 -101 51 92 -79
6594 -79 90 -114 189 55 141 -40 35 -11 -38 -27 56 -58 13 -172 -55 -16 -241 154 -130 30 25 -115 141 41
6618 41 20 49 285 271 17 -140 25 184 -69 156 -205 -10 -60 10 -242 -114 -49 31 -47 47 177 411 -68
6641 -68 155 91 99 -22 -32 19 -139 -63 -31 -278 47 -86 -15 -11 -64 -12 34 235 36 -56 24 42 -86 24 108 -32
6667 -32 -31 87 -75 -72 -156 236 -45 -195 220 157 36 -206 -102 -117 36 -59 -95 35 216 29 -61 112 -33 -96
6691 -96 39 -163 -141 98 120 26 19 -39 164 -115 85 152 115 8 74 107 10 72 61 68 225 -86 51 -71 142
6716 142 -95 112 -107 -59 43 -152 -89 104 127 13 13 40 22 -184 235 116 32 71 111 -154 97 153 -18 95
6740 95 -79 -91 73 -138 30 -9 -59 54 133 33 -36 62 101 -112 9 -89 -320 -135 31 96 63 -102 29 -197
6764 -197 139 -60 -113 38 0 -269 -224 157 89 -23 89 -5 175 125 29 138 -102 123 -63 82 -129 -60 21
6787 21 -94 146 16 -138 43 158 235 -116 -191 154 -14 -256 169 -5 -28 -30 -196 -69 33 -181 -63 68
6809 68 -43 141 -11 -149 33 -159 105 26 77 180 108 158 147 89 -95 98 -42 -35 2 -86 62 222 3 -160
6833 -160 -186 -121 -12 120 -39 80 -18 -98 -49 -32 -102 51 -238 -156 -163 -138 30 -183 -50 30 -128 -31 -139 172
6857 172 -29 -23 165 79 180 164 100 228 198 -22 -184 57 8 85 -8 -273 51 -105 123 -132 13 -23 -35 -291
6881 -291 80 123 -33 60 90 -178 42 -59 -54 85 -23 108 -75 -37 -53 -168 -319 -199 -283 -21 -13 94 185 195
6905 195 -94 34 -138 33 83 -16 -86 -124 76 56 27 -47 132 -200 112 -150 39 -23 -50 -27 205 102 190 177
6929 177 82 115 -19 202 -47 23 -215 60 -227 -211 31 -105 63 45 55 -260 155 28 -91 4 -28 66 84
6952 84 -10 149 216 84 -86 -2 -130 96 151 69 75 38 -245 206 86 51 -31 -157 -141 11 -65 -1 -47 -21 -38 -122
6978 -122 -188 99 -80 52 -81 81 -69 -89 79 -81 444 -71 -114 69 35 44 -7 160 213 -6 216 -178 -24
7001 -24 25 102 -8 -134 -41 -153 -104 -94 -22 0 -148 115 7 179 -226 -24 -88 65 67 -102 145 -190 -5 174
7025 174 61 117 -213 27 181 -35 240 -74 78 -26 50 13 -107 132 -201 -6 122 56 -44 -186 76
7046 76 161 100 -56 3 -43 -145 79 -148 164 63 39 66 -134 253 -75 15 4 84 -75 298 91 -110 -161 183
7070 183 -11 201 -87 214 29 -195 -87 161 16 -151 66 -18 78 135 103 22 12 202 100 -78 174 -96
7092 -96 -141 -182 -137 -115 -38 -179 -103 45 -65 -37 48 85 23 246 107 -175 113 253 11 -38 -78 -87 -234 -123 107
7117 107 -63 -88 52 7 -53 56 -92 66 70 138 159 148 152 -145 83 -15 -154 165 -83 -163 -37 -203 164 45
7141 45 -123 47 -38 -55 -1 91 32 130 191 -80 36 -144 -94 -27 -46 -63 -5 44 102 -46 -71 159 5 121 35 73
7167 73 93 107 -129 101 11 -9 75 168 -92 -74 6 96 81 -125 -66 -96 83 -219 -16 140 85 141 88 -4 54 -131
7193 -131 17 -86 -244 -243 271 147 168 162 183 -53 -144 195 94 -128 -202 -39 -135 158 204 -33 -9 -14 -73 126 64
7218 64 -181 104 99 -171 45 17 -37 -132 -79 -44 166 26 -157 77 102 56 -23 72 133 -43 45 -77 249 64 110
7243 110 38 41 197 -119 278 -157 -7 115 -97 -79 28 -52 -274 -50 123 6 34 57 -25 137 40 15 -55 -36
7267 -36 91 79 12 -32 -230 -155 -115 31 -134 -79 -223 -57 -122 83 215 26 -26 32 -124 13 -66 -26 -70 24 169
7292 169 150 -55 170 138 103 -63 -64 -11 100 53 -126 65 84 -138 45 45 10 -108 0 -184 -81 196 92 32
7316 32 82 -168 -136 78 -289 -170 -125 -9 71 182 -21 80 -145 -102 137 171 -49 -12 -44 236 211 -1 89 88
7340 88 -149 260 -102 -139 272 27 -80 38 -37 47 144 0 90 88 -232 -95 -353 -87 -114 -92 73 94 -112 152
7364 152 -116 -34 -87 -122 -34 -24 22 134 -190 -83 222 156 94 29 160 -21 13 -23 46 99 -177 21 -15 214 -51
7389 -51 201 113 118 208 -122 14 -98 143 258 37 -23 14 10 -112 -135 91 73 21 112 -33 -108 -56 -15 -17 200 114
7415 114 21 -164 -51 69 89 61 33 242 5 -10 74 279 94 22 -128 -44 -83 -26 41 -123 26 -47 -142 166
7439 166 -70 -138 -34 45 -21 13 186 -84 50 -97 128 -82 -180 -35 7 -97 -111 43 -144 172 -88 75
7461 75 127 151 232 117 55 17 125 38 -12 67 72 69 -64 -28 -291 -204 100 -41 128 -50 62 120 -13 -9 -123 246
7487 246 -16 200 26 -52 61 -91 -76 -310 67 -115 68 -289 25 41 43 74 -23 293 -185 39 18 111 46
7510 46 10 197 127 50 137 82 188 33 -65 172 -213 4 -88 93 -11 80 65 -49 -14 55 52 72 197 22 10
7535 10 79 62 -41 76 164 -137 34 -138 -47 -55 -157 -97 -56 42 49 -77 173 -31 62 177 -213 132 85 88 10 -242
7561 -242 -139 9 82 -51 -54 68 -4 -27 206 21 -116 117 -6 -31 206 70 62 268 49 56 41 -17 -18 99 -193
7586 -193 -45 -91 -70 -49 15 57 63 -87 -75 -76 127 -80 -43 43 -28 23 6 3 23 -249 51 -167 -220 -231 137 131 -155
7613 -155 50 -63 -116 95 196 11 -153 -19 103 43 -90 -167 -165 -80 279 81 -180 -249 25 77 -77 -114 69
7636 69 5 15 164 53 114 79 33 26 139 3 52 -73 143 101 179 64 104 -29 17 -115 -46 -91 -61 -4 -29 -41
7662 -41 -2 -50 28 -83 12 -82 -153 123 27 167 -8 -241 91 -258 58 -161 80 -11 44 -29 180 33 254 18
7686 18 -11 19 -55 131 -19 -66 166 36 178 72 -179 -19 71 -117 154 -66 164 177 105 -46 -183 133 -11
7709 -11 -10 66 -16 111 45 -71 20 -241 44 -37 -96 -79 -150 -45 60 -190 -105 105 120 136 -45 14 -31 -11 92 -77
7735 -77 167 -154 -208 -118 -94 -54 0 -29 54 38 78 -19 -172 -184 68 -7 -171 -117 58 24 18 -84 59 -65 1 60
7761 60 -49 -35 -126 -18 -64 196 129 3 128 -266 136 86 -131 -5 184 -27 -13 33 -52 142 -64 -128 -10
7784 -10 -1 -30 -49 9 63 -15 -55 124 54 -73 -20 112 -179 50 -111 114 111 -115 -65 1 71 140 -10 -127 -71 88
7810 88 8 -77 -79 -179 -89 65 -47 52 -59 -120 100 93 -49 -6 39 -4 -87 18 -159 -12 33 -88 -27 -77 176 50
7836 50 15 -106 123 60 -198 -104 136 60 226 -96 96 -10 292 -206 -205 2 40 23 -14 -315 -128 -83 -24 -13
7860 -13 28 -133 116 -220 -212 95 -21 54 -110 -35 -113 22 46 100 -109 -149 115 -120 53 -21 -81 57 -33 -15 17
7885 17 50 156 -23 -136 38 -159 -99 -145 -22 85 28 177 65 -147 79 -17 -212 81 31 -70 -43 51 -109
7908 -109 47 126 41 186 12 -1 -107 21 77 -42 -69 59 139 -224 -174 -24 8 -37 133 -59 -112 -63 -12 45
7932 45 7 -5 15 -12 222 90 117 -147 -56 56 -42 -58 19 137 -43 26 -132 -29 -15 185 -161 -32 -25 -63 71
7957 71 126 130 335 -100 2 -32 -76 21 -43 -34 -142 -102 -29 148 -139 -37 -135 8 16 28 66 -101 -199 11 -50 58
7983 58 14 -216 72 20 -248 232 -100 -64 9 -82 -173 -59 11 -98 114 -77 279 81 148 30 6 119 59 -87
8007 -87 -199 -44 64 -49 -22 27 -145 -131 -52 270 -125 -5 -63 -35 25 214 6 97 14 41 89 168 -192 -128 -26
8032 -26 -104 -99 -36 -4 -96 -284 86 51 -5 177 -10 -140 -64 125 181 291 -52 -22 44 187 249 -8 -152 -13 127
8057 127 -17 147 -179 -33 129 115 129 9 228 -134 3 39 -72 -126 151 45 68 5 42 29 2 184 -305
8080 -305 -164 47 168 -34 172 -98 31 -51 132 51 84 -16 47 -21 147 -9 -38 -155 -130 -141 179 76 154
8103 154 -1 -85 -9 20 -203 -70 80 -29 55 -106 -106 -4 48 8 108 -128 -5 17 164 -14 205 176 41
8126 41 -184 29 55 -66 -98 -71 -23 -36 -130 66 15 10 130 124 -201 246 4 -18 47 22 -50 -120 149 -232 -29 -191
8152 -191 -69 173 -19 -96 18 74 -156 -96 -22 -130 38 -16 32 8 -206 82 -93 6 152 -50 55 165 74
8175 74 -148 261 242 -186 164 230 135 74 230 17 -118 139 -159 -95 105 -78
8191g8
$$ Imaginary data points
##PAGE= N=2
##DATA TABLE= (X++(I..I)), XYDATA
0 0 0 0 0 0 0 0 0 0 0 0 0 0 8 -8 8 -8 16 -16 16 -24 28 -32 40 -48 56 -64 72 -88 99 -112 129 -150 168 -191
34 -191 215 -243 272 -304 341 -381 423 -471 521 -577 639 -705 778 -858 946 -1040 1148 -1266
52 -1266 1393 -1538 1701 -1882 2089 -2328 2606 -2933 3328 -3812 4422 -5224 6321 -7921 10487
67 10487 -15267 27218 -125269 -93606 186208 81879 -104216 -125395 30817 51266 33891
78 33891 40709 42769 -42108 -38107 78105 102663 -823 -74163 -14169 41307 -12434 -28045
90 -28045 -6068 -12507 -61232 -29172 26558 3401 -42656 -14081 49832 4806 -35455 34193
102 34193 78277 10656 -57283 20532 84178 8374 -70643 -8401 60841 -10395 -71887 -29059
114 -29059 32905 -1406 -51252 -10416 9840 -18271 -11679 48854 38055 -40740 -33491 58350
126 58350 83581 -15735 -52374 15826 44708 1504 -32834 -3866 280 -28346 -21713 5631
138 5631 -7868 -34148 466 23035 -8851 -35918 11153 68686 20111 -41549 -14274 50687
150 50687 45155 -8467 -19437 -1877 -2224 -14001 11740 14005 -35775 -51170 -8354 33880 6086
163 6086 -33183 -16294 14038 12285 4475 20739 19061 1371 -5942 11059 25754 7768 792
176 792 -3987 -22003 -22757 7998 26246 -14611 -58978 -32781 35813 34789 -23207 -35165 2519
189 2519 33191 16256 994 13070 10121 -3819 5719 24611 9808 -16980 -19180 2955 7107
202 7107 -18477 -17885 -5033 -8158 -13830 -6981 7403 2994 -7286 2131 20470 11300 595 11487
216 11487 15237 8353 -2629 3912 10981 -8034 -18123 -2067 5893 -13950 -25671 -11479 8094
229 8094 1085 -17335 -4859 9266 6807 6831 10101 11048 4016 5485 17457 13660 -7976 -6855 9675
244 9675 1603 -16770 -19071 748 4671 -19785 -23458 -262 9756 -900 -6587 734 8994 8341
258 8341 11295 19029 4700 -7217 6963 19553 9060 -14010 -14986 1591 1288 -12622 -11447 -7579
272 -7579 -13061 -10100 466 7596 -2838 -11213 7966 20727 8489 6 8719 15643 7132 -2693
286 -2693 3941 9534 -7438 -14528 -4050 -1132 -8755 -15078 -8844 -3139 -7837 -3927 7311 3052
300 3052 -5165 5029 17277 15668 977 -383 14880 11703 -2381 -2795 1403 -2356 -10544 -10769
314 -10769 -3158 -6311 -16193 -7976 368 -4069 -4307 2094 8680 5117 335 10917 17728 6113 116
329 116 6230 7859 3330 -4774 -5077 -2557 -10383 -10147 -2907 -7296 -13720 -9946 545 5501 -2764 -5320
345 -5320 8193 12567 7434 7750 7472 7679 5619 4129 6086 -563 -9193 -4365 -1576 -8269 -11166 -9683
361 -9683 -4960 -4904 -9685 -2333 5744 2525 1361 4354 8490 11237 8566 7364 7505 932 852 5805
377 5805 799 -6568 -10892 -9316 -3715 -6340 -9189 -6683 -7829 -6158 1844 5812 5376 2479 1913 9959
393 9959 12116 8642 7625 3471 -372 220 1007 1343 -4169 -13447 -11276 -4867 -4558 -5869 -8048 -6263
409 -6263 -243 1164 3723 6808 6095 7447 8263 5968 7480 7912 5965 2525 -4691 -6487 -2443 -2918
425 -2918 -4688 -8869 -14173 -10824 -2659 3128 2601 -6679 -7624 6454 15450 12604 3897 -778 6992
440 6992 11375 6263 2812 -430 -3957 -5841 -7649 -4545 -1827 -9412 -13218 -8581 -3046 1550 -321
455 -321 -232 5417 4314 1749 7842 14330 13766 2567 -7250 1504 11841 5640 -6455 -13730 -9318
470 -9318 -2855 -6270 -6420 -2190 -6966 -11764 -6699 7311 17551 5851 -9938 -2528 15025 22020
484 22020 11829 -5210 -6121 2583 4733 3600 -1694 -11249 -14994 -11839 -865 6610 -5853 -17878
498 -17878 -9438 7405 14628 4523 -5559 3582 14381 11101 3582 -143 6293 10633 -561 -9506
512 -9506 -6773 -1865 -640 -6987 -12998 -10076 -7015 -3052 4321 3019 -3536 -5478 1136 16662 20177
527 20177 4565 -6576 -2497 11177 17401 3837 -10821 -11160 -6262 -894 691 -5253 -10842 -14868
541 -14868 -10604 4339 11730 3034 -8762 -8566 9732 24021 12976 -3177 -3699 6131 12011 3934
555 3934 -3963 -2702 -4884 -9086 -6264 -2777 -3783 -10412 -12122 -82 5551 -2280 -4495 4844 13884
570 13884 8757 -4063 61 16270 16301 1676 -9990 -6090 6726 5226 -7073 -11668 -10650 -7537
584 -7537 -4552 -1863 1496 -3702 -12392 -3984 13080 17385 5784 -7607 -988 16523 16666 3213
598 3213 -5369 -3544 1677 -1210 -5163 -1844 -5388 -13866 -11379 -2190 3878 -1194 -10338 -3656 8460
613 8460 9926 5303 1387 4740 11504 7530 1080 2868 3416 1502 -2657 -7368 -5994 -5184 -6577 -4346
629 -4346 -5797 -8332 -4686 -1092 3377 5858 894 -269 4724 10369 13044 5922 -2319 331 5030
644 5030 4815 628 -7668 -9268 -5546 -4528 -3814 -5190 -8444 -6461 -2192 1950 4569 1385 1590 7217
660 7217 7759 6323 6081 5191 5311 1937 -1758 -9 -1509 -4594 -4833 -7431 -8149 -6521 -4869 -1469 -2287
677 -2287 -4829 210 4746 5596 6237 4509 4892 6060 5792 7483 5028 -3366 -3225 269 -992 -5274
693 -5274 -9452 -7116 -3570 -6520 -6026 -1466 -1048 -1047 1017 4569 7763 5074 3381 7278 6536 4272 3556
710 3556 1766 151 -2367 -4027 -2734 -5887 -9175 -5409 -3795 -5308 -5165 -2895 1827 1912 442 5170
726 5170 7699 4769 4932 6871 6555 3755 -302 1167 1516 -4263 -5748 -4355 -5670 -6481 -6830 -4734
742 -4734 -2297 -3743 -1859 3132 2147 2202 5575 7419 6973 3815 3803 7801 3921 -2116 -1209 -1004 -2493
759 -2493 -5341 -7559 -5211 -5469 -7258 -3371 -1689 -3094 -438 2385 4981 5379 2923 6113 7865 4107
775 4107 4120 4459 1341 -515 -2388 -2173 -2599 -7787 -7513 -3486 -4941 -5591 -4577 -1774 1451 537 1126
792 1126 5978 5789 4526 6483 5953 5221 3421 1018 2236 -1065 -4986 -3596 -3973 -6186 -6227 -5939 -4137
809 -4137 -3312 -4115 -45 2631 1059 3194 5252 6146 6406 4189 4854 5594 1947 261 355 -2254 -3571
826 -3571 -4975 -5734 -4902 -6701 -6072 -2584 -3090 -2766 342 2213 4743 4313 3661 6564 6273 4136 4924
843 4924 3227 1126 -872 -2611 -1336 -2889 -7035 -6491 -5240 -5331 -3352 -3375 -2410 -530 180 3611 6295
860 6295 4211 4614 5486 5218 5852 3322 1643 1283 -2231 -3362 -2073 -4521 -5721 -6485 -6290 -3436 -3087
877 -3087 -2884 270 386 1016 4188 5182 6278 5447 3469 5173 4148 1298 2218 241 -3276 -4647 -5262
894 -5262 -3418 -3281 -7670 -6114 -2830 -2972 -1105 400 2075 3957 1962 3776 8378 6674 3811 2411
910 2411 1720 3005 1081 -2261 -2797 -5011 -6483 -3852 -4683 -4898 -3879 -4282 -2009 -53 1281 4954
926 4954 3970 1825 5309 6777 5956 4051 1883 2705 1151 -4119 -2447 9 -3476 -8249 -8850 -3642
942 -3642 452 -3620 -5167 -644 1098 2727 4212 4940 5503 3587 2715 6336 6026 2450 -556 -3339
958 -3339 -2354 -654 -3149 -5600 -7651 -6350 -2001 -2695 -4109 -890 1582 1590 1023 3089 8311 7275 623
975 623 2349 6865 4975 -552 -3332 428 577 -7384 -8157 -2032 -1335 -5258 -7888 -4148 2159 1160
991 1160 -203 3057 3738 3766 4630 5613 7031 3888 -374 748 1880 1376 -362 -6354 -8241 -4121 -1432
1008 -1432 -2262 -6601 -7127 -168 2546 33 1219 4200 4821 3252 2704 7646 7581 -2 -1670 2563
1024 2563 2771 -2130 -6784 -4447 -971 -5276 -7832 -3581 -1525 -1694 -2207 -754 3109 3164 3120 6284 4939
1041 4939 2971 4806 4028 2597 1235 -707 -874 -3902 -5573 -1231 -2082 -7550 -7398 -3419 1486 527
1057 527 -3511 435 5023 3026 3316 5856 6602 3860 -261 2846 6784 375 -5288 -3401 -1807 -2193
1073 -2193 -5373 -6106 -3321 -4026 -4475 -42 162 -134 2213 3602 4785 4359 3869 5999 4222 912 2374
1090 2374 1940 -965 -3162 -3529 -2110 -4238 -8088 -3787 -240 -3862 -5132 -1629 3273 3428 -280 2984
1106 2984 7628 4293 1689 4248 5572 2981 -1566 -1451 1739 -2526 -5874 -4055 -3570 -4841 -5203 -2962
1122 -2962 -110 -1952 -2489 2935 4530 2240 3074 5115 5533 3387 2016 4161 2765 -2304 -1721 -262
1138 -262 -2937 -5555 -5848 -2598 -2752 -6489 -3625 1395 175 -834 1383 4355 5072 2687 3555 6758
1154 6758 3123 252 1960 2251 -782 -4076 -3451 -942 -4361 -7110 -3218 -2013 -3697 -2991 -200 2700
1170 2700 1219 467 5242 6125 2682 3348 4864 4035 1580 -1211 965 312 -4947 -4552 -2015 -3656
1186 -3656 -5191 -4921 -1921 -390 -2941 -910 4039 2597 1496 3851 5582 5255 1851 1807 4880 1456
1202 1456 -2311 -796 -1033 -3251 -4774 -4775 -2209 -3613 -5591 -1541 533 -970 192 2450 4364 3621
1218 3621 2166 4985 5567 1644 1310 2828 1091 -1310 -3398 -2189 -1984 -5693 -5303 -1994 -2894 -3761
1234 -3761 -2250 388 1915 422 1453 5549 4348 2362 3870 4277 3491 727 -286 1375 -1137
1249 -1137 -4421 -3164 -2489 -4231 -4611 -3752 -1374 -1242 -2535 851 3116 1798 2812 4128 4671 4036
1265 4036 1996 2857 3478 -95 -1129 -541 -2096 -3482 -4667 -3984 -2970 -4473 -3888 -851 -1080 -916 897
1282 897 2384 3922 2722 2530 5464 3970 1906 2015 1707 471 -1329 -2838 -1765 -2949 -5603 -3803
1298 -3803 -2878 -3223 -2505 -1687 349 1522 697 2571 4275 3004 3608 4074 3444 3004 804 358 684 -2290
1316 -2290 -3350 -2318 -3606 -3840 -3969 -3506 -1358 -2063 -1426 1684 2222 1614 2806 3642 4748 3816 1898
1333 1898 3283 2679 -4 -171 -981 -2356 -2842 -4329 -3585 -2466 -4280 -3101 -1249 -1089 24 1185
1349 1185 2073 3248 2836 3198 4935 3090 2155 2482 1059 336 -1453 -2515 -1602 -3654 -4770 -2957 -3022
1366 -3022 -2950 -2139 -1752 404 1171 770 3302 3975 2820 3461 3525 3178 2591 564 348 119 -2401 -2590 -2704
1385 -2704 -3909 -3754 -3793 -2878 -1257 -2197 -1002 1484 1038 2056 3107 3708 4003 2655 1991 3383 2028
1402 2028 -246 -213 -1404 -1945 -2963 -3935 -2855 -3088 -4056 -2187 -1340 -695 745 961 1936 3066 3177 4183
1420 4183 3659 2136 2802 2288 772 -319 -1419 -1335 -2080 -4300 -3613 -2015 -3022 -3304 -2602 -592 1219
1437 1219 146 942 3666 3248 2636 2934 2986 3564 1962 -100 612 -229 -2022 -2176 -3485 -3264 -2879 -3896
1455 -3896 -2593 -1762 -1794 204 340 697 3187 3212 2871 2846 2658 3694 2905 -64 -137 443 -1376 -2589 -3328
1474 -3328 -2659 -2038 -4479 -3960 -858 -795 -1427 -426 1002 3487 2804 1851 3730 3784 2728 2186 1013 1146
1492 1146 351 -2068 -2005 -1906 -3176 -3015 -3552 -3317 -1864 -1692 -1252 353 248 2408 3067 1677 2943 4135
1510 4135 3263 2209 831 1387 1527 -1626 -2538 -1570 -2546 -3327 -3745 -2772 -1198 -2336 -2579 403 1484
1527 1484 1285 1829 2161 3772 3603 2207 2683 2279 830 251 -715 -1400 -1781 -3298 -2843 -2944 -3634 -2288
1545 -2288 -1426 -2002 -620 737 1690 2464 1689 3191 4165 2514 1887 2662 2114 756 -1347 -1579 -511
1562 -511 -2694 -3885 -2613 -2307 -2770 -2804 -1829 334 140 -77 2228 2964 2410 3073 2893 3209 2368 1098
1580 1098 1371 477 -1670 -1669 -1900 -2755 -2994 -3393 -2487 -1775 -2819 -1170 719 306 974 2086 3254 3518
1598 3518 1908 2667 3971 1635 -39 531 144 -1264 -2890 -3284 -1724 -3132 -3941 -1922 -1403 -1471 -678
1615 -678 3 2019 2249 1286 3298 3845 2477 2209 2092 1691 664 -1150 -969 -935 -3277 -3106 -2199 -2881
1633 -2881 -2856 -2310 -957 155 -719 668 3015 2199 1892 3214 3074 3102 1323 820 1881 -76 -2019
1650 -2019 -1265 -1564 -2731 -3333 -3427 -1750 -2154 -2932 -647 620 449 1174 1734 3088 3036 1781 2922 3120
1668 3120 1179 192 634 -473 -1325 -2706 -2494 -1935 -3326 -3066 -1299 -1741 -1527 -477 725 2101 1245
1685 1245 1729 3966 3059 2010 2490 2414 1655 -342 -987 -101 -1570 -3401 -2417 -2123 -2623 -2879 -2259 -426
1703 -426 86 -687 1228 2311 2068 2164 3016 3048 2738 1143 1209 1653 -651 -1459 -1000 -1662 -2756 -3156 -2528
1722 -2528 -1665 -2675 -2284 71 298 111 1323 2270 3083 2449 1753 3260 2436 797 721 374 -321 -1608
1740 -1608 -2697 -1754 -2145 -3564 -2548 -1586 -1756 -1081 -586 924 1843 1103 2111 3600 2521 1974 2278
1757 2278 2063 1517 -241 -412 -118 -2029 -2872 -2069 -2531 -2744 -2588 -1967 -157 -578 -449 1866 2021 1602
1775 1602 2360 2790 3005 1981 885 1893 1300 -1092 -1113 -1084 -1787 -2666 -3123 -2032 -1515 -2819 -1497 -53
1793 -53 32 728 994 2281 2859 1894 2347 2989 1763 847 732 138 -475 -1803 -2207 -1568 -2796 -3437 -1866
1812 -1866 -1755 -1549 -1143 -305 1438 1188 772 2667 3003 1800 2039 2260 1877 649 -652 -67 -655 -2247
1830 -2247 -2556 -1877 -2219 -2679 -2768 -1477 -407 -1037 46 1755 1590 1663 2361 2662 2864 1734 1248 1817 350
1849 350 -809 -782 -1265 -1838 -2706 -2635 -1426 -2217 -2763 -856 98 21 538 1044 2682 2581 1700 2740 2766 1095
1869 1095 1071 728 208 -473 -1957 -2018 -1633 -3055 -2467 -1800 -1902 -1366 -718 -62 1234 929 1422 2839 2270
1888 2270 2031 2615 1955 1727 391 -364 188 -966 -2195 -1812 -2057 -2153 -2329 -2369 -777 -467 -1004 559 1459
1907 1459 1456 1904 2311 2128 2563 1566 1463 1634 -90 -342 -550 -1665 -1773 -2420 -2239 -1727 -2265 -1879 -317
1926 -317 -718 -226 1007 1443 2317 1722 1848 2851 2359 1214 1147 584 158 -897 -1963 -1524 -1715 -2588 -2351
1945 -2351 -1828 -1615 -966 -973 133 1337 873 1860 2321 1973 2575 1912 1684 1609 595 103 -36 -1642 -1727 -1567
1965 -1567 -2386 -2463 -2053 -2017 -738 -1176 -523 863 1189 1168 1940 2039 2611 1983 925 1745 1316 -119 -456 -1014
1985 -1014 -1431 -1704 -2720 -2399 -1654 -2062 -1481 -867 -344 451 746 1166 2069 1814 2072 2158 1455 1499 1277 464
2005 464 1 -1094 -1474 -1184 -2428 -2642 -1701 -1762 -1696 -992 -687 752 764 644 2274 2042 1854 2133 1631 1882
2025 1882 1436 -38 131 -188 -1434 -1718 -1999 -2133 -1967 -2098 -1685 -844 -839 -150 863 695 1498 1988 1922 2327
2045 2327 1680 1475 1792 218 -174 -169 -1244 -1444 -2181 -2230 -1620 -1704 -2241 -1036 -667 -429 449 520 1802 2020
2065 2020 1305 2323 2477 1405 1184 914 686 259 -1207 -1218 -1343 -2201 -2183 -1925 -1930 -961 -966 -698 615 610 1100
2086 1100 1983 1645 2020 2385 1802 1414 998 180 233 -537 -1692 -1091 -1573 -1992 -1888 -2063 -1091 -816 -1210 280
2106 280 656 822 1551 1570 2003 2415 1364 1446 1534 275 172 -350 -1000 -1077 -2002 -1958 -1499 -2126 -1634 -713 -855
2127 -855 -217 451 909 1677 1482 1619 2395 1604 1266 1338 969 601 -488 -1161 -876 -1366 -2433 -1576 -1791 -1762
2147 -1762 -1368 -1126 99 652 376 1286 1815 1591 1837 1860 1617 1451 383 341 418 -1133 -1211 -1297 -1890 -1843 -2042
2168 -2042 -1614 -934 -1127 -612 453 309 754 1302 1530 2269 1529 1325 1726 1196 48 286 -378 -812 -1308
2187 -1308 -2118 -1463 -1443 -2220 -1103 -857 -709 144 343 984 1860 1201 1635 2331 1474 1220 1279 838 391 -599
2207 -599 -957 -787 -1826 -2190 -1632 -1826 -1351 -1000 -1026 400 314 361 1663 1617 1376 1963 1625 1823 1336 254
2227 254 903 -91 -1260 -807 -1371 -1781 -1629 -1970 -997 -820 -1434 -604 624 385 768 1305 1572 2034 1293
2246 1293 1363 1641 812 242 165 -491 -638 -1489 -1601 -1146 -1694 -1874 -938 -674 -738 -191 132 1240 1130 1147 1942
2267 1942 1942 1229 1325 1076 763 156 -564 -392 -709 -1767 -1530 -1432 -1527 -1344 -1344 -535 221 -104 554 1565 1240
2288 1240 1529 1545 1609 1545 878 607 579 -365 -1026 -849 -1480 -1457 -1591 -1729 -980 -1267 -1209 126 103 521 1199 1164
2310 1164 1678 1725 1145 1692 1314 164 418 -74 -406 -682 -1850 -1623 -1160 -1832 -1450 -1062 -679 -201 10
2329 10 316 1270 1195 1367 1806 1462 1329 1470 918 462 55 -676 -445 -1065 -1709 -1273 -1425 -1581 -1358 -1260 -127
2350 -127 -64 -193 833 1403 1228 1683 1670 1619 1484 580 613 535 -414 -954 -988 -1218 -1303 -1559 -1676 -1053 -1294 -638
2372 -638 119 47 692 1211 1228 1659 1597 1342 1636 890 265 456 -98 -617 -1091 -1526 -1144 -1166 -1982 -1188 -750
2393 -750 -822 -371 -34 675 1102 760 1254 1798 1376 1185 968 827 587 -307 -561 -402 -1292 -1332 -1376 -1679 -1118
2414 -1118 -1067 -815 -203 -178 179 1044 1170 1114 1717 1333 1603 1181 158 841 103 -536 -622 -1165 -1271 -1331 -1834
2435 -1834 -1229 -769 -1118 -424 91 329 751 821 1220 1723 1272 1305 1481 844 486 442 -145 -485 -841 -1343 -1161
2456 -1161 -1434 -1516 -795 -1046 -554 -91 -121 762 650 996 1602 1508 1243 1357 884 892 402 -356 -427 -502 -1285 -1461
2478 -1461 -1180 -1607 -1093 -1134 -708 -126 -242 480 1014 916 1133 1283 1195 1696 1067 359 725 -211 -632 -531 -1110
2499 -1110 -1147 -1393 -1464 -1066 -1036 -869 -158 -38 325 750 762 1459 1442 1047 1359 1207 743 617 223 -273 -611
2520 -611 -1075 -1074 -1129 -1577 -1443 -938 -1099 -475 -280 -16 978 705 895 1080 1233 1222 1241 800 574 232 -356 -260
2542 -260 -622 -968 -1037 -1366 -1075 -1185 -1243 -514 -242 -389 540 780 1179 1063 1066 1222 1453 614 843 580 -326
2563 -326 -541 -914 -1065 -1068 -1599 -1361 -939 -1204 -892 -80 -174 473 810 1048 1292 1135 1301 1386 910 612 553 128
2585 128 -149 -436 -1154 -896 -1067 -1433 -876 -952 -705 -301 -402 171 856 601 1091 1414 820 1242 903 660
2605 660 422 83 -229 -351 -872 -890 -853 -1339 -1026 -1273 -906 -416 -435 -17 708 658 779 1202 1060 1252 1086
2626 1086 526 889 256 -495 -511 -839 -768 -903 -1212 -1001 -753 -1086 -449 -221 -286 439 374 929 1277 944 1168
2647 1168 1418 665 783 514 22 -157 -745 -860 -604 -1369 -1273 -961 -989 -692 -358 -175 241 492 605 1295
2667 1295 1182 995 1220 736 858 571 -216 -72 -379 -1060 -828 -1037 -1070 -1144 -1341 -652 -301 -361 184 398 551
2688 551 933 781 1001 1274 891 700 808 104 -145 -234 -672 -838 -1052 -1183 -762 -942 -993 -353 -391 39 210
2709 210 361 1197 1317 708 1147 1007 712 725 172 19 -167 -997 -688 -674 -1207 -1245 -821 -852 -400 -734 -66
2730 -66 486 380 663 1049 1072 975 946 841 868 348 -208 100 -305 -770 -796 -1108 -889 -1024 -1277 -504 -210 -358
2752 -358 268 403 667 1051 962 1186 1374 701 768 640 97 -4 -661 -910 -862 -1090 -1013 -606 -1045 -812 -117
2773 -117 -283 36 194 389 1029 883 771 1223 784 761 301 273 208 -275 -685 -500 -610 -1083 -701 -941 -833
2794 -833 -493 -390 73 211 22 783 1141 700 1061 583 781 641 84 -145 35 -682 -700 -899 -788 -1089
2814 -1089 -1157 -820 -590 -343 -196 244 535 729 925 849 1181 858 770 832 222 -2 -36 -496 -510 -622 -1005 -650
2836 -650 -750 -1049 -342 -346 -370 186 330 496 918 655 635 1128 622 700 292 -81 189 -376 -656 -578 -834 -764
2858 -764 -760 -917 -637 -432 -484 130 157 254 740 753 956 779 698 909 814 97 297 6 -643 -565 -1033 -904 -959
2881 -959 -1262 -674 -547 -498 -104 365 363 960 755 1154 946 425 536 731 428 187 -356 -429 -590 -750 -917
2902 -917 -636 -791 -794 -496 -401 -14 146 187 656 841 657 1030 691 437 845 263 82 -24 -522 -365 -554
2923 -554 -1031 -753 -850 -705 -480 -517 -177 221 7 419 964 726 795 705 669 754 357 64 212 -410 -556 -314
2945 -314 -829 -662 -810 -922 -420 -417 -337 106 329 474 747 592 853 973 701 920 476 192 -136 -159 -275
2966 -275 -414 -766 -843 -846 -829 -591 -552 -439 -27 102 400 671 620 846 723 699 727 585 316 273 -98 -174 -401
2989 -401 -763 -863 -545 -965 -763 -600 -797 -37 80 288 694 700 571 1017 720 795 777 190 194 282 -296 -469
3011 -469 -778 -791 -845 -723 -700 -273 -513 -268 97 210 563 582 603 893 651 596 812 663 304 105 -222 -268
3033 -268 -412 -717 -755 -621 -768 -416 -376 -406 218 252 405 727 357 682 823 759 592 439 205 151 -265 -188
3055 -188 -485 -738 -469 -753 -805 -448 -402 -357 38 -24 96 676 591 910 581 485 762 555 -152 278 2 -434
3077 -434 -338 -482 -783 -735 -719 -599 -629 -573 -277 167 301 417 576 661 952 493 554 531 260 269 -66 -385 -269
3100 -269 -682 -667 -424 -848 -719 -329 -311 -391 -34 91 365 243 320 632 402 808 675 155 542 -203 -338
3121 -338 -231 -634 -703 -559 -739 -604 -462 -565 -303 156 -73 210 638 422 848 664 496 335 423 63 360
3142 360 -272 -255 -381 -576 -484 -697 -937 -715 -402 -395 -55 -60 296 572 600 698 866 513 697 615 282 82 -145
3165 -145 -323 -344 -699 -488 -477 -726 -561 -532 -610 -245 127 204 470 270 458 916 341 693 535 457 402 48
3187 48 -186 -183 -349 -689 -659 -640 -441 -330 -583 -168 -96 -94 490 576 329 722 715 550 526 222 190 3 -173 -189 -402
3212 -402 -627 -551 -473 -487 -553 -458 -330 36 -282 183 347 445 725 418 542 540 284 502 81 -188 17 -344 -605
3235 -605 -430 -701 -646 -602 -260 -310 -273 -99 147 290 502 713 436 746 505 368 288 82 -100 -40 -312 -500
3257 -500 -595 -425 -543 -606 -523 -418 -112 -170 220 311 232 467 515 512 656 600 151 130 -161 -259 -395 -289 -350 -285 -597
3282 -597 -333 -355 -564 -111 -143 164 498 330 440 666 517 662 382 155 267 212 -85 -126 -395 -394 -384 -432 -533
3305 -533 -471 -357 -178 9 39 323 262 363 713 557 544 638 258 422 154 -12 21 -137 -656 -425 -682 -558
3327 -558 -370 -308 -214 -11 28 354 448 242 421 583 541 527 443 366 312 145 -152 -154 -435 -235 -510 -582 -414 -440
3351 -440 -304 -131 -6 242 153 307 653 359 371 367 338 303 314 -45 -47 -218 -456 -510 -292 -529 -508 -418 -341 -107
3375 -107 -260 -76 157 313 498 564 439 394 477 238 353 71 -81 -56 -331 -446 -382 -442 -363 -484 -596 -177
3397 -177 -277 -61 119 148 262 366 351 351 309 283 267 37 -141 -95 -152 -178 -424 -573 -411 -220 -278 -358 172 -56
3421 -56 320 354 424 668 357 278 679 248 343 172 -41 183 48 -310 -298 -475 -533 -386 -460 -253 -232 -193 440
3444 440 328 296 440 595 411 328 169 475 369 -60 -193 -58 -209 -428 -286 -475 -336 -517 -519 -330 65
3465 65 335 198 357 228 189 551 462 279 333 445 -112 18 -29 -251 -169 -474 -445 -331 -371 -510 -332 -194 -115
3488 -115 89 -42 251 315 549 384 553 185 37 -96 9 -275 -243 -289 -459 -470 -505 -207 -269 -132 -138 -279 109
3511 109 303 344 402 483 280 450 261 346 -115 109 -119 -257 -246 -404 -137 -484 -269 -412 -260 -208 -387 -10
3533 -10 81 106 418 508 420 496 403 169 265 119 33 -193 -196 -332 -287 -549 -573 -394 -256 148 -149 -191 282 108 138
3558 138 370 139 429 298 77 223 57 -28 -109 -398 -296 -385 -515 -526 -303 -518 -165 -188 21 145 72 453
3580 453 356 123 446 384 265 281 13 14 72 -225 -244 -312 -234 -443 -276 -468 17 -116 -101 116 210 126 366 174
3604 174 206 302 352 341 169 97 -71 38 -84 -88 -443 -359 -381 -302 -402 -69 14 58 77 98 460 197 317 283 374
3629 374 356 322 126 103 -172 -362 -129 -326 -464 -455 -400 -291 -142 -214 -7 33 68 303 507 340 296 301 313 270 99
3654 99 180 121 -141 -110 -350 -226 -158 -309 -357 -147 -219 -3 -127 303 205 248 315 183 -38 142 109 293 108 41
3678 41 -310 -282 -324 -193 -137 -301 -501 -55 -184 -60 -78 -116 118 396 371 415 203 121 376 -44 189 144 -142
3701 -142 -238 -85 -339 -412 -163 -419 -239 -33 -111 -17 -118 329 385 135 413 210 342 414 162 -48 -5 -125
3723 -125 -227 -223 -329 -478 -82 -381 -321 -15 -327 83 259 -6 188 -50 338 495 155 455 286 206 175 37
3745 37 -130 -129 -340 -209 -305 -49 -234 -210 -56 118 -41 162 375 140 44 518 400 285 386 136 123 -111
3767 -111 -191 -113 -174 -446 -269 -258 -224 -55 -193 31 -1 73 144 30 163 496 124 372 559 169 5 65 -118
3790 -118 -135 -322 -139 -128 -285 -266 -237 -40 -189 35 52 156 126 207 381 223 321 143 212 128 -47 -164 10
3813 10 -178 -310 -240 -83 -220 -367 -115 -198 -181 -2 290 96 251 196 309 223 202 119 47 302 -182 -264 33
3836 33 -147 -227 -192 -132 -390 -144 -405 70 50 196 184 231 228 302 258 106 143 -62 164 23 -133 -5 23 47 -169
3861 -169 -395 -227 26 -226 -98 69 71 232 333 222 205 196 67 0 155 96 -50 61 -215 -137 -316 -260 -244
3884 -244 -314 -22 -353 55 -84 32 74 10 255 96 68 139 305 -120 140 63 -63 -63 -355 -389 -92 -314 -522
3907 -522 -272 -363 -92 123 80 56 205 91 183 125 164 282 139 57 140 130 -108 -255 -174 -191 -308 -370 -278 -258 -262
3932 -262 167 -54 20 124 24 89 292 25 276 129 147 49 57 80 -28 -254 -370 -266 -375 -398 -54 -3 -20
3955 -20 33 99 79 -81 171 99 -17 219 273 -26 138 66 10 82 -196 -229 -190 -302 -163 -367 92 58 210 -69
3979 -69 60 179 50 86 266 119 301 244 254 68 -165 -7 -43 -172 -186 -225 -323 -119 -244 -409 8 -8 68
4002 68 102 -181 298 216 192 121 95 118 -36 43 30 -299 -526 -230 -240 -76 -352 -245 57 -242 10 -91 33
4025 33 131 165 194 54 222 138 179 169 -42 -118 -149 23 -66 -252 -134 -73 -204 -136 -16 54 120 254 -32 213 259
4050 259 257 111 204 -15 130 90 14 -122 -184 -174 -294 -243 -61 -136 12 37 -255 -239 109 18 146 155 112 308 349
4075 349 -25 -28 112 109 40 -279 51 -78 -129 -103 73 -33 -38 149 9 -56 259 57 229 161 18 201 150 20
4099 20 -228 -144 -100 81 -331 -85 -5 -85 -26 -255 -245 -70 37 21 -20 -33 140 128 -38 3 118 147 114 -55 -153
4124 -153 -137 -99 -163 -139 -58 10 -218 -64 -61 -53 18 211 79 108 281 227 151 163 354 -60 -289 129 -99 -272 -151
4149 -151 -201 -193 -121 -98 -90 25 -45 -326 163 158 345 199 120 276 157 197 58 6 62 53 134 142 -274 -160 190 -239
4175 -239 -2 77 76 -154 6 -90 -63 -71 295 -22 173 204 -106 68 -18 -39 -223 -204 -120 -121 -143 -100 169 -175 37
4200 37 -79 -61 -101 196 -96 -67 97 84 31 16 86 -19 -82 -11 118 -1 7 -272 -230 -77 -111 61 71 191 22
4225 22 39 90 -27 157 113 -159 -52 74 43 42 119 -137 -178 -146 -18 -164 -34 -345 -111 61 155 124 150 -39
4249 -39 70 57 244 -14 263 213 248 -18 -11 45 -179 -47 -192 13 -79 -42 -108 116 -36 -145 144 42 84 11
4273 11 92 218 -47 75 28 99 73 18 -76 -123 73 -182 -257 27 44 -128 -95 125 -60 205 -49 116 -33 -42
4297 -42 186 28 369 103 -57 14 111 -6 -30 -205 -155 -181 -52 141 105 35 -99 127 -46 247 98 59 73
4320 73 94 127 66 5 263 -70 -161 15 54 -290 -225 49 -265 17 -159 -1 -236 66 87 167 75 218 110 41
4344 41 -48 34 -70 -60 21 76 -19 -195 -111 38 80 -242 -60 -71 138 -57 63 85 94 -97 129 112 122 -262 166
4369 166 6 -42 40 -235 15 -162 -252 -72 -28 -50 130 77 180 97 47 50 46 265 -83 31 -21 -83 -71 -200 101
4394 101 -244 -117 85 -153 -29 -74 39 47 -111 -52 111 114 -90 103 10 141 -151 -17 113 155 -128 -193 6
4417 6 -123 26 -32 -92 -56 -8 232 49 -15 133 232 -22 -45 83 85 67 -189 -25 149 -143 66 -51 -102 54
4441 54 -105 -105 -16 143 -70 -45 -100 -24 -102 -113 169 -140 86 168 176 147 71 155 33 -113 -235 -50 -194 -122 64
4466 64 -54 -189 35 13 49 -29 102 84 106 -4 -126 96 213 75 126 41 298 85 -82 -103 -81 101 279
4489 279 -90 -32 121 -101 -74 281 157 -56 -28 21 -4 -193 -107 -70 -202 -137 -120 -171 30 -80 -115 190 -18 -16
4513 -16 -79 70 262 -84 -11 18 -30 145 130 111 -76 -161 -109 -197 106 -178 -18 -235 -75 -114 56 149 120 181 67
4538 67 -40 -163 -112 -153 15 61 102 180 83 -126 13 -169 -121 48 -103 -62 186 134 167 41 -108 -58 107 -28
4562 -28 -121 287 -8 -144 11 -67 85 94 -192 -144 -30 -154 -63 -15 60 -18 32 66 51 140 -93 -97 -134 -94 -18 -193
4588 -193 13 28 -118 246 26 84 65 -148 63 60 -32 195 31 107 167 -88 -50 29 126 64 81 22 55 -262 -130
4613 -130 84 -4 4 106 -11 63 -54 177 124 -101 -58 -50 -61 101 -111 95 -93 55 121 30 -67 -60 67 168 74
4638 74 121 -17 -86 111 131 14 -58 -50 93 69 -24 -55 164 -36 -11 -43 -208 -15 -85 -246 -78 210 -141 -144 -50
4663 -50 -166 105 90 13 -55 228 16 -184 105 72 -125 98 17 -99 161 -12 27 5 198 116 -22 59 -151
4686 -151 60 248 -118 95 24 12 -93 133 -137 152 10 81 39 105 -4 37 -60 -226 137 36 86 -36 -78
4709 -78 55 -104 29 39 -41 10 11 -80 -52 -179 52 -127 -53 87 57 40 -28 -29 -35 5 91 -19 -185 -44 195 74
4735 74 51 -7 -50 -61 -281 100 72 -89 -40 -149 -159 29 155 -86 379 -2 202 54 -83 14 139 203 -140
4758 -140 -53 -125 -109 -189 8 -116 61 -20 57 -152 -11 41 48 105 111 55 53 66 -66 -97 8 97 -76 -23 49 16 -24
4785 -24 -23 -19 19 133 -16 -145 -26 -12 12 79 -197 74 6 124 -9 -26 107 211 -38 93 -124 -98 142 -115
4809 -115 -7 -80 -168 42 97 -34 3 -69 -39 -3 -14 -96 22 -209 54 -101 -216 9 44 -91 65 144 -92 38
4833 38 -34 -56 -45 -117 -15 91 12 -90 -12 115 205 -104 125 8 -49 -42 13 -141 166 46 11 -20 64 -13 17 -217
4859 -217 91 -47 138 101 224 -48 11 165 265 95 -202 90 94 -205 -105 25 -138 -23 79 7 -143 30
4881 30 -58 -40 184 171 38 -162 29 100 -64 -104 147 -78 -104 156 -8 -170 -28 45 -17 171 65 -176 -41
4904 -41 28 -81 20 -14 21 79 -77 79 -39 65 45 -24 187 82 -138 -22 -85 -249 13 109 -181 92 101 -12
4928 -12 94 -32 8 128 104 -102 -61 216 -161 -122 141 14 52 -164 -136 81 -41 83 15 73 -135 -43 207
4951 207 -124 47 33 102 -30 -133 -122 115 1 -22 97 131 -114 84 79 18 -200 142 170 40 -77 -13 162
4974 162 201 55 117 55 62 -55 154 91 62 -97 48 182 -79 56 -22 -15 199 -59 37 202 -60 88 -55 -36
4998 -36 115 187 4 82 129 -168 5 194 -54 -139 -89 -2 -292 27 76 123 83 252 -66 -4 -83 -19 68 115 130
5023 130 -23 100 -109 -17 53 41 -215 -36 -63 -98 157 -53 -82 108 57 66 107 -107 -188 -70 3 -6 137 -36 -79
5048 -79 -141 -147 60 142 -70 -17 -142 -34 147 -14 172 77 33 82 153 53 -28 39 -116 312 -172 -67 82 39
5072 39 115 -99 64 -239 -414 -112 -203 37 -51 -167 -106 -85 143 58 120 161 112 208 152 -37 3 54 -12 109 -142
5097 -142 -97 13 57 -13 -24 -86 135 13 124 91 -28 -143 268 121 -15 53 1 -33 -50 -65 -195 24 31 -146
5121 -146 77 21 -9 -228 -25 178 56 151 90 100 176 146 -128 -133 -37 173 -6 80 98 -146 -117 78 -51 -161
5145 -161 -212 56 74 1 -134 -208 122 128 31 -72 -25 103 -12 8 10 -20 -5 -194 83 -152 -158 100 -121 43 65
5170 65 18 60 -82 -31 202 -87 -69 150 -139 -168 290 49 -1 -54 26 -76 62 27 227 -75 105 74 5 -65
5194 -65 -133 -82 -59 147 -126 -74 111 -90 177 22 -145 -16 115 -46 37 21 110 15 35 -6 1 259 80 -123
5218 -123 81 81 52 74 -107 119 85 -18 -41 35 11 -109 26 -193 -166 56 -132 81 97 -159 16 -126 34
5241 34 186 41 -231 -54 -106 -82 -126 329 -45 -62 -4 -86 -168 -70 -109 -19 -62 -108 39 -14 -36 239 -42 51 135 101
5267 101 98 -67 -101 47 -16 -37 -51 44 -158 -269 -35 -141 -152 -138 83 -76 205 -181 -39 72 -19 83 31 241
5291 241 144 -10 -110 55 22 -141 67 6 44 -159 -35 155 78 -267 56 26 150 147 -2 8 8 135 -59 106
5315 106 -110 -191 -31 54 -51 96 127 -108 -107 64 87 -64 125 104 119 203 -59 37 152 235 189 106 121 -91 -47
5340 -47 -126 -207 -121 -22 -93 -285 -50 18 -11 43 -48 115 77 15 55 60 -135 78 100 -130 -21 -52 -5 136 4 173
5366 173 30 -259 -67 -56 63 64 1 -189 -95 126 -101 56 12 -45 44 98 -49 22 -59 97 -51 -236 -68 -247
5390 -247 -89 -174 -149 79 6 53 109 83 200 157 97 45 4 24 61 98 -242 -305 -103 -106 40 -250 -84 69 46 29
5416 29 52 -28 78 -43 23 -61 -3 54 -112 37 87 128 86 26 28 -87 -50 -87 -175 16 52 -152 69 -18 151 144 -114
5443 -114 1 -136 51 51 167 -146 -242 -10 -118 -89 -134 -45 -13 -19 -136 -163 -161 -76 -2 106 136 81 164 -31 111 57
5469 57 -66 39 -106 -84 -30 -119 126 -19 -3 89 99 -15 -134 18 -133 191 -25 -45 49 206 -107 -55 -32 -47
5493 -47 -89 46 -264 124 18 -66 106 -177 -102 216 28 -1 -47 43 126 -145 28 36 107 86 121 -142 76 -163
5517 -163 -43 70 -69 -46 -125 48 -91 -3 -21 -25 -25 29 -161 29 229 64 52 58 253 -5 17 30 -124 -124 -11
5542 -11 -66 -119 -154 6 -167 85 197 84 44 -39 -67 205 232 103 54 33 -96 -7 -106 126 -58 -9 128 -9
5566 -9 -37 -148 -18 -163 224 125 35 -60 68 180 55 75 -33 11 246 5 -119 -99 -111 -61 -53 -4 115 138 -21
5591 -21 -138 -17 78 53 99 -47 72 57 -64 -34 150 105 -112 -82 -132 -74 -26 -188 -240 -191 187 -224 -77 101
5615 101 37 202 64 -16 131 3 130 103 150 184 -8 -8 -7 25 -15 -74 -163 -88 84 -40 -26 -65 -110 -131 38 179
5641 179 -21 -12 -127 152 -47 40 34 -56 -43 68 -17 78 -175 -205 -58 -102 -48 -92 8 -193 53 33 -252 73 66
5666 66 35 29 -172 -21 15 91 -14 182 -179 -210 25 -72 -291 -206 -109 18 -229 88 233 2 117 114 216 146
5690 146 231 64 -7 53 -17 -63 -24 -1 -176 110 -158 -3 71 -59 3 -160 20 -12 -224 26 -126 -187 -10 -80
5714 -80 58 -29 -10 -48 -4 -23 -32 -85 -116 -88 -109 38 -54 -213 -136 18 -41 151 79 126 114 7 229 108 34 -99
5740 -99 -42 -62 90 -149 -149 -71 -46 -110 114 75 200 222 -36 76 -45 168 -7 157 71 -325 -156 -107 -198 -205 -26
5765 -26 86 -2 93 21 2 32 -45 -97 39 7 4 140 90 -60 133 -196 -186 166 23 87 148 167 41 -97 12
5790 12 133 -42 -132 48 115 94 16 -146 107 12 68 -1 5 -3 46 61 -56 71 -179 101 -228 -246 -57 -55 -253 66
5816 66 -149 87 86 -6 -53 164 127 97 111 65 63 92 -60 105 -100 65 144 -113 6 -41 160 137 -12 72 292
5841 292 -96 125 -25 -14 95 -64 34 -29 -21 -104 62 -10 -251 -69 -107 -283 -102 138 54 -26 -130 90 41 117
5865 117 227 99 112 107 94 -73 63 -238 -296 -13 -17 -185 -43 66 -64 -82 -283 -96 47 23 113 95 12 -10
5889 -10 -95 43 -119 -114 -29 -50 77 -2 -9 161 30 -115 -163 8 98 47 9 -35 -22 -176 13 64 46 -59 -77 80
5915 80 40 136 32 -262 -108 -121 13 -89 196 285 -129 -133 -26 191 63 35 115 -25 1 132 68 138 62 118 -143
5940 -143 -151 -210 -73 -14 31 49 -109 23 20 -54 -171 34 -87 98 124 -37 -15 185 4 -18 58 133 192 90 71
5965 71 -106 -46 41 117 78 -73 -159 143 -11 116 70 -75 48 216 59 215 -68 -41 136 -192 -9 -101 -173
5988 -173 -156 61 -38 -210 -225 -58 0 15 -51 3 -261 69 81 196 37 43 88 16 167 67 -65 -10 -73 27 -148
6013 -148 -154 54 13 84 -17 128 -57 100 -9 173 -44 -31 12 44 11 -318 77 -110 -71 38 -32 -11 -7 5 -5
6038 -5 74 -98 23 288 123 -101 22 -25 38 168 39 -42 23 -98 -28 -51 -55 44 -56 94 98 95 10 94 -69 54
6064 54 -139 113 -2 31 -129 29 0 87 69 -64 -81 166 127 17 76 -110 -14 -43 -91 73 100 -146 18 -104
6088 -104 116 -48 72 387 20 26 22 -20 57 -34 -93 -94 11 49 -103 -119 -178 -115 10 91 79 -127 21 107 -29 174
6114 174 21 40 -52 56 -65 53 -120 -99 -86 -123 -93 -127 37 -87 152 -160 -48 233 -22 178 -28 25 -117
6137 -117 -144 78 146 -108 96 77 8 69 -213 119 115 34 -186 -283 -96 79 116 113 55 -17 298 -86 160 73 76 -134
6163 -134 -193 -65 -8 -26 -184 -128 -128 -21 82 -57 -89 -31 118 64 -206 -23 21 -79 157 126 16 -33 -71 239
6187 239 -54 140 -258 124 67 -25 90 41 -85 -10 45 50 233 4 71 13 2 -318 -187 22 0 5 -20 -191 -14
6212 -14 -192 158 -18 20 -84 86 8 36 35 63 137 -3 -184 17 125 -144 195 -132 -8 -8 -51 -207 0 -300
6236 -300 -35 -68 -68 23 99 33 43 17 -95 281 74 71 -146 152 39 47 -20 -159 37 60 -148 -183 42 -119 -8
6261 -8 -88 22 -108 -34 -82 -143 -11 32 104 -17 3 64 -250 -8 -84 -110 -70 -144 -36 -126 -159 -79 -6 -47 184 103 78
6288 78 9 -243 -5 82 214 -226 -132 172 -153 -17 34 145 374 97 -192 38 -94 -4 27 -91 22 82 110
6311 110 -25 84 -63 -63 121 31 -103 -4 -57 -148 54 -125 -145 127 59 -72 4 -13 83 128 -52 2 147 -34
6335 -34 -113 -30 -26 -10 -9 222 59 195 94 -2 -171 22 -77 23 13 -150 37 87 -171 132 134 -54 138 72 -207
6360 -207 -80 194 152 -83 86 -135 -105 49 -249 -269 46 -313 -145 -119 29 105 -32 -85 -46 -30 -208 -132 -131 -57
6384 -57 240 176 -79 -51 -282 -83 62 229 -44 24 -128 76 73 -98 -6 42 -34 121 -103 171 6 -39 -44 31
6408 31 119 -68 -176 -99 35 54 9 -56 69 -196 67 80 18 -5 81 -60 63 6 47 51 -134 30 29 34 -186 -40
6434 -40 -225 19 -111 58 -80 35 75 71 84 2 26 66 -117 102 104 59 -185 -101 -49 17 52 -187 -26 67 30 -118
6460 -118 -173 60 -24 -106 -17 -1 220 40 55 -27 -69 100 -164 -3 -146 -127 -228 -17 -1 22 199 -140 -184 -285
6484 -285 -6 -20 -72 166 212 -109 -164 -54 -76 -71 -118 -21 145 282 32 -149 -73 -167 -49 -53 -58 230 -104 -34 4 -19
6510 -19 -61 75 59 -26 -139 72 153 22 174 -183 -64 -31 -137 -183 -109 -146 31 138 -146 1 -91 32 36 16
6534 16 73 -10 106 51 66 -83 34 -35 -58 218 -281 -165 49 65 -92 225 -70 -137 131 99 -113 -327 128
6557 128 158 33 108 25 -152 -77 -34 34 -183 64 -167 21 -81 32 -12 -2 -137 -82 -113 -47 111 -213 34 -92
6581 -92 114 10 66 -36 56 -219 -276 79 60 112 -97 -47 153 -39 -134 8 -22 69 152 98 -14 113 97 -41
6605 -41 151 -5 -90 -110 46 39 -276 -72 52 -91 -219 -65 -109 -47 -139 -41 -38 -36 67 -1 -62 -124 114 188 -199 22
6631 22 -31 90 124 4 -88 -139 52 -40 34 -159 -37 22 70 12 -182 164 24 55 43 1 -51 -81 -147 -151 -20 -62
6657 -62 54 -91 -66 -87 -174 -95 24 38 83 -100 -61 42 23 -34 -112 -1 1 52 -7 -12 77 61 -166 -145 -59 -39 -269
6684 -269 26 26 21 274 152 53 -8 78 -131 -44 15 -88 -293 25 -42 97 -75 -81 -155 74 -73 -29 -80 28 102
6709 102 -72 113 37 11 -3 64 -183 39 -44 -25 -191 -93 -69 67 -93 138 101 -28 -185 -101 157 -73 266
6732 266 236 26 -28 299 -94 4 -175 -20 94 -92 -45 -30 -14 28 217 100 33 -66 -75 -147 50 -206 107 -19
6756 -19 42 102 -74 188 -185 -192 193 144 -133 93 99 -136 -86 -213 6 -49 -131 -15 -94 103 46 11 -193 55 14
6781 14 26 -125 74 -32 -22 30 58 -161 -36 -86 -34 29 -60 144 -78 35 -94 -32 140 -6 17 -1 217 170
6805 170 98 -76 -38 -9 -44 -35 -21 92 -206 -14 -67 83 -147 12 -81 75 132 218 -47 120 60 -51 83 -11
6829 -11 -64 91 118 -143 -76 -188 158 -162 114 -31 158 -83 143 -97 10 -161 233 130 -31 97 -93
6850 -93 235 148 -62 -86 40 -79 -17 -120 112 113 -28 -173 146 -27 -38 -81 96 16 127 -18 72 109 6 195
6874 195 178 141 -116 -81 -34 -3 77 -195 -13 -1 9 -25 137 10 -211 184 -55 186 19 -175 193 -60 110
6897 110 -151 -39 -73 -82 21 -116 -23 52 -7 127 250 -54 252 -26 56 117 305 97 56 24 179 -107 24
6920 24 80 225 47 -114 125 -41 -46 -127 22 -78 78 39 -18 6 -130 0 188 -178 140 166 100 236 -56
6943 -56 -31 -135 3 -127 41 53 -45 154 -130 -298 75 -37 77 -50 138 170 -67 64 91 -60 125 -97
6965 -97 145 -40 -89 216 -50 -19 -186 17 -2 61 66 261 -93 -49 148 -169 -63 288 242 155 -7 -29 -180 -38
6989 -38 97 -12 -92 51 151 218 -155 44 83 -68 247 72 34 -167 -82 298 117 -3 -242 18 -176 260
7011 260 -104 -127 26 -134 -15 7 -208 130 130 -10 113 43 -148 270 51 80 -69 156 -58 -11 55 -92 -21
7034 -21 23 19 -247 -240 -91 4 121 72 53 305 20 38 -4 192 124 86 30 -253 119 143 -93 2 -81 -28 50 -43 -128
7061 -128 19 -112 -43 13 -105 -61 -11 13 -34 53 -29 -138 -195 -9 -23 -123 -95 39 8 118 62 12 -91 83 -18
7086 -18 -172 44 120 5 194 227 -89 -139 47 80 -107 162 20 16 -5 -165 -107 -20 -7 -3 -219 146 163 -7 -20
7111 -20 -17 36 -89 12 98 -42 -59 84 176 -178 -93 -200 -47 -6 -264 -110 -147 9 82 -28 264 85 202 -108
7135 -108 380 66 -56 -204 -110 70 -115 -22 -148 -1 123 186 -42 60 175 -124 -42 34 -55 133 225 -91
7157 -91 179 85 -102 156 -18 -74 34 -6 -34 -72 93 124 37 -434 -2 -185 -92 -138 -110 276 108 -27 -29 -185
7181 -185 194 -26 -38 -14 116 0 96 -47 137 36 16 -144 -93 -3 16 -125 -173 -94 3 63 81 61 170 -4
7205 -4 -93 -80 39 -94 24 -79 -190 59 44 7 338 -8 -178 73 -111 -64 -171 -35 118 157 12 55 162
7228 162 56 142 276 13 121 -205 0 54 -22 -23 -55 -21 94 15 -54 179 1 31 -64 72 117 -166 -9 127
7252 127 -112 148 106 -110 9 43 181 -66 15 132 -93 44 26 41 -130 88 -95 -32 153 -34 34 3 -185
7275 -185 24 9 171 -84 187 29 -43 84 118 77 27 -128 7 112 56 -76 71 25 -14 88 224 -47 -181
7298 -181 -45 0 -152 -60 -97 -26 66 -288 31 -29 -273 99 159 -106 269 195 6 -42 -3 -30 -47 197 48 -147
7322 -147 168 -35 77 -145 -111 229 -93 29 98 69 -73 79 -52 218 109 70 -98 8 -69 -62 -36 34 -72
7345 -72 -66 -102 56 -212 -68 -83 51 -48 -181 -94 104 277 155 -241 -90 105 44 130 -137 33 3 -77 -31 -114
7369 -114 -52 142 -175 -301 72 15 -11 -185 -62 298 -199 107 -21 2 371 -73 -2 262 128 -17 -122 -100
7391 -100 -157 -34 -12 -183 96 100 93 -179 145 -50 29 -24 -56 10 -200 16 120 -129 -75 276 -96 -7 -150 -188
7415 -188 33 -130 -212 176 329 12 64 71 172 7 73 -40 289 18 -76 79 -263 30 -151 -57 0 -3 50 -36
7439 -36 -3 8 62 152 -169 -286 -28 -37 -135 159 -154 106 -104 -117 -88 -9 -196 10 -48 6 -34 -65 -48 -345 57
7464 57 57 -70 -47 51 -134 0 -159 -104 91 167 -123 35 182 57 -160 46 -246 -107 -12 -133 12 -233 -110
7487 -110 -67 94 -194 52 83 112 6 20 63 -7 -63 7 35 -85 112 34 -21 -26 125 11 88 258 -2 91 -112
7512 -112 89 -23 85 -17 -42 91 -188 -23 -77 114 113 36 -62 117 62 3 -58 -12 143 113 95 106 -102 -105 41
7537 41 -82 -104 -36 -55 49 154 406 117 17 63 -312 35 -59 126 -45 -234 125 24 18 40 54 -168 138
7560 138 -36 191 16 -87 93 62 -109 -77 -115 -129 28 0 -154 86 -47 -9 -112 131 34 88 116 120 76 103
7584 103 73 79 82 20 -128 87 71 2 14 175 -52 253 10 12 -10 149 -68 39 32 134 73 102 338 13 36 4
7610 4 8 -71 -68 8 -46 -106 -9 -127 -178 86 63 115 50 -61 88 165 201 57 18 -151 -138 -175 -41 -17 11 206 -48
7637 -48 -30 -38 155 -59 -191 30 12 -39 -89 131 -150 46 92 -248 -96 35 -224 -68 26 19 98 -110 -63 68
7661 68 -65 158 135 -55 4 -35 -110 -15 -13 29 54 252 119 -83 7 46 26 -50 -101 6 -178 -34 -96 -82 118 132
7687 132 60 173 -65 179 -1 114 39 95 -25 185 -18 -29 -60 260 38 -111 17 66 -13 -80 117 -53 -95
7710 -95 -55 -2 92 -95 63 170 9 -95 32 -38 10 1 -325 -24 -6 -93 107 -20 -4 -82 -107 -77 -103 8 29
7735 29 -58 -67 78 23 -82 -150 -34 -8 106 99 124 41 -17 -25 -11 -62 -40 9 128 -125 -111 114 13 38 -18 44 -69
7762 -69 -47 -98 -29 108 -52 -87 -52 99 -119 186 23 -70 -69 23 25 104 90 43 -27 190 61 -106 -63 128 111 -70
7788 -70 -175 -132 -7 -3 30 -8 36 -1 -91 -14 103 -8 -80 -19 -134 76 -52 -29 42 190 90 150 -26 168 -133
7813 -133 -8 -170 63 -18 -195 -37 -62 -2 12 49 70 -56 82 139 -31 68 -19 114 -29 69 3 145 40 -80
7837 -80 121 -109 15 -27 126 12 -35 11 -15 -92 21 -66 186 85 -25 58 -69 133 34 89 16 -19 -82 27
7861 27 -155 -99 9 -9 -57 -14 133 94 127 -99 180 -86 27 102 -21 15 6 -106 35 34 -196 -173 -30 -104 -33
7886 -33 -100 72 -49 -15 24 -4 13 2 -46 -173 65 -1 -19 -22 52 110 -103 -169 0 -95 37 52 -147 -50 -18 175
7912 175 59 17 -104 -86 66 -115 -73 -262 -126 74 -40 -128 64 -109 162 -202 -177 -107 -80 -113 123 144 300
7935 300 -46 -46 56 -127 63 40 28 18 -64 76 -200 -269 144 -49 0 -90 -35 30 -75 -133 -100 228 -5 122
7959 122 -32 12 -72 87 224 68 47 -67 112 50 10 -103 -56 -42 -43 -17 -81 76 115 -124 174 225 34 -119
7983 -119 -15 82 249 -69 -24 -139 42 -41 78 -71 -43 -94 284 -10 -34 -78 104 -1 -5 126 92 61 101 184
8007 184 95 -4 62 -112 52 -124 177 -25 -83 -120 -229 -60 -6 18 69 -15 47 -28 -97 -138 55 119 195 -220 114
8032 114 115 -71 88 -254 6 60 -13 -103 -228 113 -192 -165 28 241 -149 -91 122 74 136 78 105 2 -11 -46
8056 -46 -17 185 -229 -125 94 15 -234 106 -62 -136 112 22 -53 -59 72 -194 98 -84 -84 293 106 -151 -227 -35
8080 -35 -71 -215 33 -70 -247 57 168 107 96 204 246 -25 -31 -93 -66 115 95 177 -20 -203 -22 -172 -55 -91
8104 -91 -200 4 177 -51 -53 42 147 -21 162 -34 26 162 171 -32 112 41 -50 136 -103 -77 -55 111 -43 -146
8128 -146 -194 -125 -95 -24 14 8 26 79 -25 43 146 -31 -14 151 144 -28 -59 29 -18 -87 -91 -127 4 85 105 11 92 -59
8156 -59 126 1 39 -118 -61 54 -64 102 94 119 -82 233 -309 -173 60 145 -8 -22 70 29 -92 113 -146
8179 -146 161 -139 43 26 40 256 28 -32 -222 -98 82 69
8191F9
##END NTUPLES=NMR FID
##END=
