##TITLE=1H_Pr 53-490
 CDCl3
 8 sc, 
 25.10.2022
##JCAMPDX= 6.0         $$ Bruker NMR JCAMP-DX V2.0
##DATA TYPE= NMR FID
##DATA CLASS= NTUPLES
##ORIGIN= UXNMR, Bruker Analytische Messtechnik GmbH
##OWNER= root
$$ XWIN-NMR		Version 3.5
$$ Tue Oct 25 15:28:31 2022 Russian Standard Time (UT+4h)  she@DPX200
##.OBSERVE FREQUENCY= 200.1313499994
##.OBSERVE NUCLEUS= ^1H
##.DELAY= (6, 6)
##.ACQUISITION MODE= SIMULTANEOUS
##.ACQUISITION SCHEME= undefined
##.AVERAGES= 8
##.DIGITISER RES= 18
##SPECTROMETER/DATA SYSTEM= spect
##.PULSE SEQUENCE= zg30
##.SOLVENT NAME= CDCl3
##.SHIFT REFERENCE= (INTERNAL, CDCl3, 0, 15.7039)
##AUDIT TRAIL= $$ (NUMBER, WHEN, WHO, WHERE, WHAT)
$$ ##TITLE= Audit trail, XWIN-NMR		Version 3.5
$$ ##JCAMPDX= 5.01
$$ ##ORIGIN= Bruker BioSpin GmbH
$$ ##OWNER= she
$$ F:/spectra/data/she/nmr/H-F/1/audita.txt
$$ ##AUDIT TRAIL=  $$ (NUMBER, WHEN, WHO, WHERE, WHAT)
(   1,<2022-10-25 15:27:33.54 +0400>,<she>,<DPX200>,
      <created by zg, POWCHK disabled, PULCHK disabled
       configuration hash MD5:
       00 E9 B6 7A A2 85 ED C7 34 08 36 98 17 FE 4E 26
       data hash MD5: 16K
       E1 50 DC 45 BB B4 23 2F B5 0D 40 C4 00 3B AA 15>)
$$ ##END=
$$ 
$$ hash MD5
$$ 42 3E 7E FE 1F 38 E5 14 BC CE 0A FA 6F 70 06 0E
##$RELAX= 
##$RELAX= 
##$RELAX= 
##$RELAX= 
##$RELAX= 
##$RELAX= 
$$ Bruker specific parameters
$$ --------------------------
##$DU= <F:/spectra>
##$EXPNO= 1
##$NAME= <H-F>
##$PROCNO= 1
##$TYPE= <nmr>
##$USER= <she>
##$AMP= (0..31)
100 100 100 100 100 100 100 100 100 100 100 100 100 100 100 100 100 100 
100 100 100 100 100 100 100 100 100 100 100 100 100 100 
##$AQSEQ= 0
##$AQ_mod= 1
##$AUNM= <au_zg>
##$AUTOPOS= <>
##$BF1= 200.13
##$BF2= 200.13
##$BF3= 200.13
##$BF4= 200.13
##$BF5= 200.13
##$BF6= 200.13
##$BF7= 200.13
##$BF8= 200.13
##$BYTORDA= 1
##$CFDGTYP= 0
##$CFRGTYP= 5
##$CHEMSTR= <none>
##$CNST= (0..31)
1 1 145 1 1 1 1 1 1 1 1 1 1 1 1 1 1 1 1 1 1 1 1 1 1 1 1 1 1 1 1 1 
##$CPDPRG= <>
##$CPDPRG1= <>
##$CPDPRG2= <>
##$CPDPRG3= <>
##$CPDPRG4= <mlev>
##$CPDPRG5= <mlev>
##$CPDPRG6= <mlev>
##$CPDPRG7= <mlev>
##$CPDPRG8= <mlev>
##$CPDPRGB= <>
##$CPDPRGT= <>
##$D= (0..31)
0 1.2 0 0 0 0 0 0 0 0.06 0 0.03 0 0 0 0 0.0002 0 0 0 0 0 0 0 0 0 0 0 0 
0 0 0 
##$DATE= 1666697252
##$DBL= (0..7)
120 120 120 120 120 120 120 120 
##$DBP= (0..7)
150 150 150 150 150 150 150 150 
##$DBP07= 0
##$DBPNAM0= <>
##$DBPNAM1= <>
##$DBPNAM2= <>
##$DBPNAM3= <>
##$DBPNAM4= <>
##$DBPNAM5= <>
##$DBPNAM6= <>
##$DBPNAM7= <>
##$DBPOAL= (0..7)
0.5 0.5 0.5 0.5 0.5 0.5 0.5 0.5 
##$DBPOFFS= (0..7)
0 0 0 0 0 0 0 0 
##$DE= 6
##$DECBNUC= <off>
##$DECIM= 32
##$DECNUC= <off>
##$DECSTAT= 4
##$DIGMOD= 1
##$DIGTYP= 9
##$DL= (0..7)
0 120 120 120 120 120 120 120 
##$DP= (0..7)
150 150 150 150 150 150 150 150 
##$DP07= 0
##$DPNAME0= <>
##$DPNAME1= <>
##$DPNAME2= <>
##$DPNAME3= <>
##$DPNAME4= <>
##$DPNAME5= <>
##$DPNAME6= <>
##$DPNAME7= <>
##$DPOAL= (0..7)
0.5 0.5 0.5 0.5 0.5 0.5 0.5 0.5 
##$DPOFFS= (0..7)
0 0 0 0 0 0 0 0 
##$DQDMODE= 0
##$DR= 18
##$DS= 0
##$DSLIST= <SSSSSSSSSSSSSSS>
$$ [...]
##$SUBNAM2= <"">
##$SUBNAM3= <"">
##$SUBNAM4= <"">
##$SUBNAM5= <"">
##$SUBNAM6= <"">
##$SUBNAM7= <"">
##$SUBNAM8= <"">
##$SUBNAM9= <"">
##$SW= 18.0517283424941
##$SWIBOX= (0..15)
0 0 2 0 0 0 0 0 0 0 0 0 0 0 0 0 
##$SW_h= 3612.71676300578
##$TD= 16384
##$TD0= 1
##$TE= 0
##$TE2= 300
##$TE3= 300
##$TEG= 300
##$TL= (0..7)
0 120 120 120 120 120 120 120 
##$TP= (0..7)
150 150 150 150 150 150 150 150 
##$TP07= 0
##$TPNAME0= <>
##$TPNAME1= <>
##$TPNAME2= <>
##$TPNAME3= <>
##$TPNAME4= <>
##$TPNAME5= <>
##$TPNAME6= <>
##$TPNAME7= <>
##$TPOAL= (0..7)
0.5 0.5 0.5 0.5 0.5 0.5 0.5 0.5 
##$TPOFFS= (0..7)
0 0 0 0 0 0 0 0 
##$TUNHIN= 0
##$TUNHOUT= 0
##$TUNXOUT= 0
##$USERA1= <user>
##$USERA2= <user>
##$USERA3= <user>
##$USERA4= <user>
##$USERA5= <user>
##$V9= 5
##$VALIST= <valist>
##$VCLIST= <CCCCCCCCCCCCCCC>
##$VD= 0
##$VDLIST= <DDDDDDDDDDDDDDD>
##$VPLIST= <PPPPPPPPPPPPPPP>
##$VTLIST= <TTTTTTTTTTTTTTT>
##$WBST= 1024
##$WBSW= 4
##$XGAIN= (0..3)
0 0 0 0 
##$XL= 0
##$YL= 0
##$YMAX_a= 88693
##$YMIN_a= -107255
##$ZGOPTNS= <>
##$ZL1= 120
##$ZL2= 120
##$ZL3= 120
##$ZL4= 120
##$ABSF1= 10
##$ABSF2= 0
##$ABSG= 5
##$ABSL= 3
##$ALPHA= 0
##$AQORDER= 0
##$ASSFAC= 0
##$ASSFACI= 0
##$ASSFACX= 0
##$ASSWID= 0
##$AUNMP= <proc_1d>
##$AZFE= 0.1
##$AZFW= 0.1
##$BCFW= 1
##$BC_mod= 2
##$BYTORDP= 1
##$COROFFS= 0
##$CY= 11.3945322036743
##$DATMOD= 1
##$DC= 2
##$DFILT= <>
##$DTYPP= 0
##$F1P= 2.36226072786647
##$F2P= -0.459571619588291
##$FCOR= 0.5
##$FTSIZE= 0
##$FT_mod= 4
##$GAMMA= 1
##$GB= 0.15
##$INTBC= 1
##$INTSCL= 1
##$ISEN= 128
##$LB= 0.24
##$LEV0= 0
##$LPBIN= 0
##$MAXI= 10000
##$MC2= 0
##$MEAN= 0
##$ME_mod= 0
##$MI= 1.114404
##$NCOEF= 0
##$NC_proc= 0
##$NLEV= 6
##$NOISF1= 3.799351
##$NOISF2= 2.8
##$NSP= 1
##$NTH_PI= 0
##$NZP= 0
##$OFFSET= 15.70392
##$PC= 1
##$PHC0= -18033.65
##$PHC1= 12.0007
##$PH_mod= 1
##$PKNL= yes
##$PPARMOD= 0
##$PSCAL= 0
##$PSIGN= 0
##$REVERSE= no
##$SF= 200.130013532006
##$SI= 16384
##$SIGF1= 3
##$SIGF2= 2
##$SINO= 400
##$SIOLD= 16384
##$SREGLST= <1H.CDCl3>
##$SSB= 0
##$STSI= 0
##$STSR= 0
##$SW_p= 3612.71676300578
##$SYMM= 0
##$S_DEV= 0
##$TDeff= 0
##$TDoff= 0
##$TI= <>
##$TILT= no
##$TM1= 0
##$TM2= 0
##$TOPLEV= 0
##$USERP1= <user>
##$USERP2= <user>
##$USERP3= <user>
##$USERP4= <user>
##$USERP5= <user>
##$WDW= 1
##$XDIM= 8192
##$YMAX_p= 0
##$YMIN_p= 0
$$ End of Bruker specific parameters
$$ ---------------------------------
##NTUPLES= NMR FID
##VAR_NAME=  TIME,          FID/REAL,        FID/IMAG
##SYMBOL=    X,             R,               I
##VAR_TYPE=  INDEPENDENT,   DEPENDENT,       DEPENDENT
##VAR_FORM=  AFFN,          ASDF,            ASDF
##VAR_DIM=   8192,          8192,            8192
##UNITS=     SECONDS,       ARBITRARY UNITS, ARBITRARY UNITS
##FACTOR=    0.0002768,     1,               1
##FIRST=     0,             0,               0
##LAST=      2.2672688,     0,               0
##MIN=       0,             -107255,         0
##MAX=       2.2672688,     88693,           0
$$ Real data points
##PAGE= N=1
##DATA TABLE= (X++(R..R)), XYDATA
$$ [...]
1817A98P3mL45l16j80K90j24l63ql5J53m06J9K51l42P4K92k48j08L38J64k27k93
1840d57L40K25j35K72O0J13m10K21J91J53l34J61L50o25n2L26k01l31J63p8j31
1861a79l2j18K13R3n57K03J51k72J17L13l4O0J18j59J88p9RK48k9o4J08R6r2J69
1885D71q4k54N9%j28k60J08K11j53j43p4J38Q3l38j10L29l8l95K74K80k97K02
1907a19J61N9j47J83M11l06j77kN39k04k99k01L47K05l58q4J06N4k83l16K06Q0
1929a45j00k9j22P7J76p5N5jj34R5L66J04k01j36L98J70m40K43J48j08j13j49
1951G9PL00m96j40M31k41l12J78L59m86k19k0L45M7k82M8L38Qj19J85M2L17j53
1974B16o0P5j01K6M92k01j19l38J99J42L7o32J46M04n4l33J19j91L1m03K34L15
$$ plain form
1817 198 271 267 612 296 116 406 282 -81 -89 -124 29 -377 -358 -107 -449 -375 -83 -331 -439 -101 63 -164 -457
1840 -457 -117 108 -27 245 305 418 8 229 420 573 239 400 750 125 73 399 198 -133 30 -48 -179
1861 -179 -211 -329 -116 -23 -580 -377 -226 -498 -381 -68 -102 -42 76 -83 105 26 35 283 254 190 298 394 302 471
1885 471 387 133 192 192 64 -196 -88 123 -30 -173 -247 -109 -26 -364 -474 -145 -183 -578 -304 -24 -321 -119
1907 -119 42 101 -46 137 548 242 65 63 602 398 99 -102 245 450 92 8 114 168 -115 -431 -225 -145
1929 -145 -245 -274 -396 -319 -143 -218 -163 -164 -298 -203 163 267 66 -70 328 498 58 301 449 341 228 79
1951 79 86 386 -110 -250 181 -60 -372 -194 165 -321 -540 -560 -215 -168 -450 -402 -64 -56 -175 10 52 369 216
1974 216 156 231 130 156 648 447 328 -10 189 331 368 -264 -118 286 232 -101 18 -173 -142 -545 -311 4
1996Dk40j74K01KJ19K15k7N7j05k73N36K32m75K62J65n22J83Q1KJ47m88L74k27
2019D9L8l24K84o9r0o0j99L01q0k50J72l1j3J36m7o9M70k21j78N74l32L67l20
2042A08L26k86j83J96J73o3j68j35K35k20j11J10O9j69k14J24J1j74j54O15k62
2063a72j21J94K64j77k3j58K57J78k93K79m5J60j14j11J65k98L1J74L9k7k94K5
2085f7l2k76P9P6q0K26j54j64J99L39m01r7L44j17j21J12N43l43O0J09j49K26
2107C12k75P9L97j34k70P5K85m25k19R7J71j58l78K87J20l97L22jl0l13M06L07
2129B58l03j27K79J00k06k11J20L32n1Q4K27k39j78K41o1nq7lj34m9l68L01k45
2152c25K40J23j74j42j5K52k74k70M60P8k86p8M02L29m53J97J90j06l1j1L19J1
$$ plain form
1996 4 -236 -410 -209 -207 -88 127 100 157 52 -221 315 547 72 334 499 -23 160 241 243 390 -98 276 49
2019 49 87 -237 47 -22 -112 -172 -371 -70 -150 -400 -228 -259 -272 -136 -183 -252 218 -3 -181 393 61 428 108
2042 108 434 148 -35 161 334 271 103 -32 203 -17 -128 -18 51 -118 -332 -208 -197 -371 -525 90 -172
2063 -172 -293 -99 165 -12 -35 -193 64 242 -51 228 183 343 229 118 283 -15 16 190 229 202 -92 -67
2085 -67 -99 -375 -296 -220 -300 -74 -228 -392 -193 146 -255 -352 -8 -125 -246 -134 409 66 126 235 86 312
2107 312 37 116 513 379 109 184 469 44 -175 -78 93 -65 -443 -156 -36 -433 -111 -112 -142 -455 -49 258
2129 258 -45 -172 107 207 1 -210 -90 242 191 275 502 263 85 326 265 260 173 170 36 -13 -381 -80 -325
2152 -325 -85 38 -136 -278 -293 -41 -315 -585 -125 -47 -333 -411 -9 320 -133 64 254 148 117 106 425 436
2174D36m61L70j57J3r0n0J25k59j59j11L02k63r4J57P5m2m0P3J61j0l01J46j5
2197a94J55K19j88j51K59K7N5J11N2P0n34J51M23k35k90m7L14j88j35M56j55n31
2219c56J4M6J76N3k33N55l30l42K31K24lj08K26J59k10j83K90P3k66K05R0j8J23
2242D16l18J59m03J32M3J37l04k95K93j92j34J91J93r4j5J20j54J12J73k3K4J85
2264B46j51O8O6k11M21n4m92K36J70k75J06N9L57m86k67O6pM5j53k2Q2k12o9L32
2288a45j47K4J38L2J05j30K7K18j45j14K53qo6L26k07l5O2J37k78R0N9j5j22k23
2312a64K53n8k71J98j99J16j04J29j20m2j8K59Jk61O4N25k88j53L33o8pJ05J32
2335C62l34J36J96l6l06N9j20J32k7j3j25Q1l37J48J24k7J10k26J39j83K24J0
$$ plain form
2174 436 -25 345 188 201 111 61 186 -73 -232 -343 -41 -304 -398 -241 -166 -208 -248 -175 -14 -24 -325 -179 -194
2197 -194 -39 180 -8 -159 100 127 182 293 345 415 -119 32 455 220 -70 -117 197 9 -126 330 175 -356
2219 -356 -342 -296 -120 -67 -300 255 -75 -417 -186 38 35 -73 153 312 102 -81 209 282 16 221 311 293 416
2242 416 98 257 -146 -14 29 166 -138 -433 -140 -332 -466 -275 -82 -176 -191 -71 -225 -113 60 37 61 246
2264 246 95 163 229 18 439 385 -107 129 299 24 130 189 546 60 -207 -141 -148 -103 -256 -278 -196 -408 -477 -145
2288 -145 -292 -268 -130 -98 7 -123 -96 122 -23 -137 116 108 42 368 161 126 188 325 47 137 196 181 59 -164
2312 -164 89 31 -240 -42 -241 -125 -229 -100 -220 -262 -280 -21 -20 -281 -217 308 20 -133 200 132 125 230 362
2335 362 28 164 360 324 18 77 -43 89 62 49 -76 5 -332 -184 -60 -87 23 -203 -64 -247 -23 -13
2357a3J63j91k1R3J90l39k3M04Q6m60M6N90k33l09J3K64l9j23j22O3j55j87J36
2380a67j24L54k41r6K5k35N13m02J11J47M45o30K20L76k75P2K59j63K22m29L15
2401B97o6P0l56K4K03k03P9j28N9k27J48l62L13K35q4r0J7j00o6K15J77r3r3K3
2425hJ89j60l5n9K72j34K67j05n2p6J54j54n1j17K3O8p1r3j88M09Jj47l67P9K06
2450a49M5p3K85l42K07l5P6J22r3rj23L04j67K10J3j32j1j00J00l3j93p4n0J53
2474f9kl60M80J34k08m07K26K11p9q0K46j55j50K77Q3OM5k08K61j91l5M24l96
2497E3J00M0r3J20k75O6r0J99l70J48Rr1L22n04Q2R9q0o9L32j47j32J14p4J42
2521i9K32j13J75j40J39j16K0L7n9J35K08Jm6j21k31L3J01l61O6l6R4j89M6P9
$$ plain form
2357 -13 150 -41 -62 31 221 -118 -141 263 349 -111 -65 525 292 -17 -4 260 221 98 -24 39 -116 -303 -167
2380 -167 -291 63 -178 -274 -249 -484 29 -373 -262 -115 330 -300 -80 296 21 93 352 189 411 -18 297
2401 297 231 301 -55 -31 172 -31 48 -80 -21 -248 -100 -462 -149 86 2 -88 -71 -171 -237 -22 155 62 -31 -8
2425 -8 181 21 -14 -73 199 65 332 227 175 99 253 99 48 -69 -46 22 -49 -142 -330 79 80 -67 -434 -355 -149
2450 -149 -104 -177 108 -234 -27 -62 14 136 43 34 -89 215 48 258 271 139 128 28 128 95 -98 -172 -222 -69
2474 -69 -71 -431 49 183 -25 -432 -206 5 -74 -154 92 -63 -213 64 147 153 198 -10 251 60 25 449 53
2497 53 153 193 100 220 -55 11 -79 120 -250 -102 -93 -184 138 -366 -284 -185 -265 -334 -2 -149 -281 -167 -241 -99
2521 -99 133 20 195 55 194 78 98 135 76 211 419 420 374 253 22 55 156 -205 -139 -175 -81 -270 -224 -145
2545a45k5k6k5K23j3L3j69LJ1M98k73O7j98k9O96k53l11J70J11k56l4J13j2q6
2569G0p8Q3m38L69l13N5J62k14K55J22j45J11N3n14M08J59l04M17k37N7M8M8j39
2592C5Q0n8K10k25R2k82Q0J18L59n01p7q2L58l01N2j38K26l22k0O47n47K32j23
2615a87L68j44qn2K09k18J44j26J89j40pJ87L6l89M67j23k10j7L4K33l88k1j97
2638c60N09k74J42j44j15J45N0N7j74L32j90j57j4L13J10m41K87l4M7J7P4R8J58
2661D36m32K36J43k10j53O6j53j67n8oJ34j6N4po3j48L69m5J27j95J28J12K10
2684C62k98L5O0l9N0J05j54j53P1J17K01k87K6j15M28m41p8l7mN4J97l17K20m4
2708d1k53K87Q1j95R8K9K10J89m07j45L19j9J9N5%L7l97J06P8nk05J62l9N3J77
$$ plain form
2545 -145 -170 -196 -221 2 -11 22 -147 -144 -133 365 92 159 -39 -68 628 375 64 234 345 89 55 168 156 70
2569 70 -8 75 -363 6 -307 -252 -90 -304 -49 73 -72 39 92 -422 -14 145 -159 258 21 78 126 174 35
2592 35 115 57 267 42 134 -148 -68 50 409 -92 -169 -251 107 -194 -142 -280 -54 -376 -396 251 -296 -64 -187
2615 -187 181 37 29 -23 186 -32 112 -14 175 35 28 215 251 -138 329 206 -4 -21 13 246 -142 -163 -360
2638 -360 149 -125 17 -127 -242 -97 -47 10 -164 168 -22 -179 -193 120 230 -211 76 42 89 106 180 278 436
2661 436 4 240 383 173 20 86 -67 -234 -292 -298 -164 -180 -126 -133 -196 -344 25 -20 107 -88 40 152 362
2684 362 64 99 159 120 170 275 121 -32 39 156 357 70 96 -19 409 -32 -110 -147 -151 -97 100 -217 3 -41
2708 -41 -294 -7 74 -121 -23 6 216 405 -2 -147 172 153 172 227 227 264 -133 -27 51 46 -159 3 -36 17 194
2733A94m28m2n8O1K52Lj95N3J33j22K03R4N0j57k55L49Q8k58K80j87p6L06N9l28
2757A9j19K7L6J3r5J54J35m21J12N0J28l05K1L29j52k62Q7L08J38m82K92O0j09
2780c6M2P3P5N0l4k62K12j97J23J38j56J77j60L2n8n2K11q9l25P8J67k21J33k53
2804c32L64k47l1K53K34l90R9J42p2K10O1l46K49k50K75Q1k42J49k96K62j8j25
2826C0J75j36m0j00l4j03L9K64k23o3l4M0O4J02n4K73l54K60p2j11R0N3K35l35
2850c4K38l9k6n9P4j69L11k49K4J70o6n5j66J86m26lK82J05k43k07K31o5L4k3
2874a75R7j46J40j47K99k06J89K63N8j60j95K78j64pj07L36m39RJ71p4k86J22
2896a44j96M48j50j35O6q6n8L47m56M41j66J96J9K1j05L39l76L9M8j42O2K77j53
$$ plain form
2733 194 -234 -276 -334 -273 -21 -18 -213 -160 -27 -149 54 148 198 41 -214 135 223 -35 245 58 -18 288 347 19
2757 19 -100 -73 -37 -24 -119 35 170 -251 -139 -89 39 -266 -245 84 -68 -330 -243 65 203 -279 13 73 -36
2780 -36 6 79 154 204 170 -92 120 -77 46 184 28 205 45 77 19 -33 178 89 -236 -158 9 -212 -79 -332
2804 -332 32 -215 -246 7 241 -149 -50 92 20 230 291 -55 194 -56 219 300 58 207 -89 173 155 30
2826 30 205 69 29 -71 -105 -208 -169 95 -128 -191 -225 -185 -121 -19 -73 200 -154 106 34 -77 13 66 301 -34
2850 -34 204 165 139 80 154 -15 296 47 71 241 175 120 -46 140 -286 -289 -7 98 -145 -352 -121 -186 -152 -175
2874 -175 -78 -224 -84 -231 68 -138 51 314 372 212 17 295 131 124 17 353 -86 -77 94 20 -266 -144
2896 -144 -340 108 -42 -177 -111 -197 -255 92 -364 77 -89 107 126 147 42 381 5 44 92 -50 12 289 136
2919A36q9L3M5k03J81j71J11M1pk42J56J1k40J73J17j30r4N9R6J67m27K95j70
2942a52L12J30o2l66L99j39J44k92K4J87k2j13q4J63l3j48K16j20l43J89M1P4
2964Em03K60k37M13K9M4j49j28J12j94J59jQ1J0K89q0m5k23Q8K42l30k6L94k11
2988I9J13J5m53K82k50J00l0j71J84j41J46J54o1Qk6m4j23J09k1J44K59l27p5
3011a09J55Q8o8l50M96o4n8J76j02k57p3K03l7Q8k13r8M19n49J02Q7%j23P1L00
3035H4k71L07q3o5Q8l9K09k06j35N28n31K23m49N34k06L38j35k80K75j61o1J40
3057A04l70K71l7L9j12M7K04l26Mj81J59Q6o1R6K13p5J04J72k71O4J32j78J32
3080B16n6j69K00l40R3J08L1l2l65K45J26k04K11j86J24m42N09j82J38p1R4J02
$$ plain form
2919 136 47 80 125 -78 103 -68 43 84 77 -165 -9 2 -238 -65 52 -78 -172 -113 -17 150 -277 18 -152
2942 -152 160 290 228 -138 261 122 266 -26 -2 185 163 50 -34 129 96 -52 164 44 -299 -110 -69 5
2964 5 -398 -138 -375 38 67 111 -38 -166 -54 -248 -89 -90 -9 1 290 210 165 -58 30 272 -58 -84 310 99
2988 99 212 227 -226 56 -194 -94 -124 -295 -111 -252 -106 48 -13 -5 -31 -75 -198 -89 -110 34 293 -34 -109
3011 -109 46 134 66 -284 212 148 90 266 164 -93 -166 37 0 88 -125 -223 196 -353 -251 -164 -164 -287 -216 84
3035 84 -187 120 37 -28 60 21 230 24 -111 417 -114 109 -340 194 -12 326 191 -89 186 25 -36 104
3057 104 -266 5 -32 7 -105 -58 146 -180 -176 -357 -198 -112 -173 -77 136 61 165 337 66 130 262 84 216
3080 216 160 -9 191 -149 -56 52 83 51 -314 -69 57 -147 64 -122 2 -440 69 -113 25 -46 48 150
3102A50MR6k98M13k85R6J0p0j13q6KK22q4n1J77l22K22j96j8K99k12j08N0r5K67
3127G0j58J68l34K12j47K27Q6l40J58K24Pk78J12N4p5r5L00r8K10j88k67J99j45
3150i8K28Pl45K57M3l32J71K0r2O0O7LJ26l08Q5J56l11N4L40j53q7J24J44j9o7
3175G3J33j6k9j46k71L91j15K39l89N4K57j96j8p4j79K82k19K62l60K29k2K1L
3198i0J79l39L41K37k91J35j27J13P5k1m5k22O4M0j7K20k13p6K73l59K15m77J48
3221b37M95l15R3pk95J6K1j23L74m4q7K40j2j54K79k04J76k24K41o1j68P8M2K34
3245C58l45n4k9l1j56P2L03k53J56q6M5q4J16j90L71k51j65J67j23R5L7J33l3
3268E3j31J61j66N9m5R9Q6j32M9J03j48J29K00k43l1j18K7o0Q9J2j94J29q0O4
$$ plain form
3102 150 154 250 -48 365 80 176 186 116 3 -83 -81 141 57 6 183 -139 83 -113 -131 168 -44 -152 -102 -197 70
3127 70 -88 80 -254 -42 -189 38 124 -216 -58 166 173 -105 7 61 -14 -109 191 93 303 115 -152 47 -98
3150 -98 130 137 -208 49 92 -240 -69 -49 -141 -81 -14 -11 115 -193 -108 48 -263 -209 131 -22 -109 15 159 140 73
3175 73 206 190 161 15 -256 135 20 259 -130 -76 181 -15 -33 -107 -286 -4 -223 39 -321 -92 -114 -93 -90
3198 -90 89 -250 91 328 37 172 45 158 233 212 167 -55 9 49 32 252 39 -37 236 -123 92 -385 -237
3221 -237 258 -57 36 29 -266 -250 -229 -352 22 -22 -109 131 119 -35 244 40 216 -8 233 172 4 82 124 358
3245 358 13 -41 -70 -101 -257 -185 118 -135 21 -65 -20 -104 12 -178 193 -58 -223 -56 -179 -84 -47 86 53
3268 53 -78 83 -83 -24 -69 30 116 -16 33 136 -12 117 317 74 43 -75 -48 -108 -19 -7 -201 -72 -152 -88
3292h8j18K06k63L70j23O9j30J21O1r3o7Q7N0NP0j78L13l76j3j30L99j32j75J50
3316A5r1J99l4l39K19n2J85j86j55M65l25K53l24L20K29j94j07J02j52R3N4j58
3338A7QK62k00n9J34j43J99l59R2J60k17j7J88k36J49j9k1j01r8K23nR9n7M4k08
3363a65J72J60pj64l6J88m4o0K3M7q9K10j48kkl16K81j51P2j63J9J31M3l04K82
3388b3o1j58M34k96K86l20J38j1k3J13J49p5o1p3K7k37K56N4j17J75l21M59k43
3411G2J28n2j55K82l72j9J00Pk58P7K66p6o6M4Ok39J74O0o0o0K53j17J02m5j04
3436e2L52k91m8J09Q9j11k44K47M4M1nn3r3J62k74J70O4k35p2J75j01p1J94Q4
3460H1m7K40l35L36j37k43R0K29K6m42J19P9k9K18j09Ol14L9J01k1P9k48J69K8
$$ plain form
3292 -88 -206 0 -263 107 -16 53 -77 44 105 12 -55 32 82 87 157 -21 292 -84 -97 -227 172 40 -135 15
3316 15 -76 123 89 -250 -31 -83 102 -84 -239 226 -99 154 -170 150 379 185 78 180 28 121 175 17
3338 17 25 287 87 28 162 19 218 -141 -49 111 -106 -123 65 -171 -22 -41 -62 -163 -261 -38 -43 56 -1 43 -165
3363 -165 7 167 160 -4 -40 148 104 44 67 114 25 235 87 85 83 -233 48 -103 -31 -194 -175 -44 -1 -305 -23
3388 -23 -84 -242 192 -104 182 -138 0 -11 -34 79 228 153 92 19 46 -191 65 119 2 177 -144 315 72
3411 72 200 148 -7 275 -97 -116 -16 -9 -267 -190 76 0 -66 -22 -16 -255 -81 -21 -81 -141 112 -5 97 52 -52
3436 -52 300 9 -39 70 159 48 -196 51 95 136 131 78 -15 147 -127 43 107 -128 -200 -25 -126 -197 -3 81
3460 81 34 274 -61 275 138 -105 -15 214 240 -202 -83 -4 -33 185 76 82 -232 -193 -92 -113 -34 -282 -113 -85
3484h5o3P3P4n2j25K61q4l2J71j58J69l86M43r3R7j53j84J72L08m09lJ01J23k06
3508d1P1l02K35J91m17R3J6J52K08l31J20J08m5m14K27J90On4O6r1k9J88j53j12
3532a18J95J06m05J91J24J90k78No8J67j20L8j33J40J99j94q1m5J62j67Q2J90
3554A80q9m4Q8k32L27j57l12L18Oj3j21O1J04P4r4l5K5j63Rn2J74m2J49j63j63
3579a65n1J59l7M2K8k01M16j16l9J57k01K31l2j89K10k67K58j32N2l5k25ml1K7
3603a45O7j27J17nn5J17NJ8j07J83j52k04J32L13m21J67r5L55k23Jq2L15k86L43
3627B31P7j50J17j00j26j04l9J16j31L3j70J62K06j68m4k5K29j83j02J97%j39
3649a13J28j83R0Q4j20L49k00j45N5J91J60k15o1K90k24Q5k85L66k26Q1k34J86
$$ plain form
3484 -85 -148 -75 -1 -53 -178 83 -1 -33 138 -20 149 -237 206 113 210 57 -127 45 353 -56 -59 42 165 -41
3508 -41 30 -272 -37 154 -263 -170 -154 -2 206 -125 -5 103 58 -356 -129 61 67 13 79 -12 -41 147 -6 -118
3532 -118 77 183 -222 -31 93 283 5 10 -58 109 -11 27 -106 34 233 39 -42 -87 75 -92 -10 180
3554 180 91 47 135 -97 230 73 -239 79 85 72 -49 12 116 190 96 61 86 -77 -68 -120 54 12 161 -2 -165
3579 -165 -216 -57 -94 -52 -24 -225 191 75 36 193 -8 223 191 2 212 -55 203 71 123 88 -137 -141 -172 -145
3603 -145 -78 -205 -88 -93 -148 -31 -26 -8 -115 68 -84 -288 -156 157 -264 -97 -192 163 -60 -59 -141 174 -112 231
3627 231 308 158 275 175 49 -55 -94 22 -109 -76 -246 -84 122 -46 -90 -115 114 -69 -171 26 26 -113
3649 -113 15 -168 -78 6 -114 235 35 -110 -55 136 296 81 20 310 86 171 -114 252 26 107 -127 59
3671E9k0j6j91J68j07K5J85k99K31NK5P4j24j19M31m99J80P4j43J51k9j02n0n9
3695a50J4K31n3L2M0j13k7R3J1R3k24nj19M9J2p6M0k51N51j85l4jL29k09O8j18
3721bjj14J60l6l1J1J13N3J74j73j88J94j46J27k06J46j28o1j52J52Pr7L11k30
3745a17KJ64j29K28j93J45k39J16O0n9J80o0k19K77K8K6j44J36j43n4k12K72J3
3768G8m1J59j12j24M1q6j56K21j26J6J58n5o9M0R1m6l2k8R3k4PM0k31L53N7p0
3794A54k62oK69j89K0L05k32l3n3q2J02j18J9L29q2l41M36j00J14j55j28J6P3
3817E6OM9K41j88j10j04J47l5k35K33J29j87P9l50K71k70J71J59l21K43K45m14
3839a85M9P5rJ0K74j44j48l7K48l9k8K1J18k8n5J7j95M8J47k39m6M46l19o3Q8
$$ plain form
3671 59 39 23 -168 0 -107 -82 103 -196 35 40 65 139 15 -104 327 -172 8 82 -61 90 61 -41 -91 -150
3695 -150 -136 95 42 74 114 1 -26 67 78 171 -53 -58 -177 -128 -116 -192 -152 -403 148 -37 -71 -72 257 48 116 -2
3721 -2 -3 -117 43 7 -24 -13 100 153 327 154 -34 160 14 141 -65 81 -47 -108 -260 -108 -101 -198 113 -117
3745 -117 -115 49 -80 148 -45 100 -139 -23 37 -22 158 98 -121 156 184 210 66 202 59 5 -207 65 78
3768 78 37 196 84 -40 1 -85 -241 -20 -146 -130 28 -27 -96 -56 35 -11 -43 -71 22 -2 5 45 -186 167 224 154
3794 154 -108 -114 155 -34 -14 291 59 26 -27 -109 -7 -125 -106 223 141 -200 236 136 250 95 -33 -17 56
3817 56 62 111 352 164 54 -50 97 62 -173 60 189 2 81 -269 2 -268 -97 62 -259 -16 229 -185
3839 -185 -136 -61 -70 -60 214 70 -78 -115 133 94 66 87 205 177 122 139 -56 -8 139 -100 -146 300 -19 -82 6
3864FM0L06n59J26m5K28q7k73K67o0J24q6o5o1J38j15K26k77P1j4K58K0p3p1k25
3889b01J94n0m5J55p7k3j18L76l51q4L82k11l9n6K09J24j50j67J78p6J73j92Q
3912d1J69k45J77L34m75l2J45J53j76j24J62k1j96K09J03j28M3J36l35J3P2L9
3934a8N8p1P8j33P8O9l9j76J06R5K4k13pj01K74P7p2J69l34Q9j3J73j54J51l40
3959b30K02J16oo6Qj17r7J67n5P3J41k02rJ60k82J83r5J82n8K67j77j89P8K50
3983B44n20M24K8k26K17k53O8k08J67N5J37k35k19J93J27J4J53j29j9k38J29J79
4005H8k87J49J37L2q7k54L07LJ37l34k5K71j45o8oL05j26j06p4m1P5l9P1j90J09
4030i8R2M8r4L5q7J27l7q4j22J57J80k25K31q5J18k03L4J08M3j85K53p7j20qK67
$$ plain form
3864 6 46 352 -207 -81 -126 102 15 -258 9 -51 73 -13 -78 -139 -1 -116 110 -167 -96 -110 148 168 95 24 -201
3889 -201 -7 -57 -102 53 -24 -47 -165 211 -140 -224 158 -53 -92 -148 61 185 35 -132 46 -30 143 -49 -41
3912 -41 128 -117 60 394 -81 -113 32 185 9 -115 47 26 -170 39 142 14 57 193 -142 -129 -57 -18
3934 -18 40 -31 47 -86 -8 61 22 -154 -48 47 71 -142 -149 -250 24 101 29 198 -136 -47 -60 113 -41 110 -230
3959 -230 -28 88 82 16 24 -93 -190 -23 -78 -5 136 -66 -75 85 -197 -14 -109 73 15 282 105 -84 -6 244
3983 244 -276 148 176 -50 167 -86 -18 -226 -59 -4 133 -102 -321 -128 -1 13 166 37 18 -220 -91 88
4005 88 -199 -50 87 119 32 -222 85 88 225 -109 -134 137 -8 -76 -82 223 97 -9 -83 -124 -49 -88 -17 -207 -98
4030 -98 -6 42 -52 -17 -104 23 -14 -98 -220 -63 117 -108 123 38 156 -47 -13 95 138 -47 206 129 9 1 268
4055B68q7l14k8P7R2J14o4j32J83l67J40J46k91L1K37o0J9j06n1K10k45K52n8
4078c4J41LK59l86PJ88k92q2K12J78n8O6l09J05j9n8J27j52K16k64o7J56J73j30
4102b0k6k7QK31l26jL46j17n5K7l6j1m7o9L25k25L4N0J33j75j4L07l42j55N7K10
4128H2j30l1K72k66Q7l1Q3l5J3q1J04k12M0L18r5M9j01J5j22q2L85l4j46J08k11
4153b1l0K51r7r2l67M43k18K55l13O1K9j7J47j18j8R2j07J76P0k31K57J53k02
4176A03k56L60k5M4k36o2L5J95R5r2k68J38l5P3q9n9J20J68k57%L82n73K23k63
4200b79J19q0L63M1k5k42K25k03P5j52K38k56K14K27j61j76K15j38j92N6R0J56
4222A15L3Q2k10R1n3l12L35k0k60L1K11j57K45j15j61J48k9j31Q8k1N2K26k12
$$ plain form
4055 268 181 -133 -161 -84 8 122 58 -74 109 -258 -118 28 -263 -232 5 -55 -36 -142 -193 17 -228 24 -34
4078 -34 107 110 369 -17 -10 178 -114 -196 16 194 136 202 -107 -2 -21 -79 48 -104 112 -152 -219 -63 110 -20
4102 -20 -46 -73 -65 166 -160 -161 185 68 13 40 4 -7 -54 -123 202 -23 11 61 194 19 5 312 -30 -185 -128 82
4128 82 -48 -79 193 -73 14 -17 66 31 44 -37 67 -145 -105 213 118 167 66 81 -41 -123 262 228 82 190 -21
4153 -21 -51 200 103 11 -356 87 -131 124 -189 -128 -99 -116 31 -87 -105 -13 -120 56 126 -105 152 305 103
4176 103 -153 207 182 226 -10 -72 -37 158 253 161 -107 31 -4 69 -20 -79 41 209 -48 -48 334 -239 -16 -279
4200 -279 -160 -240 123 164 139 -103 122 -81 -6 -158 80 -176 38 265 104 -72 143 5 -187 -131 -41 115
4222 115 148 230 20 111 58 -254 81 61 -199 -168 43 -114 131 16 -145 3 -26 -157 -69 -90 -38 188 -24
4245b4J71k27j30P8L43j49O2j03J38j68K3J77k77J20j55J24Q5j24L7J83l13j6
4267a45L32K3j29M4J1l5J2p2l0K8L9j20J2J77l58L13r8n2k94J69J21q8K15j35
4291f0j68P1m1J43L17n7k64J3j07J16K16m51K85j32L8L02k07j47K00j09l9lL16
4314B32j35j90J52l93J63K63j73Rm7J35L7l53K27l2J59j42r0J46J22P5k62J73
4336G6JR7j55m2K15k20j6R6O2j84L7L9Q8k72L64k42p0J79j82K99l98K45l17L51
4360E1k10L15l12P1Q7QJ34j26q3J24j98p8K40J17O9j5p7k54K75o1k30L03j37n5
4384d2kL04k2l49L38j52j30J44J5M2j42M3J44j21K1j06l8J1k4j97L04q6J72k38
4408a11r8L22J9j92K11j27N3j8l59L82o5k39J35J13r0J12n9R8p8K7l2J7m3L85
$$ plain form
4245 -24 147 -80 -210 -132 211 62 124 21 159 -9 14 191 -86 34 -121 3 88 -36 1 184 -129 -145
4267 -145 187 210 81 125 136 101 113 41 11 39 78 -42 -30 147 -211 102 4 -48 -342 -173 -52 -140 75 -60
4291 -60 -228 -157 -198 -55 262 205 -59 -46 -153 -37 179 -272 13 -119 -81 221 14 -133 67 -42 -81 -84 232
4314 232 97 -93 59 -334 -171 92 -81 -72 -119 16 53 -300 -73 -105 54 -88 -178 -32 90 165 -97 76
4336 76 77 174 19 -23 192 -28 -44 52 114 -70 -33 6 94 -178 186 -56 -126 53 -129 170 -228 17 -300 51
4360 51 -159 156 -156 -85 2 10 144 18 -65 59 -139 -217 23 140 209 194 117 -137 138 77 -153 150 13 -42
4384 -42 -44 260 238 -111 227 75 -55 89 104 146 4 47 191 70 91 -15 -53 -42 -66 -263 41 -45 127 -111
4408 -111 -209 113 132 -60 151 24 77 59 -300 82 17 -222 -87 26 -64 48 -11 87 9 36 4 21 -22 363
4432C63n31K55J4p3J5p8J83j04J32j74P7r6j10K51k65K59k18L18L3l44kR9K0j87
4456a63J62K1k1j00l3P8P8j75K56k16K71m4k37K91j67J14k7q5kJ11M4k59J95j81
4480h9O4K3M5j0J20k12Q8k79P1J56J06k36l9J39K64j77j61J79ol72L57q2K41k31
4504d1L9J73j26q6j49J06K30K4j87N5P4N2j76k23o8M52l9o9j3Rj68Q4J6j31J30
4529c2J98k98J30kj10L3K30j44O5l4m4J86l40J88J14l56J42M8l7q7K0J7j26K70
4553C1j30K43l01J50j75K74N8k03j48K63J56j26j85l2J47j5p5M9K62k45J80N6
4575B34k72N2j23N4L0j19J15l4j9j12K21k30N0P4J26j60J16K9J95k40j10L6Q4
4598cJ12j54j89J04J05M9k13L01l8j9j65L60j25k9m2l79N22k35%J26k20R2j06
$$ plain form
4432 363 -168 87 101 28 43 -35 148 44 176 2 79 -17 -127 124 -141 118 -100 218 251 -93 -95 4 24 -163
4456 -163 -1 20 -1 -101 -134 -56 22 -153 103 -113 158 114 -123 168 1 115 88 3 1 112 156 -103 92 -89
4480 -89 -25 -2 43 33 153 -59 29 -250 -179 -23 83 -153 -192 -53 211 34 -127 52 46 -326 31 -51 190 -41
4504 -41 -2 171 45 -41 -190 -84 146 170 -17 38 112 164 -12 -235 -303 149 110 41 28 37 -131 -47 -31 -162 -32
4529 -32 166 -132 -2 -4 -114 -81 149 5 70 36 -8 178 -162 26 140 -216 -74 -26 -63 -150 -130 -113 -239 31
4553 31 -99 144 -157 -7 -182 92 150 -53 -201 62 218 92 -93 -125 22 7 -68 -19 243 -2 178 234
4575 234 -38 14 -109 -55 -25 -144 -29 -63 -82 -194 27 -203 -153 -79 47 -113 3 32 227 -13 -123 -87 -3
4598 -3 109 -45 -234 -130 -25 24 -189 112 74 55 -110 250 125 96 54 -325 197 -38 -38 88 -132 -40 -146
4621a46J65P9j27l7N5l2K58j99J02J46l48J69J84n2k61K40k74J05n8q1k7K14j7
4644E8l67L92j01K6q8J09j96K62Q4l17n6J38j49L03K02l54q7K12PK79m89k0K49
4667I7j78J19o7O2l3j49J71J26l30K75l14J24J88j99J72j26l1p2J18K78l78K19
4689G2o7L6L1o4k44M31j04N3j51rJ2op4Q5j0j17K20J0Q9l37J06l6J27o2Lp9N3
4716c2N1J04j03M9Q1l38J64R5j51r1L1J4j8J33L4j1l4N6j34kK15j55o6K01p2J73
4742A94j76j54J28o6J52J63j0k64O2j42J93j76L3L12m48J02J92m7K89l47k08L93
4764A75m89K56M3l5N0k9J72r5k52M2K74J00l74J04o8O6k0o2n4J02m9J91j85M0
4788i7K31q3Q6j26n7M5K9J27L7k78j87M26j32j3j0k7K83j98J07k00k17K35Q7j10
$$ plain form
4621 -146 19 98 -29 -66 -11 -43 215 16 118 264 -84 85 269 217 -44 196 -78 27 -31 -112 -139 75 58
4644 58 -309 83 -18 8 -80 29 -167 95 179 -138 -194 -56 -205 98 300 -54 -141 71 78 357 -132 -152 97
4667 97 -81 38 -29 33 0 -149 22 148 -182 93 -221 -97 91 -108 64 -62 -93 -165 -47 231 -147 72
4689 72 5 41 72 8 -236 195 91 144 -7 -16 -4 -10 -84 1 -9 -126 94 104 193 -144 -38 -74 53 -9 -6 -85 -32
4716 -32 19 123 20 69 150 -188 -24 71 -80 -171 -140 -126 -144 -11 23 12 -22 34 -100 -102 113 -42 -108 93 21 194
4742 194 18 -136 -8 -74 78 241 231 -33 29 -113 80 -96 -63 249 -199 -97 95 48 337 -10 -218 175
4764 175 -314 -58 -15 -50 0 -29 143 48 -204 -162 112 212 -162 -58 -126 -60 -80 -142 -196 -94 -143 48 -137 -97
4788 -97 134 51 137 11 -46 -1 28 155 192 -86 -273 153 21 8 -2 -29 254 56 163 -37 -254 -19 68 -42
4812d2K59k46J70j65k12K59K0L2J78l1m11L81j38q0J67m4R5n2j14R9j73K84k79
4835d3L62l40L31k36J24l49M1N4M4J45m6j43q1q2J29J28j4L2JP2K2l03K11M6l4
4860G1K56j71k86J05k11K06P9Qj14J14j29K5J34k32kK02o0j95M5J17Q6j54Q1K9
4884Dj94L98l39K6K54k58K53l9N7k83J26K3N0J04k31j05J2K76j25L54o16K24K17
4907A88l94L51k78K24k47N9jK08l12L8N82m58P3j66L3J18j11J63l10M78l99L25
4929A64l5o2q2J68p8j12oj96L23m4O4n3kj01L23m15K21o0j37lJ82j40K30l17J97
4954B9j5K00j5o4o2l0j86K03l20K96L0k83J13J5J8K12k00K09k17O5k35L03q1J61
4978A46r9j46j0p9M00j45L8Pj35Nn5P2j45Q7k32L98kk97K26l9j49k4K88L9l03
$$ plain form
4812 -42 217 -29 141 -24 -236 23 43 75 253 222 -189 192 54 -26 141 97 192 140 26 125 -48 236 -43
4835 -43 319 -21 310 74 198 -151 -110 -56 -12 133 87 -56 -137 -219 -90 38 24 56 57 129 151 -152 59 105 71
4860 71 327 156 -130 -25 -236 -30 49 57 -57 57 -72 -47 87 -145 -147 55 -5 -200 -155 -38 48 -106 -25 4
4884 4 -190 208 -131 -105 149 -109 144 105 162 -121 5 28 78 182 -49 -154 -142 134 9 363 -253 -29 188
4907 188 -206 145 -133 91 -156 -97 -98 110 -202 -164 418 -40 33 -133 -100 18 -93 70 -240 238 -161 164
4929 164 129 67 -15 153 75 -37 -43 -239 84 40 104 51 49 -52 271 -144 77 17 -120 -123 59 -81 149 -168 29
4954 29 14 214 199 135 73 43 -143 60 -260 36 66 -217 -104 -89 -71 141 -59 150 -67 -2 -237 66 -15 146
4978 146 47 -99 -109 -188 212 67 105 112 -23 -18 -73 -1 -146 -59 -291 107 105 -192 34 -5 -154 -178 110 149 -154
5003a54J29lq0p6P3q8J01L46l86O4P2j06J77M0j94K76k3m08J95J35J58k01j55
5026a08L55l18M9j10M8Q5L0l2M6q1Q2N7j42RN2N4m6j72L12k33K1J52j02j13J63
5051E8n3j56K02n6L44l21m9M8k82L17j82J89k11J14k74L00q5J97J6k24P7KK07
5074A78j07j66L73m01J77k17J91j59K42p3j01L70j79K55l83K10m32N5L87k97K12
5095A35n17J08K43j44K04k74J97N7Q5j78J69N3k67l5J14O0k09K68J04k88K45m34
5117c04M51j99j06L35k67O1J27l99K44J31m4o5L1m2oK07m31K66j68Q0K19k30K11
5140A02J2Q2o9j74k1J63l59k21M42O2mrL0p5L8j10L08j76j44O9J3k24L10j15J24
5165E4j40rR1K45k14j86K67k43O3M7j0K7J35k54J33j52J30O7k78L54r2J53k26
$$ plain form
5003 -154 -25 -28 -108 -184 -111 -199 -98 248 -138 -74 -2 -108 69 109 -85 191 168 -240 -45 90 248 47 -108
5026 -108 247 -71 -22 -132 -84 1 31 -1 45 -36 46 103 -39 -30 22 76 30 -142 170 -63 -42 110 8 -105 58
5051 58 5 -151 51 -5 339 18 -31 17 -265 52 -130 59 -152 -38 -312 -12 -97 100 116 -108 -31 -29 178
5074 178 71 -95 278 -123 54 -163 28 -131 111 38 -63 307 128 383 0 210 -222 -167 220 -77 135
5095 135 -382 -274 -31 -175 29 -245 -48 9 94 -84 85 138 -129 -164 -50 10 -199 69 173 -115 130 -304
5117 -304 147 -52 -158 177 -90 -29 98 -301 -57 74 30 -35 -4 -46 -52 155 -276 -10 -178 -98 121 -109 102
5140 102 114 196 127 -47 -68 95 -264 -485 -43 19 15 6 36 -39 -1 -111 197 21 -123 -54 -41 -265 45 -70 54
5165 54 -86 -95 -4 241 27 -159 108 -135 -72 -25 -35 -8 127 -127 6 -146 -16 51 -227 127 35 188 -38
5188c8j68l1J98K53k54r0J23K38k59Q3K2R1o4M1k61lK12k91J17L80k17j30K44
5211A96n1j76R2o5L9j56j14J01K18J30l50K97j72J44j09J60k87o7J04r7J62j56
5233a57M2K50j21k5j24K43j78P0j29J02o3J19k59L07m7j41K37k9L9L1j74j77J60
5256b4J79j07k6n7q9N5J38nj21r4Q3J66J42m36J12J61k71J56J85p3k05J4J53K3
5280E9l34O0J26K06p6pRq6o3L3j43K19N2j60k4K6o2J75k5J11k91m3J75J38j3N3
5306A15j31J85m34L58n1l7l06K60P4j35mJ73kj18M7lR5j48m4O5q5K76j2j38l9
5331c9k41R1J60m9j4Q9K7J39l08L4O2L7J4l9J53j87K11J54o6j54q7j01j72K97
5355A1J25O8j78k74M72n0j77r4R6K5J41l63J81M5%J48j76j99K97k23J62j8P0j50
$$ plain form
5188 -38 -206 -237 -39 214 -40 -130 -7 231 -28 55 77 168 104 145 -116 -119 93 -198 -81 299 82 -48 196
5211 196 145 -31 61 -4 35 -121 -235 -134 84 214 -136 161 -11 133 24 184 -103 -170 -66 -163 -1 -157
5233 -157 -115 135 14 -11 -135 108 -70 0 -129 -27 -90 29 -230 77 30 -111 126 97 136 167 -7 -184 -24
5256 -24 155 48 22 -35 -124 -69 69 64 -57 -151 -68 98 240 -196 -84 77 -194 -38 147 74 -131 -117 36 59
5280 59 -275 -215 -89 117 41 34 43 -43 -106 -73 -216 3 55 -105 -129 -103 -165 10 -15 96 -195 -238 -63 75 62 115
5306 115 -16 169 -265 93 42 5 -301 -41 33 -102 -106 67 65 -53 -6 -9 86 -62 -106 -41 -126 150 138 0 -39
5331 -39 -280 -189 -29 -78 -92 -3 24 163 -145 -111 -49 -12 2 -37 116 -71 140 294 228 74 -13 -114 -286 11
5355 11 136 204 26 -248 224 174 -3 -97 -1 24 165 -198 -17 28 28 176 0 -199 98 -125 37 19 89 -61
5379f1p8J55j93N8K91j72j42J03K57k68L38m25k9K42k24K08p5K04n38M25j63J38
5401E1L4o6j36J11P7j97K75j47Q8j98R4J41O9j27q1j43J65q3p3J98j62J12j04
5424a02J49N2p8J9k56L35l5r8k32R2J27p2j73K81M8j23R9Q8l53K03J76m9j33J5
5448b0l84N11P1j75jK29l31P4J36K48m58J06Q7M3k44j54K57p9K04k3K0q6Q3r3
5472B1P1j48J73pj40M8k37J65K67k73n1J91o5j94J90m4ML8J19M8k56j46J86LQ8
5497E1O2qm2L3M7k89J70o6O2k45m0K82j04l6O3J1m9R0QJ38l94M52l5j90p7K76
5523A70k31j67J83J74l5k21M0J09J68j51j04J93K1k34K71p9n15L76R6k76J7L90
5545A95k37J97k3j89j74R1K69l10Q0P1kJ52k2Rj12Q1j53J87k76M14l54M7K02k40
$$ plain form
5379 -61 -139 16 -177 -119 172 0 -142 -39 218 -50 288 -137 -166 76 -148 60 -15 189 -349 76 -87 51
5401 51 85 19 -117 -6 71 -126 149 2 90 -108 -14 127 196 69 -12 -155 10 -73 -146 52 -110 2 -102
5424 -102 47 99 21 40 -216 119 84 -14 -246 -154 -27 -99 -272 9 57 -66 33 121 -232 -29 147 98 -35 -20
5448 -20 -404 107 178 3 2 231 -100 -26 110 358 -100 6 93 136 -108 -262 -5 -84 120 97 117 31 114 21
5472 21 92 -56 117 110 -30 18 -219 -54 213 -60 -111 80 15 -179 11 -33 -29 9 128 176 -80 -226 -40 -37 51
5497 51 113 105 63 96 143 -146 24 -42 20 -225 -265 17 -87 -123 -60 -49 -98 -8 0 138 -256 196 161 -29 -106 170
5523 170 -61 -228 -45 129 94 -127 -87 22 190 39 -65 128 149 -85 186 107 -408 -32 64 -212 -195 195
5545 195 -42 155 132 -57 -231 -140 129 -181 -101 -30 -32 120 98 107 -5 76 -77 110 -166 248 -106 -59 143 -97
5569i7J18J53j5j08n2n3J67k46K26n5k61K57J90k63Q0J26k69Q0%j32O2J41l4k1
5593fK3p1K18P2k92N6j3k03J74QL2j0j30L55k57P1rJ13j86P6j26J01Mo2J4R1Q
5620E1k50J12J54L9k7N7j8k45O6j0J84j50j53L71l24m9K84n5J25j47j31J27OK8
5644D5p3o0O5o3j27j38N27k06l9J23P2k02O5j04J71o0Nl4L47j61N5j21J0J95k55
5669C7R3P1j34j94J59o7M1k8K33l3k29%k06M43k66j03L24l30j84K93j0L4P1lJ24
5694A36Q4j4l88K40O3j53p0K18J40l74J30J71m3j62K69k82J51j05N4k38N6J43
5716B6j61L89l97L44k63o9J62q2Q0j73l1L21O7k09k1P6Q0j97J74j66K08r6M1j41
5740c8jLJ57J42j56n3n0m5M4n8J36J44k84j1J45k06J66P5j15j6N3r6LJ69k8o2
$$ plain form
5569 -97 21 174 159 51 -1 -54 113 -133 93 38 -223 34 224 -39 41 167 -102 -22 -22 -154 -92 49 15 -6
5593 -6 17 -54 164 236 -56 0 -13 -216 -42 -34 -2 -12 -142 213 -44 27 18 131 -55 21 -105 -4 0 -62 -48 43 51
5620 51 -199 -87 67 106 79 136 118 -127 -61 -71 113 -37 -190 181 -143 -192 92 37 162 15 -116 11 17 45
5644 45 -28 -88 -23 -86 -213 -351 176 -30 -69 54 126 -76 -11 -115 56 -4 1 -33 314 153 208 87 97 292 37
5669 37 130 201 67 -127 32 -35 6 -22 211 178 -51 -51 -257 186 -80 -183 141 -189 -373 -80 -90 -56 15 12 136
5694 136 220 206 -182 58 121 -32 -102 116 256 -118 12 183 140 -22 247 -35 116 11 65 -173 -117 26
5716 26 -135 254 -143 201 -62 -131 31 -51 29 -144 -175 146 213 4 -17 59 139 -58 116 -50 158 62 103 -38
5740 -38 -39 -36 121 263 107 54 4 -41 3 -55 81 225 -59 -70 75 -131 35 110 -5 -21 32 -64 -61 108 80 18
5766A8q4J52o7k7R5j15m3lm3J71L6j18k12j73L59p4Lqj27K83p1J56J2j85L58l74
5792h1m1J24K09m05K10r9J29j82J92j18L19k48J48K5j69j11j46K57O5j25pR3o9
5815c0J31J94l42K56j83J5l2J75k02J6P5k01M3O9nj09K81N6m34K51L1l0j54J44
5839A5p4J93l10J67k10N2Q8j4J33J86l31j1J60k8J7M3j11J82j43O8k2j57J73j25
5863e9L35j68k30J21kK%oJ19M3k34N1K2J09k03K35Qk14j1p0K79k33J45J14j41
5888A2R8k8m4O3K51k46j02J10J31m01K71j16r1K23k58K20j47K31k29O5j71L66
5910B08k87J11J02l14J11o4J10j94J5L48P7j28j00p5J67k1l5k33J52O2mJ01j40
5933c1l7j40K35P0m4J5k71K24J23j54k5J49N7j21k48J10R2m9L2o1K21p1L7J3k04
$$ plain form
5766 18 -66 86 19 -8 87 -28 -71 -74 -117 54 90 -28 -240 -413 -54 -128 -125 -133 -260 23 -48 108 120 -65 293 -81
5792 -81 -122 2 211 -194 16 -83 46 -136 56 -62 257 9 157 182 13 -98 -244 13 78 -47 -54 39 -30
5815 -30 101 295 -47 209 26 41 9 184 -18 -2 73 -128 -85 -16 -21 -130 151 207 -227 24 55 25 -129 15
5839 15 -59 134 -176 -9 -219 -167 -79 -93 40 226 -105 -116 44 16 33 76 -35 147 4 72 50 -107 66 -59
5863 -59 276 108 -122 -1 -3 -1 -1 -7 112 155 -79 -28 -6 103 -100 135 143 -71 -82 -152 127 -106 39 153 12
5888 12 110 82 38 101 352 106 4 114 245 -156 115 -1 -92 131 -127 93 -54 177 -52 13 -158 208
5910 208 -79 32 134 -180 -69 -133 -23 -217 -202 146 223 95 -5 -80 87 66 31 -202 -50 12 8 109 -31
5933 -31 -68 -208 27 97 53 68 -203 21 144 -10 -35 114 171 50 -198 -88 4 -45 -13 -74 147 76 113 126 -78
5958g8p7K34J38j59n4J0J65q4Pp4L1j58L32j5j88L9L61n54L38q6j72K07k47J84
5982A00o9J0k50K20o1o7J88L9p9l10N4O9L03j88j14K19M9mp6lK44k84J51L3l2
6007A42J31q5j06n5L3J04k75L06o7k6rp9J9J1k02J69j4N4J08j0k09K99j94o9q
6032c2R6Q0j16j45m5K04J32k91J59Rn11M27o5o3K6R4R7k19N7J38R1o9L00l40q0
6057f6K30j39J03R0l72K54J02k64K8M8j16K60l64K03m9J73Q1M2k74pJ01k05J83
6080D2j62K1K51k33l2N8l4K62j55L1j55P9J89r4n6j21J99J6l56M43q8j20oj25
6104a46K09j56J69l51J68L05r3k52M9K77j42j44N5J75j31j74L54j77J80j1l61
6125a97J66j1j20J43J12k68K98m31L26R8j21j82L13j37Q9k80M44k62R3r4J8n8
$$ plain form
5958 -78 -155 79 217 58 4 14 179 95 102 28 59 -99 233 218 30 69 430 -124 214 128 -44 163 -84 100
5982 100 31 41 -209 11 -50 -117 71 110 31 -279 -225 -156 147 -41 -155 64 113 109 33 30 274 -10 141 174 142
6007 142 273 188 82 27 60 164 -111 195 128 102 93 14 33 44 -158 11 -3 51 159 149 -60 239 45 -24 -32
6032 -32 64 144 28 -117 -162 42 174 -117 42 51 -460 -33 -98 -161 -135 -41 56 -163 -106 32 123 54 354 14 -66
6057 -66 164 25 128 218 -154 100 202 -62 -34 14 -102 158 -206 -3 -52 121 202 244 -30 -37 64 -141 42
6080 42 -120 -99 152 -81 -113 -55 -89 173 18 49 -106 -27 162 68 12 -109 90 106 -250 193 105 -15 -21 -146
6104 -146 63 -93 76 -275 -107 198 105 -147 -98 179 37 -107 -52 123 -8 -182 172 -5 175 164 -197
6125 -197 -31 -42 -162 -19 93 -175 123 -308 18 116 -5 -187 126 -11 78 -202 242 -20 73 -21 -3 -61
6147f1j35L97k44M5k43K84J33p9j71J74k9n5j9J40N0j34o3J33n1j23J30k31L20
6170A68n58K83K20k8k91K65k71L04k20j31J98Q8j00R8K52j85J05j79R6j31j03
6191a20J22r5L9J85l77O8J07J64k36j02J68l6P7R2j90J41J35l18J13J21j98L52
6213B12m58L8K22j20m1K55m8n2mNj27Q6M6J11k37QJ18l07K98O5j71J37j60N8K60
6238A94l20O8N3o0M3P4k02j6J31qO6M6k75L06j33j31J87j3J06K4r4q7K63j05j72
6263e5k8PN1K07l04J9j0J64j56Q1j71M18k25l4K20m24L18O4r7J37k43k72K42K01
6287A10j25L7q0k28M25P0m7k30J28l2q2J12J77k02l22J49p3M54j60n8J63n08N52
6310B30r3j07J31l45L04j7J03j81J6L9k11J22K0k04J43l2R1p3J24o3K4j97J19
$$ plain form
6147 -61 -196 201 -43 2 -241 43 176 97 -74 100 71 16 -3 137 187 53 -10 123 72 -51 79 -152 168
6170 168 -390 -107 113 85 -206 59 -212 92 -128 -259 -61 27 -73 25 277 92 197 18 114 -17 -120
6191 -120 2 -93 -54 131 -246 -178 -71 93 -143 -245 -77 -113 -36 56 -134 7 142 -176 -63 58 -140 212
6213 212 -246 -208 14 -106 -147 108 60 8 4 9 -118 -32 14 125 -112 -104 14 -293 5 70 -101 36 -124 -66 194
6238 194 -126 -58 -5 -65 -22 52 -150 -166 -35 -43 23 69 -206 100 -33 -164 23 10 116 140 46 -41 222 117 -55
6263 -55 -83 -76 -25 182 -122 -103 -113 51 -105 -24 -195 223 -2 -36 184 -240 78 142 45 182 -61 -333 -91 110
6287 110 -15 22 -58 -286 139 209 162 -68 60 28 -54 58 235 33 -289 -140 -213 241 81 23 186 -322 230
6310 230 137 30 161 -184 120 103 206 25 41 80 -131 -9 11 -193 -50 -82 9 -64 60 -3 21 -176 -57
6333e7J47j71J04nk04L2J78P5j00L1j08j04N58l65N2M0r6l6L2M6NO2j59q6J15
6358a4r5J77q9J17k45N8MK93k50P1l01L04J24Nk51R8j1L3Q5k83L41k25K64j56
6382E4q5JL37m26J46J31j48O0j04R2o2KM9n8J52L4j96k8P5k47L80k29oJ09K6q7
6408b8Q1l07K35j3J06j94p0J41J2R6r8nJ58k0k49J89j69K25J8o3k53L52m41J59
6432a38k5J15q5J73O7p7j82K02j2m5QM7p9j38L53j82m7J80p8l6l00K71k36L66
6456A22j06p9n5K99l96K96j2j56J25R1j33K06q3j40j32Q0l6O7o6oJ42k04r6K43
6480b9K98j41J17k99J24o5N9L1j11k32J09R6j70J76j01r3L51k04K7k7J44k95K21
6503a4P9j62j45L01j60m6K70j52J03n8Q5R0k80K49k22Q2j15P2J1J41j97L88l20
$$ plain form
6333 -57 90 -81 23 18 -186 -154 24 99 -1 30 -78 -182 376 11 63 103 7 -29 3 49 54 116 -43 -129 -14
6358 -14 -109 68 -21 96 -149 -91 -87 206 -44 27 -274 30 154 159 -92 6 -5 28 113 -170 171 -54 210 54
6382 54 -31 -30 307 -119 27 158 10 70 -34 58 -4 -2 47 -11 141 175 -21 -49 26 -221 159 -70 -76 33 59 -28
6408 -28 53 -254 -19 -32 74 -120 -190 -49 -37 59 -39 -44 114 94 -155 34 -135 90 108 45 -208 144 -297 -138
6432 -138 -163 -48 -133 40 107 30 -152 50 38 -7 1 48 -31 -169 184 2 -45 135 57 21 -279 -8 -244 122
6456 122 16 -63 -118 181 -215 81 69 -87 38 129 -4 202 119 -21 -153 -73 -109 -42 -108 -114 28 -176 -272 -29
6480 -29 269 128 245 -54 70 5 64 95 -16 -248 -139 -43 -213 -37 -138 -231 120 -84 -57 -84 60 -235 -14
6503 -14 65 -97 -242 59 -101 -147 123 -29 74 16 101 191 -89 160 -62 20 -95 -23 -12 129 -68 320 0
6526@J8j74K94p5Oj2j66R5R7J36N8j84k20J62N6J15m36L53l55o4L38J59j22Q6
6550A65j57j76L3J44Q5j70K21k66l2K90j49K6L7r5J40j17N3j10OJ34l5k6J33k4
6574A10j90J56j92O5pJ53l93K04K8l1J09j90J07J14k12K19K61j11l82J22k71K23
6596a08L01j79o9l03M38q3J29j3k41L49Q4l12oJ25k83J35J68j81K6l48L25J47
6618A01k37l3R9j9KP0p0k03R4J88j03K96k55Q9R9n3j05J19k72K91m1q4j58L12
6642A27j54j7O2k71J91Ol2J42j6k2J37j02P6l07J6j4j9J77J39q6j70ll0L27O5
6667B22k15J68J0j50J46k45K35j31m4M4K06k47k11K30l3K6k09J94lk68Q8L62j46
6690B9r4N5K3Q3k04j13J82j87Q9Q4J46L15m15J51j25K92m67K34l6J32j16n2O6
$$ plain form
6526 0 18 -156 138 63 69 57 -109 -14 83 219 277 93 -127 35 91 206 -230 123 -232 -296 42 201 79 165
6550 165 8 -168 -135 9 94 -76 145 -121 -153 137 -12 14 51 -44 96 -21 32 -78 -72 62 27 1 134 110
6574 110 -80 76 -116 -51 -58 95 -298 -94 -66 -97 12 -178 -71 43 -169 50 311 200 -182 -60 -331 -108
6596 -108 193 14 -55 -358 80 -3 126 113 -128 221 305 -7 -13 112 -171 -36 132 -49 -23 -371 -46 101
6618 101 -136 -169 -70 -89 -87 -17 -87 -290 -196 -8 -111 185 -70 19 118 65 -40 79 -193 98 57 -27 -185 127
6642 127 -27 -44 18 -253 -62 -56 -88 54 38 16 153 51 127 -180 -164 -178 -197 -20 119 33 -137 -140 -170 157 222
6667 222 7 175 185 35 181 -64 171 40 -4 40 246 -1 -212 18 -15 11 -198 -4 -7 -275 -187 175 29
6690 29 -65 -10 13 96 -108 -221 -39 -226 -137 -53 93 408 -7 144 19 311 -156 78 42 174 58 6 72
6713G2j57N4lk96O2K88l1j64m2J72k05K06j35K43n2r3k5J48%JJ6j64Q2M0K63j10
6739A70k58O2k80L72j21k29L97k33P9K37k79M0l8J71k03OJ0j24J47Q3K4J00L7
6762A70j59j58nK39L4p9K02n2j69K57l32j5K32j92j6j43L21l27P2R5n6J48k48
6785a81k7L1K72k6p2J05k75K57K2O7k22K08k40J36k37K55j1j25j96N9L76N2m12
6808a84L64j72r5q4J48K17j12J18k30j34K91n0k20L21l10J10R4j08J18J05j59
6829B8o0q9q6j49L75k51K09l4k03L24K1j55J92j17J32m3n9j99J40J61qj77J55
6852A07k29J82j35J48n7J50q7Q7k77J58j38N3J49K12l02k54K68Kk30P2K18j77
6874h0k36L94J44l08M7J75j99K3k04K99K7R4j97K8k5j68k1K0J79k6p9K14k36J62
$$ plain form
6713 72 -85 -31 -34 -330 -268 20 -11 -175 -217 -45 -250 -44 -179 64 12 -81 -106 42 42 43 59 -105 -23 17 280 170
6739 170 -88 -26 -306 66 -55 -284 113 -120 -41 196 -83 -43 -81 90 -113 -107 -97 -221 -74 9 33 133 170
6762 170 11 -147 -152 87 121 42 244 192 23 280 -52 -67 165 -27 -43 -186 135 -192 -120 -25 -81 67 -181
6785 -181 -208 -177 95 69 -3 102 -173 84 106 173 -49 159 -81 55 -182 73 62 -63 -259 -200 176 228 -184
6808 -184 180 8 -87 -171 -23 194 82 200 -30 -164 127 77 -143 178 -132 -22 72 -36 82 187 28
6829 28 -32 -121 -207 -356 19 -232 -23 -57 -260 64 85 -70 122 5 137 94 35 -164 -24 137 129 -48 107
6852 107 -122 60 -75 73 16 166 79 166 -111 47 -91 -38 111 323 21 -233 35 37 -193 -121 97 -80
6874 -80 -316 78 222 -86 -39 136 -63 -40 -244 55 82 176 -21 7 -18 -186 -207 -187 -8 -34 -113 101 -135 27
6898B7r7K05l4j50k4J83k95K90J87m33N0j09L4J27P2j56K76l56K01n1L90l51Q8
6921G4n4j86j28L47p7R6P7m4k64J67K9k31J56Lm3jM1R2J14j31j23N9J20j02j2
6946b1J7nJ45r8j20J64j81j01L74l04J70o9L3m2o7J01K82l03j9J68j24J24k06
6969h2Ro3p8O7K49l48J40l4rQ5J55j42J66o7j20m6j43J60K3J49j6k9l69J38K61
6994E6j50J10J14l08J23j11J37k1J55p2j56L77k97J51l21k5J98K17j69ro9M2k
7017c0q9K8J83Lj12M5J03k29J06J31j61K8%l0J73r8P4j31Plj67L58k53l1j66L15
7043E4Ko2Q6k84K56M0j82K49k03J09p6j09K99m11K05P9Oj11n4k2J99j9k32J82
7067Ap9J9K07j30O9m4j31K9p7N9K24q6j23J05j02j01J54j28J10o8P9L25j61j40
$$ plain form
6898 27 -70 135 101 -49 -73 110 -185 105 292 -141 -91 -200 -166 -39 33 -123 153 -203 -2 -53 337 -14 74
6921 74 20 -166 -294 53 -24 72 149 105 -159 8 37 -194 -38 -35 -78 -79 -38 54 168 37 -86 -27 93 -9 -21
6946 -21 -4 -9 136 38 -82 82 -99 -200 174 -130 40 -29 4 -38 -105 -4 278 -25 -44 124 0 124 -82
6969 -82 -73 -136 -214 -147 102 -246 -106 -140 -149 -64 91 -51 115 48 -72 -118 -261 -101 -78 71 55 26 -343 -205 56
6994 56 -94 16 130 -178 -55 -166 -29 -50 105 33 -123 254 -43 108 -213 -238 -40 177 8 -1 -70 -28 -30
7017 -30 -119 -91 92 95 -17 28 131 -98 8 139 -22 6 6 -24 149 51 125 -6 1 -2 -169 189 -64 -95 -261 54
7043 54 56 -6 80 -204 52 92 -90 159 -44 65 -11 -120 179 -232 -27 52 58 -53 -107 -129 70 51 -181 1
7067 1 -78 -59 148 18 87 43 -88 -59 -136 -77 147 61 -62 43 -59 -160 -6 -134 -24 -92 -13 312 151 11
7091A1R8j02J07j39O0No5kk2L79l39j60J92k16L16j54N4j42K75j37p4K4j1K98
7115B56l20N9j39K73j72l4nM4K61q4k20M47k16j62Q9o3j64M2J92j22QJ45J39m47
7139a93K12Rl42L62k07K50q8J36j09k2j54Q4J31k78K02M1q3j85L4N28m62J9K55
7162A40k79J30k4M5J39m51K03J1j85L48j13J92m85L23q8J10k6K6m2K23m05K88
7184H0J35k03o6N5j34K75p0j88K29k5j15L7q8J71j37jj15J38N4P5p5n2j40K09
7208D9k05J81j83J87K5lj8k72M59k55J36l62L46o1M2l75R9Q5K00k61K20q6j9M5
7232b6k1j03J90j5j00R7k48K11J45k03J61o0j22lo0J41o2N6J63r6j34j47L93m75
7256c18K22M9m15M09n4j60J28K84l07pKK05n9jr1L66l02L4J63j90J25%n47N96
$$ plain form
7091 11 109 7 114 -25 35 40 -25 -27 -49 330 -9 -169 23 -193 123 -31 23 -119 156 19 -55 -31 -42 256
7115 256 -64 -5 -144 129 -43 -77 -82 -38 223 139 -81 366 150 -12 77 14 -150 -108 84 -38 -30 115 254 -193
7139 -193 19 28 -314 48 -159 91 3 139 30 8 -146 -62 69 -209 -7 34 -49 -234 -200 328 -134 -115 140
7162 140 -139 -9 -33 12 151 -300 -97 -86 -271 77 -36 156 -329 -6 -94 16 -10 16 -26 197 -208 80
7184 80 215 12 -54 1 -133 142 72 -116 113 88 -27 10 -78 93 -44 -45 -160 -22 32 107 32 -20 -160 49
7208 49 -156 25 -158 29 54 51 33 -239 220 -35 101 -261 85 24 66 -309 -210 -125 75 -186 34 -52 -71 -26
7232 -26 -47 -150 40 25 -75 22 -226 -15 130 -73 88 28 -94 -97 -157 -16 -78 -22 141 45 -89 -236 157 -318
7256 -318 -96 -47 -462 -53 -107 -267 -139 145 -162 -169 -167 38 -21 -22 -113 253 -49 -15 148 -42 83 83 -464 132
7280A32q3j08K4J55k06K36j16Oj68K43j17p7R5j00J57j41LK27o1m9j03M0K16k27
7304b2kj06R9j46P8J61j27P2J8Qj75J66L8l97N71n28K78n3K28k59K81j7l39J45
7328b8P0j94J56q1J37k11KMJ71k43j83O49l53J62l4jj67M4K57l02r3J89j12J29
7352c2J08O4M7k45J32M8l32N3J65j93K55J49j2l99K75k69J26p5K13j53J16Q0j00
7375B1k95L34l6j80J33NM0J8N0M5j46j47L74r4J12l67K47q9j37K70l56J5QK09
7399C4N4k46K9QK80j26j2j16M6p1N5J38j34l4J33j02j17J91J1j44Q5K22k43j62
7423b21J81j38K48j10o4j57M06k90J76o1M2j92K91j80P5O8l93N03Q7k64j01L48
7445B54k41J24n8n2J50j52J33j84oK00k52R3j8J08k26K93l03J15p3J25o5N1L2
$$ plain form
7280 132 49 -59 -35 120 -86 150 34 40 -128 115 -2 -79 16 -84 73 -68 -65 162 101 52 -51 -11 205 -22
7304 -22 -24 -130 -31 -177 -99 62 -65 7 25 33 -142 24 62 -335 236 -292 -14 -67 161 -98 183 166 -173 -28
7328 -28 42 -152 4 -77 60 -151 -149 -145 26 -217 -400 249 -104 58 24 23 -144 -100 157 -145 -238 -49 -161 -32
7352 -32 76 140 187 -58 74 122 -210 -157 8 -185 70 219 207 -192 83 -186 -60 -135 78 -75 41 121 21
7375 21 -274 60 24 -156 -23 -18 22 40 90 135 -11 -158 216 122 234 -133 114 25 -112 158 -198 -183 -175 34
7399 34 88 -158 -129 -121 159 33 21 -95 -49 -120 -65 73 -61 -95 38 -64 -181 10 21 -123 -38 184 -59 -221
7423 -221 -40 -178 70 -40 -104 -261 145 -145 31 -30 12 -180 111 -69 6 74 -319 184 271 7 -94 254
7445 254 13 137 79 27 177 25 158 -26 -32 168 -84 9 -9 99 -127 166 -137 -22 -95 30 -35 16 48
7468D8K8k52K90j91j19M18m5l24kK34k22J25o1J7K9j59M25m26k50J78J27K11k36
7491a57J46o9J66l7L5p0l0q9m0P9L00j16l17N17m87J12J08l9j85L07j11j81M8
7514a10o1P7K2K57n8j35k43L10j31R8j36K1j42L66j03m6j44L57k01J5J4o1R4j85
7538a25K37k77J33O0J98j73k8J2K42m09J18j53J08j31K95p2j48K25K5J03j62l78
7560c00K28J6J70j68M5n6oJ16N5q1j04M5q0J91k26L58k88J09O0j40J23J03k3j72
7584b5Q0K07l44k7P5N6j7k08K51j33K06k53R8oR0k94K44K56k11R0M4j79j00j06
7608b06n6N0J22J9J7J81p8j32Q1l9K05j41j26K10l34J63lJ81k1m0j41J38J03k28
7632g5N2jJ16J61j70J8j23n5R5l39K76j45M2l1K40K7l43O12k45jk58OK39J0k73
$$ plain form
7468 48 76 -176 114 -77 -196 222 177 -147 -149 85 -137 -12 -73 -56 -27 -186 239 -187 -437 -259 -132 79 -157
7491 -157 -11 -80 86 49 84 14 -16 -105 -145 -66 234 118 -199 318 -169 -57 51 12 -173 134 23 -158 -110
7514 -110 -171 -94 -72 185 127 -8 -251 59 -72 26 -110 -89 -231 135 32 -14 -158 199 -2 13 27 -34 60 -125
7538 -125 112 -165 -32 28 226 53 25 37 279 -130 -12 -165 -57 -188 107 35 -113 112 137 240 78 -300
7560 -300 -72 -56 114 -54 -9 -65 -71 45 100 19 -85 -40 -120 71 -155 203 -85 24 84 -56 67 170 147 -25
7584 -25 55 262 -82 -109 -34 22 5 -203 48 -85 121 -132 -34 -40 50 -244 0 256 45 135 179 0 -100 -206
7608 -206 -262 -212 -90 -71 -54 127 49 -83 -2 -41 164 23 -103 107 -227 -64 -67 114 93 53 -88 50 153 -75
7632 -75 -23 -24 92 253 83 101 -22 -77 18 -321 -45 -190 -148 -179 61 88 -255 357 112 111 -147 -141 98 108 -165
7657a65K81J97l43L3J36k29J41j52K9K52n26J6L90j88K0J47j08l1J94k3K7k1j03
7680b6K30k54L5q4K91j01j84K78l05o1J57L4j04J92O5k81J86k90J97j07K87l91
7702b36O7M7J35j35J49R5k92J05K35j41j07K7J01r9O7J01j48k8J33q3j2J86j45
7725B2JM4J5j23j12K81j88J84j50N9k49K29K9J7k66J64k15M04j1k23J08q3K43
7748A80j89L5j66o5K07J1l0r6j08K47J01m0r3j15j2K05l9P3m4j10P9r5j44J77
7772c1K60j95O2L5j18J13L8j33rj79K72p7J17l45Q0J33J58k93r1L89o8pOj17R7
7797I7k92k0O8q8L61j73KK75l21J79J56k09kJ92k28j33R8L93m02J54j42K69r3
7820A41j25m5J50p8j96M57n17M9J62m5l7j12L21k30J13J68o3P5j61o4J04j67M46
$$ plain form
7657 -165 116 313 -30 3 139 -90 51 -101 -72 180 -346 -330 60 -128 -108 39 -69 -100 94 71 98 77 -26
7680 -26 204 -50 -15 -99 192 91 -93 185 -120 -181 -24 10 -94 98 163 -118 68 -222 -25 -132 155 -236
7702 -236 -169 -122 13 -122 27 122 -170 -65 170 29 -78 -51 50 -49 18 119 -29 -57 76 -7 -19 167 22
7725 22 23 67 82 -41 -153 128 -60 124 -26 33 -216 13 42 59 -207 -43 -258 146 135 -88 20 -63 180
7748 180 -9 26 -140 -205 2 13 -17 -113 -221 26 127 87 -6 -121 -133 72 33 106 62 -48 31 -64 -208 -31
7772 -31 229 34 96 131 13 126 164 31 22 -157 115 38 155 -190 -110 23 181 -112 -203 186 118 111 117 0 97
7797 97 -195 -215 -147 -235 126 -47 -45 230 -91 88 244 35 33 225 -3 -136 -38 355 -47 107 -35 234 141
7820 141 16 -29 121 43 -153 304 -213 -164 -2 -47 -84 -196 125 -105 8 176 113 188 27 -37 67 -100 346
7843C46n78M50m7k17j5j34K6N3J91j95Qpk2J94k01J1K86p7k44l8K66m2J11l97
7867b72J78J38K1N4k60J75k41K78J90k38j14Q1m7J73l5J68j60O8j83j46J18K8
7889b6J7J42l1l30N1oJ27K11l7j62k1O8j97K14j3k51J21l9P4Q0p3K33j22k27J30
7914f7K13k5k99K74K01j06l44R5K6o9j89J89R3K0J08O5k51M30l15n9k86K48J59
7937A11K6j02j20K54k05R1j41n8N0M3j10L11j85k1p5O0kj26K62j01j57L07j51
7960c9K73j47K7j00l0L19l64J89j22j01PK27p7j57K21j39J74k03p3P1j23K28R5
7983A56j52O9j9o5r4M7L07k63K9q1K09l44J77K46j07k4r6j96Q3J06l4r4J61M01
8007D22l58k30J52p0r2P8q8J13J24p6k61K00MK9J01O4k9k27J04l00M26j57o9K84
$$ plain form
7843 346 -232 218 171 -46 -61 -195 -169 -116 75 -120 -112 -119 -141 53 -148 -137 149 72 -172 -210 56 14 125 -272
7867 -272 -94 44 65 119 -141 34 -207 71 261 23 -91 -10 -57 116 81 249 89 157 -26 -172 -54 -26
7889 -26 -9 133 102 -228 -177 -183 -56 155 118 -44 -65 3 -194 20 7 -244 -123 -162 -88 -8 -81 152 30 -197 -67
7914 -67 146 121 -178 96 297 191 -153 -58 -32 -101 -290 -101 -8 12 120 185 -66 364 49 -10 -296 -48 111
7937 111 137 35 -85 169 -36 55 -86 -144 -94 -51 -161 150 -35 -56 -131 -71 -73 -199 63 -38 -195 112 -39
7960 -39 234 87 114 14 -16 303 -61 128 6 -95 -88 139 62 -95 126 -13 161 -42 -115 -44 -167 61 156
7983 156 4 73 54 -11 -105 -58 249 -14 15 -66 143 -201 -24 222 115 91 -5 -201 -118 -12 -46 -140 21 422
8007 422 64 -166 -14 -84 -176 -98 -186 -73 51 -25 -286 -86 -82 -53 48 112 83 -144 -40 -340 86 -71 -140 144
8031A44l2J19k34q6jk2J32l54L82l6l8J38j28j67J05j73K24q1J88j53j80L18N
8054G0j86j4J02J42k65K67k51K6J62O4Mk58J54L7j20J02J20j71L5j23J85j73l4
8077a25m8M18l92K15Q4j66M3q9L3J9N1j86J32n0K51k04L4j78M6O8n0O3k58M46
8101A57q8k3J20j42r8j10K11K23n7k50l4L1n3Rj50K69K33n81K84K1n0j04N1M92
8125C61k27N3R9n0j82j52J20L9k06L77j61nl08K64J32q6RJ69n8k18K74n9l46L0
8149a31M68k39n4J58r4k77K49p1N1J02k39j68M08l70l0L19L8k69J19N2O4J2j84
8172h6M2j45J66l8K01k56j54L69J15k36P9K2j95J26j49JK04J7k01
$$ plain form
8031 144 112 231 -3 -89 -90 -112 20 -334 48 12 -26 112 -16 -183 -78 -251 -27 -108 80 -73 -253 65 70
8054 70 -116 -130 -28 114 -151 116 -135 -109 53 117 121 -137 17 54 -66 36 156 -15 20 -103 82 -91 -125
8077 -125 -173 245 -147 68 152 -14 29 -60 -27 -8 43 -143 -11 -61 190 -14 20 -158 -112 -44 -94 -31 -289 157
8101 157 69 46 166 24 -74 -184 27 250 193 -57 -91 -60 -113 -104 -254 15 248 -333 -49 -28 -78 -182 -131 361
8125 361 134 187 286 236 54 -98 22 61 -145 232 71 66 -242 22 154 68 77 246 188 -30 244 185 -161 -131
8149 -131 337 98 44 202 108 -169 80 9 60 162 -77 -245 163 -207 -237 82 120 -149 -30 22 86 98 -86
8172 -86 -44 -189 -23 -61 140 -116 -270 99 214 -22 57 79 -116 10 -139 -138 66 83 -118
8191a18
$$ Imaginary data points
##PAGE= N=2
##DATA TABLE= (X++(I..I)), XYDATA
0@%%%%%%%%%%%%%%%%%%Pj5J6j6J6j6J9k7L2l2M0m8N1n9O6p4Q5r4J06j21J35j50
40g9J67j85K05k26K50k77L04l34L70m09M49m94N45o03O68p39Q21r15J025j156
60f13J313j507J750k074K519l170M224o204J1137m5957o8673J25509P0439q3002
74E691o7925N0763M4320j2995j5924p614k0358J9367M9412j4411p3804J297P9805
87C7624J4591p6704k7075N7910L1565l5688k7693R902J5423J0401K219k4597j8059
100c0181L0922L0996k8749l3216K4151K8864j6759j5149J2985p95j0501J6856
112I424J2692k8630j6932L4253K0135l6232k1677L1565J7122k6897j0079K1318
124F062l488j9131J6956J8959k9858k0531L8236K3491m0260k4988L8114K5461
$$ plain form
0 0 0 0 0 0 0 0 0 0 0 0 0 0 0 0 0 0 0 0 7 -8 8 -8 8 -8 11 -16 16 -16 24 -24 27 -32 34 -40 45 -49 57 -64 71 -79
40 -79 88 -97 108 -118 132 -145 159 -175 195 -214 235 -259 286 -317 351 -388 433 -482 543 -613
60 -613 700 -807 943 -1131 1388 -1782 2442 -3762 7375 -38582 -107255 18254 88693 5691
74 5691 -62234 -11471 32849 19854 3930 -3684 -24042 -4675 44737 30326 -43478 -42181 37624
87 37624 52215 -24489 -51564 6346 37911 2223 -25470 -15568 -145 10256 12475 -12122 -30181
100 -30181 741 31737 2988 -30228 -6077 22787 6028 -9121 3864 3069 -7432 9424
112 9424 22116 -6514 -23446 10807 30942 -5290 -26967 4598 21720 -5177 -15256 6062
124 6062 2574 -16557 399 19358 -10500 -31031 7205 30696 -9564 -34552 3562 29023
136B9023k9623k0220K1099J2686j0701j352M430j0002q43J9815O68k6362l498
149a4880K7856N373k6683p710K0075O322j3317l640M704j892J910O831p184j0933
163a3168J0123J4485j1493j2934J2543J0905j1825n365J3177Q25j3313L600J4851
176A2411o083j5410P350J4218q268j1269P633N167r230M58R847p581j2960J1993
190a724J5847j5540j8778J5639K0205j2887j8165Q890J4371l417o984O39n22K316
204a10R164j455j5363m44J9867L491k0664p015J7867Q708j3857r167O611N866
218C499p74j959n097m454Q040R725r897j3454Q901J6217o738j4982M295J2883
232F205j591p692J030L199j58K305J597n928k784Q501M332j0007n466R216N165
$$ plain form
136 29023 -600 -20820 279 12965 2264 912 5342 -4660 -5503 14312 14980 -11382 -14880
149 -14880 12976 18349 -8334 -16044 4031 10353 -2964 -6604 -1900 -3792 -1882 4949 -2235 -13168
163 -13168 -3045 11440 -53 -12987 -444 10461 -1364 -6729 6448 7273 -6040 -2440 12411
176 12411 6328 -9082 -1732 12486 4218 -7051 582 5749 -3481 -3023 6824 -757 -13717 -1724
190 -1724 14123 -1417 -20195 -4556 15649 2762 -15403 -6513 7858 4441 -2543 -1904 -2426 -110
204 -110 9054 7599 -7764 -8208 11659 15150 -5514 -12529 5338 14046 189 -8978 -2367 3499
218 3499 2725 766 -4331 -8785 -745 8980 -917 -14371 -5470 10747 4009 -10973 -6678 6205
232 6205 4614 -3078 -2048 1151 993 3298 4895 -1033 -3817 4684 9016 -991 -6457 2759 7924
247G924q527m886O421K112n481j74L596k972k782M810J670n914q18O567O88o088
263c854J183N255j500l176L109K528l411r87M251N82m570K40M433p65m608O58
279f32L714k061l404J903J595l020o89L001r19l775K282L651l076l443L885L458
295B470l181k415L459K111j797r06J760J23m96J143N50l135J70L589R4m955n62
312a978M198K98m734m75K845L00k418k31J205q27K43J387j095k118K616K309j924
329c99k077K410L057j986j897J526K058r22j154Q91J35n17K51M50j556j127J862
346A005J16k806m29K615l74k715k41K238K64j844L07J219l0l6M59j74k25J255
364F04J065j006r46J357J848j016j527J36J574l77r22k62m23l20O61J09k291q12
$$ plain form
247 7924 -603 -5489 932 3044 -2437 -2611 985 -1987 -4769 41 1711 -4203 -5021 1546 2234 -3854
263 -3854 -2671 2584 1084 -2092 1017 3545 134 -853 3398 3980 -590 -350 4083 3318 -1290 -632
279 -632 3082 1021 -2383 -480 1115 -1905 -2594 407 -512 -4287 -2005 1646 -1430 -4873 -988 2470
295 2470 -711 -3126 333 2444 647 -259 1501 1624 1128 2271 2821 -314 -144 3445 3539 -1416 -1978
312 -1978 2220 2518 -2216 -2691 154 454 -1964 -2195 -990 -1817 -1574 -187 -1282 -3400 -784 1525 -399
329 -399 -2476 -66 2991 1005 -892 634 2692 1770 616 1507 1642 1125 1376 1826 270 -857 1005
346 1005 1121 -1685 -2114 501 127 -2588 -2829 -591 -327 -2171 -1864 -645 -675 -711 -252 -426 -651 604
364 604 1669 663 -283 1074 2922 1906 379 515 2089 1712 790 528 105 -215 446 555 -1736 -2548
382b548K148R88k417j494J575J522l04j051l77O75J991K11j163j149J478K090
398B175N3j917r24J937K117j163k616m76K161J820j905l192j36L123J203l185
414i25l005J821L099l93k835j158J271K602Q93k730k278K623M091l00m229j333
430b786M206L836k969m585R97M839Q70l998k223J608K144O45k297l046R4L738
446A073J598m277l798K503N207l21n501k009M843M387k910m442Q14M669J449k556
462G29j906N5K768K228j282l697q89M009K986l356n413J186N862J192o490l341
478e359M775L772l141l640L94K412O98M13j109k968Q59N320J706n680l936N811
494C27O335l499p325J680P002Q24n369k479L127J995j16j393k669j190L310K988
$$ plain form
382 -2548 -400 588 -1829 -3323 -1748 -226 -530 -1581 -1958 -1283 708 919 -244 -1393 85 2175
398 2175 2228 311 -613 1324 3441 2278 -338 -814 1347 3167 1262 -1930 -2066 1057 2260 -925
414 -925 -3930 -2109 990 597 -2238 -3396 -2125 477 1370 -1360 -3638 -1015 3076 2776 -1453 -2786
430 -2786 1420 5256 2287 -2298 -1301 3538 4408 410 -1813 -205 1939 2584 287 -2759 -2665 1073
446 1073 2671 -1606 -5404 -2901 2306 1985 -3516 -5525 -682 3705 795 -3647 -2833 1836 3285 729
462 729 -1177 -1122 1646 3874 2592 -1105 -1994 2015 5001 1645 -3768 -2582 3280 4472 -2018 -5359
478 -5359 -584 3188 47 -3593 -3199 -787 -89 324 -785 -3753 -2894 2426 4132 -1548 -5484 327
494 327 6662 3163 -4162 -2482 4520 5344 -25 -2504 623 2618 2502 1109 -1560 -2750 560 3548
510C548k708o346R06P363J835q028m284O439O446l478p082R39O809J668l825k758
526b556J519K767J599j102k934j565L452M559k353p167q2Q296J968q426m571O084
542e12N762m471n768J673L414O58j196r76j360j79M208K452m999m362N236P099
558F679l648p729J425P909J188o252k519L510K784o48k745j409J87K462K032k737
574D89m754O57N636J684o278m270M994O168k917o350K06O638K297m566l317K505
590a178L846R9k355j362K91K320K494j998n037N26O100J357o417l619N196M159
606D422m012m462J398M104l35k900o42R67Q19O20M42j903j009K636K742k241l278
623b632J871L600k98k924l84K099J171r55j531J33M51L46j41l87j542l8J429N93
$$ plain form
510 3548 840 -5506 -4600 2763 4598 -3430 -7714 -1275 5171 1693 -5389 -4450 2359 4027 202 -2556
526 -2556 -1037 1730 3329 2227 -707 -2272 1180 5739 3386 -3781 -3863 4433 6401 -2025 -6596 -512
542 -512 5250 779 -4989 -3316 98 756 -440 -1416 -2776 -2955 1253 3705 -1294 -5656 -420 6679
558 6679 3031 -4698 -3273 4636 5824 -428 -2947 563 3347 2699 -46 -1455 -1268 1194 3226 489
574 489 -4265 -3608 2028 3712 -2566 -6836 -1842 4326 1409 -4941 -4735 1903 4200 -366 -3683 -1178
590 -1178 2668 2767 412 -950 -659 1661 4155 2157 -2880 -2354 3746 5103 -1314 -4933 263 4422
606 4422 410 -4052 -2654 1450 1115 -1785 -2427 -1460 -641 -21 421 -1482 -2491 145 2887 646 -2632
623 -2632 -761 2839 2541 -383 -767 1332 2503 1548 17 150 601 947 806 419 -1123 -1161 268 861
641H61j853j479N75K690m35k116n58J712J681r01j811P70J787M30o81n58j56R50
659I08J076k15j907o96K519J004k199k155J109K209n19k522l85J395R08j175j121
676a766J44O42Q62k49j029n6J152J324j081p83O00J546J06q21p35R10P81j04p84
695F59o96M77M25J16q91m18L91m5M5o12o30O7N96L7q08j59L23J048k35l75l24
716a009R69M93j36k82l6O77O99o8q51J18N36M33p70r04N35L49k99q31k68J38O30
737A23n11r29j26Q78J15m04l38K98N63K64n62j86P04M57K14m54L6Q40R1m00l85
758B88L58N06m8p96o4j2M90j34j199J40L61k60k68p01M72L94l18m08K54M58J92
779b95j72K86M8L14M92l66l85O49M67l32q3JL53j23k38l07O9L04k68r07k5L39
$$ plain form
641 861 -992 -2471 -1896 794 359 -1757 -2315 -603 1078 177 -1634 -864 923 1353 672 114 -42 908
659 908 1984 1769 -138 -834 1685 2689 490 -1665 -556 1653 1134 -1388 -1773 -378 530 -645 -1766
676 -1766 -1622 -980 -118 -367 -1396 -1452 -300 1024 -57 -840 -240 1306 1412 591 -144 766 1547 1443 659
695 659 -37 440 865 981 90 -328 63 18 63 -549 -1179 -1112 -516 -479 -1287 -1446 -1123 -75 -310 -685 -1009
716 -1009 -40 453 317 35 -1 676 1375 1307 456 574 1110 1543 773 -131 404 753 454 -377 -645 -507 123
737 123 -388 -1317 -1443 -565 -450 -854 -1192 -894 -331 -67 -629 -815 -111 346 560 106 142 982 1073 673 288
758 288 646 1152 1104 308 244 232 722 588 -611 -471 -110 -370 -638 -1339 -867 -473 -791 -1199 -945 -487 -295
779 -295 -467 -181 -133 181 673 307 -78 571 1038 706 623 624 977 854 616 309 378 682 414 -493 -518 -179
801a79j29l68l17J93J83j5m72K67J79Q3P6J40j16N62L35j77j9K34L88J11k56j07
823E96J6M87m53j86j02N2j37k01n18J67j25J00l91k19J35K21k25k91L72K40L65
844i7j89O0j65M32M87K79n84J21N77L65n35k89M4K18J65l74l70O2j15K94m22o61
866f97j24M73L72j065l74N42N92Rn14j01M64L57J58k83JO58P55n91n58L06Q73
887A253M7q97k09M57n4J28n56l22j45O00n6q40r79Q08J120o47j296N89R77k41
907b63l61J1M11p2M91K80o69k79J161R42p64j299Q82J075o5j501m4N64L65m64
927D01o62j25k15O57J59j236n31P40J102n07j233j8J107Q38j89j209k4J538J039
946A632j417r44J217J223p47r61N03L16k91l7K31q41l61R28Q79j669j731J585
$$ plain form
801 -179 -308 -676 -993 -800 -617 -632 -1104 -837 -658 -575 -499 -359 -475 87 422 245 226 460 848 959 703 596
823 596 612 1099 646 460 358 410 273 72 -446 -279 -404 -304 -695 -914 -779 -558 -783 -1074 -702 -462 -97
844 -97 -286 -226 -391 41 528 807 223 344 921 1286 751 462 506 724 889 515 145 207 92 386 -36 -697
866 -697 -821 -348 24 -1041 -1415 -873 -281 -272 -786 -887 -423 -66 92 -191 -190 468 1223 632 74 380 1253
887 1253 1300 403 194 651 597 725 169 -153 -298 302 246 -594 -1573 -765 355 -292 -1588 -999 -22 -263
907 -263 -624 -613 -202 -274 217 497 -172 -451 710 1652 888 -411 471 1546 1481 -20 -64 500 865 401
927 401 -261 -386 -601 56 215 -1021 -1552 -812 290 -217 -1450 -1468 -361 477 288 -921 -945 593 1632
946 1632 215 -729 488 1711 964 3 506 822 531 494 725 -116 -477 451 1330 -339 -2070 -485
964d85K028j808k155J372J955j048j598O80Q77l45J2R61k03j017Q22J539p96j569
982g78M68K177J33k289m20J807L51j299p20M37O56Jn96o33k10K81L89n2m76l62
1002a135L77J282j98j667j37K240Q88j999j130K030J477j454j231J314P59j127
1018B89q5R72n60j412O98J840j484k141R99K744j809k662J565K103j322j586O49
1035a202J491q55l99J322m48q89R03J203m75j500O09J810N6j614o09J542O31j114
1053D62q43K43N31K01p25n37J66L97P8o87J58j65j32M14P29j199n22J386Q85r24
1073h4j401J649J778j392j446J375J113r63o83J041L3j333M60J436j310j742J024
1090d45J793j281k000J095J375n99j057O24L74m88l65R94k87l44L94J424j179
$$ plain form
964 -485 1543 -265 -2420 -1048 907 -141 -1739 -1059 -182 -527 -515 446 243 -774 48 1587 791 -778
982 -778 -310 1867 2000 -289 -709 1098 1449 150 -570 -133 523 524 -72 -705 -915 -634 -245 -297 -773 -1135
1002 -1135 -758 524 326 -1341 -1478 762 1650 -349 -1479 551 2028 574 -657 657 1416 289
1018 289 204 1176 616 -796 -98 1742 258 -1883 -884 1860 51 -2611 -1046 1057 -265 -1851 -1202
1035 -1202 289 -566 -965 357 -91 -980 -77 1126 651 -849 -240 1570 1626 12 -597 945 1576 462
1053 462 -381 -138 393 594 -131 -668 -502 -105 -27 -714 -556 -721 -853 -439 290 -909 -1431 -45 840 -84
1073 -84 -1485 164 1942 550 -896 479 1592 629 -54 987 1020 -313 147 1583 273 -1469 -445
1090 -445 1348 67 -1933 -838 537 -62 -1119 -495 -121 -609 -974 20 -267 -611 -217 1207 28
1107B8n74R05Q87n80j041P98L66k43j61K90p70J99O39j60j233k9J167m61q30l8
1127h41Q12n21j97p5L67n60K52J160l43q38N31J183q07o63P31Q99n60o12R89o0
1147H47n81M9N85m05j008O60O31q34r37Q44L75p06n56O06K00r11N97N41o96l76
1167a075Q71N14n98m38R00N88p61K18O78j73n71N01L16o06n41J019k56r93J01
1186c06P75j13q92p2N36m72k26N23Pn47J92K95K02m88K91N58l80k78N26Q04p06
1207B29r7P80p2o73J22N63n31m50L29O15r57k34P26nr21j41R64n96p58L73P94
1228F0m31m29K93M52m53rP35J52o05L44N08j30m17M05M34o46k73M70N10j030K5
1249c5M06j11o71J94K58k52o90O37j59m17J35M88k06l66M19Q78q56p8M15N92o03
$$ plain form
1107 28 -546 359 1246 666 -375 423 789 546 385 675 -95 104 743 583 -650 -679 488 27 -803 -841
1127 -841 -29 -550 -747 -822 -455 -1015 -763 397 54 -784 -253 930 123 -540 191 1090 530 -82 907 847
1147 847 266 315 900 495 -513 147 778 -56 -993 -149 226 -480 -1036 -430 -230 -1141 -544 -3 -699 -1075
1167 -1075 -204 310 -288 -726 174 762 1 219 897 724 153 654 970 364 -177 842 586 -407 -306
1186 -306 469 356 -536 -608 -72 -544 -770 -247 -240 -787 -595 -300 -98 -586 -295 263 -117 -395 131 935 229
1207 229 132 912 840 167 289 852 321 -129 200 815 -142 -376 350 345 -576 -717 247 -349 -1107 -734 60
1228 60 -371 -800 -507 -55 -508 -517 218 370 -235 109 617 487 70 475 909 263 -10 460 970 -60 -35
1249 -35 371 260 -411 -217 41 -211 -901 -264 -423 -840 -705 -217 -423 -789 -370 508 -348 -426 -11 581 -22
1270b2K09N36j53n25O7Q21j56l89R5L84q59p3L42J29p48r8M36j6q30L77J67j37
1292d43k77K00L70m39n8N47J25k46K87K74m7l68L99N21n64M2L79O5o59j8N15m3
1314E62o10l7P4q5l21J74Rm08R4L18k60Q1k5K33j90m5L95K75m00L87J17J82l94
1337A26K34L20m54K06M9J80j74k39j9L4k99Jq4J15l36l7l8q8j93L36J11j18o6
1360d33J08n2M35j06J16K48J19k29J81nm4K00N5l65k5K07j24q8r7O3k26K9j2j13
1384a58l20Q0J92k04k77K51J67L4l68L55jP0J71%P0J5K63J39J38l18j12N94j64
1407F17n38Q0K07J17k69m60J48J09Lm16k60M65j62l4J43k41j53K72K20Ol06L03
1429a49L10L65o17L8N40j8k45k58L79K60j29Kj20k1m48K56J32m99k39K71M21o19
$$ plain form
1270 -22 187 723 570 45 112 933 777 388 483 867 8 -65 277 406 -342 -440 -4 -20 -850 -473 -306 -443
1292 -443 -720 -520 -150 -589 -647 -100 25 -221 66 340 293 -75 324 845 281 323 702 767 108 90 605 562
1314 562 -48 -85 -11 -96 -417 -243 -234 -642 -548 -230 -490 -409 -434 -201 -391 -436 -41 234 -166 221 338 520 126
1337 126 360 680 226 432 481 661 487 248 229 263 -36 -35 -119 -4 -340 -377 -415 -503 -696 -360 -249 -367 -433
1360 -433 -325 -377 58 -48 68 316 435 206 387 382 338 538 593 228 203 410 286 198 101 164 -62 -33 -45 -158
1384 -158 -478 -398 -206 -410 -687 -436 -269 -235 -603 -248 -249 -179 -8 -8 62 77 340 479 617 299 187 781 617
1407 617 79 159 366 483 214 -246 -98 11 14 -402 -662 -197 -359 -393 -250 -491 -644 -372 -152 -146 -452 -149
1429 -149 161 526 -91 -53 487 469 224 -34 345 605 476 478 358 337 -111 145 277 -222 -461 -190 231 -388
1451c88k04l4M00J60n99J63K46L11k14j28N12r8j71K46L24l11r9M13N07o44n62
1472a70L27M43k64q24N79M72l57o63J84M73m99m19L19L22l53m48O83K6k46o3N56
1493G8J72m42J22M35L63n57k69O73m7l55j80N00j48l2k8j2k90l7l95L73J68o38
1515e46pR3J79m91J39M99K38m29l34P31L14n03Q0L33l7P8j21O34j88o67J71O11
1537G77j84q86K89P81m48p47J80L17l95l50J48N30o19J31L44j86k25N0L00J01
1557i2l38P5O76j9k53K01J17J73r6p6n3N2kl69J43m8O6q6k9l1m76L31Q7k36L1
1582b52n42N21K45l82k58K90N75m30r8M89K23j41n6N16l08q2R8J68j51m23M2O97
1604G41m72p30L15L12k30l09K57k40l31L0M89j35k80K28M03l26k30L66O2M2J75
$$ plain form
1451 -388 -592 -626 -226 -66 -665 -502 -256 55 -159 -287 225 127 -44 202 526 215 116 529 1036 392 -170
1472 -170 157 600 336 -488 91 563 206 -457 -273 200 -299 -718 -399 -77 -430 -878 -195 -169 -415 -478 78
1493 78 250 -192 -70 365 728 171 -98 575 528 173 -7 493 345 313 285 273 -17 -54 -449 -76 92 -546
1515 -546 -553 -460 -281 -772 -633 -134 104 -325 -659 72 386 -117 -37 296 259 337 216 850 662 -5 166 777
1537 777 593 -293 -4 777 329 -418 -238 79 -316 -666 -518 12 -607 -476 -132 -318 -543 -493 -193 -92
1557 -92 -430 -355 321 302 49 250 367 540 444 368 315 367 365 -4 139 91 157 71 42 11 -465 -134 -47 -283 -252
1582 -252 -794 -273 -28 -410 -668 -378 197 -233 -331 158 381 240 184 700 392 310 408 576 425 2 44 741
1604 741 269 -461 -146 166 -64 -373 -116 -356 -687 -657 -168 -303 -583 -355 48 -278 -508 -142 -80 -38 137
1625A37L05m83K51J43J09j82m5K78j57J71n59J64J49l30L2J8J15r5k37p0l28J99
1647d15K82o7l24K84M27m35j05L74J62k03o6O69l89j74M02J21J58n42J75L55m25
1668B64m50L67J6l44r3J93L62r47K58L71j93l58K08J36l59R2L73j48J0L50J50
1689B58j7l1L69j74p2R8n0p3J22k92L73k38j97Q6J78n43k0O3J14k25R3J66j46
1712a58l88J84L56m30l7L14J24K6l52P39n8l49J27N19j52j55J12M9j58l74Q5K86
1734C10j92j04J81l96j03J25J88k04l68L14j60L6J15K38j17l28K98K36n0l1J10
1755I8L57l97K35p7K56j34Q6N4p4m32J74K94n10k16K02K11n58j04L92j86q4J00
1777c13j5j31J47K56J69k13l5N40l97q3L94j20j13K76j0L49j93l35rK18k37j33
$$ plain form
1625 137 442 -41 210 353 462 280 235 513 356 527 -32 132 281 -49 -17 1 116 21 -216 -286 -614 -415
1647 -415 -133 -200 -524 -240 187 -248 -353 21 183 -20 -86 583 194 20 422 543 701 159 334 689 264
1668 264 -186 181 197 -147 -240 -47 315 -632 -374 -3 -196 -554 -346 -210 -569 -477 -104 -252 -242 108 258
1689 258 241 210 579 405 333 431 381 308 430 138 511 273 76 162 340 -203 -223 -160 -46 -271 -178 -12 -158
1712 -158 -546 -362 -6 -436 -473 -159 -35 -9 -361 378 320 -29 98 617 465 310 422 471 313 -61 24 310
1734 310 118 14 195 -201 -304 -179 9 -195 -563 -249 -409 -373 -258 -20 -137 -465 -167 69 19 -12 98
1755 98 455 58 293 216 472 338 424 478 404 -28 146 440 -70 -286 -84 127 -431 -535 -143 -329 -413 -313
1777 -313 -328 -459 -312 -56 113 -100 -135 405 8 -75 319 199 86 362 352 701 508 173 164 382 145 12
1799A2L74m34m45M08N01o89l40L89K9j05j42M0J34p1N6M15j32m16P89r1j50j55
1821b3K47K05j52j09N28m52l11K17K37r3l21K40l32L32m69L7J5j05L13q2l61K90
1843a49q4R1k52L26K21k15m5J73L04k00j56L56L8k10J3J66j9j41k6L14m09k73
1865a77K07m5k13j08L09n1m59J72J8Q2k25J66L00j23R0K63jl9k82K58R4k68K34
1888B02k9J86J66l02K37n36J18K19q7k83n1M71k17j96n7K35l60k86K30K76m39
1909e03k8L85n0Q4k0L05K66m36L63J8J86l15j6J0K55l56j02N9n6q8J7J43k41L9
1933h1k01J20J09m26L53j37j2q3J97K32K2k21r0N27j99j8N7L9m7P9n1K99l15j85
1957c2K57K31m4m36MJ75k37rk30J98j1L9k48K39j5m09K25K85M1m38K44L12k21
$$ plain form
1799 12 386 -48 -493 -85 416 -273 -613 -224 -195 -300 -442 -402 -268 -339 -283 132 0 -416 373 282 132 -23
1821 -23 224 429 277 168 696 244 -67 150 387 294 -27 213 -119 213 -256 -219 -204 -309 4 -78 -439 -149
1843 -149 -233 -142 -394 -68 153 -62 -107 66 370 170 14 370 408 198 211 377 358 217 191 505 96 -177
1865 -177 30 -15 -228 -336 -27 -78 -537 -365 -347 -265 -490 -324 -24 -147 -57 206 205 166 -116 142 236 -32 202
1888 202 173 359 525 223 460 -76 42 261 174 -109 -160 311 94 -102 -159 76 -284 -570 -340 -64 -503
1909 -503 -531 -146 -196 -112 -132 173 439 3 366 384 570 255 239 249 504 148 46 105 49 -39 -22 121 -120 -81
1933 -81 -282 -162 -53 -479 -126 -263 -275 -358 -161 71 93 -128 -218 309 110 92 149 188 141 220 169 468 153 -32
1957 -32 225 456 412 -24 -20 155 -82 -91 -321 -123 -134 -95 -343 -104 -119 -528 -303 -18 23 -415 -171 141 -80
1980h0Q1J75J61k10L0k70M81j08k66N22j01k26q0l7R1j34j83K19lp8k54M5j6K5
2004b16m3J41Ol83J51J50L26K5k49L40k06j13K49Q1Pk8j14K86l12o6J82n9J7j88
2028a6k6q4J20k13j60L1L10j11n0K10P6j06j12k3Q2J02j46L37j32j85K37M07l45
2051B03m3J13J31M1n15K89O3k10k46J07P8l80J79K05m5n28J63L48q0j91Q7K64
2073C3j52r6K23l0j20K66R8j2NN4r8O9o2m4J69l9k3k29O1m3o1j16k65J29Q8m7
2099b42l31K57P9j64M2N0L96n8j44J37L98o24J13M60J38m63J16K4j06K0K59J93
2121E50n72j06O41n69K7k73K67p3l88L41p3j32J12Q2nm8k4J85l25M69J08J16l46
2144c6P7J07J43k92M01j03j16L2q4P9k36N5J29j69l3oJ86k43p5K49r1l48L5K10
$$ plain form
1980 -80 1 176 337 127 157 -113 368 260 -6 516 415 189 109 72 163 29 -154 65 62 -16 -270 -225 -241 -216
2004 -216 -259 -118 -112 -495 -344 -194 132 157 -92 248 42 -71 178 259 266 238 124 410 98 32 214 155 172 -16
2028 -16 -42 -126 -6 -219 -379 -348 -38 -149 -199 11 87 -19 -131 -154 -72 30 -116 221 89 -96 141 548 203
2051 203 160 273 404 445 -70 219 282 72 -174 -67 11 -369 -190 15 -30 -558 -395 -47 -127 -318 -231 33
2073 33 -119 -215 8 -22 -142 124 222 210 215 269 171 240 178 134 303 264 241 12 73 30 -31 -147 -412 -283 -195 -242
2099 -242 -573 -316 -237 -401 -359 -309 87 29 -115 22 420 -204 -91 369 507 44 160 184 78 98 357 550
2121 550 -22 -128 513 -56 -29 -302 -35 -108 -496 -155 -228 -360 -248 -166 -171 -219 -243 -58 -383 86 194 310 -36
2144 -36 41 148 291 -1 400 297 181 213 129 208 -28 27 156 -13 -46 -52 134 -109 -184 65 -26 -374 -339 -129
2168a29j21r3M6L28o0L3NK58j06k13L41j8M5k75J72N5k12J31K52m77j53l2K88
2191F5j54l16J58O8n9K7J56j44j76M31j86l13M35Q4Kk25O7L50l9j60K53J35k94
2214A65m3J91K1k12OK34j12l13K1P9J80o35M08o9K0l50J65J91k22j38M59J73k45
2237b6k72M31j39j29N72k29j00R0L23l46L6L6J25l65j04J4J34M1l58J27K2l08
2259d25O6L06q7l14J83L94l17j09M6J94O3j88J39K81l2k82M36l28n4L4J96%j24
2282G8mR4l31k1L28K8m10K13k8k8M6j95K38k52L9m0l0j72K38K09j82J47j7J92
2306A40r5rK81k71K14j11n5J21q3j19L25k43O7j26k7l42J33R9j01p2j77J12J14
2329b25Q6j09K81k74N7M42j82P5K23l68M2J78L11m45J69o0J26j24K90m41K12l18
$$ plain form
2168 -129 -250 -343 -297 31 -29 4 9 267 161 -52 289 271 316 41 213 268 56 187 439 -38 -191 -223 65
2191 65 -89 -405 -247 -179 -238 -211 -55 -199 -375 56 -130 -443 -8 76 78 -147 -80 270 231 71 324 459 165
2214 165 122 313 334 122 128 362 250 -63 -42 37 217 -418 -10 -79 -59 -409 -244 -53 -275 -413 46 219 -26
2237 -26 -298 133 -6 -135 437 208 108 198 521 175 211 247 372 7 -97 -83 51 92 -266 -139 -117 -425
2259 -425 -359 -53 -140 -454 -271 123 -194 -303 -257 -63 0 -188 -49 232 200 -82 354 26 -28 6 202 202 78
2282 78 74 168 -163 -184 144 172 -238 -25 -53 -81 -35 -230 8 -244 -205 -245 -275 -447 -209 0 -182 -35 -52 140
2306 140 45 36 317 46 260 149 94 215 132 13 338 95 162 36 9 -333 -200 -101 -202 -274 -451 -339 -225
2329 -225 -139 -248 33 -241 -184 258 76 151 374 6 48 226 537 92 261 201 327 203 493 52 264 -54
2351e4r3J88L3j48Q1K15l81J87P8j26l35o3N0L34k00R0M11k49k6J96j44k9RN5
2375G9M66l87J91m15M70l97j31K08j48j28j63M33l15l5K53j91J20L0j45k02K14
2396a93J98n7J38k0J7j08PK53k45J23j90K40J08k29pJ41j36q6O8k07J40Q2k16
2419a79N1om0m0J75L3l24J39J02P8R4oM9l40K11j5P6K29L1k17K0J86j58j12K65
2444C02q3%j55J59k98J5L4j40K07j0p7prq5j26Q5j6R0m2K18r4J51j10K24J16n6
2470B93o2j09R7j29m5P1L3k93K30L2m27J51K12j02J37j88n2L13k46m34M61m8M9
2493e6J10j05Q5L2j70r8K85J67k40K41r8O7j82J08n8J68l8J22j06q1l66K40n1
2516b4j58K9L16Jm01M3j78L12j90K48j93J40O9P3nJ7K42j90j38K10k66J22j2l8
$$ plain form
2351 -54 -147 41 74 -74 7 222 -159 28 106 -20 -355 -418 -368 -34 -234 -144 267 18 -8 188 44 15 24 79
2375 79 545 158 349 -66 404 7 -124 84 -64 -192 -355 78 -237 -272 -19 -210 -90 -60 -205 -407 -193
2396 -193 5 -52 86 66 83 -25 -18 235 -10 113 -77 163 271 42 35 176 40 -46 22 -185 -45 37 -179
2419 -179 -128 -134 -174 -214 -39 -6 -330 -191 -89 -11 83 77 126 -214 -3 -18 58 287 318 101 121 307 149 37 302
2444 302 219 219 64 223 -75 -60 -26 -166 41 31 -46 -53 -62 -147 -273 -188 -204 -114 -156 62 -32 119 9 233 349 293
2470 293 231 122 219 90 45 116 149 -144 86 118 -309 -158 54 -48 89 -99 -151 162 -84 -518 -57 -105 -56
2493 -56 54 -51 34 66 -104 -202 83 250 10 251 153 220 38 146 88 256 218 340 234 153 -213 27 -24
2516 -24 -182 -153 163 164 -237 -194 -372 -60 -250 -2 -195 -55 14 87 82 99 341 151 13 223 -43 79 67 29
2540B9J19J00k51O9N9p5j18j03O0l0j56M59l97o7L98l0k28j77L54J43l78R1J53
2563B4J51L23k30j3m7PJ85j48j69QQ3Mj17j68K29k71q7J64lj6j48P0j98K57m8
2588a58K3k06J88J87N1P9j33K29k16n5R8J65j84K19k86O3m3mJ47q3r0k4K07l68
2612a94P2JP6j47j10J32J9k41M05k28J41q4L8K59j05J30j97L13k08r7K83J01k09
2635A50k80N28m4k63p1L3j5k00J51l1L7j23J8J12j88r5L31k37J36J1o2O5L7K58
2659B58k70q3P0K58j91J9R8p4j88J83J67J3k42l2L13j66k54L26k34j55m49M68
2681a65p4mN1l9K35m06K35Q8J65j32k3J9J18q3J89n9n5K65k15J69l26L17l42K05
2705A33j60P0M6j71j55K05J52m14J42k8J67k23L29J58k58j66K74J8j51L1J78L4
$$ plain form
2540 29 148 248 -3 66 125 50 -68 -171 -111 -141 -297 162 -235 -302 96 66 -162 -339 15 158 -220 -129 24
2563 24 175 498 268 255 208 215 400 252 83 91 174 178 61 -107 122 -149 -236 -72 -75 -91 -239 -169 -367 -110 -158
2588 -158 -135 -341 -153 34 85 164 31 260 44 -11 87 252 68 287 1 64 21 17 164 81 -9 -33 174 -194
2612 -194 -122 -121 -45 -192 -302 -170 -151 -392 13 -215 -74 -158 -120 139 34 164 -33 280 72 -25 258 359 150
2635 150 -130 398 354 91 20 53 38 -162 -11 -42 -5 -128 -110 2 -186 -281 50 -187 -51 -40 -102 -37 0 258
2659 258 -12 -95 -25 233 42 61 159 85 -103 80 247 260 18 -14 299 133 -121 205 -29 -184 -633 -165
2681 -165 -239 -243 -192 -231 4 -402 -167 -79 86 -46 -69 -50 68 -15 174 115 60 325 110 279 -47 270 -72 133
2705 133 -27 43 89 -82 -237 -32 120 -294 -152 -180 -13 -236 93 251 -7 -173 101 119 -32 -1 177 211
2727B11j01J22K4o0k97K65J19l44N2L03l46K9j44J85L1k80K8J31r8J16L2O0kj51
2751a15j11R9J99J34j33j98J33R3O1j05J60k79k7J2K92k3k64J89N6j61k38L8j
2774a89J98j58J16K76m47j40K11p2J92J11j78M1k45L43o8l9K58k38L35m65K44
2795H6J63J54j88q7J38n0N8j60r6J0j0m9r8k03J75O1J77j95r0K02k00K20No8J28
2820H3j95K08N1k16K72j06j98o4Q6J26J65k27K31j7k74m6M86l99k50J59n4L1j03
2843b51K87l09O9L5K96j96j53J9M28m18O0J45R5J07j27P1J4j20P5nm9MJ5N0j67
2868b5k33L65j46j29k57N41l36j02J10R9Q2k59K08j89M95k29j26J96l5Q9J1J63
2890B93k14Q0q1K0J74j89l9J18k13K51k76M6l8P4R0j23nP5k50J01k19L58l35K37
$$ plain form
2727 211 110 232 256 196 -101 164 283 -61 -9 294 -52 -23 -167 18 49 -231 -203 -72 -170 -54 -22 38 36 -115
2751 -115 -226 -127 72 206 73 -125 8 101 162 57 217 -62 -89 -77 215 192 -72 117 173 12 -226 -188 -189
2774 -189 9 -149 -33 243 -204 -344 -133 -205 -13 98 -80 -39 -284 59 -9 -48 210 -28 307 -158 86
2795 86 249 403 215 128 266 216 274 114 18 28 18 -31 -129 -332 -157 -96 81 -114 -204 -2 -202 18 23 -45 83
2820 83 -112 96 147 -69 203 97 -101 -165 -79 47 212 -15 216 199 -75 -121 365 -34 -284 -125 -179 -148 -251
2843 -251 36 -273 -204 -169 127 -69 -222 -203 225 -193 -133 12 107 214 87 158 172 52 127 122 73 77 92 142 -25
2868 -25 -258 107 -39 -168 -425 116 -220 -322 -212 -113 -31 -290 -82 -271 224 -5 -131 65 30 119 130 293
2890 293 79 159 78 98 272 83 44 162 -51 200 -76 -30 -68 6 96 -27 -32 43 -207 -106 -325 33 -302 -65
2914f5j27K43R9j55K37k83J23K2J42k38R3J54k14J01k4q8j3PJ9O2l15J00K84k34
2938g0j12pJ43k2j70L79j81L9j55L51j53j0J51j17K0p8J32Pj50j2K25j51K2j05
2962b4M6o3J48j71L6q7J32n6j26k8J60M6r6J12m11K65N2J06j67L63k23j32r7M19
2986B04j20J08J32k36j1N7l0j16K78j30j2j47J5j56m4J69j45j89L57j46J2J8j06
3009b38J9K09k43N5K63l5k2K7q6J10j33M58l7k70j69M20p9k10l9n8J03J51j95
3032Aj30M5k3j42K06J61m75J71M37l17Q1N2k22P6J34l1l4n4J09M8k41J05J87p5
3056F9P8Oj24k4j01K23j49jl22K52p5K8J74Q8j66k43K30j46K66k5J5k0j7q9J11
3081C8r8k6K89k68K13n5j26K81j62m65O11j10P9ol04J92l9j64K54l5Q5m66P5K18
$$ plain form
2914 -65 -192 51 150 -5 232 -51 72 94 236 -2 91 245 31 132 108 20 7 14 33 95 -220 -120 164 -70
2938 -70 -182 -189 -46 -68 -238 141 -40 -1 -156 195 42 32 183 66 86 8 140 147 -3 -15 210 59 81 -24
2962 -24 22 -41 107 -64 -28 -115 17 -39 -165 -193 -33 13 -83 29 -382 -117 -65 41 -126 237 14 -118 -215 204
2986 204 84 192 324 88 77 134 104 -12 266 136 124 -23 -8 -164 -208 -39 -184 -373 -16 -162 -150 -132 -238
3009 -238 -219 -10 -253 -198 65 30 8 35 -51 59 -74 384 347 77 -92 328 249 39 0 -58 45 196 1
3032 1 -129 -84 -107 -249 -43 118 -357 -186 251 -66 15 67 -155 -79 55 24 -10 -64 45 93 -148 -43 144 69
3056 69 147 153 29 5 -96 127 -22 -23 -345 -93 -168 -140 34 122 -44 -287 -57 -203 63 38 53 33 16 -73 38
3081 38 -60 -86 203 -65 148 93 -33 248 86 -379 232 122 201 195 -109 83 44 -120 134 99 184 -282 -207 11
3105A1j29j17k6L24j24K73n6K14j62j52Q9o5R5j29JK18k94R4p2Q0K01l11J13Q7
3129A63n60M41q3o9r4J66r4J40k11L27j14q6q6J38j4J16o7J9J13j50K03k02L85
3152C81l33J41j96L6p9J19m2j10J04q1J40m3k33L10k00k66O58o45K91P5j68j73
3174c14J32J19Q1k77L89J58j49qn5p8o6J05K43l20L70l65n9K23k84J07k41L65
3196G6k19j39K11K4k9J41m2k01L2K00m7K00j48JK0J6K22j4j38Q4k28q2J63q3m4
3221b4L5j43K66p6l12J95K0Q1j99N3J63j36m4R7m1pR4K22l53L47l20R4L8P0k14
3246i4J48L4n6M8K07k38j65n1O6k4J77K0j35J67m84L21q5K13k77k47K81J59l95
3269d10K48K22j76K78J6K00k77k51K28k24M52p7j04k11J6K47j77J79k37R6q1J0
$$ plain form
3105 11 -118 -235 -261 63 -61 212 156 370 208 56 145 80 175 46 47 265 -29 65 -7 73 274 -37 76 163
3129 163 -397 44 -39 -108 -202 -36 -130 10 -201 126 12 -74 -160 -22 -36 80 13 32 145 -5 198 -4 381
3152 381 48 189 -7 29 -50 69 27 -83 21 -60 80 37 -196 114 -86 -352 306 -339 -48 27 -141 -314
3174 -314 -182 -63 18 -259 130 288 139 131 76 -2 -68 37 280 -40 330 -35 -94 129 -155 -48 -289 76
3196 76 -143 -282 -71 -47 -76 65 23 -178 -146 54 7 207 59 60 80 96 318 304 166 250 22 -60 103 20 -24
3221 -24 11 -132 134 58 -254 -59 -39 42 -157 -104 59 -77 -121 -24 -65 -72 22 244 -109 238 -82 12 50 120 -94
3246 -94 54 88 32 80 287 49 -116 -167 -101 -125 52 72 -63 104 -380 -59 -144 69 -208 -455 -174 -15 -410
3269 -410 -162 60 -116 162 178 378 101 -150 78 -146 306 229 125 -86 -70 177 0 179 -58 38 -43 -33
3291c3L7N2q8k4M2K7K5k15Q8K5J2l43K79K76j88M9J31j5j51L20l35nR7qM8J78
3317B81l9Pk13J3Oo5q4K75k87L08j89N1j01m8K7j37j62L30p4NJ52k1M7j85O9J76
3343A42P7r0q9K1Q0Ok1ok03r4K47j65O3p3J04k12J84l10Q3K98n1r6J51n8j53J6
3369a49K23J16m2m5L43k54O7o9j77n3J13k5M3q1K00q0k53O5Q7j17P9k7j79p5L57
3394F7Q3j09k32K36J49k86K18j4k04J86o1k52J07K41n7O8J24k48j15J67K3O6J45
3417C02n1k56O8J08j30j49Q5Q4m1j53K11j4l58L47N7m76L35J01J30j98N7j19K13
3440A53J03o7J5l22J87j76K59l4j96J19Q7l21R1L1j44K88j14k9o2oK9K76l96K11
3464a8L6q8p2L58j39j09J12K92k53j73K9J31k85L40p9K6pJ68k88J37k73l2L67
$$ plain form
3291 -33 4 56 -32 -56 -14 13 38 -177 -89 -64 -52 -395 -116 160 -28 21 152 137 -14 306 -29 -34 63 55 103 281
3317 281 242 249 36 49 55 -10 -94 181 -106 202 13 64 -37 -85 -58 -195 -357 -27 -101 -96 56 35 82 -103 -34 142
3343 142 219 129 40 61 141 147 126 120 -83 -177 70 -95 -32 -105 -1 -213 -29 -339 -256 42 -9 -105 46 -12 -165 -149
3369 -149 74 190 148 103 446 192 259 190 13 -40 73 48 91 10 210 130 -123 -58 29 -88 -9 -36 -215 -290 67
3394 67 150 41 -191 45 194 -92 126 112 -92 94 33 -219 -112 129 72 140 264 16 -99 68 91 157 302
3417 302 251 -5 63 171 41 -108 -23 61 20 -133 78 64 -294 53 110 -366 -31 70 200 2 59 -60 153
3440 153 256 189 204 -118 69 -107 152 118 -78 41 128 -193 -102 -71 -215 73 -41 -70 -132 -138 -109 167 -229 -18
3464 -18 18 -70 -142 216 77 -32 80 372 119 -54 -25 106 -179 161 82 108 101 269 -19 118 -155 -187 180
3487A80o7l21J09J74L6m58L06p4M4n7j57M10k16J51J14n6pj21R9o9K12j15p2k6
3511A9q6j23K27L07k03r6J8j12J94l95Q6K88k27r2J28%N2J33j84J90k05o4K64
3534A19Qr4rQ9o5k5J2K45m47R4L8J65O7l03J85j4O8j79r4J27j4j9J06P7l59K54
3560C2J89q3o8j50O1j17J55p5J88k28K49k31J50J79q4J69m3O1m55K94k68%J40
3583F5l7j28K43k94J22k03J75j51K28l6J59k44j07K97j06R6k77K30J7N0l8q8O8
3606D1J80j77j27J36o1N1j50J39j59j17K43r6J90j48J78r7O2p7k1K35o3j01k09
3629a48k13J84J20l8K01o7R0J88k65K05j63m7JL9p0M1J69L7j08k24R7j09M4oJ84
3654A42j16k17K58n5j85n5P6K94n4M5k85K70J6o4RJ07j99L8j28K31j38l3J08j82
$$ plain form
3487 180 113 -208 -99 75 111 -347 -41 -115 -71 -128 -285 125 -91 60 174 118 111 -10 89 20 232 117 45 19
3511 19 -67 -190 37 344 141 45 63 -49 145 -250 -164 124 -103 -195 -67 -67 -15 118 -66 124 -81 -145 119
3534 119 127 33 24 113 48 23 35 280 -167 -73 -35 130 197 -106 79 65 133 -46 -140 -13 -27 -46 60 137 -222 32
3560 32 221 138 70 -80 -19 -136 19 -56 132 -96 153 -78 72 251 167 336 293 354 -101 193 -75 -75 65
3583 65 28 -100 143 -151 -29 -232 -57 -208 20 -16 143 -101 -208 89 -17 79 -198 32 49 99 61 -27 41
3606 41 221 44 -83 53 -8 43 -107 32 -127 -244 -1 -97 93 -55 123 26 88 11 -10 225 162 61 -148
3629 -148 -361 -177 -57 -95 106 39 129 317 52 257 94 47 48 87 17 58 227 264 156 -68 29 -80 -36 -42 142
3654 142 26 -191 67 12 -173 -228 -152 142 88 133 -152 118 134 70 79 186 -13 25 -103 128 -10 -43 65 -117
3678a17J24j25K9r7P1J80r0k27K13k41K76l1j6k15K29M5j56J18n4P1P0JO8o8K0
3703G8l8M7%p5Mj29J19K72k61j79j36L15l7J46j8j68R3j72K7K03r4j9j81M14k65
3728e4k8J42J22k42J6K3P6K0M3m08J78K47l22M0K65l7Q7k96J32p4o7K32r2M9j4
3753C8j1K83n16OJ09L19l28R4K83j64P8l25QM46k36K1k5M2N5k52j87K34j16k9
3777a73K70J33j58j03j02M3n7QL3M9q8K01j22K60m84K54K68j93QJ1L6k32LM7K48
3802A60k8j06p6J05n0J17l3j93K06N7m35L51N5l18J87P3lM3o3j60j0K20p1J44
3826A72k47K70m8l00J49K04p0l23L12K8N7k02p0k6j00j1L4J09P5L8j34N9Q3l49
3850b90M26k80K49j58K17k59K81k71K85j66j64K6L34k79J5j2k4J94j91J41J68
$$ plain form
3678 -117 7 -118 -89 -186 -115 65 -25 -252 -39 -280 -4 -35 -51 -266 -37 8 -148 -30 -84 -13 57 58 126 58 78
3703 78 40 87 87 12 16 -113 6 278 17 -162 -298 17 -20 126 108 -60 33 -139 -112 91 -3 -22 -203 211 -54
3728 -54 -82 60 182 -60 -44 -21 55 75 118 -290 -112 135 -187 -147 118 81 168 -128 4 -70 -137 95 3 52 38
3753 38 27 310 -206 -200 -91 228 -100 -6 277 113 191 -134 -126 320 84 105 80 122 177 -75 -262 -28 -144 -173
3777 -173 97 230 72 -31 -133 -90 -147 -139 -106 -57 -145 56 -66 194 -290 -36 232 39 47 58 94 -138 -135 -88 160
3802 160 132 26 -50 55 5 122 89 -104 102 159 -276 75 130 -188 -1 72 69 112 49 -111 -121 99 28 172
3826 172 -75 195 147 -153 -4 200 130 -193 119 147 204 2 -68 -94 -194 -205 -171 -62 13 51 -83 -24 59 -290
3850 -290 136 -144 105 -53 164 -95 186 -85 200 34 -130 -104 230 -49 -34 -46 -70 124 -67 74 242
3871B42j89L0%k14R7j14q0J93rj3O5o2O5j09J66j13o8N6o8R0O8M1j65M4r5M71
3897C29j51l42J92k7N5J13k26L11k78J18J31m08o0p3J35K53k0j9m5j90J62N8j86
3920a68J39J8K21k86n8J82k0l26J72K10P7j06J17k1n9J32k28j54p5M32j98N1q0
3943b8J19l2k30Q3n7m2K51pk6k78N04j50j27L6J64j1j86Mm9Q8K7o3Jk49K11j26
3969a73J53L4j64J62j40J25q2k2L8L4m2J50j84J03J57r4j27qK22j29O8k11L07
3992A77m4j47j9K06nj29r9Q2L10l25J23k20M43o10M29j87J2k5l5Q2j06J04l19
4015c02R3j7J94k3J43k23J98L3J03Knj93j34J45K13j42q1J54j08K2k06J76Q3o7
4039E8K8j64M9P1p2K6k4j36l6J06j4rL86j58l9p2J11j39k06M71l77K18J03k98
$$ plain form
3871 242 53 83 83 -131 -34 -148 -228 -35 -44 -57 8 -54 11 -98 68 -45 -113 -57 -125 -35 33 74 -91 -47 -142 329
3897 329 178 -164 28 1 56 169 -57 254 -24 94 225 -183 -243 -316 -181 72 52 33 -12 -202 -40 18 -168
3920 -168 -29 -11 210 -76 -134 48 28 -298 -126 84 161 55 172 151 92 224 -4 -158 -233 199 1 52 -28
3943 -28 91 59 -171 -88 -145 -187 64 57 31 -247 257 107 -20 16 180 169 -17 -13 -62 26 53 -10 -9 -258 -47 -173
3969 -173 -20 14 -150 12 -128 -3 -85 -107 -69 -35 -77 73 -111 -8 149 55 -72 -80 142 13 81 -130 177
3992 177 133 -14 -33 173 168 39 -60 22 332 7 130 -90 353 -257 172 -15 -3 -28 -63 19 -87 17 -302
4015 -302 -209 -226 -32 -55 88 -135 63 96 199 201 196 3 -131 14 227 85 4 158 50 72 -134 42 125 58
4039 58 86 -78 -29 42 -30 -4 -28 -164 -200 -94 -108 -117 269 111 72 0 111 -28 -234 237 -140 78 181 -117
4063a17JJ89q1k10K74J9N1r7k16P7J28J71k45J26l79M10l25L09L2o7j63L1j84
4086b66k4N18n7J01k28r8N4j29J50j75J41p8j31L79j98M3j83K20j18l09K98n6
4108a46K48j2q8j91J27l8L43k96J44nRj24qJ20l2r0P2k4J3J08l03K65n6j8L3r0
4134c9n4K3j3j49J62j7p8n4J19m3J51r4Q2r5L34k20j34n8K18j2O6q3k3J20p4P9
4160A14j91l12K43L55k65J73n5n6P7q8j49J20o8O1m7O9K6m8J84J33j16k33k6M9
4184e0M2O5j17J55J12k94J14J06j79M4M9K26j58j58Q2J48k45rn7M9J32k00K2J39
4208A8Q8k38J59Q8p2J20j43K1J43M7j08J62l21j14K88l7j02K28l19O4Jl4K4J22
4232H5p5k29K05K40l1k94P5j57J37J36n7p5r4K65j08k08K87p7j33J05Q9P1L4l19
$$ plain form
4063 -117 -116 73 -8 -218 56 75 126 29 -187 -110 18 189 -56 70 -309 101 -224 85 117 50 -113 -82 -266
4086 -266 -290 228 171 272 44 -54 0 -129 21 -154 -13 -91 -222 157 -41 2 -181 39 -79 -388 -90 -146
4108 -146 102 90 2 -189 -62 -100 243 -53 91 86 95 -29 -37 83 51 -39 33 9 22 130 -173 92 36 18 51 -39
4134 -39 -93 -70 -83 -232 -70 -87 -165 -219 -100 -143 8 -86 -4 -99 235 15 -119 -177 41 29 95 12 -11 109 35 114
4160 114 -77 -389 -146 209 -56 117 62 6 83 -5 -154 -34 -102 -41 -88 -19 7 -41 143 276 160 -73 -99 -50
4184 -50 -8 57 -60 95 207 -87 27 133 -46 -2 47 273 115 -43 39 187 -58 -67 -124 -75 57 -143 -121 18
4208 18 106 -132 27 115 43 163 20 41 184 231 123 285 -36 -150 138 101 -1 227 -92 -28 -27 -61 -37 85
4232 85 10 -219 -14 226 195 -99 -24 -181 -44 92 35 -40 -134 131 23 -185 102 25 -108 -3 86 157 191 -128
4256a28K56k31J01j39J20M1p4r5K12k06J63p2K25m94J59K82k30O3L5j61K03N5
4278H5j48l6J44J52k64J24M8Rj59o0L15r7k29K06kj7j55J03j53J02P6j81l2Q4
4302h5J27J44k54K81j68M5J62q1j16j4j6K01j32L3J93k77j24l7K12j04j10J20
4324@l9J79K9k27J03j61J78j23J46j73J63j60l6m9J2K86q9J38j60l1P6j9J12j4
4348A41oQ4k84K41j13J24j76o3o5N9RO6k80L11j93q0O0MO2Q0Q0r4m5p4J34Mn0
4375f4j08O9K64k26K57k15j80L20l69M68j80l8R4J82k25O4n1q9J73j95M8k13j3
4398b27K08J27J8M6l89L00m02L68J20l31M1K51j77j12K49J42j36QK04l66N5k7
4420c0R0R4k14m6J06N2j13J39j65R8j20R1M5j71Q2qL53l89j04K61K57m80j34K42
$$ plain form
4256 -128 128 -103 -2 -141 -21 20 -54 -149 63 -143 20 -52 173 -321 -162 120 -110 -47 -12 -173 30 85
4278 85 -63 -99 45 197 -67 57 105 114 -45 -105 210 113 -116 90 88 71 -84 19 -134 -32 44 -137 -169 -85
4302 -85 42 186 -68 213 45 90 252 171 55 41 25 226 94 127 320 43 -81 -118 94 -10 -120 0
4324 0 -39 140 169 -58 45 -116 62 -61 85 -88 75 -85 -121 -170 -158 128 39 177 17 -14 62 43 155 141
4348 141 135 219 -65 176 63 187 11 -52 -117 -58 -49 17 -263 48 -145 -225 -165 -161 -99 -19 61 -33 -78 -152 -18 -14 -64
4375 -64 -172 -103 161 -65 192 -23 -203 117 -252 216 36 -2 92 274 49 113 62 -27 146 -49 -1 -214 -227
4398 -227 -19 108 126 172 -217 83 -319 49 169 -162 -121 130 -47 -159 90 232 96 104 308 -58 -3 -30
4420 -30 60 154 -60 -106 0 52 -61 78 -87 11 -109 -18 27 -144 -62 -70 283 -106 -210 51 308 -172 -306 -64
4444f4J05J41r0k92J7K86j4m1l14L94m8k08O6K50p0k97J6k9Q8q8R7J28r1K36l5
4469A43J05j18j25p4L05l44N9j49L25l4J61j16k8j1q9J92m0l73K35j63M0K23k87
4492a63K60R6k01J08j35K9LK09j07m0j29J72ROq2n7K12j34q0J63K07k78p3ln3
4517f1L62J9l27L2j35J3R3R1l18J9J76m7Q5k4Q4O2k33q7j2J82j32M4J71k85J92
4542c6l27K91J87l85L75j83O7Q5M3j32j08K50l5j80J48K83l71J31l07J64r9L10
4564A71k31m8L26k69j06Q0J87l57J31J68j00j56J37P1j94M05l54J79J45l01p6
4585a92J49K28j24K5k11K81P5l01J16L4p0p2q9J48l58K80R9r5J63k14O6L9r6J72
4609E3m0J1k6J99q9k30J77r8J27Om0Pj72k50M10O8j55p8J17r4J14j29L29j54k41
$$ plain form
4444 -64 41 182 92 -200 -183 103 89 48 -266 128 80 -128 -62 188 118 -179 -163 -192 -104 -192 -95 33 -58 178 143
4469 143 248 130 5 -69 236 -108 -49 -198 127 93 254 138 110 99 10 202 162 -211 24 -139 -99 124 -163
4492 -163 97 193 -8 100 -35 -6 -3 206 99 59 -70 102 111 117 35 -22 190 56 -24 139 346 68 -5 -8 -61
4517 -61 301 320 -7 25 -110 -97 -4 87 -231 -212 -36 -83 2 -22 62 124 -109 -196 -208 -26 -158 -114 57 -228 -36
4542 -36 -363 -72 115 -270 105 -78 -11 74 117 -15 -123 127 92 -88 60 343 -28 103 -204 -40 -139 171
4564 171 -60 -108 218 -51 -157 -77 110 -247 -116 52 -48 -204 -67 4 -190 215 -139 40 185 -116 -192
4585 -192 -43 185 61 86 -125 156 231 -70 46 80 10 -62 -151 -3 -361 -81 18 -77 86 -128 -62 -23 -119 53
4609 53 13 24 -2 197 108 -122 55 -43 84 90 50 57 -115 -365 45 113 -42 -120 -3 -97 17 -112 217 63 -178
4634a78J55P7K61k89n1j7J53J5J69j85k15j0R2J03k99M84k74j39J14q7O3J35j70
4657i3J77j10j21J27q3K60j50j4p8J5L20k87nM7nJ13j9q6N0k22R9k25L41l1j8
4682BJ38k69L07j37k02K2j02J81J71k83P0kJ71q8j73J86j5o1J41j5K8O8o4j16
4706d2L31l31J04K61k38j07j29L65j12k72M2J85l20K41L4m9j37J99k4j1K8O7J9
4729A04q6k1Lm5j05K32Qr6k8L38l50j7J61P2j14M6K4q9j05K43l46O3K64j7j63
4754b4J62k77J8P6J47l4J06l02J70j49N3L64k02r5p9J51r3k4LK81k23M9j58J23
4778D3J68p0j94J04j44N9N4k26J68O0j4j21J58O8L5J1k44K7J43j08K2r9M8k2Q9
4803A5J0p8M0j41J96J12j31K4j6k45K42k08m6M34l72K10J03m18M47j97R5j17J4
$$ plain form
4634 -178 -23 54 315 26 -25 -42 111 126 295 110 -105 -115 -23 80 -219 265 -9 -148 -34 -121 -58 77 -93
4657 -93 84 -26 -147 -20 -103 157 7 -7 -85 -70 250 -37 -42 5 0 113 94 8 58 -164 -65 -290 51 20 2
4682 2 140 -129 178 41 -161 -139 -241 -60 111 -172 -102 -104 67 -21 -194 -8 -23 -84 57 42 70 138 74 -42
4706 -42 289 -42 62 323 85 -22 -151 214 102 -170 -128 57 -263 -22 12 -37 -174 25 1 -10 18 85 104
4729 104 18 -3 0 -45 -150 82 90 -6 -34 304 -46 -63 98 170 56 102 126 37 -68 175 -171 -108 156 139 -24
4754 -24 138 -139 -121 -45 102 68 174 -128 42 -107 -54 310 108 13 -66 85 -8 -32 -29 252 29 78 -80 43
4778 43 211 141 -53 51 -93 -34 20 -206 -38 22 8 -113 45 113 148 159 -85 -58 85 -23 -1 -100 -52 -74 15
4803 15 25 -53 -13 -154 42 154 23 47 31 -214 28 -180 -226 208 -164 46 149 -269 178 -19 76 -41 -27
4826b7p4J55J25k94K41k6j03r2J57r8j02L22l86L26k19K9L80j32j43p3q1K20l14
4849b09J56k32R4k5J49k5p2N2K47Nl6l95L07L23m83J73L1K5pj35Jm8P1O3k00J31
4875c9R2J46l05j04O3K90jk87K72k90P9J77M9k50J22j01J12J50j74p3J39j5k24
4898a72J98K78m67R8K52j50K20k16j65K50k62j5J35n4j74J31n2J57o6J62j36j09
4920a57M5P7p4k9M52k73J32k48m8L63j80O2Kj6r1J04O9k64J50j89J87k10J03j19
4944a52PK41R9l47ON7Q9K8j34j50J38N6o0K52k56J19K55l22K11r9Q3Kj47K22l9
4969A59j23j38J06m3k7K38l65K58j18J17M7k35J37K26m99K13n5K90k52j91N07
4990B52o3j35Q3l23K10M0R4j72q9qL28l1k08j19J00P6j63p8lp0K08J28rj82j75
$$ plain form
4826 -27 -101 54 179 -115 126 100 -3 -95 62 -36 -138 184 -202 124 -95 -66 314 182 39 -34 -115 105 -209
4849 -209 -53 -285 -191 -216 -67 -92 -164 -112 135 140 104 -291 16 339 -144 29 60 85 78 -57 -56 -104 -33 30 -170 -39
4875 -39 53 199 -106 -210 -147 143 142 -145 127 -163 -84 93 142 -108 14 -87 25 175 1 -72 67 52 -172
4898 -172 26 304 -163 -65 187 37 257 41 -124 126 -136 -151 -16 -70 -244 -113 -165 -8 -74 88 -48 -157
4920 -157 -112 -35 -109 -138 314 41 173 -75 -123 240 60 122 124 108 17 121 190 -74 76 -113 74 -136 -33 -152
4944 -152 -145 96 195 -152 -146 -89 0 28 -106 -256 -118 -62 -122 130 -126 -7 248 -74 137 38 121 123 -24 198 159
4969 159 36 -102 4 -39 -66 172 -193 65 -53 64 111 -124 13 239 -260 -47 -102 188 -64 -255 252
4990 252 189 54 137 -186 24 64 158 -14 -103 -111 217 186 -22 -141 -41 35 -128 -206 -209 -279 -71 57 48 -134 -309
5015c09L60n5J42j57J10j9q4J5n4J81j76K15k4j59P9l2j30K78j78m2RN2J4nQ9
5040A20j20oJ19%o2K4j74J39k94K84n5j87L25O8l87L02M9p8K03m79L87j46k65
5063b33rJ99K13k18O4N0l4K61l52r9L4k7L5R0k66L29j95L12L1j70O1l07K34n4
5087e1K42l89L36J51l02n7r6J31n6R1L5p9J64J03j9M1k23j16N6J0K63j18j66l
5111e2J12p9J20k64l4L48m0j19q3j34J09K86m3k05k20K34K06l78L52m8k43R8K28
5134A51K8m7L6o3N4m16L22k32J03m9K11K9R2j04J2j08N2l3M2k47J03R9l8qq7Q2
5160a6N7j63N4J52P3k53J22N2j39lJ13l46L85j31k8J48R4K3l00j46O8J73lJ75
5184A61M7mk63n2J50j06n2l7K35j29J32m0j68J20p9K42j92J29k03J74M8j82j41
$$ plain form
5015 -309 51 -4 138 -19 91 72 -12 3 -51 130 -46 169 145 -14 65 33 -97 181 3 -39 -30 22 36 31 120
5040 120 0 -6 113 113 51 75 -99 40 -254 30 -25 -212 113 181 -206 96 145 67 270 -209 178 32 -233
5063 -233 -242 -43 170 -48 16 66 32 293 -59 -158 -124 -151 -116 -26 -292 37 -158 154 185 15 76 -231 3 -51
5087 -51 191 -198 138 289 -13 -70 -166 -35 -91 0 35 -44 120 223 204 245 22 -94 -38 -28 235 117 -49 -52
5111 -52 60 -19 101 -163 -197 151 111 -8 -91 -225 -116 170 127 -78 -298 -64 142 -236 116 68 -175 -77 151
5134 151 179 132 168 105 159 -257 65 -167 -64 -113 98 127 219 115 127 19 71 38 80 -167 -64 35 -3 -11 -98 -16
5160 -16 41 -122 -68 84 157 -96 26 78 -61 -64 49 -297 88 -43 -71 77 171 194 -106 -252 -184 -11 -14 161
5184 161 208 204 -59 -111 39 -67 -119 -156 79 -50 82 42 -126 -6 -85 157 -35 94 -109 65 113 -69 -210
5207b10K51Q9j42k1J06J4k49j32O8K40j31J42k44K72K27l18j11N5j08K86N7j88
5229d7J48j43J84j32K03k51j67K83k24m0K09Mk8M5j05p9R4J02q1k21L32ql63L37
5253E2j23P2J0J20j69O1N9L4o3M7j06q3K68J18l32K05M1k40j61J74J80ql46J92
5277Bo5K47j89K18j88J34j54k25L56q9j42J29R7o6rR9j82J13j43j00J46Q2j06
5300c5J04j51K31j48m7J83j43P7J49l02K08j42m6J68l16Q8J95M1P8j03O2Rj40
5323B0j84J1J65j52M13k59l2j6o7p5K5M0N2J04Q5j22O0N9k73K13o6j06J51j4j88
5348a56J50K67k97L17k32K7k16J54M3j0n3OP8j57j25J17J71j53L48k99r3J38R5
5371A20j58K6J95r3J5j67r7K58j11J11k19K1M5J82L3p0K0q6p7K6k28L97k88K4
$$ plain form
5207 -210 41 130 -12 -33 73 87 -162 -294 -226 14 -117 25 -219 53 280 -38 -149 -94 -202 84 141 -47
5229 -47 101 -42 142 10 213 -38 -205 78 -146 -186 23 27 -1 44 -61 -140 -46 56 -25 -246 86 78 -285 52
5253 52 -71 1 11 131 -38 23 82 116 53 100 -6 -89 179 297 -35 170 211 -29 -190 -16 164 156 -190 2
5277 2 -63 184 -5 213 25 159 5 -220 136 47 -95 34 131 65 56 155 -27 86 -57 -157 -11 71 -35
5300 -35 69 -82 149 1 -46 137 -6 71 220 -82 126 -16 -62 106 -210 -122 73 114 192 89 151 160 20
5323 20 -164 -153 12 -140 273 14 -18 -34 -101 -176 -151 -111 -59 45 130 8 68 127 -146 67 1 -105 46 32 -156
5348 -156 -6 261 -36 281 49 76 -140 14 57 47 -6 0 78 -79 -204 -87 84 -69 279 -20 -113 25 120
5371 120 -38 -12 183 90 105 -62 -159 99 -12 99 -120 -99 -54 128 161 91 111 25 -52 -26 -254 143 -145 -121
5395a21K8P9k73J58L00l31M75k60J8k3qj32L0P9J21N2j70jk5J6R4k18PL1l2J88
5421H2j86J76r0n4ro9N1R6j70K96k0Q9k31q6J92j92L26j97o7J90r7R7o1l61L24
5446B9k25L34r5O7J26j17j76O5j03L8L6j05k1J19L3j39O7o6K2K20k99J47K46l52
5470a49K01j00K4K01j85J29j82P2kq8O7O9j47P1J26o5J35l50L05k75J24o7K43
5493A57l89L41o3l21L74k96J82J97n9J24k1j50j46J14j59pj36M88k07o3nJ6J49
5516A20k25K04j49N19n28J34J35o7q4L7kp4J19j10o3n3J00rN9j86r2K45N8k43
5540a55K86j73J68J4Mk65Q6n2J99l99K59R5K3k83Q4J26j1l7j59L33k51m7K90j89
5564e4K08j75n2J30Q3j15J69j62J94j20j02J37n2j72K21J12j9j18j70L25k29J6
$$ plain form
5395 -121 -93 -14 -287 -129 171 -160 315 55 73 50 42 -90 -60 19 140 192 22 21 -4 12 106 -112 -105 -74 -106 82
5421 82 -104 72 -18 -72 -81 -150 -99 -3 -173 123 103 192 -39 -125 67 -125 201 4 -63 127 30 127 66 -295 29
5446 29 -196 138 43 110 236 119 -57 8 -95 -57 -21 -126 -147 -28 5 -134 -67 -133 -111 109 -190 -43 203 -149
5470 -149 52 -48 -24 177 -8 121 -61 11 9 -79 -12 57 -90 -19 107 42 177 -173 132 -143 -19 -86 157
5493 157 -232 109 46 -275 99 -197 -15 182 123 247 226 76 -70 44 -115 -122 -258 230 23 -40 -45 -29 120
5516 120 -105 99 -50 469 -59 75 210 143 59 96 94 20 139 29 -34 -87 13 4 63 -123 -215 30 88 -155
5540 -155 131 -42 126 140 144 -121 -35 -87 112 -287 -28 67 90 -193 -109 17 6 -31 -190 143 -108 -155 135 -54
5564 -54 154 -21 -73 57 140 25 194 32 226 106 4 141 89 -83 138 250 231 113 -57 268 39 55
5586E5j30jJ2o6L9%M56p20K38M4J18j20J7P8K7J58q9k61K19j63N5k15K00n9K80
5611A72l12M4M1K63j23l85L20o3J04j12K34l25J31k14Q3K2J0J94p5j39K1R0J81
5634A62k05P5j76J01J5J0K4l4J37J58l39L18k09J9r1l8LJ62J01k8k74q9K96m5
5658E3J56Q5l75M4Q6r2P9K08l69j3J95k41K34P0P8r9Pk28KLK46q7m0j7j09K88
5684A64l05J93j64J09j94j9M1M9L14j47K31j20k71PM04j74J40k95L1R9k4j02n7
5707i0q1K29O8k28n2J08K0J16q2j60K41j31J05j21m2n4L5n4l0J27l5NK15r0J81
5732B00j07k00J20K11l20M3J71l7j19jJ09k9P1Q7j81L7j12J00k7j7R9k35K79j21
5756B1j24J00j88J85O5m1j1n3n0J66q5NL3k8K3O3j8r7O6r2K53j01J60k90J65K3
$$ plain form
5586 55 -75 -76 -64 -130 -91 -91 365 -355 -117 -73 45 -75 -58 20 47 205 116 -145 74 -89 -34 -249 -49 -108 172
5611 172 -140 -96 -55 208 85 -300 20 -43 61 -51 183 -142 -11 -225 -142 -120 -110 84 9 -130 -109 -19 162
5634 162 -43 32 -144 -43 -28 -18 6 -28 109 267 -72 246 37 56 -35 -73 -70 92 193 165 -109 -198 98 53
5658 53 209 294 -81 -37 49 -43 36 244 -125 -138 57 -184 50 120 198 99 106 -122 -120 -117 129 42 2 -15 -124 164
5684 164 -141 52 -112 -3 -197 -216 -175 -126 188 41 272 152 -119 -112 292 118 258 -37 -6 93 69 -33 -90
5707 -90 -171 58 126 -102 -154 -46 -26 90 8 -152 89 -42 63 -58 -100 -154 -119 -173 -203 -76 -111 -106 109 19 200
5732 200 93 -107 13 224 -96 -53 118 81 -38 -39 70 41 112 199 18 55 -57 43 16 -1 98 -137 142 21
5756 21 -103 -3 -191 -6 59 18 7 -46 -96 70 -15 -10 23 -5 18 81 63 -34 32 -60 193 92 252 -38 127 150
5782A50m48N90k81m4K3j62K9K39n6J17k60O0%J15j81L26r6r2J05k59Q3l9R4N5
5806F8j99L31l82K14O8k64L19J1m9j41j30J51o3J06l8k7K14m1Nl68J16K1J10J82
5830B14j34R1k53M8J09p8K%J99l76K68j80lJ0J77j77O4Qj21O1r7J21N8j23J65
5855E3O2r1L7j45K77j19k08K40j99J49m9j77P5K04j36j7K16k47k3N8J55k38K13
5878I0j26K2j45J55k9P5J45k75j46J00J55P0m3k53K48k68O9o6J85J39k42n7Q2
5901a15L8L73m76J85N4m0J5J04j56L0J90l42K13k17J73l03J23K24j16K4J8LJ26
5924A28l68jK62k37N3j11N59l05k32L52l04K20K75n18L9N6K65j49qo8J96k57K98
5947A45j41O9J68k73R6k59J2K0R3pO9j05R3J17l06K74j41N5J29k8j1r0l5P7r2
$$ plain form
5782 150 -298 292 11 -33 -10 -172 -143 96 40 157 -103 -43 -43 72 -109 217 121 29 134 -125 -42 -81 13 68
5806 68 -131 200 -182 32 100 -164 155 166 117 -24 -154 -3 -66 40 2 -25 189 148 153 -215 -99 -78 32 214
5830 214 80 171 -82 -34 75 -3 -1 -1 198 -178 90 -90 -93 -83 94 -83 -19 -11 -132 -71 -168 -47 11 -112 53
5855 53 115 24 61 -84 193 74 -134 106 -93 56 7 -170 -95 109 -27 -44 172 -75 -98 -40 115 -123 90
5878 90 -36 -14 -159 -4 -33 42 187 -88 -234 -134 21 91 48 -205 43 -225 -156 -222 -37 102 -140 -197 -115
5901 -115 -77 296 -180 5 59 19 34 138 -18 12 202 -140 73 -144 29 -274 -151 73 -43 -19 -1 2 128
5924 128 -240 -241 21 -216 -163 -274 285 -20 -252 100 -204 16 291 -227 -188 -132 133 -16 -24 -92 104 -153 145
5947 145 4 73 241 -32 64 -195 -183 -163 -70 -77 -8 -113 -20 97 -209 65 -76 -21 108 80 69 -21 -56 21 -71
5972g1P1l4K21k07j9QN6q7n4J62mj96J29j27K65j64P5K43l14J58J44m31L14Qk99
5997a53K73k30qJ45j87J35j7J69p8m0J2j40L27l70N53l10j46M0L5j25J95j12r4
6020a26r5K27k09J13K95j99p9K11j91J33l99M38M0j72J35K51l23j70K68j8L7k98
6042a31N02o41L60l0m7m2J7J05k53K89L5k04q2K65l35K00K07n5j55j54R7R8p1
6065b5M2J85k95K84r5j46M9q6J80n5K01j78j45N7rJ08j1k5r8K15k62K04j09j86
6089b00K73J54j42J57k05J04k90K85R5k54J57j27o9J14Q0k69J46l2r7J22p9k5
6111a02j4K11o3j74O4P1Nk23K18k9k9p2j47L82o9j07J2L0J28j15K92k60j1J79
6135A77o7j45N0n0K5j5j26R4n4K56r8j66J20N7L9k36K41l5j79J47p0N6K84k4k05
$$ plain form
5972 -71 0 -34 187 -20 -39 -31 25 -62 -116 46 42 -154 -25 -152 113 -51 24 267 -47 111 255 -176 138 146 -153
5997 -153 120 -110 -118 27 -160 -25 -42 127 49 9 21 -119 208 -162 391 81 -65 -25 10 -115 80 -32 -126
6020 -126 -221 6 -203 -90 205 6 -73 138 -53 80 -319 119 159 -13 122 373 50 -120 148 130 167 -131
6042 -131 371 -270 90 60 13 -29 -12 93 -160 129 164 -40 -122 143 -192 8 215 160 5 -149 -52 46 -25
6065 -25 17 202 -93 191 96 -50 -1 -87 93 38 239 61 -84 -27 -36 72 61 36 -62 153 -109 95 -14 -200
6089 -200 73 227 85 242 37 141 -149 136 231 -23 134 7 -62 52 132 -137 9 -23 -120 2 -77 -102
6111 -102 -116 95 32 -142 -78 -7 -2 -225 -7 -36 -65 -137 -284 98 29 -78 -66 -36 92 -23 269 9 -2 177
6135 177 110 -35 15 -35 -10 -25 -151 -57 -111 145 47 -119 1 58 97 -139 102 67 -112 35 -35 21 305 281 76
6160G6M5j4r1j44Q9n1J78n5j62RK8P7P2m2j27J68j58K58l98K55n6j25L69k79J70
6185I2M7k26P5j63K54M0o9mJ94k51N9j8M1l22K64j05P9J05j36K25j92L6P8J47
6209B50l10j05L97j97J55n1j83R2k28L46j30QJ78j3j55k56K69N7p8O9l24m8J91
6232f6k1l2J86J37l44R2l7R3j82J17n5K2J18M6L2k84K65n5L7j4j19O0o7O5J81
6257A75j91J22p8J8l2K97k38n6k41L24j69K7L41n8l62J41R2j44LJ83j69j06J26
$$ plain form
6160 76 121 107 16 -128 -39 -90 88 33 -129 -120 -92 -15 57 15 -112 56 -102 156 -242 13 -43 -168 201 -78 92
6185 92 139 -87 -12 -175 79 119 50 46 240 -11 48 30 71 -251 13 -92 -13 92 -44 181 -11 25 103 250
6209 250 -60 -165 232 35 190 139 -44 48 -180 166 36 44 222 209 54 -202 67 124 46 115 -209 -257 -66
6232 -66 -87 -119 67 204 -140 -48 -85 8 -174 -57 -112 -90 28 74 106 -178 87 32 69 55 -64 -4 -71 -6 175
6257 175 -16 106 28 46 14 311 73 17 -224 100 -69 -42 299 241 -121 20 112 -32 -29 154 -15 -121 5
$$ [...]
8191g0
##END NTUPLES=NMR FID
##END=
