##TITLE=1H_Pr 53-400
 CDCl3
 8 sc, 
 17.10.2022
##JCAMPDX= 6.0         $$ Bruker NMR JCAMP-DX V2.0
##DATA TYPE= NMR FID
##DATA CLASS= NTUPLES
##ORIGIN= UXNMR, Bruker Analytische Messtechnik GmbH
##OWNER= root
$$ XWIN-NMR		Version 3.5
$$ Mon Oct 17 15:47:45 2022 Russian Standard Time (UT+4h)  she@DPX200
##.OBSERVE FREQUENCY= 200.1313499994
##.OBSERVE NUCLEUS= ^1H
##.DELAY= (6, 6)
##.ACQUISITION MODE= SIMULTANEOUS
##.ACQUISITION SCHEME= undefined
##.AVERAGES= 8
##.DIGITISER RES= 18
##SPECTROMETER/DATA SYSTEM= spect
##.PULSE SEQUENCE= zg30
##.SOLVENT NAME= CDCl3
##.SHIFT REFERENCE= (INTERNAL, CDCl3, 0, 15.7039)
##AUDIT TRAIL= $$ (NUMBER, WHEN, WHO, WHERE, WHAT)
$$ ##TITLE= Audit trail, XWIN-NMR		Version 3.5
$$ ##JCAMPDX= 5.01
$$ ##ORIGIN= Bruker BioSpin GmbH
$$ ##OWNER= she
$$ F:/spectra/data/she/nmr/H-F/1/audita.txt
$$ ##AUDIT TRAIL=  $$ (NUMBER, WHEN, WHO, WHERE, WHAT)
(   1,<2022-10-17 15:46:36.14 +0400>,<she>,<DPX200>,
      <created by zg, POWCHK disabled, PULCHK disabled
       configuration hash MD5:
       00 E9 B6 7A A2 85 ED C7 34 08 36 98 17 FE 4E 26
       data hash MD5: 16K
       CE 87 8A 81 6B 8F 16 EC 74 92 55 8D A5 33 8E 88>)
$$ ##END=
$$ 
$$ hash MD5
$$ 30 33 40 65 F5 B1 0B 3F 7C 04 76 42 DB 96 AF 6B
##$RELAX= 
##$RELAX= 
##$RELAX= 
##$RELAX= 
##$RELAX= 
##$RELAX= 
$$ Bruker specific parameters
$$ --------------------------
##$DU= <F:/spectra>
##$EXPNO= 1
##$NAME= <H-F>
##$PROCNO= 1
##$TYPE= <nmr>
##$USER= <she>
##$AMP= (0..31)
100 100 100 100 100 100 100 100 100 100 100 100 100 100 100 100 100 100 
100 100 100 100 100 100 100 100 100 100 100 100 100 100 
##$AQSEQ= 0
##$AQ_mod= 1
##$AUNM= <au_zg>
##$AUTOPOS= <>
##$BF1= 200.13
##$BF2= 200.13
##$BF3= 200.13
##$BF4= 200.13
##$BF5= 200.13
##$BF6= 200.13
##$BF7= 200.13
##$BF8= 200.13
##$BYTORDA= 1
##$CFDGTYP= 0
##$CFRGTYP= 5
##$CHEMSTR= <none>
##$CNST= (0..31)
1 1 145 1 1 1 1 1 1 1 1 1 1 1 1 1 1 1 1 1 1 1 1 1 1 1 1 1 1 1 1 1 
##$CPDPRG= <>
##$CPDPRG1= <>
##$CPDPRG2= <>
##$CPDPRG3= <>
##$CPDPRG4= <mlev>
##$CPDPRG5= <mlev>
##$CPDPRG6= <mlev>
##$CPDPRG7= <mlev>
##$CPDPRG8= <mlev>
##$CPDPRGB= <>
##$CPDPRGT= <>
##$D= (0..31)
0 1.2 0 0 0 0 0 0 0 0.06 0 0.03 0 0 0 0 0.0002 0 0 0 0 0 0 0 0 0 0 0 0 
0 0 0 
##$DATE= 1666007195
##$DBL= (0..7)
120 120 120 120 120 120 120 120 
##$DBP= (0..7)
150 150 150 150 150 150 150 150 
##$DBP07= 0
##$DBPNAM0= <>
##$DBPNAM1= <>
##$DBPNAM2= <>
##$DBPNAM3= <>
##$DBPNAM4= <>
##$DBPNAM5= <>
##$DBPNAM6= <>
##$DBPNAM7= <>
##$DBPOAL= (0..7)
0.5 0.5 0.5 0.5 0.5 0.5 0.5 0.5 
##$DBPOFFS= (0..7)
0 0 0 0 0 0 0 0 
##$DE= 6
##$DECBNUC= <off>
##$DECIM= 32
##$DECNUC= <off>
##$DECSTAT= 4
##$DIGMOD= 1
##$DIGTYP= 9
##$DL= (0..7)
0 120 120 120 120 120 120 120 
##$DP= (0..7)
150 150 150 150 150 150 150 150 
##$DP07= 0
##$DPNAME0= <>
##$DPNAME1= <>
##$DPNAME2= <>
##$DPNAME3= <>
##$DPNAME4= <>
##$DPNAME5= <>
##$DPNAME6= <>
##$DPNAME7= <>
##$DPOAL= (0..7)
0.5 0.5 0.5 0.5 0.5 0.5 0.5 0.5 
##$DPOFFS= (0..7)
0 0 0 0 0 0 0 0 
##$DQDMODE= 0
##$DR= 18
##$DS= 0
##$DSLIST= <SSSSSSSSSSSSSSS>
$$ [...]
##$SUBNAM2= <"">
##$SUBNAM3= <"">
##$SUBNAM4= <"">
##$SUBNAM5= <"">
##$SUBNAM6= <"">
##$SUBNAM7= <"">
##$SUBNAM8= <"">
##$SUBNAM9= <"">
##$SW= 18.0517283424941
##$SWIBOX= (0..15)
0 0 2 0 0 0 0 0 0 0 0 0 0 0 0 0 
##$SW_h= 3612.71676300578
##$TD= 16384
##$TD0= 1
##$TE= 0
##$TE2= 300
##$TE3= 300
##$TEG= 300
##$TL= (0..7)
0 120 120 120 120 120 120 120 
##$TP= (0..7)
150 150 150 150 150 150 150 150 
##$TP07= 0
##$TPNAME0= <>
##$TPNAME1= <>
##$TPNAME2= <>
##$TPNAME3= <>
##$TPNAME4= <>
##$TPNAME5= <>
##$TPNAME6= <>
##$TPNAME7= <>
##$TPOAL= (0..7)
0.5 0.5 0.5 0.5 0.5 0.5 0.5 0.5 
##$TPOFFS= (0..7)
0 0 0 0 0 0 0 0 
##$TUNHIN= 0
##$TUNHOUT= 0
##$TUNXOUT= 0
##$USERA1= <user>
##$USERA2= <user>
##$USERA3= <user>
##$USERA4= <user>
##$USERA5= <user>
##$V9= 5
##$VALIST= <valist>
##$VCLIST= <CCCCCCCCCCCCCCC>
##$VD= 0
##$VDLIST= <DDDDDDDDDDDDDDD>
##$VPLIST= <PPPPPPPPPPPPPPP>
##$VTLIST= <TTTTTTTTTTTTTTT>
##$WBST= 1024
##$WBSW= 4
##$XGAIN= (0..3)
0 0 0 0 
##$XL= 0
##$YL= 0
##$YMAX_a= 293783
##$YMIN_a= -342460
##$ZGOPTNS= <>
##$ZL1= 120
##$ZL2= 120
##$ZL3= 120
##$ZL4= 120
##$ABSF1= 10
##$ABSF2= 0
##$ABSG= 5
##$ABSL= 3
##$ALPHA= 0
##$AQORDER= 0
##$ASSFAC= 0
##$ASSFACI= 0
##$ASSFACX= 0
##$ASSWID= 0
##$AUNMP= <proc_1d>
##$AZFE= 0.1
##$AZFW= 0.1
##$BCFW= 1
##$BC_mod= 2
##$BYTORDP= 1
##$COROFFS= 0
##$CY= 11.3945322036743
##$DATMOD= 1
##$DC= 2
##$DFILT= <>
##$DTYPP= 0
##$F1P= 2.36226072786647
##$F2P= -0.459571619588291
##$FCOR= 0.5
##$FTSIZE= 0
##$FT_mod= 4
##$GAMMA= 1
##$GB= 0.15
##$INTBC= 1
##$INTSCL= 1
##$ISEN= 128
##$LB= 0.24
##$LEV0= 0
##$LPBIN= 0
##$MAXI= 10000
##$MC2= 0
##$MEAN= 0
##$ME_mod= 0
##$MI= 1.114404
##$NCOEF= 0
##$NC_proc= 0
##$NLEV= 6
##$NOISF1= 3.799351
##$NOISF2= 2.8
##$NSP= 1
##$NTH_PI= 0
##$NZP= 0
##$OFFSET= 15.70392
##$PC= 1
##$PHC0= -18035.74
##$PHC1= 14.40069
##$PH_mod= 1
##$PKNL= yes
##$PPARMOD= 0
##$PSCAL= 0
##$PSIGN= 0
##$REVERSE= no
##$SF= 200.130013532006
##$SI= 16384
##$SIGF1= 3
##$SIGF2= 2
##$SINO= 400
##$SIOLD= 16384
##$SREGLST= <1H.CDCl3>
##$SSB= 0
##$STSI= 0
##$STSR= 0
##$SW_p= 3612.71676300578
##$SYMM= 0
##$S_DEV= 0
##$TDeff= 0
##$TDoff= 0
##$TI= <>
##$TILT= no
##$TM1= 0
##$TM2= 0
##$TOPLEV= 0
##$USERP1= <user>
##$USERP2= <user>
##$USERP3= <user>
##$USERP4= <user>
##$USERP5= <user>
##$WDW= 1
##$XDIM= 8192
##$YMAX_p= 0
##$YMIN_p= 0
$$ End of Bruker specific parameters
$$ ---------------------------------
##NTUPLES= NMR FID
##VAR_NAME=  TIME,          FID/REAL,        FID/IMAG
##SYMBOL=    X,             R,               I
##VAR_TYPE=  INDEPENDENT,   DEPENDENT,       DEPENDENT
##VAR_FORM=  AFFN,          ASDF,            ASDF
##VAR_DIM=   8192,          8192,            8192
##UNITS=     SECONDS,       ARBITRARY UNITS, ARBITRARY UNITS
##FACTOR=    0.0002768,     1,               1
##FIRST=     0,             0,               0
##LAST=      2.2672688,     0,               0
##MIN=       0,             -342460,         0
##MAX=       2.2672688,     293783,          0
$$ Real data points
##PAGE= N=1
##DATA TABLE= (X++(R..R)), XYDATA
0@%%%%%%%%%%oJ4j6J6j6K4l2M0m8N6p2Q5r5J14j36J57j81K08k43K83l25L70m21
$$ 0 0 0 0 0 0 0 0 0 0 0 -6 8 -8 8 -8 16 -16 24 -24 32 -40 45 -50 64 -72 85 -96 112 -131 152 -173 197 -224
33b24M77n38O07o84P68q60R60j070J189j319J462j617J787j975K181k405K649
$$ -224 253 -285 322 -362 406 -454 506 -564 625 -694 768 -849 938 -1037 1144 -1261 1388
50A388k917L214l541L904m311M768n283N872o554P349q294R440j0858J2671j5089
$$ 1388 -1529 1685 -1856 2048 -2263 2505 -2778 3094 -3460 3889 -4405 5035 -5823 6848 -8241
65h241J8484k3631L2453n1589J67658j82158k92340L79913K12807k09382k13801
$$ -8241 10243 -13388 19065 -32524 135134 -47024 -339364 40549 253356 43974 -169827
76a69827J18602J02837P545j5545n6474j16985Q6584K01674n2390k73122J1559
$$ -169827 -51225 51612 59157 43612 -12862 -129847 -43263 158411 106021 -167101 -155542
87a55542K79638M8481k55042q1372J82340J00393r7850p7764O910M0648O2423
$$ -155542 124096 172577 -82465 -163837 18503 118896 21046 -56718 -49808 -9160 53263
98E3263J6824j08530o3427J23316R6541j15502r6835Q9824O9811o2869j9819L7780
$$ 53263 70087 -38443 -101870 21446 117987 2485 -94350 -4526 65285 2416 -17403 20377
110B0377l9486k8035R4748K7311j34614l8245J50372M6189j45843m6050J25395
$$ 20377 -19109 -47144 47604 74915 -59699 -97944 52428 98617 -47226 -93276 32119
121C2119K9076r5940N986O7305n2948m5138J05095L6682j48213l5000J74531M1620
$$ 32119 61195 -34745 -28759 38546 -14402 -59540 45555 82237 -65976 -100976 73555 115175
133A15175j76821m6428J57511M5874j20130l3449P3154Q447k8645K3429q053n9785
$$ 115175 -61646 -108074 49437 95311 -24819 -58268 14886 23333 -5312 18117 10064 -49721
145d9721K9354Q8663l7131j07825L1062J09967j9854r6889Q414P0890k031l6358
$$ -49721 -20367 68296 31165 -76660 -45598 64369 44515 -52374 -43960 26930 24899 -11459
157a1459M341Q35j0213L1683K0422n4174k5471O7099K5264o8107j6820O2963J836
$$ -11459 -7118 -6283 -16496 15187 35609 -18565 -44036 23063 48327 -19780 -36600 26363 28199
170B8199n4830J6813M6734l5701m2325M9292L6998n6491l3316N4543K4188m7449
$$ 28199 -26631 -9818 36916 1215 -41110 8182 45180 -11311 -44627 9916 34104 -13345
182a3345j0544L6087j0296k5793L5450J8956n9354j7094P9907K1445q9895k6507
$$ -13345 -23889 12198 1902 -23891 11559 30515 -28839 -45933 33974 55419 -34476 -60983
194f0983Q8667L2635p3609l1798M8872K5839j9001j1209r748j0362L1994L3275
$$ -60983 27684 60319 -13290 -45088 3784 29623 10622 -587 -10335 -20697 11297 44572
206D4572m4803n5046M3852O9560l4982p5949J9079O9271l823n2436q798K7084
$$ 44572 -231 -55277 -11425 58135 23153 -52796 -33717 35554 31731 -20705 -29503 -2419
218b419J3944K448j1118l0025L848N1976Q592o3318j8638O4807K7301n6031k8640
$$ -2419 11525 13973 2855 -27170 -23322 28654 37246 -26072 -44710 20097 47398 -8633 -37273
231c7273M1766K3896k4198j3260P855q49L420J4917j1191k7794J2769L5641j2743
$$ -37273 4493 28389 4191 -9069 -1214 -2063 1357 16274 5083 -22711 -9942 25699 12956
244A2956l9794R777L7413q512l1395Q555K2334j0793j1688J5020K100j7871P187
$$ 12956 -26838 -17061 20352 11840 -19555 -11000 11334 541 -11147 3873 5973 -11898 -4711
257d711K0241j2771j8948J6861J6704j7513j1051J7273N477j6761J444J4726p667
$$ -4711 15530 2759 -16189 672 17376 -137 -11188 6085 11562 -5199 -3755 10971 3304
270C304j4305J1919J2954j5743j2898J6955J0194j7456q268J5975M182j3876J013
$$ 3304 -11001 918 13872 -1871 -14769 2186 12380 -5076 -13344 2631 6813 -7063 -6050
283f050J0684o487o528J2446K651j6195J610K0535l702k1568O298K0967o196j7975
$$ -6050 4634 -1853 -8381 4065 6716 -9479 -7869 12666 8964 -12604 -6306 14661 8465 -9510
297i510O156J2798m836p676L722J600m614M060M411r691p057J3573Q042j6193
$$ -9510 -3354 9444 4608 -3068 654 2254 -2360 1700 6111 -3580 -10637 2936 10978 -5215
311e215j0117J6525J0233j5500q569J2596O468q106k139M252j571L00O538l083
$$ -5215 -15332 1193 11426 -4074 -12643 -47 6421 -1685 -3824 428 -1143 -843 5695 2612
325B612r560N413J2516n857j2672N027J2270m316j0614K558P701k005n537J150
$$ 2612 -6948 -1535 10981 5124 -7548 -2521 9749 5433 -5181 -2623 5078 3073 -2464 -1314
339a314J812k312J104K049m273l270P246L339r258l011J0172L211r441j940Q755
$$ -1314 498 -1814 -710 1339 -2934 -6204 1042 4381 -4877 -7888 2284 5495 -3946 -5886 2869
354B869J417n596K09K725m45K17K467k694l554M042M792m718o532L693O874k658
$$ 2869 4286 -1310 -1101 1624 1179 1396 3863 1169 -2385 1657 6449 1731 -4801 -1108 5766 3108
370C108p235JO173o81l186m69j18j110L928K594o313m416P484O716o182o818L892
$$ 3108 -4127 -4126 2047 1366 -1820 -2289 -2407 -3517 411 3005 -3308 -7724 -240 6476 294 -6524 -2632
387b632P143j20l994l418J644N878K070n256o093K854Q028J240q643o722O042
$$ -2632 4511 4391 397 -3021 -1377 4501 6571 1315 -4778 -1924 6104 7344 -1299 -8021 -1979
402a979R686j790j1671l975R341Q650m905j2675j812J4057Q117j1668j2314O910
$$ -1979 7707 5917 -5754 -9729 -388 8262 3357 -9318 -11130 2927 11044 -624 -12938 -6028
416f028J4126L10j1325n957N924J0678K482j1070j0407Q133J6537j107j9147p400
$$ -6028 8098 8408 -2917 -8874 -2950 7728 10210 -860 -11267 -3134 13403 12296 -6851 -14251
430a4251J7066J4756j2229j9990M348J9897K796j6148q808P429J0878J737q412
$$ -14251 2815 17571 5342 -14648 -10300 9597 12393 -3755 -12563 -5134 5744 7481 -931
443i31j0826K179J6260O229j5893j3854J1592K0613k616k2745o452K0594J5084
$$ -931 -11757 -9578 6682 12911 -2982 -16836 -5244 15369 12753 -9992 -16444 4150 19234
456A9234j3921j8859N819J7393K688j1887q450K582R066O529n971j3856k488J6270
$$ 19234 5313 -13546 -7727 9666 12354 467 -7983 -5401 3665 10194 4223 -9633 -12121 4149
470D149J1413j4189k0967P768K6610M99k6931q443K2739J3873j4183j4016N376
$$ 4149 15562 1373 -19594 -11826 14784 15283 -11648 -20091 2648 16521 2338 -11678 -6302
483f302R356L244o48o130r557N021J9861R44k5532j0669K6160K0365k2128k7838
$$ -6302 3054 6298 5650 -480 -10037 -5016 14845 15789 -9743 -20412 5748 26113 3985 -23853
497b3853J3966K9204m547k5693m574J5916Q832m378q262p153K143J4568P802j6374
$$ -23853 -9887 19317 14770 -10923 -15497 419 9251 4873 -3389 -10542 -8399 6169 13971 -2403
511b403j8759J2801K8006l103l1956p804L1185J8472k3499k5068J3400K6175k680
$$ -2403 -21162 -8361 19645 16542 -15414 -23218 7967 26439 2940 -22128 -8728 17447 14767
524A4767k0249n934J0569Q915J85o816j0314j889J5804J3087j6945k4675J1316
$$ 14767 -5482 -11416 -847 8068 8253 1437 -8877 -10766 5038 18125 1180 -23495 -12179
537a2179L2998l167l6575n488L3726J3168k5724j5975J5513J3520m501n839j623
$$ -12179 20819 17652 -18923 -24411 9315 22483 -3241 -19216 -3703 9817 5316 -523 -2146
550b146m649L945J5654K4k4109p595K8266J6874k6295k5371J9481K8972j0522
$$ -2146 -6795 -2850 12804 12828 -11281 -18876 9390 26264 -31 -25402 -5921 23051 12529
563A2529k7873%K0887P232j1167j0112o67P451R329K81j4169j0012J3889J9821
$$ 12529 -15344 -15344 5543 12775 1608 -8504 -9171 -1720 7609 7890 -6279 -16291 -2402 17419
577A7419p679k6054j577K8375J2494k4653k0548J7763K5045p696k4557j397J8854
$$ 17419 9740 -16314 -17891 10484 22978 -1675 -22223 -4460 20585 12889 -11668 -13065 5789
590E789P486j0285r239K74N528P455J388j3009j1151J4066J9220j0801k5589M259
$$ 5789 13275 2990 -6249 -5975 -447 7008 8396 -4613 -15764 -1698 17522 6721 -18868 -14609
604a4609K7602K091k4699p342J9465J0270j1448r625M929O018L82O89k389o370
$$ -14609 12993 15084 -9615 -16957 2508 12778 1330 -8295 -3366 2652 3034 3723 1334 -5036
618e036J557J1635J198j3849n753J3715Q466j0386j0525N540R600j636p491k135
$$ -5036 -3479 8156 9354 -4495 -10248 3467 11933 1547 -8978 -3438 6162 4526 -2965 -5100
632e100L566L047m95j839j750j158K775M616j394p182r87Q693N019p982p403N688
$$ -5100 -1534 1513 1018 -821 -2571 -3729 -954 3662 2268 -4914 -5901 2792 7811 -171 -7574 -1886
648a886R651k377q773j459P298L439l968m368R10J860K540J077n341n154N201
$$ -1886 7765 5388 -3385 -4844 2454 5893 1925 -2443 -1533 327 2867 3944 -1397 -6551 -1350
663a350Q337m748j0208J979J0591N81q990l170O227M835k724m379q4L317K586
$$ -1350 6987 2239 -7969 -5990 4601 5182 -3808 -6978 -751 4084 1360 -3019 -3103 214 2800
678B800m93l109j590K770L882r12n371j58M812J842m278k728K201J719j01j380
$$ 2800 2307 -802 -2392 378 4260 3348 -2023 -2181 2631 4473 195 -2533 -332 1387 1286 -94
694i4j717k56K322O43k217j156Q24J268P15m49j979J50K726J128j931k004J459
$$ -94 -1811 -2067 255 898 -1319 -2475 -1651 -383 332 -117 -2096 -1946 780 1908 -23 -2027 -568
711e68K842J73k494j492J653K640l24k834j095K324J897j176l492l16L177J801
$$ -568 2274 2447 -47 -1539 114 2754 2430 -404 -1499 825 2722 1546 -1946 -2262 915 2716
727B716l528k805J864L295q83k892q32K076K306r11k814k05L463J553k460k099
$$ 2716 -812 -3617 -1753 1542 659 -2233 -3065 -989 1317 406 -2408 -2613 850 2403 -57 -2156
743b156J820K671N34l013j466K658K103j605k849Q06K487k87k010j267J452J381
$$ -2156 -336 2335 2869 -144 -1610 1048 3151 1546 -1303 -497 1990 1703 -307 -1574 -122 1259
759A259o15k326l38J991P19j587j431R68J552L68j522r56J662J901j090j846R14
$$ 1259 644 -1682 -2020 -29 690 -897 -2328 -1360 192 560 -962 -1918 -256 1645 555 -1291 -377
776c77K214k91j512k0R29N58k40j370j20J317L91j313n58P7N05o8q19o67O50P79
$$ -377 1837 1546 34 14 943 1501 1261 -109 -229 1088 1479 166 -392 -315 190 122 -697 -1364 -714 65
796F5o89j270N78J257J43j176j68J141M63j54n07M39O39J5m93L01N3J40K09j24
$$ 65 -624 -1894 -1316 -59 84 -1092 -1260 -119 344 190 -317 122 761 776 283 584 637 777 986 862
816H62q45k23J187Nj536P5Q62P9j132k63M94j17m2r3k91j36N42L90p9m86j3J540
$$ 862 17 -206 981 986 -550 -475 387 466 -666 -929 -435 -552 -594 -687 -978 -1114 -572 -182 -261 -747 -760 780
838G80J23j019n51J429O06q29k70K44L2N57M35j730o55J692R29k092j358R03J649
$$ 780 903 -116 -667 762 1368 539 269 513 545 1102 1537 -193 -848 844 1773 -319 -1677 -774 875
857H75n92j666k79M62J233J42j437r98J274J917M1k383n55K908J349k008j637
$$ 875 283 -1383 -1662 -1200 33 175 -1262 -2260 -986 931 972 -1411 -1966 942 2291 283 -1354
874a354J370J808p8j079j315K12K166J174l112k119K260K889k030l098O41K160
$$ -1354 16 1824 1746 667 -648 -436 1730 2904 -208 -2327 -67 2822 792 -2306 -1665 495
890D95O5r33r82m31O38J884J97l088j239L910L149m363l019L528L776k538k678
$$ 495 560 -373 -1355 -1786 -1148 736 933 -2155 -3394 516 3665 -698 -3717 -189 3587 1049 -1629
907a629J425J702p14N3J093k472j499M114J900m912l376M354M134l397n045K136
$$ -1629 -204 1498 784 837 1930 -542 -2041 2073 3973 -939 -4315 39 4173 776 -4269 -2133
923b133L999o70k813j171J766J237P53r59k289L14L006J566k485k402J482L251
$$ -2133 1866 1196 -1617 -2788 -1022 215 968 9 -2280 -1966 1040 2606 121 -2281 -799 2452
939B452P55l416k762K481M925j032o348n44O554J400n995k057M221J302k804l04
$$ 2452 3207 -209 -2971 -490 4435 3403 -2945 -3489 3065 4465 -1530 -3587 634 1936 -868 -1172
955a172J453k015j064M807J018p190j513Q736K694r029l637R157M469p593m141
$$ -1172 281 -1734 -2798 2009 3027 -4163 -5676 3060 5754 -3275 -6912 2245 6714 -879 -5020
970e020O197K998m903k21L330j899k681L817L353o012m139N935N061n785n773
$$ -5020 1177 4175 -728 -949 2381 482 -2199 1618 4971 -1041 -5180 755 5816 31 -5742
985e742L785O193k239n475L40L868J172k444j266J46J542J003j73j440l76M54
$$ -5742 -1957 4236 1997 -3478 -3138 730 1902 -542 -1808 -1662 -120 883 710 -730 -1106 -652
1001f52K152J213k199m163L225O225k631p963J488Q645m14q929j50P578n85n969
$$ -652 1500 2713 514 -3649 -424 5801 3170 -4793 -3305 5340 4926 -4003 -4153 3425 2840 -3129
1017c129J111M171k771k847N074J554p015j753Q717K839j0358k685J0477L239
$$ -3129 -2018 2153 -618 -3465 1609 3163 -3852 -5605 3112 5951 -4407 -7092 3385 6624
1031F624r368k638P889K078o180m9M362j741k835L377J982m674k255N208K718
$$ 6624 -2744 -5382 2507 4585 -1595 -1644 2718 977 -1858 1519 3501 -1173 -3428 1780 4498
1046D498n216l257L824L485k738l076K28K640J063j496k445J011K412J23k477
$$ 4498 -718 -3975 -151 3334 596 -2480 -2252 388 1451 -45 -2490 -1479 933 1056 -1421
1061a421j7J572J81q61J445N78l443P96M890q31o326P93P348o02p617L88P168
$$ -1421 -1438 134 315 -546 899 1477 -1966 -1170 3720 2889 -3437 -2644 4704 4102 -3515 -3127 4041
1078D041j113n949J133M324k586k826L575J594n418n03O559L03p249N6P410J23
$$ 4041 2928 -3021 -1888 2436 -150 -2976 599 2193 -3225 -3728 2831 3134 -4115 -4059 3351 3474
1094C474o946M97N413m00l318Q02K264j950m46K783o19l472J476L149j235l802
$$ 3474 -3472 -2975 2438 2038 -1280 -478 1786 -164 -610 2173 1554 -1918 -442 2707 1472 -2330
1110b330J257K505j017j237L90J37p51J283N65k524q25L293J194l589p49L803
$$ -2330 -1073 1432 415 -822 -432 -295 -1046 237 802 -1722 -2547 746 1940 -1649 -2398 1405
1126A405q9k693O81K586j874j308L054M67l568J20M355q76m617J636L733j620
$$ 1405 1316 -1377 -696 1890 16 -1292 1762 2229 -1339 -1219 3136 2260 -2357 -721 3012 1392
1142A392l609J874K437k645j486L021L95l647M02L633j178l865J854L954k421
$$ 1392 -2217 -343 2094 -551 -2037 984 1379 -2268 -1866 1767 589 -3276 -1422 2532 111
1157A11k905K853K144k796q88K812K44k972J379K986k514k397K767K143l062j675
$$ 111 -2794 59 2203 -593 -1481 1331 1575 -1397 -18 2968 454 -1943 824 2967 -95 -1770
1173a770K793R13k855jK375j018k367J779J385k319j368K965P86l381K61L057
$$ -1770 1023 1936 -919 -920 1455 437 -1930 -151 1234 -1085 -2453 512 1298 -2083 -1822 1235
1189A235j037k043J491J904j912r15K135N79k371L71K992j344k439J498K437k372
$$ 1235 198 -1845 -354 1550 -362 -1277 858 1437 -934 -563 2429 1085 -1354 144 2581 209
1205B09j892K062J298k508o16K614k25k988Q17K804k071j770J907J952k856j039
$$ 209 -1683 379 1677 -831 -1447 1167 942 -2046 -1229 1575 -496 -2266 -359 1593 -1263 -2302
1221b302L035O95l008K68L060j088k236J934J814k067j487K597N45k219l14K207
$$ -2302 733 1428 -1580 -1312 1748 660 -1576 358 2172 105 -1382 1215 1760 -459 -773 1434
1237A434L9k570Q73J543j386j629J707J064k273n78K550l91k124P68J921j368
$$ 1434 1473 -1097 -224 1319 -67 -1696 11 1075 -1198 -1776 774 383 -1741 -973 948 -420
1253d20j266J901P03j722n2J842l7j836J040J622j343j175J381J125j898n65J701
$$ -420 -1686 215 918 -804 -856 986 949 -887 153 1775 432 -743 638 1763 -135 -700 1001
1270A001N6j983L36J592o53j970J144J671j705j029J670L67j794n8K042m54j475
$$ 1001 1057 -926 -590 1002 349 -1621 -477 1194 -511 -1540 130 497 -1297 -1355 687 233 -1242
1287a242M63K010j274j381K210L69j441k46J618P0j559L84J244o00j205Q27R54
$$ -1242 -779 1231 -43 -1424 786 1155 -286 -532 1086 1156 -403 -19 1225 625 -580 247 1201
1304A201j517p04J560K1j439j17J284Pj490M91J114r97k92M94N02n19K91Q46o41
$$ 1201 -316 -1020 540 561 -878 -995 289 296 -1194 -703 411 -586 -878 -384 118 -401 -110 736 95
1323I5r15J093O19n45m85P52K85p00J23J61l75m04P40K16j418%J032L04j641k0
$$ 95 -820 273 892 347 -138 614 899 199 322 483 108 -296 444 660 -758 -758 274 578 -1063 -1083
1343a083J155q2n46j79Q26o11l12N58N26j017M2J069M05q86j63J027k1p96k09
$$ -1083 72 -10 -556 -735 91 -520 -832 -274 252 -765 -723 346 751 -135 -298 729 708 -88 -297
1362b97P50K18j75k28q8M6l38L15j87n74L70N94o77n61L52J11K29k31J72l87J39
$$ -297 453 671 496 268 180 226 -112 203 16 -558 -188 406 -271 -832 -480 -369 -140 -371 -199 -586 -447
1383d47N77J14n08j12Q18K64n41j69K76L36k76k1l97M58M6k96L49k48o75O78M65
$$ -447 130 244 -264 -376 442 706 165 -4 272 608 332 311 -86 372 418 122 471 223 -452 226 691
1404F91r25o70P62M57m91p14K11Q33K37q88m03Q60M35o32k79M13K33j45K30M72
$$ 691 -234 -904 -142 315 -176 -890 -679 154 391 -497 -900 -40 395 -237 -516 -103 130 -15 215 687
1424F87o75k25O39Q68j140n71N19J069q25j197P02R15m65j063J01R05l87l46K6
$$ 687 12 -213 426 1294 154 -417 102 1171 346 -851 -149 766 301 -762 -661 244 -143 -489 -463
1443d63L68p08K65O76J09o20l87J000P19j111p24R74J378r07j261N54J542r29
$$ -463 -95 -803 -538 138 247 -373 -760 240 959 -152 -876 98 1476 569 -692 -138 1404 475
1461D75q86N00R43j005m44P81J25j117l97J504J09j754l80K156J38k310P4J938
$$ 475 -411 89 1032 27 -417 364 489 -628 -1025 479 588 -1166 -1546 610 748 -1562 -1488 450
1479D50N36j781l61J976j32j370Q43P74o80r04Q52J132j027j334J102J657j304
$$ 450 986 -795 -1156 820 688 -682 161 935 255 -649 203 1335 308 -1026 76 1733 429
1496D29j362N67J274m52j300J73J409p40o39J7J037o03o27P49M54q22n75J181
$$ 429 -933 -366 908 456 -844 -671 738 -2 -641 -624 413 -190 -817 -68 386 -436 -1011 170
1514A70P08r28j005J227J317r80j778J425J527j034j460R60J006p55r38R60M95
$$ 170 878 -50 -1055 172 1489 509 -1269 156 1683 649 -811 149 1155 400 -538 422 917
1531I17j385n61J706J63k120J82J944qk259N6K011N5j788K96J427J83j397L79
$$ 917 -468 -1029 677 840 -1280 -1098 846 838 -1421 -1365 646 701 -1087 -791 636 819 -578 -199
1549a99J163q82o25J231K19q83n17J127M43j091k90O50L50n85n31M56Q5K10q53
$$ -199 964 82 -543 688 907 24 -493 634 1077 -14 -304 346 696 111 -420 36 121 331 -522
1568e22q6N03J22k26l07L61l4l44R1O99l13p91P60J224r51j117J068J188p55r16
$$ -522 -608 -105 17 -209 -516 -155 -189 -533 -442 257 -56 -847 -87 1137 186 -931 137 1325 570 -346
1588c46O80O46n73q67O31N87j085j45J182l43j307M61J238n44j434P00J186p61
$$ -346 334 980 407 -460 171 758 -327 -472 710 367 -940 -479 759 215 -1219 -519 667 -94
1606i4r82Q82O10o99k24J166j97j018Q60O44m99j047P81O26n92j97L29j1m33j20
$$ -94 -1076 -194 416 -283 -507 659 462 -556 304 948 449 -598 183 809 217 20 349 338 -95 -215
1626b15N58l65l10N78m3o98k1O54j86p84J18P93k58m18N05P0k32k31J323k90j031
$$ -215 343 -22 -332 246 203 -495 -516 138 -48 -832 -714 79 -179 -597 -92 -22 -254 -485 838 548 -483
1647d83N11R02o13q34Q82L66n83m54P82m0q59L1R86m20r88N47J019j097p93J104
$$ -483 28 930 317 -517 365 731 148 -306 476 436 -423 -392 594 174 -814 -267 752 -345 -1138 -34
1667c4O88j120n47J119j87n25K22Q37m88o03O50L45n27l10J132L9j006K87P30
$$ -34 654 -466 -1013 106 -81 -606 -384 453 -35 -638 12 357 -170 -480 652 691 -315 -28 702
1686G02j83n29R9M83p08j3O50j58q58j49J004m01n46K76N69n94n91Q61J83n09
$$ 702 519 -10 89 572 -136 -149 501 343 -515 -664 340 -61 -607 -331 238 -356 -947 -86 97 -412
1706d12J72O18k46p39P61M97o81m82P82P41r91j75P07N6o10Q7M96n02p88O88P55
$$ -412 -240 378 132 -607 154 651 -30 -512 270 1011 20 -155 552 608 -2 85 581 79 -709 -21 734
1727G34p48l78L34N76j193J40N92J10q44N14M87l81l74N90L83j056K01Q18O3q01
$$ 734 -14 -392 -58 518 -675 -535 57 167 -677 -163 324 -57 -431 159 542 -514 -313 505 568 -233
1747b33L25O22l60n15N07J28o99K01M91n15m50M34P24r29l25M12N00o46k31N67
$$ -233 92 714 354 -161 346 474 -225 -24 467 -48 -498 -64 660 -269 -594 -182 318 -328 -559 8
1767Hr9l69p2Q67l14n24N08O44p21l52Q65J95n82J18L72k6p72M22J92l73m95Q45
$$ 8 -91 -460 -532 335 21 -503 5 649 -72 -424 441 636 54 172 544 518 -254 168 360 -13 -508 337
1789C37m8m43j38M93j18q55O00L65m67m30O93N26q13m94J241k83q04L70O46j33
$$ 337 289 -154 -292 201 83 -772 -172 193 -274 -704 -11 515 -298 -792 449 166 -638 -268 378 245
1809B45o32N32N61n59k66M06M43q63L5P72l20p33L14N81m55n28J56K03k36N2M09
$$ 245 -387 145 706 147 -119 287 730 -133 -98 674 354 -379 -65 516 61 -467 -311 -108 -344 -292 117
1830A17j81n37M53K53o08l8O33J42o27K50N97k47m54N92M8l42l43O91L30j035
$$ 117 -64 -601 -148 105 -503 -541 92 234 -393 -143 454 207 -247 345 393 51 -292 399 729 -306
1850c06k24J353m12p51J94K83j57m91K86M68m49l47L39K97o46J72N81M1o20J60
$$ -306 -530 823 411 -340 -146 137 -20 -511 -225 243 -206 -553 -214 83 -563 -391 190 231 -389 -229
1870b29Q31j91p69L01O49n84N5M02k55k58K23K81l31j49K21M30n71n00M65j34
$$ -229 602 411 -358 -57 592 8 63 465 210 -48 175 456 125 -24 197 627 56 -444 21 -113
1890a13n89N36J12j12k42N78j06n00q2M51L53o02q8P97q6j39K3N07m97j7K71J45
$$ -113 -702 -166 -54 -166 -408 170 64 -436 -518 -67 286 -316 -404 393 307 168 191 698 201 184 455 600
1912F00m41l82P74j2o96K1L78L1k63j85N4J66l65J14P3M8j80K63J56m40M68m53
$$ 600 159 -223 551 539 -157 -136 242 273 10 -175 -121 45 -320 -206 -133 -85 -265 -2 154 -286 182 -271
1934b71M79k15K57k82O2L32m1m21J55N25l16o68L20P10l09n84J87L55l94k72M62
$$ -271 208 -7 250 -32 30 362 321 -100 55 580 264 -404 -84 626 317 -267 -80 275 -119 -391 71
1955G1L0n43j15O19K95o07r9M07M93r85P7M96J95m23l28N50l4M8k21N76j52o03
$$ 71 101 -442 -557 62 357 -250 -349 58 551 -434 -357 139 334 -89 -417 133 99 147 -74 502 350 -253
1977b53M30K29q2o19J85N79m81n40M17L71k04n31K58J20L76q80N65J33M3m78K97
$$ -253 177 406 324 -295 -110 469 -12 -552 -135 236 32 -499 -241 -121 255 -625 -60 73 116 -362 -65
1998f5L47k91m54O74J91p71K18L64J99m77j95P12p3k26l71M42J6l54O4Q4P6l24
$$ -65 282 -9 -463 211 402 -369 -151 213 412 -65 -260 452 379 153 -218 224 240 -114 -50 34 110 -214
2020b14l80P49k56k01J14J68K51n89o6L64J11Q5m17P70J54o28Q2j83R01p83k60
$$ -214 -594 155 -101 -302 -188 -20 231 -358 -424 -60 51 136 -281 489 643 15 97 -86 815 32 -228
2041b28O61l45l56K06L98m8q73P05L41n88l11M03M40o53n81O87N57p82J36L87
$$ -228 433 88 -268 -62 336 288 -585 120 461 -127 -438 -35 405 -248 -829 -142 415 -367 -231 156
2061A56J56m92j93O28Q5n05J98J68O5l65J39K95j14k69J00l4J6J70l35J07J38
$$ 156 312 -180 -373 255 340 -165 33 201 266 -99 40 335 221 -48 52 18 34 204 -131 -24 114
2082A14j36j7J66%j38q6l8K04m18j83K41O21n88k41P83K45o63M3L26K83n81j13
$$ 114 -22 -39 127 127 -11 -97 -135 69 -349 -532 -291 330 -258 -499 284 529 -134 -91 235 518 -63 -176
2104a76M86P0m55qO14m25o13M66M85m44k67L80j69k52n1L97Qm45j1M94l06o5J45
$$ -176 310 380 -75 -83 531 106 -507 -41 444 0 -267 113 -56 -308 -359 38 46 -399 -410 84 -222 -287 -142
2127a42K26L5k85O9L02n08p0N75J96l60K07n1l7j40K04m6n9J93k69j54j77M08
$$ -142 84 119 -166 -97 205 -303 -373 202 398 38 245 194 157 17 221 175 116 309 40 -114 -291 117
2149A17j59l30p6N70k61k68K65M29l49m55O56R9m28j50L40L68m52Q4O68r3o76
$$ 117 -42 -372 -448 122 -139 -407 -142 287 -62 -517 139 238 -190 -340 0 368 -84 0 668 575 -101
2170a01K38K80m65m27N57J70k78m68N35M5o62L63L34k19m28M03L88n15J70J09
$$ -101 137 417 -48 -475 82 252 -26 -494 41 86 -576 -213 121 -98 -526 -123 265 -250 -80 29
2190B9j61J98k14M09k69l65M39K91k80p5K95j57q3l66O73l9m18L21M0m63Q8R9
$$ 29 -132 66 -148 261 -8 -373 66 357 77 2 297 140 57 -309 364 325 -93 228 268 -195 -107 -8
2212hr6j17J35L25k19o18M34N44k99o88M15L43m55k46N24M39n79K47J12n0m84
$$ -8 -104 -221 -86 239 20 -598 -164 380 81 -607 -192 151 -304 -550 -26 413 -166 81 193 143 -341
2233c41N32J34j46j94K44M6o09L57j74P2j24J53j99j3k55O30j87j49K58K79k99
$$ -341 191 325 179 -15 229 275 -334 23 -151 -79 -203 -50 -249 -262 -517 113 -74 -223 35 314 15
2254A5j95J65J62k46j62N18m0n09J71Q44n42k69L1L04j91q2K18K27m18j10M1J93
$$ 15 -180 -15 147 -99 -261 257 217 -292 -121 723 181 -88 -57 247 56 -26 192 419 1 -109 -68 125
2276A25l19k2M42r9o99L35K73j39k73N88l03j89P8M80k44j07J29j9j43J97K21
$$ 125 -194 -216 226 127 -572 -237 36 -103 -376 212 -91 -280 -202 278 34 -73 56 37 -106 91 312
2297C12q2l48Q1M83l13m91M96K1k27l0j71O71o92L36j51k9k63j03N40j6p3j6K76
$$ 312 230 -118 -37 446 133 -358 138 159 -68 -98 -269 402 -290 46 -105 -134 -397 -500 40 24 -49 -65 211
2320B11n13J68K66n7Q9r1L39n29M17k10J79l23p2L21Pk62K4K65n11L65j56J46
$$ 211 -302 -134 132 75 164 73 412 -117 300 90 269 -54 -126 195 202 -60 -36 229 -282 83 -73 73
2342G3j82l01N92l31J6K03j82K74l79L28j2l83O5M33k7K1k00L28j11j52k62K16
$$ 73 -109 -410 182 -149 -133 70 -112 162 -217 111 99 -284 -219 214 187 208 8 336 225 73 -189 27
2364B7Q0N0R7o8j73j63K61k2j27k01K11R2l0j48m5kJ60l5j20J75o4J06l5L5N9
$$ 27 107 157 254 186 13 -150 111 89 -38 -239 -28 64 34 -114 -159 -161 -1 -36 -156 19 -45 61 26 61 120
2389A20j32J12l56L57k27l9K33M25m32r0J3L9j63L79l19J8L0j98L58k20j67N7
$$ 120 -12 100 -256 101 -126 -165 68 493 61 -29 -16 23 -140 239 -80 -62 -32 -230 128 -92 -259 -202
2411b02L39j92l32K62M37n07L3J80L7j31j7K89j56Nn3R0Jj06j1Q6n9N5L2J87k70
$$ -202 137 -55 -387 -125 312 -195 -162 18 55 -76 -93 196 40 45 -8 82 83 -23 -34 52 -7 48 80 267 -3
2436cJ49j34k2K46m66m8M95j47K5n79L33J59j75m9K08O2k00J72J65j00L1j58K47
$$ -3 146 12 -10 236 -230 -278 217 70 95 -484 -151 8 -167 -216 -8 54 -146 26 191 91 122 -36 211
2459B11k34J03q7L19J50n69k8J07L12m30J39J50r5j55N2J46j83J4q1K82l09r8
$$ 211 -23 80 -7 312 462 -107 -135 -28 284 -146 -7 143 48 -107 -55 91 -92 -78 -159 123 -186 -284
2481b84K39j07J50j98K11K56j99j86L69j74j90K85k31Q4L4k22L20j73K16m38J33
$$ -284 -45 -152 -2 -200 11 267 68 -118 251 77 -113 172 -59 25 59 -163 157 -16 200 -238 -105
2502a05Q0J02j80k7K75l38K48L5j09j14kK18N7k40Q3O4k04J67J29r1K14k42k0
$$ -105 -25 77 -103 -130 145 -193 55 90 -19 -133 -135 83 140 -100 -17 47 -157 10 139 48 262 20 0
2525@O4j13n4O6J37k85P7j10M2J66k64L23PK6j56k01O6K49m2j86M6K49P8l98M54
$$ 0 64 -49 -103 -37 100 -185 -108 -218 -176 -10 -274 49 56 82 -74 -275 -209 40 -2 -188 -142 107 185 -213 241
2550B41j6q8j97L88m79J01j2N9J32k85K5L19Q7j03j42J41l25J8J25Q3l21j03K87
$$ 241 225 137 -60 328 -151 -50 -62 -3 129 -156 -131 188 275 172 30 171 -154 -136 -11 72 -249 -352 -65
2573f5N4J30k61L51Lj50jL3Q2j02O9J4j12j20L37l78L60k57l6J6J57J58l61J41
$$ -65 -11 119 -142 209 212 62 61 94 176 74 143 157 45 -75 262 -116 244 -13 -49 -33 124 282 -79 62
2597F2Q2j85k11L04k58J61j60K5K05j26o2J38J89k50J06J75J19m37K3L68j99r7
$$ 62 144 -41 -252 52 -206 -45 -205 -180 25 -101 -163 -25 164 -86 20 195 314 -123 -100 268 69 -28
2619b8J5L53m16K98n5J5k16j3O2L68n13j37M23k97PK52j58RJ29k22J80j55l8L89
$$ -28 -13 340 -76 222 167 182 -34 -47 15 383 -130 -267 156 -141 -134 118 -40 -31 98 -124 56 -99 -137 252
2643B52l50J10J1R6l68K76r6L04k82o8K65k02r7J26M6J01n22N00q4l73J99L35
$$ 252 -98 12 23 119 -249 27 -69 235 -47 -115 150 -52 -149 -23 23 124 -398 102 18 -355 -156 179
2665A79k63j22L4L78l54q6L10j13L23m97M54j31j53m2K36k33K63J24j01j73O1
$$ 179 -84 -206 -172 206 -148 -234 76 -37 286 -211 243 112 -41 -83 153 -80 183 307 206 33 94
2686I4O7n0k71J69K47l05L4j62K02j80K42j40J69l11o9M46l67K06J9j47O7j95
$$ 94 161 111 -160 9 256 -49 -15 -177 25 -155 87 -53 116 -195 -264 182 -185 21 40 -107 -40 -235
2708b35M28j25j25j02K76P1k05p4L49k44k04J08N04l66P0K06j74l23J82Q4j71
$$ -235 193 68 -57 -159 117 188 -17 -91 258 14 -190 -82 422 56 126 332 158 -165 17 101 -70
2729g0m9%K40j27l27K74K69k84k01J77L14j49n5r2M7Q1K54l46k67K20j47J23J40
$$ -70 -119 -119 121 -6 -333 -59 210 -74 -275 -98 216 67 12 -80 -33 48 302 -44 -311 -91 -238 -115 25
2752B5l0M18m55J8RJ20l54K34o7%k78M79k30K69m88K96k33J56J08KK05l50mL06
$$ 25 -5 413 -42 -24 -15 105 -249 -15 -82 -82 -360 119 -111 158 -330 -34 -267 -111 -3 -1 204 -146 -150 156
2776A56j33J59j22m1r1n7M04k29k04j30J89K86j46k33L12k7k35L2LM3l1J63j38
$$ 156 23 182 60 19 -72 -129 275 46 -158 -288 -99 187 41 -192 120 93 -142 -110 -107 -64 -95 68 -70
2799g0k6J15N4j12j29J61L04m76J50L57k29j69J44kp2R7M7j49R7R1p0j16O2j03
$$ -70 -96 19 73 -39 -168 -7 297 -179 -29 328 99 -70 74 72 0 97 144 -5 92 183 113 -3 59 -44
2823d4K0J07l15L0K82l21J24L69l66o0K85J73m85J5J59O3K08l46r1k8K95J11k43
$$ -44 -24 83 -232 -202 80 -241 -117 252 -114 -174 111 284 -201 -186 -27 36 244 -102 -193 -221 74 185 -58
2846e8J3M6k9j80k1J17L31k51p6Q5R5l0k6j28K46j05m17M73J5l18J6M11j62O9
$$ -58 -45 1 -28 -208 -229 -112 219 -32 -108 -23 72 42 16 -112 134 29 -388 85 100 -218 -202 209 47 116
2870A16n84N08r1j55K13J69j22j2J14j50pj59J42K32j91Q4J34n51M18j27P7P1
$$ 116 -468 40 -51 -206 7 176 54 42 156 6 -1 -160 -18 214 23 107 241 -310 108 -19 58 129
2892A29l07K47P8k37N6j58Q8J60M4o3j96K30J13k74Oj2K63pm97N36j13Q4l05L24
$$ 129 -178 69 147 -90 -34 -192 -104 56 100 37 -159 71 184 -90 -84 -96 167 160 -337 199 86 170 -135 189
2916A89N3l43J73K4l9j83JK77j80L6Q7L4j88KK43j67j23r5n8K93j28J93n3J59
$$ 189 242 -101 72 96 57 -126 -125 152 -28 8 95 129 -59 -57 186 19 -104 -199 -257 36 -92 101 48 207
2940B07j29j09L34p7M8p6j89j80J98p1J56k08J66m38L75K30l62k66OJ67p9J71
$$ 207 78 -31 303 226 274 198 9 -171 27 -44 112 -96 70 -368 7 237 -125 -391 -385 -218 -297 -126
2962a26nl5R7j11K69j38j45L45j74K86j99qL48l18j74J30k8M05n72J0RK44m08
$$ -126 -131 -166 -69 -180 89 -49 -194 151 -23 263 64 56 404 86 -88 42 14 419 -153 -143 -134 110 -298
2985b98Q1J76J98l80O4K06l21O5K21N0M4k40N7L46l17j41J37R7J14k9O8n91L10
$$ -298 -217 -41 157 -223 -159 47 -274 -209 12 62 106 -134 -77 269 -48 -189 -52 45 159 130 198 -393 -83
3008h3J11l52M60k20J16O5m4N7q8j69K93k63o9L70n03J56J8O7K12j4m3N1j48R
$$ -83 28 -324 136 -84 32 97 53 110 22 -147 146 -117 -186 184 -319 -163 -145 -78 134 120 77 128 -20 -11
3032a1J86O4l47K17k40K30l6j75K74J06k40O7k26P3q9Q7q3K00P3k9j35O6k91J29
$$ -11 175 239 -108 109 -131 99 63 -112 162 268 28 95 -131 -58 -147 -60 -143 57 130 101 -34 32 -259 -130
3056a30K8K4K11k06PM35l52p8J34l4pkj86J15K50k76J75j53K02p6j46J32j01k
$$ -130 -102 -78 133 -73 -66 369 17 -61 73 39 32 30 -156 -41 209 -67 108 -45 157 81 -65 67 -34 -36
3080c6l7O7k43L17l41J85K44j61K2o7K45k26k69K57q4J63j67J52Q5r2k01K74m1
$$ -36 -73 -6 -249 68 -273 -88 156 -5 17 -50 195 -31 -300 -43 -127 36 -131 21 106 14 -187 87 46
3103D6j19K92j72k66L39j12K38p2l66L12k44J78N5j76J02Q1k60P5J08j50L2J73
$$ 46 -73 219 47 -219 120 8 246 174 -192 120 -124 54 109 -67 35 116 -144 -69 39 -111 -79 94
3125I4k36L8J10J40k94J17j22l4K60M0j63J95r1J33J85n90M07l14j81J38J43P9
$$ 94 -142 -104 6 146 -148 -31 -153 -187 73 113 -50 145 54 187 372 -218 189 -125 -306 -168 -25 54
3147E4j08r3O6l0k37N90l40N2j81M87k37q2Lj48N01k27k54L29K4N0k10R5L15l97
$$ 54 -54 -147 -81 -111 -348 242 -98 -46 -227 260 23 -59 -56 -204 297 70 -184 145 169 219 9 104 419 22
3171B2k79O04m68K21j62J61l86J66q5M03j46J23l09J03k21L6K52N1k49J6L13j22
$$ 22 -257 347 -121 100 -62 99 -287 -121 -206 197 51 174 -135 -32 -253 -217 35 86 -163 -147 166 44
3193D4j3l05M40j52j54L55l33R8R1N7Q6k19r8K1j16L00J47l53R6K57k19l05K62
$$ 44 31 -274 166 14 -140 215 -118 -20 71 128 214 -5 -103 -82 -198 102 249 -104 -8 249 30 -275 -13
3216a3Q7j22k46K20j16J69o3n4K69k10P0q8J50j09j6K43M4K9q7j65K88l02o5K46
$$ -13 74 -48 -294 -74 -190 -21 -84 -138 131 -79 -9 -97 53 -56 -72 171 215 244 157 -8 280 -22 -87 159
3240A59k27M9K2P9qk72L11J4m32J03J18K54k21O0J77n5q7J33m07N2K86N4l55L30
$$ 159 -68 -19 3 82 74 -198 113 127 -305 -202 -84 170 -51 9 186 131 44 177 -230 -178 108 162 -193 137
3264A37j43J5j77R0J32L2l22L49J62k29k9j7J10l36R8K24j21j43J51j18L00m69
$$ 137 -6 9 -168 -78 54 86 -236 113 275 46 17 0 110 -226 -128 96 -25 -168 -17 -135 165 -304
3286c04L44O0J09l44m9J81p6K61k28J48j86K34j33p9L33l68J86j02k17L45j77
$$ -304 40 100 209 -135 -184 -3 -79 182 -46 102 -84 150 17 -62 271 -97 89 -13 -230 115 -62
3307f2o5mj42J12K43L2k45j16L21j0j03L0n5K3J31k27j1O6k9J38J67j41O4l1p2
$$ -62 -127 -131 -273 -161 82 114 -131 -247 74 64 -39 -9 -64 -41 90 -137 -148 -82 -111 27 194 53 117 86 14
3332A4nJ49o9L2k94R9j02K25j34j73M99m22L7Q3k5j45J7M01j67q6J18j35n6M58
$$ 14 9 158 89 121 -173 -74 -176 49 -85 -258 241 -181 -144 -61 -86 -231 -214 187 20 -66 52 -83 -139 319
3356C19l00o1P8J75k24j10N4k9Q9LJ72k44J26j08J03j49K28Mk1k82K19k00K56
$$ 319 19 -42 36 211 -13 -123 -69 -98 -9 -6 166 -78 48 -60 43 -106 122 126 105 -177 42 -158 98
3379I8J13l32k6J23k08J55K38k05j50N8L15k31K18j14o2K29k86J60j8J04l72J70
$$ 98 211 -121 -147 -24 -232 -77 161 -44 -194 -136 179 -52 166 52 -10 219 -67 93 75 179 -193 -23
3401b3K59m15J32J65m01K32j11J57N0J39k12mr2j0J91j38J23O0j51P9P2k54K09
$$ -23 236 -179 -47 118 -283 -51 -162 -5 45 184 -28 -32 -124 -134 57 -81 42 102 -49 30 102 -152 57
3424E7r2K50k12K35j17k4k92K91j41K08j68m3K34m01K35pj19J00M2J63k39l25
$$ 57 -35 215 3 238 121 97 -195 96 -45 163 -5 -48 186 -215 20 13 -106 -6 36 199 -40 -365
3446c65N11k11pK3k48J60M13k00j10m3j4J56o9j67M29j52j49K72j17j31J2J54
$$ -365 146 -65 -72 -49 -297 -137 276 76 -34 -77 -91 65 -4 -171 258 106 -43 229 112 -19 -7 147
3468A47k38j04M7J11J85l46K06r6J3j23j15K30K4J61m4J73k20Q6l54K90J21k99
$$ 147 -91 -195 -148 -37 148 -198 8 -88 -75 -198 -313 -83 -59 102 58 231 11 97 -257 33 154 -145
3490a45K28j48K08k0k84N30l33qOp9nL22l78J40J6k4j28N9K09l03J01l5l06J66
$$ -145 83 -65 143 123 -161 369 36 28 34 -45 -50 272 -106 34 50 26 -102 -43 166 -137 -36 -71 -377 -211
3514b11L45J31j17j29m8O5P8k85L40j7j42o5J24j92j79K32Q8p2k60o4Q2K99J95
$$ -211 134 265 148 19 -29 36 114 -171 169 152 10 -55 69 -123 -302 -70 18 -54 -314 -378 -296 3 198
3537A98k33r1K98J6o9l79K10P2k08K24j71K30J6j28J25k72M14k06J05j85j43K56
$$ 198 -35 -126 172 188 119 -260 -50 22 -186 38 -133 97 113 -15 110 -162 252 46 151 -34 -177 79
3559G9l06J55l4Q7N9Mn7r7K17q0J2j46K35j70J4K79o60K46J01J59J60m19J68k6
$$ 79 -227 -72 -106 -19 40 44 -13 -110 107 27 39 -107 128 -42 -28 251 -409 -163 -62 97 257 -162 6 -20
3583b0K4r0k3K78j30qn7N2j27L62k48j70K15p7R7k11o4K13P0R8p5k6p7l21K57
$$ -20 4 -86 -109 169 39 31 -26 26 -101 261 13 -157 58 -19 78 -133 -197 16 86 184 109 83 6 -315 -58
3608e8Jn5L22m20K03j65R5J19j18J34n3J63j60pj24L12m50N48k63k04J28pJ67
$$ -58 -57 -112 210 -210 -7 -172 -77 42 -76 58 5 168 8 1 -123 189 -261 287 24 -180 -52 -59 108
3631A08Mo8k18n5J35O3J7K0l20K03K51k02K4R0P9k26J09M4m4k7R1j21P6j24N6
$$ 108 112 44 -174 -229 -94 -31 -14 6 -314 -111 140 -62 -38 52 131 -95 14 58 14 -13 78 -43 33 -91 -35
3656c5R5Mj67m3K64j35J35k58K97N9k38k1O4k42K80k06K17p4K0rP4l0J97ok69
$$ -35 60 64 -103 -146 118 -17 118 -140 157 216 -22 -43 21 -221 59 -147 70 -4 16 7 81 51 248 242 -27
3681b7J42j20J47j02q6J49r4J91l81O1J52j69P3j08K67k9k6j03j11K62J96l54
$$ -27 115 -5 142 40 -46 103 9 200 -181 -120 32 -137 -64 -172 95 66 40 -63 -174 88 284 -70
3703g0M7L02k63j31J41Pk96L97j03Q2q4J32j62k58J47J80P5r4o0K24l87J47K34
$$ -70 -23 279 16 -115 26 33 -263 134 31 113 29 161 -1 -259 -112 68 143 49 -11 213 -174 -27 207
3726B07k16k3j46J40k8J06J66l06J25o6L46l56M4J26k00J43j80M57m39j30J81
$$ 207 -9 -32 -178 -38 -66 40 206 -100 25 -41 305 -51 -7 119 -81 62 -118 339 -100 -230 -49
3747d9L3j69K70L5j50j5K67k06R1N6k84J15m4j22J16O0K9l3n8m4lR3m0j01Q2Q1
$$ -49 -16 -185 85 120 -30 -45 222 16 107 163 -121 -6 -50 -172 -56 4 33 0 -58 -102 -105 -12 -52 -153 -71 10
3773A0l9p3N8J73Q1k22j87L59k57K01j73M3O9J41q2PR3j45J79p2j75j9J68k53
$$ 10 -29 -102 -44 129 210 -12 -199 160 -97 104 -69 -26 43 184 102 109 202 57 236 164 -11 -30 138 -115
3797a15N4n6J63p8r8J09o7K5K61j43r2K0K11j99K1j59L58j21o9O0k6K95m52K9
$$ -115 -61 -117 46 -32 -130 -21 -88 -63 198 55 -37 -17 194 -5 16 -143 215 94 25 85 59 354 -98 -69
3821f9j53K69J29j49P7j40J4L7J04k43j16O6J19K79j19l38K77k09J25L08k55O4
$$ -69 -222 47 176 27 104 -36 -22 15 119 -124 -240 -174 -55 224 105 -233 44 -165 -40 268 13 77
3843G7q2l9PK28m5J6j82O5J49j47r0Q0j90L7O3J87j34J0J5O8l43K62K12j94P6
$$ 77 -5 -44 -37 191 146 162 -20 45 194 47 -43 37 -153 -116 -53 134 0 10 25 93 -250 12 224 30 106
3868A06Nl97J67Q6M2l3q7J00o7k7J25j04QL51l12n2j34K05M3L05m55J3J50K24
$$ 106 111 -286 -119 -33 9 -24 -111 -11 -78 -105 20 -84 -76 275 -37 -89 -223 -18 25 330 -125 -112 38 262
3892B62l43M5pj53m7L76j83j34J71r9J88J37l81K79J9oj57M8j06J18o0R2L18n83
$$ 262 -81 -36 -43 -196 -243 133 -50 -184 -13 -112 76 213 -168 111 130 124 -33 15 -91 27 -33 59 377 -206
3916b06K04P6L6o6j3J78k20j63K41j88O5n3K21l1n9j04R5J22l60L70l56nR2K16
$$ -206 -2 74 110 44 31 209 -11 -174 67 -121 -56 -109 112 81 22 -82 13 135 -225 145 -211 -216 -124 92
3940I2K34p0k48K94l57L61k27lP7k19j3J74m5j70M45l61J23l2k18j22J41K59r1
$$ 92 326 256 8 302 -55 306 79 76 153 -66 -79 95 50 -120 325 -36 87 55 -163 -285 -144 115 24
3963B4p2mK07k61J40J12j23J96k88R6j3K25l44r1M48j86P2o0j61P6J47k78K50
$$ 24 -48 -52 155 -106 34 146 23 219 -69 27 14 239 -105 -196 252 66 138 78 -83 -7 140 -138 112
3986A12k63p9K92l42J09j04M46j83l2R2K05l25n3K98l02MK93r6j01oJ45k79J35
$$ 112 -151 -230 62 -280 -171 -275 171 -12 -44 48 253 -72 -125 173 -129 -125 168 72 -29 -35 110 -169 -34
4009c4K1K3j36L56j58k92J99J50l15J07q1J09N1k44L65j43k09K49J11j43M4j30
$$ -34 -13 10 -126 230 72 -220 -21 129 -186 -79 -160 -51 0 -244 121 -22 -231 18 129 -14 30 -100
4031a00q7J36K9j23o7M69M6l06P4Q8J0j77N3J24k10K06j41nn6k77N47l87M4J69
$$ -100 -187 -51 -22 -145 -212 257 303 -3 71 159 169 -8 45 169 -41 165 24 19 -37 -314 233 -154 -110 59
4055E9R2j65K51p8n6k43J02J03n2n2k00K76N1j51j54J96J6J15r5k0r0M4j23K96
$$ 59 151 -14 237 159 103 -140 -38 65 13 -39 -239 37 88 -63 -217 -21 -5 110 15 -5 -95 -51 -174 122
4079A22J43k24j39N8PJ78J74l79R2j28J74j69J82L6j4n6M8k51j09K05lj84K87
$$ 122 265 41 -98 -40 -33 145 319 -60 32 -96 78 -91 91 127 113 57 105 -146 -255 -50 -53 -237 50
4102E0m2j09nK09k51j34K93M4K3k40l6K87j51O7J0M9k43J49J52K5k04o1J58p4
$$ 50 8 -101 -106 103 -148 -282 11 55 78 -162 -198 89 -62 5 15 64 -179 -30 122 147 -57 -118 40 -34
4126c4J38L1j67J15p4J4J15J43j54j15K64J4k48j85K47j01q1L9J20j85L7q2K92
$$ -34 104 135 -32 83 9 23 138 281 127 12 276 290 42 -143 104 3 -78 -39 81 -104 -67 -149 143
4149A43m46K58n9n1K40o4K3l8k71L69M4j11Ok93K05o7K2K5K36k38J58q6j21K78
$$ 143 -303 -45 -104 -155 85 21 44 6 -265 104 148 37 43 -250 -45 -112 -90 -65 171 -67 91 5 -116 162
4173A62j80j48L55m7r5j76J81Q4j94o0K57m3o3m4o1J18K00j83r1o6K03k57R0J98
$$ 162 -18 -166 189 142 47 -129 52 136 -58 -118 139 96 33 -11 -72 46 246 63 -28 -94 109 -148 -58 140
4197A40j35j5J7J60l77M24m4J3j14P0k36m7M1O2J14j05j10J19J8L2n7J4q0K78
$$ 140 5 -10 7 167 -210 214 170 183 69 139 -97 -144 -103 -41 73 -32 -142 -23 -5 27 -30 -16 -96 182
4221A82jj70Q7O5l87K32j8K01j08p6Q1Q4k12n2J42j81K21j46M3K77m56L67k16
$$ 182 181 11 98 163 -224 8 -10 191 83 7 88 172 -40 -92 50 -131 90 -56 -13 264 -192 175 -41
4244d1J33j40mj04J21J17j48O7J24o0k42K79r1j05N8l7K15k48L3K39M1J74l81
$$ -41 92 -48 -52 -156 -35 82 -66 1 125 65 -177 102 11 -94 -36 -73 142 -106 -73 166 207 381 0
4267@P8q7J62L0m0l84M53k98J89q3Mm4k51K09R0N4l15J03J95j06Q4j32K25N7j69
$$ 0 78 -9 153 183 143 -241 212 -86 103 20 24 -20 -271 -62 28 82 -233 -130 65 -41 43 -89 136 193 24
4292B4L4M1q1L39k23k95P1J65j10j21R5O7r1N0L20k24m9n5n1M3q7L5L07k26J63
$$ 24 58 99 18 357 134 -161 -90 75 -35 -156 -61 6 -85 -35 285 61 12 -43 -94 -51 -138 -103 204 -22 141
4317A41k54o6P8OJ53J2L7k16N8J36j6m80L48l1K2L15l24K28l49O4K42L6j45Rl0
$$ 141 -113 -179 -101 -95 58 70 107 -109 -51 85 69 -411 -63 -94 -72 243 -81 147 -202 -138 104 140 -5 4 -26
4342b6O6m2l6k16J65j37n6L01j05j02K27o1O9n5m5K21l07P5J70l4K07j04p9o5
$$ -26 40 -2 -38 -254 -89 -226 -282 19 -86 -188 39 -22 47 -8 -53 168 -139 -64 106 72 279 175 96 31
4366C1J46k46o0O2r2K82j32q3K0P8m7j77J53j24K25j68K76j10Mq6L06n3j69M5
$$ 31 177 -69 -129 -67 -159 123 -9 -92 -72 6 -41 -218 -65 -189 36 -132 144 34 38 -48 258 205 36 81
4390H1P2m10K30o5k0P4pK17j67j30L80k13l9K6k74L02j66J38k03J45j67N9j14
$$ 81 153 -257 -27 -92 -112 -38 -45 172 5 -125 255 42 3 29 -245 57 -109 29 -174 -29 -196 -137 -251
4413b51J35L66N3k03k13J25P5k24n2J52qJ46O9j21k12R9j12K87j05o5J88j70P7
$$ -251 -116 250 303 100 -113 12 87 -137 -189 -37 -45 101 170 49 -163 -64 -176 111 6 -59 129 -41 36
4436C6j34J82j53k8K56j97P4l96L30j16L09J05j69p7k92K73j07J18K6j9J03j96
$$ 36 -98 84 -69 -97 159 -38 36 -360 -30 -146 163 268 99 22 -270 3 -104 14 40 21 124 -72
4458g2J13K0j1k23L62k15K9J76m18J99J04J14l33K80p0M7j18J33m14L69k41J02
$$ -72 41 61 50 -173 189 -26 3 179 -239 -40 64 178 -155 125 55 102 -16 117 -297 72 -169 -67
4480f7J33m7k52K5O1L1j81L04R3j65j78K42N4k45K43K0J9j42J25j70L9k0j4J92
$$ -67 66 19 -233 -208 -147 -116 -297 7 100 -65 -243 -1 53 -192 51 71 90 -52 73 -97 -58 -78 -92 100
4504A00k11K21K6j22Q2j78J31p2K7k44K27p8K16l92J2M41Rll28K30k24M03j95
$$ 100 -111 110 136 14 96 -82 49 -23 4 -240 -13 -91 125 -267 -255 186 195 192 -136 94 -130 273 78
4527G8j9l47j0L88q5P1l26J33L06k87k19J15K81o7j71n8K65J74l20N30l88L0j57
$$ 78 59 -288 -298 90 5 76 -250 -117 189 -98 -317 -202 79 12 -159 -217 48 222 -98 432 44 74 -83
4550h3J5K47o8k41J76r2M1K11l03K96k37Q1J38k06q6L19j24M0j05p3o3J05j60
$$ -83 -68 179 111 -130 46 -46 -5 206 -97 199 -38 43 181 -25 -111 208 84 124 19 -54 -117 -12 -172
4573a72K08r7n1J07p6j5RM7K9O8j70r6J45m9J03J95q7k74J71R8q2J1j51M24j69
$$ -172 36 -61 -112 -5 -81 -96 -87 -40 -11 57 -113 -209 -64 -113 -10 185 98 -176 -5 93 11 22 -129 295 126
4598A26J61r0l2j91Np6n9j25L94k4R9l63J32j21M02j15k70M8J54J06m64J84O7
$$ 126 287 197 165 -26 -21 -97 -156 -281 113 89 188 -175 -43 -164 238 123 -147 -99 55 161 -303 -119 -52
4621e2K25mj24k13J98J7q5m5K53j34n7j36K19J16k12Q6m8l82J88L10K34n77N1
$$ -52 173 169 45 -168 30 47 -38 -83 170 36 -21 -157 62 178 -34 52 4 -378 -190 120 354 -223 -172
4644a72K57j06j95L15J57k23R7r9J86P1l63N5K6m3n3j87M96l51L77m54K1J82J31
$$ -172 85 -21 -216 99 256 33 130 31 217 288 -75 -20 6 -37 -90 -277 219 -132 245 -209 -188 -6 125
4667A25k40n9J89p1k30J36j67L32j27k8o0j4J80p8J31k34L19ROo7n0j7k4L14m29
$$ 125 -115 -174 15 -56 -286 -150 -317 15 -112 -140 -200 -214 -34 -112 19 -215 104 113 119 52 2 -15 -39 275 -154
4692a54J30p9J35k20K90o1q7j21JrJ03l67P25j30j78M4J01j25j55L24k62J78j24
$$ -154 -24 -103 32 -188 102 41 -46 -167 -166 -175 -72 -439 286 156 -22 22 123 -2 -157 167 -95 83 -41
4715d1K70k63J38o3m6j78R7k4K29j55k48M07l1J67m59J02K00k48J42J3J5j14M63
$$ -41 229 -34 104 41 -5 -183 -86 -110 119 -36 -284 123 92 259 -200 -98 102 -146 -4 9 24 -90 373
4738C73l33m0J57m14L91q1J83k79j10K66r7N2n2k17K12m36L56J51j0j23jJ37m7
$$ 373 40 0 157 -257 134 53 236 -43 -153 113 16 68 16 -201 11 -425 -69 82 72 -51 -52 85 38
4761C8j75J59q1L3k61J81O4J38m14L19J36l12o3K93j07jJ01j39J87k32K58j35
$$ 38 -137 22 -59 -26 -287 -106 -42 96 -318 1 137 -175 -238 55 -52 -53 48 -91 96 -136 122 -13
4783a3K2q4l1K08k59J26j06O1L9J65k67K6L6Q9J44j15J44k19q2J52o7r2J69JK46
$$ -13 9 -75 -106 102 -157 -31 -137 -76 -37 128 -139 -113 -77 12 156 41 185 -34 -116 36 -31 -123 46 47 293
4808B93m70J84J44k94J01K38l01J83J00m05K00N5k23J64O7k65J09k4K80j64O8
$$ 293 -177 7 151 -143 -42 196 -105 78 178 -227 -27 28 -195 -31 36 -229 -120 -144 136 -28 40
4829D0r9l4J38K41m41n3K28p5J27k36P0R3k9K7k0L34l26n6J42n7m0K02n7j02l5
$$ 40 -59 -93 45 286 -155 -208 20 -55 72 -164 -94 -1 -30 -3 -23 311 -15 -71 71 14 -26 176 119 17 -18
4854a8r6M00j90p3k73J66R8oK55n11K63l9L05r2Kk28J69j71M9K8L1J12P6K0r2
$$ -18 -114 286 96 23 -250 -84 14 8 263 -248 15 -24 281 189 191 -37 132 -39 10 38 69 181 257 277 185
4879A85k37qJ41k9k71K05J6k8m1Rr5J49J23k46J50j71QJ13J63k34K54k8j09q2
$$ 185 -52 -60 81 52 -219 -14 2 -26 -67 -58 -153 -4 119 -127 23 -148 -140 -27 136 -98 156 128 19 -63
4903f3K1qM7j21N2K61k27J14p9J2J70o9k57J51k5J92j76j1q4p1J39K4J59o13M77
$$ -63 -42 -50 -3 -124 -72 189 -38 76 -3 9 179 110 -147 4 -21 171 -5 -16 -100 -171 -32 -8 151 -462 15
4928A5J03j37k30K18K6J29r5j1j5np1P4j38%KL48k53P2o8O7L6k62M30k34j45N8
$$ 15 118 -19 -249 -31 -5 124 29 18 3 -2 -73 1 -137 -137 -135 213 -40 32 -36 31 67 -195 235 1 -144 -86
4954h6K5J24p3m2KRJ18j32k26L91k00P9j02N17m53R0j5j12K22n0r5k72M27j54
$$ -86 -61 63 -10 -52 -50 -41 77 -55 -281 110 -90 -11 -113 404 -49 41 26 -86 136 86 -9 -281 146 -8
4978hK52k54N2m72L85n2QM8M6k21Q1k6J79J71l08K52l11O6K06L8k17J53p4J77
$$ -8 244 -10 42 -430 -45 -97 -89 -41 5 -216 -135 -161 18 189 -119 133 -178 -112 94 132 -85 68 -6 171
5002A71Nj64R5l0j54J49j84K18j03j73J35NK35l54J80j6j53N1j70J64J74j30J9
$$ 171 176 12 107 77 -77 72 -112 106 3 -170 -35 -30 205 -149 31 15 -138 -87 -257 -93 81 -49 -30
5025c0o6N3J10j58L7K85o49L93N9o8J23j42j26q0J47N4K74j7k03j03K22N3l5l0
$$ -30 -96 -43 67 -91 -54 231 -418 -25 34 -34 89 -53 -179 -259 -112 -58 216 199 -4 -107 115 168 133 103
5049A03j6k35L58n09M03l65K78r6J51r0L6J74j16Q9k80J90lN6n9j73O8k72O2K91
$$ 103 87 -148 210 -299 104 -261 17 -79 72 -18 18 192 76 165 -115 75 72 128 69 -104 -36 -308 -246 45
5073D5K17k07k27K01j08J49l7J11J6k38J27j98l4o0L57n1J23r3M0k95N3J97j88
$$ 45 262 55 -172 29 -79 70 33 144 160 -78 49 -149 -183 -243 114 63 186 93 133 -162 -109 88 -100
5096a00j59k8N06m01Q6J38RO4l15J18Q0j31J95L7q6L04l71M0j77K02J38j43k19
$$ -100 -259 -287 219 -182 -96 42 51 115 -200 -82 -2 -133 62 99 13 317 -54 -14 -191 11 149 6 -213
5119b13K69Q2M3j10n4K13k00J44k83K19J00l61J26J43k1m2k5j86k3J73Q6k86R0
$$ -213 56 138 181 71 17 230 30 174 -109 110 210 -151 -25 118 97 55 30 -156 -179 -6 80 -206 -116
5142a16mM9n3J14r8K7k7K46p0j08J00o4n5L72l28J21j84k05J42L10l87o1M15j66
$$ -116 -120 -71 -124 -10 -108 -81 -108 138 68 -40 60 -4 -59 313 -15 106 -78 -283 -141 169 -218 -279 136 -30
5166c0q6L5K07l31L79k74L61k54o8j19J58R8N2k93J59j94M7m3R7K13p4l30L51
$$ -30 -116 -81 126 -205 174 -100 261 7 -61 -180 -22 76 128 -165 -6 -200 -153 -196 -99 114 40 -290 61
5189F1O7j71k80L21n0o2J65o9rk91M82k88Q8j77L79j89J70j80K67k13J92j12l43
$$ 61 128 -43 -323 -2 -52 -114 51 -18 -27 -318 164 -124 -36 -213 166 -23 147 -33 234 21 213 101 -242
5212b42L44j86N9k3K67k08J7l8p0n3p3L73m4l48K05m7j9L48m26J29O1L6l23L27
$$ -242 102 -84 -25 -48 219 11 28 -10 -80 -133 -206 167 123 -225 -20 -67 -86 262 -164 -35 26 62 -261 66
5236F6k61j8K63R2j52K25j48J38N5l65jO1oQ1Mj74J10k59K14L41k94j34K60jj37
$$ 66 -195 -213 50 142 -10 215 67 205 260 -105 -106 -45 -51 30 34 -140 -30 -289 -75 266 -28 -162 98 97 -40
5261d0N2j78L79p3k00m1j16L28n1J2j91j3K19j86K49o0j00q8M39k87k35L09k37
$$ -40 12 -166 213 140 -60 -101 -217 111 60 72 -119 -132 87 -99 150 90 -10 -98 341 54 -181 128 -109
5284a09J38o7J11k05K31J03k0P2j76M3n2Q2j25P3K8J69k38nn7j36K57p0k20K14
$$ -109 29 -38 73 -132 99 202 182 254 78 121 69 151 26 99 127 296 58 53 -4 -140 117 47 -173 41
5308D1r0j03J59PK57j39m0l2k45J1M6J66L2p2J8P9M4jN4l80K24j00K84n1l11L47
$$ 41 -49 -152 7 14 271 132 92 60 -185 -174 -128 38 70 -2 16 95 139 138 192 -188 36 -64 220 169 -142 205
5334B05j90j00J30j65J19j2k5Q7k37J80J44o1o2j00J80%k20J01Nj2K44l61J41
$$ 205 15 -85 45 -120 -1 -13 -38 49 -188 -8 136 75 13 -87 93 93 -127 -26 -21 -33 211 -150 -9
5357iJ50N7j41q2j32J51j68L8J84n0oj25K58J22l11K2K18k47N2J27M2m4j10J60
$$ -9 141 198 57 -25 -157 -6 -174 -136 48 -2 -8 -133 125 247 -64 -42 176 -71 -19 108 150 106 -4 156
5381A56k86P3J65j21J84J75l78K6K93n38K17j74J32J69k05K78k48o5j69M57j14
$$ 156 -130 -57 108 -13 171 346 -32 -6 287 -251 -34 -208 -76 93 -112 166 -82 -147 -316 141 27
5402B7j8J38p7J10m25L26j23k61J49j41mJ77P2j60L23J03j40J83j39q3J65k34
$$ 27 9 147 70 180 -245 81 -42 -303 -154 -295 -299 -122 -50 -210 113 216 76 259 120 37 202 -32
5424c2k46M29k68J10J5R2k95K62jR6m4k53K99j71p2J80l32o3L66n3K34j72l44
$$ -32 -278 151 -117 -7 8 100 -195 67 66 162 118 -135 164 -7 -79 101 -231 -294 72 19 253 81 -263
5447b63K52L4Mq7J06L2k8R8j34l5j0J63k77K56r7Kk03K7L38j55lo7k39K57K18
$$ -263 -11 23 27 -60 46 78 50 148 14 -21 -31 132 -145 111 14 16 -187 -160 178 23 20 -47 -286 -29 189
5472A89k69P1J04K59l99L6k19J44M9J40n5m9J0j21L64k69J37r6j38K13k43J33
$$ 189 -80 -9 95 354 -45 -9 -228 -84 -35 105 50 1 11 -110 254 -15 122 26 -112 101 -142 -9
5494iQ0nK32m50P6L9K18k16j54L18k88J86j15j29J27K43j47L1p9RP9M43k74k22
$$ -9 71 66 298 -152 -76 -37 181 -35 -189 129 -159 27 -88 -217 -90 153 6 37 -42 -33 46 489 215 -7
5518gJ66j34J58k72p9K34Pj66L5K8J22k46O0P4J85l24q9J9K5J33J29j28k7J11
$$ -7 159 25 183 -89 -168 66 73 -93 -58 -30 92 -154 -94 -20 165 -159 -248 -229 -204 -71 58 -70 -97 14
5542A4k07J08J62L7l5j63m0K94j07N6k25J02q8n3O3K62Rj84j32K50q4j65K23p
$$ 14 -193 -85 77 114 79 -84 -124 170 63 119 -106 -4 -92 -145 -82 180 189 5 -127 123 39 -126 97 90
5566I0k88M17r0m34L97o8q8j8Q5P9k93J02J7k21K80K35l45N6L2O8n0K80k65J61
$$ 90 -198 219 129 -305 92 24 -64 -82 3 82 -211 -109 -92 -313 -33 202 -143 -87 -55 13 -37 243 -22 139
5590A39k71J4P1r3J20J0n6j3R6N2mK20k71oL48p31M71J33q7J7q3j17j07J28j23
$$ 139 -132 -118 -47 -140 -20 -10 -66 -79 17 69 65 285 14 8 356 -375 96 229 142 159 76 -41 -148 -20 -143
5615a43J74j70K01%m6J39p3k51K45Q3k64M71l08J3k04m9J9K79l1j38J09M9l95
$$ -143 31 -139 62 62 16 155 82 -169 76 159 -105 366 58 71 -133 -182 -163 116 85 -53 56 105 -290
5638b90J70L62l99J99j59O7P3nM9k3qj13J23k7k36K42j60L5K22k52K44r1J07k19
$$ -290 -120 242 -157 42 -117 -50 23 18 67 44 36 -77 46 19 -217 25 -135 -100 122 -130 114 23 130 -89
5662h9kJ32n1l7J09j99K8M04m01r6L17K4j20%Q7J4j66N5r3J61n0pk04J99n3Q1
$$ -89 -91 41 -10 -47 62 -137 -109 295 -106 -202 115 139 19 19 106 120 -46 9 -84 77 27 20 -184 15 -38 43
5688D3M2m43L08J57p0j61K65m0j78K46k23N8R7j67l60M86k35J24j04M32j91j48
$$ 43 85 -358 -50 107 37 -124 141 101 -77 169 -54 4 101 -66 -426 60 -175 -51 -155 277 86 -62
5710f2J25k56N34j73j14r6L1j29L8pJ06l4lJ81q1k93K45J8m0P7o2r8J56n7j34
$$ -62 63 -193 341 168 54 -42 -11 -140 -102 -109 -3 -37 -40 141 60 -233 12 30 -10 67 5 -93 63 6 -128
5735a28j75M3L93k60K01j89M4L60k52q7J03j02J78R8l22j16J31M78k2o15K12M3
$$ -128 -303 -260 133 -127 74 -115 -71 289 37 -50 53 -49 129 227 -95 -211 -80 398 376 -239 -27 16
5757A6P9k8l0q6K90k88nm6J69m6J6o5k31Q3K01k0j14J67J43j06j47Pl4J9K37j31
$$ 16 95 67 37 -49 241 -47 -52 -98 71 25 41 -24 -255 -172 29 9 -105 62 205 99 -48 -41 -75 -56 181 50
5783E0N8R5j76J7p0j21J52p8L13j63l08L09K36l20L85m74J57j95p4L79k2j10m2
$$ 50 108 203 27 44 -26 -147 5 -73 240 77 -231 78 314 -6 379 -95 62 -133 -207 172 150 40 -2
5806bj04Q0K50k19O7j76N0j7J44J12l36K39J28l82N30l10j01Q5K68l32j28K79
$$ -2 -106 -26 224 5 72 -104 -54 -71 73 185 -151 88 216 -166 364 54 -47 38 306 -26 -154 125
5828A25j77J3N3k49L55l4k92M05k9k64K16k90J71p8Q3lpj10L10J23m22L0K01j48
$$ 125 -52 -39 14 -235 120 86 -206 199 170 -94 122 -168 3 -75 8 5 -2 -112 198 321 -101 -71 130 -18
5852a8j21M45m26K42j79K0R4j68K00J57k55M9o5P3l0l09J24J19Q6j46P8J58l56
$$ -18 -139 306 -120 122 -57 -37 57 -111 89 246 -9 40 -25 48 18 -291 -167 -48 38 -108 -30 128 -228
5875b28K86P8j1R9k96Q0J72M4j48j89J35R9q7j61K48n5K18o15J86J05NM7p8oK6
$$ -228 58 136 125 224 -72 8 180 224 76 -113 22 121 34 -127 121 66 284 -331 -145 -40 -35 12 -66 -72 -46
5900d6k3L34k63k13K09j49J61k09K58J81j62k22J82j47R5k13K18J70j93j35Q1
$$ -46 -69 265 2 -211 -2 -151 10 -199 59 240 78 -144 38 -109 -14 -227 -9 161 -32 -167 -86
5921h6J13q2k78O3J45P3R1J09l45L69j79k24L96r6m2j16p1J62k54M11n09M15K
$$ -86 27 -55 -333 -270 -125 -52 39 148 -197 172 -7 -231 165 69 27 -89 -160 2 -252 159 -350 65 67
5944F7n4J74j15k08J17J1J62o8j38J1l39L65k19J17J27j00K02K2k20K63j78j3
$$ 67 13 187 72 -136 -19 -8 154 86 -52 -41 -380 -15 -234 -117 10 -90 112 134 -86 177 -1 -14
5966a4K0k00J00O0J53j62M1J34j48k3J12Lk2k49J17j02K83k76m9K00j6J54o4l42
$$ -14 6 -194 -94 -34 119 -43 -2 132 -16 -39 73 76 54 -195 -78 -180 103 -173 -222 -22 -38 116 52 -290
5990b90P2k1M12l01l4J98r8Q7o3l3N7J06m2j69J28m6N4j10J96j9j08J05k2j38
$$ -290 -218 -239 173 -128 -162 36 -62 25 -38 -71 -14 92 50 -119 9 -37 17 -93 103 84 -24 81 59 -79
6014g9k86M33j47j51K60J32n1k2R1j56j86m7L38k50N1k4J63J18j79J95m34Q6L78
$$ -79 -365 68 -79 -230 30 162 111 89 180 24 -162 -209 129 -121 -70 -94 69 187 8 203 -231 -145 233
6037B33j94rn4j17n4K48J49l15J55R6m8j03j02K33p3l34L38q3O1j7J3J63j11j72
$$ 233 39 30 -24 -141 -195 53 202 -113 42 138 90 -13 -115 118 45 -289 49 -34 27 10 23 186 75 -97
6061i7j12p5J65J70l6J03l18O9l8M03jk51o4K47k35mN5K14j52j91J6n7K2J8K76
$$ -97 -209 -284 -119 51 15 118 -200 -131 -169 234 233 -18 -82 165 -70 -74 -19 195 43 -148 -132 -189 -167 -149 127
6086A27k17q6J38K9lK82k53k92J46R2L31k09j10r9Q4K15j80L5J40L2l35J29k05
$$ 127 -90 -176 -38 -9 -12 270 17 -275 -129 -37 294 85 -25 -124 -40 175 -5 30 170 202 -133 -4 -209
6109b09O5K27j54M0k7J07K15j46j36r1K89o5o5j53O2P0M8j47nL0K3J89k17R9K2
$$ -209 -144 83 -71 -31 -58 49 264 118 -18 -109 180 115 50 -103 -41 29 77 -70 -75 -45 -22 167 -50 49 71
6134G1J2l71J43L34j08j53J14o5j9jK2PR2J9N6j79Qj11jR3Q8K56l19j8j85L69
$$ 71 83 -288 -145 189 81 -72 42 -23 -42 -43 -21 -14 78 97 153 -26 -18 -129 -130 -37 51 307 -12 -30 -215 154
6160A54P1q6k7O0k04j40K17r3r0o2P2K53J33j31l3k16J69l21J96R0j2O3j36L0
$$ 154 225 139 112 172 -32 -172 45 -48 -138 -200 -128 125 258 127 94 -122 47 -274 -78 12 0 63 -73 -43
6184d3J5J19j39j39J48P0J3J36k08P9j0J1k1p4K26n3k35j59K02O0J25N5J12l63
$$ -43 -28 91 -48 -187 -39 31 44 180 -28 51 41 52 31 -43 183 130 -105 -264 -62 -2 123 178 290 -73
6208g3M18m37J68L2nq3k01R9L0J45l33K15Mj12M6q6J46j02K03k02n7K65j84j91
$$ -73 345 -92 76 108 103 20 -181 -82 -52 93 -240 -25 -21 -133 -87 -173 -27 -129 74 -128 -185 80 -104 -295
6232b95M00k7q4p8K00j78K01n8k50L17j53J09o5m3P4j08j8J38R1l71M30j34k9
$$ -295 105 78 -6 -84 116 -62 139 81 -169 148 -5 104 39 -4 70 -38 -56 82 173 -198 232 98 69
6255F9n5k51R6O5J60j05K30j12J05k81P9K37J27k31l51L83k04K81O0m36j22J82
$$ 69 14 -237 -141 -76 84 -21 209 97 202 -79 0 237 364 133 -218 165 -39 242 302 -134 -256 -74
6277g4J85K5l33J48j15K08j22N6P0R0m09L87M3r0j24K9J4j67J56k6K74p4l83L18
$$ -74 111 136 -197 -49 -164 44 -78 -22 48 138 -271 116 159 69 -55 -26 -12 -179 -23 -49 225 151 -232 86
6301H6R8J9j12j77m9J25j3J07j32R3J22q7j15j63K58j55J75L6j76k06M14l38N6
$$ 86 184 203 91 -86 -135 -10 -23 84 -48 45 167 80 -35 -198 60 -95 80 116 -60 -266 148 -190 -134
6324a34K32j72L07l9l08j27K5J15j61L13l7R9o0J60k37P4M6k65K95r9J36j95J2
$$ -134 98 -74 233 194 -114 -241 -216 -101 -262 51 14 113 53 213 -24 50 96 -169 126 27 163 -32 -20
6347b0l3R6QJ12j16J19Kk26J55l7k9n8j66L37m71K05q5M01m14OJ96N3j68J21K0
$$ -20 -53 43 51 163 47 166 168 -58 97 60 31 -27 -193 144 -327 -122 -207 194 -220 -214 -18 35 -133 -12 8
6372Hnl1L20l15j05Lm6JK03N2l76L09j79J00O2J91k54L17l60L42l57o3K30j27
$$ 8 3 -28 292 -23 -128 -125 -171 -170 33 85 -291 18 -161 -61 1 192 -62 255 -105 237 -120 -183 47 -80
6396h0J38m1Q7l9l20N07o3p6K5m7j64n0L5M8%q3J00n1J76N4l71L87k92J89k30
$$ -80 58 17 104 65 -255 252 189 113 138 91 -73 -123 -88 -40 -40 -123 -23 -74 102 156 -215 172 -120 69 -161
6421a61L49k04N4J80k27J61r7J76k70J6rL18m24K85o3l08K85J5j87J51l41J52
$$ -161 188 -16 38 218 -9 152 55 231 -39 -23 -32 286 -138 147 84 -224 61 76 -111 40 -301 -149
6443a49M21k46J29o7j49K0Qmp4K4R3r9K45j34K28n32N16k11o0p5L18p2q8J08r9
$$ -149 272 26 155 88 -61 -41 -33 -37 -111 -87 6 -93 152 18 246 -286 230 19 -41 -116 202 130 42 150 51
6468E1k84K02nPJ07n0K7J02k52L4Mp5J93J19P8k90J21k20l16O41l5m66K59Pj72
$$ 51 -233 -31 -36 -29 78 28 55 157 -95 -61 -57 -132 61 180 258 -32 89 -131 -447 194 159 -307 -48 -41 -213
6493b13J21K27k24K25k71J18j8j27k8L16k60J65l6j14J84j91K39j72p3K94k74
$$ -213 -92 135 -89 136 -135 -17 -35 -162 -190 126 -134 31 -5 -119 65 -126 113 -59 -132 162 -112
6514a12j9J52k37K64J4P1K3j75N5p4K7Q2j85K1L55j84qk59J47Q0J33l60L61j51
$$ -112 -131 21 -216 48 62 133 156 -19 36 -38 -11 71 -114 -93 262 78 70 -189 -42 38 171 -189 172 21
6538B1j24KJ4J29p5L0j50K3J94j59J06n3j06J54J72j65Q1k98J74m1k3J76k4k56
$$ 21 -103 -101 -87 42 -33 -3 -153 -130 64 -95 11 -42 -148 6 178 13 94 -204 -30 -71 -94 82 58 -198
6562a98K23k1n7l0L21m02j07J70J45n9J85l12P4k3J22L5R6n3j69k0J25j8K5J34
$$ -198 25 4 -53 -83 238 -164 -271 -101 44 -15 170 -142 -68 -91 31 66 162 109 -60 -80 45 27 52 186
6586A86k26K6R9L3j20j07k1J14o8J28l8pMQ3n7M3p7lM6k0q0j78O4j12M14j21j1
$$ 186 -40 -14 85 118 -2 -109 -130 -16 -84 44 6 -1 3 86 29 72 -5 -8 38 18 -62 -240 -176 -288 126 5 -6
6613fM8j41r7Q9L45j83j85J56L00k04k8J36o2O7k06o6K96l42K95j81LJ62k05J91
$$ -6 42 -99 -196 -107 238 55 -130 26 326 122 94 230 168 235 29 -37 259 -83 212 31 34 196 -9 182
6637A82k04n7o4L48k20j02J02M4J31o8q4K17n21L46k15M52l57p0o5K71r2o8n9
$$ 182 -22 -79 -143 205 -15 -117 -15 29 160 92 8 225 -296 50 -165 287 -70 -140 -205 66 -26 -94 -153
6660a53K19m9j05J78j68K21n2l60K51o5K09J52k81k34N0J5q6M54k02L0N5J18l55
$$ -153 66 17 -88 90 -78 143 91 -269 -18 -83 126 278 -3 -237 -187 -172 -258 196 -6 24 79 197 -158
6683a58J60M7n3k65Q7K33O4J23l55K52j14k56L23j56J99k70J02L64l47o5p7M03
$$ -158 2 49 -4 -269 -182 51 115 238 -117 135 21 -235 88 -68 131 -139 -37 327 -20 -85 -162 241
6705B41m0k50J21l38L40q0N1Q2k49J21q1J00j03J92j44K4m6J19o7n7K1o7L2K17
$$ 241 201 -49 72 -266 74 -6 45 127 -122 -1 -82 18 -85 107 -37 -13 -59 60 -7 -64 -43 -110 -78 139
6729A39j11q5r9K53J01k94K15k65K69k22K72J19l91NJ27J81j56m0K27m72Q5J07
$$ 139 28 -57 -156 97 198 -96 119 -146 123 -99 173 292 -99 -94 33 214 58 18 245 -227 -142 -35
6751c5K11n1k25Q5m7K7k85J30P8l1J38Q5k9J6k78M20m55K71L7j98K72l21nL30
$$ -35 176 125 -100 -15 -62 -35 -320 -190 -112 -143 -5 80 51 67 -211 209 -246 25 62 -136 136 -185 -190 140
6775A40j96j78L11j80J66j28n4j0l7N2N7K5J05j71N3J44m00K90j27N4j31M66k58
$$ 140 -56 -234 77 -103 63 -65 -119 -129 -166 -114 -57 -32 73 -98 -45 99 -301 -11 -138 -84 -215 251 -7
6798gj66J13J23p0l3J40n4m4J77l4k81L4M3J46j02J77m6j08J06l17L32J03j23
$$ -7 -173 -60 63 -7 -40 100 46 2 179 145 -136 -102 -59 87 -15 162 116 8 114 -203 129 232 109
6821A09n6j28O5r0p5K01K7L78k67j03k1J43k16j49L40k74K51J88l85J17J38k25
$$ 109 53 -75 -10 -100 -175 26 53 431 164 61 40 183 -33 -182 158 -116 135 323 -62 55 193 -32
6843c2N2or5J52j44j58K10r0J97k45L50l99L38Qk05mJ42j41j49J93k5LJ8k9J25
$$ -32 20 14 -81 71 -73 -231 -21 -111 86 -159 191 -208 130 138 -67 -71 71 -70 -219 -26 -51 -48 -30 -59 66
6868F6q6o1K1j29J67J46m6J24r3O3m23N04m31K17n1q1J64J6j61K12j03l9q6k5
$$ 66 -20 -81 -60 -189 -22 124 78 202 109 172 -251 253 -178 39 -12 -93 71 87 -74 138 35 -4 -90 -115
6892a15J03q8Nj13J34J40k2l48J66K3J91l51N64l78J4L25k13p5J49j47Jm8QK9
$$ -115 -12 -100 -95 -208 -74 66 44 -304 -138 -115 76 -275 289 -89 -75 250 37 -38 111 -36 -35 -83 -75 -46
6916d6j25K71m46N60l05K6L2J6K43k38j36J16P5K8k4k24L1L0N03n55L98j23l0
$$ -46 -171 100 -346 214 -91 -65 -33 -17 226 -12 -148 -32 43 71 47 -177 -146 -116 387 -168 230 107 77
6939G7Q1k74m3L72n5n5k53J29kJ16j78k01L92k50k3K76n1l3J16j62L47m43J53
$$ 77 158 -116 -159 213 158 103 -150 -21 -23 93 -85 -286 106 -144 -167 109 58 25 141 -21 326 -117 36
6962C6j78J34j19J05Np3K34j18J21o4K62m42R5r7j97J39J96j73P3J70l14j0Q7
$$ 36 -142 -8 -127 -22 -17 -90 144 26 147 83 345 -97 -2 -99 -296 -157 39 -134 -61 109 -205 -215 -128
6985a28L44n56J43O1j8K1M04l23k43K75p5Q3O2j25J72k08J54j16J69l51R8K19
$$ -128 216 -340 -197 -136 -154 -133 271 -52 -295 -20 -95 -12 50 -75 97 -111 43 -73 96 -255 -157 62
7007F2j11L9K48r7P9l16J95n7N9K4k11K00k63P9l1J64l58O91l11j08J74q7j54
$$ 62 -49 -10 238 141 220 -96 99 42 101 125 -86 114 -149 -70 -101 63 -295 396 85 -23 151 64 -90
7030i0J99L6j53J66k25KJ60k36J92p6M7j47Q0m3K56R2k73J38p2J0j33m6k38K94
$$ -90 109 145 -8 158 -67 -65 95 -141 51 -25 22 -125 -45 -88 168 260 -13 125 53 63 -70 -116 -354 -60
7054f0J35m4j37K66k83j3P5K48k02J78j36j72J80m4n2J94j8r9K46m49L56J22j33
$$ -60 75 31 -106 160 -123 -136 -61 187 -15 163 27 -145 35 -9 -61 133 115 16 262 -187 169 291 158
7077A58r9N6j79k9m5M6J07k34L32j00l0p4R5K2q2L06l03r6n3J30J40Qj18J27j57
$$ 158 59 115 -64 -93 -138 -92 15 -219 113 13 -17 -91 4 26 -56 250 -53 -149 -202 -72 68 76 -42 85 -72
7102g2lJ19j7j71K95r5m8M8K4N0j23j55q8N36l27kOm87N72j1j59r1j1K06P9q9
$$ -72 -75 44 27 -144 151 56 8 56 80 130 7 -148 -236 300 -27 -29 -23 -510 62 51 -108 -199 -210 -4 75 -14
7128a4J41M5j33K4j42J98j86N6k0L44r2k60K35k82R5J21k12P1K61j64j21k32K25
$$ -14 127 172 39 63 -79 119 -67 -11 -31 313 221 -39 196 -86 9 130 -82 -11 250 86 -35 -267 -42
7151d2K01k55r8J40m3R8k04J20K44m22O8K62p3r6M0J70k28J67j51K70m5k23K72
$$ -42 159 -96 -194 -54 -97 1 -203 -83 161 -261 -193 69 -4 -100 -60 110 -118 49 -102 168 123 -100 172
7174A72q0q0J73j10n3Q0j44j09J7Q1j79K33k5Q4j78J27J27N7k25P7J55j74o9J30
$$ 172 92 12 185 75 22 102 -42 -151 -134 -53 -232 1 -24 60 -118 9 136 193 -32 45 200 26 -43 87
7198H7k96K93j9m3K30k67M1q6K98l56L34l32J74oj65J4J65l2J3o3Q0j20R2J58
$$ 87 -209 84 65 22 252 -15 26 -60 238 -118 216 -116 58 52 -113 -99 66 34 47 -16 64 -56 36 194
7222A94j14J1o7L7O4J1j48J35j45j08K95q1m0j82K21j87M22j38k26J21j06j9O
$$ 194 80 91 24 61 125 136 -12 123 -22 -130 165 84 44 -138 83 -104 318 180 -46 75 -31 -50 -44
7245d4K39r3j09p0P1k55L17k06K65k25l2N6J47J9K64n84L69Jj35K8k34K91P8l20
$$ -44 195 102 -7 -77 -6 -261 56 -150 115 -110 -142 -86 61 80 344 -240 129 130 -5 23 -211 80 158 -162
7269a62K11k37J51M4J1N4j20O4j17o1L55j47M9j33J07q8J62m99N03ml27L05r0
$$ -162 49 -188 -37 7 18 72 -48 16 -101 -162 193 46 95 -38 69 -19 143 -356 147 143 -184 121 31
7292C1J62k70J14P3j21N3L5l59L93j33J70j68k23M10k71K24r0J20k81MK7L9j7
$$ 31 193 -77 37 110 -11 42 77 -282 111 -22 148 -20 -243 167 -104 120 30 150 -131 -127 -100 -61 -78
7315g8J05k7k02K48l15K68n5O3q0L00m82M0K58q8R7j60J62l8K89l15m7j33K35
$$ -78 27 0 -202 46 -269 -1 -56 7 -73 227 -255 -215 43 -45 52 -108 54 16 305 -10 -57 -190 45
7338D5r5r9K00j58K86O4l69J43j35J88j76L61m58j9L23l0k56K11q3K0K70k88J11
$$ 45 -50 -149 51 -107 179 243 -126 17 -118 70 -106 255 -203 -222 101 71 -185 26 -57 -37 233 -55 56
7361E6Pj78L46j88j46N7J52j81O3o2K15k91K22o8j10J61k24M30j94j93Q8J71k85
$$ 56 63 -115 231 43 -103 -46 106 -75 -12 -74 141 -150 72 4 -106 55 -169 261 67 -126 -38 133 -152
7384a52oKJJ23O2N3j19k33L31j43K17k37P2J54j07J45j08j30j57K58q9L98k51
$$ -152 -158 -156 -155 -32 30 83 -36 -269 62 -81 136 -101 -29 125 18 163 55 -75 -232 26 -63 335 84
7407H4k76Q9p8j41O89m98J37k5k42K30K90O3k01j25M2j8k60K22p7L04l15M7J23
$$ 84 -192 -103 -181 -322 367 -131 6 -19 -261 -31 259 322 121 -4 38 20 -240 -18 -95 209 -106 -59 64
7430F4n9ll69L24K9O3j34j10j72K75J34j8j06J18M1J61j14Q9k86N8J48j54j02
$$ 64 5 2 -367 -43 -14 49 -85 -195 -367 -92 42 24 -82 36 77 238 124 213 -73 -15 133 -21 -123
7453a23k7J49N0q2n4L5q8O0P3l7J04j16l9O2m6j7K1p2Nk5j9K23K3j40Mk7Q4j15
$$ -123 -150 -1 49 -33 -87 -52 -140 -80 -7 -44 60 -56 -95 -33 -79 -96 -75 -147 -142 -167 -186 37 60 -80 -76 -103 -19 -134
7481a34K60P5k02M4M2P1j5m58K65J65j6K9n1k98J62j30Q1J55J13k17oJ08O0l88
$$ -134 126 201 -1 43 85 156 141 -317 -52 113 97 126 75 -223 -61 -191 -110 45 158 -59 -65 43 103 -285
7505b85P8J75R8l3N2k6k32K82m5m8P7j52N1l8J15j76O8%K5mo7k45L70K20m52L26
$$ -285 -207 -32 66 33 85 59 -173 109 64 16 93 -59 -8 -46 69 -107 -39 -39 -14 -18 -85 -330 40 260 -192 134
7531A34Lr3r8j05K73m44L52k19l2J89LJ12l18K55o0j33J90O4j12q0n8K04j6N1
$$ 134 137 44 -54 -159 114 -330 22 -197 -229 -40 -37 75 -243 12 -48 -181 9 73 -39 -119 -177 27 11 62
7555F2j63P9j32K39l18J20j23J89l6Q3l46J41K62r9r1J90j25j51J92j08R4j10
$$ 62 -101 -22 -154 85 -233 -113 -236 -47 -83 0 -346 -205 57 -42 -133 57 -68 -219 -27 -135 -41 -151
7577a51O8K06l26K16j17j87M03k19K70l11o0M4N8J37j22M2R6j8p2J17p0J27k69
$$ -151 -83 123 -203 13 -104 -291 112 -107 163 -148 -208 -164 -106 31 -91 -49 47 29 -43 74 4 131 -138
7600a38J51j2j05K8K75l46K70j14N8J0n9j47mJ51J85k01Q2j74L1j32J20j32k3
$$ -138 13 1 -104 -76 199 -147 123 9 67 77 18 -129 -133 18 203 2 84 -90 -59 -191 -71 -203 -226
7623b26J88O3J5R1j04k02L84k74L88k81l03J13J62j44k44K42K31K03n02J56P2
$$ -226 -38 25 40 131 27 -175 209 -65 323 42 -261 -148 14 -130 -374 -132 99 302 -200 -44 28
7644B8j34M96k48j19o2P0nJ55j6l34J57J43O9k80P5J54kj68j36P1M3O5j6l45K30
$$ 28 -106 390 142 23 -39 31 26 181 165 -169 -12 131 200 -80 -5 149 147 -21 -157 -86 -43 22 6 -339 -109
7669a09K3J15k02P1k33L82k99L26q5K69j21j87P6j75J39m9M42m17l72L25q1K53
$$ -109 -86 29 -173 -102 -335 47 -252 74 -11 258 137 -50 26 -149 -10 -59 383 -34 -406 -81 -162 91
7691I1k77L47m80K42J71k90J39L8J37k45j54K14P5QJ16l13L07k24L07k41N1k50
$$ 91 -186 161 -319 -77 94 -196 -57 -19 118 -127 -281 -67 8 16 132 -181 126 -98 209 -32 19 -231
7713b31L48j2m1K61k24L09o33O8L30k6k10k68L37K06Q4m15J02n9P6K35p1l43q0
$$ -231 117 105 64 325 101 410 -223 -155 175 149 -61 -329 8 214 298 -117 -15 -74 2 237 166 -177 -257
7736b57M24n5k05K53k19r0J72Qk1k8j01m5K09j69O5M5j94J03J62mk19J25q4Q9
$$ -257 167 112 -93 160 -59 -149 23 31 10 -18 -119 -164 45 -124 -59 -14 -208 -105 57 53 -166 -41 -125 -36
7760c6J33j53p3Q1L0q5L5k94M54j40p0K22j76J50J98k75Q5k95J38K25k57L3K7
$$ -36 97 -56 -129 -48 -18 -103 -68 -362 92 -48 -118 104 -72 78 276 1 86 -209 -71 154 -103 -70 -43
7783d3LJ40k05K13j68l8J34k28J32j22K47o4R5k00L92k81Nk2r9J98m5j42R1P0
$$ -43 -40 100 -105 108 -60 -98 36 -192 -60 -182 65 1 96 -104 288 7 12 -10 -109 89 44 -98 -7 63
7807F3o4J72j04k37K11k5J09j35K03j05k56P6p7J81j30k7J83n2p0r6N9J13R9k30
$$ 63 -1 171 67 -170 41 16 125 -10 193 88 -168 -92 -169 12 -118 -145 38 -14 -84 -180 -121 -8 91 -139
7831a39R2k1j07J75MQ8jj10k5K04o8Q2j03j85J1J37j57K26j45J73P1n13L93k1
$$ -139 -47 -68 -175 0 4 92 91 -19 -44 160 92 174 71 -114 -103 34 -123 103 -42 131 202 -311 82 61
7855F1J48k33j0M6j06K0M12l93K35k33j32L66j58o4o1R8k32K18J61o0j52K21n18
$$ 61 209 -24 -34 12 -94 -74 338 -55 180 -53 -185 181 23 -41 -102 -4 -236 -18 143 83 -69 152 -366
7878c66K33P2L2n5J56j35K05j8l37J11kJ86r5Q6m0j96Q9Q7j66J17j8j73K49l1
$$ -366 -133 -61 -29 -84 72 -63 142 124 -213 -102 -104 82 -13 73 33 -163 -74 13 -153 -36 -54 -227 22 -9
7902ik86L24J0j7l45K22Qk35M85J63k43j09m0k0j87L66k13K84k23M3P6M8j14l25
$$ -9 -295 29 39 22 -323 -101 -93 -328 157 320 77 -32 -72 -92 -279 87 -126 158 -65 -22 54 102 -12 -337
7926c37J84J94j16J7L64j58o1l94M05l80K10K1J34l6j86J57k06K99k16l6O7L74
$$ -337 -153 41 -75 -58 306 148 87 -307 98 -282 -72 -51 83 47 -139 18 -188 111 -105 -141 -74 300
7948C00l90N2j31J46Nk06L83j32j95J96j38j41L84k11J07k31L12l41K65L24n26
$$ 300 -90 -38 -169 -23 -18 -224 159 27 -168 28 -110 -251 133 -78 29 -202 110 -231 34 358 -168
7969a68J24m5J70j4j31p5R6J58l4k14J20o8J64R2j72J38q1j69k1R7K97k59K38
$$ -168 -44 -89 81 67 -64 -139 -43 115 81 -133 -13 -81 83 175 3 141 60 -109 -130 -33 264 5 243
7992B43k08jK4k82K56J53r6l44J98k2MP2Po3M07m99L00j35k20K69n6jJ42j01l5
$$ 243 35 34 58 -224 32 185 89 -255 -57 -79 -75 -3 4 -59 348 -151 149 14 -206 63 7 6 148 47 12
8017A2o4k7M2J14Jp8K06m25L48l13M24l46J39k11M8L74l11M21k54l30K12J5o6
$$ 12 -52 -79 -37 77 78 0 206 -219 129 -184 240 -106 33 -178 -130 244 -67 354 100 -230 -18 -3 -69
8040f9kP1k3J01L7KM2n7k19k9J81o1J4J80m49K23j3L88k73J43j35j14K3L17l41
$$ -69 -71 0 -23 78 115 117 159 102 -117 -146 35 -26 -12 168 -281 -58 -71 317 44 187 52 -62 -39 278 -63
8065f3p4O0J77jq6J00k6o2j15R1r8K31j55K75l88K62pr2l25L15k66K60J65l73
$$ -63 -137 -77 100 99 13 113 87 25 -90 1 -97 134 -21 254 -134 128 121 29 -296 19 -247 13 178 -195
8089a95M10m32K77M2l57P5L10m68M86o8j09n5j52J66K59j81L8p8rK92l88K06M8
$$ -195 215 -217 60 102 -255 -180 130 -338 148 80 -29 -84 -236 -70 189 8 46 -32 -41 251 -137 69 117
8112A17l03K61p1J2Q4o3RO8j77j44J05K84r8o6J68l65J87kO3j87NL72k63J46l3
$$ 117 -186 75 4 16 100 37 46 114 -63 -207 -102 182 84 18 186 -179 8 6 69 -118 -113 259 -4 142 109
8137A09R2l7oj36j4O4j63J93O3j40J14l7m43K49R3j7J79j67J1R2K4l71J96O7j26
$$ 109 201 164 158 22 8 72 -91 102 165 25 139 102 -341 -92 1 -16 163 -4 7 99 123 -248 -52 15 -111
8162a11K82j58N8k17L29j77j74K32r6K49K9k14k20L67k41J70Lq6J5k28M51l30
$$ -111 171 13 71 -146 183 6 -168 64 -32 217 246 32 -188 179 -62 108 111 25 40 -188 263 -67
8184f7qK42j67M8q6L2j77
$$ -67 -75 167 0 48 -38 -6 -183
8191a83
$$ Imaginary data points
##PAGE= N=2
##DATA TABLE= (X++(I..I)), XYDATA
0@%%%%%%%%%%%%%qJ6j6J6j6J6k4L2l6M4n6O4p2Q6r7J10j26J45j66J87k11K39k69
$$ 0 0 0 0 0 0 0 0 0 0 0 0 0 0 -8 8 -8 8 -8 8 -16 16 -20 24 -32 32 -40 46 -51 59 -67 78 -88 99 -112 127 -142
36a42L01l38L77m19M68n20N76o38P05p77Q57r46J042j148J266j395J536j695J874
$$ -142 159 -179 198 -221 247 -273 303 -335 370 -407 450 -496 546 -602 664 -731 805 -890 984
55I84k079K313k577K886l256L701m252M955n879P157r045J2114j7914L2487j31966
$$ 984 -1095 1218 -1359 1527 -1729 1972 -2280 2675 -3204 3953 -5092 7022 -10892 21595 -110371
70a10371k32089M02216K34027k81502k28564J72072J56541m6086o6161l3596n5133
$$ -110371 -342460 59756 293783 12281 -216283 -44211 112330 66244 83 -33513 -88646
81h8646Q0454J59521p1399k46069L4812K80165J9952k75346o6379K20412R5174
$$ -88646 -8192 151329 79930 -166139 -131327 148838 168790 -106556 -172935 47477 142651
92A42651j42803r2290M9712O2689K9938j1554q9252m0861J19883Q4039j21638
$$ 142651 -152 -92442 -42730 19959 49897 38343 -50909 -91770 28113 112152 -9486
103i486r9507J04003Q7783p5905m6086M9584r103l1097O8482K6094j17087l2492
$$ -9486 -108993 -4990 82793 6888 -39198 10386 1283 -29814 38668 64762 -52325 -84817
115h4817J45015M2303j51024m8325J36614L8626j11574j4599Q0823k8543n5679
$$ -84817 60198 102501 -48523 -96848 39766 78392 -33182 -47781 33042 4499 -51180
126e1180P9504L9396j28621l4581J63983L8340j77854m4164J70265M8113j39604
$$ -51180 28324 67720 -60901 -95482 68501 106841 -71013 -115177 55088 103201 -36403
137c6403m1341R8133K3097n0250P743Q936m1855K0454P5396l5377j00400L4817
$$ -36403 -77744 20389 43486 -6764 979 9915 -31940 -11486 63910 28533 -71867 -37050
149c7050J10600k6519j05903J3100Q4885n318n4458J796J8389o898J5881J5441
$$ -37050 73550 47031 -58872 -45772 39113 33795 -20663 -18867 -478 -7376 8505 23946
161B3946m4065k3384O2322K6763o8470k1603O6923J0794n8888P779N1033k6070
$$ 23946 -20119 -43503 18819 45582 -22888 -44491 22432 33226 -25662 -17883 33150 7080
173G080m3828M3362L9746n3717l5654N6196K9192n1929j8593M1582N69l1645K2142
$$ 7080 -36748 6614 46360 -7357 -43011 13185 42377 -9552 -28145 13437 14006 -17639 4503
186D503K1411m8266j8073P0510J8833q6342k4301R0963L0007q2202l2748O2242
$$ 4503 25914 -22352 -40425 30085 48918 -37424 -61725 29238 59245 -22957 -55705 6537
198F537L0518l3548j8850M643J082K2913K1674l9127m4371M5762O3547m0607p4401
$$ 6537 37055 3507 -15343 -10700 -9618 13295 34969 -4158 -48529 -2767 60780 20173 -54228
211e4228K7131P4015j1865o2524l296L9772J1701j2679j4272j6932P863M1748
$$ -54228 -27097 46918 35053 -27471 -30767 9005 20706 8027 -6245 -23177 -15314 26434
223B6434K015n8723j3950O5536K3532o1340k8012M9858K7385l2686j8942J6804
$$ 26434 28449 -30274 -44224 21312 44844 -16496 -44508 5350 32735 49 -18893 -2089
235b089O745j426Q283p667k1736J2487L2555j3023l8601J0685L9040r551l4980
$$ -2089 4656 3230 11513 3846 -17890 -5403 27152 14129 -24472 -13787 25253 15702 -19278
248a9278P611K6845r781j7662J2600O099j6405K577J9237j0596j9663J5409J8314
$$ -19278 -11667 15178 5397 -12265 335 6434 -9971 -7394 11843 1247 -18416 -3007 15307
261A5307j6966j4107J8277Q520j6564j245J5792m134j4171J0049J3780j3832j2745
$$ 15307 -1659 -15766 2511 11031 -5533 -6778 9014 4880 -9291 758 14538 706 -12039
274a2039J6298J1575j8045r451J6598O013j5386k202J1806l885r216R522M042
$$ -12039 4259 15834 -2211 -11662 4936 10949 -4437 -6639 5167 1282 -7934 1588 5630
287E630j5089m7J8708k761k1098N525K1539o083j9000O553J5912n099j0026M526
$$ 5630 -9459 -9506 9202 6441 -14657 -9132 12407 6324 -12676 -6123 9789 4690 -5336 -810
301h10M930l944J811M103o892n464J1470P218j5219r220J6194R918j6682j0375
$$ -810 4120 176 1987 6090 -802 -6266 5204 12422 -2797 -12017 4177 14095 -2587 -12962
315a2962J3935P723j1172m958O829L3k364M653j421q441M561J1505n146j2543
$$ -12962 973 8696 -2476 -7434 -605 -572 -2936 1717 296 -8145 -3584 7921 2775 -9768
329i768N508J3245m034j1469L497R784j975o939J789L606j549l88J481l058k556
$$ -9768 -4260 8985 4951 -6518 -3021 6763 4788 -2151 -362 3244 1695 1307 2788 -270 -2826
344b826N514K657q620l890R721K989j0581k803R252J755o950q28M775m99p60J796
$$ -2826 2688 5345 -3275 -7165 2556 5545 -5036 -7839 1413 3168 -3782 -4610 165 -334 -1094 702
360G02j879k073M027M271m144n382M609O873l053p330J566O504m10m878l92J703
$$ 702 -1177 -3250 777 5048 904 -4478 131 7004 3951 -3379 -1813 4691 4281 -597 -989 714
376G14n42J287J892n748m018O883N279p050p044N114P140k015n539j901L551M891
$$ 714 172 1459 3351 -2397 -6415 468 5747 -1303 -8347 -3233 3907 1892 -3647 -5548 -1997 2894
392B894Q41n532m126M743P775q52q500l713P741Q615m253j1235o77J0926N730
$$ 2894 3735 -1797 -5923 -1180 6595 5743 -2757 -6470 1271 9886 5633 -5602 -6279 4647 10377
407A0377p653j1393J710J3257M647j3511j0621R293J3488l766j3662k697Q985
$$ 10377 2724 -8669 -6959 6298 10945 -2566 -13187 -3894 9594 5828 -7834 -10531 -1546
420a546Q666j676j1014o357J0184J4295m446j8117k665J8376J2025j4892j8151
$$ -1546 7120 5444 -5570 -11927 -1743 12552 8106 -10011 -12676 5700 17725 2833 -15318
433a5318Q858K0575m52j8781o557J2093R934l105j0462p198N744J3785J499j7073
$$ -15318 -6460 14115 13663 -5118 -11675 418 10352 7247 -3215 -10413 -4669 9116 10615 -6458
447f458j0290J4081J7993p874k2129j811K2099J1579j7597j7339J0334J9480j222
$$ -6458 -16748 -2667 15326 7452 -14677 -16488 5611 17190 -407 -17746 -7412 12068 10846
460A0846j4564n835P337R798K095q064j0483J900J5670P016j6094j6952J1137
$$ 10846 -3718 -9553 -2216 7582 9677 1613 -8870 -6970 8700 15716 -378 -17330 -6193
473f193K3816l718k7711m920K4819J1548j8826j4572R637J1829n64n053n476m099
$$ -6193 17623 13905 -13806 -18726 6093 17641 -1185 -15757 -6120 5709 5145 92 -5384 -9483
487i483O716J4919k096k2832n489K6809J6035k4517k4239J8494K9397r391k8120
$$ -9483 -2767 12152 10056 -12776 -18265 8544 24579 62 -24177 -5683 23714 14323 -13797
500a3797j53K0985P079j0742r230j843N362J0917K763j7014j3508J5295K3335
$$ -13797 -13950 7035 14114 3372 -5858 -7701 -2339 8578 11341 -5673 -19181 -3886 19449
513A9449q090l0675k820L2488J3956k7975k2012J9104K6326p713k3393k048J6401
$$ 19449 11359 -19316 -22136 10352 24308 -3667 -25679 -6575 19751 12038 -11355 -13403 2998
526B998Q164n285p942n358K605J3607P405j7272j9042J4416K9018p719l5740j257
$$ 2998 11162 5877 -2065 -7423 -4818 8789 16194 -1078 -20120 -5704 23314 15595 -20145 -21402
540b1402L5240R404l0602j5242K0673J5588j0249j0091J066Q07L629J0543k566
$$ -21402 13838 23242 -7360 -22602 -1929 13659 3410 -6681 -5615 -4808 -1179 9364 6798
553F798j9928l128K7530J2455k7998k1558K3934K7927j5139k9083N103K4945L946
$$ 6798 -13130 -16258 11272 23727 -4271 -25829 -1895 26032 10893 -18190 -13087 11858 15804
566A5804j6563r193M840R138N500m498j2931n145J4722J4609j1465k3593L258
$$ 15804 -759 -9952 -5112 4026 9526 5028 -7903 -13048 1674 16283 4818 -18775 -15517
579a5517K8191O950k7449j6490K1687K3920j2664k5274L070K2649N357j4772q890
$$ -15517 12674 19624 -7825 -24315 -2628 21292 8628 -16646 -13576 9073 14430 -342 -9232
592i232N561P841L898k197j0723o180J3535J5342j2517k3502P671K7179j815k6864
$$ -9232 -3671 4170 8068 5871 -4852 -11032 2503 17845 5328 -18174 -10503 16676 14861 -12003
606a2003n225K2347R192j6011j0220Q148P669j628k819j617l399K270J0038Q1
$$ -12003 -17228 5119 14311 -1700 -11920 -3772 3897 2269 -550 -2167 -5566 -3296 6742 6823
620F823j3568l099J4847O954j1731r853Q204J0148l105q683o76N425K553k043
$$ 6823 -6745 -9844 5003 11957 226 -9627 -1423 8725 5620 -3063 -3739 1686 4239 2196
634B196k883j775O15K540K822k637o212J2Q206L159r275n853P567Q095l564q982
$$ 2196 -687 -2462 -1847 693 3515 878 -5334 -5322 2884 6043 -3232 -9085 -1518 6577 3013 -5969
650e969J95Q451K850n514l816K737L216J439m96m251k947N537O627n500r628L392
$$ -5969 -5774 2677 5527 13 -3803 -1066 2150 3589 3093 -1158 -4105 1432 8059 2559 -7069 -3677
666c677J0681j240j0430j905P442L791m227m745Q88M108J195k004k703p79L324
$$ -3677 7004 5764 -4666 -6571 871 4662 435 -4310 -3422 686 1881 -123 -2826 -3605 -281
681b81K961j441m368N56M979J266m257j918L109K489j051j624q52L17K329j7k431
$$ -281 2680 1239 -3129 -2573 2406 3672 -585 -2503 606 3095 2044 420 -432 -115 2214 2197 -234
698b34j202J121J402j52j398j647K61K099Q53k896j412J904K494p25k484n44K256
$$ -234 -1436 -315 1087 935 -463 -2110 -1849 250 1103 -1793 -3205 -1301 1193 468 -2016 -2560 -304
715c04K128m36l137L18K864J451j476k583J23L619J296l849k424K680L037j545
$$ -304 1824 1388 -1749 -1431 1433 2884 1408 -1175 -1052 2567 3863 14 -2410 270 3307 1762
731A762l545k23K616J189j893k658K82K919R05l119j931K369K584l88k722o21
$$ 1762 -1783 -2006 610 1799 -94 -2752 -2470 449 1354 -1765 -3696 -1327 1257 869 -1853 -2474
747b474K840J942j879k486J419L054k85k352m69J637J574j185j693n0J919N85
$$ -2474 366 2308 429 -2057 -638 2416 2131 -221 -690 947 2521 1336 -357 -407 1512 2097
763B097k251j323P82J665n46j948o96J934J133j536j795R69K201k96j917K00J745
$$ 2097 -154 -1477 -695 970 424 -1524 -2220 -286 847 -689 -2484 -1515 686 390 -1527 -1327 418
780D18K45m90p47L15J336L78j075o67J115O71l18m70p88O22J010j039j231J07
$$ 418 663 173 -574 -259 1077 1455 380 -287 828 1499 1181 711 -77 545 1555 516 -715 -608
798f08J177o22j140J77O55K99o34n05K42P11j09o29M48O06J26Q3k11l73L58J133
$$ -608 569 -53 -1193 -1016 -361 -62 -696 -1201 -959 -248 -357 -986 -538 68 194 277 66 -307 51 1184
818A184Rq34l91J299L41j356m14Q90P8n94k50k4n47L66K45m22n61k52J216J12
$$ 1184 1193 359 -32 1267 1608 252 -162 728 806 212 -38 -62 -609 -243 2 -420 -981 -1233 -17 95
838I5j631k29J444Q26q54m78P66M51M51o1j252k68J951J069j744j559J590J738
$$ 95 -1536 -1765 -321 505 -349 -827 -61 390 841 780 -472 -740 1211 2280 536 -1023 567 2305
856B305j002j738k27J001Q71q85j060p14J218J346q62k341k18K928Q35k621j876
$$ 2305 1303 -435 -662 339 1210 325 -735 -1449 -231 1115 253 -2088 -2306 622 1457 -1164 -3040
873c040K136J993n88j448l46J053J539M98k058j671K484K761k077k916J174L013
$$ -3040 -904 1089 501 -947 -1293 -240 1299 1797 -261 -1932 552 3313 1236 -1680 -506 2507
889B507o01j747q85J76P05J134j23l282o31L564J853l770l457L854L952l350l236
$$ 2507 1906 159 -726 -550 155 1289 1166 -2116 -2747 817 2670 -1100 -4557 -703 3249 -101 -3337
906c337K209K568j527o36J199j014r09L124K094m381k969M708M038m287m328K773
$$ -3337 -1128 1440 -87 -723 476 -538 -1447 1677 3771 -610 -3579 1129 5167 880 -3448 -675
922f75M294j406l618n76K032J000j91j634j433M47K465O82l055j573K269L065
$$ -675 3619 2213 -1405 -1981 51 1051 860 -774 -2207 -1760 705 1387 -1668 -3241 -972 2093
938B093m42l482j212K851L989j790n816J054O433R98o172j867N162K087l646j420
$$ 2093 1651 -1831 -3043 -192 3797 2007 -3809 -2755 3678 4676 -1496 -3363 1799 3886 240 -1180
954a180K145q24j287L324M65n881j431P784K297r459l335R053M563q531m145O700
$$ -1180 965 141 -1146 2178 2643 -3238 -4669 3115 5412 -4047 -7382 1671 6234 -2297 -6442 258
970B58L708n036j769L996l87l172L314K983m704l523N891M591n919n221M807O207
$$ 258 3966 -1070 -2839 1157 770 -2402 912 3895 -809 -4332 1559 6150 231 -4990 -183 6024
986F024l689n391Q54M339L06l318j072R04J567J3r10j191j91P67J564P05k452
$$ 6024 2335 -3056 -2202 2137 2443 -875 -1947 -1043 524 537 -373 -1564 -1755 -988 576 1281 -1171
1003a171k511L020M971k420p230K360Q576r48q671J74Q049K91o870O26M629j572
$$ -1171 -3682 -662 4309 1889 -5341 -2981 5595 4647 -4024 -3850 4199 4490 -2380 -1754 2875 1303
1019A303l511L713K206o267k027P971K189j0113k480J0121L187j0254l065R189
$$ 1303 -2208 1505 3711 -2556 -4583 3388 5577 -4536 -7016 3105 6292 -3962 -7027 2162
1033B162K283o797r94M913n88l259K622K648m354j704N204K220n219k499M365
$$ 2162 4445 -2352 -3346 1567 979 -2280 342 2990 -1364 -3068 2136 4356 -863 -3362 1003
1048A003L397l326l600J484L004J9k268j657Q71K525l17k683k73J934K02j294
$$ 1003 4400 1074 -2526 -1042 1962 1981 -287 -1944 -1073 1452 1135 -1548 -1821 113 315 -979
1064i79O96M65k141L23M102m91n739J038O917k60p942O01P697q30o319J087N223
$$ -979 -283 182 -1959 -1636 2466 1975 -3764 -2726 4191 3931 -4011 -3410 4287 3457 -2862 -1775 3448
1081C448j924l782L070K177m727j385O237K04p082j66P181j02p301K94O194m84
$$ 3448 1524 -2258 812 2989 -1738 -3123 3114 3318 -3764 -3930 3251 3149 -4152 -3858 2336 1852
1097A852m688J057K837j424p94K130j44k764J192L729j517l536J380L134r59k115
$$ 1852 -2836 -1779 1058 -366 -1160 970 826 -1938 -746 2983 1466 -2070 -690 2444 1485 -630
1113f30Q55Q71p85M8Q00k228m32K804N88l727n38L651J08l455M38K861j551j837
$$ -630 225 1096 311 359 1159 -1069 -1501 1303 1891 -1836 -2374 1277 1385 -2070 -1632 1229 -322 -2159
1131b159K688R79l806O13L730j42m454J128M431j199m014J735L209k442j876K741
$$ -2159 529 1508 -2298 -1685 2045 1903 -2551 -1423 3008 1809 -2205 -470 2739 297 -1579 1162
1147A162R90l434J1L454p44m068J564L736k047l624K198K595k592j579K620N80
$$ 1162 2152 -1282 -1271 2183 1439 -2629 -1065 2671 624 -3000 -802 1793 -799 -2378 242 822
1163H22k559M75L258j808k532K677K333l018j644L155J020k601m58K521l75k475
$$ 822 -1737 -1262 1996 188 -2344 333 2666 -352 -1996 1159 2179 -422 -880 1641 1266 -1209
1179a209J524J947k389j547K605Q60l265m16L246m78k932J038K249j866j336J989
$$ -1209 315 2262 -127 -1674 931 1791 -1474 -1890 1356 878 -2054 -1016 1233 -633 -1969 20
1195B0R40j786q71L119p87k624J443K681j588k143K485J518k717p16K790J09k993
$$ 20 960 -826 -1697 1422 635 -1989 -546 2135 547 -1596 889 2407 -310 -1026 1764 1873 -1120
1212a120Q29K517j782k356J887K071k878j445K881N86l021j28K778l82k574J455
$$ -1120 -291 2226 444 -1912 -25 2046 -832 -2277 604 1190 -1831 -1959 819 437 -2137 -682
1228f82K285k070j465K293J268k373n65K631L01k647N46K214j216j325J312J131
$$ -682 1603 -467 -1932 361 1629 -744 -1309 1322 1623 -1024 -478 1736 520 -805 507 1638
1244A638j964o30K070P5k327N15J984j259j994J741J412k142n99J607J11j794
$$ 1638 -326 -956 1114 1189 -1138 -623 1361 102 -1892 -151 1261 -881 -1480 127 238 -1556
1260a556O75J753q73j620J679J412j609p36J541M82j489o0K103o51j794J119J442
$$ -1556 -881 872 -1 -1621 58 1470 -139 -875 666 1148 -341 -401 1702 1051 -743 376 1818
1277A818j431j600J992P04k256k09J618k80j778N69J518q57j344J476P44j352
$$ 1818 387 -1213 779 1483 -773 -982 636 356 -1422 -853 665 -192 -1536 -60 684 -668
1293f68n56J639L99j777L65J408l82j093P95J045j172n42J487M61j789k15J539
$$ -668 -1224 415 814 -963 -598 810 428 -665 130 1175 3 -539 948 1409 -380 -595 944
1310I44J35j657J10J215o92q74M37P08r86q4O21k55p31P95O47p56n59Q73Q27o49
$$ 944 1079 -578 -468 747 55 -819 -382 326 -660 -744 -123 -378 -1109 -314 333 -423 -982 -109 718 69
1330F9l09P58k86l18M82N89j059j63J061L42j656J00J242L1j268P7N17m04n71
$$ 69 -240 518 232 -86 396 985 -74 -237 824 1166 -490 -390 852 883 -385 -308 209 -195 -766
1349g66L25O71r43m3Q27N6q81k85J257J91j095K66P38J23n17J05J84O5l3M98l51
$$ -766 -441 230 -713 -756 71 127 -754 -1039 218 409 -686 -420 318 441 -76 29 213 278 245 743 392
1370C92l87K27O37m94o31J85K49J34n32k18j3K55K47l44l33k21P39p5l22k86N20
$$ 392 5 232 869 375 -256 -71 178 312 -220 -438 -451 -196 51 -293 -626 -847 -108 -183 -505 -791 -271
1391b71M40j86p89R10J58J41k07K4K06l24M46J68l91m18K20Q45m67r21J43P39
$$ -271 169 -17 -806 104 262 403 196 220 426 102 548 716 325 -93 127 972 505 -416 -273 466
1411D66P6j290m27J118O5n77m79O67J78l26K55K68k59m75Q08P20p90q21R81R56
$$ 466 542 -748 -1175 -57 8 -569 -1048 -381 -203 -529 -274 -6 -265 -740 68 788 -2 -823 158 1114
1431A114o20j160P52R51p4j134J83Q00m35p16J8N88m34n85R75M0j068p3R00K50
$$ 1114 494 -666 86 1037 963 -171 12 812 377 -339 -321 267 -167 -752 223 263 -805 -878 22 272
1451B72j102o54J377J191j193j269J096J262n64j156P32J248r62n21Q06N49j590
$$ 272 -830 -1484 -107 1084 -109 -1378 -282 980 416 -740 -8 1240 278 -243 563 1112 -478
1468d78J23J515rj912k17J857N32k577k34K171L30k101m37J907J6j565K75J381
$$ -478 -355 1160 1151 -761 -978 879 1411 -1166 -1400 771 1101 -1000 -1437 470 486 -1079 -804 577
1486E77q14o47Q37J004q98j080J229J512j453j429J184J496p05j455P63J027k58
$$ 577 -237 -884 -47 957 59 -1021 208 1720 267 -1162 22 1518 813 -642 121 1148 890
1503H90j334L84M82j44q20M10N98q10o36P45P76r13j066J137J149r04j549J438
$$ 890 -444 -60 422 278 -542 -132 466 -344 -980 -235 541 -372 -1438 -301 848 -56 -1605 -167
1521a67J356j003j336R45J468j101j054J490M32j365m8J427Q8k019QK197k18k116
$$ -167 1189 186 -1150 -205 1263 162 -892 598 1030 -335 -383 1044 1132 -887 -879 1318 1100 -1016
1539a016q9J999R7k126L2J724k05j352R9J280r93k70R60M58j142m15J094M92q90
$$ -1016 -1105 894 991 -1135 -1103 621 416 -936 -837 443 -550 -820 140 598 -544 -959 135 627 -263
1558b63l00R84N21p15m57N20K60j14k58j13l2L18k69k80J50J76o15K40K58j07
$$ -263 -563 421 942 227 -230 290 550 436 178 65 33 351 82 -198 -48 128 -487 -247 11 -96
1578i6o69M07J139j024q80O61R27n49j010Q56J079p90o35R11O02r80J9R72l2j584
$$ -96 -765 -358 781 -243 -1123 -462 465 -84 -1094 -238 841 51 -584 327 929 -51 -32 940 908 -676
1598f76N57J324n32j568M88J523q62j315J005Q83j404l32P66K46r53L92P57m06
$$ -676 -119 1205 673 -895 -407 1116 254 -1061 -56 827 -577 -909 -143 103 -850 -458 299 -107
1616a07r47Q17O45m31m44N02L07n35K34L44M5m85R7O96o34m44Q28L31p92k20L27
$$ -107 -1054 -237 408 -23 -467 35 342 -193 41 385 430 -55 42 738 104 -340 488 819 27 -193 134
1637A34J1n11L89M30r58K04M72l6j197N52P50k72r01M70J075o24m80Q97K61r57
$$ 134 145 -366 23 453 -505 -301 171 135 -1062 -510 240 -32 -933 -463 612 -12 -492 405 666 -291
1657b91L25Q30l87j014Q88O21p58q46R49P13j295n17J029J48j003K32P44q14n60
$$ -291 34 864 477 -537 351 972 214 -632 317 1030 -265 -782 247 395 -608 -376 368 -446 -1006
1676a006P67M68p34j69N91N83r19k02Q35j23l52J25O84k83l95N79Q6o46J74P62
$$ -1006 -239 229 -505 -674 -83 500 -419 -621 214 91 -261 -136 548 265 -130 449 535 -111 63 825
1696H25n54n64N3P67o20n39Q10N1p36J56O65l08p32K15Q13n78n09N04R66q69j88
$$ 825 271 -293 -240 527 -93 -632 178 229 -507 -351 314 6 -726 -511 302 -276 -785 -281 685 -184 -372
1717c72M97L65p22O0Q63m50p73P86P01q07l92O96P4r33L20K88R7o57J89M22p08
$$ -372 125 490 -232 -172 691 241 -532 254 955 148 -244 452 526 -407 -87 201 298 -359 -170 252 -456
1738d56o2P61k08r07M04O89l35l44k7P12l12l26M20M88o98K51N29m7m74k07R46
$$ -456 -518 243 35 -872 -468 221 -114 -458 -485 227 -85 -411 9 497 -201 50 579 532 58 -149 797
1759G97o88k65L20K94l96m63P34N8r42K82M47k03o31O88K26n58n26J030k54n17
$$ 797 109 -156 164 458 62 -401 333 391 -551 -269 178 -25 -656 32 258 -300 -826 204 -50 -567
1779e67J16P52k30l85M13M34q11k38J006J85q92J37Q55k43r48L62N54l51n20N19
$$ -567 -451 301 71 -314 99 533 -278 -516 490 675 -217 -80 775 532 -416 -54 500 149 -371 148
1799A48J83r03Q6Q36j78o63q8P81k47o06L86M97j65n64N96K18n29j75Q46q3n19
$$ 148 331 -572 -486 350 172 -491 -579 202 -45 -651 -265 232 67 -497 99 317 -212 -387 459 376 -143
1820a43K21P13n59m50M12M77p33j30L62J01m76K44K39n92j43O18j9r73M54M77
$$ -143 78 791 232 -218 194 671 -62 -192 170 271 -205 39 278 -314 -457 161 142 -831 -377 100
1840A00k5n59L06M94l59J62L6M45q78j12Q12L40j185J93Q53m18o51O04N71p79
$$ 100 75 -484 -178 316 -43 119 155 600 -278 -390 422 762 -423 -230 623 205 -446 158 729 -50
1860e0k05N28nq46K5P84l1q91K15R70n99n61L20L48J41n66O03k45L4R8M02m04
$$ -50 -255 273 268 -578 -553 231 200 -691 -476 494 -105 -666 -346 2 143 -423 180 -65 -31 67 469 65
1882F5j28M89J41n96J25M89l24l10M11K62l64o05O04q6m03k48O56Np57J33L53
$$ 65 -63 426 567 -29 96 585 261 -49 362 624 260 -345 259 173 -230 -478 178 183 -574 -441 -88
1903h8O8n79K21L70J46o10O41J38l84j40L07M60q16K81K06K53l04m41N80J2k78
$$ -88 -20 -599 -378 -8 138 -472 169 307 -77 -217 90 550 -266 15 221 474 170 -271 309 321 43
1924D3J18Nj39j7J12m06M7O5j32J0N3j6j53N1M73k80M0R9j9K45l95L86J86k68
$$ 43 161 166 27 10 122 -284 -237 -172 -304 -294 -241 -257 -410 -359 114 -166 -126 -27 -46 199 -196 190 376 108
1948A08k31p2O70k28l89K79L74m47l81M63K64m61k17M50k05k90l13Q92j31n23
$$ 108 -123 -195 475 247 -142 137 511 64 -317 146 410 -51 -268 182 -23 -313 -626 266 135 -388
1968c88j45P69j70m59P4L13K86p09K97L65kl77K10L08N2q00K30P06k50n32K18
$$ -388 -533 236 66 -393 -319 -6 280 -429 -132 233 231 -146 64 372 424 -376 -146 560 310 -222 -4
1989dL77j69n97J32M65l21m60N01j7k17k18O41J35m84k52O51r2l30J08L83J10
$$ -4 373 204 -393 -261 204 -117 -577 -76 -93 -310 -528 113 248 -236 -488 163 71 -259 -151 232 342
2010C42n98L34R3O6j47M1K7J58l35j38K06J02p7l28J90K84k90k64L10N5j30m90
$$ 342 -256 78 171 237 90 131 158 316 -19 -157 49 151 74 -254 -64 220 -70 -334 -24 31 -99 -589
2032e89N77J69n41K75Q4K50n44k12Q89j79n14J43M85j72p81O36O91m36m63K61
$$ -589 -12 157 -384 -109 -25 225 -319 -531 358 179 -335 -192 293 121 -660 -24 667 231 -232 29
2052B9O76o07o10K37P02n11j51M02m7o67K91L20j35k12O8L71n26j7K33N42k85
$$ 29 705 98 -512 -275 427 -84 -235 167 120 -547 -256 64 -71 -283 -215 156 -370 -387 -154 388 103
2073A03K2q4R3k8j8L8K10r6j6j11k51K42j41oJ19N5j49n22M55K77k03k59J76M24
$$ 103 125 41 134 106 88 126 336 240 224 113 -138 104 -37 -43 76 131 -18 -540 -85 192 -11 -270 -94 330
2097C30q50J68L30Q1l97K2P94k01q40M54M98L4r01N19K75j25l88N46o0l70k33
$$ 330 -520 -352 -22 59 -338 -316 478 277 -563 -109 389 423 -478 41 316 191 -197 349 289 -81 -314
2118c14Q58m00m23J73J19N1n18L02K74l86j53L42K58l45j25L84R3j71j1j10j88
$$ -314 544 144 -279 -106 13 64 -454 -152 122 -264 -417 -75 183 -162 -287 97 190 19 8 -102 -290
2139b90K06K24j17o4K25L52l64j41K3L14l97j30L22k8m02K27L44n08j78L06M02
$$ -290 -84 140 23 -41 184 536 172 31 54 368 -29 -159 163 135 -267 -40 304 -204 -382 -76 326
2160C26n60k4O32o2n24k63Q41o2o35M35O59n87o59O09K25k23l71K85K63l89N4
$$ 326 -234 -258 374 312 -212 -475 366 304 -331 104 763 176 -483 126 351 128 -243 42 305 -84 -30
2181c0J48J16o12N27K15l74k87L34N2l16%J79p2k25J67K46j4l03K42M40n98q7
$$ -30 118 234 -378 149 364 -10 -297 37 89 -227 -227 -48 -120 -345 -178 68 54 -249 -7 433 -165 -252
2203b52L71O5k28N5N11n05j01K06K72m05N7N27m42m44K36K25l14l34M76j42j72
$$ -252 119 184 -44 11 522 17 -84 122 394 -11 46 573 131 -313 -77 148 -166 -500 -24 -166 -338
2224c38j79L59M6q3j4L12O7k24p9K5J75j77L04kj60m32N24j40j19K86L94m56q0
$$ -338 -517 -158 -112 -195 -209 103 170 -54 -133 -108 67 -110 194 192 32 -400 124 -16 -135 151 545 89 9
2247IK21j73o5l0R2j64l92L47K76j20k50K44J6j80n7L93o8m38P8N38k62%J73R
$$ 9 230 57 -8 -38 54 -110 -502 -155 121 1 -249 -5 11 -169 -226 167 99 -339 -261 277 15 15 188 197
2271A97n5q1J38k13o7J51K04m33J14K71o2m50L79l7j04j62j28M97k23l82L05J25
$$ 197 142 61 199 -14 -81 70 274 -159 -45 226 164 -286 93 56 -48 -210 -338 159 -64 -446 -141 -16
2293a6j28j09K65J2k7j80L15m0j87J16J38k01J63M3Q9m05Q5N09n51j14j34O17
$$ -16 -144 -253 12 24 -3 -183 132 92 -95 21 159 -42 121 164 253 -152 -67 442 -109 -223 -357 260
2315B60k75k2L0k70J40l2J78j06L7j57RJ80l16K98J38l09K38P8j26K13j94L12
$$ 260 -15 -37 -7 -277 -137 -169 9 -97 -60 -217 -208 -28 -344 -46 92 -217 21 99 -27 186 -8 304
2337C04j93j24J76mj40K1lo2l70L95m6l1j26K79J5j72q1J15L02k10k11L6J43l76
$$ 304 111 -13 163 159 19 40 37 -25 -395 0 -46 -77 -203 76 91 -81 -162 -47 255 45 -166 -130 13 -363
2361c63K69K61k7k30m5M73j95j50j8J82M5l22J18j7j52K06l7j50p8kN23k75j28
$$ -363 -94 167 140 -90 -135 338 143 -7 -25 157 202 -120 -2 -19 -171 35 -2 -152 -230 -232 291 16 -112
2384a12J48j83J49L6J06l26J63L42l73O6L16l26p9J31K17k84K40n00M18K51n30
$$ -112 36 -147 2 38 144 -182 -19 323 -50 16 332 6 -73 58 275 -9 231 -269 149 400 -130
2405a30J70j01R2n4P8L29k00l52RQ9J73l83K90o6n3P2K8J70m65M64K8k44Q9q2
$$ -130 40 -61 31 -23 55 384 184 -168 -159 -70 103 -280 10 -56 -109 -37 -9 161 -304 160 188 -56 33 -49
2429d9q2K30l0P2nj1r6LK08j18q4P7l9j98J48m65L11J75j19L8m5J4J42j51NKj24
$$ -49 -131 99 69 141 136 125 29 32 240 122 38 115 76 -122 26 -439 -128 47 -72 -34 -79 -65 77 -74 -69 -67 -191
2456a91%J06J50m53K83o0N32o64K04K00p1J95j20K05k44o0J55p3j14j51L04k16
$$ -191 -191 -85 65 -388 -105 -165 367 -297 -93 107 36 231 111 316 72 12 167 94 -20 -171 133 -83
2478h3J09M1Q0Pl37l9L17R6j23j71q7K40j87K6L30j62O5j10J36J32j81j7j60J
$$ -83 26 67 147 154 -183 -222 95 191 68 -103 -190 50 -137 -111 219 57 122 12 148 280 99 82 -78 -77
2502g7Q4j44L55mk1n50M17j18l1k95N12k27j01J43l8K4oK52l11Q0o6J09J68j77
$$ -77 7 -137 218 214 193 -357 60 -58 -89 -384 128 -99 -200 -57 -95 -71 -77 175 -136 -56 -122 -13 155 -22
2526b2K47j61j66J45l8o3n4J81n9l30K87L40l07j20L1P0r8k22K63J80m38K95J84
$$ -22 225 64 -102 43 5 -58 -112 69 10 -320 -33 307 0 -120 -89 -19 -117 -339 -76 104 -334 -39 145
2549A45q1k62P2J95l93K24k59N39k26J26j43K18j09OK1J11k46n9J19j32Q3N9j14
$$ 145 64 -198 -126 69 -324 -100 -359 180 -46 80 -63 155 46 52 73 184 -62 -121 -2 -134 -51 8 -106
2572a06J97m28L05m6Q9J71m59J29j02O0K07k23L62m39J81Q3q6J43p0O4J79k51
$$ -106 91 -337 -32 -78 11 182 -277 -148 -250 -190 17 -206 156 -283 -102 -19 -105 38 -32 32 211 -40
2594d0O3r8K19m2j30P4p4K41m29L92k20K16m67J65J01j69k32O79o4n51J40M33
$$ -40 23 -75 144 102 -28 46 -28 213 -216 176 -44 172 -295 -130 -29 -198 -430 249 185 -366 -226 207
2616B07o3l88J0L43j36l2J76j4o2k30J85K43k29J09l4J08k60K80k45k15M85k05
$$ 207 144 -244 -234 109 -27 -59 117 103 41 -189 -4 239 10 119 85 193 -67 213 -32 -247 238 33
2638C3j16L3m7J87j69k43L75ok47q0K93k2n8L04K64l16l25K43L1j22J19J33J23
$$ 33 -83 -50 -97 90 -79 -322 53 47 -200 -280 13 -9 -67 237 501 185 -140 103 134 12 131 264 387
2661C87m69K22J39j21j78N3J84m05nL43J23m40j55J18N43m41j19L12J24l12J54
$$ 387 -82 140 279 158 -20 33 217 -188 -193 150 273 -167 -322 -204 339 -102 -221 91 215 -97 57
2682E7k11J91%O1J9l76L29l3L26k64L4k3J03l98L52m7k11r3L42l18j02O4J86k13
$$ 57 -154 37 37 98 117 -259 70 37 363 99 133 110 213 -185 167 120 -91 -184 158 -160 -262 -198 -12 -225
2706b25K08kj14m0lL59m03J17k95O01k86Q9k22N21p7k49J99r4o7j84K74N2j4k97
$$ -225 -17 -19 -133 -173 -176 183 -220 -103 -398 203 -83 6 -216 305 228 -21 178 84 17 -167 107 159 145 -152
2730a52L59J31n12J41R2O3j49M4M1j54J92j55k39k8N38n4m3j3l3j55J47O6l09
$$ -152 207 338 -174 -33 59 122 -27 17 58 -96 96 -59 -298 -326 212 158 115 102 69 -86 61 127 -182
2753a82M7K2M03n74J74K20J90k15j20J82L8J35n16K08j42J49j92p1J55j69K8M13
$$ -182 -135 -113 290 -284 -110 110 300 85 -35 147 185 320 -196 12 -130 19 -173 -244 -89 -258 -230 183
2775A83Ll32L6N63l35k01rQ1N2k90K47Mq0j6L0P6m5K06j05Pl33K89k17K1K86J6
$$ 183 186 -146 -110 453 118 -83 -92 -11 41 -249 -2 2 -78 -94 -64 12 -33 173 68 75 -258 31 -186 -165 121 137
2801A37j39j73M01l1j16j48o3Q3p6J91J6j47PM7J2P8j72J55J55k80J12K87k45
$$ 137 -2 -175 226 195 79 -69 -132 -49 -125 66 82 -65 -58 -11 1 79 -93 62 217 -63 49 336 91
2824I1k51K19K64l13m7o7P5p0k03L45N1m74K43J44P1l64N5M35m73L41j18K80k25
$$ 91 -160 59 323 10 -37 -104 -29 -99 -302 43 94 -380 -137 7 78 -286 -231 204 -269 72 -46 234 9
2847IL03N3m30K9L37j76Po6J57k42m9n7L23k30j69J75J77k38j86J38K50o9j26
$$ 9 312 365 -65 -36 301 125 132 66 223 -19 -68 -125 198 -32 -201 -26 151 -87 -273 -135 115 46 -80
2870h0J84k45k05J51M39l37K17k97K06j31K23J8k92L3L23q5J79l56J11j39L61
$$ -80 104 -141 -346 -195 244 -93 124 -173 33 -98 125 143 -149 -116 207 122 301 -55 56 -83 278
2891B78m07L03J2n0k30j04N7N7L0J24r5qJ6J11n6J86j84j31P1N4J13l70L27J83
$$ 278 -129 174 186 136 -94 -198 -141 -84 -54 70 -25 -33 -17 94 38 224 40 -91 -20 34 147 -223 104 287
2915B87k15k81K46K96l60K9j26J60Qm10L48K50l13k58P58m76l2J07K20k86k3o0
$$ 287 72 -209 37 333 -27 2 -124 36 44 -366 -18 232 -81 -339 419 -57 -89 18 238 -48 -71 -131
2937a31J73j04J08n6k4n8O3J55j57J5J86L0k2j72L85j12k21J29K1k43j19L43j12
$$ -131 42 -62 46 -10 -34 -92 -29 126 -31 -16 170 200 178 6 391 279 58 187 208 -35 -154 189 77
2960G7k67Q5P2J49J86k21R3q7J65n04K76j08P6K2j67%K4K31K37m85k5K91J00k68
$$ 77 -190 -105 -33 116 302 81 174 87 252 -252 24 -84 -8 14 -153 -153 -129 102 339 -146 -171 120 220 -48
2984d8j21L56j71r1L0J96k56n9J64j0j7j53J41j17J03J48j64qj29K2J51J08j18
$$ -48 -169 187 16 -75 -45 151 -105 -164 0 -10 -27 -180 -39 -156 -53 95 -69 -77 -206 -184 -33 75 -43
3007d3k6j30J13j23L66l11L84j28K43l53j7J32J46Nj94j15j7k73M03q5j22J05
$$ -43 -69 -199 -86 -209 157 -154 230 102 345 -8 -25 107 253 258 64 -51 -68 -341 62 -23 -145 -40
3029d0j54K50j13L7j05J41l44J12O8K24n6R5j08N1j78K05J38o19N87j7L9l18j38
$$ -40 -194 56 -57 -20 -125 16 -328 -216 -148 76 20 115 7 58 -120 85 223 -396 191 174 213 -105 -243
3052b43K60k32K88p0m6J40j38q9J21k97L21k7K6q9O8np1J70j14j74J84nO6o5p2
$$ -243 17 -215 73 3 -43 97 -41 -130 -9 -306 15 -12 14 -75 -7 -12 -83 87 -27 -201 -17 -22 44 -21 -93
3077i3L83l10J55k4Q7m1k70K10j11J71j27o3N7k95J01L25j39Q1j66P5O3j66j12
$$ -93 290 -20 135 111 198 157 -113 97 -14 157 30 -33 24 -271 -170 155 16 97 -69 6 69 -97 -209
3100b09J89P8k65J31K3p1k4k08J79K76p7j45J47N1j50m7J31P2mJ5K9n79N80r0
$$ -209 -20 58 -207 -76 -53 -124 -148 -356 -177 99 22 -123 24 75 -75 -122 9 81 77 92 121 -458 122 32
3124C2k8j88Q0R8O3J7j86nQ0K7l5j97M49j30k42J96mKm36M11N6P3k56J41J37k52
$$ 32 4 -184 -104 -6 57 74 -112 -117 -37 -10 -45 -242 207 77 -165 31 27 29 -407 4 60 133 -123 18 155 -97
3150i7k3p3K80k50m4K8J34J14j97J83k7mj16J02l52L56mJ08j35k0l0K2K78k76
$$ -97 -120 -193 87 -163 -207 -179 -45 69 -128 55 28 24 -92 10 -342 14 10 118 -17 -37 -67 -45 233 -43
3174d3k95O99l7n00K40q6J97j22o4j30k4j16R0M44m16o2K11k46J85k95K40K32
$$ -43 -338 361 324 -176 64 -22 175 53 -11 -141 -165 -281 -191 253 -163 -225 -14 -260 -75 -370 -130 102
3196A02k67O6K4J06R2k44J67k5K21k46n0J19NK34j53j98R6K12Qj24l41M11l85
$$ 102 -165 -99 -75 31 123 -121 46 21 242 -4 -54 65 70 304 151 -47 49 261 269 145 -196 215 -170
3219a70M4R8m13K42J47Ol09N95l10k12K05Q3M3j08j3J60j02J7k6K57k68J42j55
$$ -170 -126 -28 -441 -199 -52 -46 -355 240 -70 -282 -77 6 49 -59 -72 88 -14 3 -23 234 -34 108 -47
3242d7j47L31l02K9M25m74M24m10nJ05K42k11j3J03p2q9k91N12m13M19q1%o7K02
$$ -47 -194 137 -165 -136 289 -185 239 -171 -176 -71 171 -40 -53 50 -22 -111 -402 110 -303 116 35 35 -32 170
3266A70k40J25p7J69LM4m1j48P3O1l37j11N34k73K38k37JK3K8m8N5J26m53J86
$$ 170 -70 55 -22 147 150 194 153 5 78 139 -198 -309 225 -48 190 -47 -46 -23 5 -43 12 138 -315 -129
3290a29J37P4j99O1J43k34K04J24O2n51R4K58m3O0P1o1k15K04j17O4k39L43O0
$$ -129 8 82 -117 -56 87 -147 57 181 243 -308 -214 44 1 61 132 71 -144 60 -57 7 -232 111 171
3313A71l8j07N8N2j00k1k59Q6L02M4j02k20M51m01j27Q4k0J72R3l41J38K05l03
$$ 171 133 26 84 136 36 15 -244 -158 144 188 86 -134 317 -84 -211 -127 -147 25 118 -223 -85 120 -183
$$ [...]
8191D7
##END NTUPLES=NMR FID
##END=
