##TITLE=1H_Pr 53-3d
 CDCl3
 8 sc, 
 26.09.2022
##JCAMPDX= 6.0         $$ Bruker NMR JCAMP-DX V2.0
##DATA TYPE= NMR FID
##DATA CLASS= NTUPLES
##ORIGIN= UXNMR, Bruker Analytische Messtechnik GmbH
##OWNER= root
$$ XWIN-NMR		Version 3.5
$$ Mon Sep 26 14:51:16 2022 Russian Standard Time (UT+4h)  she@DPX200
##.OBSERVE FREQUENCY= 200.1313499994
##.OBSERVE NUCLEUS= ^1H
##.DELAY= (6, 6)
##.ACQUISITION MODE= SIMULTANEOUS
##.ACQUISITION SCHEME= undefined
##.AVERAGES= 8
##.DIGITISER RES= 18
##SPECTROMETER/DATA SYSTEM= spect
##.PULSE SEQUENCE= zg30
##.SOLVENT NAME= CDCl3
##.SHIFT REFERENCE= (INTERNAL, CDCl3, 0, 15.7039)
##AUDIT TRAIL= $$ (NUMBER, WHEN, WHO, WHERE, WHAT)
$$ ##TITLE= Audit trail, XWIN-NMR		Version 3.5
$$ ##JCAMPDX= 5.01
$$ ##ORIGIN= Bruker BioSpin GmbH
$$ ##OWNER= she
$$ F:/spectra/data/she/nmr/H-F/1/audita.txt
$$ ##AUDIT TRAIL=  $$ (NUMBER, WHEN, WHO, WHERE, WHAT)
(   1,<2022-09-26 14:49:42.43 +0400>,<she>,<DPX200>,
      <created by zg, POWCHK disabled, PULCHK disabled
       configuration hash MD5:
       00 E9 B6 7A A2 85 ED C7 34 08 36 98 17 FE 4E 26
       data hash MD5: 16K
       BD 0F 13 A5 8D E3 40 21 1A 0E 56 4D ED 91 1A 98>)
$$ ##END=
$$ 
$$ hash MD5
$$ F6 07 66 A9 3F B8 E9 DA D4 D8 6B B8 11 BA DE DE
##$RELAX= 
##$RELAX= 
##$RELAX= 
##$RELAX= 
##$RELAX= 
##$RELAX= 
$$ Bruker specific parameters
$$ --------------------------
##$DU= <F:/spectra>
##$EXPNO= 1
##$NAME= <H-F>
##$PROCNO= 1
##$TYPE= <nmr>
##$USER= <she>
##$AMP= (0..31)
100 100 100 100 100 100 100 100 100 100 100 100 100 100 100 100 100 100 
100 100 100 100 100 100 100 100 100 100 100 100 100 100 
##$AQSEQ= 0
##$AQ_mod= 1
##$AUNM= <au_zg>
##$AUTOPOS= <>
##$BF1= 200.13
##$BF2= 200.13
##$BF3= 200.13
##$BF4= 200.13
##$BF5= 200.13
##$BF6= 200.13
##$BF7= 200.13
##$BF8= 200.13
##$BYTORDA= 1
##$CFDGTYP= 0
##$CFRGTYP= 5
##$CHEMSTR= <none>
##$CNST= (0..31)
1 1 145 1 1 1 1 1 1 1 1 1 1 1 1 1 1 1 1 1 1 1 1 1 1 1 1 1 1 1 1 1 
##$CPDPRG= <>
##$CPDPRG1= <>
##$CPDPRG2= <>
##$CPDPRG3= <>
##$CPDPRG4= <mlev>
##$CPDPRG5= <mlev>
##$CPDPRG6= <mlev>
##$CPDPRG7= <mlev>
##$CPDPRG8= <mlev>
##$CPDPRGB= <>
##$CPDPRGT= <>
##$D= (0..31)
0 1.2 0 0 0 0 0 0 0 0.06 0 0.03 0 0 0 0 0.0002 0 0 0 0 0 0 0 0 0 0 0 0 
0 0 0 
##$DATE= 1664189381
##$DBL= (0..7)
120 120 120 120 120 120 120 120 
##$DBP= (0..7)
150 150 150 150 150 150 150 150 
##$DBP07= 0
##$DBPNAM0= <>
##$DBPNAM1= <>
##$DBPNAM2= <>
##$DBPNAM3= <>
##$DBPNAM4= <>
##$DBPNAM5= <>
##$DBPNAM6= <>
##$DBPNAM7= <>
##$DBPOAL= (0..7)
0.5 0.5 0.5 0.5 0.5 0.5 0.5 0.5 
##$DBPOFFS= (0..7)
0 0 0 0 0 0 0 0 
##$DE= 6
##$DECBNUC= <off>
##$DECIM= 32
##$DECNUC= <off>
##$DECSTAT= 4
##$DIGMOD= 1
##$DIGTYP= 9
##$DL= (0..7)
0 120 120 120 120 120 120 120 
##$DP= (0..7)
150 150 150 150 150 150 150 150 
##$DP07= 0
##$DPNAME0= <>
##$DPNAME1= <>
##$DPNAME2= <>
##$DPNAME3= <>
##$DPNAME4= <>
##$DPNAME5= <>
##$DPNAME6= <>
##$DPNAME7= <>
##$DPOAL= (0..7)
0.5 0.5 0.5 0.5 0.5 0.5 0.5 0.5 
##$DPOFFS= (0..7)
0 0 0 0 0 0 0 0 
##$DQDMODE= 0
##$DR= 18
##$DS= 0
##$DSLIST= <SSSSSSSSSSSSSSS>
$$ [...]
##$SUBNAM2= <"">
##$SUBNAM3= <"">
##$SUBNAM4= <"">
##$SUBNAM5= <"">
##$SUBNAM6= <"">
##$SUBNAM7= <"">
##$SUBNAM8= <"">
##$SUBNAM9= <"">
##$SW= 18.0517283424941
##$SWIBOX= (0..15)
0 0 2 0 0 0 0 0 0 0 0 0 0 0 0 0 
##$SW_h= 3612.71676300578
##$TD= 16384
##$TD0= 1
##$TE= 0
##$TE2= 300
##$TE3= 300
##$TEG= 300
##$TL= (0..7)
0 120 120 120 120 120 120 120 
##$TP= (0..7)
150 150 150 150 150 150 150 150 
##$TP07= 0
##$TPNAME0= <>
##$TPNAME1= <>
##$TPNAME2= <>
##$TPNAME3= <>
##$TPNAME4= <>
##$TPNAME5= <>
##$TPNAME6= <>
##$TPNAME7= <>
##$TPOAL= (0..7)
0.5 0.5 0.5 0.5 0.5 0.5 0.5 0.5 
##$TPOFFS= (0..7)
0 0 0 0 0 0 0 0 
##$TUNHIN= 0
##$TUNHOUT= 0
##$TUNXOUT= 0
##$USERA1= <user>
##$USERA2= <user>
##$USERA3= <user>
##$USERA4= <user>
##$USERA5= <user>
##$V9= 5
##$VALIST= <valist>
##$VCLIST= <CCCCCCCCCCCCCCC>
##$VD= 0
##$VDLIST= <DDDDDDDDDDDDDDD>
##$VPLIST= <PPPPPPPPPPPPPPP>
##$VTLIST= <TTTTTTTTTTTTTTT>
##$WBST= 1024
##$WBSW= 4
##$XGAIN= (0..3)
0 0 0 0 
##$XL= 0
##$YL= 0
##$YMAX_a= 125036
##$YMIN_a= -164870
##$ZGOPTNS= <>
##$ZL1= 120
##$ZL2= 120
##$ZL3= 120
##$ZL4= 120
##$ABSF1= 10
##$ABSF2= 0
##$ABSG= 5
##$ABSL= 3
##$ALPHA= 0
##$AQORDER= 0
##$ASSFAC= 0
##$ASSFACI= 0
##$ASSFACX= 0
##$ASSWID= 0
##$AUNMP= <proc_1d>
##$AZFE= 0.1
##$AZFW= 0.1
##$BCFW= 1
##$BC_mod= 2
##$BYTORDP= 1
##$COROFFS= 0
##$CY= 11.3945322036743
##$DATMOD= 1
##$DC= 2
##$DFILT= <>
##$DTYPP= 0
##$F1P= 2.36226072786647
##$F2P= -0.459571619588291
##$FCOR= 0.5
##$FTSIZE= 0
##$FT_mod= 4
##$GAMMA= 1
##$GB= 0.15
##$INTBC= 1
##$INTSCL= 1
##$ISEN= 128
##$LB= 0.24
##$LEV0= 0
##$LPBIN= 0
##$MAXI= 10000
##$MC2= 0
##$MEAN= 0
##$ME_mod= 0
##$MI= 1.114404
##$NCOEF= 0
##$NC_proc= 0
##$NLEV= 6
##$NOISF1= 3.799351
##$NOISF2= 2.8
##$NSP= 1
##$NTH_PI= 0
##$NZP= 0
##$OFFSET= 15.70392
##$PC= 1
##$PHC0= -18031.67
##$PHC1= 11.80069
##$PH_mod= 1
##$PKNL= yes
##$PPARMOD= 0
##$PSCAL= 0
##$PSIGN= 0
##$REVERSE= no
##$SF= 200.130013532006
##$SI= 16384
##$SIGF1= 3
##$SIGF2= 2
##$SINO= 400
##$SIOLD= 16384
##$SREGLST= <1H.CDCl3>
##$SSB= 0
##$STSI= 0
##$STSR= 0
##$SW_p= 3612.71676300578
##$SYMM= 0
##$S_DEV= 0
##$TDeff= 0
##$TDoff= 0
##$TI= <>
##$TILT= no
##$TM1= 0
##$TM2= 0
##$TOPLEV= 0
##$USERP1= <user>
##$USERP2= <user>
##$USERP3= <user>
##$USERP4= <user>
##$USERP5= <user>
##$WDW= 1
##$XDIM= 8192
##$YMAX_p= 0
##$YMIN_p= 0
$$ End of Bruker specific parameters
$$ ---------------------------------
##NTUPLES= NMR FID
##VAR_NAME=  TIME,          FID/REAL,        FID/IMAG
##SYMBOL=    X,             R,               I
##VAR_TYPE=  INDEPENDENT,   DEPENDENT,       DEPENDENT
##VAR_FORM=  AFFN,          ASDF,            ASDF
##VAR_DIM=   8192,          8192,            8192
##UNITS=     SECONDS,       ARBITRARY UNITS, ARBITRARY UNITS
##FACTOR=    0.0002768,     1,               1
##FIRST=     0,             0,               0
##LAST=      2.2672688,     0,               0
##MIN=       0,             -164870,         0
##MAX=       2.2672688,     125036,          0
$$ Real data points
##PAGE= N=1
##DATA TABLE= (X++(R..R)), XYDATA
0@%%%%%%%%%%%%%Qj6J6j6J6k4L2l2M0m8N6p2Q3r1J05j24J46j67J90k17K46k79
35a48L14l53L96m44M96n51O12o80P54q36R23j017J124j240J367j505J656j824
53i56K012k224K460k726L029l379L790m278M869n601O536p783R537j2202J6782
68I866k6788Q8613p8414j45377J64362Q9594q0948q0545M6268K4535Q067P070
80B6303k4374o2587L4944Q7935j2238j09986j0358J02748L5347q6743m9290N2759
92a5540N1875j5656k9145j0656N609K5220K4050l3627m4243L3484N6877k8892
104A9356n0013K3443L0855k4251n119K7133k2388l4159M4838M1697n9065n1878
116e9551N5969N1207m8852m2336M2359K4606l3896j499K9842k6737l0329N2879
$$ y = [0, 0, 0, 0, 0, 0, 0, 0, 0, 0, 0, 0, 0, 0, 8, -8, 8, -8, 8, -16, 16, -16, 24, -24, 32, -40, 43, -48, 57, -67, 79, -88, 102, -115, 131, -148, 166, -187, 209, -235, 261, -290, 322, -358, 396, -440, 483, -534, 590, -650, 717, -788, 868, -956, 1056, -1168, 1292, -1434, 1595, -1784, 2006, -2272, 2597, -3004, 3532, -4251, 5286, -6916, 9866, -16922, 71691, -6723, -152100, 12262, 101856, 20908, -59637, -13369, 11166, 19233, 26303, 1929, -60658, -25714, 62221, 49983, -60003, -70361, 32387, 67734, -19009, -68299, -15540, 36335, 20679, -8466, -19122, -13513, 11707, 35757, 2130, -42113, -8629, 48248, 19356, -30657, -7214, 23641, -610, -5729, 21404, -984, -35143, 9695, 51392, -7673, -59551, -3582, 47625, -1227, -43563, -1204, 23402, -10494, -11993, 17849, -8888, -39217, 13662]
128A3662M0020o5181m5939O9016M9364o2398m9121M8243M2875k8500k7873J2731
140c101O935m015J1428j537k7648P65L8817J672m4976r349M0919J0860l4239p763
154b1232K7005M416j5541L167N066j1969N526K0342j4527k2305K3961K1788l1383
167e686j8206L6469J3703l6463o896L5547P90l3716J188K4530n703j7656R982
180b117Q625j4025m15J9261p539k5375J2798L0982j3730l4626J3203L5334j0450
193A1926l1218P607K5159k367j2873K038J092k739R266M583j9456q117K3723J1344
207A9968k4676j4804K1713J3670j8345j1077J2685M732p753K553L245j0768l39
220i196J7263p36j9865L603K1242m639j7230N800J3543p079p553R707L315j0783
$$ y = [13662, 53682, -11499, -57438, 11578, 60942, -1456, -50577, -2334, 40541, 12041, -15832, -3101, 3834, -181, 11247, 9710, -17938, -17173, 21644, 23316, -21660, -31009, 9910, 20770, -13469, -21232, 5773, 10189, -5352, -2185, 2881, -9088, -3562, 16780, 2253, -20052, 3909, 25697, -5686, -23892, 12577, 26280, -10183, -17079, 18468, 19258, -14458, -13270, 11260, 5557, -12099, -2117, 6508, -7517, -7932, 11329, 3790, -21585, -8787, 22195, 8465, -26161, -12958, 22376, 11926, -19292, -11685, 13474, 11107, -1766, 272, 1364, -1375, 7891, 12474, -6982, -15099, 8624, 19968, -4708, -19512, 2201, 15871, -2474, -13551, -866, 3866, -3887, -1334, 1911, -8857, -9196, 8067, 7331, -12534, -8931, 12311, 7672, -9558, -3758, 9785, 2706, -4847, 4860, 8175, -2608]
234b608o9J1184k909j1903K924J0286l307r709L798O058n985l218P786n46j0346
249h564K917J2781m802j4983O338J5304n943j1443N853R074l936k782L057j991
263H80k840P336K256j1036l126J2392M423j3066n201J1371N448j0473m984O213
277d07K017m372J02J083l843J150P947k150r409L895J1495l304j0837L439R247
292F053k283o637K395L794j425k80J552j619k159L495K322o029l869N549L452
307D311o648l933O178K952o035k008N581l8m462K020L294l148j459M229J157m235
323b244J574M208j012l525K322K960k675j951K027J922l249j565K767O66k967
338g42r19K208n34k766O63K015k452p97L129n3k964J052L881j438l510K333L647
$$ y = [-2608, -2677, 8507, 5598, -6305, -3381, 6905, 3598, -6111, -2313, 3745, -2240, -5458, 2328, 1782, -8564, -5647, 7134, 2332, -12651, -6313, 8991, 3048, -8395, -2542, 6532, 2596, -186, 2871, 880, -1960, 5376, 7632, -3404, -6530, 5862, 10285, -2781, -7982, 3389, 8837, -1636, -6620, -407, 1610, -2762, -2660, -1577, -5420, -4270, 3677, 1527, -7882, -3987, 7508, 4204, -6633, -3194, 6053, 3770, -2867, -472, 3322, 1897, 1617, 3169, 1550, -609, 2886, 5208, -821, -4690, 859, 4311, -2337, -6270, -92, 2860, -3175, -5183, 398, 360, -4102, -2082, 1212, -1936, -3395, 834, 1991, -2244, -670, 3538, 2526, -999, 1323, 4283, 1608, -343, 1684, 3606, 357, -1208, 1559, 2225, -742, -1661, 547, 13, -2753, -2090, -75, -2527, -3324, -195, -248, -3212, -2160, 1721, 283, -3227, -894, 2753]
355B753j753k575J813K064k36m15k80N07p0Q38m13k735p32K538Q67l366k326L166
373c55K005k634j538R87Q20l74J02r09j237J428K664q90k168P88L023J008j051
390A669j642Q64J727K5j761j011L20J214J088j312k069M8K353R6k973r68J123
407a209N7P65l31k631q98M168K889m339l573M798L910j838l953k94L255K826r66
424B636l083o86K888K763j209l804k277K922M626j339p306j541O875L490n957
439a002n795L625N695q3m675k739J957L879J257l359k459J595N255K075m352n283
455d409K645O754J674p265m703O472P048m978p796J286O347k38k251r65k598n08
471c485N088J697p965m037P910P847m778r381Q29R017L502o923o295N180P982
$$ y = [2753, 1000, -1575, 238, 2302, 2066, 1651, 1371, 1878, 1808, 2646, 2233, -502, -1234, 1304, 2171, -1195, -3521, -355, 1650, -984, -2522, -1535, -715, -1089, -987, -1896, -3133, -1705, 959, 69, -2099, -1311, 1712, 2720, 1669, 27, 891, 2618, 2643, 882, -129, 191, 1405, 2493, 1181, -888, -840, 1513, 1609, -1364, -2332, -1209, -1152, -387, -718, -3349, -4247, -79, 2810, -1529, -5102, -304, 3606, 1768, -2185, -2479, 776, 3602, 2636, -447, -1133, 1755, 4518, 3309, -495, -2772, 150, 4776, 3437, -3869, -5410, 1465, 4955, -1002, -6797, -3172, 2523, 2440, -2235, -4974, -3017, 862, 2119, -1240, -3699, -2104, 3151, 5226, 874, -4409, -1764, 4990, 6664, -601, -5304, 1168, 8216, 3238, -4558, -3272, 3075, 2837, 586, -379, -2977, -3485, 1603, 3300, -4665, -8702, -792, 7055, 2277, -7104, -6275, 2742, 6244, -679, -6974, -1794, 6188]
486F188j287n861j204J285K647M814r92r677j755J2085M702j3782r243R450J1815
501I185l586j1856k577R044P219o039j0045J470Q742K681l399l745k801K632R382
516F307J434j3092n012J5511J0614j3844j3664Q196J3632l108j1006j272P681
529B377L890k929n472k423J572M177L404l949q454J199J2145J786j4443n668J4437
544A649R838j0283r834N957P004j437l607j030k47L628N601j952q124k025O071
559A209N716l043q897j627J1029N985j2695j0168R407J1658n764r022K341M466
573E95k22j72j215m581Q81Q631L413p672o862N840R749l159j0787j395J2350M991
589A0385j0391o729P292M685m532k242K452j371r17M375n43q168r64Q602K080
$$ y = [6188, 4901, -960, -2164, -879, 1768, 6582, 5590, -4087, -5842, 6243, 10945, -2837, -12080, -2630, 9185, 5599, -6257, -8834, 210, 7429, 1390, -8655, -7185, 1557, 4238, 839, -2906, -5707, -3075, 6307, 7741, -5351, -10363, 5148, 15762, 1918, -11746, -3550, 10082, 6974, -4032, -5304, 2377, 6267, 3338, -2134, -4557, -2985, 1192, 4596, 647, -7807, -6608, 5537, 7323, -7120, -12788, 1649, 11487, 1204, -8630, -2673, 4331, 2894, -713, -1743, -1990, 1638, 7239, 5287, -2837, -4862, 1209, 6925, 3882, -5015, -6642, 4387, 10372, -2323, -12491, -3084, 8574, 2810, -6212, -3871, 595, 373, 201, -1014, -5595, -4714, 3917, 7330, -342, -7204, -1364, 8385, 5226, -5561, -6956, 5394, 10385, -6, -6735, 557, 5242, 710, -1532, 920, -451, -1368, 3007, 2464, -5704, -6668, 1934, 4014]
604D014o817k509N164L486k386m098k93L610K989k053k883J901K310j801l85J531
620A780j109k125L703L237m739n084L407M253k673l801R65L561M33k303k151p6
636b722J786J092m41l46j020O4K756J228m513j801O226L967n485m034M436K797
652C990l492j420J398J54P56J393k076l179J418K667j720k449N97J624Q72j160
668f27j425o27K049J670j394j470J672J584j242q75M56K31P79R68M2q84K07L73
686A487o9n07r00p19J166J173j835j684J177J141p84j347P47L43k84L17k74q54
704a706o63K746P21j807o36K612J038j981m67O56M20O90k92j232P4J801K1j878
722A17r95J417R46j250j377j12Q34J52o94j253Q86J496n33j260N05O63Q6K58j27
$$ y = [4014, -2803, -5312, -148, 3338, 952, -3146, -3439, 171, 3160, 1107, -1776, 125, 2435, 634, 249, 1780, 671, -1454, 2249, 5486, 747, -4337, -930, 3323, 650, -3151, -2186, 1375, 1808, -495, -2646, -2722, -936, 156, -285, -631, -1651, -1587, 1169, 2397, -2116, -3917, 2309, 6276, 791, -3243, 1193, 3990, 498, -922, 476, 630, 1386, 2779, 703, -2476, -1058, 1609, -111, -2560, -1963, -339, 533, -627, -2052, -2679, -630, 1040, -354, -1824, -152, 1432, 190, -685, -229, 2, 781, 1749, 1791, 907, 1114, 1487, 1418, 911, 11, -708, 458, 1631, -204, -1888, -711, 430, -354, -1701, -954, -611, -895, -578, -852, -1706, -2369, 377, 1098, -709, -1345, 1267, 2305, 324, -143, 513, 933, 1623, 1331, 99, 173, 1974, 1995, 117, -878, 539, 1485, 235, -1142, -1254, -420, -268, -962, -2215, -1329, 167, -366, -1626, -1121, -458, -372, -114, -241]
741b41m59J087J114q53j085J283J215p33q55N70k9l33J05o68n85L80K88l61o16
760g76L40M76p75n04J06J20K3k19J79N54J83N5J39K65K03K42K05k74J35J9L82
781A078n57J85K21J66m04j46J75k85n83k69j10j81p5o04N17J38j26P9K09l07J64
802g15M40r1k95P11L24m11M57N90K78n01Q8J63R3k60k07l72j86L70l3q51K2M10
824B4K80p89m46Q3J99j07l25j49M40K60pK83J79j2M87N97p41k61Q83J54m36l70
846B26O01N82n69j01r8l86j06p7j5n70l47J70O4k79j1K44j35rM58K88r48M8J080
869A10K06j019O1J396K26k02l13M00L32j44j36r1j199L40R11o9j473l54J146P87
889I15j504p32P63M95o44k33j75l92R20J073q47o76J111R16l65n33J55K04M07
$$ y = [-241, -700, 387, 1501, 648, -437, 846, 2061, 1328, 473, 1043, 1014, 681, 786, 118, -467, -87, 201, -160, -776, -436, 40, -735, -1239, -1133, -1013, -990, -1209, -1030, -476, -293, -238, -99, 166, 369, 611, 816, 542, 677, 696, 1078, 521, 706, 927, 1093, 689, 543, 718, 433, -150, -419, -529, -710, -785, -1389, -872, -734, -860, -781, -572, -879, -715, -275, -366, -661, 50, 374, -37, 420, 1010, 1288, 787, 875, 1038, 1131, 871, 664, 292, 106, 476, 443, -408, -386, 24, 304, -485, -931, -848, -649, -756, -1081, -1230, -790, -530, -537, -254, -75, -87, 400, 997, 256, -5, 878, 1032, 596, 226, 827, 1409, 840, 739, 641, 255, 149, 72, 57, -513, -860, -690, -626, -905, -916, -672, -807, -816, -358, -70, -1018, -970, 110, 316, -703, -642, 754, 980, 778, 465, 865, 1197, 1053, 917, 826, -373, -33, 878, 809, -664, -1018, 128, 915, -589, -1321, -558, -63, -707, -940, -1115, -1507, -587, 486, -361, -1037, 74, 990, 625, 92, 247, 451, 858]
908H58O93m11j663O58K050o48k068j1J337N47j748n76N51l77L33J67o3r82k3J754
928C78P84k792j046K996J668k854j453K612K252k112o25J001k89m55J198J112
944B375k328j102K574J172l135j619J874J990j144j855l34J040Q18n90j957J60
960b061K085N96j364J03N98k80K67J005m50j858J481K595r86l259L70L132R17
977B891k900r70K038J293k244j778J505P43j969N37K281k029l183L488L250m090
993a137l559M297L735l769k458K565J850k055l2J409l67j83J308O88k114j199
1009a021R68J464k6k264p05K746J334k677k694J751K623j480j644L30J231k18
1025b82n19l68m9R16M20R05M06j432j673J958K423k481l014M325K911l821l477
$$ y = [858, 1551, 1140, -523, 135, 2185, 1537, -531, -542, 795, 1342, -406, -982, -431, -808, -475, -308, -371, -1353, -1376, 378, 1162, -1630, -2676, 320, 1988, -866, -2319, 293, 2545, 433, -192, 809, 520, 65, 1263, 2375, 47, -1055, 1519, 2691, -444, -2063, -189, 1801, 657, -1198, -1532, -492, 326, -264, -2221, -2061, 24, 620, -744, -641, -43, -323, -56, 949, 499, -1359, 122, 2717, 1731, -1528, -1158, 1974, 2891, -9, -979, 1059, 2352, 108, -1670, -165, 578, -1391, -854, 1427, -602, -3785, -297, 2953, -1137, -4696, -399, 3336, -433, -2891, -326, 1524, -531, -563, 846, 479, 296, 1604, 2292, 178, -1021, -53, 1411, 1385, -879, -1584, 1162, 2496, -181, -2875, -1124, 1499, 19, -1625, -1295, -64, -282, -801, -1169, -1218, -302, 118, 1023, 1429, -3, -1676, 282, 2705, 224, -2790, 1535, 4446, 625, -2852]
1042b852L693K126l849o96L656m02m014J584K844l114k778L243K770k332k109
1057b230J648J688j198j614M53J308N01l88k74J124l55o41O48L69r08N2J406k2
1075A567j635o71Q36q0L0o6o19L73J503j190k570Q24K666j521j602K312J262k461
1093a042l78K582q22k616K295L287k556k430K370J684k595j423K865R19k064l0
1109D6J390q96j871N13J322o77j081P53J288r93j539O05J325m99j159J506Q71
1126I04j409l17J132j28j146J405J360q94r89J427k62j845O00J959j662r88J885
1143A032P05k763j31K086r86k081J636J643j943j257J923K07j528N93J483l30
1159B89r68J269L19r52q28J032J045p08m28Q16L59o54p15N47M75j207J6J155n47
$$ y = [-2852, 841, 2967, -882, -1578, 2078, 1676, -2338, -754, 2090, -1024, -3802, -559, 2211, -121, -2230, -582, 1106, -92, -1706, -1253, 55, 556, 168, -106, 1018, 663, 22, 670, 1039, 131, 183, 1589, 1567, -68, -739, 97, 17, 47, -19, -638, -265, 1238, 48, -2522, -1698, 968, -553, -2155, 157, 1419, -1042, -1420, 1162, 340, -2276, 19, 3306, 750, -1680, 690, 2374, -221, -1644, 1221, 2140, 76, 46, 1436, 540, -1331, -818, 504, -173, -1254, -501, 787, -206, -1745, -1140, 185, -314, -1473, 33, 904, -505, -822, 310, 182, -964, 441, 1801, 907, -82, 1345, 1083, -762, -162, 1797, 135, -853, 1032, 1737, -1026, -1157, 929, -57, -2138, -502, 1141, -802, -2059, -136, 71, -1457, -864, 619, 289, -679, 590, 909, -43, -871, 161, 1206, 498, 70, 886, 1245, 591, -124, 423, 898, -309, -293, 862, 315]
1178C15j656O18J509j708p48J980K76j925p5J993p14j803J441J383j362k21J664
1195I67N43j935K52J604n60j176R33R79j612m23J150l67q30L16O99o5j262O24
1213a63J53q26l44K98P61m97l56Q68O42j045k63J416n3j220Q52J112r87q30J128
1232F46Q01j560L61J297m50j417J25J294j372r05J270N09j400k92J568n30j163
1249a218M70J029q90l36O62O65q86q1Q79K89m30p8Q75O3j115L44P41l18r48R18
1269F35J9p67j34O43K3r76M6N61m38o97R43L3p99k46J222q0o20K55P04m90n12
1290f75P04P77q28P0N63L78r40K1J280m21j234O14N61q33n30M48N57r69j70N57
1310g0J22p62K48M93l23p59N79O06p12j63M95M36l25K9O62j29l34K83K46k91j41
$$ y = [315, -1341, -723, 786, -922, -1670, 310, 586, -1339, -1414, 579, -135, -1938, -497, 886, -476, -697, 967, 1510, -425, -173, 1431, 871, -305, 628, 1607, -5, -428, 722, 355, -475, -159, 540, 475, -787, -163, -10, -836, -1180, -882, -121, -618, -974, -106, 536, -509, -772, 644, 591, -629, 223, 1335, 348, -482, 646, 1447, -113, 248, 1545, 1095, -322, -197, 1097, -275, -1180, 90, 599, -801, -1093, 475, -55, -1218, -748, 281, -609, -945, -283, 382, -504, -585, 294, 583, 153, 75, 950, 1013, -102, 242, 983, 665, -283, 635, 654, -113, -247, 396, 419, -557, -511, 50, -388, -1085, -142, -109, -908, -1154, 68, -12, -632, -377, 327, -163, -675, 29, 806, -22, 48, 611, 989, 49, 70, 1350, 929, -305, 309, 870, 37, -493, -45, 512, -457, -627, -70, 52, -710, -462, 31, -292, -1051, -472, 134, -578, -741, -246, 190, -135, -106, 556, 427, 93, 376, 622, 331, 190]
1331A90K08L54n06k74N76l50l61J54N19r43k43N88j86o39K84M72k27k19L66M57
1351B20l24l47L71M62n17l13J014j07l19K54M66J2m79n8R3j69l31K13j27j31r4
1372b11j09K79k53Ll7k09J40J49J5l10n6N96j30M4L19k6Q1r1N7L32j27l78N76
1395F54k30k70K24%j52j27k47L44J86m59l5j15r8m19K63L2L24l64k26O73j7l29
1417c88Q0O03j57m02M96N76n98J90q8J06J81l27J52J73q0m76l10K29j05j96j6
1438c57M81l47n05O0J040q28q50J120K80k30n81O34K82l57J81J06K71L74m22k24
1458A28L98J46q31J76R08m54j079P28O50r15o69O33O07o72r37Q34K63n93q4M55
1478c08N1np2J75O91n78n26L97P54m56n92J231Q30j415m80Q20N92j586J58J054
$$ y = [190, 398, 752, 246, -28, 548, 198, -163, -9, 510, -433, -676, -88, -274, -913, -629, -157, -384, -603, -237, 220, -104, -451, -80, 382, -135, -448, 566, 459, 140, 394, 860, 872, 393, 335, 428, 259, -72, 141, 14, -117, -211, -320, -41, -294, -291, -328, -537, -397, -248, -233, -543, -599, -3, -133, -89, 230, 204, 285, 194, 251, 583, 456, 78, 654, 424, 154, 378, 378, 226, 99, -148, 196, 382, -77, -112, -227, -325, -744, -481, -449, -125, -489, -715, -42, -59, -388, -308, 295, 138, -264, 232, 808, 210, 400, 312, 418, 599, 272, 424, 597, 517, 41, -269, -40, -145, -341, -357, 124, -223, -728, -668, 372, -456, -1306, -186, 94, -136, -717, -83, 199, -158, 23, 129, 400, 774, 352, 128, 526, 672, -159, 17, 925, 471, -608, 120, 770, -145, -814, -181, 426, -246, -1183, -349, -86, -679, -763, -308, -257, -262, -334, -159, 532, -46, -572, -175, 579, 123, -469, 762, 1592, 177, -303, 517, 1109, -477, -319, 735]
1498G35j14j127J54O66o43k36O0L85j99R2m31L44M35o54l34P34R68p14l76J053
1518G98K86j400J21R47k01o23L82P06m53j004N17J81j47q3O2j89K18q68k43N86
1538d07K53p33J32R49k28q88M29J113p96q71J226P66r92j26Q08J22q17K29N35
1557G04Q3l27L5k39n40K14j96r3L21N4n04J77N14l94q52N19N91l23m77Q09L32
1578D08q42Q2O68j23k4L20j82M39j29m44l30N17K29p55N90P71j255n25O46K45
1598C06j000K16Q20m30p24M61L71n92n04J059K12o52N53L49m24o91P41Q9k44N31
1618D47K32j43l43M61n37k36L96j19k7j19L40l41n40L57l75nJ92J35k19J49J82
1639a13k39k24M35L43m52O34R2n34j80Q99j68r66O89Q47r68m66J053l65r39N60
$$ y = [735, 621, -506, -352, 314, -329, -565, -505, -120, -319, -227, -658, -314, 121, -533, -867, -133, 835, 121, -255, 798, 1084, -316, -195, 752, 551, -72, 310, 1016, 563, -441, 76, 257, 110, 27, 89, -100, 118, -750, -993, -407, -154, -887, -755, 194, -34, -922, -493, 620, -176, -1047, 179, 945, -47, -173, 635, 757, -60, 169, 704, 787, 460, 495, 256, -284, -70, -266, -359, -38, 16, -488, -311, 203, -191, -1043, -524, 67, -256, -733, 76, 408, -434, -352, 316, 193, 169, 489, 307, 746, 617, 173, -157, 360, 589, -166, 424, 1195, -60, -585, 61, 306, -694, -478, 342, -88, -812, -351, 20, -572, -1076, -17, 195, -457, 96, 445, 21, -670, 71, 160, -84, 447, 679, 536, 193, 654, 117, -119, 277, 158, 131, 12, 352, 11, -529, -172, -547, -552, -360, -225, -444, -295, -113, -352, -576, -141, 202, -250, 384, 476, -58, -238, 661, 493, -473, 216, 1063, 95, -371, 682, 317, -622, -62]
1659f2O85l54n00L47n5p48K37K29k85K17OJ24J48o5p0l85K92K20J35K02J55j33
1681C40o2j1J50m44K24O62p66J30J82j42o00O7N49n08j8M72l17m65K5M73l43k40
1703f42M34L36m34j72Q74l61l36N32L58n36j02L29M70m59k04L88l16l0K72j49
1723B52j50l1j76L24m06j44rL32l03k30K24J43l48K50M17j55m44K93M46j21l58
1744a94M98J94m19K93K46r0m87J57K45l23k83L39K6n01K02K54l72l53M06Pk71
1765d26j74K17OJ96K39M9j65k3L60q7j61R8R8k5j75k7K43J00r1k15N13k93l48
1788i1m7L66n61r6K56L3l70J42J7L43k82k1Q5MK2j12O34l64j65Q8M43l31J49J47
1812B89r1l5J60O2j35l08J56j7q0j56K7Nm0K7J54k79j16J94mj21j94O05j19j3
$$ y = [-62, 623, 269, -231, 116, 61, -687, -450, -221, -506, -289, -283, -159, -11, -76, -146, -531, -239, -19, 116, 318, 473, 340, 278, 267, 417, -27, 197, 859, 93, 223, 405, 263, -337, -270, 279, -229, -247, 225, -92, -557, -532, -59, -402, -642, -208, 128, -306, -478, 396, 35, -301, 231, 589, 53, -49, 280, 750, 291, 87, 475, 159, 129, 401, 252, 102, 71, -105, 219, -187, -331, -340, -8, -311, -541, -317, -174, -522, -272, 145, -10, -454, -161, 285, 164, -194, 304, 498, 79, 372, 618, 528, 41, 198, 443, 120, -163, 176, 202, -299, -97, 157, -215, -568, -162, -155, -426, -600, -383, -377, -181, 58, 107, -58, -81, 279, 192, 31, 129, 227, 202, 27, 0, 243, 343, 252, 37, 550, 257, -91, -138, 228, -333, -429, -173, -140, -510, -368, -351, -8, -290, -311, -226, -222, -200, -312, 322, -42, -207, -119, 324, -7, 142, 289, 198, 163, 323, 385, 250, -58, 98, 81, 1, -155, -128, -123, -163, -136, 18, -261, -377, -183, -187, -308, -502, 103, -16, -29]
1836b9j7m8K43j29K12J9n0P1r8L61l75P0J31n2r8j14j4K0l38Q6m3j60j49J20M81
1861A00n47K67j60L57o51M62mq9J08N4J44J55J51J1k20q2L43M0j60j80K56K1n81
1884b05M55Kj07j31n58O59l61j95K70K17o27J9N08J06j47k45L85j06L7j63N29
1905C42k48K1K1K39K9O4l25M25k20k87O3J54J16m27k59K75j94J94k18o1J05j7
1927b08k63K77L36m00j14K08N0K82n67O34m9J1m17N41J34l62p8K58N5j78n4K51
1949C47J01o87L65j21Q3n77M21k19L69m25K92j37l7k07J32M17K5j13j31O00k06
1970B92j67j4K06j51j86K87K76m24k14J61J73J40k55k6M8k58p8j83L53L9n75R6
1992d60N48J3m30N0N45k88l40L25L71j3l58M52k31k04L73q5k4J33j82n09M45J17
$$ y = [-29, -46, -94, 149, 20, 232, 251, 201, 272, 174, 535, 160, 230, 361, 309, 211, 97, 83, 103, -235, -149, -192, -352, -501, -381, 100, -447, -180, -340, 17, -634, -172, -176, -265, -157, -103, 41, 196, 347, 358, 138, 56, 399, 439, 279, 99, 355, 376, -205, 250, 252, 145, 14, -544, 115, -246, -441, -171, 46, -581, -562, -54, 52, -95, -340, 45, -61, -24, -187, 342, 94, 115, 136, 375, 404, 468, 143, 568, 348, 61, 124, 278, 394, -33, -292, -17, -211, -17, -235, -296, -191, -208, -471, -194, 142, -258, -372, -164, -114, 168, -399, 235, 186, 197, -220, 321, 455, 93, 15, 273, 328, 150, 96, 347, 448, -239, 126, 5, 88, -489, -68, -287, 82, -343, -51, -188, -225, -432, -300, 117, 142, 29, -102, 498, 292, 125, 111, 317, 166, -20, 267, 543, 119, -95, 66, 239, 379, 124, 98, 146, -112, -190, -373, -20, 19, -556, -460, 88, 101, -329, -279, 266, -22, -362, -37, 334, 321, -37, 415, 184, -20, 353, 268, 244, 377, 195, -314, 131, 248]
2014B48k89j78M21J62p21R7M43m43k71K40N48o74r8P32j02n69j2P30k04j33K50
2035A77J68l39L7K80j47L38j53k36J06K54m87p4M05l14m41M12J35k61J2R5j58
2056a91m47M05K53J2m70M80J14m77K63K06k31J61M94K7o53R6M11p04j39N88J87
2077C85k22p6N01l60p30L99J75k74j37M73l55k68J74o4L05J41k59P7L14r6k31
2098a28K17K00k74l20N73L42p02M0N21k02m94O3O51p69qL07l06j47M45j59k56
2119d06J57L91j53k44M09Rm29k8O31k94l92M28J32p6j35J64L0j78N91l18J61n43
2141i3p4J70K2Nj33J20P1k57j92M07l60q0O9O50o20O4L24J21l73l1M73q7k28L64
2165C32J19o31K54L36K23o92M69L07m24l83L61k56m70L55n8o5N6J51k06QJ51k56
$$ y = [248, -41, -219, 202, 364, -357, -260, 183, -260, -531, -291, 257, -417, -515, 217, 115, -454, -466, 264, 60, -73, 177, 345, 6, 43, 323, 176, 514, 361, 125, 231, 485, -2, -76, 329, 15, -426, -14, 121, -140, -128, -33, -191, -638, -233, 20, 32, -438, 42, 156, -321, -58, 148, -83, 78, 572, 599, -54, 42, 453, -251, -390, 198, 385, 163, 87, 588, 228, -502, -103, 72, -202, -339, 134, -221, -489, -315, -379, -74, 67, -192, -115, 199, 103, -128, 89, 289, 15, -305, 268, 610, -92, -52, 469, 267, -227, -164, 487, -282, -290, 17, -289, -436, 9, -150, -406, -249, 142, -11, -255, 154, 163, -266, -294, 337, 43, -349, 79, 211, 135, 0, 164, 194, 16, 607, 289, 450, -93, -167, 3, 25, 30, -103, 17, 88, -169, -361, 46, -314, -394, -325, 325, -295, -231, 93, 214, -159, -190, 283, 196, -32, 332, 451, -180, 74, 410, 633, -59, 410, 717, 293, -90, 271, 15, -455, -100, -158, -223, -167, -16, -222, -214, -63, -319]
2187c19K48k69R3K55K90k46q5L87k26p9K43Q2L8l79oj18K26k12K17L31n08j30
2209a67K75j64n60O08M8k88l73N21J03m48J42M39k52j21K69j2q9L7K29N8m12K68
2231A11j34J54j31K2K70k12J12k42j17K07k96K29M0l63J89J40K47m08J97J57o6
2252A06m94L04K69j70j86K40J17m14M37N6R9k55j74M49l87K32K71m36j13j85N42
2273C08j04l84K08K92p13L8L04j91k78L59J71j20J04J6K00j74j76L12J62j89j47
2294bJ16J3K2o5lJ86k64j8J28j15j02J20r0J27l59M09l2k47q7j05J56O8m2J3P1
2319a02k3K06j37M6M4J5J04kj17L5J1n6J88q1r7oJ8k38J62K2p6O6j38J00j44j00
2345c00O6M4J63j97J24o4Q3J53r3Rj43K40O6k12n8K34p4LJ18Q2N8m05K20K77k23
$$ y = [-319, -71, -340, -247, 8, 298, 52, -33, 354, 128, 49, 292, 374, 412, 33, 27, -91, 135, -77, 140, 471, -37, -167, 108, -56, -616, -8, 40, -248, -621, -100, 3, -445, -303, 136, -116, -237, 32, 20, -69, -32, 197, 255, -157, 111, -23, 131, 0, 22, 292, 80, 192, -50, -167, 40, -256, -27, 13, -350, -161, -21, 226, -182, 15, 172, 106, -388, -84, 185, 15, -171, 69, 186, -228, 209, 265, 364, 109, -65, 384, -3, 229, 500, 64, -49, -234, 308, 204, -180, 28, 320, -393, -355, -51, -242, -520, -161, 10, -110, -6, 10, 210, 36, -140, 172, 334, 145, -2, 114, 127, 149, 84, 81, 267, 3, -15, 113, -2, -104, 16, -74, 53, -306, 103, 71, -176, -263, -368, -212, -144, -186, -173, -102, -125, 81, -56, -10, 34, 49, 153, 151, 34, 69, 80, 24, 212, 131, 34, 28, 46, -192, -30, -8, -84, -18, -156, -56, -200, -300, -234, -190, -27, -224, -100, -164, -81, 72, -21, -12, -155, 85, 151, -61, -119, 115, 41, 44, 162, 244, 302, -103, 117, 394, 171]
2370A71n45J95M45k86j82P4k7j92M9M25j69q4m5J71k46PK17P4O6k60L47k19l7
2393e1K36o4J5k0K7l4N4k50N0K82k47j68O7O1P4k9J3j61j99J82J17J26m8q4n9
2418a10j75K22L1K1K7J22%K47l09J70o2k30Q2O4L21l87J4K8p9P9j26Q9j78j19
2442b58L57L5l12K7n6J44L38n12L27r6J27k10J93K43j98OO4k45K99J15k82J08
2464B14p5j29k62L59j36k17Q7L37l06k58L84o0j57K34o8p3J00j29k4O1p5J23K18
2487A48J17r7j4M1j44J65n42M34M3j22j57K72q2p3M0k7j25o9k6J2m1L62j38k46
2511b69K69j42J18Q9K6r9m8J13J22N2k76K66j95j57L8J55K94l86K13M6k92m3j8
2534a24k7l4M1j13M1J37L4j95j01K24o7K24k22M99n48r6L03L05q1K1L73p11J88
$$ y = [171, -374, -179, 266, -20, -202, -128, -155, -347, -298, 127, -42, -126, -171, 0, -246, -239, -22, 52, 118, -142, 205, -14, -51, 185, 121, 136, 116, 143, 109, 163, -87, -37, 245, -2, -170, -103, -42, 32, 3, 16, -145, -344, -162, -45, 81, 33, -51, -110, -285, -63, -32, -11, 16, 138, 138, 385, 76, 246, 184, -46, 36, 100, 421, 34, 48, 76, -3, 76, -50, 39, -139, -258, 99, 134, -178, -151, -207, -63, 275, -237, 90, -6, 121, -89, 104, 347, 149, 155, 219, -26, 273, 388, 106, 214, 139, 10, -252, 107, -29, -246, -159, 178, -128, -386, -2, -62, -219, 15, -53, -126, -26, -155, -179, -118, -193, -70, 148, 265, 168, 154, 195, 51, 216, -326, 108, 151, 29, -128, 144, 62, -11, 29, 2, -123, -192, -218, -206, -247, 115, -23, -269, 0, -142, -24, 65, 91, -8, -56, 57, 179, 231, -45, 221, 26, -131, -93, 62, 356, -30, 183, 229, -63, -106, -124, -151, -185, -144, -257, -216, -79, -45, -240, -341, -117, -184, 40, -182, 317, -231, -327, -24, 281, 200, 221, 594, -117, 71]
2557G1n2J2l53N57k09m9J40J17k50K35P1l68p9M30j00k81p7l7J95n23O42J5k03
2580i6K57j09o2k91M71m6j06Q3J15j46k35K15m7j65K00K57l39J81j73O8o5j37
2602a70R0j26K7L28j63N4j89J36j77K44l2l19L67kj38RK64q1N0L5k26J12Q8l5
2626A46p2l26O5J91J63k99LJ61k49j81J32N0Rj61K81OM7J50l60K27M7m4m2N0Q6
2651H0n6j56K79Q2L6p4K68n59K91k62k02K08K43j03Q9l28J56k31M5J72K5j1j00
2674a08L42n50L01j03l2N1L2P7M09m12J23J12l78j10K73O6j06J24J02J8j89k03
2696a61J67L2k29q9L50Q8q7k40o6J48J13k63L48q6J65j35l24J71R4J11l15J85
2718b3J15J14j15R2K55m37o9J01j32n2R0L08r2m28J43J20k4K1J09j55j27j2oL03
$$ y = [71, 19, 31, -322, 235, 26, -23, 117, 234, -16, 219, 290, -78, -157, 273, 173, -108, -185, -222, -27, -550, 92, 107, -96, 161, 52, -10, -301, 170, 124, 18, 101, 216, 70, -165, 50, 3, -162, 38, 295, -44, 137, -36, 32, -33, -170, -80, -206, -179, 149, -14, 40, -149, -13, -190, 54, 22, -297, 70, 68, -70, -61, 203, 122, 172, 207, -19, 93, 181, 146, 74, -252, -187, 4, 167, -132, -129, 32, -217, -398, -266, -216, -207, -368, -87, -81, -34, 116, -244, -17, 30, -14, -56, -6, 80, 24, -132, 147, 229, 265, 191, 459, -100, 191, -71, -273, -65, 178, 75, 164, -164, -8, -239, -194, -22, 3, -8, -108, 234, -316, -15, -118, -150, -99, -67, 10, 419, 7, 130, 242, -136, -246, 27, 93, -13, 111, 213, 231, 42, -161, 6, 38, -191, -280, 70, 158, 71, -169, -235, -87, 26, -237, 111, 25, 190, 55, -269, -98, -4, 107, -208, -23, 92, 206, 91, 183, 438, 1, -68, 33, -99, -151, -61, 247, 155, -273, -130, -10, -34, -13, 96, -59, -186, -198, -204, 99]
2742I9j64J11o4Q2j58L01l9K7K1k40K99j04j40J46k15L34k95L6N3k87L42k68m
2765a27J53j21j27r6J45K52o7k29L89j33q9r2L16k8l18J17K05j16O0q4J76j80
2787Fk64L35L3m5j52J14rj42J09j80r9J82o3K47k40R8J35l83M15n0m8J3L7J24
2811A73j76M7p1J21P2pk25J80q2j00J43J11k56K3j53L06l11J13jR4K9j39J48K77
2835C16m91P9K89j58k1J1JnJ51K1r7K4k3J1j84M4L20j62k18J15j50J90l3r8j9
2860h7j08j20L09l25K44p9J23Q7k55j6L51J5k45K99j16K75l40J62KJ60m19J22
2882C9K6m1n4k03K6L38m17L21%N9J96m15j02J32J34m6N7q2j93J73J81K7p4j39
2906e7N4j34J88K45j32j41n0k8K52R3l72qK23j56j33J65K8j6N7k73R4Q9k64K86
$$ y = [99, -65, 46, -18, 64, -94, 207, 168, 195, 216, -24, 275, 171, 31, 177, -38, 296, 1, 37, 90, -197, 145, -123, -127, 26, -95, -222, -318, -173, 79, 12, -217, 172, 39, -50, -142, 174, 146, -172, -55, 150, 34, 94, 10, 186, 6, -258, 77, 110, 65, -87, 27, 18, -124, -15, -195, -294, -112, -175, 72, -168, -70, 65, -318, 97, 47, -1, 12, 49, 173, -3, 44, -27, 94, 166, 159, -66, 114, 32, -68, 75, 186, -70, -47, -200, 106, -205, -92, -93, 1, 30, -109, 39, 316, -175, -96, 193, 35, 14, 25, 26, 21, 172, 193, 96, 120, 97, 108, -76, -32, 288, 126, -92, 23, -127, 63, 30, -68, -87, -195, -315, -6, -331, -87, -166, -43, 44, -211, -227, 124, 139, -106, 193, 77, 352, 12, 174, 176, 336, -83, 39, 65, 24, -30, -233, -207, 131, -286, 35, 35, 94, 290, -125, -227, -95, 39, -7, 50, -32, -225, -52, 129, 156, 82, -57, -3, -137, 51, 296, 164, 23, -27, -55, 197, 290, -82, -90, 133, -23, -156, 9, 37, 21, 78, -195, -101, -12, -276, 10]
2930A0r9j30R8K35q8k31K57J13j58J96J32j18K2k08j49K40J62k59P4j30J76j30
2952A5J50m3m91L61j26J10j77N17l27k9j20K50k2m2j16L4JJ12J02l10K43p8J41
2975A55l2k2rJ31r6l99M95m12J85J11l40J23K04l94N08l23K48k29L48j24j35P9
2997G2R6j42k10L47l71M70j63r4K23l59L79j97K8J54k36Q2q8m3m4J03l4Q5j21
3020f3j03k3L88l46j37K76p0J01Q4j42k21K75j01j40L23R8k62J41K2j21Rp7K21
3043A32l15K96J18j64R1q0m0j16j67K28j80O7L45j31m66M32k09J29rK81l84k66
3065d08O07j44N5n9j63J31k4p3J84j02J93k03j31lK96o2L3k73K43J24m01K55o2
3088A3k19K94K2J11k09K1j95K3j24J79j1K15O2o0j57J51R1M2p7J28m15J94K89
$$ y = [10, -89, -219, -121, 114, 26, -205, 52, 165, 7, 203, 335, 217, 239, 31, -118, 122, 284, 25, 99, -31, 145, 15, 165, 122, -369, -8, -134, -24, -201, 316, -11, -40, -160, 90, 68, 26, -90, -56, -55, 57, 159, -151, 92, 14, 155, 123, 101, 92, 223, 127, -272, 223, -189, -4, 107, -233, -110, 94, -300, 208, -115, 133, -96, 252, 128, -7, 72, 168, 26, -184, 163, -208, 262, 99, 5, 228, -131, 248, 51, 79, 233, -3, 79, -9, -52, -96, 7, -27, 58, -63, -166, -189, 199, -147, -284, -8, -78, 23, 107, -35, -256, 19, -82, -222, 101, 199, -63, 78, 100, -21, -12, -89, 132, -183, 113, 231, 67, 158, 78, 38, -78, -245, -17, -197, -130, 215, 84, -382, 50, -159, -30, -39, 242, -142, -408, 199, 55, 110, 51, -112, 19, -5, -78, 106, 4, 197, -6, -137, -140, 156, 94, 127, -146, 97, 221, -180, 75, 13, -206, 88, 110, 221, 12, 33, -162, -139, -263, -84, -95, 120, 182, 122, -35, 116, 207, 249, 172, 300, -115, 79, 368]
3111C68k31l5J27K1l48q7R5J53k0j06k07K16N3L2o7j75o4N16k15J3j35J67j87
3134a16J43R8j60J43N2l26L01p2J96j24j46J22j00k2N9L07k16m37K61N3j57P8
3156f3k68K17N5L7j80K46k33J09N4n3K90j30n5K15k19l6P8j5m7J97q4K3l99N05
3180B44j44l92L69k85nJ60n8j18j17N10k52L7j04J39J11P3k71J09j48K17P9O5
3202B19j14J95l5j09r6m5N7Jk13q7J59J75J1k62o8J26PK5j34J36O7k45K67Ml21
3227b80J88J33j77j8L99k2q5j99K43J41k66o4L0j16J11J28j95j84L81l07J81K2
3249D4j48O5k81M56j31J2l73N34j31J26j51R0J15k64jL09j89j23qLK10k2k89N5
3273i2K42m6k22N8J16k67L20j58j27K12r0J10l4J44k37L9k9O3k0L9k45L62m3j7
$$ y = [368, 137, 102, 229, 250, -98, -185, -90, 63, 43, -63, -270, -54, -1, 31, -36, -211, -275, 241, 26, 39, -96, 71, -116, 27, 125, -35, 108, 160, -166, 135, 63, 259, 135, -11, 111, 11, -11, 48, 355, 139, -298, -37, 16, -141, -63, -331, -114, -59, -22, -202, 44, -189, -80, -26, -79, 211, 81, 26, 241, 22, -14, 64, 49, 2, 199, 115, 138, -261, 244, 100, -292, 77, -208, -213, -53, -111, -229, -346, 164, -88, -51, -155, -16, 95, 168, -103, 6, -142, 75, 154, 219, 105, 300, 265, 156, 60, 15, 72, 73, -140, -227, -68, 107, 118, -144, -212, -86, -79, -54, -188, -52, 15, -230, 37, 41, -280, -92, 41, -136, -154, 245, 223, 138, -61, 182, 323, 57, -7, 23, -93, 18, 146, -49, -233, 148, -159, 22, 44, -104, -39, -320, 136, 5, 17, -356, 178, 47, 173, 22, 112, 227, -37, -38, 271, 82, -41, -49, -46, 164, 142, -147, -92, 150, 104, -118, -60, 56, -211, 109, -49, -176, 36, -54, 56, 22, 166, -71, -32, -61, 2, -18, 21, -224, 138, 95, 78]
3297G8j86K72k06J0K17p3k34J18j60J09L64k93JQ2l57K80j47RK20N0n4l06J36
3320g0Q6Q6j80M48l77p1Q7K2Q8J84m71PM35j84j46Q1j46PM02n06K9L87j19k72
3344a93K34j07o9q1J27R4R3J59m84K0K12j07r8J61j33j47N33l6j28r1J96J81m33
3367i7P5k14NL07K75j80p3l0n0J6j32J77l2K6k16Q9nj07J41k13J48J21p9J60j3
3392I9R9k25J00q9J4J51j19J39q7j41K08ok50k1Qj59L54k48J15J72m4j55J22k03
3416a66J03M6k48J18j55J31J38qrO2n2om1qK28J29j59j70J77K04k16J06r7l10
3440b03L51j94k30L28n9q4K33l41KM1J24R0K0j24q8Q5J96j29j20o6r9L90k66M77
3464C34j21k25J40OrK59o15R3L26k73J08j81L6J04q7K51l16J16O6k35M10k51j59
$$ y = [78, -108, 164, -42, -32, 185, 112, -122, -4, -164, -55, 309, 16, 17, 99, -258, 22, -125, -116, 104, 154, 100, -206, -70, 16, 102, -78, 370, -7, -78, 9, 31, 119, 303, -168, -161, 274, 90, -56, 25, -121, -114, 288, -218, -189, 198, 79, -193, 41, -66, -135, -216, -89, 5, 98, 257, -227, -207, 5, -102, -200, -39, -172, -319, 214, 178, 50, -41, 155, 336, -97, -22, -236, -231, 76, 351, 171, 98, 68, 18, 34, -98, 79, 47, 73, -143, -54, -59, -166, -25, -238, -90, 31, -48, 112, 99, 198, -27, 73, -16, -2, 149, 30, 169, 82, -59, 149, 143, -107, -128, -120, -279, 75, -173, -58, 114, 70, -85, 37, -166, -63, -17, -265, -147, -302, -171, -33, -41, -50, 12, -40, -46, -87, -95, 133, 262, 103, -67, 110, 314, 98, 204, 107, -203, 148, -46, -276, 52, -7, -91, 142, -199, -197, -156, -32, 58, 78, -46, -134, -49, 147, 18, -102, -168, -267, 123, -143, 334, 213, -12, 128, 134, 125, 384, -231, -138, 188, -85, 23, -158, -122, -18, -105, 146, -170, -54, 12, -223, 187, -64, -223]
3487b23L80k02K86l22K01mM3k64L99p3j94P4o2rK02J30n06J31j15J32M6j49N7
3510d2P0l8%J18K3k94J32k86M29k54J39j38k50M49K0N8j32J07j31M1n0K19j57
3533C3j52N5K14j57l0M1q0K84l57k02K14K43k51J32n8K78pk98K5J67n5j68J56
3556B7M5j21K11L1j28K0K03n26M07n6l77K47J56Q0l09R0K11k92L3O4R1l80K34
3579c9P8k29k75O08l37J59p1J32m5l32J47J87Q0K19l54R4R4l68O9K44j3Q0J7k8
3603A17k02M0k10L3J35k25J91M2q0p2K25Qj16K91o6k61K03Jj99K7K60l89L47p0
3627C0M6L1r9j07L07j08o9P6j75K34k74N0L0M4M9l09L56j86k33M10l70L00k40
3650b07PK33p0K39l68M66j70n6m3N3K6RJl11K0Q3J3J43k27j4R9j03J1J35j3N1
$$ y = [-223, 157, -45, 241, -81, 120, 116, 159, -105, 294, 221, 27, 101, 39, 30, 232, 362, -144, -13, -128, 4, 50, -99, -42, 28, -10, -10, 108, 131, -163, -31, -317, 112, -142, -3, -141, -391, 58, 78, 136, 4, 111, -20, 21, -29, 190, 33, -119, -64, 150, -7, -37, 4, -76, 208, -149, -351, -137, 106, -145, -13, -71, 207, 200, -98, -73, 94, 39, -129, 27, 72, -49, 162, 193, 65, 85, 288, -238, 169, 113, -264, -17, 139, 219, -90, 0, 211, -81, -48, 16, 107, -273, -39, 39, -190, -465, 143, -194, -35, -106, 26, -19, -351, -204, -17, 63, 282, -72, 22, 116, -252, -183, 61, 48, 128, 145, 117, -85, -45, -255, -222, -87, -312, -121, -79, -159, -231, -6, 2, -114, 177, 111, -150, 53, 54, -145, -118, 142, -247, 100, 30, 76, 107, 8, -99, 208, 100, 31, 107, -68, 166, -108, -58, -28, 16, 65, -244, 112, -74, -307, 103, -267, 33, -207, -200, 33, -37, 202, -166, 300, 130, 74, 31, 84, 110, 119, 120, -191, -171, -88, -75, 68, -159, -173, -74, -177, -166, -31, -44, 7]
3676G%j91P4M9j32O23n77L22p6j45L5j8NL90l26o3M5k08K47j41N1J15j49J46R
3701I2n1M6m1J56p3k97K48k26K32l1j75N4K02N5l70K29j6R1m20M43j57M5j27P2
3725a9l0O9o1J52k1j90L60j19n3n0j95M36m43npK1K65q7l48N00k8j11N6k83L41
3750A50j88K35j68k78L01k9J65j48p3J12Q0l0J39p3j83lj8J13N8k80k00J57P1
3773i0J00j43K38k29K3L98k50o2p9LJ22J65o3r2K74n01j0J39N4j40J47o7L07J5
3797B59j00j80k83J23K23j69K1R7K82l89j06K07j25J66j33J70k01QJ9J76J17k90
3819a08j5N2Q2R9L1j53j9m5J40k23J4J43J1j35j56J61Q6O7m5q0J14j01k37K18
3843i9K16l75J43N29o15J58oL3K4l0J15j44n9R3J73M2j68m2q0J22q7J68K1k19
$$ y = [7, 7, -184, -110, -61, -193, 430, -147, 175, 99, -46, -11, -29, -24, 366, 40, -23, 22, -186, 61, -80, -29, 86, -63, 83, 92, 41, 87, 46, 202, 129, -168, 80, -146, 86, 55, -120, -66, 136, 191, -179, 50, 34, 125, -295, 148, -9, 36, -91, -19, -49, 20, -41, 111, 90, -100, 260, 141, 88, 38, -157, 279, -164, -169, -176, -155, 110, 23, -325, 175, 147, 36, 92, -191, 150, -38, 197, 29, -249, 52, 23, 188, 40, -33, 79, 159, 129, 268, 195, 12, 9, -9, 104, 162, -118, -318, -161, -90, 10, -133, 105, -124, -101, 297, 47, -15, -94, -91, 31, 196, 133, 41, 315, -186, -196, -57, -3, -143, 4, -63, 244, 259, 159, -21, -304, -181, 42, -127, -106, -9, 273, -116, -222, -15, -140, 26, -107, 63, -138, -130, -111, 65, 182, -108, -123, -71, 11, 110, 141, -12, -31, -76, 64, -159, -145, -2, 9, -126, -282, -121, -35, 32, -13, -93, 21, -80, -317, -99, 117, -258, -115, 414, -201, -43, -49, -16, 8, -22, 93, -51, -110, -17, 156, 198, 30, -12, -92, 30, -57, 111, 132, -87]
3867h7Q5J51p5O7j93j01K8J37o5K7N0k60K67nm5N3J45J33l21K93k99l9J11J25
3891A82om5k33KJ67j5J02K37l79j33Qj34M05j98l0K6L20k57l0Q9p6L2j62O0k14
3916b82M0P0j06K51L02j95p2J42l91M16m3J6n32M27LK8n3K1k30Q9J70j64L43n47
3940b97J60J62pp8j42J42j7Q9J65j36K8J82j93L3k44mJ43J47j83K55l7k23J19
3963F4q8Q0J01N5k20j2M6M8p8l10J65M99m05K11j66L0j46K7N8Q5P8J0k64J41p4
3988f5K28M7j90J7j52K76j45l47o5J99K42k58Q5J21jR8pk46J02j48K12k3O4r1
4012d7K51j29j80K92j28jJ41k64K50l67K85q4k01N7K65p1j35k8J23N3j46q4j14
4035b62M12k32L8J74l9k93L71j35J13l05K26k30J84j51J77J65j8j8k31l0k58L85
$$ y = [-87, -2, 149, 74, 141, -52, -153, -125, 12, -53, -26, 24, -236, 31, 26, -19, 34, 179, 312, -9, 284, -15, -54, 57, 182, 176, 131, -102, -100, 67, 52, 154, 391, 12, -121, -113, -247, 158, -40, -70, -44, 276, 19, -11, 78, 2, 34, -128, -68, -282, -242, -172, -278, -27, 275, 80, 8, 150, -241, 175, 132, 148, -384, 43, 46, 74, 21, 42, -188, -99, 71, -93, 250, -297, -137, 25, 18, -60, -202, -60, -77, 12, 177, 41, 69, 251, 58, 91, -153, -157, -14, 133, -50, 205, 168, -55, 64, -24, 56, 157, 212, -8, -20, 26, 74, -4, -314, -149, 350, -55, 156, -10, 20, -126, -99, -41, 44, 122, 132, -132, 9, -65, 163, 210, 20, 37, -115, 161, 16, -331, -396, -197, 45, -213, -128, -7, -8, 90, 83, -163, -61, -209, 3, -20, 44, -47, 204, 75, -105, 187, 59, 58, 199, -65, 185, -182, 103, 19, -182, -125, 140, 69, -66, -94, 29, 82, -64, -148, -262, 150, -82, -44, 130, 91, -202, 169, 34, 147, -158, 68, -162, 22, -129, 48, 213, 195, 177, -54, -84, -342, 43]
4057D3j83J31j44J05p8Q2q7M2J3R6J72k55K64j01oJ47m65J37J55j13L50l55km8
4081a00p8J74Q4J31p2m14K53k5J63q1O2l1l5k0j13J03j4J62l76J48MJ58k79K54
4105E8j19J35k60J90J79n58M92r1Q6j72J52j25K7p4K57j71k69J00K6Nj3P5M8J22
4129A00K8k38J04o7J5R8O0j81L41k30J04j67R7j49k2J31K92k10j13j11J54kl75
4152c41L91J79k76J8K29n17J52J12m0K17k28o4K87k7o2J2P0R9r1J11q8k88J5o2
4176a92L73n0l01J87o6mK9J15j54l7J78o1Rn7k83K23m9J75J51k81J98n9J81k29
4200dMK54k8j87n3J47k35l4N9K55m2k04J01M8K38k53j66M7l8R8j20k66K28R7k26
4225b80J40L8L6r3L2K87q1k94L76k93J90j85Q5q8K05j65K00m6j29J29J22j47K1
$$ y = [43, -140, -9, -153, -48, -126, -44, -131, -89, -76, 20, 192, -63, 201, 100, 94, 241, -224, -87, 68, -45, 305, -50, -52, -100, -178, -4, 80, 211, 139, -275, -22, -47, 116, 35, 97, 66, 31, 11, -102, 1, -13, 149, -227, -79, -75, 83, -196, 58, -61, 74, -186, 4, 183, -375, 117, 26, 112, -60, 92, -33, -6, -80, 177, 6, -263, -163, -137, -132, -145, -70, -22, 100, 128, -110, -6, -73, -58, 40, 100, -81, 260, 30, 134, -33, 64, -85, -107, 24, 316, 106, -7, -118, 36, 34, -341, 50, 229, -47, -29, 200, -317, -165, -53, -93, 124, -104, -168, 119, 92, 30, 42, 112, 211, 120, 231, 143, -145, -130, -192, 181, 131, -170, 17, -49, -53, -24, 91, -63, -100, 78, 17, 26, -31, -314, -91, -140, 35, 186, -95, 103, 44, 225, -4, 0, 254, 226, 39, -14, 133, -102, -136, -77, 178, 136, -68, 33, 81, 319, 66, -100, -53, -91, 7, -113, -379, -151, -54, -280, -140, -102, -66, -159, -127, 160, 79, -215, 161, -132, 58, -127, -42, -130, 75, -90, 110, 64, -65, 64, 186, 39, 60]
4248F0j8j9k38J64J69ln44M48j12K05j37M5Kmp3n4N4J76j50K6j00K52J10k60Q1
4273H0n3R4J58j72j35J77k95J36r6Q4J04J9k97J79R7k67N8K7j22P3O8R3J03k00
4297h7M46j94l32K64N8n4j69N0O8P8j98J08j8n4J1N5P1p6j31K1J5q2J42n9K63
4322A96l49J62k59O7j9J49J80j61J92j32J9J79k19NN9L6J69k62Lj06J61q9J84
4345A65r7l18n2J07J71o2j62L18k6j04k0j5N8J49r8J57k66L02k33J3O5q9J18k60
4369a79L98k46J01L0k13Q3J64j97K90m79K57P6j35j27N0k44M84p4q7J94j81j65
4391b00M62j86j45N2j55K30l6J66k57m8L44j53j9J14j92rj75J08R1J38j37K2j02
4414h7K3J21J80m4n40L19J67m65M89r8J1j39K52k63P6j29J18J47n7j60n9O7J61
$$ y = [60, 42, 23, -215, -51, 118, 115, -429, 19, -93, 112, -25, 20, 22, 18, -55, -109, -55, 121, -29, -3, -103, 149, 259, -1, 80, 27, 121, 279, 107, -28, 149, -146, -10, -106, -22, 82, 101, -196, -17, 80, -187, -129, -102, -224, -151, -83, 10, 113, -87, 359, 165, -167, 97, 155, 101, -68, -18, 50, 128, -70, 38, 20, -34, -23, 32, 103, 27, -104, -83, -68, -150, -8, -67, 196, -153, 9, -250, -183, -202, -53, 127, -34, 158, 26, 45, 224, 5, 10, 69, 105, 274, 12, 15, -91, 70, -19, 165, 68, -250, -302, -195, -24, -86, -248, 70, 44, -60, -80, -95, -37, 112, 14, 171, -95, 207, -26, -13, 52, -37, 81, -179, 219, -27, 74, 104, -109, -26, 138, -59, 231, -248, 9, 85, -50, -177, -127, -371, 113, 39, -48, 146, -35, -200, 262, 76, -69, -17, -172, 58, 22, 188, -69, -117, 227, 74, 55, 169, -23, -32, -207, -99, -8, 130, -7, 15, -87, -64, 57, 237, 193, -347, -28, 139, -326, 163, 65, 76, -63, 189, -74, 2, -127, -9, 138, 81, -79, -138, -71, 90]
4437I0k60J37L8j62K97j3J14k39J76j99kk84L03j29J25k0L2k29N0L17r6m1R7j7
4461H5p2J16j69p9K34J80l30j16K77j20p7L49k15k70J97k01K07k23J38J20q2j28
4483a79O6J55k87J65J80k46oJ52o0K26j84L6n9L14k57P9j59J5J90n6l16K89j47
4506h9k32O5J12L55j04k3r0K22l31L87k51nj66J85J65j17j44j19K24J6M3J43l14
4529f8J47l8R1l12J65J1K35k99R8m2k83K15o1J61j40J20j70J12J07K2k71o6K86
4552B0j22J20lm2l1p5oJ53K30l53M5P5j11K58q8J45k79L27l05J31Pm6q1p2K38
4577A35k95K14j19R2l33K69J0j74M05k17P7p2k5j06l3L55m7j61J72k79K45j38
4599b5K81k48k33K35n8L35k97q6k9K5J11K9j5Q9K5j49j99k13K69J09j32L21j55
$$ y = [90, -170, -33, 5, -157, 140, 127, 241, 2, 178, -21, -23, -307, -4, -133, -8, -28, 4, -225, -175, 142, 46, 5, 102, 85, 13, 129, -40, -119, 115, 295, -35, -151, 126, 6, -71, 278, 63, -207, -10, -211, -4, -227, -89, 31, -51, -179, -113, 42, -245, -80, 100, -146, -152, 0, -60, 166, -18, 18, -41, 273, 16, 95, -64, -49, 141, 85, -231, 58, -89, -321, -256, -144, 211, 107, 84, -6, 216, -115, 272, 21, 16, -150, 35, 200, 83, -61, -180, 44, 60, 103, 246, -68, 79, 41, 132, -180, -15, -4, 231, -68, 30, -12, -295, -80, -141, 20, -120, 0, -170, -58, 49, 71, -200, -266, 20, -102, 18, 15, -27, -58, -133, -139, 14, 244, -109, -64, 11, -100, 158, 70, 215, -64, 263, -42, 89, 96, 50, -31, -103, 135, -160, 54, -65, 27, -306, -37, -27, -201, 204, -13, 64, -8, -33, -139, -172, 183, 136, -25, 147, -132, 113, -25, 256, 8, -225, 10, -48, 287, -10, -96, -125, -100, 11, 40, 25, 114, 139, -10, -209, -422, -153, -44, -176, 145, -10]
4622a0J9R9K7m3K2Q4m06L13j35K76j09m1J87l65k5J37l8j26K79k43P8m06M74r4
4646d6K58k94O2J52k24O6n6M74j68l21K72p6k54M86l02RM0J02k06K63k67J63j96
4669f3N6L0k84K89j27J56j60O5j04P8j69K03q1J90j96P5J7J36k23R6J28l9J02
4692A75o3j37J71r2J33k83J62j49J49J00j80J51j78m1N1J86l14o4R9L24l09j3
4714a22J80j00o5kJ85j5N1k57j00K62R4R8k2j73O3o4m2J49k40j05J29L12j98m0
4738b2M0j2j85o6L20k51J5K64j11P5J05k63Q1O9n3K4j31L79m00k1K40k11L0J62
4762G8q9J13J34j77n0p5P1N4k64K32o1K8j09J83K5k53J48k33L74j66O8J31j76
4785a4k31J64Q4q4N8J18J12K06l57Q1n5q6O2j26K26k27k7P0P9L4p4j60k4K61j80
$$ y = [-10, 9, 108, 135, 92, 114, 198, -208, 105, -30, 246, 137, 96, 283, -82, -107, 30, -8, -134, 145, -98, -20, -426, 48, -46, 212, -82, -20, 132, -92, -26, -82, 392, 224, -97, 175, 99, -155, 331, 29, 38, 78, 180, -26, 237, -30, 133, -63, -7, 23, -261, 28, -99, 57, -103, -38, -142, -64, -233, -30, -111, 79, -117, -42, -25, 111, -112, -16, 112, 73, 175, 112, -25, 146, 54, 187, -96, 66, -83, 66, 166, -14, 137, -41, -82, -31, 155, -159, -223, -124, 200, -109, -122, 58, -42, -107, -109, 76, 61, 112, -145, -245, 17, 111, 209, 187, 14, 77, 13, -29, 120, -120, -225, -96, 216, 18, -22, 18, 6, -179, -245, 75, -176, -161, 103, -8, 67, 172, -91, -10, 59, 6, 30, -101, 278, -122, -143, 97, -114, -84, 78, -11, 102, 236, 59, 9, -66, 5, 59, -205, 27, -34, -6, -115, 68, 93, -160, -12, -245, 129, -37, 31, 162, -14, -245, -81, 3, -81, -23, 95, 207, 413, 56, 137, 82, -4, 58, -68, 158, -69, -96, -26, 53, 87, 13, -147, -171, 90, -90]
4810i0K00k32J29k20Q5J97l34J33M16m25K03p3K62k04J5M4J46l93L59k69oJ75
4832A18L7m6j18Qj71k9N02n84K68j54J36o3L5K31j73J51q2r0J6q6K25j39P0K42
4856C04l83rm0J71L6Q2m5L2j69o0Q7j14r9L12o3K1kj43K6nj10J3k4K18L6J06j15
4883F3o7J17q6N6K2k74M32k23J51n4Ql19K54n6n3l5r9K80j93J63k88K72K1k11
4907a19J20k75M40k81qK00R4l73J69J50j38L9J33m5J14k29K96k53k26M72m95K02
4929a3J93m00J4K01J87L5o4o3j17l06J62L32q0l3r8r1N5j03M3J23l43N68k75L51
4953B78k64L74m21J0K53k07J20j18n5q0L77k52j79J26j86K67J52j9k43k20J62
4974a25J61J47k2l77K77r9L9K25j60J38k13J98l21J95j22J65j16r8K09j54O2J62
$$ y = [-90, 110, -122, 7, -213, -128, 69, -265, -132, 284, -141, 62, -11, 251, 47, 62, 106, 252, -141, 218, -51, -57, 118, 155, 109, -9, -1, -172, -201, 301, -283, -15, -169, -33, -96, -61, 170, -3, 148, 66, -24, -8, -94, 131, -8, 62, 304, -79, -88, -128, 43, 79, 161, 116, 148, -21, -81, 6, -108, -207, 105, 42, 63, 61, -82, -56, -61, -171, -158, -182, 36, 72, 178, 63, -4, 113, 27, 83, 105, -169, 263, 40, 191, 137, 145, -174, 80, 24, -29, -64, -163, 117, -76, 87, -201, 71, 92, -119, 1, -274, 166, -115, -123, 77, 171, -202, -33, 117, -21, 18, 151, 106, 220, -9, 287, 34, -192, 280, -215, -13, 180, -220, -206, -5, 182, 217, 153, 90, -27, -333, -171, 161, 81, 48, -50, -141, -86, -189, -146, -23, -366, 202, -73, 278, 14, 388, -33, -23, 230, 23, 143, 25, -30, -110, 267, 15, -164, -38, -224, 43, 195, 176, -67, -287, -125, 36, 183, 161, -216, 61, -38, 1, 226, 66, 204, -9, 189, -132, 63, -59, 106, -10, -108, 101, -53, 9, 171]
4996A71k01j07M5J79j72J78qK4l07K98n8j82L24l36R5J11j16J29J05j42QJ08k2
5019A24j44N2k49k1M06l54J41k0J92j78J46L9j58o6J20Oj14j32j3R8j54K55n5
5042g9J5L8j36R1R3q1J77N6k22J69j38LR9m9L3j01O5j2j80L39k49O1N0m0l75K78
5068i5j16L00R1j30o7K73n44J31K97k48R3r2K99m66O66j70j42Q9pm02K05K34j11
5091H8j82K79j49J32j08j14j58j04L87k50L11l00J86n4ON0j08K14k18J78j44J4
5113d4R2j15J16J38J51k37k3j77L54k58K8o0K3j0O0o4P8K37k27M5j72j98K70q7
5137h0K75m6j30j07J67k4p8K24k43J72k01j47J39J09J45n5j51P5R6O6k79L6K43
5160B06k16M5j07m17O28j10J1o7o6k02K75k33L00j91L01K9k90L80m17L71m17L39
$$ y = [171, -30, -137, -92, 87, -85, 93, 85, 109, -198, 100, 42, -140, 184, -152, -57, 54, -62, 67, 172, 30, 38, 146, 124, -20, 32, -217, -238, 168, -186, -45, -65, 127, -51, 95, 134, -24, -90, 30, 36, -78, -210, -223, -125, -279, -24, -79, -64, -26, -162, -71, 22, -59, 118, 174, -48, 121, -17, -14, 85, 36, 69, -32, 33, 21, -159, 180, -69, -8, 42, 2, -373, -95, -211, 89, 180, 50, -17, 256, -288, -157, 140, -108, -15, -107, 192, -274, 392, 222, 80, 169, 162, -240, -35, 199, 88, -94, 185, 36, 168, 60, -54, -212, -316, 71, -179, 132, -168, 18, -36, -30, 20, -88, 126, -92, 86, -58, -44, 48, -67, 49, 187, 338, 101, 78, -99, 255, -3, 25, -35, -12, -22, 38, -26, 52, 289, 62, 107, -65, -263, 7, -80, 195, 149, 19, -88, 79, 55, -23, 201, -42, 130, -71, -218, -79, 30, 175, 120, -31, 44, 140, 206, -73, -37, 206, -10, 35, -72, -489, 139, 29, 40, -27, -93, -295, -20, -253, 47, -144, 157, 186, -104, 276, -141, 230, -187, 152]
5182A52k95K71j1k59K97l24P9j0J34K41l63J38j96J97k68L66l30O9k0r2L61k69
5204a32pL99j69k9J9j30N6J29M6j38K8o2j0J13k53J48k2O2o4J08j91J00K4l9j75
5229a89J0J4J03K92m14K55m9L1j58K10n6J13l5L3j16K24l03p8n4P7K02o9Q1l65
5253b41K45L12j10j76j69J14J3K37k32k2J79l33L22k98L07j54k7Kn8P9R2r7P0
5276E5j79L00j16n2j85K03k9r9o1K46Rk41q0K09j34L43r2k74L80j32J55k41m1
5299e6M4j85J83K20K8o1j27N2M4j1J09lq3k99L24j69j13K55l89L09m7M4P9k44
5323i6J88j70m30N82l07J09M11k32l76L27PQ1m6L1l14M04l02J30J34j88K11j05
5345D9P4j06L16m91nr9J87L7J27K22j92q2k10j4J47j48J55J30j77N1%j64p5L01
$$ y = [152, -143, 128, 117, -142, 155, -169, -90, -100, 34, 275, -88, 50, -146, 51, -217, 149, -181, -112, -132, -224, 137, -132, -139, 260, 91, 62, 81, -49, 7, 136, 182, 44, 72, 10, 0, 113, -140, 8, -14, 48, -16, 92, -99, 1, 25, -14, -189, -179, -165, -62, 230, -184, 71, 22, 53, -105, 105, 49, 162, 127, 160, 44, 268, -35, -113, -167, -90, 112, 43, 124, -241, 4, 316, 206, 30, -139, -25, -12, 225, -7, -29, 150, -183, 139, -159, 148, -6, -33, -31, -89, -10, 82, -15, 55, -124, 176, 60, 8, -177, 26, -3, -102, -163, 83, 92, -149, -229, -20, -154, 189, 97, -177, 203, 71, 226, -15, -56, -12, -197, -14, 206, 234, 173, 46, 98, 142, 131, 240, 237, 154, -145, 179, 10, -103, 152, -237, 72, 25, 69, 148, -96, 92, -78, -508, 74, -233, -124, 287, 55, -321, 6, 13, 94, 48, 79, -235, 169, -133, -3, 131, -57, 154, 49, 123, 17, 333, -158, -163, -262, -75, -38, 89, 311, 119, 37, -173, -187, -40, -188, -33, 97, -80, -29, -29, -193, -268, 33]
5369C3L7q9Q9j46J10J15j76p3J03k9L2m3j21L8L14l32O1K67m3j50j54J44J41k2
5393A06k26K64l13L01q2j53j4K40P6j69J03k58J09J24k50K49l09J46L43r7j16
5414G4j35R6m9L31j52k2l51L89k59n2J60rJ99j65Ol34R9L51l26K22m4OJ42k9j02
5439D6J50k23J17j44k75L08l8Q0p0O1k10L11j24J9j13N5k17J3N03k78J89o7k24
5462a31j0K9Q1R9j63j34K18P0l09L22j19K42r6j69J95k6j03P1l10K69P8j63O4
5485EN8j45mo2p2J93R6j94P3J0P5o6k7P7J17k0k56K95l33L75K43m49P9k76L7n5
5511b26J66Q8q0k15J88j09K64R4J47l20J02k24L38j33j80J04n1M1L1j8j7J7R7
5534A04Q3j89L11l44K3J22k67J50o6K53k93K58j48p1l2O8O6j91K09J37j06j82
$$ y = [33, 70, -19, 70, -76, 34, 149, -27, -100, 3, -26, 6, -37, -158, -120, 194, -138, -77, 190, 147, -3, -157, -13, 128, 106, -120, 144, -169, 132, 50, -103, -117, 123, 199, 30, 133, -125, -16, 108, -142, 107, -202, -56, 287, 190, 74, -61, 35, -14, 317, 165, 143, -208, 181, -78, -130, 30, 21, 220, 55, 61, -273, -174, 177, -149, 73, 29, 35, 177, 148, 46, 196, -27, 90, -54, -329, -21, -59, 21, -49, 12, -198, 113, -11, 8, -105, -50, -267, -254, 249, -29, 160, 93, -131, -141, -112, -31, 68, -95, -229, -11, 59, -250, 72, -47, 195, 99, -70, 125, 99, -4, 67, -243, 26, 104, -59, 5, 63, -82, -86, -148, -220, -27, 69, -125, -52, -42, 33, -33, -60, 17, 134, 114, -142, 153, -180, 195, 438, -11, 68, -208, -171, -226, -60, 28, -52, -267, -79, -188, 76, 170, 317, -3, 99, -125, 213, 80, -100, 4, -47, -6, 25, 7, -10, 7, 104, 187, -2, 309, -35, -12, 110, -157, -7, -73, 180, -113, 145, -3, -74, -106, -38, 28, -163, 46, 183, 77, -105]
5556a05k5l6j81L51j09k65K25L99k24R1l15j83M51j03oJ72j85J26K40l35M6j11
5578h2j9K04j34m2k2mNJ89j01j85M38l75R8J0lj14M28rk04M6r7j79K62j65l9K72
5604A78k54Q6J30k15r0M56o49L85P5k18m3J84J63l29K54j68M3k96J29P8Q8L2K7
5627D6J42k61J33k2K2p7%J07J25j88k36K79j52J71l47M60j70L7J11k68L3J63j7
5650I1MJ33k12j64J62P6k1J41k15K52m19L02k11M0M5L55l15N2J80j38j25k1j54
5673a62J35L4R0m80L19J03j00J17r2j38K12P8J8r8q1J24M0j45J30J11J8J6K29
5696D78n70J25j6J66j28M9j66Q0q3K40k0j52k38J6K45k48L17Rm2o7m4K90K41l05
5720A77l32K15q6k75J49J32L42j67j18K34m17K97k41J88P3J08l86k9J26M4O4j90
$$ y = [-105, -130, -166, -347, 4, -105, -370, -145, 254, 30, 121, -194, -377, 74, -29, -35, 137, -48, 78, 318, -17, 29, -82, -101, 103, -31, -73, -95, -99, -94, 95, -6, -191, 247, -128, -30, -20, -23, -137, 291, 282, 78, 124, 27, -152, 110, -55, -94, 178, -76, 10, 140, -75, -165, 291, -358, 27, 102, -116, -159, 25, 188, -141, 113, -55, -12, -308, -179, -101, -13, 19, 46, 188, -73, 60, 38, 60, -17, -17, 90, 215, 27, -209, 70, -82, 89, -258, 202, 32, 69, 180, -88, -55, 108, 91, 95, 228, 16, -148, 14, 90, 69, 210, -5, 247, -172, 130, -81, -41, 4, 359, 44, 96, 276, 138, 13, -8, -162, -27, 7, 97, -383, -64, 39, -61, 56, -36, -174, 38, 116, 134, 36, -45, 79, 119, -26, 104, 215, 233, 249, 478, -92, 33, 17, 183, 55, 104, -62, 18, -65, 175, 155, 3, -235, -219, 26, -222, 95, 104, 62, -5, -49, 241, 482, 177, -155, 60, -26, -301, -152, -20, 322, 155, 37, 271, -146, 151, -90, 98, 171, 279, -107, -136, -10, 34, 98, -92]
5742i2j62K81n8P0nJ98l01j72P9J15J7L49j70k59k6j34L58m0j29K48k58K70j38
5765D1m3J28j04J55j02J66j03k92O0N0L8k45J80J73k59j12J51OQ4J6J03K67m08
5788e0L36k25K95l40j93L43o1k6R7j78j2k41J36K28k37j04Q0N6J1K57l14J05P4
5811C7P9J25j73r2J07O9l28J09j04J42j63J85J02j79M1J06j08j56K46j05qk1J15
5834B6k97K88Q2l14J58M9j91J89p7p1j86j32M96p3N1j8r1R4N7K5K82l20M2j4K02
5859B57l01J37j25P5j86K99l53J07j80K76j8J95k48MJ79l18J60O7mqmj4j87L10
5883A20J28m23L34P5k83p9J11j0L38n04K50J28r4j24o5J99K3l93L52j49J9k2n9
5906a28j82L92RqK26m89J9q5m1M98l56r7K25p6J62n7J29j44n5J83p7k81K00K43
$$ y = [-92, -254, 27, -31, 39, 34, 232, -69, -241, -162, -47, -30, 319, 149, -110, -136, -270, 88, 48, -81, 167, -91, 179, 41, -2, 126, 22, 177, 75, 241, 138, -154, -94, -44, -6, -251, -71, 102, -157, -269, -118, -112, -28, -12, 91, 358, -50, 286, 61, 356, 16, -177, 166, 105, 79, 176, -2, -14, -255, -119, 109, -128, -232, -152, -96, -85, 172, -142, -37, 37, 116, 241, 68, -24, 83, 152, -176, -67, -171, -29, -192, -7, 95, -84, -43, 63, -45, -201, 45, -60, -68, -89, 26, -271, 17, 99, -215, -57, -8, -199, -10, -87, -158, -344, -476, 20, -53, -2, -20, -111, -17, 40, 65, 347, 27, 69, 55, 257, -44, 93, -32, 43, -143, 156, -197, -90, -270, 6, -12, 183, -65, -61, 118, -200, -40, 27, 23, 15, 11, -3, -190, 120, 248, -175, 159, 234, -49, -128, -17, -27, 311, -193, 57, 185, 91, -33, -98, 101, 124, -269, 83, -66, -47, -69, -128, -310, 82, 91, 83, 309, -180, -161, -246, -287, 211, -145, -242, -17, -93, 69, 12, 141, -3, -58, 125, 48, -233, -33, 210]
5930B10k7j28m7J52j78r8r0M7K53j08j3p7J35J54l22j86M47j37J02j09N6q2j7
5953f3J28q4J63l86K39j08R0K22k18J90j6j43r1K25l19M0KQ7K88l75J26Jj39K36
5977I5j24Q0n8l8J1j6N2Kj21L04k44Q5K06k10k73J18L66Ql20j19M9J70P5j97J64
6002F5L2k41j38L23Oj47J34k90K31J68p3j86j54O40m34p3n2J68J8Rj01RQ0j45
6026a51J79K7P4l28K64kL1l35M63k31P4l2k06L03m05K83k4M2J65j03k79J88Q1
6049G8N3l60K01J52jL7j75l5m9J42q7J70j13j03K17k5j84J9P7J27l61K08k62K39
6073c5J23n2j3O2j11R0J47l11M2K33j16K8p0j80K08O7l1K0j51J26j86L66j59k9
6097F8P9J13l35j0L62m30K03n3j22J26m0M0O6j47J66m0k92K12j01J91L4m2O8J8
$$ y = [210, 183, 55, 8, 160, -18, -116, -206, -159, 94, -14, -27, -104, 31, 185, -137, -323, 124, -13, 89, -20, 36, -46, -63, 65, -19, 144, -242, -3, -111, -21, 201, -17, 173, 157, 14, -77, 148, -171, -131, -129, -42, 246, -129, -3, -2, -141, 95, -29, 51, -7, -45, -34, -50, 2, 4, -117, 187, -57, 28, 234, 24, -249, -131, 235, 243, -77, -196, -147, 23, 98, -99, 65, 97, -144, -282, 41, 47, -100, 34, -256, -25, 143, 70, -116, -270, 370, -64, -137, -189, -21, -3, 6, -95, -86, -6, -151, 28, 55, 129, -199, 65, 63, 94, -241, 222, -9, 65, 33, -173, 130, -275, 8, -16, 26, 191, 88, -191, -3, 78, 131, -229, -28, 124, 123, 160, -15, -50, -99, 43, -44, 126, 13, -90, 127, 102, -82, -63, 14, 141, -220, -12, -274, -35, 88, 36, 23, 85, -26, 64, 211, -100, -58, 175, 59, 87, 17, -163, 45, 112, 81, 101, -50, 76, -110, 256, 97, 68, 147, 260, -75, -85, 277, -153, 50, -3, -125, 1, -39, 1, 67, -80, 86, 46, -246, -34, -135, 56, 90, 48, 116, 134]
6121A34k35k3O0j48j2K56j90M7J9K5J71l1k66J87jn2L26l20K77l45J16J02j6k8
6145E3l61K88L0m1rK51j55m9J51k3j98j39K68j44L4J30m62L39Mj17K13n1J61j99
6169b6jJ20r9O9k88K56K9k22L50j61Ok10m8L01j65K13ql50M60o1m12J82n5K38
6193A18j22J32k24LL4J73k24l0r9K21j04J34K1k70K36K49l99n3M36k72m0J72k44
6216a52K91j93J51l2j18O8q6K6k11K95p0J51p6m6l5Q0j74L9L47j11l6k46L3L6
6240f9j24j2K92k46K78M7j19K2K3l02J31Q1K55o56L75j44J28o4RJ59p8j33K09
6263F2K1k21K61j35n0K03R5k44J54r0k40J08M7j15K2jM32k15jJ73k60J20p3m7
6287Fq0j19K50M2n8j50K13j07K7J70j11j06M1l7m3J94l98M64m42K14n7lj5k3P8
$$ y = [134, -101, -124, -64, -212, -224, 32, -158, -111, -92, -67, 104, 73, -193, -6, -7, -59, 267, -53, 224, -121, -5, 97, 81, 53, -308, -20, 10, -31, -40, 211, 56, 7, 158, 135, -63, -202, 66, -78, -44, 86, -376, -37, -33, -150, 63, 12, 173, -26, -27, 93, -6, 63, -225, 31, 60, -162, 188, 27, 33, -177, -225, 76, -89, 124, 116, -234, 226, 165, -247, -65, -120, 118, -4, 128, -96, -93, -59, 114, -110, -140, -239, -18, -122, 12, 33, -237, -1, 248, -151, -204, 232, -40, -80, 92, -152, 139, -54, 97, 65, -53, 15, -71, -45, -256, 39, -31, 120, 44, -2, -37, 43, -131, -92, 255, 144, 108, -138, -105, -69, -193, -205, 87, -159, 119, 166, 47, 69, 92, -210, -79, 2, 257, -399, -24, -168, -40, -104, -95, 64, -14, -147, 62, 83, -138, 123, -12, -62, 141, 236, -8, 146, 56, -184, -76, -29, -144, -122, -123, 309, 94, 93, 266, 6, 126, 53, 6, -74, -193, 57, 99, 41, -109, 104, -3, 24, 194, 83, -23, 18, -19, -62, 132, -266, 198, -244, -30, -87, -90, -105, -128, -50]
6312e0r4M61m39K59k52jK08j65n6P4J57j06J90Rk60K97l72K77j57q6N04l66m1
6335ip5K7J51j41J81k44J15J54j78k2o1J27j34r2J0Q6n0L46j13k38J64j52ML8
6359a06j06K59J03j89n2r5K45j47R5Q8j6L4J5j96K54n9m3m2J48j47j96j5J67J74
6383A73m62K59k67N38l01R9j41J56r1J88k43K57k01K1j24J87r1Q3K1L2M8M3k04
6406b0j23J23j40J44k1k7p3L35m3J95l87j6j9P7k13K30M3j12m1L04n8k14L10k49
6430Ek51K12m5Q9k04L60o1k63M3J15j32K67j85q4K0J20J25l96M76Q0m58J69R5
6453I7j27J57k34p6K87l69L6L18j94J33P1j39J88j19j56J51J38k19J51k10J89
6474G3j03J34O2m32L38n8j6k71L28k26K67L4j86Rl7K21p3q6JJ31l03J35Q2m6J33
$$ y = [-50, -144, 317, -122, 137, -115, -116, 92, -73, -129, -55, 102, -4, 186, 195, -65, 232, -140, 137, -20, -106, 398, 32, -9, -84, -57, 94, -47, 134, -110, 5, 159, -19, -41, -102, 25, -109, -201, -191, -105, -155, 191, 78, -160, 4, -148, -144, -106, -212, 47, 150, -39, -91, -186, 59, -88, 7, 95, 79, 113, 128, -68, 186, 127, 84, 42, 190, 43, -153, -168, -1, 173, -289, -30, -297, 241, -60, 39, -102, 54, -37, 151, -92, 165, -36, -15, -139, 48, -43, 40, 61, 93, 141, 184, -20, -143, -20, -160, -16, -37, -64, -137, 198, 155, 350, -37, -53, -72, 5, -208, 22, 65, -47, -88, 216, 158, -56, 254, 5, -246, -34, -79, 10, -194, 166, 105, -158, -115, 0, -132, 135, -50, -134, -114, 6, 131, -265, 211, 291, -167, 2, 97, -30, 127, -107, -183, 104, -265, -229, 89, -105, 28, 99, -40, 148, 29, -127, 24, 162, -57, 94, -116, 73, -30, 104, 166, -266, 72, 14, -2, -273, 55, -171, 96, 130, -56, -47, -84, 137, 64, -22, -21, 110, -193, -58, 24, -22, 111]
6499A11L9j75N0k06K75K4j98J86j37j43K2K58j85p9J77k13k3L30o6k82K37o9K81
6522B14k58j30P2L53n0l18K24q2J28k15P5k48K42q6l4J13M1j44K01j04j8K50k96
6545g0J49j01q5J24n3J91m59J96J32J28q1L5k16J24j37K4J32L6k02J53j42M3J83
6568A04j63J19j23N7j97Q4J0j86K35O7J26k80M5Q4J12J27m00L39k23o9K62r0j3
6591B7k31L36q5j07p7K15j87J15P8L5k43J45R3j11q5J55O7j81j07p7L44l59K98
6614E8k48L06k07J97p8j42K86k76J37K75l48l0J81l2j61lo2L26j03j91K80M9j70
6637D4m8O4P7k50J4J71J6Q6L1j54k4n4j18K95p2p8q3K11R2j01O8k89J27p2J71
6662A24l5L9j01J49l97K99j19J69k17O6K47m79M70q9j8j28K19k58l3k9J71J57
$$ y = [111, 150, -25, 25, -181, 94, 118, -80, 106, -31, -174, -152, 106, -79, -158, 19, -194, -217, 113, 47, -235, 2, -67, 214, -44, -174, -102, 251, 201, -117, 107, 25, 153, -62, 13, -235, 7, -79, -113, 0, 41, -103, 98, -6, -24, 226, -70, 79, -22, -107, 17, -36, 155, -304, -108, 24, 152, 71, 106, -110, 14, -123, -99, 33, 69, -133, 20, -122, -79, 104, -59, 60, -63, -6, -203, -119, -109, -295, -60, 7, 133, -147, -102, -18, 94, 221, -179, 160, -63, -132, 130, 40, 27, -204, 132, 47, -60, -137, 78, -109, 6, 84, 119, -124, 21, 114, 3, -82, 73, 140, -41, -148, -225, 119, -240, 58, -190, 116, -91, 106, 28, -114, 172, -104, 33, 308, -40, -70, 111, 79, -82, -85, -147, 179, 76, -115, 165, 214, 44, -4, 60, 137, -113, -99, 72, 88, 174, 205, 51, 27, -27, -145, 150, 78, 0, -83, 128, 220, 119, 187, -102, 25, -47, 124, 89, 128, 27, 176, -221, 78, -41, 128, -89, -23, 224, -255, 215, 126, 108, -20, 199, -59, -92, -121, 50, 207]
6684B07k41J34Pn6LNJ3k25J70j53K11j02P4k19L91k71Jm5o8j5J74o9J63o0LJ40
6710A72l16J31J64n7Oj92JJ0J59j47K14k74MK98m5q3L5L39l53Q2l43J96j7o8J82
6735I8p6O8j46j90L52k83K69P8j24k2R9J31j08l18J94R2Q3j30m44N19o1Rl31L77
6759A36j81j50L26j88J24O5k58J95j16J96j27R9P0k99j00K75n1J34l47J36n9K87
6781A67R9k56m7J72j59m8R2j25J55j11L12l49K16j21J40j38j3nJ62k08j2L0k38
6804b85L52k8q1J2j3K22l39K00k66K56k88J83O9K31n3j60K56m93K79J16k48n0
6826a28q6K57j12J78n8O7k11N9k55K52q5J62o6k40J85J46o1J4M4j82J19J00j35
6849c6j84L45k21J61k53J15k2M6j7n6O0K71j28n6J75o4oM7j59O5o1J25l9k9P5
$$ y = [207, -34, 100, 107, 51, 54, 59, 72, -153, 17, -136, 75, -27, 47, -172, 219, -52, -51, -96, -164, -179, -5, -74, 89, 29, 32, 172, -144, -13, 151, 94, 100, -92, -91, -81, 78, -69, 145, -129, -125, 173, 128, 45, 80, 419, 66, 148, -195, 1, -16, -84, 98, 22, 90, -56, -246, 106, -177, 92, 170, 46, 24, 123, 254, 146, -172, 22, 114, 197, 67, -377, 142, 81, 90, -241, 136, -45, -195, 131, -57, 67, 132, -126, 69, -47, 149, 22, 121, 191, -108, -208, 67, 16, 150, -197, -61, -120, 167, 266, 10, -37, 135, -24, -72, 20, -105, 50, -61, 251, -98, 118, -3, 137, -1, -14, -19, 143, -65, -77, -47, -285, 67, 39, -42, -30, -43, 179, -160, 40, -226, 30, -258, -75, -6, 225, 172, 12, 268, -225, 54, 170, -78, -128, -214, 43, -69, 109, 51, 118, -93, -34, -289, -37, -122, 40, -26, -266, -81, 65, 4, 18, 62, -120, -1, 99, -36, -220, 125, -96, 65, -188, -73, -95, -49, -66, -122, -62, 209, 81, 25, 200, 136, 130, 177, 18, 83, 22, 147, 108, 79, 154]
6874A54j9j95J56j40P5r7K45l81L08j28ML57l23K90n51L16j90J69r8J54j03M4
6896D7j10r1O1K37l44P5k83K05J86j38J99J83k97J17j39lK84j96j13K79N3k80
6918f8J35j91J43L5l4Q5j1Kp4j6m4J81k8J9k44k61J88j6Q5J51j43M60l45j74R7
6943f8N5%N2j34j9j44L78k04n1K39L5p5l6m2K60n2k46K22j59J35j07r8K94k69
6967c4J20j0p4l34J67P5k40J18n2L48j37Kj10K19n9q9K85m04L67Nq4M9j49P5n9
6992ek44M59k23l8N1R2j94N9J65j69J23j13K12k81K69K0j9j31N2J2J0L6j20k08
7016a85J96J05k9k34J49Q5J01j46j98K24j78l8Q4j13L22k76nl3K09J47k81L03
7038B09k01k04q0K81J0P9j56P5O4n9L5L9n7J10m98M33j03LQ3j07J12k08J31O9
$$ y = [154, 135, -60, 96, -44, 31, -66, 179, -202, 106, -22, -18, 339, 16, 306, -245, 71, -119, 50, -48, 106, 3, 47, -63, -154, -93, 144, -200, -125, -408, -203, -17, -155, 44, 227, -70, 47, -92, -95, 189, -7, -120, 159, 212, -68, 67, -124, 19, 54, 20, 105, 94, 96, 22, 6, -38, 143, 115, 134, -110, -371, -183, -199, -114, 37, -106, 354, 9, -165, -68, -13, -13, 39, -95, -114, -258, 120, -84, -135, 104, 139, 64, 28, -14, 246, 194, -52, 170, 11, 146, 39, -59, 235, -34, 86, 76, 2, -332, -165, -90, -330, -212, -264, 84, -53, -51, -161, 58, -1, -90, 195, -209, 158, 163, 79, 128, -21, 54, -5, -249, 210, -13, -51, 0, 92, -102, -43, 122, -47, 76, -37, 175, -106, 163, 183, 164, 33, 85, 97, 107, 143, 23, -185, 11, 116, 87, -147, 2, 87, 188, 42, -156, 68, -110, -148, -64, -177, 145, -131, -136, -169, 40, 187, -94, 209, 8, -196, -276, 5, 15, 94, -62, 13, 77, 18, 53, 92, 35, 145, -353, 80, -23, -20, 63, -44, 68, -140, -9, 60]
7062F0Jk25p5L10l85l5M62k29J39o7j38K31Q5k99L62m34j15M14J8P0n3k23O1K4
7086d1J89k30J8L45j13k53J00nJ35p8p4o0j01j46J68LJ05q1j4N25l81Q6R0l07
7110a20J98j17l5O7P6j67L9P7n0L47m2k50n2J92j53Mk52J12J9p0L96j86J50l27
7134a44J34J54k67Q2k3Q8k6K8O0l44L40J3Rn5j01J16R7k04P6L4m8j41K72k71J41
7159B0J33j63q4jj2J27p8r0Q1L36k44j12P5k1L9Q6n3k24J91l4J30k19J19L5j82
7184a45N0R2LJ03l8p2o4k3p0K75j44J16k34n6K00J96k53NL10k35K69k48n0M31
7208D18l92J2q8n7qJ28J0l8j43K54p0j8K15j91p4R8l0jK88o54J57J73p2M5m1J53
7234G4j15K31k60j03M51l50k0J57j34N3l45J89M7J21j79J22o0Nl1J03r1L0K38
$$ y = [60, 61, -164, -239, 71, -314, -349, 113, -116, 23, -44, -182, 49, 134, -165, 197, -237, -352, 62, 80, 150, 97, -126, -65, -41, 148, -82, -64, 281, 168, -85, 15, 10, 145, 67, -7, -67, -168, -314, -146, -143, -38, -119, -133, 392, 11, 97, 187, -120, 78, -39, -74, -7, 69, -98, -59, 18, -32, 315, 273, 23, -29, 163, 10, 14, -238, -126, -107, -177, 219, 33, 183, -144, -10, 144, -123, -41, -64, 24, -2, 26, 86, -258, 82, 95, 104, 49, -52, 64, 161, -43, 33, 67, 19, -122, 150, -121, 20, 153, -10, -94, -95, -107, 20, -58, -148, -67, 269, 25, -87, -12, -33, 6, 92, 39, -185, 6, -28, 102, -117, 2, 37, -145, -95, -3, 0, 103, 65, -7, -71, -94, -164, 111, -33, 83, -151, -207, -7, 189, -64, -59, 251, 16, 285, 37, -13, 418, 26, 38, -50, -107, -115, 13, 23, -15, -158, 96, 26, 8, 223, 32, -42, 56, 26, 25, 313, -341, -184, -11, -83, -38, -79, 74, -41, 190, -70, -173, 278, -72, -92, 65, -69, -16, -361, -172, -125, -4, -183, -61, -121, -116, -147, -44, -135, -105, 133]
7257A33j61J1J19j67K42j75j28K50l01J44J73k3n8L7J04j21k45K22j9O6k81o5
7279b43M57k47j22J85k88K84L1k60J16J79m02M09k14J86m6J49k0l67J61l6R5l5
7301b8r3J00K0MP4R4k39K03l10J58L8j33J82q2J95k81J6NQ1j5k05P3J74r1P4r7
7327h3K48r6j96J41J13J7k82K26j1o6N9k65J55K03n19K51J40O0Q7P2j56J0p7L9
7351G0j44l4J70n2j43K27J20q7k17L01r6j20p9L1j01K17L3k03K15l9r3j00J07
7374a7j5K93m30K12J54k32J90k61J97m3M5l22K11j23J11l1l6J68k95L35kj10J5
7397A4m1K1l06L17J0om2q6J63k27Q0Q3J68j91l8J6P3n1L2P9Qj42n3l3J27P7r0
7424c8j7n8q6K69N3N7j65J52r2l3J98j82P7ql03N05k99j81J48P2mj33QJ72N8n7
$$ y = [133, -28, -17, 102, -65, 177, 2, -126, 124, -177, -33, 140, 117, 59, 96, 200, 79, -166, 56, 37, 103, -178, -243, 214, -33, -155, 30, -258, 26, 57, -203, -87, 92, -310, 99, -115, 71, 25, 174, 154, -213, -52, -88, 7, -28, -121, -21, -1, 3, 77, 171, -68, 135, -175, -17, 21, -112, 70, -12, 183, -98, -82, -77, 4, -11, -216, -143, 31, -60, 14, -83, 165, 69, -127, 14, 127, 144, -138, 88, 77, 11, 70, -195, -40, 163, -356, -105, 35, 95, 182, 254, 98, 108, 31, 70, -74, -108, 62, 10, -133, 94, 214, 127, -90, 211, 115, -5, -84, -53, -154, 63, 96, -107, 108, 69, -24, -124, -17, -32, 261, -169, 43, 197, -35, 155, -106, 91, 48, 93, -229, -18, -141, -30, -61, -97, 71, -224, 111, 109, -1, 14, -27, -6, -312, 5, 15, 9, -33, -119, 44, -183, -103, -20, 148, -43, -81, -65, 8, -43, -11, 68, 76, -66, -119, -152, -25, 52, -38, -55, -113, -199, 70, 123, 180, 15, 167, 75, 42, 240, 58, 135, 127, -176, 329, 30, -151, -3, 69, 65, -68, -60, 112, 170, 113]
7450A13k98L62q2j03J36j61M8J60K7j80J47K8j48P2J8r7L46p77L26L23l29J75
7472A06l9k00L75N8m56M2J9K87k02P3j2o1J48j08n5j50K73l00M25R1l85J11l31
7495b91K55L7O4K94n75J60o8Q3J48j72J98j70K57l16j5j77L27J12l23K32L4k07
7517a13l10M23O7j24R5J07l08K20J23k45O8j11J57k6n8nj95L78j04R0j33k54L73
7540A15J39k82O7J60k06j91K97j40m6K54k91J48k33J3K59K1j88L28k72k45M26
7561A33j51L0M6j05K82l47K44p0J7l0k45K3J71P6k07J25rL4J29J17k77l3n4o9
7585a70K56M6j56j14J09n4M3J82j13J4j69p6M08j76j53RJ34j20K64k31O2j04q7
7608a96R7L65m12L59l86K17K08k49J9j86j7O9L27l36J51J93j61j27J36m37L03
$$ y = [113, -185, 177, 95, -8, 128, -33, 15, 175, 202, 22, 169, 197, 49, 121, 139, 42, 388, -389, -63, 260, -69, 106, 67, -133, 242, 300, -156, -114, -95, 192, -10, 63, 51, -10, 138, 30, -25, -175, 98, -202, 223, 314, -71, 40, -291, -36, 1, 65, 359, -216, -56, -124, -41, 107, -65, 133, -37, 220, -96, -111, -288, 39, 151, -172, 60, 94, -113, -423, 0, 67, -57, 38, 145, -163, 57, 180, -65, 3, -108, 49, 23, -35, -40, -235, 143, 39, 129, -4, -258, 115, 254, -28, 39, 199, -7, -198, 99, -41, -87, 167, -124, 24, -209, -196, 63, 84, -104, 224, -48, -293, 133, -18, 12, 58, -47, 235, -112, 132, 62, 79, 49, -196, -173, -2, 74, -133, -8, -17, 17, 146, 263, -14, -47, -101, -170, 86, 132, -24, -138, -29, -83, -40, 142, 29, 43, -126, -202, 206, 30, -123, -114, 20, -100, 164, -67, -5, -109, -196, -99, 266, -146, 213, -173, 44, 252, 3, 22, -164, -181, -112, 215, -121, 30, 223, 62, -65, 71, -366, -63]
7629f3P1j19n7M25l22K27k72L37l98J77K6L8j73k0j77M84j76j62L72k57J09l25
7651b55K53J66p8R6j08k20J38Q5J04m1N8j20k13L32m01K05j22P3q4K0P0j68R5
7674a15J91po4j70M99l93LJ86l21K85J26l21P2j5j81M18j43m8j16Q9n4j00J36
7697d3r6K64j6k24K57k33M7M9k34L24j19J56j73J69j35J11p5l24M06j93k47K68
7719f1j50K12k3Q3J43j70Q8j15l0K5J06l11l1K64j38M77l00M1k8j82r9m0O9P5
7743i5P2p0NqK44j51J95l82K43Q1l41J30P8k14J27J70r2j12n3J46K77j03qj77
7767c8L18l92m4J91m4k26L72L51m35O3l86L46r0k4m6q3K35j36j74L29k17m0K19
7790D9J03K17k69O2j03j55j43K59j16R9p8OJ9R6J52k49K29k03j08L8J2J29j07
$$ y = [-63, 8, -111, -168, 257, -65, 162, -110, 227, -171, 6, 32, 70, -103, -123, -300, 184, 8, -154, 218, -39, 70, -255, -2, 164, 86, 182, 74, -146, -8, 77, 181, 140, 198, 78, -135, 197, -204, 1, -121, -48, -132, -112, -42, -210, -115, 76, 69, 5, -165, 334, -59, -56, 130, -191, 94, 220, -101, -29, -44, -225, 193, 50, 2, -114, -25, -79, -179, -43, -139, 125, 109, -115, 142, -91, -44, 5, -229, 95, -24, 132, -41, 128, -7, 104, 29, -295, 111, -82, -329, -61, -211, 1, -22, 61, 204, 34, 122, 7, -23, 2, 108, -203, -234, 30, -108, 369, 69, 110, 82, -100, -199, -239, -170, -95, -23, -93, -88, -96, 148, -3, 192, -190, 53, 134, -207, -77, 1, -213, -86, 84, -8, -120, -173, -27, 250, 147, 139, -38, 280, -112, -156, 35, -9, -235, 137, 488, 53, 116, -270, 76, -14, -38, -84, -167, 68, -68, -242, 87, -130, -170, 49, 152, 369, 100, 162, 59, -96, -239, 20, -96, 3, -75, -69, -50, 46, 198, -51, 178, -25, -133, -95, -83, 46, -61]
7813f1q3J12j08Q6j15j11L40j96K55k10o0J16j8K04j53j63J33j4J53k98j1p2L45
7836G1j11Q5o1p6q1K91J26l61O4J07j22J09k4j35K48j20J00k11K77j96j40K85
7858A25P6j05m84O33j99l9p6J11N1j24J98k26N5j17J02P3J3j45K25j89o2J28o
7881A8J34k02P3j25P4p9J47J8k34P2K62k98L35j27J44m5j61p9j09J87r8L0J55
7904I2Qj05M6p0J20j76Q7j50L03J96n43K15p3J00P1j80K22oj58l8j21J28L2j41
7928a41K01n9JO6j67J59m1k4j54L66l66o8K37k0LJ61l7l09K10j23L01J17k90j19
7952i6J24M9j9J24m9j04L6j3oj66K07J03r0Q8rk23O8o8J01k99J47m6K95Lj65j8
7978b6j87J60K82j91j75J31Q8j9l21J79J08O7k60J70N3l42K69p6J87j15K95k42
$$ y = [-61, -144, -32, -140, -54, -169, -280, 60, -136, 119, -91, -151, -35, -53, 151, -2, -165, -32, -46, 107, -191, -202, -274, 71, -40, 45, -16, -92, -173, 118, 244, -117, -53, 54, -68, 41, 17, -118, 130, 10, 110, -101, 176, -20, -160, 125, 201, 96, -388, 245, 46, 7, -69, 42, 93, -31, 167, -59, -4, -121, -19, 54, 67, -78, 147, -42, -104, 24, 18, 152, -50, 23, -102, -28, -107, 40, 58, -176, -104, 158, -140, 195, 68, 212, 167, 6, -73, -182, 5, -93, -63, 92, 100, -5, 41, -29, 91, -85, 2, -148, 155, 351, -192, 23, -50, 50, 121, -59, 163, 157, -1, -39, -160, -32, 0, -141, 60, 1, 2, 68, -99, 60, 19, -5, -159, 207, -159, -227, 10, -10, -7, 154, 117, -192, 18, -105, 196, 313, 23, -96, 28, 77, 58, 182, 133, 29, 65, 52, 46, -120, 87, 190, 100, 188, 179, -44, 24, -44, 57, -242, -95, -141, 154, 157, -8, -26, -213, -53, 229, 38, -137, -6, 82, 63, -258, -79, 29, 96, -164, 6, 59, -283, -14, -90, 97, -18, 277, 35]
8000C5r1N4K93l36l2O3J47Lk14J09k46J88O2Q4m90M71j04n0J83k53K82n1l75J59
8024a09K04rK44j91l45L1R5J37J6j01J54l81L09p1k9j5K0j08K89P9N0k79L2Jq5
8049f2O8j60qJ11m0j22J78j15J78q9k33L12r4J73k56l2J88J16j52R4j84K37l87
8072b79M17k34J34P8k08J94M9j83K34m07Q5J26j12J96q7P3j33R0m1K8p8N6r9J78
8096G7r2j84K86l27K05q0K54k62M43l44K06k1j95K20k50N5qK08k88J08M9n0k5
8119a5j03K21N8l9m6N5j81K98m34R2K43j11oJ89j87r2L9J88l71J29L7M1J38l66
8143b23K64O2j39K27l12K53j93j13L13j56j96J14O5J05k37K14ML8j17p8P5J39
8165A09o3j11K32l04J89J43J0k5j46j93K5O2j30M3O0r2K80n55L49J61q5MM4JK2
$$ y = [35, -56, -2, 291, -45, -77, -14, 133, 136, -78, 31, -215, -27, 35, 119, -371, 100, -4, -54, 129, -124, 158, 107, -268, -109, 95, 86, 330, 139, -206, -175, -80, 57, 73, -28, 126, -255, 54, -17, -46, -61, -41, -149, 140, 219, 269, -10, 22, 23, -62, 6, -154, -162, -51, -91, -213, -35, -150, 28, -61, -294, 18, -76, 97, -159, -191, -3, 113, -39, 55, -129, 108, -279, 138, -96, 38, 116, -92, 102, 151, -32, 202, -205, -120, 6, -106, 90, 3, 76, -57, 33, -8, 20, -58, -2, -101, 77, -15, -199, 87, -240, -35, -115, 139, -123, 320, -24, 182, 161, -34, 186, -64, -9, -17, 191, -97, 11, 60, 10, -15, -118, 103, 161, 122, 76, 131, -50, 248, -186, -94, 149, 38, 32, 221, 34, -58, -19, 169, -202, -73, -36, 5, 143, -223, 41, 103, -36, 191, -121, 132, -61, -174, 139, -17, -213, -99, -34, 71, -166, 48, 52, 90, -27, -105, -30, 109, 46, -65, 167, -137, 52, 195, 205, 180, 34, -159, -134, -72, -202, -159, -99, -191, 89, -466, -117, 44, -41, -37, 7, 8, 30]
8190C0j87
$$ y = [30, -157]
8191a57
$$ Imaginary data points
##PAGE= N=2
##DATA TABLE= (X++(I..I)), XYDATA
0@%%%%%%%%%%%%%%%%Kj0J6j6J6j6J6k4L2l2L9m7N0n8O8p6Q7j00J11j24J40j56
38h2J75j96K16k40K70l00L30l63L99m41M87n35N89o49P15p90Q75r70J077j200
58f33J343j514J722j978K303k732L328m207N635q343J5167o2466j12495J79556
72A4686J10350j14813q9529O7120N1555j4897j1038j6863l7808L4640P4139k4056
84D3486j04671K462J05440K3806r8006m4286P0620N2361l4019m2772O65J6469
96h445J9202R892l0145l4841L5042N3814l1061n3639K5542M3336k2959j7171K5509
109A4076q160k9828L4555L7181n3879m7614N8498N2561n3446m8265M4578L3703
121C3960l8964j4401L0475j3070k9272M0412L5126o1195m3342O8765M8294o6600
$$ y = [0, 0, 0, 0, 0, 0, 0, 0, 0, 0, 0, 0, 0, 0, 0, 0, 0, 2, -8, 8, -8, 8, -8, 8, -16, 16, -16, 23, -24, 26, -32, 36, -40, 47, -53, 58, -66, 74, -82, 93, -103, 113, -127, 143, -157, 173, -190, 209, -232, 255, -280, 309, -340, 375, -415, 460, -510, 567, -633, 710, -804, 918, -1060, 1243, -1489, 1839, -2368, 3267, -5076, 10091, -52375, -164870, 14686, 125036, 10223, -79306, -12186, 39369, 24472, 13434, -3429, -41237, -6597, 67542, 43486, -61185, -58723, 46717, 70523, -27483, -71769, -1149, 51212, 17193, -25579, -24914, -8445, 10757, 20649, -9496, -44337, -9295, 44519, 13458, -40181, -14639, 28697, 5738, -11433, 14076, 5916, -23912, 10643, 47824, -6055, -53669, 4829, 57390, 3944, -44321, 257, 33960, -5004, -19405, 11070, -2000, -31272, 9140, 44266, -16929, -60271, 8494, 56788, -9812]
133i812m9283N7317M7955l7711l5838K0542J8177o993K745J168j9778J604L3586
146B3679l49m3215o449M3496J0033l7913r875L0035N897k2372j712R716p597l1
160f657J6965j0169k1516J9527K3069k7812j9029L5020J6449l6013j0141L6660
172A6353L440l4755L03K9565k994k0653P897J2532j1952n130J6290m695k3099
185a6898J0158K7462j3963l3938J3808L4896j1850l3611R678K9028m909j8860
197h999K188P387k170M550M467j4150n942K2884J0434k4559j3458K3715J4452
210B0799k0297j3189J5420P411j0584j736M378o944j695J3750o46j9475K072K0873
224A0137m231j9575N210J5908n953j0197Q547N869r434j301J1415q21j1404L296
$$ y = [-9812, -59095, -1778, 46177, 8466, -27372, -6830, 11347, 4354, 7099, 8267, -11511, -9907, 23679, 23330, -19885, -26334, 17162, 27195, -10718, -20593, 9442, 15339, -7033, -8745, 971, -6626, -6657, 10308, 139, -21377, -1850, 21219, -6593, -25622, 9398, 25847, -10166, -20307, 16353, 19793, -14962, -14659, 14906, 11912, -8741, -844, 11688, -264, -5394, 10896, 6201, -16898, -6740, 20722, 6759, -27179, -13371, 21525, 9675, -23936, -14258, 14770, 9861, -8999, -6811, 576, -1594, 2956, 7423, -6727, -12669, 10215, 20649, -3910, -17368, 6347, 20799, 502, -12687, 2733, 10144, -440, -2176, 2202, -4742, -6437, 7313, 6667, -12808, -10736, 10137, 5906, -13669, -8459, 7449, 1496, -8701, -154, 5715, -3719, -5020, 6395, 5574, -5830, -2534]
238b534J1555k784j0188L592P625m977m956O507Q31r474R55J1213m319j4522N678
253e798J4767o312j3600O018J0251n136n640L725K77k264N063L019q750k013J2404
268F011M106j2331m531J2306N817j1381n381P771L074n246j771K719k013m43N486
283D193j854r250K466J0242l950j1622L478J0091k356p802K754N760j572j568
297i90K420p17j619L117J969m147k952N738L812o143l855O565K995o296k764N436
313B569L51n744N11L750l006k987M047Q08l979K95M335j320l804K758L369k270
329c17j947K727K262k156j366L031J189k675o25K687j75k523J89K429j897k104
345a271K297L18l505J43L343j963l834J897L499k304k751K258K588j054r10O51
$$ y = [-2534, 9021, 6237, -3951, -359, 7266, 2289, -2667, 3840, 4671, -4803, -3848, 7365, 3046, -11476, -5798, 8969, 2657, -10943, -4925, 5326, 190, -5450, -1725, -1448, -3712, 1351, 4370, -4380, -6393, 6011, 10117, -2214, -6745, 5561, 11378, -3, -5384, 2387, 5461, 215, -1556, 1163, -850, -1293, 4193, 2339, -6911, -4445, 5797, 1847, -9775, -6297, 3794, 1438, -6364, -3610, 2150, 578, -990, 1430, 713, -906, 2211, 4180, 33, -2919, 2819, 6631, 488, -3367, 3198, 6193, -103, -2867, 2569, 2920, -2824, -2313, 1437, -1569, -4556, -509, 299, -3680, -3385, 950, -370, -4174, -1416, 1953, -317, -2264, 463, 2725, 569, -797, 2234, 3423, 748, 123, 2810, 2635, 112, 301, 2730, 833, -1271, 1026, 1344, -2161, -2018, 1325, -638, -4472, -2575, 924, -1380, -4131, -1873, 715, -339, -1249, -598]
361e98N87K61J153l36j660j86L406J234l318j283L215K063k963k361J325P48j017
378B70l65j033j100J169K238k103k230R53K310M40k326p38Q16J961Kj588k12J400
396a36K189M82p49j728L99K732l16k619r40K177L68o63m09k084o77L267J782m996
414a921l357M498L655l712m086J013L879J669j811k601M09L495J552j428l105
429a851k9L392L814k144o151K52O967K566o848m990M690N656j918o199j753L166
445a380L543q24l544j965K236L932L64n215l827L727O596j42o926k550P383O236
461G644n535p570L575P638n95m454p05m81M05L205R78o592l059P903N642o893
477A106r181K515R106J154q168m903N993P677l302o972M6M226K416K325j661p031
$$ y = [-598, -11, 250, 1403, 1067, -593, -779, 2627, 3861, 543, -740, 2475, 4538, 1575, -786, 539, 1287, 270, -95, -1128, -2228, -1059, 1179, -924, -3154, -2201, 109, 549, -1777, -2515, -1699, 262, 264, -1324, -1536, -136, 2053, 2535, 1786, 58, 457, 3189, 2873, 254, -686, 1491, 1859, 1196, 787, -1297, -1974, 1293, 3075, -1921, -5278, -780, 2875, -837, -4923, -3910, -31, 1638, -173, -2774, -2365, 1130, 2682, 1254, -1851, -1880, 1512, 5326, 3182, -2969, -2717, 4250, 6816, -32, -5022, -332, 5324, 3406, -2793, -4546, -1380, 2163, 1339, -2205, -4170, -1934, 1998, 2362, -2853, -6680, -2953, 3643, 3501, -3425, -5975, 1408, 7644, 2109, -5461, -1886, 5752, 5157, 703, -2, -483, -78, 3127, 4105, -2487, -5546, 2357, 7999, 1106, -8075, -5560, 3546, 4700, -3468, -8371, -2378, 5299, 1997, -4975, -4929, -703, 1713, 4038, 2377, -4654]
493d654l94J1403L191j3294o584J2380J0842o701j2081k07J0037N200q054r561
507h477L976R464M65o939l727J97L115O529q91j1294k854J4843P479j4960j1901
522a4975J1833J4166n172j2215J329R558L121n565m936L41L356L897P81m831n729
537e041K041R934n0j3932l737J4703P420j2933r901P868Q417l764m923J77K191
552a530K865L121l118o977M17P911M242m415p275R82J0343L602j2407q597J1527
567F91J1262q005j0527L569O220j246k983r01k065J557O580J156q898n404O870
582b124Q487m279r874R81J2236L363j1579n391Q731O507n875l473M082K90k038
597D4K810k87o576J58Q407J583p939k979N606L341m396m772J163M277J779k910
$$ y = [-4654, -5048, 6355, 9546, -3748, -10332, 2048, 12890, 6189, -5892, -6099, 3938, 9138, 1084, -8477, -4501, 4963, 5428, -1511, -5238, -5041, -1926, 4603, 3712, -7582, -10436, 4407, 11886, -3074, -14975, -3142, 11024, 5852, -6363, -5034, 4524, 7645, 2080, -2856, -2515, 841, 4738, 5519, 688, -5041, -3000, 6934, 6884, -7048, -10785, 3918, 11338, -1595, -11496, -3628, 4789, 1025, -3898, -3721, -1530, 1335, 4456, 1338, -5639, -5222, 2689, 6931, 2516, -4759, -3777, 6566, 10168, -2239, -10836, 691, 11953, 3948, -6579, -3010, 3210, 1964, -1019, -1920, -3985, -2428, 4152, 5308, -3590, -8994, -2124, 6363, 2084, -7790, -6809, 5427, 8790, -2789, -8180, 551, 7058, 1183, -2290, 1792, 2082, 44, 2854, 2567, -4009, -3851, 4556, 6139, -1800, -4779, 827, 4168, -228, -5000, -3837, 440, 2219, -691]
613f91k796J988K202j342j062K129k28j247K447K827m364m257M517N049k844m301
629a973J819L850n76l337k008J041K142L44j241r19m49l56J908O58m082j461N972
646A332L173o181m219N470L628l599j763K660J072k49R24j272k609J824K952j410
662A733k757J164J997n38j279j417j34J651J115k444j473J756Q17j611j112J165
678a367Q01P6Q19k67o23M08M87r0m1j03K04J090J213j374j861J543J050o39j466
697a40M21N30n71m03r2j018o42K275M77k228q86K356L82k259m84J175J056K15
715A64Pr67K99K121Kj554o35K107R00k033l67K35P56K78p39j002N46J257p01j831
735a157q8Q22k65m60J58o36N56J190j040q20J287J302q73o74O50O15L8l4j59j37
$$ y = [-691, -3487, -1499, 703, -639, -1701, 428, 200, -1047, 1400, 4227, -137, -4394, 123, 5172, 2328, -1973, -154, 3696, 3120, -217, -2225, -1184, 958, 1302, 61, -858, -1307, -1663, 245, 903, -3179, -4640, 1332, 4505, -1676, -5895, -425, 3203, -396, -2159, 501, 1573, 1324, 2248, 976, -1633, 191, 3143, 1733, -1024, 140, 2137, 1599, 320, -1097, -1231, 420, 1535, -909, -2382, -626, 191, -1420, -2532, -1367, -566, -490, 329, 62, -561, -153, 334, 244, 203, 100, 304, 1394, 2607, 1233, -628, 915, 1965, 1326, -140, 281, 811, 240, -163, -255, -1273, -1915, 360, 837, -1391, -2277, 79, 461, -1798, -2282, -1107, -51, 164, 171, -796, -497, 1624, 1626, 72, -563, 1544, 2444, 411, 44, 279, 1035, 1313, 574, -428, 118, 1375, 674, -1157, -1245, -423, -688, -1148, -990, -1626, -1070, 120, -920, -1740, -453, 849, -24, -698, -48, 567, 605, 571, 412, 275]
755B75O96P80o55j063J198K27p57j018M61pk18n65Q6K22mj08o28J43O8l2j50J65
777h84J69q1M57J67L23K14L44j59K16J95k48p4J87L8l9rr8j71j56j79J21n96k87
800e50M2k85l31k64N48K32k85j81O68L30m43j82K25P81j44p0L46Q1M75L0q8k13
822G22M82K56o76l30k37L81l06n83j99J15K73m50j33j29k46K62K16l34m72R42
842d46N61p02j57R42N75j81k45M09j19j33M64ml04j93N20j48l33P1r5l88P4m10
864b42j7p39j89Q05j29p95k49J070N32o42k97O15M99m51K23K20k98K63P80L33
884A292j175l5J302L73j273q72Q52O74p39n67j78j5K12N51j133j053Q38J222r47
903f71j052K66P73K13N04r4j043R62J685m29j788K07J905L37j608j80O33M69l38
$$ y = [275, 971, 1751, 1096, 33, 1231, 1458, 701, -317, 144, 137, -81, -646, -560, -338, -342, -450, -1078, -935, -867, -899, -1049, -884, -715, -796, -339, -172, 151, 365, 709, 550, 766, 961, 713, 639, 826, 864, 825, 816, 718, 547, 391, 212, 333, -263, -550, -508, -793, -1124, -1388, -840, -608, -893, -1074, -406, -76, -519, -701, -476, 305, 161, 91, 437, 518, 993, 1023, 935, 722, 1204, 1460, 784, 454, 217, 598, 292, -291, -490, -375, -102, -552, -685, -814, -1060, -798, -582, -916, -1388, -446, 115, -587, -744, 198, 773, 592, 347, 756, 637, 504, 968, 964, 660, 467, 987, 839, 506, 577, 482, 94, 168, -242, -259, -998, -1187, -382, -511, -1306, -1555, -485, 47, -595, -892, -277, 222, -229, -6, 214, -84, 179, 959, 1292, 117, 82, 1384, 1757, 484, -388, 464, 1138, 399, -168, -346, -361, -149, 402, -731, -1784, -946, 276, -671, -1723, -1457, -684, -471, 33, -61, -1104, -142, 1543, 1114, -674, -467, 1438, 1775, 167, -13, 620, 1089, 751]
922G51k6j40o89j58J325l9k525j153K751J110k533j808K827J875k147j326J558
939c47M67j000J167O55j467q45K567J316k821j225K538K297j754k215L34J085
955G52P61j333j451M15J816k21j364k47L17j62j64P25m64j567J327J995j131k510
973b506Q69L463L79k836j060K742J605k402j745K082J231j636r4K112j503l167
989b466K916K945l861l610M240L363m050l747L450K265k419p81J750mp74J134
1005C51N11j973p39J583J976n04j456m03K328J188k728k021K310K224j575k253
1021a181P33J281n10r54n4J36N25j89J01J84j494j005J672K220k011k468L322
1038C08L569m014l540L778L274l723j348M027K25l811O67L185j895k981L124K663
$$ y = [751, 725, 585, -104, -262, 1063, 1024, -1501, -2654, 97, 1207, -1326, -3134, -307, 1568, -579, -1905, -347, 120, -880, 287, 942, -525, -1370, 1197, 2513, -308, -1533, 1005, 3302, 1548, -667, -333, 752, 1513, 180, -1271, -856, 960, 739, -625, -872, -555, -717, -881, -156, -620, -2187, -860, 1135, 4, -2506, -1637, 1826, 2205, -631, -1691, 1051, 2656, 254, -1491, 591, 1822, 186, 92, 2204, 701, -2466, 450, 3395, -466, -4076, 164, 3527, -523, -4270, -820, 1445, -974, -1755, -5, -9, -783, 351, 862, -1111, -1850, -267, 1709, 1205, -251, -654, 1674, 2862, 134, -1887, 423, 2647, 1072, -1181, -448, 833, 323, -631, -685, -549, -24, -213, -112, 72, -1422, -2427, -755, 1465, -546, -3014, 308, 3877, -137, -3677, 101, 3375, -348, -1696, 2331, 2556, -1255, -588, 2597, 702, -2279, 845, 3508]
1054C508k995l063K263J498j785j755J057J670J06r03o88P78j8n58L02P84o58
1071d57K3J105N21j704k99J544N01m63R1o41L72R44r26k132N07K894j081k247
1089a448J755R81k541j168K705j47k903K152K761k305k636K326K132k416j217
1104a969K736J393k102m36J504l37j667J052J480l28j403N90J061j249j097O42
1120a30O93l91j043M34P47j350n94J097R5r03P77J591j541p90J187Q19j665L90
1138e77K016l23j596J768M66k192j70K505o70k547J614J576j611j764J814M95
1154H04j928J54K027j200j130M56P68p69o61J190N75n06k77O10P68j128j81J172
1172G44J95p38k0J263k40j853N91J732j204j437J787P05k249m32J752n79j749
$$ y = [3508, 513, -2550, -287, 1211, -574, -2329, -1272, 398, 504, -399, -1087, -309, -327, -885, -583, 201, -457, -434, 671, 1192, -512, -811, 733, 1234, 771, 862, 221, 593, 1537, 611, -1521, -1014, 1880, 799, -1448, 307, 1288, -1253, -2421, 284, 137, -2766, -614, 2147, -158, -2794, -468, 1664, -752, -1969, 767, 2160, 58, -378, 1126, 789, -878, 174, 1654, 1326, -77, 513, 1574, 325, -772, -130, 563, 172, -871, -437, 310, -1040, -1634, -537, -442, -1345, -568, 1023, -518, -1308, -121, 698, -967, -577, 1439, 1116, -480, 1288, 1754, -438, -608, 1897, 1227, -1320, 294, 1870, 259, -1505, 309, 804, -1124, -970, 1057, -143, -1273, -817, -49, -818, -1479, -289, 286, -220, -497, 113, 881, -247, -428, 744, 939, 201, 181, 1444, 1204, -649, -58, 1674, 470, -967, 820, 1525, -724, -1156, 596, 17, -1732]
1189a732Q38J722j379j070J747L20j832K08J636l69j093R75R80j008k51J173K5
1206H90o58M66M42l84q45K30M39mr43M50M06o44n84Q14L8q63m88J126m3j360O09
1227i06J180o13j137J275J086j283j33J481K93j676K08J494j037q28J274J048
1243A726j507l20J295m65j321N05L15m67q56O91R88j405j87Q17K40q16K6O65j02
1262a78l34J95N00j98m01J049L97p37l60J006N3r00N4R17p13p47P03M04j035j01
1282d26P71r7r74k16J263o03r07N53P78q54k32Q28L60o93J38J168m43p23N39N50
1302G80m84n63N99P03q01j45Q00k64p93M7M79k36o95L99J94m50l19K48N42q61
1322h20J71M32j01m85M33M84k73k56P05m8n5R6M33o6l47R2K92Mm27mM5l71J88
$$ y = [-1732, -894, 828, -551, -1621, 126, 446, -1386, -1178, 458, 89, -1004, -29, 951, -57, -308, 865, 890, 232, 698, 1140, 756, -89, 141, 580, 576, -367, 83, 489, -155, -739, 75, 113, -750, -1238, -112, -155, -1515, -906, 274, -339, -1476, -201, 885, -398, -531, 950, 1243, -433, -225, 1269, 232, -596, 678, 1726, 219, -101, 1194, 729, -592, -87, 228, -239, -1095, -404, 584, -821, -1008, -191, 49, -767, -741, -76, -178, -512, -317, 183, -15, -416, 633, 1030, 293, -67, 939, 992, 92, 146, 1063, 350, -397, 306, 710, -325, -426, 345, 248, -726, -942, 321, -282, -1189, -636, 142, -712, -944, -116, 244, -449, -311, 857, 414, -309, 230, 780, 296, -267, 332, 1035, 234, 89, 889, 625, -168, -121, 358, 122, -573, -174, 20, -430, -749, -501, 41, -820, -649, -217, -318, -803, -370, 114, -159, -415, 290, 242, 187, 283, 716, 650, 303, 395, 687, 691, 264, 260, 305, -66, 122]
1345A22J58r7l44oL81m60m40K59K86n14l9J55N35m08K70M24oo24K59M39k42p6
1367C2M64P3l07K93J47j53R4m40P3L35n60o4k87m5l3L84m03j7l2J32j19k69K79
1390d23K42l64J22M29Q4j8J26L18k56L31j20J53m1m22k66N75K4l71k6O0N3l36
1412a26j74M84k01n42r6M22k48n99O45O64m65j69K16L84Q9r7kK77m5m6m31P74
1434G14J86k59m14M55j07q59N40K67n68o37M07P55o59o00K09L42j97o1K64n1L6
1455b37j62j15N96O4n49J33J020k56o13K91J028p03j136R58O27n47q16N75O32
1474G90j028l99Q60p6m68MJ01Q4n30n92R10N86o00k89N22R45j070o60J438L70
1494H98j287m0J557m70o08J40Q07n95o17N17K94j97j63n68J6L80k36q72O04J099
$$ y = [122, 280, 183, -161, -167, 214, -246, -686, -427, -141, -655, -694, -539, -4, -412, -142, 282, 276, -348, -89, 350, 108, 32, 496, 569, 262, 555, 702, 549, 643, 203, 276, 611, 51, -13, -300, -345, -378, 6, -397, -414, -446, -314, -433, -702, -423, -181, -545, -423, 6, 90, 72, 198, 516, 260, 591, 471, 624, 583, 161, -105, 470, 494, 123, 97, 157, 210, -126, -300, 184, -17, -559, -655, -233, -481, -1080, -435, 229, -236, -405, -189, 195, 284, 187, 185, 462, 417, 371, -60, 714, 900, 641, 227, 682, 575, -284, 256, 523, -45, -682, -275, 480, -179, -779, -570, -228, -425, -486, -222, -273, -237, -399, -514, 82, 146, -403, -270, 750, 494, -119, 172, 1200, 497, -639, 319, 946, 399, -417, 158, 790, -238, -637, 223, 147, -321, -317, -216, -132, -662, -1254, -344, 242, -358, -647, -125, 820, -250, -910, 528, 898, -389, -429, 1128, 658, 50, 190, 997, 402, -215, 302, 596, 399, 236, -332, -316, 64, -172, -1044, -440, 659]
1514F59j052o52P57L42r51R6J120K3p29J35P19l04p78R27M30j56k99M2O8M5l28
1535A14o54P48L75o73k13J117m01j554L97R20o83p15J022O40j011l59J008J39
1553B17j007N59O88k25k05K38l2k63M48P9l98L53O46p44k27L48l85m49K32N74
1573D47n04p39O10L07q24j80N95Q7j98K56K12j85k00j65O3O78J67o95O18P32p39
1594C43j015J008M05r42K65Q67k17j125M50L13p49k29O63J87p65K2O27o07n01
1613a000N32M82l17M06L96q11R2J68J52k43K88K89j73lK84j09n52N68Q1m31J7
1634A16Lj31k55L32l31k54M14M18q88O09K15q02j95P01K14q17N60O66m39p07R55
1655C84J80p70M35P69n05m24M34k09m11K7O28r2l49J65J89n33n66K55m8J90jJ49
$$ y = [659, -393, -1045, -288, 54, -897, -801, 319, 342, -387, -252, 467, 163, -615, 312, 742, 586, 287, 329, 397, 442, 114, -540, 208, 583, -90, -303, 814, 413, -1141, -744, 176, -507, -1222, -200, 440, -571, -930, 78, 217, -790, -231, 457, 232, 27, 265, 233, -30, 418, 497, 99, 452, 1098, 354, 127, 475, 90, -359, -127, 447, -57, -796, -186, 121, -703, -883, -288, -201, -399, -143, 69, -116, -316, -481, -418, 260, 427, -268, 350, 1082, 343, -672, 336, 741, -201, 64, 931, 714, -411, 39, 352, -397, -626, 37, 224, -541, -519, 108, -499, -1000, -468, 14, -303, 103, 499, -312, -220, -52, 100, -143, 145, 434, 261, 258, 542, 433, -119, 449, 530, 99, 116, 119, -12, -267, 65, -266, -520, -106, 312, -576, 33, 248, -554, -749, -48, 166, -651, -91, 575, 136, -571, 384, 564, -206, 229, 998, 493, 69, 503, 294, -117, -90, 538, 446, 97, 262, 451, -82, -648, -393, -441, -251, -252, -103]
1677a03j93J78k15m6N9K02r2L07J41o8n35L05M57j26k39P04r2o65K26J24m54k20
1699c45J000p10n30R66k31n12j82O82l38l97L90M63m00k89L60J38m55J56M93Q1
1719C40k95J73K14j61m9j41L34k47L07k86L36m63r0J07m2j26k67M02l16J27n10
1740f53K12J61j98L07L06n52J48N36j86l67J89N24k43K8J12r3p1Q6O6j38J38l01
1762A1N01p94K8J12J86l23l4P9j60q5K95j74K06r3J52kk36Q6K90J41j65O9J84
1785B74L52m96K93J30m22J46r8L03m04j0L49j36m55ML9J21j51j86N30l40l35o
1807d98N38l44K09J55k9j59P9O3J12j96L39n6m0k5l9K6k9K04N9j03l89K57j18
1830A6o7m7J35k74j31m8J16j80l74P32o1P6k47L27K0LJ54R7j87L6J68J62j22j13
$$ y = [-103, -296, -118, -333, -379, -320, -118, -210, 97, 238, 170, -365, -60, 397, 271, 32, 736, 644, -21, 205, 329, -125, -345, 655, -55, -585, 381, 150, -362, -544, 138, -200, -597, -207, 256, -144, -433, -73, 65, -390, -234, 259, 340, 45, 218, 432, 271, 222, 81, 415, 168, 475, 189, 525, 62, -28, 79, 37, -89, -356, 46, -270, -143, -653, -441, -280, -478, -171, 135, -417, -269, 267, 81, -286, -97, 427, 184, 212, 324, 231, 160, 246, 312, 174, 312, 11, 512, -282, -254, -142, 44, -279, -313, -234, -394, -479, -184, -358, -152, -245, -93, -95, -331, -245, 45, 186, 21, 90, 274, 626, 130, 423, 553, 131, 277, 179, 482, 78, 68, 417, 281, -174, -170, -131, -10, -161, -347, 183, -157, -492, -498, 40, -304, -95, 60, 31, -128, -49, 14, 126, -70, 269, 213, 173, 148, 109, 135, 106, 310, 369, 266, -123, 134, 16, -51, -98, 37, -237, -368, -416, -300, -480, -854, -122, -183, -107, -354, -27, -7, -4, 150, 247, 60, 96, 264, 426, 304, 191]
1854A91j2j4m8j20P3k2J41m49K87j34k34K46Q9k01k05K41M2k13L0K77p6N8P9q
1878A8L44l39K33p2l25K47K62qlk60L25k73l49K93J43m88j16M63j11N2n41M07
1900i8qk92l3L31l51J82J9M40m14p1L03L13j61N3j00k5J51m4n5j93O23l37j34
1923I9J22O3k72k64q1J76k0m9Pk6j28J0P7L34l46J68K55K17l43m24N93J43j68
1946A43j11K97o5j69N8K45k10q8J05K69n91J10j47L25pl69j83L59N6n8m14K19
1968b26J01m60L45N40l83j24J25L92k2k37o0M18J0o8N9r7r2L5l15K58Q7j11k61
1991h6K92k1n28q9O79n31k27N36j80j43j49M32O5l17q7L40j04L41j87j11O0J67
2013A52q8J08L38j5m19j03M20l67n37M16N33l81n22M32K16n26k7L02j21q7L42
$$ y = [191, 179, 165, 117, -3, 70, 48, 189, -260, 27, -107, -341, -95, -6, -207, -412, -171, -129, -342, -312, -35, -111, -53, 26, 18, 362, 23, 256, 184, -141, 106, 368, 360, 357, 97, 422, 149, -200, 93, 236, -252, -368, 95, -16, 36, -505, -98, -106, -398, -431, -100, -451, -269, -250, 190, -224, -295, 8, 321, 160, 213, 113, 88, 239, 195, 140, -53, 570, 233, 99, 221, 284, 12, -252, -333, -157, -177, -226, -219, -245, -373, -363, -286, 48, -298, -130, 125, 342, -1, -425, 168, 311, 143, 32, 329, 264, 95, 153, 398, 188, 100, 205, 474, -117, -7, -154, 171, 164, -205, -388, -29, 27, -31, -445, -226, -125, -585, -240, 300, -83, -207, -82, 310, 288, 51, -9, 409, 419, 351, 410, 313, 221, 256, -59, 199, 286, 175, -86, 206, 185, -343, -432, 247, -284, -511, 25, -155, -298, -447, -15, 50, -267, -354, -14, -118, 223, 36, -75, -15, 152, 64, 172, 510, 495, 76, -27, 393, 26, -511, -95, 438, 57, -465, -33, 183, -343, -370, -68, -189, -276, 66]
2034F6j23p9M0j28J53J51o9k5K83J32n31o4M60j50J03k51M46k15j48m4J03k85
2056a75j20L24j93m5P1P2n63J81J32K27j02K90m7l35J4M83j79k84N31J33l15k1
2078G9K22l23o3J97L2l0l10O76l25j96k22J08K84j73l6m9J81k02k68J84K97p6
2100a3k01K28L62o10R9M06p5j45L17L20n07r9P1J04k71K73L7j33j04N08k81p98
2122e12L43L32n70J06N63m21j43J39L36o30k65P61Pj85J64J92j09l12K59m1J36
2143A50j5p1J31R6l60j49L54J28n53L33M51l40n09L36O2l55j72P64j52m60K34
2164i7K09m61j67R63m8p59P22j09m80J92L80k57j14J62J86p7r5j2J23l15j32K31
2186D5J55k43k23K4P7mk0n0L24l41L4L95n3m22K13J53K75m19J53K08p8k90M41
$$ y = [66, -57, -136, -96, -224, -71, 80, 11, -14, 269, 401, -130, -194, 266, 116, 219, -32, 414, 199, 51, 7, 110, -175, -295, 29, -164, -209, -138, -66, -629, -448, -316, -89, -191, 99, 52, -283, -269, 214, 35, -249, 282, 415, 100, 79, 301, -22, -85, 112, 144, 114, -196, 480, 155, -41, -263, -155, 129, -44, -80, -129, 52, -150, -418, -234, 63, -13, -214, 14, 376, -234, -135, 271, 196, 51, 368, 688, 181, 82, 153, 257, -14, 259, 296, 163, 59, 567, 286, -512, -169, 163, -407, -301, 262, -159, -302, -163, 173, -457, -722, 39, 46, -139, 25, 217, 108, -204, 55, 14, 150, 135, 64, 195, 291, -69, -218, 136, 264, -289, 44, 495, 155, -354, -18, 44, -311, -483, 281, 129, -331, -97, 112, -349, -516, 447, 399, -360, 362, 253, -227, -35, 345, 88, -26, 136, 322, 245, 150, 138, 261, -54, -186, 45, 200, -43, -266, -242, -165, -169, -189, -239, 85, -256, -222, 173, 120, -302, -89, 64, 339, -80, 73, 281, 203, -87, 354]
2209C54k1l85k6M30k47j7r9L67n04N8K97l47j60J54J15l07J06q8J59k12O6N35
2231B28k91l30L77J48J40l45Q7J96J9P0Nk8j86j26J54J3k82M0J6K82o62J66K57
2254e2j94J22j8J48j96KL83l42k71L30pJ06l9J00m2p5P3K76j62j45J29J15k46
2277eK61k59K87m76J10J70j50o8j27L05j90j52M20j97j91M2K62oR3j4O8j21k19
2300a57J26O9K31k92L13n7j50K46l06K13k18n0K11l58j70K11K93n1l82K56P1j04
2322e5J56j73pm5R1J68k12j18J59L56m14MK31j82J48l29O39l32j43J69j2L9j39
2345aM2k6o0Mj26M27m20n4J52r7j92L20K7R5l48J52M6k07L40J53j01Q7Nl75K64
2370A07O9j48P1m3K14k27Jk58K93J3k71K03O7L8k18Q6J92k53l69L10RP1k14K21
$$ y = [354, 333, -52, -78, 352, 105, 88, -11, 356, -148, -90, 207, -140, -300, -146, -31, -338, -232, -320, -161, -373, -307, 228, -63, -393, -16, 132, 272, -73, 14, 210, 229, 299, 304, 276, 90, -36, 118, 131, -151, -111, -95, 187, -475, -309, -52, -246, -124, -142, 6, -190, -188, 195, -147, -418, -88, -95, 11, -28, 72, 30, -45, 28, 304, 142, -3, 126, 241, -5, 256, -3, 284, -192, -82, 88, -62, -130, -257, 48, -142, -294, 126, -71, -262, -220, 42, 36, 129, 115, 183, 62, -157, -31, 38, 269, -23, 290, 233, 83, 329, 23, 236, 18, -32, 179, -179, -349, -138, 155, 104, -278, -22, 49, -55, 101, -72, -79, -124, -33, 135, -77, -195, -36, 320, -94, -90, 141, -41, 107, -222, 417, 85, -58, 111, 99, 138, -1, 41, 15, -45, -41, -167, 260, -160, -214, -62, -159, -351, -31, -4, 91, -257, -105, -59, -266, 74, 227, 126, 213, 218, -157, 107, 176, 28, 99, 56, 270, 43, 44, -214, 79, 92, -179, 24, 91, 129, -89, -3, 189, -64, -433, -123, -114, -43, -257, -36]
2394c6n8J93j40k7M50l12m8J84O2k30l85O66j52k14l1J64OM2k29j49K41j8j10
2417a31p1J9L36k55m9J96R5l08p4J81j02J07Q9j59K24K12j81J9K10m25j3M55j42
2440B33j68R3l30K46k58oN59m54j25K63l7k14O1M7M8l66L10j61L90Q0l19j1J25
2463FJ04k38M3L94m94J47K30J8l60O0J92J07o1k21K3lj11P1nn6j67q6L21K47k96
2488a35j49K44j11J27j24K25J72k58j72M24J26l87O6L28k87r5K45m80J49J53k25
2509a64J24N5l23K2L53j74l2O1LR3p4J43N4k58k00L83M1K6j35O4J14k8k82L98
2533B64k28J38l03L30q9j3k53J59o9J28k44J92j71K60m37J20L83l32J83j24K87
2554A81j28m8M0o7J65J31j38J18m4M9m01K5L95k10J09MO7j96k67K50J42k18K02
$$ y = [-36, -94, 99, -41, -68, 382, 70, 22, 206, 268, 38, -347, 319, 167, -47, -78, 86, 92, 134, -95, -244, -3, -21, -131, -202, -183, 153, -102, -151, 45, 140, -168, -242, -61, -163, -56, 33, -126, 98, 310, 129, 148, 358, -67, -80, 375, 233, 65, 158, -172, 74, -184, -190, 369, -85, -210, 53, 16, -198, -137, -90, -42, -408, -98, -259, 131, 211, -108, -119, 6, 110, -128, -85, 309, -185, -38, 192, 210, -150, -90, 102, 209, 148, -73, -50, -53, -164, -93, -98, -154, -321, -407, -86, 161, -135, -284, -40, -151, -24, -148, 77, 249, -9, -181, 243, 369, -18, 48, 376, 89, -6, 239, -241, -92, 61, -164, -40, 15, -308, -286, 67, -107, -139, -78, -75, 18, -56, 87, 141, -117, -317, 66, 107, 133, -2, 62, 176, 148, -134, 264, 36, 174, -129, 201, 112, 99, -154, 5, -64, 64, -180, 12, -159, 101, -336, -216, 167, -165, 18, -106, 181, 53, 5, 45, -22, 143, 274, 136, 254, 210, 259, -142, -117, 278, 68, 177, 181, 248, 52, -215, 35, 177, -41, 161]
2577A61j27Q0l74J95j10n2l7K74J95k42P9k4j72k6K76O5%Q8j35m41N79R2m88L62
2601B18j83MK5Q1j06m3l46L10J13k49K99l24J09o0R1j09j42M65k28rL07k40j93
2624b10L04L39n99J52K22J62m34L6J15L5Mk19K13J2q3J1l98L75J16l49J43l5n0
2647a38L4k28N04k34o2J0o5K20L5J82n8j92q5l3K99M9m7M9k48M3j29l6K67j47
2671a0P8j12K6k45J38J50k20J72oJ85o0l31L02m5o7k81L40Q8J88j14J84m99J62
2694B3N9j14Q1J41j82J7N2m9l6n7M3j11L9K7P2j02M8L9j63J70J17l55M03j35j4
2719A3k04K20K4K0j9p6J37k03J16K48p7j33j37K53k38j9J5J48l17Q1J93k37p5
2742b67J64J51P9k20J11k0m7J32r0j82p0L32p3R7j13PJ59K9k70Q5J19J09l16L26
$$ y = [161, 34, 114, -260, -65, -175, -227, -264, 10, 205, -37, 42, 18, -154, -180, 96, 161, 161, 249, 114, -327, 252, 344, -144, 218, 35, 39, 64, 145, 39, -4, -350, -40, 73, -176, 123, -201, -92, -152, -61, -170, -312, 153, -75, -84, 223, -17, -210, 94, 433, -166, -14, 208, 370, -64, -28, 87, 122, 126, -93, 120, 132, 49, 60, -338, 37, 153, -196, -53, -88, -138, -104, -332, 172, -62, -124, -114, -179, 41, 76, 258, 200, 8, -77, -110, 189, 238, 191, 240, -8, 35, -94, -130, 137, -10, 68, -44, -18, -263, -125, 25, -195, -23, -29, 156, 96, -235, 67, 22, -45, -326, 14, 102, 290, 176, 360, -139, 23, 82, -32, 49, 190, 8, 25, 77, 28, -8, -65, -22, -133, -94, -67, 5, -97, -49, -10, -173, -3, 114, -241, 162, 27, 13, -191, 29, 53, 73, 54, -22, 115, -88, 28, 276, 199, 66, -71, 182, -56, -75, -60, 88, -229, -148, 45, -192, -267, -103, 48, 127, -93, 18, -2, -49, 83, -7, -189, -259, 73, 0, 97, -16, -9, 150, 179, -91, -6, 113, 222, -94, 232]
2766B32r2j30j37M5o6J42l31L68j99J40j51L06k45j47O9l4K46J74j24m01K47L83
2788B95k15j99J43l7J83N4k27O3Q6J7o7j18j61K72p2k25P8k9K9R8k2j94L28q1
2812ak30K71L4j07P7M16n47j17J74J78j89m6K60o9k7k51M4K35l24M48k58O6m7
2835a0j76J72L0J3o5M9J48k33N3kj12J54r4J80rj46K7J71k58N04m52J55L51k25
2859B25k36J27q1j19J9j12L24k39m4J5O6j05j01K04k74K41j41N2K61l63K91J07
2881A17l6k49K34K78k84j79J27K05r2j04K68j21P8k72n2L6j23l6J79O4O4k94J5
2904a77L1J35J40j06L2j81J79j34J48q4J47k2m02L16Q7p0j3P5j0j09J59k3k24
2927a06K52j19m8qj2k70J04J41Q8j32O8k42K29L0j05J59J51k9M5l21K13J10l50
$$ y = [232, 140, 10, -127, -82, -148, -6, -337, 31, -168, -28, -179, 127, -118, -265, -196, -230, 16, 190, 66, -335, -88, 295, 80, -119, 24, -13, 170, 224, -3, 60, 146, 163, 96, -22, -183, 89, 17, -208, -130, -159, -130, -32, -54, -248, 80, -1, -231, 40, 74, -33, 44, 460, -87, -204, -30, 148, -41, -87, 173, 104, 77, -174, -130, 105, -219, 229, -29, 37, -10, -186, -14, 16, 29, -36, 13, 161, -72, -19, -21, -133, 21, -73, 107, 98, -48, -21, 150, -108, 396, -56, 99, 450, 225, -11, 116, 35, -84, -65, -177, 147, -92, -136, -121, -55, -160, -261, -57, -331, -90, -231, -179, 82, -281, 10, 117, 81, -168, 66, 344, 60, -119, 8, 213, 121, 17, 285, 164, 242, -30, -82, -46, -169, -205, -26, 38, 102, -192, -177, -146, -11, 129, 23, 55, -126, 53, -81, 67, -17, 130, 108, -294, 22, 109, 39, 26, 101, 91, -18, 141, 118, -106, 146, 27, -21, -29, -41, -311, -207, -66, 22, -110, -42, -284, -55, -25, -130, 29, 180, 151, 196, -125, 88, 198, -152]
2950a52L23N6j22j15J23j18j30K88j49j42K36k47j58L38q8J48M7k30K31l84L51
2971A06j26k49K94o2k73O23j52j57k4R3k97K00o8J00R7j97J71p2K23o7l15J40
2993a2Q8j87n1J91o8kp5l6m5K02j71J25R0j13r8K7M03j57j87J4J07K4j51mK78
3018A92k41Q4K71l61O4j54J05j19K06J22j49R3q5K2p2j86L58k01MJ30j94M3M1
3041b7L5r5K59o1J54l08J82J33m5l02K99j11j11J51j38q8J37j77L8O4r9k6K92
3064A56m23K63j63J18qm2j0J56k3R0j86K28O4k23K55k64l5J04j4j0L20m27L68
3087B94n03K67jj85K69k76J53j20j53P2R3l3j16P8J03k3J94r4J28m0q8j94K52
3110G7l02L75J06j53n9qK3m4j07J0L43m83K55o3J43k66M7J69j84J04m0r1j91K25
$$ y = [-152, 171, 227, 105, -10, 113, -5, -135, 153, 4, -138, 98, -149, -307, 31, -57, 91, 138, -92, 139, -245, 106, -20, -269, 25, -37, -310, 313, 161, 4, -20, 73, -224, -24, -92, 8, 105, -92, 79, 7, 230, 163, -152, -12, 76, -111, -162, 29, -39, -41, -116, -152, -197, 5, -166, -41, 49, -64, -162, -135, 268, 111, -76, -62, 45, 69, -82, -86, 192, -49, 35, 306, -55, 9, -145, -40, -159, 47, 169, 20, 113, 28, 50, -22, -208, 150, -51, -47, 83, -111, -68, -27, 8, -87, 172, 111, 265, -43, 139, 272, 227, -75, 224, 113, 2, 153, 15, -73, 64, -113, -75, -11, -110, -136, 156, -267, -4, -167, -49, -57, -99, -109, 47, 24, 114, -72, 156, 220, -3, 252, -12, -47, 57, 43, 33, 353, -74, 294, -209, 58, 57, -128, 141, -135, 18, -102, -255, -183, -90, -123, -239, -161, -58, -81, 113, 19, 147, 107, 19, -175, 77, -225, 150, 256, 103, 44, 36, 59, 15, -92, -82, 261, -222, 33, -30, 113, -153, -106, 63, -121, -17, -57, -148, -339, -114]
3134a14J82k53P1J12n2j4RK16kj36k8l7j76r0L82k33k2K17j60o3K7N56n01J27
3158A8j68j2j6rm0M5J63J52j93M1K5j18p7L18j68j53K24J82k55K4m0J09j12K57
3182A97j18l0O7O1K26n25KL40l58O3J73j73P3m7L20m31O9K2j9oM7K43o0j72K25
3207A89k58n8M7r6R6K38j41O6j2O6Q4m17K04m7k1K19q0k59n3NL2J52n8o5M9J59
3233D1n0J40M1k55M55l39j84l8K49q8K34k13k33K99J25k75k9M51k86k24k2J01
3255a00K68j14j25J17K74l36j25K78k16J2k97K19J05N9L5j83L75j2k9k10j11J38
3277B2q8O1K9k18Q2j55K57q9p4J73JpJ78k62P0r1J55k55Q9M26m05Q9o2kLK42j83
3304a4l9R7P2ok36J78j49J09J17j18J22L01l64j46M7J22p1J47p3l70K18J63JP1
$$ y = [-114, 68, -185, -114, -2, -54, -68, -59, 157, 155, 19, -9, -46, -222, -312, 70, -163, -185, 32, -128, -191, -164, 392, -109, 18, -150, -162, -178, -187, -227, -182, -19, 133, -60, -19, 6, -112, -189, 129, -39, -192, 32, 214, -41, -17, -57, 52, -60, 197, 79, 49, 116, 177, 403, -122, -120, 220, -138, -75, 98, -75, -2, -49, 271, -160, -91, -69, -88, -94, -47, 196, 136, -36, 189, -69, -127, -80, -176, -80, 158, 17, 83, 71, 137, 221, -196, 8, -39, -60, 159, 79, -180, -233, -228, -196, -44, -102, -167, -118, 41, -9, 131, 172, -83, 372, 33, -151, -189, 60, -28, 206, -7, -240, 59, 184, -91, -120, 331, 45, -179, -201, -100, 168, 54, -71, 46, 320, -16, -141, 137, -79, -67, -364, -145, -40, 19, 54, -129, 246, 234, 205, -5, -116, 22, -66, -5, 24, -194, -112, -267, -10, -99, -173, 0, 1, -6, 172, -90, -20, -111, 44, -211, -122, 304, -101, -12, -74, -76, -73, 169, -14, -53, 44, 116, 110, -126, 52, -97, 12, 129, 11, 133, 434, 70, -76, -29, 93, 22, 169, 96, -274, -56, 107, 108, 179]
3328A79l72J39J3o3K92l0k12O9j5o7J60J0j81J93m3j11M2o1j7J03l4PL1k4q0J76
3354A04j48j33L3j0K05p6J70j67p8K9N6q5L41r0k70J40p2J09l1k1L62m20K2mK3
3379a1k7k6k8L7M18m39j13P1J1J46j74K74n9k0l46L82q7j08j25J26n8K41M3k45
3403a17J95q9R7j36J06l3J52k74L16o4kj64J06k49K87M0j10l54L54j05o1j1K85
3426A69j21j47Rk9J26lJ00J24o0k33L01k47K57m1Q0j52j21o3J35K34m41L36l82
3449a69K19j96J18n1Mq8K64k53r3L70k08j92m1K38q7J83k12L79k12J56m44M14
3471I9l4k51K60P6j19l7J54J74l34J55j75R9N7k62L26j48j98J0J50j69Q5N4J40
3494A12R8k43p7J20L0Q7j37J95l04J48J91j46j69O3L23P6m37K32k06J9J2j47k6
$$ y = [179, -193, -54, -41, -104, 188, 158, -54, 15, 0, -67, 93, 103, -78, 115, 72, -39, 3, -58, -75, 28, -6, 1, 32, 8, -72, 104, -44, -177, -144, -154, 51, -25, 145, -22, -100, -71, -15, -100, 241, 151, -119, 21, -51, 58, 27, 6, 368, -52, -30, -34, -11, -38, -64, -92, -55, 363, -76, -189, -118, -107, 39, -135, 139, 80, 60, -286, 96, 9, -99, -224, -98, -156, 85, 128, -117, 78, -11, 86, -50, 56, 23, 175, -99, 217, 153, 151, -13, 93, -156, 131, 171, 61, -293, 61, -44, -105, -116, 169, 48, -99, -90, -119, 7, 4, 104, 228, 168, -65, 236, -11, 246, 205, 285, 133, 12, -51, 84, 318, -123, 213, -169, 50, -146, -28, -79, -75, -163, 101, -152, -245, 125, -83, -275, -316, -78, -165, 18, -194, 185, -27, 129, -315, 99, 65, -186, 74, 150, 31, -6, 148, 322, -12, 143, -32, 67, 124, -138, 188, 40, -158, -148, 2, -167, -82, -28, 112, 210, -33, -110, 10, 40, 127, -10, 185, -119, 29, 220, 74, -95, -32, 291, 367, -70, 162, -44, -25, -13, -160, -186]
3517a86K16NK24l82J9r9O6L9K08k41K23j86J40O1j82J50j03j08L72O6l63M68m33
3540b6m2R9N0k44K17pj68L46k13k4k20K41j27k8M4J81o8R2q5O5j13j93J76n1j3
3565a11Q3m0j28K20Nj76J09OO6J06pj52Q7P8k88J66J13J27m18L95l39N5O9m6j2
3590c2J37k9k26K05j98K77j71l7J79j67J30j71Q5J05l58L14j60J42l46K52M8m4
3612f5Q4k83K90p5L7o0J01Jj13o3K96j85p9j04L09k55J36J01k09L04j23K6J30
3635B01q8lK3l63M88l56jL69j79j56J39N8pm23K62r6J17j81K82j76J94j04j09
3658a09O8L5j9j03Jj21L05k1L08l28J30k41K34m5p1O6l20K91P9l32r1P3J84R3
3682F6K22l22K3L8jN9j40J20k85J30K18j63J39J33k21O2L6k59K25qj47J24r2K82
$$ y = [-186, 30, 35, 259, -123, -104, -203, -137, -98, 110, -131, 92, -94, 46, 107, -75, 75, -28, -136, 236, 302, -61, 407, -26, -68, 31, 81, -163, 54, 47, -121, 225, 12, -12, -232, 9, -118, -146, -102, 79, 11, 103, 18, 83, -30, -223, -47, -98, -111, -28, -68, -196, 24, 29, -147, -38, -32, 34, 140, 133, -19, 68, 146, -142, 24, 137, 264, -154, 241, -98, -43, 26, -20, -32, 105, 76, -150, 55, -143, 134, -37, -74, 105, -62, 68, -103, -18, 87, -271, 43, -117, 25, -321, -69, -21, -65, 19, -264, 26, -49, -12, -72, 29, 30, -83, -146, 150, -35, -114, -218, 91, -164, -28, 73, -136, 168, 45, 71, 201, 113, 110, 133, -230, 258, -98, -99, 270, 91, -65, 74, 132, 125, -298, -36, -132, -15, -196, 86, -90, 104, 0, -109, -41, -6, -25, -128, -127, -248, 57, 36, 344, 16, 146, -95, 139, 94, 23, 89, -231, 60, 139, -193, -284, -211, -27, 66, 288, -34, -11, 27, 26, 85, -55, 65, -220, -90, 128, -35, 104, 237, 16, 78, 114, -145, 80, 72, -75, 49, -43, 239]
3706B39m89L04j08K0m9j51J28R4k00J77r6P7K2K88l90K09J09mk58P1L3N9l03L01
3730H3j29j97J58O23k66l56J41j72K83k88J93l0K74k60j65j5K43k47J54p8J45
3751I4l27K99PJ26k38J21L4j9rn0l22K28j11N18m21J64p2j54m2K39l9l49K30K83
$$ y = [239, -250, 54, -54, -34, -83, -234, -106, -12, -212, -35, -131, -54, -32, 256, -134, 75, 184, 180, -78, -7, 26, 85, -218, 83, -46, -243, -85, 538, 272, -84, 57, -115, 168, -120, 73, 43, 317, 57, -108, -123, 120, -127, 27, -51, 94, -233, 66, 73, 199, -39, 82, 116, 97, 88, 38, -284, -56, -167, 351, -70, 94, 22, -132, -174, 65, 26, -323, -93, 190]
$$ [...]
8191E9
##END NTUPLES=NMR FID
##END=
