##TITLE=1H_Pr 53-3.5
 CDCl3
 8 sc, 
 26.09.2022
##JCAMPDX= 6.0         $$ Bruker NMR JCAMP-DX V2.0
##DATA TYPE= NMR FID
##DATA CLASS= NTUPLES
##ORIGIN= UXNMR, Bruker Analytische Messtechnik GmbH
##OWNER= root
$$ XWIN-NMR		Version 3.5
$$ Mon Sep 26 15:26:45 2022 Russian Standard Time (UT+4h)  she@DPX200
##.OBSERVE FREQUENCY= 200.1313499994
##.OBSERVE NUCLEUS= ^1H
##.DELAY= (6, 6)
##.ACQUISITION MODE= SIMULTANEOUS
##.ACQUISITION SCHEME= undefined
##.AVERAGES= 8
##.DIGITISER RES= 18
##SPECTROMETER/DATA SYSTEM= spect
##.PULSE SEQUENCE= zg30
##.SOLVENT NAME= CDCl3
##.SHIFT REFERENCE= (INTERNAL, CDCl3, 0, 15.7039)
##AUDIT TRAIL= $$ (NUMBER, WHEN, WHO, WHERE, WHAT)
$$ ##TITLE= Audit trail, XWIN-NMR		Version 3.5
$$ ##JCAMPDX= 5.01
$$ ##ORIGIN= Bruker BioSpin GmbH
$$ ##OWNER= she
$$ F:/spectra/data/she/nmr/H-F/1/audita.txt
$$ ##AUDIT TRAIL=  $$ (NUMBER, WHEN, WHO, WHERE, WHAT)
(   1,<2022-09-26 15:25:37.09 +0400>,<she>,<DPX200>,
      <created by zg, POWCHK disabled, PULCHK disabled
       configuration hash MD5:
       00 E9 B6 7A A2 85 ED C7 34 08 36 98 17 FE 4E 26
       data hash MD5: 16K
       0C 9E AA 0D D1 F7 D0 B0 23 EA DA 64 59 92 71 B9>)
$$ ##END=
$$ 
$$ hash MD5
$$ 72 9B 6F 98 83 94 07 43 38 BF 95 A2 53 B5 FC B4
##$RELAX= 
##$RELAX= 
##$RELAX= 
##$RELAX= 
##$RELAX= 
##$RELAX= 
$$ Bruker specific parameters
$$ --------------------------
##$DU= <F:/spectra>
##$EXPNO= 1
##$NAME= <H-F>
##$PROCNO= 1
##$TYPE= <nmr>
##$USER= <she>
##$AMP= (0..31)
100 100 100 100 100 100 100 100 100 100 100 100 100 100 100 100 100 100 
100 100 100 100 100 100 100 100 100 100 100 100 100 100 
##$AQSEQ= 0
##$AQ_mod= 1
##$AUNM= <au_zg>
##$AUTOPOS= <>
##$BF1= 200.13
##$BF2= 200.13
##$BF3= 200.13
##$BF4= 200.13
##$BF5= 200.13
##$BF6= 200.13
##$BF7= 200.13
##$BF8= 200.13
##$BYTORDA= 1
##$CFDGTYP= 0
##$CFRGTYP= 5
##$CHEMSTR= <none>
##$CNST= (0..31)
1 1 145 1 1 1 1 1 1 1 1 1 1 1 1 1 1 1 1 1 1 1 1 1 1 1 1 1 1 1 1 1 
##$CPDPRG= <>
##$CPDPRG1= <>
##$CPDPRG2= <>
##$CPDPRG3= <>
##$CPDPRG4= <mlev>
##$CPDPRG5= <mlev>
##$CPDPRG6= <mlev>
##$CPDPRG7= <mlev>
##$CPDPRG8= <mlev>
##$CPDPRGB= <>
##$CPDPRGT= <>
##$D= (0..31)
0 1.2 0 0 0 0 0 0 0 0.06 0 0.03 0 0 0 0 0.0002 0 0 0 0 0 0 0 0 0 0 0 0 
0 0 0 
##$DATE= 1664191536
##$DBL= (0..7)
120 120 120 120 120 120 120 120 
##$DBP= (0..7)
150 150 150 150 150 150 150 150 
##$DBP07= 0
##$DBPNAM0= <>
##$DBPNAM1= <>
##$DBPNAM2= <>
##$DBPNAM3= <>
##$DBPNAM4= <>
##$DBPNAM5= <>
##$DBPNAM6= <>
##$DBPNAM7= <>
##$DBPOAL= (0..7)
0.5 0.5 0.5 0.5 0.5 0.5 0.5 0.5 
##$DBPOFFS= (0..7)
0 0 0 0 0 0 0 0 
##$DE= 6
##$DECBNUC= <off>
##$DECIM= 32
##$DECNUC= <off>
##$DECSTAT= 4
##$DIGMOD= 1
##$DIGTYP= 9
##$DL= (0..7)
0 120 120 120 120 120 120 120 
##$DP= (0..7)
150 150 150 150 150 150 150 150 
##$DP07= 0
##$DPNAME0= <>
##$DPNAME1= <>
##$DPNAME2= <>
##$DPNAME3= <>
##$DPNAME4= <>
##$DPNAME5= <>
##$DPNAME6= <>
##$DPNAME7= <>
##$DPOAL= (0..7)
0.5 0.5 0.5 0.5 0.5 0.5 0.5 0.5 
##$DPOFFS= (0..7)
0 0 0 0 0 0 0 0 
##$DQDMODE= 0
##$DR= 18
##$DS= 0
##$DSLIST= <SSSSSSSSSSSSSSS>
$$ [...]
##$SUBNAM2= <"">
##$SUBNAM3= <"">
##$SUBNAM4= <"">
##$SUBNAM5= <"">
##$SUBNAM6= <"">
##$SUBNAM7= <"">
##$SUBNAM8= <"">
##$SUBNAM9= <"">
##$SW= 18.0517283424941
##$SWIBOX= (0..15)
0 0 2 0 0 0 0 0 0 0 0 0 0 0 0 0 
##$SW_h= 3612.71676300578
##$TD= 16384
##$TD0= 1
##$TE= 0
##$TE2= 300
##$TE3= 300
##$TEG= 300
##$TL= (0..7)
0 120 120 120 120 120 120 120 
##$TP= (0..7)
150 150 150 150 150 150 150 150 
##$TP07= 0
##$TPNAME0= <>
##$TPNAME1= <>
##$TPNAME2= <>
##$TPNAME3= <>
##$TPNAME4= <>
##$TPNAME5= <>
##$TPNAME6= <>
##$TPNAME7= <>
##$TPOAL= (0..7)
0.5 0.5 0.5 0.5 0.5 0.5 0.5 0.5 
##$TPOFFS= (0..7)
0 0 0 0 0 0 0 0 
##$TUNHIN= 0
##$TUNHOUT= 0
##$TUNXOUT= 0
##$USERA1= <user>
##$USERA2= <user>
##$USERA3= <user>
##$USERA4= <user>
##$USERA5= <user>
##$V9= 5
##$VALIST= <valist>
##$VCLIST= <CCCCCCCCCCCCCCC>
##$VD= 0
##$VDLIST= <DDDDDDDDDDDDDDD>
##$VPLIST= <PPPPPPPPPPPPPPP>
##$VTLIST= <TTTTTTTTTTTTTTT>
##$WBST= 1024
##$WBSW= 4
##$XGAIN= (0..3)
0 0 0 0 
##$XL= 0
##$YL= 0
##$YMAX_a= 224207
##$YMIN_a= -285128
##$ZGOPTNS= <>
##$ZL1= 120
##$ZL2= 120
##$ZL3= 120
##$ZL4= 120
##$ABSF1= 10
##$ABSF2= 0
##$ABSG= 5
##$ABSL= 3
##$ALPHA= 0
##$AQORDER= 0
##$ASSFAC= 0
##$ASSFACI= 0
##$ASSFACX= 0
##$ASSWID= 0
##$AUNMP= <proc_1d>
##$AZFE= 0.1
##$AZFW= 0.1
##$BCFW= 1
##$BC_mod= 2
##$BYTORDP= 1
##$COROFFS= 0
##$CY= 11.3945322036743
##$DATMOD= 1
##$DC= 2
##$DFILT= <>
##$DTYPP= 0
##$F1P= 2.36226072786647
##$F2P= -0.459571619588291
##$FCOR= 0.5
##$FTSIZE= 0
##$FT_mod= 4
##$GAMMA= 1
##$GB= 0.15
##$INTBC= 1
##$INTSCL= 1
##$ISEN= 128
##$LB= 0.24
##$LEV0= 0
##$LPBIN= 0
##$MAXI= 10000
##$MC2= 0
##$MEAN= 0
##$ME_mod= 0
##$MI= 1.114404
##$NCOEF= 0
##$NC_proc= 0
##$NLEV= 6
##$NOISF1= 3.799351
##$NOISF2= 2.8
##$NSP= 1
##$NTH_PI= 0
##$NZP= 0
##$OFFSET= 15.70392
##$PC= 1
##$PHC0= -18039.69
##$PHC1= 22.60069
##$PH_mod= 1
##$PKNL= yes
##$PPARMOD= 0
##$PSCAL= 0
##$PSIGN= 0
##$REVERSE= no
##$SF= 200.130013532006
##$SI= 16384
##$SIGF1= 3
##$SIGF2= 2
##$SINO= 400
##$SIOLD= 16384
##$SREGLST= <1H.CDCl3>
##$SSB= 0
##$STSI= 0
##$STSR= 0
##$SW_p= 3612.71676300578
##$SYMM= 0
##$S_DEV= 0
##$TDeff= 0
##$TDoff= 0
##$TI= <>
##$TILT= no
##$TM1= 0
##$TM2= 0
##$TOPLEV= 0
##$USERP1= <user>
##$USERP2= <user>
##$USERP3= <user>
##$USERP4= <user>
##$USERP5= <user>
##$WDW= 1
##$XDIM= 8192
##$YMAX_p= 0
##$YMIN_p= 0
$$ End of Bruker specific parameters
$$ ---------------------------------
##NTUPLES= NMR FID
##VAR_NAME=  TIME,          FID/REAL,        FID/IMAG
##SYMBOL=    X,             R,               I
##VAR_TYPE=  INDEPENDENT,   DEPENDENT,       DEPENDENT
##VAR_FORM=  AFFN,          ASDF,            ASDF
##VAR_DIM=   8192,          8192,            8192
##UNITS=     SECONDS,       ARBITRARY UNITS, ARBITRARY UNITS
##FACTOR=    0.0002768,     1,               1
##FIRST=     0,             0,               0
##LAST=      2.2672688,     0,               0
##MIN=       0,             -285128,         0
##MAX=       2.2672688,     224207,          0
$$ Real data points
##PAGE= N=1
##DATA TABLE= (X++(R..R)), XYDATA
0 0 0 0 0 0 0 0 0 0 0 0 0 8 -8 8 -8 8 -16 16 -24 24 -32 40 -47 56 -64 72 -84 97 -112 129 -148 169 -193
33 -193 218 -246 276 -312 349 -390 437 -485 539 -598 661 -733 809 -894 985 -1084 1195 -1317
51 -1317 1453 -1599 1764 -1949 2156 -2393 2665 -2979 3349 -3793 4334 -5016 5899 -7099 8825
66 8825 -11541 16458 -28163 117635 -20521 -270739 21717 184162 31386 -119832 -27057
77 -27057 30680 39838 41171 -6676 -113908 -42759 123772 92205 -113148 -120708 74166 125011
89 125011 -42172 -118504 -9495 74649 27365 -28940 -39141 -17690 28863 58573 -12830 -78279
101 -78279 -2229 91021 25082 -61374 -9372 45959 -832 -16632 26319 -7610 -53446 24971
113 24971 78991 -30857 -98939 18959 88930 -19566 -76366 18879 50572 -24792 -21384 32730
125 32730 -17780 -62365 33649 81810 -40825 -94416 40646 100560 -27718 -89572 16488
136 16488 76443 5861 -35781 -759 10551 -1041 16393 8692 -37377 -22464 46075 33866
148 33866 -49094 -46372 33475 36887 -30264 -31967 18604 17796 -10559 -1512 2435 -18885 -1147
161 -1147 30559 -2163 -34603 11790 38853 -16064 -33764 25453 31536 -26121 -17142 39363 17571
174 17571 -36326 -10708 32442 2294 -29707 -22 17707 -10946 -12021 15222 -3573 -31688
186 -31688 4613 38781 -7773 -46582 5613 49905 -1118 -47404 -4581 38871 11225 -20630
198 -20630 -7585 7731 7082 12612 4004 -22793 -10492 34562 25427 -31055 -30376 27295 31998 -21703
212 -21703 -31723 8147 17242 -4748 -9180 -6347 -11285 2670 20038 -4054 -29240 2235 33689
225 33689 2042 -29595 -2332 24467 3773 -13396 2147 8500 -2571 2503 10853 -3599 -11884
238 -11884 8093 17498 -5773 -16552 5536 13984 -7107 -13496 3933 4078 -10627 -4017 8762
251 8762 -5257 -16332 4524 14429 -7884 -14377 8286 13841 -4952 -5706 6974 3395 -2355 6166
265 6166 5264 -8265 -2913 14385 6725 -13981 -5647 15914 8080 -13311 -7537 9106 3979 -8299
279 -8299 -4819 449 -3980 -1987 3486 -5263 -11182 3660 11547 -5448 -12964 5851 14157 -2361
293 -2361 -9500 4755 9693 508 -2226 2424 1775 561 4176 1837 -5882 -2564 8559 3395 -10307
308 -10307 -5342 8484 3936 -10098 -5804 5555 660 -6973 -2783 674 -3101 -1244 3291 -1468
322 -1468 -4629 3916 7663 -1415 -4306 5052 7413 -385 -3104 3512 4855 -1142 -1658 2508 811
337 811 -2155 195 1686 -2812 -3876 1651 857 -5259 -3594 2626 -431 -5492 -1388 2511 -1862 -3360
353 -3360 1504 2232 -2199 -725 3986 2637 -719 1689 4517 2174 -95 1763 2558 -283 -485 1288
369 1288 -370 -2893 -669 2165 -1434 -4927 -336 2323 -2007 -4616 -1369 574 -1370 -1944 -1722 -1104
385 -1104 -131 1357 375 -1262 931 3568 2819 177 -470 2374 4584 1731 -1464 328 3338 2326
401 2326 -812 -2484 -1526 909 1594 -2701 -5413 -375 3019 -2211 -5581 -993 1469 -1019 -1090 747
417 747 -1601 -2064 2167 2407 -2064 -1780 3685 4804 1001 -1370 1680 3887 1706 -806 -24 2590
433 2590 872 -2146 -351 893 -2678 -4095 330 1938 -2977 -4486 333 1434 -3466 -3712 679
448 679 1783 -1297 -681 2302 1653 -1458 -686 2954 2841 -243 -441 3821 5342 -1050 -4200 2373 5889
465 5889 -1379 -4778 3308 4920 -4929 -6076 2419 -138 -7157 -1964 5748 -518 -7703 -1201 5305
480 5305 -902 -7198 -1483 6881 4971 -3976 -4320 4710 4892 -2668 -1896 6099 3284 -3118 2603 7182
496 7182 -4279 -9021 5405 10712 -4429 -10581 2794 9297 -2321 -10910 -5645 3746 3868 -2900
510 -2900 -5770 174 3059 -1311 -1766 1040 -2016 -2647 8512 10354 -6817 -12005 8289 14777 -5924
525 -5924 -13914 6517 16609 216 -11002 -1656 6261 809 -3897 -1200 1094 -1076 -745 2301
539 2301 -2123 -10401 -4674 10265 6677 -11814 -9065 12353 9922 -12500 -11230 9356 10595 -2786
553 -2786 -2632 4791 1367 -2180 2371 2085 -3569 -1189 5810 5789 -1696 -8703 -4316 7186 5480 -8382
569 -8382 -8506 7990 8738 -8252 -10569 2036 2557 -3328 1291 4566 -3129 -4716 5640 6227 -5771
584 -5771 -8373 5429 13214 2690 -9964 -3665 10774 6400 -8931 -6173 7965 6135 -4105
597 -4105 -2280 1321 -4503 -4040 5339 1741 -9705 -3414 9917 3993 -11211 -7781 5581 6018 -2555
612 -2555 -4416 1202 5216 3482 -2357 -3385 1364 4713 2769 1321 1142 -1011 -827 3246 1349 -5948
628 -5948 -3285 6684 5331 -4653 -6723 -208 1858 -1274 -3289 -1989 638 2159 728 -2353 -3590
643 -3590 -1861 2088 5141 1234 -5260 -760 8597 4465 -7893 -4735 8687 7932 -2239 -3058 1299
658 1299 1757 1618 167 -4356 -3951 3669 5219 -3823 -7844 -1151 4279 729 -4823 -4688 1288 5006
674 5006 701 -6212 -3812 3820 4665 -1226 -2882 1360 4691 3085 -902 -2890 664 4602 3107
689 3107 -1775 -1738 2071 2185 -457 -2515 -2404 290 2290 -685 -3900 -2324 1164 -21 -3503 -1715
705 -1715 1198 258 -393 674 -150 -1285 763 2228 274 -410 2057 2540 684 434 934 458 424 1564
723 1564 577 -1176 -296 702 -650 -1567 -1432 -859 -326 -500 -1482 -1560 -375 19 -1696 -1356 494 692 -104
742 -104 537 844 214 1440 1682 164 363 2430 1646 -441 64 1441 1059 120 -213 -53 365 775 -956
761 -956 -2458 -1416 496 -733 -2442 -2171 244 671 -828 -1894 -537 1410 1206 -762 -716 884 2229
778 2229 1182 -170 178 1568 1969 937 -383 314 1611 1072 -564 -976 -378 751 -141 -1500 -1460
795 -1460 -591 -322 -1075 -1716 -1283 -263 -80 -941 -1678 -43 1027 176 -226 603 1459 1332 644 586 1047
814 1047 1059 1210 323 131 759 676 374 -199 -10 276 -440 -877 -1042 -979 -766 -773 -925 -1185 -850 -274 31 -300
836 -300 -658 134 886 231 69 516 1070 1014 831 1287 679 306 1580 1109 -219 -750 490 865 -535
855 -535 -1248 -526 106 -266 -563 -1373 -1358 -548 306 -751 -2184 -1209 1201 390 -1435 -947 1054 1489 741
874 741 208 424 773 1708 1907 -32 -709 1305 2515 250 -1792 -513 1826 507 -1915 -1507 60
891 60 -217 -855 -913 -1375 -2033 -300 1481 -956 -3352 -297 2536 242 -2383 -524 1939 1657 819 380
909 380 -173 1120 2689 1101 -965 -209 1495 1549 141 -1238 -1397 -412 1230 97 -2765 -2348 1484
926 1484 1900 -2301 -3919 -408 2326 -201 -2753 -628 2010 640 -475 665 863 -1340 1076 4042
942 4042 511 -3434 661 5634 950 -4989 -348 5019 886 -3606 -1024 1742 -1152 -2267 441
957 441 -412 -2927 -248 2394 -883 -3664 -1330 2076 1256 -1662 -1984 1047 3236 729 -2805 -399
973 -399 3051 2156 -441 254 1778 404 -202 799 -74 -1520 -687 1692 1697 -2014 -3536 -27 3140
990 3140 -1635 -5485 174 4716 -934 -5497 405 3726 -2716 -2764 4171 2714 -4006 48 6244 395
1006 395 -5739 741 6424 775 -4227 847 4352 312 -3248 -1074 1472 152 -1461 -217 864
1021 864 -1104 -3049 -489 1034 -2020 -2474 1383 3072 -1566 -3026 277 1648 -69 -879 769 2455
1037 2455 2627 215 -1510 301 2452 -240 -1189 3032 2154 -2840 -1346 3231 -383 -5939 462 5848
1053 5848 -1126 -5975 890 4086 -3553 -5105 1994 2828 -2581 -1267 3329 899 -2911 -559 2840
1068 2840 1318 -1631 750 3734 1778 -2628 -1110 2342 1137 -1993 466 3008 192 -2505 -74
1083 -74 320 -2306 -1302 1533 -138 -1917 64 -10 -2089 -1322 810 -1019 -654 2396 1136 -2019 -225
1100 -225 3008 -402 -2409 2859 4447 -1237 -1524 2903 1350 -3324 -932 3327 372 -2516 683
1115 683 2132 -2162 -3553 -515 1049 -1344 -1704 862 968 -1834 -2427 755 1144 -1570 -192 2916
1131 2916 1559 -1979 -260 2276 -355 -1552 2103 3014 -737 -732 2307 37 -2977 268 2150 -1261
1147 -1261 -1688 1893 380 -3405 -1294 1228 -1491 -2383 1311 1408 -1673 -1001 1461 -376 -1929 592
1163 592 2258 397 -651 1653 1380 -533 -594 1252 1145 -22 118 1223 397 -1657 -319 1059 -386
1180 -386 -1944 513 1634 -1550 -2643 521 757 -2610 -1500 2052 371 -2129 352 2188 -1239
1195 -1239 -1989 2053 2171 -1347 31 2847 514 -1757 1046 2386 -676 -894 1826 1113 -1864 -797
1211 -797 937 -466 -1955 -581 857 -972 -1496 -92 -70 -1357 -1098 768 285 -1118 -315 1304 562
1228 562 -774 422 2081 457 -648 1236 1843 -864 -432 1779 118 -1630 631 1429 -1046 -1808
1244 -1808 723 581 -2091 -1209 1145 -572 -2302 -190 903 -1193 -1458 988 843 -1103 -511 1398
1260 1398 907 -784 195 1528 147 -434 785 1880 -71 -453 1078 1088 -990 -737 730 -54 -1540
1277 -1540 -370 500 -1039 -1335 5 -22 -1492 -1189 782 69 -1181 55 1230 -41 -852 830 1336
1294 1336 -140 -66 1264 841 -436 525 1313 -53 -650 754 1001 -685 -707 528 174 -1329 -465 320
1312 320 -853 -1457 -155 237 -848 -843 226 651 -728 -483 984 465 -692 288 887 496 -316 708
1330 708 1305 81 -92 1103 703 -581 -99 500 -58 -972 -201 -170 -689 -499 -184 -533 -663 -568 -5 -360
1350 -360 -766 62 78 -315 -187 547 588 -60 391 990 650 61 903 765 253 36 461 488 -180 -63 378
1371 378 47 -528 -610 148 -420 -940 -914 -364 -364 -836 -577 -441 -285 -341 13 305 167 109 486 243 18 585
1393 585 420 328 672 287 -93 606 872 290 -345 128 444 -661 -534 -194 -246 -559 -495 -480 -411 -652 -563 -364
1415 -364 -271 -306 -423 371 508 -107 -387 766 1065 99 -174 992 1136 -93 -327 744 606 -325 -250 683
1435 683 274 -1003 -271 368 -481 -1214 -786 311 133 -1161 -1196 348 302 -948 -739 930 780 -884
1453 -884 37 1260 184 -657 718 1913 257 -429 1006 1249 -429 -744 200 440 51 -555 -409 230
1471 230 5 -1009 -1181 228 143 -1201 -346 1007 -392 -1703 12 1095 -566 -1015 1086 1645 -71
1488 -71 -688 914 843 52 -292 556 1153 265 -824 109 784 -455 -1244 194 1213 -1131 -1664 677
1506 677 554 -1912 -1583 1115 880 -1519 -256 1310 -340 -1418 -94 826 329 167 806 991 788
1523 788 -252 -412 464 1240 -112 -508 1231 993 -1128 -1421 659 215 -1025 -164 783 -407 -1530
1540 -1530 -624 26 -656 -587 217 271 388 -436 -534 499 480 -524 -84 2088 1343 -856 -226 1494 -99
1559 -99 -1228 614 1624 -439 -946 1098 425 -1771 -804 634 -217 -1088 414 249 -781 -496 -459 -400
1577 -400 -150 235 40 190 784 209 -477 40 767 47 280 1152 816 -616 110 244 -540 -30 561 406
1597 406 307 165 -723 -1098 -218 -59 -837 -64 928 -276 -1573 -186 558 -1084 -997 1522 931 -701 301
1616 301 1394 -452 -1208 832 1079 144 151 1284 203 -590 149 395 -196 -299 359 260 -388 -443 -524 -703
1636 -703 -417 -371 -198 499 -9 -604 -408 194 -331 -483 736 638 -48 483 936 -93 -518 766 731 -168
1656 -168 231 1004 16 -936 409 36 -1326 -4 970 -485 -841 230 179 -1560 -1006 615 -99 -687
1674 -687 190 386 -623 -315 344 376 -61 240 761 761 68 150 46 301 225 -5 594 763 -573 -774 93
1695 93 -127 -919 -254 127 -350 -983 421 -47 -1097 -309 423 -80 -711 513 450 -312 -5 907 279 -301
1715 -301 675 1039 -181 -108 548 404 -362 -158 541 -48 -370 259 185 -576 -449 -354 -120 -368 -512 -37 -185
1736 -185 -547 -182 -113 181 -19 58 665 350 -320 361 761 10 -382 403 467 -452 75 960 -74 -305 252
1757 252 361 -391 -706 278 -123 -836 -386 221 -386 -809 6 97 -495 -197 23 -52 -365 60 632 351 -15
1778 -15 344 768 461 122 396 491 164 -319 327 263 -199 -70 401 -377 -410 54 -110 -490 -402 -115 -322 -650
1800 -650 -464 10 -244 -551 111 371 -314 -284 528 180 -208 180 582 143 -152 675 446 37 -212 600
1820 600 312 -265 -423 244 -92 -467 -243 170 -391 -509 -180 132 -270 -416 -42 -307 -125 89 448 168
1840 168 -7 385 337 179 351 571 267 -270 222 480 -101 -189 359 209 -375 -295 104 -264 -500 -302 47
1861 47 -293 -772 -207 328 -490 -611 -75 404 -377 -209 387 484 -54 303 414 157 103 -24 258 129 118
1882 118 514 102 6 21 144 -434 -169 -15 -151 -340 -255 -167 -242 -562 -479 -211 -503 -375 -41 74 -456 -152
1904 -152 484 505 -605 46 753 152 -325 279 751 -34 -398 447 413 -169 -395 432 9 -403 -742 160
1924 160 -233 -260 -381 -245 -260 -493 -471 157 385 -339 -126 236 330 24 171 446 401 -110 336 568 298 -33
1946 -33 -114 -41 120 96 -178 184 300 -201 -805 -265 241 -295 -591 475 89 -809 -489 136 -286 -787 -103
1967 -103 466 -94 -145 326 531 -33 -54 201 688 761 23 9 530 416 -712 -262 394 125 -545 -28 577
1988 577 -402 -893 10 213 -607 -487 279 408 -330 -241 -93 -13 12 -316 351 706 316 -141 -39 595 -38
2009 -38 -293 254 835 -168 -393 331 -154 -1043 -469 521 -91 -699 9 207 -779 -520 -202 -367 -99 471
2029 471 -90 -444 82 98 -508 75 751 176 63 805 755 -359 -294 453 331 -315 192 598 20 -637 -173
2050 -173 147 -532 -379 -249 -35 35 -399 -356 19 -364 -902 -57 655 173 -557 126 563 -296 -509 688
2070 688 648 -33 509 1017 122 -534 237 334 -69 202 568 45 -464 -126 -94 -678 -247 156 -208 -298 204
2091 204 -90 -883 -301 430 129 19 477 393 13 -143 -40 -37 245 251 254 508 195 -74 29 76 -49 -333 281
2114 281 421 -248 -293 312 -142 -560 -470 640 105 -293 116 249 -802 -407 399 98 -172 162 746 107
2134 107 -104 411 187 -306 390 709 -275 304 343 -66 -391 140 145 -297 -37 60 -227 -302 -159 -178 -239 -62
2156 -62 -250 -114 209 2 -50 -66 432 -319 18 737 385 -185 -1 593 129 -378 242 775 -322 186 513
2177 513 -262 -786 -75 210 -394 -327 144 5 -542 152 149 -234 -48 136 -19 3 163 388 -107 62 207
2198 207 235 392 273 185 235 155 117 -80 327 151 -151 241 278 -359 -392 117 114 -469 22 616 -235 -497 138
2221 138 -59 -643 -143 722 136 -190 231 654 251 -410 334 249 194 54 326 -80 -140 75 305 -40 46
2242 46 106 103 -244 -421 -312 -174 -147 -178 -61 -109 -290 -89 154 -126 -248 451 219 72 -162 244 423 -153
2264 -153 137 419 98 25 335 393 -129 -376 426 -89 -350 45 342 -360 -551 -326 -105 -221 -184 117 -27
2285 -27 -359 5 89 61 -262 -156 289 -58 84 152 427 229 210 151 111 -176 315 266 236 -17 58 -155 -344
2308 -344 -180 78 -24 -508 -265 -8 -484 -161 -29 -85 -42 -344 239 62 -52 55 193 -22 163 221 276
2329 276 -50 345 413 82 -102 187 386 -89 -104 35 50 -336 -161 12 42 -413 -102 78 -342 -300 -65 -32
2351 -32 -259 -377 229 311 -326 -76 451 29 -274 -79 375 218 -327 -24 135 131 -135 41 157 -248 -145
2372 -145 280 -133 -178 -107 -290 60 -502 -180 -140 38 -264 -110 -115 22 392 30 145 50 372 50 148 43
2394 43 321 74 -50 37 439 -3 2 138 -29 -93 -268 118 -7 -204 -410 137 73 -428 0 42 -218 -507
2416 -507 -69 67 -171 -216 13 -35 178 185 525 295 -151 0 65 132 82 172 1 265 -8 167 -12 217 -163
2439 -163 -271 -367 239 -341 -133 36 6 -334 -290 165 57 -32 -19 96 190 -112 -182 492 91 206 -22 191
2461 191 519 113 -1 -38 -15 -342 -217 185 192 -43 -487 419 -86 -532 -64 -198 -6 -172 84 119 23 5
2483 5 -120 31 48 -94 -98 143 134 -258 -225 263 215 -83 127 466 140 -48 -87 126 59 -55 2 32 -70 -210
2507 -210 16 -276 -362 10 -111 105 407 -337 -174 205 90 27 155 403 134 -69 97 300 -187 74 486
2528 486 275 -8 451 137 -117 -62 -180 -200 64 -89 40 -144 -8 66 -414 122 198 -16 -232 392 418 -393
2550 -393 -176 369 247 -159 356 336 43 8 134 29 104 147 -6 -40 -46 51 -272 -297 -2 -182 -153 269 117
2573 117 90 241 -18 -126 -451 200 276 6 286 282 -130 -157 33 69 -102 508 400 -126 124 309 -238 -213
2595 -213 166 -61 -223 78 149 -110 -712 -103 248 -34 -144 155 -207 -226 -66 58 31 -77 363 128 288
2616 288 374 -178 32 329 -1 -92 219 483 8 -269 312 -115 -577 112 123 -182 -62 359 -339 -301 -45
2637 -45 289 -351 -212 203 -31 -282 12 -131 -389 -204 406 439 -153 49 209 0 11 260 189 64 280
2658 280 75 -42 -252 -64 21 -111 149 -70 231 -45 -124 -417 -355 127 -328 -328 155 -82 -72 314 217 -167
2680 -167 -118 288 -29 -36 274 180 -46 -50 155 -30 -107 31 251 -15 -348 76 50 -398 59 -18 70 -170 -282
2703 -282 77 -282 -156 -142 283 -215 -42 347 -61 -3 -27 -12 100 -301 242 272 -114 -147 77 89 -107 -180 198
2726 198 184 -221 -209 116 29 -65 -100 -14 -13 -138 220 51 -365 -167 175 -67 32 390 69 -50 -113 59 -199
2749 -199 59 287 345 15 -34 211 241 1 -55 74 82 -91 24 70 -125 -300 -222 133 -211 -348 154 -108 -170
2772 -170 171 -23 65 -27 111 268 -28 -185 383 216 33 -52 75 23 -96 208 140 87 -23 29 -196 -290 -178
2795 -178 122 -38 -108 -161 155 33 -260 41 213 -371 -161 332 147 18 -134 124 35 -85 -157 17 128
2816 128 10 -35 340 71 -53 309 169 -18 63 213 -148 -149 -83 18 -246 50 112 -176 -177 103 112 213 1
2839 1 32 81 46 -171 -143 -45 84 22 23 308 -172 166 317 77 98 -52 -43 -292 -93 54 -160 -159 -36 70 -110
2864 -110 7 229 -146 -301 -68 24 42 -12 27 103 264 -51 -286 -21 -16 78 197 165 61 -22 -43 -63 -45 69
2888 69 -188 -75 -109 224 -71 -134 -397 235 -162 -90 73 49 -214 -50 39 184 -41 -51 263 -31 63 192 164
2911 164 -31 -48 -36 477 96 213 77 -44 -332 103 -52 83 -318 -199 92 77 -150 -131 -208 -109 -176 -256 -241
2934 -241 -258 -44 -30 -128 -81 -86 83 -242 -33 112 1 -48 275 14 -135 -38 -108 -65 -120 -74 108 -190 -15 -122
2958 -122 -90 -246 -149 -15 12 0 -138 -152 212 -277 -37 174 253 204 -342 -18 173 -133 281 267 184 96 131 234
2982 234 -284 -66 89 -262 -92 -154 -22 -91 18 -161 -304 -51 40 60 160 -79 46 50 -441 -27 -183 227
3004 227 75 120 -8 -101 -8 -176 -68 102 246 -94 184 -59 -100 105 143 21 -299 118 50 -116 -299 281
3026 281 20 -322 -127 -116 -127 -295 -14 70 -86 25 123 143 8 228 217 82 157 226 -118 74 30 -93 -257
3049 -257 143 9 -231 -136 -6 61 153 86 -7 -381 -12 -142 -274 -156 207 146 50 303 129 -228 -11 312
3071 312 -25 115 487 60 -95 235 188 -123 -87 4 -285 126 -23 -84 -149 105 -214 -47 12 126 -7 -185
3093 -185 -139 82 -239 -90 486 -22 -30 186 52 -14 -69 49 108 289 113 224 283 66 89 -242 -121 217 86
3116 86 -15 -138 -116 -387 -200 37 -24 -131 154 230 -140 -166 139 221 85 138 341 342 -53 47 -55 47 528
3139 528 108 34 62 147 12 -57 135 -115 -368 249 -168 -179 -434 -156 -157 126 222 48 -191 -131 209 233 65
3162 65 -66 101 -101 202 127 171 -82 -44 120 -37 160 341 -142 -132 200 -114 -153 21 334 83 -154 -71
3184 -71 -57 -38 236 -133 -328 -129 -152 -29 -249 179 -83 47 51 8 -333 126 321 189 -54 -160 79 -120
3206 -120 91 100 173 -205 -164 -132 67 83 -96 -159 -99 -257 -118 -191 -120 -72 -256 -9 -34 50 -43 197 138 -66 181
3231 181 137 -29 108 154 118 196 -25 57 201 -28 -69 163 -262 184 121 38 -181 139 209 73 -36 -94 -81 -235
3255 -235 16 116 -360 -97 328 10 -182 380 355 104 -36 -76 -43 295 -22 14 58 20 11 -127 119 -26 172
3278 172 -48 36 -327 -204 -123 -191 52 -137 -79 -97 75 -31 97 -160 -5 161 -84 108 222 19 139 233
3300 233 -33 25 5 -31 137 -2 -91 7 11 101 -191 -173 -76 -157 -127 54 -119 84 -345 6 49 -60 184 -52
3324 -52 55 -30 169 -243 -93 197 -40 28 210 -97 245 -57 -107 119 -45 144 -75 52 -304 -288 104 -1
3346 -1 -171 -173 -167 16 129 -23 16 -253 -20 -154 -92 31 26 116 197 71 -3 177 125 19 -5 -41 -13 14 203 -244
3372 -244 154 97 37 -225 -281 -140 59 6 -220 -128 47 -186 -21 294 42 146 307 -190 -100 128 121 80 171
3395 171 -105 376 -98 39 64 312 -300 -90 31 -47 -143 57 141 -138 -101 -308 -49 -104 164 -91 -115 -144 -186
3418 -186 172 -95 94 127 129 206 -36 256 -44 122 220 140 -16 -120 -78 126 200 51 -70 218 34 -184 -183
3441 -183 -46 -91 -86 18 15 -175 -116 70 28 -61 208 149 104 -178 52 4 -25 41 225 38 36 161 42 169 -58
3466 -58 228 -172 -257 -6 53 324 87 -199 60 -142 52 -25 68 1 120 167 22 -125 -110 -166 -77 -54 111 215
3490 215 157 -47 97 14 147 96 157 137 -66 -55 179 143 -25 72 -177 -34 70 -49 -39 210 -10 -40 -14 -74
3514 -74 32 -42 15 -26 -106 391 -119 35 169 273 -102 46 4 369 17 128 170 69 21 -146 18 -88 15
3537 15 -149 -104 -2 50 118 -259 -139 165 -184 -39 -117 253 -237 -44 -206 -125 -191 -46 399 -214 57 170
3559 170 88 6 208 168 1 -8 -245 49 -8 154 -47 -203 26 -3 -325 -144 203 -154 -353 22 121 -153 -173
3582 -173 98 160 72 -27 -92 64 251 228 324 70 222 161 -142 71 -88 -125 -53 199 -210 -173 -194 219 -246 -244
3606 -244 213 51 -106 -58 -23 -271 32 -96 -32 174 80 24 52 47 228 -255 66 110 -156 21 135 -239 -96
3629 -96 -182 128 -62 4 248 239 -128 -356 36 -83 -9 81 23 -15 -77 142 18 222 -85 74 181 277 357 -17
3653 -17 -202 -11 147 9 191 252 13 -22 -3 -113 -133 -1 -64 -29 57 97 -39 -89 -61 -87 -58 -22 -52 -87 -87 -70
3679 -70 16 -107 125 236 207 99 153 197 42 198 63 -167 -78 -24 36 -106 -35 -158 -69 -187 48 -170 -4
3702 -4 -25 -19 -171 -22 30 -55 150 -93 -124 -91 285 66 83 -74 122 173 124 67 -47 -16 45 -227 -179 141 197 -139
3728 -139 -122 -114 -28 -128 -97 31 79 22 267 301 -43 12 -110 157 -161 145 -145 -87 -30 26 -3 156 27 -113
3752 -113 91 53 189 -85 52 182 120 -184 -82 86 -372 -276 -248 -95 -183 -120 -74 -122 -35 0 99 -181 -47 102
3776 102 -115 151 147 -126 138 -142 131 170 132 112 -194 -67 -28 14 256 58 107 -71 -218 -282 -290 -99 -30 -84
3800 -84 -99 -28 -250 -208 38 145 -134 223 -51 46 158 -174 123 279 -118 66 231 -198 99 -14 -22 -66 201
3823 201 23 -73 -56 1 -191 61 -231 -103 -185 -61 45 -151 1 26 207 -49 -187 -119 -76 24 -100 -71 133
3846 133 60 132 -60 242 18 104 -56 12 243 70 71 166 -102 -90 -187 -65 -50 -160 -132 155 178 21 162 -114
3870 -114 -202 199 -28 -4 -128 0 250 85 -177 -124 -26 -29 60 193 -112 -112 -98 190 -55 253 -229 -194 184 -212
3894 -212 4 -69 123 -187 80 47 83 63 165 51 -87 -169 -144 103 115 173 -96 182 221 152 215 8 -17 -101
3918 -101 -33 -40 -387 -88 38 36 118 -313 114 -225 98 -145 -189 -208 -107 -155 -156 -5 64 88 -147 246 -29 -40 54
3943 54 391 315 14 -39 -200 153 97 -88 166 -13 15 -176 130 -37 -209 71 -148 -169 -53 -110 55 -263
3965 -263 -72 -117 3 178 52 -221 127 -285 105 280 61 -46 82 184 -375 -144 -6 179 28 -168
3985 -168 -45 239 -52 184 245 -153 -54 -175 -180 28 23 -30 -145 -229 13 93 23 10 -194 339 223 -20 117 90
4009 90 -101 13 -226 12 213 281 218 -246 31 41 -40 -86 -180 -77 43 -3 -17 -419 -281 23 150 23 -108
4032 -108 143 150 -195 -287 -104 205 108 229 282 -18 162 45 -300 -26 350 149 -183 181 -47 -222 -102 46
4054 46 -106 168 137 36 -64 -171 -10 -178 180 247 58 -280 197 119 -45 32 25 29 180 -89 468 13 -143
4077 -143 14 233 86 -8 -44 -52 131 12 39 -226 225 -310 -47 -36 37 87 -142 41 53 -72 163 103 -66
4100 -66 347 -19 -156 -170 126 -107 104 -19 -92 122 108 80 229 -214 -57 120 -110 76 10 -312 289 -122
4122 -122 -272 -450 265 81 23 144 -139 -159 11 74 51 160 -8 310 -315 44 -35 342 -21 -225 157 125
4144 125 65 -172 -69 28 8 -68 -62 -87 57 72 -252 -298 43 -92 40 -32 21 -52 132 179 -99 443 18 158
4168 158 81 219 -37 -194 42 173 -192 237 116 -163 -99 95 -64 -12 -202 -75 -43 -176 -91 -10 -85 -277
4190 -277 -147 3 -222 147 7 -74 3 -30 -46 25 181 80 133 43 38 36 59 6 9 -176 -5 98 99 -144 36 81
4216 81 -189 -176 -267 -230 159 -164 -26 32 -101 15 -76 -168 52 219 51 52 96 -126 202 149 -110 19 390 41
4240 41 87 159 48 18 55 -45 -167 -114 32 -178 53 -268 -99 86 -170 86 -76 -273 -93 -65 29 -59 -114
4263 -114 118 -32 -207 -99 38 -123 77 -22 -137 -65 -5 -68 -177 101 -35 75 20 40 160 -223 -230 -116 16
4286 16 -62 -63 36 72 -76 6 -74 9 323 314 13 -23 144 125 80 143 -71 -112 131 186 21 -125 175 60 -109 20
4312 20 -117 141 -172 -6 -108 34 51 -87 -147 7 121 107 22 -74 -179 351 -75 -1 -94 325 -23 -15 -159
4335 -159 140 31 -25 -94 21 -152 -106 45 -259 78 -222 -146 -237 -2 146 66 -138 32 -86 41 -82 243
4357 243 -88 22 151 327 -156 14 56 161 -53 -3 -4 115 342 -40 -157 -113 187 -138 161 -79 38 43
4379 43 -41 38 190 -178 310 149 173 182 323 109 60 316 -106 -97 102 -168 316 113 186 167 246 -167 -57 -114
4403 -114 -144 202 -15 -119 -54 -151 -24 46 -135 -313 -262 270 17 14 67 14 24 -104 171 75 -60 164 -63 -46
4427 -46 26 -177 278 25 -136 -275 13 -220 122 -113 171 -78 -89 13 3 -86 -267 -36 -48 -24 5 -87 -85 -67
4451 -67 -175 42 -75 -167 -65 109 -147 84 80 -43 96 136 39 58 339 121 117 205 -100 -17 110 224 -113 -154
4475 -154 -99 -174 89 97 -119 -200 -190 -76 364 -134 48 128 168 156 -155 -42 84 135 -188 240 20 369 138
4498 138 12 27 24 148 -31 1 80 -168 267 -29 -155 -131 91 -37 -181 201 -240 -22 94 102 -72 56 80
4521 80 112 153 236 11 296 -86 133 96 20 83 -42 -211 150 -71 16 -440 -224 -5 34 180 67 -283 -127
4544 -127 -18 202 -24 33 -100 -55 8 -213 -164 -24 238 59 84 285 95 -231 -122 101 69 -156 584 179
4566 179 41 -121 93 -95 -107 -275 172 -68 193 62 -120 97 -368 20 -292 -159 182 131 130 68 -47 -245
4588 -245 24 220 176 224 -31 -212 -49 -82 14 -97 144 -218 195 26 -113 -193 -332 -44 -138 16 -211 -245
4610 -245 -80 -227 -52 -11 -24 -37 269 65 91 91 90 100 68 -7 98 208 150 41 -29 140 -2 -185 77 20 -28
4635 -28 50 148 -53 73 -54 -219 -217 187 -295 -133 -226 -150 223 93 15 -24 226 176 97 119 214 -55 -50 197 -80
4660 -80 39 34 25 -362 127 71 -238 -244 30 -418 -175 28 97 -116 -159 -7 -92 -87 34 -61 30 64 125 180 135 204 108
4687 108 165 -255 108 -98 -17 -14 65 40 -131 -151 98 -39 -8 -258 -439 -247 -201 -90 -186 62 -366 -239 31
4710 31 -142 -68 157 85 291 -141 -97 128 194 182 190 39 36 167 102 -14 152 141 245 3 19 63 128 -22 138
4735 138 -163 20 29 134 -215 -49 73 -195 382 38 45 197 122 -74 -117 245 257 -163 127 -140 -87 -73 109
4758 109 -141 82 131 -2 -70 34 -178 3 -125 -6 92 -218 81 -336 66 -118 -95 65 -179 233 154 136
4780 136 22 162 23 207 -182 16 -190 -2 258 196 95 -292 126 38 -39 110 75 -14 -132 -11 -33 -44
4802 -44 102 -47 -56 272 -86 -102 0 90 -121 222 -119 -54 155 -4 85 318 81 166 9 -101 110 -97 151
4825 151 117 -67 111 -22 -254 -11 -118 -108 -249 -192 -77 -244 39 12 85 1 -133 -191 150 100 -65 132 113
4848 113 -24 -3 9 -42 -24 74 -114 147 -89 -51 99 71 163 -37 197 -220 232 81 -4 -110 -52 81 125 153
4872 153 -40 282 101 0 -404 263 107 141 291 16 119 6 214 -100 -53 -132 150 -103 -135 18 52 -262
4894 -262 -392 -141 1 -165 57 -14 -253 -18 226 -150 1 316 146 -34 48 135 177 233 -145 28 189 -107
4916 -107 -16 -238 -2 -47 -125 -244 -222 123 110 111 -39 -249 -74 24 -180 -120 -43 22 77 -287 -128 116 147 -66
4940 -66 30 12 155 92 147 51 -92 -87 145 -77 -161 -103 -123 -1 144 -23 35 23 -21 -7 214 -34 -40 -234 -243 -42
4966 -42 -82 -74 357 -7 62 61 35 213 16 25 -213 -50 -28 -6 32 92 -247 20 -132 37 -183 96 -87 -47 -239
4991 -239 -87 124 5 97 -50 -163 76 184 90 -181 -70 51 16 154 32 49 154 315 13 58 -22 94
5013 94 -287 -85 34 56 18 21 116 -34 -8 -113 94 129 135 -145 -71 -90 127 -210 140 74 -79 198 -321 -194
5037 -194 -81 11 413 141 -215 -306 -121 -96 17 -74 0 -401 42 86 -17 78 -167 81 -207 72 -77 -181
5059 -181 -98 16 -109 -62 -83 -17 83 69 -123 72 103 137 -93 -102 82 42 -33 -50 96 144 27 162 27 34 177
5084 177 -192 -316 -34 3 -30 -280 -177 -116 -249 -135 160 260 -239 -208 -62 -34 -5 -68 -25 -2 327 54 -211
5107 -211 -14 181 201 -70 132 230 -297 72 119 103 95 -180 129 203 104 -92 -312 -29 193 -111 4 66 153
5130 153 -78 105 9 14 39 460 182 -70 128 -155 -133 44 36 242 -301 -106 249 29 -104 58 149 -71 137
5153 137 -167 100 -150 309 189 22 -2 225 203 -77 72 98 -226 -73 131 233 229 -30 -309 -252 321 -43
5175 -43 41 26 34 149 -212 -130 -34 -14 66 -122 95 -63 -122 -245 -88 33 -254 61 -46 71 97 78 -125 -32
5199 -32 263 -22 288 -19 111 154 -292 -154 -40 20 145 75 -58 99 39 -17 -11 101 -43 38 161 -34 -123
5222 -123 -229 -68 51 139 -120 -61 -111 138 -132 98 89 93 -50 20 -1 -58 -66 37 -219 -54 -166 39 -233 163
5246 163 195 18 40 14 -237 10 87 -8 -135 -172 35 -210 -56 -72 129 117 -178 -43 42 -189 107 295 48
5269 48 171 8 111 195 200 221 279 -71 -118 -120 -48 -90 137 42 -62 -88 -122 189 162 277 79 1 -313 222 -227
5294 -227 -55 273 -57 -156 87 140 232 139 175 -65 3 30 140 23 157 37 -6 -8 -39 -61 -248 -38 -62 -147 -178
5319 -178 -143 -92 -149 46 -131 246 65 189 165 305 -3 -114 -99 35 156 -34 120 -296 -20 -112 59 20
5341 20 31 -181 -56 155 -80 33 -91 -81 -9 -144 -96 -377 -55 513 -152 -6 -41 -118 95 262 -29 -269
5363 -269 273 -42 200 297 46 309 99 -92 -40 86 106 -182 -53 -153 52 127 -4 -101 108 157 -205 -96
5385 -96 -187 15 -18 192 108 9 321 -87 183 58 183 151 -32 -65 -129 102 1 221 124 139 3 -105 -62 -26
5409 -26 80 -6 -262 -5 107 128 -4 -25 -141 59 33 -32 13 -193 -154 153 122 322 49 -53 -67 -56 89 300
5433 300 39 -23 -51 90 12 56 179 55 -110 -27 -63 -181 27 -83 -81 -165 64 67 94 3 -63 132 186 -173 -27
5458 -27 -87 241 -73 -28 75 -21 -78 -43 -160 131 -188 48 -16 -267 407 114 92 184 -313 -314 -39 -113 -38 -46 72
5483 72 231 -274 51 -102 -40 269 91 106 133 275 -162 43 -185 226 106 -195 -99 187 25 -94 4 -104
5505 -104 38 166 -183 -165 -151 -164 -204 -34 47 -130 -12 -59 -16 3 110 95 -186 177 -84 19 235 103 52
5528 52 134 -13 59 63 38 42 -69 -21 -259 -45 69 252 19 71 -2 122 54 -43 -74 -582 83 -106 -162 314 214
5553 214 107 40 15 148 -78 407 277 -147 54 -62 203 -159 -98 82 -151 -200 -243 256 -243 113 -114 -178
5575 -178 203 12 -223 -267 155 -73 -37 -118 156 154 -205 49 -5 156 200 -40 281 192 217 -93 177 -39 -55
5598 -55 -98 -8 161 101 -29 29 -194 -62 -232 -185 -164 -328 25 -199 -11 -199 -141 -165 15 -254 -179 -180 -52 -11
5622 -11 212 12 75 -171 138 -66 34 52 10 -137 17 174 -162 22 -276 98 -85 -68 -162 92 -18 2
5644 2 207 -36 121 -153 -37 -61 105 20 -98 -93 15 -38 -160 -77 104 30 20 -66 138 22 89 158 86 48 -88
5669 -88 63 -157 51 -66 220 -91 244 76 -97 10 78 81 56 26 -191 -107 43 -5 254 -89 -125 -67 -273
5692 -273 -51 109 -17 -57 -194 -240 -83 -52 276 38 -4 19 -136 34 -318 -177 -97 -1 95 -72 76 26 -66
5715 -66 -56 -255 89 -27 -175 131 -11 -94 -9 -157 -129 -311 -60 175 -59 84 25 -189 -198 40 -333 -9 178
5738 178 -165 -269 -213 -131 -277 12 -84 272 -65 209 -99 20 -86 -248 -153 -46 164 128 155 -82 16 -160
5760 -160 -127 193 93 -184 72 -221 118 4 137 -215 -173 115 14 -84 -62 4 39 -116 10 203 -137 86
5782 86 -27 147 65 -105 -135 195 51 101 -131 -59 46 18 28 -106 55 -80 55 6 -20 -69 -63 -97 240 -64
5806 -64 169 116 -149 122 170 -57 21 107 -93 211 55 108 -88 -96 154 128 115 216 -180 105 -52 -12 196 -481
5830 -481 -207 121 -111 -74 -5 -96 -71 -58 -347 -128 54 -119 90 -47 45 85 -13 89 -227 -301 -198 -18 -114
5853 -114 77 -13 -55 30 -107 42 14 -87 70 50 -164 159 -65 -168 32 -116 -291 -168 146 -106 104 19
5875 19 -317 212 -167 -130 14 -200 -57 96 -19 -82 109 60 1 -17 -76 -76 -147 -83 86 88 64 96 -150 -353 53
5900 53 -29 161 -78 66 -32 -232 14 -186 49 -170 -16 56 -37 110 -25 -1 202 181 351 10 -298 -68
5922 -68 44 108 -283 -56 27 -112 -16 -203 67 -136 -124 85 46 -45 -238 228 -118 99 -67 -255 279 -15
5944 -15 129 -31 100 -240 105 99 -62 316 -29 48 254 3 -127 -79 -112 -142 135 66 -101 190 85 11 -18
5967 -18 12 -13 -30 75 96 128 -81 -228 275 -52 0 -92 -188 94 164 31 -37 -197 -58 -30 38 132 -97 5 395
5992 395 138 -3 195 89 -141 -39 188 -94 -140 -77 -70 59 192 175 45 111 10 99 -67 -96 95 64 532
6015 532 -206 -4 30 -23 174 -42 112 -42 38 -168 -23 13 -425 -2 65 -175 -69 117 -1 76 18 172
6037 172 -3 126 -65 298 103 140 280 196 22 -7 181 -161 126 76 46 -142 93 270 -159 240 195 1
6059 1 -22 -122 204 -44 -10 -7 34 -154 -55 -217 -14 39 -81 74 -29 212 -187 173 0 49 -12 -134 -88 -110
6083 -110 -281 -98 -6 -35 101 -10 53 -180 139 246 -139 159 -111 222 28 -10 70 58 167 62 -23 -150
6105 -150 102 -57 236 332 259 11 151 279 76 -9 61 205 -93 -23 118 -232 -14 255 27 -53 -149 -74 -34
6128 -34 144 32 -9 -484 38 103 17 56 125 -77 -276 -137 118 40 197 3 -12 54 -114 131 -5 77 -58
6151 -58 -352 238 -158 34 50 199 -51 -70 24 179 5 125 -115 6 -49 -238 -106 5 222 -322 153 -200
6173 -200 -209 -216 7 -146 254 -11 -67 -71 -223 -182 -38 -85 123 -358 -155 -239 -53 -142 -189 104 -62 99 209 -104
6197 -104 28 18 422 -291 135 -246 89 164 179 -206 64 -28 -160 208 59 86 -176 53 -147 107 -178 22
6219 22 94 192 -190 56 -149 -17 183 -102 -101 -15 390 234 -223 -10 -45 -92 -63 150 8 259 32 -79 -230
6242 -230 62 206 -131 61 -4 -35 87 78 70 50 32 17 42 206 227 14 -120 -89 105 -163 28 182 158 111 -36
6267 -36 73 387 -172 -60 -20 34 18 -208 -1 -106 -239 311 -238 64 147 146 28 -62 99 -6 5 -90 -111 71
6291 71 -123 -72 37 -35 -35 -64 173 -198 2 12 -14 350 9 -30 -39 -345 201 71 269 -261 82 -96 -73 -75 55
6316 55 -105 80 76 -59 27 -155 101 38 -74 -19 226 -310 240 335 -30 -80 171 60 167 -240 -13 -106 35
6339 35 -112 30 34 107 -63 -13 106 -293 35 -62 -109 184 16 -67 -2 -184 -67 22 -86 85 103 191 80 -65
6363 -65 20 -70 99 -56 -117 -227 147 119 -8 -19 46 82 27 62 -3 -51 -262 -35 -130 -184 -120 53 60 -137 -218 -238
6389 -238 94 257 -143 -168 204 200 -97 -155 120 -106 172 25 -161 -16 -5 22 74 -74 -160 -76 327 -4 -123
6412 -123 -130 -151 -40 100 -131 108 57 13 111 -116 189 -294 211 186 192 34 111 -132 -15 132 51 54 -207 156
6436 156 -265 140 -19 -96 -88 247 10 -123 -73 -123 -209 -86 -21 254 -102 62 -110 195 -137 31 -79 17 72
6459 72 98 123 -42 171 38 86 -34 -190 230 108 19 66 17 -91 -86 -19 -57 -256 164 6 140 -28 -103 4
6483 4 -141 57 -115 -281 -321 -246 220 219 11 233 -138 -15 -154 50 114 19 89 -85 186 -22 -2 -19 58 96
6507 96 -119 -78 -135 49 -22 -21 -59 55 -34 -24 35 -54 25 -19 235 67 20 320 -145 -5 104 -58 -43 42 118 -59
6533 -59 180 92 27 114 64 -193 118 60 -135 -26 175 131 42 -125 -182 -99 5 159 -181 188 4 -58 119 152
6557 152 -125 112 -97 -76 72 -59 -19 -209 145 -154 -16 156 -5 290 -134 93 21 -134 276 -12 68
6578 68 -78 -22 13 -267 303 110 -55 162 -248 -79 -97 17 -53 -184 17 278 396 -70 -80 16 40 110 -87
6601 -87 -197 117 190 -54 -95 88 148 -51 -10 87 11 -6 -272 -174 116 -134 145 -89 -54 -118 268 107 4 22
6625 22 103 207 139 144 -50 139 25 -64 -195 113 -76 81 -95 -110 -11 -73 -192 -110 -91 27 108 35 -127 -35 -79
6650 -79 78 -69 -243 -9 36 -52 23 -3 45 108 71 -233 10 -102 -102 305 38 -57 61 -29 46 -72 67 139 47
6675 47 -16 -28 38 143 -131 -149 141 -305 98 132 17 211 -74 -35 -55 7 -125 13 -23 4 -239 -138 -105 -218
6699 -218 49 -9 -143 -126 130 175 19 -86 93 -75 93 184 251 102 206 -121 -54 -210 -97 38 -104 229
6721 229 138 93 -161 275 19 108 122 -120 -184 46 -133 -232 29 143 -195 125 -1 88 259 -324 -157 376
6743 376 -72 220 -50 119 197 -85 -31 -166 147 4 -25 265 -92 292 -77 177 -59 94 49 -83 -122 13
6765 13 233 -216 24 -126 142 -111 35 -103 -213 -24 24 -41 -233 -175 -76 -66 224 126 -104 139 -160 4
6787 4 -44 -132 31 -137 84 76 -168 141 91 44 -134 131 -69 5 -145 -142 34 -81 78 -73 -149 -114 -100 128 -26
6812 -26 81 205 107 116 384 -80 -87 -84 128 17 122 -5 74 -17 -143 64 -58 49 196 -28 102 -19 25 102
6836 102 -46 -127 -39 -16 95 -189 44 126 -68 163 -89 146 -59 -128 59 -6 166 -121 67 -147 -28 -107
6858 -107 2 -86 -117 -217 -268 -183 48 -15 -55 68 -64 -8 -18 217 -79 -11 80 359 41 -90 57 -227 48
6881 48 -227 -28 296 -214 85 121 -90 -9 -138 -175 183 18 16 -68 158 -88 -149 102 -143 -152 -135 -162 156 -44
6905 -44 -20 55 171 74 196 27 -54 -112 78 88 -143 9 92 -69 -29 -57 184 108 -145 139 -60 -34 -233 -207
6929 -207 149 -180 -44 -31 22 -15 47 -87 146 163 -37 74 -29 -339 -25 91 34 -74 65 81 -168 26
6951 26 163 81 -213 18 -171 -15 171 -112 -304 -3 -90 -187 -75 -25 1 7 63 11 -102 107 272 212 171 154
6975 154 -241 -25 -12 -155 -12 52 95 -48 -123 -286 54 -115 61 -73 -55 -40 71 -196 -32 84 -155 -20
6997 -20 -99 -104 108 20 68 10 -98 -12 -26 -196 -137 -184 24 183 1 102 159 164 -152 -2 -65 96 149 -115 74
7022 74 51 -142 -56 85 78 50 10 148 228 -1 -36 -272 303 -106 -127 -83 137 259 90 -26 183 372 145 -33
7046 -33 144 -131 29 191 3 25 -351 -67 98 -207 171 -195 103 -86 203 -132 178 17 -172 241 60
7067 60 55 252 -68 149 102 138 140 -5 77 121 130 37 25 141 27 -7 37 -81 101 42 -10 -38 69 -33 -107 56
7093 56 -158 -82 45 -163 174 -95 23 -128 -22 21 0 -53 48 -151 203 216 293 268 -217 24 -124 6 96
7116 96 17 74 -47 28 150 64 -344 -55 -283 -201 -89 248 -73 -185 288 14 -35 13 -141 67 140 -143 42
7139 42 -80 -151 -45 11 -334 94 -97 -125 125 86 -20 206 46 142 178 -249 -221 -139 -74 -154 4 47 -176 -160
7163 -160 168 -28 -85 138 -103 -80 160 189 -108 45 -339 257 -92 -30 87 -9 -160 -16 25 -98 78 155
7185 155 -174 -111 -99 -78 189 -96 56 97 -93 10 152 -199 -162 19 126 8 198 34 -38 148 162 -215
7207 -215 -6 -18 114 118 14 50 -126 236 -192 44 -162 -298 84 211 59 -14 -111 -38 34 -150 -169 68 -37
7230 -37 -27 -84 96 198 -124 157 206 151 257 144 104 84 44 -121 -137 105 -151 -75 56 -115 15 -67 -97 -122
7254 -122 -129 -113 -73 -97 6 -314 136 186 -26 49 0 105 79 -110 -30 -139 5 225 113 -221 -137 -64 17 -8 87
7279 87 120 80 -9 -69 -120 320 -192 209 63 14 295 -58 175 40 -211 -186 -89 122 -95 180 -37 113 204
7302 204 131 141 80 47 -167 110 128 66 -229 -57 125 -167 124 -58 -145 -187 -202 -203 -164 145 -149 -265 12 102
7326 102 177 -17 -47 251 -47 -59 301 157 44 116 48 6 36 63 -82 232 195 -215 84 -14 231 -41 -269
7349 -269 -266 -12 -50 -51 -30 26 8 -56 31 -107 150 119 -278 223 77 -41 -192 -89 -62 97 -192 -336 44 -36
7373 -36 254 -192 89 -134 -41 -159 -15 8 -173 93 197 118 -128 -63 -150 -127 -70 -72 -102 -140 -44 -134 94 122 357
7398 357 -4 21 -159 -140 74 61 1 57 -41 54 48 -108 -159 -56 -14 72 -178 94 315 132 141 -252 -44 -91 144
7423 144 -244 -83 170 109 34 -67 238 -50 -4 -49 70 54 68 20 -90 -143 -59 -3 153 -116 -148 -120 -14 -288
7447 -288 -175 30 24 -3 -21 75 1 28 185 51 169 -62 -29 1 126 281 118 180 31 191 -11 -11 20 -56 -19
7472 -19 -168 165 -15 100 134 269 6 -115 2 -174 194 -124 488 27 20 -136 26 -30 -48 -9 86 176 188
7495 188 102 -35 183 -204 -78 39 -155 5 82 286 23 -103 240 -164 -126 49 -26 -25 0 -249 196 -134
7517 -134 -192 123 203 145 100 -70 -168 208 -98 -38 23 -79 54 -26 -451 61 -7 142 39 -174 56 -65 -79
7540 -79 418 115 1 207 69 134 -59 208 138 -161 -28 251 59 42 -193 45 37 -1 160 130 -18 132 -54
7563 -54 -115 -70 -63 254 -140 -50 -153 99 132 228 127 -11 -120 -183 21 -2 19 -1 -20 222 117 -261 266 -11
7587 -11 -51 120 323 -74 130 359 -53 -76 -58 -363 -5 -65 -39 207 -46 91 140 -79 149 -10 117 104 -200
7610 -200 -4 97 77 -30 92 -129 107 -50 56 64 20 145 21 -81 113 -187 -116 21 56 167 -123 41
7632 41 -58 39 278 223 93 -25 -150 -142 -312 120 -119 -258 -36 -118 180 -59 -145 -139 106 117 -23 -118 16 26
7656 26 -119 59 303 -119 -75 42 -32 -173 -58 36 2 10 -113 195 3 25 -91 -164 -83 -169 -266 -7 -55 197
7680 197 73 -45 128 73 -110 -229 -61 -88 -58 -20 87 21 94 195 133 -188 -22 122 31 -115 -89 -1 169
7703 169 12 51 -47 175 0 1 73 -81 -28 -60 -86 -146 147 -77 -17 67 19 -63 -13 185 -50 259 103 140 25
7728 25 -245 -150 -214 -176 -13 -153 -9 -6 -45 -66 56 38 84 51 -89 -19 84 -140 -37 31 304 105 215 -30
7752 -30 -127 43 16 -107 107 24 -42 54 9 -240 101 41 184 304 63 84 -128 -166 -323 -115 -159 -34 -23 139
7776 139 -94 31 198 -278 -16 -23 16 107 65 2 43 -2 -13 143 104 253 137 -236 -171 -100 -57 -64 217 -132 -22
7801 -22 -108 -102 -141 -45 89 178 111 47 99 34 -32 186 -54 136 91 -152 58 20 85 -190 66 -440 -155 -101 -88 39
7827 39 -130 -68 -17 264 -3 -65 -46 11 106 -27 -39 39 151 -68 48 -71 -75 -56 167 -21 -125 -98 -171 107 50
7852 50 223 44 -85 93 238 -213 91 92 102 33 7 -48 -151 47 -121 10 223 199 -9 121 64 -223 178
7875 178 169 -41 24 43 -118 284 196 -190 86 214 -16 -79 -181 -141 54 -358 -25 64 46 285 75 -265 -184
7898 -184 -210 16 -34 120 -36 -227 -138 -45 -106 -13 60 5 -184 218 -158 127 84 -99 -129 152 -154 21 111 -74
7922 -74 143 183 -15 -29 17 -43 28 -21 -404 251 31 56 211 -168 -128 -8 76 -291 57 -51 104 -137 217
7945 217 -108 -180 -15 -104 -69 -313 -34 -153 142 -32 -222 18 142 187 183 193 -26 -64 206 113 -196 -38 197
7968 197 -83 -200 52 69 137 306 -136 27 132 184 -244 114 34 25 336 43 -241 56 18 44 87 -76 -72 -37
7992 -37 -32 54 71 59 -16 -82 -112 -100 -29 105 88 119 106 275 82 -177 39 -30 165 -358 -174 -76 49 182 36
8017 36 64 22 145 11 3 -25 222 65 -29 -194 0 -331 -153 50 92 68 141 -127 118 180 110 -51 0 -84 169
8042 169 190 237 -46 77 210 6 -156 -1 -172 -58 -24 49 -5 189 126 13 243 -54 201 153 88 95 -23
8065 -23 -66 -68 -167 214 136 -11 98 -66 -4 11 85 31 311 -68 36 -87 172 -102 53 -126 76 -116 10
8088 10 25 -127 -6 253 -66 -60 18 0 129 93 5 -119 75 -93 185 122 131 -87 -157 149 150 31 -184 293 -227
8113 -227 -265 26 18 -19 -151 37 -65 6 -206 -11 -214 -176 -92 -83 23 -88 -202 -155 45 -35 83 -155 -109 103
8137 103 80 -39 143 -161 44 13 18 -66 -121 137 36 17 -218 68 82 13 225 -240 -39 66 103 -242 -22
8160 -22 154 -139 -76 13 6 262 -79 -42 -74 -284 149 59 -178 -189 -77 59 -21 104 -46 -56 -51 -70 121 19 28
8185 28 -26 -27 -111 226 -88 85
8191H5
$$ Imaginary data points
##PAGE= N=2
##DATA TABLE= (X++(I..I)), XYDATA
0 0 0 0 0 0 0 0 0 0 0 0 0 0 0 0 4 -8 8 -8 8 -8 16 -16 16 -24 24 -32 33 -40 47 -51 59 -67 75 -87 98 -108 122
37 122 -137 153 -169 189 -210 232 -258 284 -314 346 -380 419 -462 509 -559 616 -684 756 -839
56 -839 933 -1043 1174 -1327 1517 -1753 2058 -2469 3052 -3935 5443 -8484 16962 -88151 -285128
71 -285128 28751 224207 12433 -152104 -24127 79022 43266 9878 -18932 -77837 -8071
82 -8071 128123 75863 -119354 -105809 94623 125031 -61099 -127443 12209 94991 17413
93 17413 -56835 -40091 376 31013 35586 -25459 -72981 2863 87178 14182 -78053 -20445
105 -20445 54446 5565 -29955 15449 7440 -35144 21737 71340 -25916 -86807 29218 99889
117 99889 -15362 -81544 19866 64243 -22322 -39756 24165 -2778 -50274 23909 69431 -41982
129 -41982 -93010 38785 96098 -37059 -97589 22049 85051 -3629 -55983 -3891 23777
140 23777 2011 6248 7144 -24806 -11971 46841 31519 -46465 -39051 43529 44479 -30709 -34271
153 -34271 24285 24145 -17102 -13008 2404 -12420 -5164 21933 -3225 -36004 4597 35268 -14978
166 -14978 -37382 20982 34069 -23991 -22519 34704 19093 -36847 -12105 36777 9059 -28877
178 -28877 1575 26521 -3351 -13455 14057 4541 -23394 4315 34349 -8106 -44956 4125
190 4125 45619 -7232 -52879 -4640 41246 5958 -31954 -11324 13272 7579 3068 -782 -16343
203 -16343 -4706 32261 21276 -31056 -25832 32195 33994 -22388 -30462 16717 26510 -5138 -13065
216 -13065 -937 -1333 4229 14841 -5308 -27352 750 29308 -3504 -35837 -5553 24698 1296
229 1296 -20747 -2240 10319 -1935 -1928 7930 -1618 -9099 8840 17742 -4550 -14750 7968 18055
243 18055 -4290 -12060 6690 9901 -6785 -3855 9209 -1878 -13711 3722 13509 -8233 -17027
256 -17027 5951 11547 -9147 -12413 3559 2726 -6061 432 3571 -7301 -3130 13216 6607 -12169
270 -12169 -3678 18052 10002 -12014 -5590 13348 7455 -7725 -3701 4629 602 -1327 3123 -2540
284 -2540 -8787 3101 9708 -7067 -14584 3604 11383 -6461 -14086 1769 8310 -3001 -6617 995
298 995 2518 445 2633 2348 -3249 211 9925 5764 -6886 -2269 11783 6207 -8500 -4183 7866
313 7866 3232 -7247 -2948 2318 -2070 -2735 1407 -1749 -5614 827 4543 -4196 -7775 2157 5226
328 5226 -3639 -5603 2405 4739 -943 -1508 3505 3506 -30 2161 4141 166 -861 3857 3424 -2668
344 -2668 -1881 4033 1161 -5081 -1770 2369 -2167 -5061 -533 784 -3714 -3243 1579 288 -3191 -1140
360 -1140 2165 380 -2013 196 1956 70 134 2686 1814 -102 2071 4755 1635 -1699 1697 4374
376 4374 -228 -3040 67 1542 -1192 -2687 -1970 -1689 -1129 -626 -1758 -3079 -1193 1126 -102 -2285
392 -2285 -2155 896 2810 233 -2290 616 3955 2596 -395 -711 1337 3178 3333 -313 -2381 2243
408 2243 5299 -958 -4466 191 2529 -1594 -2774 -1058 -2550 -3689 19 255 -4125 -3088 2093
423 2093 2649 -1826 -3316 574 3071 987 -1218 293 3207 2349 -645 612 3425 545 -837 2629
439 2629 4251 -853 -2936 1519 2396 -2687 -3910 891 1254 -2449 -2872 -111 -935 -4158 -2691 1103
455 1103 737 -2192 -1607 2463 3412 -1787 -3921 2997 6961 68 -3480 4221 6503 -3196 -4581 4387
471 4387 4078 -3636 -32 7091 382 -7565 -1710 5140 -1646 -8044 -1891 5423 1504 -7343 -6433 2453
487 2453 3449 -4490 -3854 4495 3659 -3670 114 5856 -2420 -6524 6777 11970 -3138 -8610 5301
502 5301 11079 -1661 -9795 -1132 8005 5119 -3361 -5718 366 3095 -2197 -4343 -575 -1444 -2832
517 -2832 3982 4827 -9401 -12621 7132 13535 -6986 -13868 7817 16623 -2163 -12891 349 9956
531 9956 2910 -3198 393 3849 1308 -255 1516 -817 -6470 -1275 10202 5148 -12148 -9409 10470
546 10470 7573 -14322 -12323 10222 10420 -6930 -7234 2997 1114 -3841 983 2738 -2076 80
560 80 6596 4714 -2711 -6221 295 9319 6537 -6743 -6244 8528 8617 -8504 -11026 4346 5994
575 5994 -3159 -1372 2961 -3824 -6342 2573 4052 -7116 -8105 5346 10458 -1626 -11632 -3180
589 -3180 10591 5967 -8698 -4927 10162 8440 -4204 -3612 3628 -310 -1521 6025 3559 -7144
603 -7144 -2790 9622 2535 -12251 -7437 7377 5952 -5095 -6528 460 3483 -126 -4927 -4688
617 -4688 1293 4330 1170 -1449 -687 -775 -146 3291 2304 -3068 -236 8167 5847 -4640 -5582 2661
633 2661 5010 -146 -2548 -184 1511 1122 -1377 -4210 -3920 -1036 1820 2639 -1838 -6737 -2193 5921
649 5921 1928 -9080 -4638 9108 6933 -4489 -4782 2489 3456 1090 379 -1452 -668 5771 6023 -3088
665 -3088 -6247 1610 6270 905 -5078 -3097 2339 3889 -1856 -7287 -4061 3869 3336 -3658 -4865
680 -4865 621 3060 305 -3182 -3378 664 4321 2330 -2233 -1120 3329 3111 120 -1262 169 3038
696 3038 3370 399 -2630 -1006 2123 865 -2750 -1378 1619 4 -2040 -1216 -1251 -2582 -1107 753
712 753 -1198 -2151 360 1569 -730 -765 779 589 701 1839 1372 -358 634 1951 948 -96 817
729 817 1360 1053 502 -282 -1093 -281 226 -1307 -1600 -38 -218 -1599 -1432 -696 -1234 -675 -100 -1316 -964
748 -964 1170 855 -1311 -189 1868 1590 462 533 1096 1504 1675 373 -521 710 1976 766 -1410
765 -1410 -995 1189 475 -1314 -1695 -872 453 -381 -2150 -2247 -307 315 -651 -1686 -661 856 1527 193
783 193 -855 583 2132 1413 -31 -104 1629 1706 1100 47 309 1009 1007 109 -1113 -400 424 -169 -1193
802 -1193 -1529 -620 133 -1065 -1687 -566 153 -612 -805 -590 178 -46 410 273 155 959 1395 937 585
821 585 1081 1402 990 467 404 225 509 -23 9 -440 -241 -54 -593 -732 -1532 -689 -480 -1027 -1788 -852 -178
842 -178 -482 -653 89 -85 -95 943 1063 -194 -124 1454 1759 497 -55 1098 1631 758 264 -56 -8 523
862 523 390 -668 -1749 -925 823 -198 -2220 -1702 -131 391 -1233 -1476 -936 -285 37 308 -750 -1105
880 -1105 1332 2454 545 -1548 593 3108 1432 -919 -195 1705 1402 -31 114 -117 -521 204 1610
897 1610 -1157 -3134 -623 1887 -876 -3358 -1390 905 370 -969 -1293 -852 272 1921 188 -1307
913 -1307 -127 2118 1809 92 -310 36 1401 2331 1060 -1472 -540 2509 2116 -1778 -3134 418 2673
930 2673 -698 -3559 -1093 1422 -208 -2106 -1021 -365 -1610 20 2328 -396 -3951 340 4991
945 4991 639 -4668 385 6244 1922 -3510 -194 3241 378 -1215 1060 1399 -1190 290 2432
960 2432 -884 -3614 -1019 2123 152 -2719 -2662 289 1596 -1040 -3659 -1296 2922 1440 -1704 -848
976 -848 1186 444 -594 832 929 -72 996 2923 2003 -1621 -1947 1419 3681 -675 -4553 889 5248
993 5248 -716 -6253 -152 3742 -2233 -4079 2448 2349 -4896 -2197 4567 -456 -6220 341 6487 687
1009 687 -5044 802 4950 547 -3027 -14 3236 1750 -274 383 1580 -87 -2032 504 1845
1024 1845 -608 -2117 1383 2394 -2498 -4286 -182 1619 -837 -1866 -140 1356 423 -1729 -2745
1039 -2745 -74 2399 363 -823 2388 2495 -1997 -1437 3816 1462 -3706 1330 6760 -379 -6012
1054 -6012 1109 5002 -2625 -4749 2191 3766 -2895 -2846 1924 -1 -4400 -1602 2558 381 -2656
1069 -2656 -113 2383 328 -3198 -1136 2873 1677 -1366 518 3395 749 -1948 779 1929 -550
1084 -550 6 2700 1150 -1484 -272 580 -1950 -1596 1103 -215 -1304 961 -42 -3337 -1474 1744
1100 1744 -398 -2816 1766 3406 -1798 -2556 2007 1611 -2465 -115 4552 1950 -1785 848 2743
1115 2743 -1109 -2344 1161 2613 -401 -1283 768 1106 -1948 -2270 392 832 -1369 -1105 1450 15
1131 15 -3177 -1413 1562 -111 -1900 1689 3196 -1113 -1520 2139 968 -1855 951 3300 93 -1380
1147 -1380 2085 1556 -2357 -910 2391 24 -1966 853 1529 -2338 -1944 905 -250 -2374 -114 1512
1163 1512 -658 -1725 78 470 -1431 -760 1294 1230 -66 -139 1532 702 -839 212 1873 1235 -773
1180 -773 841 1952 -410 -2000 989 1403 -1756 -1240 1902 483 -3064 -614 1005 -1517 -2769 902
1196 902 1719 -2188 -1181 2178 274 -2049 707 2503 -206 -796 1949 1497 -1262 -276 1882 723
1212 723 -693 746 1685 231 -1094 181 415 -948 -1085 341 449 -1430 -1052 286 -163 -1882 -378
1229 -378 1043 -367 -1257 377 1385 -905 -776 1857 880 -1065 831 2642 -30 -1203 1563 2119
1245 2119 -1045 -800 1783 499 -1638 -53 1150 -1048 -2022 601 546 -1767 -1308 663 -202 -1465
1261 -1465 -674 548 -81 -793 328 1025 -333 -508 1055 938 -421 -58 1555 953 -694 657 1557
1278 1557 147 -844 752 959 -805 -825 511 0 -1520 -1026 659 -697 -1302 102 453 -913 -813
1295 -813 412 288 -803 172 1443 110 -670 867 1417 75 56 1323 861 -485 209 1053 -22
1312 -22 -699 424 400 -836 -789 433 59 -1291 -1192 260 -170 -1279 -534 439 -510 -1083 123 818 -273
1331 -273 -244 786 633 -526 116 1032 572 -190 704 859 42 42 693 397 -568 -403 154 -271 -628 -643 -38
1352 -38 -854 -626 -296 -200 -919 -414 218 -253 -529 -255 540 -72 -71 513 870 451 370 911 549 280 293 593
1374 593 395 -146 145 324 141 -417 136 84 -385 -797 -590 -420 -821 -558 -341 -280 -470 -291 -29 -157 327
1395 327 149 243 282 715 155 74 720 890 489 -55 645 769 124 25 39 4 -322 -363 18 -383 -617 -712 -514
1418 -514 -114 -908 -1082 -297 395 -477 -945 207 716 -491 -701 710 968 -27 77 903 695 -473 109
1437 109 855 409 -333 -143 371 346 -732 -659 497 231 -1047 -849 489 233 -1403 -1296 665 -129 -1314
1456 -1314 22 1280 -186 -1130 710 871 -306 -399 977 1203 523 238 193 858 571 -644 -449 555
1474 555 753 -820 -697 887 -569 -1691 -438 1282 -811 -1729 392 906 -1149 -1488 397 579 -420
1491 -420 -421 727 870 337 -588 180 1531 372 -557 818 1832 -478 -1202 749 1134 -1198 -882 1636
1509 1636 722 -1722 -854 550 -592 -1842 -136 615 -178 -624 -130 -19 -236 -692 -493 592 1154 204
1527 204 -353 785 1132 -1047 -654 1597 1305 -457 347 1323 45 -1420 -158 696 -390 -471 192 271
1545 271 -643 -1257 -1053 21 219 -623 -583 1079 444 -1463 -825 1503 142 -1250 848 2159 -260
1562 -260 -734 1338 983 -1236 -342 1729 803 -526 465 653 -727 -830 -311 -237 -77 350 -460 -617 -95
1581 -95 -896 -1348 -356 421 -93 -282 726 451 -869 -447 337 362 225 1008 687 333 366 19 -424 381
1601 381 828 -48 95 1098 -208 -1501 -122 183 -828 -894 844 433 -1583 -683 629 -954 -1527
1618 -1527 455 1512 -381 -233 993 200 -554 128 1103 519 368 831 418 -359 -101 195 -120 227
1636 227 278 -38 263 -97 -745 -860 -113 -332 -695 -158 128 -634 -437 360 -553 -707 471 640 -242 232
1656 232 1100 31 -741 461 800 -285 262 1631 326 -790 355 392 -1007 -906 1144 234 -991
1673 -991 -268 272 -993 -1035 22 47 -344 -117 448 27 -446 -528 83 283 523 179 756 575 -26 -290
1693 -290 485 381 -46 466 959 126 -408 88 62 -743 -563 310 -98 -1016 -93 41 -883 -562 345 -21
1713 -21 -565 60 379 -195 -433 585 349 -334 230 824 569 -105 454 571 310 89 389 537 164 -21
1733 -21 -66 102 -353 -505 -183 -47 -625 -217 42 -396 -946 -204 265 -493 -408 266 273 -356 -49 799 306 -302
1755 -302 440 744 -13 85 881 481 -438 193 594 116 -518 276 149 -398 -626 30 -294 -732 -365 46
1775 46 -344 -437 -147 -25 -233 -200 -74 238 25 38 412 518 -48 312 422 176 28 451 530 -192 -115 214
1797 214 88 -471 -141 87 -129 -439 -137 -8 -725 -681 -61 -91 -451 -407 459 -100 -510 299 685 -187 -124
1818 -124 676 546 -224 34 768 353 -298 224 565 253 -263 167 144 -266 -634 147 -102 -499 -370 -255
1838 -255 -456 -397 -428 -77 -386 -359 195 169 -169 225 705 278 -31 301 380 -154 -45 564 208 -287 360 409
1860 409 182 -215 307 560 -458 -568 -26 45 -477 -670 119 -233 -666 -254 142 122 -286 135 286 7
1880 7 -55 415 378 -49 224 183 281 95 383 403 79 122 76 90 -167 105 -74 -220 -435 -207 214 -464 -654
1903 -654 148 73 -586 96 404 -167 -575 93 396 -68 -317 667 748 169 -80 672 383 -133 195 434 369
1924 369 -2 -156 190 77 -394 -285 75 179 -413 -676 17 -218 -639 -462 87 -19 -377 -19 209 -78
1944 -78 -163 -15 153 63 163 281 332 815 164 -102 344 638 -88 -141 310 505 -820 -511 431 -87 -1017
1965 -1017 -569 358 -308 -750 -4 38 -309 -16 22 487 470 43 -70 568 191 29 -11 734 364 -277 261
1986 261 753 -137 -671 350 685 -196 -373 227 98 -495 -564 -241 -199 -392 -269 39 -114 -219 -813 -308
2006 -308 147 -67 -120 156 987 33 -438 675 505 -514 -131 845 443 -481 280 193 -256 -454 46 101
2026 101 30 -262 -168 -484 -192 -228 -632 -233 549 -39 -669 98 156 -524 -499 359 541 -328 226 740 -45 -498
2048 -498 47 543 -63 91 290 307 22 -390 -382 81 46 -559 -102 418 -89 -737 -383 307 -686 -780 480
2069 480 443 -353 72 533 10 -679 353 632 263 -39 723 250 -235 257 110 -290 27 676 163 -216
2089 -216 104 -159 -991 -460 153 21 -9 128 -236 -572 -814 153 -265 102 200 287 171 247 -108 -162 425 517
2111 517 155 393 529 -251 -276 633 327 -595 169 728 115 -654 59 229 -578 -874 356 46 -560 -109
2131 -109 269 -284 -581 103 0 -497 374 620 -57 -238 161 123 -658 523 380 202 -116 517 -41 -317
2151 -317 -23 -126 -121 -58 -102 76 48 -219 -433 -188 49 -309 -298 323 223 -491 -462 393 -19 -514 633 673
2173 673 -130 -315 444 -31 -587 91 721 137 -76 362 172 -535 -198 207 -228 -434 15 -147 -401 -306
2193 -306 -64 -253 -269 80 51 -86 24 -146 298 -25 -184 262 319 329 113 335 302 37 -198 560 410 -175
2215 -175 8 460 -19 -594 -189 53 -488 -628 391 -128 -552 -340 169 -427 -463 81 465 -82 -312 446
2235 446 92 -102 83 692 176 -143 256 337 -90 -51 279 171 -240 327 204 196 -412 -239 12 -351 -333 49
2257 49 101 -402 -464 77 95 -376 -32 310 45 -194 89 332 -72 -127 565 137 -284 72 537 470 -67 135
2279 135 303 -268 -92 79 -128 -320 -243 -24 -331 -555 -116 294 -61 -240 -178 -106 -35 79 401 211 227 33
2301 33 237 177 -96 181 511 -108 15 445 210 -356 416 170 158 -332 -93 300 -221 -316 57 -50 -308
2322 -308 -293 -19 -203 -266 -39 5 47 13 134 -40 20 246 172 142 -5 239 225 -125 -131 325 328 -417 -141 39
2346 39 174 -198 -104 119 -123 -116 135 -19 -136 -552 197 -66 -421 -68 470 -28 -226 120 59 181 1 472
2368 472 365 59 42 335 267 207 363 170 146 200 -78 95 -26 40 -214 -199 -292 25 -195 -241 -163 89 -104
2391 -104 -100 154 68 -198 44 201 75 -89 -3 548 323 94 208 449 121 -370 -78 275 201 -370 -132 41
2413 41 -80 -253 -177 190 -346 -230 -169 -39 -432 -317 251 -29 92 -154 88 357 24 29 219 -7 464 195
2435 195 176 204 -16 20 160 126 82 -6 12 -42 -96 -202 22 -185 -165 -346 -167 -17 -88 -263 -301 261 -7 -105
2459 -105 111 513 117 -71 174 465 -227 -75 422 228 -60 -203 254 90 2 200 27 8 -338 -130 -122
2480 -122 -285 -136 -18 -71 -19 63 157 70 -149 -80 -255 93 209 -112 52 585 -151 -219 139 47 66 116 123 239
2504 239 33 20 56 -48 -40 -123 -267 67 -7 -437 -40 -25 -23 -177 35 161 -163 145 43 135 -525 -108 75
2527 75 -86 192 517 87 309 310 188 171 236 118 208 -48 39 182 -506 -94 233 -166 -294 109 -66 -535
2549 -535 -241 136 -39 -456 -77 328 -167 -251 25 -75 383 311 193 67 67 -11 -129 127 101 -4 -61 405
2571 405 285 98 -172 -247 -215 -130 131 240 -338 70 0 -426 -270 268 -125 -63 62 86 -324 -96 413 -189
2593 -189 -240 326 603 -7 61 381 -84 -375 145 272 -97 82 131 -98 -522 100 -163 -164 -219 37 -15 -48 -145
2616 -145 -212 -253 151 -19 -191 75 403 -139 -249 245 95 -73 125 201 -230 -100 359 230 -247 -78 300
2637 300 -11 0 79 -3 -208 8 -42 -331 -247 463 80 -268 -73 162 -120 -341 163 257 175 -33 344 -120
2659 -120 111 93 235 159 334 95 307 150 -116 -76 -221 -62 -75 -183 325 61 -508 21 -82 -284 -213 221
2681 221 -15 -93 123 -13 -175 -24 436 84 -54 130 463 -51 -478 310 168 32 224 156 -247 -186 10
2702 10 -84 -102 -280 110 -93 -147 -123 -35 3 -98 -267 64 44 -133 -109 257 168 9 253 333 -219 16 140 139
2726 139 -166 -51 218 93 -127 -158 322 -27 -238 291 118 -398 -59 160 -153 -17 -153 -123 -64 -85 512
2747 512 89 -274 225 286 16 -141 -88 234 -102 64 -153 84 93 157 181 286 -100 -160 189 -106 -286 46
2769 46 41 -259 -449 -220 216 -236 -51 -232 -46 57 131 -34 53 -37 -33 125 -159 137 339 23 -63 -99 195
2792 195 -142 2 14 30 13 51 99 -123 -138 -19 204 -8 -82 118 31 -371 -24 -119 44 -319 126 13 237
2815 237 -168 98 266 -89 -82 211 257 -275 2 223 203 256 -89 55 255 -478 12 167 -47 -186 50 68
2837 68 -578 -206 -82 -279 -192 84 -64 -107 -53 48 75 -208 80 128 206 -93 100 66 -171 105 109 108 -279 -34
2861 -34 276 15 -27 244 56 -215 -294 -361 -336 -294 -118 149 25 -51 -232 194 -86 -152 -32 -227 -76 146 269
2884 269 -104 -130 -8 121 10 -50 276 178 -182 88 44 -60 -304 -137 -18 -104 -255 185 128 -203 -11 -105
2906 -105 94 -178 -80 94 -79 -171 95 101 190 -139 129 121 -6 -105 205 104 -60 -17 28 41 -275 163 426 -107
2930 -107 -295 -76 -249 -283 -134 -123 -76 -289 -340 51 -14 -83 -91 30 -2 226 40 -284 214 426 264 -37 84
2953 84 225 340 141 135 -63 182 -39 183 131 -56 -395 -111 181 -343 -62 34 -13 -172 -162 164 26 -155
2975 -155 -197 162 161 -171 66 145 434 32 96 152 56 116 462 -156 -136 -129 5 -29 131 -119 -508 -178 -253 -139
2999 -139 -264 -104 -185 -155 99 63 -121 -221 25 167 42 -18 138 101 119 -47 -163 57 -53 -47 -24 218 94
3022 94 -403 24 207 -244 -274 50 233 -59 -318 -162 -294 -279 -201 -30 -83 -86 223 -266 8 -54 200 -58 -32
3045 -32 353 -91 -178 152 -123 43 44 305 9 13 -35 89 -32 -396 -23 -84 -75 115 -155 -258 -94 -369 55
3068 55 -182 45 -176 -45 242 77 -416 160 70 174 -40 209 33 -226 189 204 -126 116 95 132 -171 138
3090 138 -2 -410 -111 -30 -152 -257 79 178 -268 -236 264 29 -3 -42 420 33 150 150 -43 -48 -142 78 -19 69
3114 69 -70 -49 256 80 -59 -159 1 -218 -128 -273 292 -199 -183 -11 295 -81 -170 440 -283 -161 31 233
3136 233 -167 -117 159 123 401 123 -89 -30 268 157 -115 288 -144 -39 -70 -63 148 -191 69 115 -177 57
3158 57 108 -1 -237 -150 -164 -190 -163 -59 31 -3 98 20 -23 45 209 72 245 195 -36 -163 58 172 -18 141
3182 141 -39 26 34 -2 -69 -232 46 31 157 -200 221 264 -163 -99 109 -165 -91 27 232 -358 -68 277 -83
3205 -83 46 199 326 -217 9 109 -96 -289 99 102 -8 -85 36 28 -72 -5 170 -490 -242 94 89 -75 8
3228 8 44 -57 -70 -180 -30 12 223 85 141 221 76 -51 113 108 -31 244 47 -124 -7 197 105 -238 161
3251 161 31 -143 -78 34 45 -31 -61 201 -215 -143 -67 54 44 -211 110 201 -223 198 83 211 98 327 250
3274 250 7 260 8 -107 -1 158 92 131 6 76 -16 -176 1 -60 -211 133 -102 -64 -61 -326 -231 7 -93
3297 -93 -152 8 131 -147 -235 -145 158 -140 -194 280 -59 91 69 30 190 -96 -334 -39 101 5 -26 -359 -179
3320 -179 -179 -176 138 -149 -77 111 81 73 225 234 124 -93 108 137 23 114 6 -12 89 341 14 -218 -6 -2 144
3345 144 -67 208 132 54 -211 73 54 45 -21 126 13 -91 196 -29 -17 -237 -16 -113 -116 332 -242 147 -23
3368 -23 157 -144 220 -66 -53 126 9 -137 -24 -68 -305 2 45 -66 -39 -4 -184 -192 37 -162 -15 -51 -150
3391 -150 -85 -160 -140 -18 163 170 -38 -205 -199 75 -82 45 209 48 -96 -27 107 90 214 47 234 -28 67
3414 67 -162 -89 -354 93 -325 -105 -133 -52 173 31 -129 -221 138 0 123 141 31 -100 218 70 -129 -26
3436 -26 -200 53 -156 -49 29 -365 108 15 -180 29 122 -3 62 -34 -65 -84 -263 -229 32 261 -28 -79 -9 420
3460 420 132 52 100 282 -45 119 345 201 108 29 76 34 178 -100 -121 201 -116 -150 -72 -213 -308 72 -22 -110
3484 -110 -235 100 -123 124 49 -202 -24 -77 -192 126 -92 108 148 -247 81 349 86 299 160 -109 18
3505 18 3 -113 -110 -51 -162 29 -151 -164 42 -145 62 -72 -142 17 -21 -235 -135 -109 435 -24 -58 303 -145
3528 -145 169 363 -43 40 -106 -116 111 -57 4 153 56 45 94 -222 -289 -130 -52 -24 135 -74 -224 -133 4
3551 4 -175 -75 34 117 13 -124 -161 -50 171 36 34 -18 139 -10 60 10 -4 117 -124 79 -27 -221 -2
3574 -2 -30 -166 -259 35 228 -353 187 79 -123 -311 -131 -48 -126 -91 111 220 203 -195 41 123 168 77 83 -129
3598 -129 58 233 -17 46 109 -59 141 105 56 -92 31 75 -158 -37 8 86 -37 -207 2 20 -150 87 -25
3621 -25 -43 282 147 -144 34 316 314 84 170 146 6 213 -20 192 -69 69 -64 -39 7 -102 70 -92 53
3644 53 -272 -77 38 62 -47 175 -184 -247 -328 0 132 -164 4 80 43 -156 -31 294 -84 174 119 -8
3666 -8 234 -74 -69 62 113 55 178 -151 196 17 6 -137 -250 -249 -170 143 201 59 -161 -138 -131 60 121 228 -79
3691 -79 281 -167 -61 294 -48 -16 -41 41 -21 -156 78 95 -302 -280 -104 -290 28 97 42 -168 270 44 -30
3714 -30 -145 32 -179 17 134 238 48 -38 -13 -145 40 -15 188 71 190 -236 121 8 -124 225 -112
3735 -112 3 -100 -104 30 33 17 -335 3 -252 -114 -44 145 21 -243 61 42 -100 210 -112 7 47 -102 -115
3758 -115 98 98 163 31 49 25 -194 -4 46 -54 92 58 -52 123 -34 10 -155 -247 50 -44 1 -86 237 41
3782 41 4 64 168 34 267 42 -91 -80 -321 65 72 224 -6 34 -64 -28 38 -38 161 -213 -190 -39 74 120
3806 120 37 146 118 -264 -216 278 -53 232 -35 160 54 127 225 136 -231 -66 219 -83 -182 -82 -72 -51 -211
3829 -211 -198 -117 113 115 -49 -200 -171 -24 99 96 -221 -143 -199 -116 82 -167 -47 -153 -202 54 53 221 303 2 -49
3854 -49 1 -78 214 -37 -304 264 179 -218 -225 10 -96 -187 -178 33 -155 -8 -41 -223 164 -267 -23 -87 -409 182
3878 182 65 -255 -32 -63 225 -151 124 218 133 2 129 -20 -105 144 -90 -63 178 8 89 -66 -12 -174
3900 -174 -44 -128 -181 -94 -123 51 175 163 77 98 -300 188 -207 -199 -168 111 126 134 -113 -70 140 107 -132 218 219 -56
3926 -56 49 -100 -77 -77 10 32 -5 62 15 -279 -98 -175 -304 -132 -120 -120 -189 178 -25 199 90 -4 -96 170 177 -196
3952 -196 123 20 85 70 184 -24 101 70 -28 -42 25 -57 -144 -95 102 -292 -187 3 118 -23 24 96 -117 86
3976 86 171 -41 -133 63 416 -68 -255 -27 18 289 143 217 -69 -10 33 -124 161 63 87 -301 -6 167 -122
3999 -122 30 -39 -79 -312 -85 -201 -30 -79 204 305 -35 123 522 -322 -112 -58 -39 -85 -32 54 25 -41 -128 325
4023 325 -81 -39 -125 6 -71 62 19 -122 -288 -164 -122 -94 -36 -89 -139 195 144 -34 -82 -27 -193 168 112 -121
4047 -121 -90 -262 127 -105 -187 187 -19 112 293 6 -101 -14 152 -300 -73 -178 201 -85 162 -81 -94
4068 -94 345 140 -15 -152 -88 140 -18 91 40 183 202 97 -104 -122 53 79 130 98 23 120 123 -61 29 -9 -274
4093 -274 -77 -17 -47 -70 -15 -308 134 -80 -198 -140 63 -219 -82 210 337 67 -234 60 127 -7 306 194
4115 194 79 -228 23 -22 -71 293 34 -10 103 98 30 -98 62 108 -27 -88 130 -270 -50 178 49 -198 177
4138 177 276 128 24 -102 293 -209 75 94 -116 -140 166 114 12 115 74 -297 -71 -87 31 -354 -74 -100
4160 -100 -419 -142 113 -33 -103 92 124 122 -22 -79 5 -18 29 -118 -52 -84 94 -170 23 148 44 -157 220
4183 220 -47 -47 -98 -50 -102 -216 164 45 -68 -304 -206 -154 39 8 46 -77 26 -112 -188 18 234 -8 333
4206 333 182 -148 279 -229 -11 -16 65 93 -63 28 372 -156 173 -173 61 149 -134 35 -113 -165 -66 -117 -162
4229 -162 -172 -242 50 92 5 -228 189 202 139 188 97 234 35 91 25 66 197 79 129 -53 160 54 -15 -51 -20
4254 -20 77 -116 -433 -367 -195 -85 -183 -156 141 -242 91 45 233 -210 161 248 70 19 83 -108 348 114 -38
4277 -38 57 250 195 39 49 -56 278 168 77 -99 -113 -91 -56 -199 -94 61 -274 -141 -193 296 -105 -86 -42 -77
4301 -77 112 -58 115 255 153 -38 176 -130 30 -55 167 -32 114 -11 -117 26 139 -23 39 111 -456
4322 -456 -307 -24 19 -165 359 61 -40 -123 57 -27 3 20 -6 -3 -129 -128 -35 -22 160 -44 -185 145 111 78 71
4347 71 124 29 -96 -37 49 -111 73 71 -246 -207 32 -167 -196 -76 33 -342 -28 -71 -161 -64 84 -73 -28 -161
4371 -161 98 44 45 3 -92 -81 101 -3 -2 -71 -257 -268 82 -182 -329 -65 -277 -51 -65 -156 -92 -15 -2 -86 -8 316
4397 316 -257 -85 -45 -14 -2 -10 -129 -204 269 47 222 46 -53 58 49 -61 -59 -72 73 68 -12 16 -42 69 -161 -365
4423 -365 37 -10 -129 98 41 -178 -14 63 -129 214 -228 142 86 39 203 9 -31 -65 94 -119 -6 26 49
4446 49 217 -104 -101 26 59 -2 72 129 70 19 -116 -94 -129 115 -39 162 -63 -115 -114 111 -109 40 64 76 -82
4471 -82 69 -228 108 -288 193 -101 -129 50 176 -239 -275 154 -324 -89 114 -323 -207 -140 -55 90 203 -3
4493 -3 -10 -150 343 -201 -44 -7 80 115 65 -102 17 18 -265 -134 133 -168 98 -158 152 327 72 -240 19
4516 19 89 -18 -77 -144 80 -391 -44 -90 144 -266 68 218 77 -7 99 125 153 153 269 -1 156 103 -50 -166
4540 -166 98 -132 -229 161 -341 -74 127 180 -80 16 -155 62 -129 -59 144 -256 -20 -111 -177 -273 46 146
4562 146 -130 -11 181 -142 96 -210 56 -36 265 162 -67 70 -72 -23 -347 20 109 74 -47 212 146 13
4584 13 -44 -48 -77 -247 251 -97 -206 -63 60 -227 15 233 166 -109 101 103 104 321 -3 171 -81 -82 -168 -72 -55
4609 -55 48 21 39 52 346 -180 -45 -52 32 -96 -63 109 283 -111 138 184 -119 50 82 -81 98 61 -198 123
4633 123 -3 -157 129 -43 -232 185 46 74 -51 -146 43 -84 -67 121 57 -264 -77 18 -208 -110 77 -46
4655 -46 -79 173 135 87 -44 97 262 87 -45 126 99 -82 131 56 -7 75 -203 -111 -29 83 -165 -404 -23
4678 -23 -183 -422 40 4 -148 -122 13 28 -65 85 -285 80 -89 -45 -60 -41 19 -25 -276 91 200 -166 50
4701 50 -63 172 130 -14 77 -170 -409 -14 -41 -140 -53 369 -70 -124 -70 142 117 -128 94 17 -85 203 269 -64
4725 -64 161 114 126 -139 145 -108 -65 26 105 -50 -256 -42 -49 130 -118 -79 -138 -60 201 -188 -219 -6 -2 97 -193
4750 -193 -14 271 -69 118 -138 80 218 154 56 17 206 69 10 22 142 -52 125 168 -51 -168 109 76
4772 76 -116 123 29 -117 18 161 -78 140 -421 54 -87 -316 3 335 108 179 63 -97 48 13 152
4793 152 90 59 -98 -72 0 -162 -104 -136 -83 -151 44 -45 -327 -172 106 -88 -156 45 26 193 -60 107 -49 -110
4817 -110 256 78 -76 108 221 155 -90 52 8 59 225 -118 189 -11 50 -96 -308 131 252 -170 -251 107
4839 107 -60 143 -132 13 142 -29 142 128 -157 104 151 -133 -41 -28 139 48 114 70 -176 127 30 261 2
4862 2 84 -159 96 234 -176 -233 -129 75 -123 -44 87 -84 -123 -303 161 139 33 160 14 -127 277 -6
4884 -6 220 168 -66 -32 10 150 431 -1 58 66 -12 17 164 -88 209 110 -204 -39 63 81 17 133 -96 85
4908 85 -25 3 164 75 -7 55 296 46 19 39 -141 153 116 -46 -78 -64 -78 -95 168 -3 49 101 54 187 97
4933 97 -104 -138 279 92 52 -63 -202 47 164 -12 -64 -107 -155 13 -66 -38 155 4 232 4 18 -108 -20
4956 -20 -240 125 -24 64 226 74 83 -137 87 168 -6 59 12 13 -44 65 -70 247 -155 -159 -7 100 85 28 102
4981 102 -12 -86 205 -81 -22 345 137 -123 15 240 42 39 33 -99 203 -129 -52 -111 -248 158 -115 127 139
5004 139 133 174 -144 19 203 -26 -215 0 -90 203 79 104 161 21 25 -35 -77 83 70 227 -26 19 -98 4
5028 4 177 -100 -9 -24 63 -45 162 -48 -90 -226 188 30 -307 60 65 106 -25 252 86 41 106 320 -147 -128
5052 -128 107 312 -96 -8 305 -85 -221 -212 -34 -141 197 -46 22 211 39 12 -194 -52 -30 -161 -185 -172 91
5075 91 -137 -308 -154 -28 -48 256 132 -64 72 -189 -73 25 198 158 172 62 167 -131 -232 60 -205 167
5097 167 225 72 -149 111 -169 80 279 94 78 325 182 149 -82 -105 6 -158 180 119 -182 -86 249 -152
5119 -152 -97 41 153 64 66 37 -115 -410 -128 -89 -94 63 -99 -167 124 -121 -88 144 -44 168 50 109 -175 362
5143 362 287 248 -149 -98 -117 28 -122 -12 260 -2 -229 76 42 -20 78 207 -23 -1 -50 -9 -47 -310 -116 -82
5167 -82 -81 -43 123 -201 -118 68 90 127 227 -263 -30 -214 185 -181 -1 -72 -84 37 149 -111 -9 -116 111
5190 111 -18 101 65 -27 -170 -125 107 46 -150 -20 -173 -47 -97 140 -28 -380 82 279 -103 -205 334 132
5212 132 117 -29 301 -59 164 -1 135 -84 136 141 -23 -104 113 42 -237 -107 -177 78 -93 3 -22 -200 192
5235 192 -40 -7 34 -26 -89 -162 -132 128 100 51 232 -171 9 123 -141 -28 119 -141 -103 4 -28 -83 153 -134
5259 -134 76 -226 -160 -95 -10 -145 -230 -46 242 226 -160 91 470 57 14 262 -45 78 -67 24 6 73 116
5282 116 -212 82 -93 -225 -57 -159 -189 39 -121 137 87 -152 -86 -145 90 0 -48 -195 190 119 -63 46
5304 46 -116 -68 -68 179 -113 -95 61 152 -92 63 -217 -123 -167 -65 -121 -126 -250 207 58 152 -335 -73 -62 -154 -88
5329 -88 -44 -94 96 56 69 -106 69 -348 -36 191 18 10 193 -320 -252 -22 -141 69 31 -132 199 -186 317
5352 317 88 -102 -1 -25 105 359 270 123 44 -83 -142 49 -227 16 114 -242 -152 39 59 94 109 -187 75
5375 75 92 -2 308 261 10 -241 -49 31 -278 -108 19 -139 -5 -278 -52 -140 77 -230 -192 193 -108 -47 -187
5398 -187 -187 25 -28 239 244 -69 -33 -121 62 185 56 0 -38 -221 211 -65 -5 -205 -27 -141 -70 -155 149 17
5422 17 -177 57 197 -275 39 -254 61 -47 16 -6 -44 -93 -169 -37 88 4 -57 99 55 6 -165 69 44 47
5446 47 149 152 -365 -57 -86 -88 -1 -104 20 -8 86 130 167 50 -102 -265 193 166 139 42 -60 102 91 -32 1
5471 1 -185 131 284 178 142 139 -186 175 62 170 -180 229 -313 183 -30 -130 184 -40 27 -315 127 79
5493 79 47 37 74 246 -112 -131 -132 67 172 164 -227 74 41 131 -201 -164 -35 -73 -70 207 117 -7 5 88 77 -192
5519 -192 31 -116 -135 -136 121 40 35 -53 -174 14 -210 58 -52 -28 -132 -43 -175 244 -117 -121 190 213 231 -26
5543 -26 174 55 -146 -156 228 -57 88 -170 146 -2 95 54 82 -13 60 118 -126 215 18 -156 -45 -50 -236
5566 -236 -166 124 130 -181 -166 -84 -14 -17 -75 32 -10 154 143 75 268 123 165 -100 -142 115 120 -224 -198 -64 -124 71
5592 71 -43 220 88 -15 -28 -2 156 163 150 97 218 -51 12 87 -40 -71 -47 -209 -17 -191 69 -210 105 -82
5616 -82 -185 328 -70 48 22 -166 -88 80 101 258 -80 -59 -89 0 181 -180 69 11 238 -224 175 36 -120
5639 -120 24 43 -216 161 -154 -85 -397 -59 -111 -82 46 389 -42 -40 60 -13 -212 15 56 169 -16 -104 96
5662 96 -2 73 239 120 -177 149 -9 185 -48 -70 191 -203 154 44 -193 152 -188 -280 158 -193 -229 57
5684 57 -172 -69 -166 -83 -170 93 379 80 200 -116 184 -110 -57 -75 130 -23 -138 203 190 2 -173 1
5706 1 -292 -117 3 314 58 -31 -121 82 -79 94 176 -84 -86 215 133 -14 68 -211 -207 57 3 -154 -121 137
5730 137 127 -120 186 -62 101 23 27 82 -81 -67 63 120 131 237 -58 -35 265 -186 112 -61 41 -31 286
5753 286 87 -106 -154 43 189 192 75 148 -156 212 -3 126 -43 -12 47 67 -125 -84 267 59 53 -25 -175 -190
5777 -190 -58 -62 -211 12 8 -127 -167 23 81 -241 52 -223 -50 -67 -177 114 -155 311 57 -149 2 -62 103
5800 103 -38 183 -102 130 -253 252 -136 -124 -6 -198 -37 127 138 133 -215 -119 -232 -88 319 88 -40 225
5822 225 116 19 88 63 38 64 337 338 76 119 62 -65 201 -228 -174 115 150 90 10 -73 325 33 -77 -18 25
5847 25 122 71 34 -181 32 87 -133 -17 -40 -109 53 88 55 -8 -197 418 92 -115 82 110 -109 -121 -87 54
5871 54 1 -53 -66 -354 219 -99 -125 -121 -1 -48 11 70 -96 -126 110 50 4 -142 102 -101 176 44 105 122 -80
5896 -80 237 -53 2 -41 -256 -273 37 -17 -126 -224 -18 -189 -66 37 73 -36 134 77 33 9 -111 -112 -128 236
5920 236 53 -97 102 -103 -6 192 -87 37 24 -59 -123 -130 63 -37 193 -4 -48 -88 152 4 29 -95 161
5943 161 -65 -25 0 -7 53 11 -17 257 24 -15 88 -45 -20 174 -98 48 -236 -52 -55 62 -145 -83 -137 -144 -123
5968 -123 -38 -166 67 -157 -168 55 -95 62 -47 195 277 -2 -52 61 57 1 -137 -74 -105 11 -273 -82 -86 121
5992 121 -89 224 101 -83 -308 -81 4 177 288 17 -38 -81 3 7 -14 -47 34 -40 89 45 144 21 59 73 -174
6017 -174 -58 71 -283 33 -37 39 32 -62 241 -104 -77 -154 100 -69 -15 159 68 -56 -74 217 -26 -22 59 -89
6041 -89 171 313 -399 109 9 95 -87 111 -157 -173 88 -29 46 129 103 13 -41 32 288 71 68 145 233 -139
6065 -139 -149 76 -140 -11 166 54 -391 -84 -94 -237 41 -107 -19 37 -102 105 -203 45 40 79 -68 -132 -176
6088 -176 13 58 25 -368 -154 327 29 -131 104 -70 -12 -87 -200 161 40 -22 63 -199 181 -122 99 -102
6110 -102 77 89 19 216 90 239 -73 -117 231 -173 145 -6 -82 106 108 -96 -63 -70 -32 2 -410 95 293 133
6134 133 -217 -155 301 -107 -287 485 -87 -42 -228 265 29 -101 57 -91 78 74 142 310 43 -39 21 64 31
6157 31 -85 -86 164 7 17 171 0 -340 -205 126 -112 -84 42 -28 -222 153 530 -16 -194 -89 -41 322
6179 322 -95 216 -265 88 266 6 276 154 -127 -76 -55 32 219 155 183 158 15 163 37 -168 150 164
6201 164 93 -338 -107 -119 -195 -73 -22 -92 -208 108 -124 129 54 31 -5 125 26 50 67 -179 24 -20 -181 -65
6225 -65 -90 -76 -14 121 -35 48 -74 -32 -113 94 -45 -132 -226 24 183 24 123 -160 -144 145 -167 -66 -141 -58
6249 -58 -207 315 77 326 -39 27 -55 -99 38 -50 72 112 43 19 -167 -273 -121 -8 126 192 254 17 -31 129
6273 129 -122 127 28 78 34 81 38 296 254 150 27 89 74 -96 -87 1 -56 -123 -103 247 220 -144 -49 -49 -64 49
6299 49 28 -88 13 -56 84 54 -167 -141 -94 124 85 81 -48 22 99 -104 149 -503 258 2 -2 -95 38 -36 -93
6324 -93 113 6 -159 115 444 53 -22 -139 -37 215 -350 -121 -33 -24 19 -76 189 -18 -68 252 84 -115 -28
6347 -28 -88 -179 -8 -403 142 96 -128 -27 -48 -55 -166 110 104 27 12 67 -156 -25 285 182 199 172 -161 223 134
6372 134 -137 -255 84 22 -7 -20 -250 108 39 -251 213 76 -89 -102 178 7 -35 -36 -28 43 126 -90 118 -33
6396 -33 44 178 176 -83 -119 -110 227 105 -14 226 139 -61 43 30 84 -35 89 68 109 -11 -168 -5 -84 61
6420 61 143 -295 -357 70 -207 -72 -72 36 -71 72 -74 67 99 -7 -238 -348 88 -69 -104 -106 179 -87 -171
6443 -171 -142 132 10 58 137 110 -123 -65 -134 85 36 12 -4 -193 -13 145 308 58 -268 2 -7 -5 -196 128
6467 128 59 140 -21 -74 106 45 8 -107 -79 -6 16 37 6 -11 75 247 -30 -29 -74 151 65 -50 -151 -30 130
6492 130 130 -102 95 103 389 -111 160 -58 69 113 92 253 198 82 55 -153 257 296 -12 96 26 21 114 61 -85
6517 -85 93 -11 -61 -12 18 97 -160 -215 -181 -55 -70 -113 -99 81 96 -225 192 4 -26 210 -163 18 177 92
6541 92 -169 -25 88 -155 -295 21 29 34 -90 -107 113 -139 44 -612 79 -89 -62 -20 -11 1 22 157 -40 -187
6565 -187 -54 -104 84 123 -161 -171 -148 110 -161 -1 -53 -49 -101 -21 -223 -75 6 -108 -199 -21 -13 -29 -83 -37 -503
6590 -503 107 -227 120 48 44 -96 49 -49 -129 7 208 -48 88 156 133 -36 47 12 106 -12 -288 -182 28
6613 28 -214 -73 35 109 141 -301 139 -279 -104 -197 93 -108 153 -1 -203 84 152 48 5 41 -42 -148 -13
6636 -13 -21 -99 77 -149 135 -8 -181 52 -120 -95 -224 13 -162 -178 -16 61 205 142 -178 463 9 -201 -130
6659 -130 -78 147 144 17 159 -44 -129 -36 -3 113 -5 260 162 -67 -177 15 -126 -65 129 -37 -37 -42 -218 -184
6683 -184 -56 71 37 -69 171 100 289 -21 109 90 -40 -4 63 156 5 -19 -10 -235 -174 91 126 -68 116 -203
6707 -203 62 -235 -200 149 68 -287 133 -300 -187 -176 -62 108 47 131 180 297 -124 -67 -297 22 -1 227 -53
6730 -53 -50 139 12 251 30 -69 87 54 -164 142 -7 12 -162 -81 -174 -97 70 -104 -180 -157 -167 -224 -37 80
6754 80 -134 127 250 -126 -303 -59 135 -112 -46 -17 41 126 -53 -221 122 39 -118 110 -89 254 -24 96
6776 96 -203 121 21 -173 -16 154 28 144 134 85 -75 209 140 139 26 -235 -81 50 -227 -47 -5 211
6798 211 -16 -132 89 -49 -51 66 -136 -185 2 234 -152 2 -73 69 -116 -313 -58 118 87 -19 165 -168
6820 -168 -34 -37 103 -92 2 -20 233 127 -29 412 267 30 -277 150 13 -36 12 -36 138 152 56 -181 -178 -266
6844 -266 -107 -76 -57 -188 -159 -77 -13 138 135 -176 141 -122 -128 45 -46 78 16 11 167 -19 48 205 15 98 61
6869 61 116 -1 215 -108 199 66 -125 50 -203 -102 -33 36 29 -52 7 -29 -355 -32 -77 173 -165 -109 228 -76
6893 -76 -138 -63 216 78 -32 62 81 -40 212 -35 16 19 -333 -139 -158 31 -101 -31 -163 4 -16 -128 202 18
6917 18 125 196 -127 -32 -307 -8 -17 39 -81 7 -153 117 -302 23 238 77 22 116 -116 177 -138 -41 -121 -320
6941 -320 5 5 230 89 1 232 24 110 -61 86 30 -49 16 -84 -51 -80 29 -6 17 67 57 262 -93 -54 63
6966 63 34 279 -119 -161 -334 -23 94 -10 42 -8 70 -147 -182 -136 35 69 -163 -144 -117 -12 -1 21 165 209 15
6991 15 73 33 58 -32 53 -56 420 -87 77 -43 70 -75 110 -228 -10 24 -64 4 45 48 108 -213 -70 211
7015 211 25 -177 13 143 35 -172 10 -19 -117 140 37 65 46 -178 93 -104 -170 -13 103 -17 12 -119
7037 -119 166 93 -150 -45 33 25 128 55 -48 12 114 22 139 -45 77 -149 148 -59 -92 148 -57 -193 -35
7060 -35 -165 -77 99 123 -162 -25 102 -139 89 24 49 -6 334 -242 -245 -95 -93 -201 197 -2 -38 -53 -32 130
7084 130 264 -12 -19 242 -58 155 41 164 -87 -97 19 49 -52 -16 -78 -177 -163 157 -205 -117 176 -196 -121
7107 -121 74 76 96 -161 -119 -94 271 -108 -251 281 97 304 -111 135 131 -3 -238 69 171 27 14 28 -144
7130 -144 -65 4 67 16 96 78 55 122 -157 219 -41 84 -35 -4 153 -188 -203 -267 78 86 157 132 135 -19 -162 -78
7156 -78 -295 -105 96 193 276 366 -49 187 -114 -68 117 -71 -119 -81 -228 -77 44 -292 -19 228 -53 359
7178 359 77 173 -12 52 -87 47 93 -9 -132 -297 49 61 -147 96 -3 248 -255 -110 126 -216 -26 -60
7200 -60 -200 175 5 5 157 109 -216 -109 233 212 159 108 191 88 -236 -96 137 170 33 -17 96 -228 -39
7223 -39 -292 -18 101 -101 75 -98 -154 15 -253 -83 -160 -277 -78 -56 -277 208 -60 -90 122 -128 -152 -177
7245 -177 307 67 -101 -148 321 157 15 -223 -7 117 -155 90 115 198 -51 19 58 288 -249 238 16 52
7267 52 -46 -102 -159 -169 166 43 -61 -38 -127 -62 44 -192 -49 124 -28 -141 -271 48 -70 42 368 -66 -129
7290 -129 -146 -26 -4 -5 117 -96 -295 -214 -11 92 34 8 -55 18 -58 132 -165 314 125 -6 -44 102 249 106
7314 106 -1 -138 116 -182 6 -33 -11 176 -98 -291 -113 175 337 9 -85 85 176 -273 -115 71 -181
7335 -181 -198 125 -113 45 -76 31 -24 100 35 74 -43 -164 -219 146 -7 -83 -51 -127 65 56 -145 93 -146
7358 -146 142 12 226 -134 172 -65 -66 157 -23 275 -23 21 -26 276 234 107 -105 -71 -77 165 43 -68 150
7381 150 189 -29 -102 54 -104 -12 -75 2 -11 10 110 -125 -350 290 -276 157 53 62 -74 2 178 -15 148
7404 148 -30 131 143 -155 -18 -318 207 309 -45 -17 80 188 -79 195 4 140 23 9 -105 1 -126
7425 -126 -36 298 105 -60 0 -172 -145 54 -144 146 40 -286 -140 99 46 124 -175 93 -57 -51 102 -41
7447 -41 103 19 65 -62 -16 1 47 -124 -146 -3 15 37 -35 -106 39 100 -114 -20 -9 -99 -39 434 -35 -155 56
7472 56 -70 163 -53 112 82 111 -25 229 -98 -126 305 203 99 91 -116 86 -91 -17 -170 41 -313 -47
7494 -47 -15 -198 73 -64 109 153 -115 125 -110 -61 -164 -36 55 -31 313 -38 34 102 38 4 -116 20 -183
7517 -183 -142 114 174 -208 -177 -69 -181 164 -109 159 274 -121 145 19 12 -89 87 186 -119 -100 169 181 -79
7540 -79 -74 167 -40 256 201 -156 45 -90 293 80 212 58 -2 -53 -5 66 -108 124 138 -24 25 53 -142 -89
7564 -89 70 140 -1 -37 -5 -176 -46 65 -59 -31 10 -165 34 -35 -271 -310 95 -76 152 186 -10 131 42
7587 42 -107 -7 275 66 -40 63 -31 -123 -182 -70 -12 163 -149 188 93 -111 23 44 139 -178 42 -28 -63
7610 -63 -20 -149 19 177 -170 -40 -22 -88 -51 -24 -195 60 114 -85 -63 73 -117 -234 167 30 4 86 -57
7633 -57 -158 245 -169 256 291 125 14 64 117 -147 211 302 -27 -42 -64 -102 224 200 -173 -98 -155 14 64 16
7657 16 -91 54 -161 176 583 -44 -95 -51 -90 -329 9 97 -43 -153 -264 -15 -95 -57 -106 295 -33 240 117
7680 117 54 -136 -48 -9 197 -148 31 65 298 155 120 134 148 37 294 228 238 132 28 10 117 -123 143
7703 143 -63 -23 -123 236 15 -35 196 147 -116 104 204 -166 -114 43 184 134 -50 -212 101 175 -41 9
7725 9 -132 -35 225 110 165 -36 -233 -63 -76 -146 -1 -114 -23 7 129 -169 -143 8 -115 42 -236 152 192
7748 192 -193 273 -130 -91 -34 -109 132 161 -141 -55 -103 13 -11 314 130 140 -259 -25 -30 -56 -36 225 81 -207
7772 -207 -152 -45 -30 -33 -182 81 37 287 269 -230 -222 -203 -238 60 -133 -89 -35 -58 120 -99 183 172 -37 -135 13
7797 13 -164 -129 -79 -6 118 -65 178 -218 -20 8 -118 -93 143 20 -8 -96 -45 -122 87 29 196 23 -280 106
7821 106 -77 -130 239 -56 162 38 52 24 -106 -66 106 67 -56 181 48 -42 -160 96 -43 -186 71 53
7843 53 -108 -37 68 -149 -51 -163 105 50 10 -106 66 -301 -46 139 111 72 284 -104 6 -14 102 -42 -170
7866 -170 100 -23 -39 166 -22 -181 -85 -18 -17 -87 11 -18 58 -17 2 28 48 106 241 0 46 191 203 79 -74
7891 -74 167 115 118 50 54 -9 30 376 64 -38 -85 182 -121 -191 59 48 130 105 48 33 199 148 -60 -106 90 28
7917 28 241 125 43 28 -73 -159 184 -107 -37 -21 -114 192 -195 -1 107 -84 -11 -169 -83 -111 22 263 117
7940 117 -84 122 -154 324 8 75 67 118 62 -198 174 -49 -146 24 -233 69 141 80 115 -98 81 -59 -43
7963 -43 -143 -27 -75 66 37 -66 35 -454 -160 69 179 1 77 -82 -15 -118 -157 1 55 7 35 -16 -50 -98
7987 -98 93 -9 325 47 -65 -17 -149 4 43 -156 46 -101 -39 -75 -171 42 22 113 -55 -16 86 -168 102
8010 102 141 -49 19 -367 96 49 -75 56 -64 -70 149 109 -42 14 8 -14 63 -98 -96 -8 8 -26 -4 -16 178 -114
8036 -114 -1 -41 16 -163 -110 53 201 52 -19 -84 -9 139 -143 -29 119 63 -47 -71 2 -25 30 -75 -172 -44
8060 -44 45 129 -185 -155 -103 -78 -183 24 -27 -82 -2 176 -87 -122 -88 41 80 85 -35 -17 186 138 -16 26 99 55
8086 55 88 51 -134 -24 276 192 122 120 -153 -148 -148 -48 139 -101 -164 -134 161 170 228 251 -48 -214 164 -36 184 246
8112 246 -99 136 -7 -86 -68 -63 -18 210 100 249 273 7 -78 148 -50 23 98 236 -51 -425 66 -45 -29
8135 -29 38 -57 100 -3 -122 -124 42 103 -118 230 -94 16 269 11 -13 41 61 36 101 -46 16 200 -34 23
8159 23 40 -5 -98 156 -136 28 42 -89 -21 -62 -40 170 75 0 101 -95 -119 47 -84 217 3 -32 50 3 25
8184 25 -140 -67 57 234 123 68 119
8191A19
##END NTUPLES=NMR FID
##END=
