##TITLE=1H_Pr 53-3
 200.13MHz,CDCl3.
 8 sc
 
5.3.2026
##JCAMPDX= 6.0         $$ Bruker NMR JCAMP-DX V2.0
##DATA TYPE= NMR FID
##DATA CLASS= NTUPLES
##ORIGIN= UXNMR, Bruker Analytische Messtechnik GmbH
##OWNER= pz
$$ XWIN-NMR		Version 3.5
$$ Thu Mar  5 16:04:30 2026 Russian Standard Time (UT+4h)  she@DPX200
##.OBSERVE FREQUENCY= 200.1313
##.OBSERVE NUCLEUS= ^1H
##.DELAY= (6, 6)
##.ACQUISITION MODE= SIMULTANEOUS
##.ACQUISITION SCHEME= undefined
##.AVERAGES= 8
##.DIGITISER RES= 18
##SPECTROMETER/DATA SYSTEM= spect
##.PULSE SEQUENCE= zg30
##.SOLVENT NAME= CDCl3
##.SHIFT REFERENCE= (INTERNAL, CDCl3, 0, 14.3821)
##AUDIT TRAIL= $$ (NUMBER, WHEN, WHO, WHERE, WHAT)
$$ ##TITLE= Audit trail, XWIN-NMR		Version 3.5
$$ ##JCAMPDX= 5.01
$$ ##ORIGIN= Bruker BioSpin GmbH
$$ ##OWNER= she
$$ F:/spectra/data/she/nmr/H-C/1/audita.txt
$$ ##AUDIT TRAIL=  $$ (NUMBER, WHEN, WHO, WHERE, WHAT)
(   1,<2026-03-05 16:02:59.87 +0400>,<she>,<DPX200>,
      <created by zg, POWCHK disabled, PULCHK disabled
       configuration hash MD5:
       00 E9 B6 7A A2 85 ED C7 34 08 36 98 17 FE 4E 26
       data hash MD5: 16K
       3A 17 F4 F6 C0 19 BC 89 8C 02 57 16 79 44 D2 70>)
$$ ##END=
$$ 
$$ hash MD5
$$ 32 11 44 1E 8C CC 20 E2 CD 70 9F A4 75 70 13 89
##$RELAX= 
##$RELAX= 
##$RELAX= 
##$RELAX= 
##$RELAX= 
##$RELAX= 
$$ Bruker specific parameters
$$ --------------------------
##$DU= <F:/spectra>
##$EXPNO= 1
##$NAME= <H-C>
##$PROCNO= 1
##$TYPE= <nmr>
##$USER= <she>
##$AMP= (0..31)
100 100 100 100 100 100 100 100 100 100 100 100 100 100 100 100 100 100 
100 100 100 100 100 100 100 100 100 100 100 100 100 100 
##$AQSEQ= 0
##$AQ_mod= 1
##$AUNM= <au_zg>
##$AUTOPOS= <>
##$BF1= 200.13
##$BF2= 200.13
##$BF3= 200.13
##$BF4= 200.13
##$BF5= 200.13
##$BF6= 200.13
##$BF7= 200.13
##$BF8= 200.13
##$BYTORDA= 1
##$CFDGTYP= 0
##$CFRGTYP= 5
##$CHEMSTR= <none>
##$CNST= (0..31)
1 1 145 1 1 1 1 1 1 1 1 1 1 1 1 1 1 1 1 1 1 1 1 1 1 1 1 1 1 1 1 1 
##$CPDPRG= <>
##$CPDPRG1= <>
##$CPDPRG2= <>
##$CPDPRG3= <>
##$CPDPRG4= <mlev>
##$CPDPRG5= <mlev>
##$CPDPRG6= <mlev>
##$CPDPRG7= <mlev>
##$CPDPRG8= <mlev>
##$CPDPRGB= <>
##$CPDPRGT= <>
##$D= (0..31)
0 0.7 0 0 0 0 0 0 0 0 0 0.03 0 0 0 0 0 0 0 0 0 0 0 0 0 0 0 0 0 0 0 0 
##$DATE= 1772712179
##$DBL= (0..7)
120 120 120 120 120 120 120 120 
##$DBP= (0..7)
150 150 150 150 150 150 150 150 
##$DBP07= 0
##$DBPNAM0= <>
##$DBPNAM1= <>
##$DBPNAM2= <>
##$DBPNAM3= <>
##$DBPNAM4= <>
##$DBPNAM5= <>
##$DBPNAM6= <>
##$DBPNAM7= <>
##$DBPOAL= (0..7)
0.5 0.5 0.5 0.5 0.5 0.5 0.5 0.5 
##$DBPOFFS= (0..7)
0 0 0 0 0 0 0 0 
##$DE= 6
##$DECBNUC= <off>
##$DECIM= 32
##$DECNUC= <off>
##$DECSTAT= 4
##$DIGMOD= 1
##$DIGTYP= 9
##$DL= (0..7)
0 120 120 120 120 120 120 120 
##$DP= (0..7)
150 150 150 150 150 150 150 150 
##$DP07= 0
##$DPNAME0= <>
##$DPNAME1= <>
##$DPNAME2= <>
##$DPNAME3= <>
##$DPNAME4= <>
##$DPNAME5= <>
##$DPNAME6= <>
##$DPNAME7= <>
##$DPOAL= (0..7)
0.5 0.5 0.5 0.5 0.5 0.5 0.5 0.5 
##$DPOFFS= (0..7)
0 0 0 0 0 0 0 0 
##$DQDMODE= 0
##$DR= 18
##$DS= 0
##$DSLIST= <SSSSSSSSSSSSSSS>
$$ [...]
##$SUBNAM0= <"">
##$SUBNAM1= <"">
##$SUBNAM2= <"">
##$SUBNAM3= <"">
##$SUBNAM4= <"">
##$SUBNAM5= <"">
##$SUBNAM6= <"">
##$SUBNAM7= <"">
##$SUBNAM8= <"">
##$SUBNAM9= <"">
##$SW= 18.0517328524113
##$SWIBOX= (0..15)
0 0 2 0 0 0 0 0 0 0 0 0 0 0 0 0 
##$SW_h= 3612.71676300578
##$TD= 16384
##$TD0= 1
##$TE= 0
##$TE2= 300
##$TE3= 300
##$TEG= 300
##$TL= (0..7)
0 120 120 120 120 120 120 120 
##$TP= (0..7)
150 150 150 150 150 150 150 150 
##$TP07= 0
##$TPNAME0= <>
##$TPNAME1= <>
##$TPNAME2= <>
##$TPNAME3= <>
##$TPNAME4= <>
##$TPNAME5= <>
##$TPNAME6= <>
##$TPNAME7= <>
##$TPOAL= (0..7)
0.5 0.5 0.5 0.5 0.5 0.5 0.5 0.5 
##$TPOFFS= (0..7)
0 0 0 0 0 0 0 0 
##$TUNHIN= 0
##$TUNHOUT= 0
##$TUNXOUT= 0
##$USERA1= <user>
##$USERA2= <user>
##$USERA3= <user>
##$USERA4= <user>
##$USERA5= <user>
##$V9= 5
##$VALIST= <valist>
##$VCLIST= <CCCCCCCCCCCCCCC>
##$VD= 0
##$VDLIST= <DDDDDDDDDDDDDDD>
##$VPLIST= <PPPPPPPPPPPPPPP>
##$VTLIST= <TTTTTTTTTTTTTTT>
##$WBST= 1024
##$WBSW= 4
##$XGAIN= (0..3)
0 0 0 0 
##$XL= 0
##$YL= 0
##$YMAX_a= 216282
##$YMIN_a= -240568
##$ZGOPTNS= <>
##$ZL1= 120
##$ZL2= 120
##$ZL3= 120
##$ZL4= 120
##$ABSF1= 10
##$ABSF2= 0
##$ABSG= 5
##$ABSL= 3
##$ALPHA= 0
##$AQORDER= 0
##$ASSFAC= 0
##$ASSFACI= 0
##$ASSFACX= 0
##$ASSWID= 0
##$AUNMP= <proc_1d>
##$AZFE= 0.1
##$AZFW= 0.1
##$BCFW= 1
##$BC_mod= 2
##$BYTORDP= 1
##$COROFFS= 0
##$CY= -3
##$DATMOD= 1
##$DC= 2
##$DFILT= <>
##$DTYPP= 0
##$F1P= 0
##$F2P= 0
##$FCOR= 0.5
##$FTSIZE= 0
##$FT_mod= 4
##$GAMMA= 1
##$GB= 0.15
##$INTBC= 1
##$INTSCL= 1
##$ISEN= 128
##$LB= 0.25
##$LEV0= 0
##$LPBIN= 0
##$MAXI= 10000
##$MC2= 0
##$MEAN= 0
##$ME_mod= 0
##$MI= 1.114404
##$NCOEF= 0
##$NC_proc= 0
##$NLEV= 6
##$NOISF1= 3.799351
##$NOISF2= 2.8
##$NSP= 1
##$NTH_PI= 0
##$NZP= 0
##$OFFSET= 14.38212
##$PC= 1
##$PHC0= -3704.358
##$PHC1= 10.79232
##$PH_mod= 1
##$PKNL= yes
##$PPARMOD= 0
##$PSCAL= 0
##$PSIGN= 0
##$REVERSE= no
##$SF= 200.129724274929
##$SI= 16384
##$SIGF1= 3
##$SIGF2= 2
##$SINO= 400
##$SIOLD= 16384
##$SREGLST= <1H.CDCl3>
##$SSB= 0
##$STSI= 0
##$STSR= 0
##$SW_p= 3205.1282051282
##$SYMM= 0
##$S_DEV= 0
##$TDeff= 0
##$TDoff= 0
##$TI= <>
##$TILT= no
##$TM1= 0
##$TM2= 0
##$TOPLEV= 0
##$USERP1= <user>
##$USERP2= <user>
##$USERP3= <user>
##$USERP4= <user>
##$USERP5= <user>
##$WDW= 1
##$XDIM= 8192
##$YMAX_p= 0
##$YMIN_p= 0
$$ End of Bruker specific parameters
$$ ---------------------------------
##NTUPLES= NMR FID
##VAR_NAME=  TIME,          FID/REAL,        FID/IMAG
##SYMBOL=    X,             R,               I
##VAR_TYPE=  INDEPENDENT,   DEPENDENT,       DEPENDENT
##VAR_FORM=  AFFN,          ASDF,            ASDF
##VAR_DIM=   8192,          8192,            8192
##UNITS=     SECONDS,       ARBITRARY UNITS, ARBITRARY UNITS
##FACTOR=    0.0002768,     1,               1
##FIRST=     0,             0,               0
##LAST=      2.2672688,     0,               0
##MIN=       0,             -240568,         0
##MAX=       2.2672688,     216282,          0
$$ Real data points
##PAGE= N=1
##DATA TABLE= (X++(R..R)), XYDATA
0@%%%%%%%%%%%%%%%%%%%%%%%%%%%%%jLoQqQqQqPnNoOpQqQqQj0J3j6J7j9K2k5L1
$$ 0 0 0 0 0 0 0 0 0 0 0 0 0 0 0 0 0 0 0 0 0 0 0 0 0 0 0 0 0 0 -1 2 -4 4 -4 4 -4 4 -4 3 -2 3 -3 3 -4 4 -4 4 -4 4 -6 7 -9 8 -11 11 -14 17
57A7m0N4p0R4j28J79k63M03o57J166k382O341m1018k04264J39898K75555m8475
$$ 17 -23 31 -39 55 -73 106 -157 246 -411 755 -1627 4714 -36304 -240568 -100670 174885 126410
74A26410j83829m1288R2213J8391j3763N9649k7743j09055j9357J31556N5691
$$ 126410 -57419 -98707 -6494 11897 -1866 57783 30040 -79015 -98372 33184 88875
85H8875j05196o5272N2432N4075m4773M597L8474l1284m4989K9909P0005m0342
$$ 88875 -16321 -81593 -29161 24914 -19859 -15262 23212 -8072 -53061 -23152 46853 6511
97F511n5652M1381M9018n8984m8356Q5397M0784q3983o5238R0116P4476r2456
$$ 6511 -49141 -7760 41258 -17726 -66082 19315 60099 -23884 -89122 994 75470 -16986
109a6986o5740P5656P3734p0382o2957N6554N7055l6736m2665M4806M321m4832
$$ -16986 -82726 -7070 66664 -3718 -66675 -10121 46934 10198 -32467 12339 16660 -28172
121b8172J8013O6200j6766j00685Q173J04906K0220r8665l3793P0964K7701l5581
$$ -28172 -10159 56041 39275 -61410 -53237 51669 71889 -26776 -60569 10395 38096 2515
133B515k1029L2425k801k7232K2955K3515k5384k4422M2230K0433n1440l2936
$$ 2515 -18514 13911 11110 -16122 6833 30348 4964 -19458 22772 43205 -8235 -41171
145d1171N9678N5239o4233o4378L3859O4914q033m9100q8J4209r802L238M2565
$$ -41171 18507 73746 9513 -54865 -21006 43908 35875 -13225 -13313 896 -8906 -5668 36897
158C6897m206o1167j4206N5993M4046m1734m3791J6864K4672m221n822J0152j0537
$$ 36897 32691 -28476 -42682 13311 57357 15623 -28168 -11304 13368 9147 3325 13477 2940
171B940k0926n65K7148N897k1869K190N90j5041P67L7325J8104m8626m2980L9862
$$ 2940 -17986 -18551 8597 14494 -7375 -5185 -4595 -19636 -18869 18456 36560 -12066 -55046 -15184
185a5184O5715k0766n9746n877M1115J7544k6951o061J0676j0872j1664J9310
$$ -15184 50531 29765 -29981 -35858 5257 22801 -4150 -10211 465 -10407 -22071 -2761
197b761J7827j8282k3061Q236K8308o111j8933J0078R410p914p339J3223J0431
$$ -2761 15066 -3216 -26277 -18041 10267 4156 -14777 -4699 4711 -3203 -10542 2681 13112
210A3112j4923j3297J5635J2067j7131n487R776L591j0678m949J7811P76k0709
$$ 13112 -1811 -15108 527 12594 -4537 -10024 -248 3343 -7335 -12284 5527 6303 -14406
223a4406J047K5461J902k2954n887K1574J6033j9577j2200J2007N749l680l07
$$ -14406 -13359 12102 14004 -8950 -14837 6737 22770 3193 -9007 3000 8749 5069 4762
236D762K478q664p929J1080J5611j4407k1151J4639J8781p572j9358N888K3080
$$ 4762 7240 -1424 -9353 1727 17338 2931 -18220 -3581 15200 7628 -11730 -5842 17238
249A7238n413k0576M805J9420j829j2457k453O731J94o048R007N68j8364l665
$$ 17238 11825 -8751 -3946 15474 13645 1188 -1265 5466 5660 -388 8619 9187 -9177 -12842
263a2842J8518R926j6826j5854J1384J6859p529p664O620j007n177L397J2357
$$ -12842 5676 15602 -1224 -17078 -5694 11165 3636 -4028 2592 1585 -3592 -195 12162
276A2162j937j9284r65K0163J537j7836l896J0559L227j1310k741J4301l029j4216
$$ 12162 10225 -9059 -10024 10139 11676 -6160 -10056 503 3730 -7580 -10321 3980 951 -13265
290a3265M199J3335p3r902j111R057j06o444Q263L144j3227l550J2517Q757j3504
$$ -13265 -9066 4269 4196 -5706 -6817 2240 2134 -4310 3953 7097 -6130 -9680 2837 11594 -1910
305a910j5100J0448J4219q355j0693N276N415j888l796O386M884j0018m27J1884
$$ -1910 -17010 -6562 7657 -698 -11391 -6115 -700 -2588 -6384 2 4886 -5132 -5559 6325
319F325N12q706j113P881K118j0384k042J1970k420j1165J461O983J099o549j258
$$ 6325 6837 -1869 -2982 4899 7017 -3367 -5409 6561 4141 -7024 -5563 1420 2519 -4030 -5288
334e288P208j008n901P763N010p429m047O348R549m468j3019M854R412l693n356
$$ -5288 1920 912 -4989 2774 7784 355 -3692 2656 12205 7737 -5282 -428 8984 5291 -65
349f5q30Q26l53j116L822N56r965J248J0685R33o457k502N076N312m814k169O753
$$ -65 -895 -69 -422 -1538 2284 2840 -7125 -5877 4808 5741 -716 -3218 1858 7170 2356 187 6940
366F940j903n652Q42K909K168m984m228L129j027k064M425J120n536k974K969
$$ 6940 5037 -615 227 3136 5304 320 -3908 -779 -1806 -3870 555 1675 -3861 -6835 -3866
381c866P931M35o888N49K598k03L400R12k900m075k593N417M059n864l330J72
$$ -3866 4065 4500 -2388 -1839 759 556 3956 4868 1968 -2107 -4700 717 4776 -1088 -4418 -4246
397d246j030J727J572J991o93p019K54R075L099k856l720j344M284K034m28R16
$$ -4246 -5276 -3549 -1977 14 -679 -7698 -7444 1631 4730 1874 -1846 -3190 1094 3128 2700 3616
413C616m105l296K581Q89P79r85l519o4j78j43M479J544j578j643l360K803Q065
$$ 3616 -489 -3785 -1204 -315 464 -521 -4040 -4104 -4282 -4425 54 1598 20 -1623 -4983 -2180 5885
430E885L382l443j0415m606J2419J2034n511j4843q826J0039J3731k380r583o632
$$ 5885 9267 5824 -4591 -9197 3222 15256 9745 -5098 -13924 -3885 9846 7466 -2117 -8749
444h749k13P734O969N98m385r229m94J2946Q018m642j1780m060J1495O656p781
$$ -8749 -8962 -1228 5741 6339 1954 -7275 -7769 5177 13195 8553 -3227 -7287 4208 10864 3083
459C083o234K024M679k720q257L432J0210k693r788k795P815Q612m705n793N424
$$ 3083 -3151 -1127 3552 832 -7425 -3993 6217 3524 -6264 -9059 -1244 7368 2663 -3130 2294
474B294J742o170q74Q967Q746r617j9744L192K0441P441j3433j8687P77J5764
$$ 2294 4036 -2134 -3008 5959 14705 5088 -14656 -11464 8977 16418 2985 -15702 -14925 839
488H39O121k469m706q709l809P104J6421R382j8591k4128Q063K8749J2607k0209
$$ 839 6960 4491 -215 -8924 -12733 -5629 10792 20174 1583 -22545 -14482 14267 26874 6665
502F665k7819M493K4437P790j1446j3734k836Q647M171J940J231p863o013N205
$$ 6665 -21154 -16661 7776 15566 4120 -9614 -12450 -3803 368 2308 3539 -4324 -10337 -5132
516e132J0256M582r520r028Q816R904m760r648k50J1451L999j4455q647Q471J0876
$$ -5132 5124 9706 186 -8842 -26 9878 5118 -4530 -4780 6671 10670 -3785 -12432 -3961 6915
531F915o2j1412o678O614N490K105K400m284o354j701P250J3874l89j6529j0069
$$ 6915 6853 -4559 -11237 -4623 867 2972 5372 1088 -5266 -6967 283 14157 13768 -2761 -12830
546a2830O941J7074O778j5800j6418L091J2857Q452n332j0152k389N79M300J0671
$$ -12830 -5889 11185 17963 2163 -14255 -11164 1693 10145 4813 -5339 -7728 -7149 -2849 7822
560G822L430j0642j2606K152K0195R558j6248j5278N487J4217K147j1639m049
$$ 7822 11252 610 -11996 -9844 10351 19909 3661 -11617 -6130 8087 10234 -1405 -5454
573e454O888n93o190J3O322M449p008q700N567R482N49m910l163M048J927m874
$$ -5454 1434 841 -5349 -5336 986 5435 -1573 -10273 -4706 4776 5325 415 -2748 1300 3227 -1647
589a647K438Q248k050j2003p239J0868J5610p211j9096k451J3563R897o790j0528
$$ -1647 791 9039 6989 -5014 -12253 -1385 14225 7014 -12082 -14533 -970 8927 2137 -8391
603h391M325N077l204J089O098J967p591p800P664J2071m228j0433k828M868N255
$$ -8391 -4066 1011 -2193 -1104 4994 6961 -630 -8430 -766 11305 7077 -3356 -6184 -1316 3939
618C939l848m185L357o59l614Q15L276M158k240o274K449N580J450p05l508K17
$$ 3939 91 -4094 -737 -1396 -5010 -4195 -919 3239 999 -5275 -2826 2754 4204 3499 -9 208
634B08K877k081j099L094n91k531l882q36O298J511m699k003j042K806M296j18
$$ 208 3085 1004 -95 2999 2408 -123 -4005 -4841 1457 2968 -1731 -3734 -4776 -1970 2326 2208
650B208l29k057m061M300P209O65n718q093K803R924o0p400m283L85M858J313
$$ 2208 1879 -178 -4239 61 7270 7935 2217 -5876 -3073 6851 6791 -609 -4892 -4507 351 1664
666A664l011k82j487n30M305J501r99j400j103L321K005k745K22N47j054J035
$$ 1664 -1347 -1629 -3116 -3646 659 2160 1161 -239 -1342 1979 3984 1239 1461 2008 954 1989
682A989j478j580O75m67J409j511m758K326N070p22l457j594L286M685k570j788
$$ 1989 511 -1069 -394 -861 548 -963 -5721 -3395 1675 953 -2504 -4098 -812 3873 1303 -485
698d85K487k96r39M26J418P19m063k757L846J061k331j026j504M46J193J121J800
$$ -485 2002 1706 767 1193 2611 3330 -733 -3490 356 1417 -914 -1940 -3444 -2998 -1805 -684 1116
715A116l112k563N329L486k491k680N29L821R3l368J277M19l269N00J873l58l258
$$ 1116 -1996 -4559 770 4256 1765 -915 -386 3435 3528 160 1437 1856 -1413 -913 960 602 -2656
732b656k434L764L447m501j788L094J358Q12o75M19Q32j891J952L724m099l148
$$ -2656 -5090 -1326 2121 -2380 -4168 -1074 284 1096 421 840 1672 -219 1733 5457 1358 -1790
748a790K673K015j106m579l28M742j585m056J792J796k55r47k87L351m68k469
$$ -1790 883 2898 1792 -2787 -3115 1627 42 -4014 -2222 -426 -681 -1628 -1915 1436 968 -1501
764a501L516J769l031L7J119J097j449l077K265J105m440R80J777j561j386O2
$$ -1501 2015 3784 753 790 1909 3006 1557 -1520 745 1850 -2590 -1610 167 -1394 -2780 -2718
780b718K460J289l962N80M947q05j946R08J301J098k527j21K770k671k831K721
$$ -2718 -258 1031 -2931 -2351 2596 1791 -155 753 2054 3152 625 504 3274 603 -2228 493
796D93J33j300j916o38L205j118k417K877Q56k128J546J686J009j178k451L719
$$ 493 626 -674 -2590 -3228 -23 -1141 -3558 -681 175 -1953 -407 1279 2288 1110 -1341 2378
812B378J644l828k44J095J95o93k395R73J110k767K24J570j362l48J270J446N90
$$ 2378 4022 194 -50 1045 1240 547 -1848 -875 235 -2532 -2308 -738 -2100 -2448 -1178 268 858
829H58k216Q43M040j633j166J029k76J49j282k90K220k591k900J997Q15o88q83
$$ 858 -1358 -515 3525 1892 726 1755 1479 1628 346 56 2276 -315 -3215 -1218 -403 -1091 -1974
846a974n80J812j91j074K805J102j994J99O93J699L51j682M51k77k464J583J766
$$ -1974 -2554 -742 -933 -2007 798 1900 -94 105 798 2497 2848 1166 1617 1340 -1124 459 2225
863B225k235k001j551K040K545k372r41J232j019J476J871O31K83k677m8L856
$$ 2225 -10 -2011 -3562 -1522 1023 -1349 -2290 -1058 -2077 -601 1270 1901 2184 -493 -541 3315
879C315o3j777n27j428P12K12m07M22k374j627K641J34j402J102N78O16j018j211
$$ 3315 3252 1475 948 -480 232 444 37 459 -1915 -3542 -901 -767 -2169 -1067 -489 127 -891 -2102
897b102M299J971l674o01O83J275N50k091J239Q2m940J14M411L30k664m279O88
$$ -2102 2197 4168 494 -107 576 1851 2401 310 1549 1631 -3309 -3195 1216 1546 -1118 -5397 -4709
914d709N873N02k065k78j593J569L135P32J44k783k580L182J539k22o29m093j968
$$ -4709 1164 1666 -399 -677 -2270 -701 2434 3166 3310 527 -2053 1129 2668 2446 1817 -2276 -4244
931d244L254K671J42m753l403N216L440k807j132J524J698r65j998M019K323m856
$$ -4244 -990 1681 1823 -2930 -6333 -1117 2323 -484 -1616 -92 1606 641 -1357 2662 4985 129
947A29j721K991J544k062l686K156L281l981l487K533L233M43l174k583K891K766
$$ 129 -1592 1399 2943 881 -2805 -649 2632 -1349 -4836 -2303 930 1373 -1801 -4384 -1493 1273
963A273J536R8m002j088L941K223q42j978j756O28j525O89M871k233q037p23P045
$$ 1273 2809 2907 -1095 -2183 1758 3981 3139 1161 -595 33 -1492 -803 4068 1835 -6202 -6925 120
980A20N586n523p334M602O041k393k121K559K316l032m755N207O618n218p011
$$ 120 5706 183 -7151 -2549 3492 1099 -1022 1537 3853 821 -3934 1273 7891 2673 -4338
995d338Q86N160J866m829k817K837J56m23N04o60J438R30j614l4J423K357R97
$$ -4338 -3452 1708 3574 -1255 -4072 -1235 -1079 -1502 -998 -1658 -220 710 -904 -938 485 2842 3839
1012C839m461j206N060J31l841j081K453J497n645k939Q324K775q313m759N514
$$ 3839 -622 -1828 3232 3363 -478 -1559 894 2391 -3254 -6193 2131 4906 -3407 -8166 -2652
1027b652Q371k686q195K648O805k420k885K351K699j982n454K821N519l096m775
$$ -2652 5719 3033 -5162 -2514 4291 1871 -1014 1337 4036 2054 -3400 -579 4940 1844 -2931
1042b931L79J699R02j214p49J592j218l60K441p63K68K051o42j711j29K602L163
$$ -2931 -2552 -853 49 -1165 -1914 -322 -1540 -1900 541 -222 46 2097 1455 -256 -385 2217 5380
1059E380m268n199M450L233l199l149P62L512k510m881M790M812m454l875K439
$$ 5380 1112 -4087 363 3596 397 -2752 -1990 1522 -988 -5869 -1079 3733 -721 -4596 -2157
1074b157N387M0m844J159L681k453j404K963O49k647l569K014L954k601l167J590
$$ -2157 3230 3270 -1574 -415 3266 813 -591 2372 3021 374 -3195 -1181 2773 172 -2995 -1405
1090a405k79l96J357J232m51k904J073N619j467m614K260L543o80l859p6M811
$$ -1405 -1684 -2080 -723 509 58 -2846 -1773 3846 2379 -2235 25 3568 2888 -971 -1047 3764
1106C764j451n467J427L460k003k822O22L520j215m549K868M937k227l095J412
$$ 3764 2313 -3154 -1727 1733 -270 -3092 -2470 1050 -165 -4714 -1846 3091 864 -2231 -819
1121h19L215L75l249R93K908k968j708K733L55k169k477J715K259l182j377L995
$$ -819 2396 2771 -478 515 3423 455 -1253 1480 1835 -334 -2811 -1096 1163 -2019 -3396 599
1137E99n61k874J000L039J212l412q69N036J08m015R63K474o48k922m54L670j517
$$ 599 38 -2836 -1836 1203 2415 -997 -1866 3170 3278 -737 226 2700 2052 -870 -1324 2346 829
1154H29m591J749L623k313k710J137L648m74m217K476M154k536j856K130K105
$$ 829 -3762 -2013 1610 -703 -3413 -2276 1372 898 -3319 -843 3311 775 -1081 1049 3154
1169C154j171l222J985K993m089k365L445N67k688j716J757K581l069j660M250
$$ 3154 1983 -1239 746 3739 -350 -2715 730 1297 -1391 -3107 -1350 1231 -1838 -3498 752
1184G52P97k952M73K449R83k364j220M286J36m771J016K785j228k864l84L148
$$ 752 1549 -1403 -930 1519 2502 138 -1082 3204 3340 -1431 -415 2370 1142 -1722 -2106 1042
1200A042o39m294J756L283j751k260J682K780l23l127J843L837k930j980K789
$$ 1042 403 -3891 -2135 1148 -603 -2863 -1181 1599 1276 -1851 -8 3829 899 -1081 1708
1215A708J210k095k490J417K970l722k418L824K51k814o36K143K055k617j405
$$ 1708 2918 823 -1667 -250 2720 -1002 -3420 404 655 -2159 -2795 -652 1403 -1214 -2619
1230b619L942P28l216J401K077lk292o45L165o3m422Q05K686j510k153m1K276
$$ -2619 1323 2051 -1165 236 2313 2310 18 -627 2538 2475 -1947 -1142 1544 34 -2119 -2160 116
1247A16k00l029J364L453k110j457K359J800q01k328J374K841k473k065K208P40
$$ 116 -84 -3113 -1749 1704 -406 -1863 496 2296 1495 -833 541 3382 909 -1156 1052 1792
1263A792j991j396P32J980k566j740K862N76k194J43J673J114j305q22L097L23
$$ 1792 -199 -1595 -863 1117 -1449 -3189 -327 249 -1945 -1802 -129 985 -320 -1142 1955 2278
1279B278k879J172J865p53j651o38J919m68l446J125K298j949j238Q92J471J30
$$ 2278 -601 571 2436 1683 32 -606 1313 845 -2601 -1476 822 -1127 -2365 -1473 -2 128
1295A28k321J656K626j716j214J938Q60k78j782L22K298j941j812J751l45j020
$$ 128 -2193 -537 2089 373 -841 1097 1957 1679 -103 219 2517 576 -1236 515 170 -850
1311h50m70M9J430j487j156K314M59j271Q04N67M43N4p14J703Q7k168P98P82j216
$$ -850 -1320 -1271 159 -1328 -2484 -170 289 -982 -178 389 832 886 172 1875 1962 -206 592 1374 158
1330A58m16l92O71J43k476O73J846j323l82M88O19R46r71M14J937j317n88J578
$$ 158 -258 -650 21 164 -2312 -1639 207 -1116 -1498 -1010 -391 555 -416 -2 1935 618 30 1608
1348A608L3m68j005l92J131p83j615J076k46q85K57K87J022n49j187J971R20j228
$$ 1608 1641 1173 168 -224 907 124 -1491 -415 -661 -1546 -1289 -1002 20 -529 -1716 255 1175 -53
1366e3O50O83k46K58q59P98P19k183k16Q84p43k07o94j14J139j403l0J578m80
$$ -53 597 1280 1034 1292 433 1231 1950 -233 -449 435 -308 -515 -1209 -1323 -184 -1587 -1617 -39 -519
1385e19K25M56k97R02j06J80J027j134r53J496k56q42m30n49J084j211q93J485
$$ -519 -294 162 -135 767 661 841 1868 734 -219 1277 1021 179 -251 -800 284 -927 -1820 -335
1403c35O3j737L83J067J520k66j956J279J754q82k96M25J14j33j203k0J426j519
$$ -335 -272 -2009 -1626 -559 961 695 -1261 18 1772 890 594 1019 1133 1000 -203 -223 1203 -316
1421c16n79n2j24O87k32p14N42k31N63J249q73k29J598k02l82oL18J193j788j391
$$ -316 -895 -947 -1071 -384 -616 -1330 -788 -1019 -456 793 -80 -309 1289 1087 705 699 1017 2210 422 -969
1441i69J740K54j643n15r5J577r57j904J864J287j200p38P50J842P11k034K8J491
$$ -969 771 1025 -618 -1133 -1228 349 -608 -2512 -648 639 -561 -1299 -549 1293 2004 -30 -2 1489
1459A489m81n0o1q16O59j146m17P99p92J7K81j412M88J714o37k94j89J137J547
$$ 1489 1008 958 897 81 740 -406 -823 -24 -816 -799 -518 -1930 -1442 272 -365 -659 -848 289 1836
1478A836j356r10K020K34j195q81O44J458j244k895J461J585j140j131j68J179
$$ 1836 480 -430 1590 1824 629 -252 392 1850 606 -2289 -828 757 -383 -1514 -1682 -503
1494e03R47k013P85J766n03n48L58N08J061p55o25N46n43J35J11j452o3M88k45
$$ -503 444 -1569 -784 982 479 -69 289 797 1858 1103 478 1024 481 616 727 -725 -788 -300 -545
1513e45j70p71M79J567j598o27K047Q20p75j007Q05K179r63k444J517J394j245
$$ -545 -715 -1486 -1007 560 -1038 -1665 382 1202 427 -580 225 2404 1441 -1003 514 1908 663
1530F63j352m29J953m45k437M38J624p78m28J60Q18P52j369P64J394m56k11K25
$$ 663 -689 -1118 835 390 -2047 -1609 15 -763 -1191 -1031 -213 539 -830 -66 1328 872 661 886
1548H86k00L41n46q2M40j308K3Q77j309o49O73M49n8q83N14J771o98j251J463
$$ 886 686 1027 481 399 839 -469 -446 431 -878 -1527 -854 -405 -463 -1346 -832 939 241 -1010 453
1567D53J132m26j123J95J605k71k509J015R80r77j212j64J209Q5k129R55J512
$$ 453 1585 1159 36 231 1836 1565 -944 71 1051 74 -1138 -1302 -93 -8 -2137 -1182 330
1584C30r07m07Q04P28L69j144P70J326j415pP08m23m32n71PQ33j559n83J872j047
$$ 330 -577 -984 -180 548 917 -227 543 1869 454 447 1155 732 300 -271 -264 569 -990 -1573 299 -748
1604g48p93P84P48K25r54O1K298m47j772J265R45l30j084k80J486l48k421Q34
$$ -748 -1541 -757 -9 216 -738 -677 1621 1174 -598 667 1612 1282 198 -82 1404 1056 -1365 -531
1622e31J032j284p90J87J039Q6j287P58J788j229n37J512M64k68r35O82J169j474
$$ -531 501 -783 -1573 -1386 -347 -261 -1548 -790 998 -231 -768 744 1208 940 5 687 1856 382
1640C82q30J607o18j217j96M44O28j280r08K020j94j122O92J071K34o85l74K078
$$ 382 -448 1159 541 -676 -872 -428 200 -1080 -1988 32 -162 -1284 -592 479 713 28 -346 1732
1658A732j36k001Q00J178o50j422k53J455m69k063O04J519j219q82J066O92K10
$$ 1732 1596 -405 395 1573 923 -499 -752 703 234 -1829 -1225 294 -925 -1807 -741 -49 161
1675A61j240R50J578j254m00J300L76n65o33J02J052j509q97J414k97j285K6N03
$$ 161 -1079 -129 1449 195 -205 1095 1471 906 273 375 1427 -82 -979 435 138 -1147 -1121 -618
1693f18N58j158l52J993j25j185P01J193l8n59n83J639J25k113Q09J124j158j017
$$ -618 -60 -1218 -1570 423 298 -887 -186 1007 969 410 -173 1466 1591 -522 287 1411 253 -764
1711g64j25R93L3k085P47J414r62j69O90O69K64j192N88J754j323n91J224j08
$$ -764 -889 104 137 -1948 -1201 213 -749 -918 -228 441 705 -487 101 1855 532 -59 1165 1057
1729A057q44n35L18P35j415r37J767k89j400N39P09M03o53m74J988J90j686P76
$$ 1057 213 -322 -4 731 -684 -1621 146 -143 -1543 -1004 -295 108 -545 -1019 969 1159 -527 249
1747B49J249m68n88m76J204n1k057M34J005r12q04J07Q65mj299N30J585p27n19
$$ 249 1498 1030 442 -34 1170 1119 -938 -504 501 -411 -1215 -1108 -243 -247 -1546 -1016 569 -158 -677
1766f77Q06Q92j05q75M67J377j218r49R06j8o64m75k5N62q08q39J500J53j352
$$ -677 129 1021 916 41 508 1885 667 -282 624 606 -58 -533 -558 4 -804 -1643 -143 10 -1342
1785a342L87J220L64n43o65J573M65j579L53J191n85r09r4P24j00j639M1J357
$$ -1342 -955 265 629 86 -579 994 1459 -120 233 1424 839 -70 -164 560 460 -1179 -1138 219
1803B19o66q80K83O67L20p52J35J718o51m66J000J04l05k11k25Q77q39j041J182
$$ 219 -447 -1327 -1044 -377 -57 -809 -674 1044 393 -73 927 1031 726 515 290 1167 328 -713 469
1822D69l63q18j35K58M25n75n82J423N14j348L88Q85K13k86o26J089N73j502J1
$$ 469 106 -712 -847 -589 -164 -739 -1321 102 616 -732 -344 541 754 468 -158 931 1504 2 13
1841A3Q01o25o06l08M98M10j382L9J386q55R7O5K26P07q35J86J471m30p92Q41
$$ 13 814 189 -417 -725 -227 183 -1199 -1160 226 -629 -532 -467 -241 466 -369 -183 1288 858 66 907
1861I07J05n41l49k30Q10r63j067Q68N50j006Q2O1L84K87q30J042J042j303K59
$$ 907 1012 471 122 -108 702 -261 -1328 -460 90 -916 -834 -773 -389 -102 -932 110 1152 -151 108
1880A08P24k25J79q03P41K16j054k66Q68r59n71L50M4K89m57j97J481r33k68J078
$$ 108 832 607 786 -17 724 940 -114 -380 488 -471 -1042 -692 -648 -359 -816 -1013 468 -465 -733 345
1900C45N8Q0k34j78J263m28j294J050J79r67m64j02P44l83j179P27O86o42L03
$$ 345 403 483 249 71 1334 906 -388 662 841 -126 -590 -692 52 -331 -1510 -783 -97 -739 -436
1919d36n5M70N57l24Q8N51n92K63M92n70J76k72l03K91r38j01Q49q08l94O52j08
$$ -436 -491 -21 536 212 300 851 259 522 1014 444 620 348 45 336 -602 -703 146 -662 -1056 -404 -512
1940e12K43n15K85J383o10o24R38K80k24m20j01Q80j1j484L48M68q05N3n25M95
$$ -512 -269 -784 -499 884 274 -350 588 868 644 224 123 1003 992 -492 -144 324 -481 -428 -953 -458
1960d58M16r63M34N72k87J90L93k02N56K8l03K69n52N83o5o75j42K47k01k80o91
$$ -458 -42 -1005 -571 1 -286 -96 297 95 651 679 376 645 93 676 611 -64 -206 41 -160 -440 -1131
1981a131M05Q42r12j76N82M84J17m41Q1J106k43q05N77L29k60k39n42P35k14r69
$$ -1131 -726 116 -796 -972 -390 94 211 -230 -149 957 714 -91 486 815 555 316 -226 509 295 -674
2001f74Q7L14m27J45k29K08M77k55J95M26m61N39N16m09J51k27J55J98p10m2L63
$$ -674 -587 -273 -700 -555 -784 -576 -99 -354 -159 267 -194 345 861 452 603 376 531 729 19 -23 340
2022C40q39j01K03P9L14q92k15J124J2o23P30K25J58k23l92J184M2r38J11M06
$$ 340 -499 -600 -397 -318 -4 -896 -1111 13 25 -598 132 357 515 292 -100 1084 1126 188 299 705
2042G05m51r0o04J74J66n46J14J78l98O0N14l93O23l05L56O28n06N8O19l17l33
$$ 705 254 164 -440 -266 -100 -646 -532 -354 -752 -692 -178 -571 52 -253 103 731 225 283 902 585 252
2063B52J14l3J4q84k55J026p94m52N01L0L07k91r9R32J05o83M73M41n1j37m11
$$ 252 366 333 347 -537 -792 234 -560 -1012 -511 -481 -174 -465 -564 368 473 -210 263 704 653 516 105
2084A05N08J23q23J98J68n44L9j78rK23o55K93M68l61J53N62k36K55j10L11K44
$$ 105 613 736 -87 111 279 -265 -226 -404 -413 -190 -845 -552 -84 -445 -292 270 34 289 179 490 734
2105G34n37M3P27n59l87j71O1K91p93m20R28l35l72L40K65J80m2j75O10M94r00
$$ 734 197 240 967 408 21 -150 -89 202 -591 -1011 -83 -418 -790 -450 -185 -5 -47 -222 388 882 -18
2126a8O47J49m27J00n90M03lo09j8M25q36LK90J00Q3l57K92N51l70mR39l09K6
$$ -18 629 778 351 451 -139 264 261 -348 -366 59 -777 -774 -484 -384 -301 -658 -366 185 -185 -189 750 441 467
2149D67k46K98M49j011k64P81l78o24PO8K01k65l93P41K42m51L02M19j33J34l84
$$ 467 221 519 968 -43 -307 474 96 -528 -521 -453 -252 -517 -910 -169 73 -378 -76 343 210 344 -40
2170d0Q26J79j055N27N39q09k38J0l2L5j007N03M12n73J4M69o8K56j87K24Q19
$$ -40 786 965 -90 437 976 167 -71 -61 -93 -58 -1065 -562 -150 -723 -709 -240 -308 -52 -239 -15 804
2191H04n86k0O72m02k8k39K3K23o23n99Q57m75n97N00j93M85j46m23J040mo22
$$ 804 218 198 870 468 440 201 224 447 -176 -775 82 -393 -990 -490 -683 -198 -344 -767 273 269 -353
2212c53M88L88J00om18M97P6o97J33Q1m48k03P0k1o6n85N44M59m51J44M34j99
$$ -353 135 523 623 617 199 696 772 75 208 289 -159 -362 -292 -313 -379 -964 -420 39 -412 -268 166 -33
2234c3K61j51k2O54m00j63O08k30n24k03L8L80m13o36P24j07m36R9K65K09k57
$$ -33 228 77 55 709 309 146 754 524 0 -203 -165 215 -198 -834 -110 -217 -653 -554 -289 -80 -337
2255c37m3O14M64o66J07N86k47P0m55Q5K40q78O3O21n88j84K26k58L51q9r4L92
$$ -337 -380 234 698 32 139 725 478 548 93 178 418 -460 -397 224 -364 -548 -322 -580 -229 -318 -412 -20
2277b0p5j16P44r8j07Rp0M94n58m04O14k48n39o3K4L90n77k50Q66o6p72O20K55
$$ -20 -95 -211 533 435 328 337 267 761 203 -201 413 165 -374 -437 -413 -23 -600 -850 16 -50 -822 -202 53
2300E3o4M43m14L35N35j018N15L36k50l10j84j49M14o42J82N0m41l2L98n0J13
$$ 53 -11 432 18 353 888 -130 385 721 471 161 -23 -172 242 -400 -218 -168 -609 -641 -243 -293 -180
2321a80Mm9P72l20k92P08n7k39K7l35M53l28o41M56J40l87l41K54K18p8m72K82
$$ -180 -176 -225 547 227 -65 643 586 347 374 39 492 164 -477 -21 119 -268 -609 -355 -137 -215 -687 -405
2343d05Q32o03J79M05Po3p3J72J90m86j34N24n93n0k90j50L24n06J42N89m15j10
$$ -405 427 -176 3 408 415 352 279 451 641 155 21 545 -48 -98 -388 -538 -214 -720 -578 11 -404 -514
2365e14L78J10K20O3j21O95n85k27L17K38n56J14k09J77p5o77L03K00n98L26J85
$$ -514 -136 -26 194 257 136 831 246 19 336 574 18 132 -77 100 25 -652 -349 -149 -747 -421 -236
2386b36Q8J17l50L24M32j64Q5K98l88J12j27K91k05m38q0L95l16l51K63R7k10
$$ -236 -148 -31 -381 -57 375 211 296 594 206 318 191 482 277 -161 -241 154 -162 -513 -250 -153 -363
2407c63O1l50P40l4n05N77K71j6o3j08K24J56p26O65k04n80J47l42L30J04o74
$$ -363 -302 -652 88 54 -451 126 397 381 318 210 434 590 -136 529 325 -255 -108 -450 -120 -16 -690
2428f90K11N28l64J48P8k7K87j64K80L33p11K08N20l19k27j87K35Q9o52j64N70
$$ -690 -479 49 -315 -167 -89 -116 171 7 287 620 -91 117 637 318 91 -96 139 228 -424 -588 -18
2449a8l07k02n8L20J85j81m8N23J07m26M91P6j31J01k22J99j61n71K35L0k91J89
$$ -18 -325 -527 -585 -265 -80 -261 -309 214 321 -105 386 462 331 432 210 409 248 -323 -88 -58 -349 -160
2471a60k3m07L02q4m2M99m97L83N07l57J14J00J8L22m83k16M88m97j59j57J17
$$ -160 -183 -590 -288 -372 -414 85 -412 -29 478 121 235 335 353 675 192 -24 464 -33 -192 -349 -232
2492b32K59k97n56O12n1j25P2K85J83K6j58M16p8j01L76j29l44l0j15m7O6l03
$$ -232 27 -270 -826 -214 -265 -390 -318 -33 150 176 18 434 356 255 631 502 158 128 13 -34 32 -271
2514b71j86K11k49K8K66l39M48KJ42M43l95R9K14N9l8j2j06J67m78k54L03j45
$$ -271 -457 -246 -495 -467 -201 -540 -92 -90 52 495 100 199 413 472 434 422 316 483 5 -249 54 -91
2536i1l30J54q3r6J88j46L15Qj79M53k12J35K38k36J97J61l35N5J96m79L24j71
$$ -91 -421 -267 -350 -446 -258 -404 -89 -81 -260 193 -19 116 354 118 315 476 141 196 392 -87 237 66
2558F6n78J59k6J78Nj80K2L16R2j30J75J05L34m76RM46l59J86l40p5J83k51k32
$$ 66 -512 -353 -379 -201 -196 -376 -354 -38 54 -76 99 204 538 62 71 517 158 344 4 -71 112 -139 -371
2581c71M64l76k20K60n1o9L75l81M48L13l85M72M4j12j17j6k2J81n44rJ85l98
$$ -371 93 -283 -503 -243 -294 -363 12 -369 79 392 7 479 523 411 294 278 256 437 -107 -116 69 -329
2603c29Q6n2J07j88o4K2M68j56j11L83L7P9j73K5L09l12P6J77k30j10l7k47O2
$$ -329 -243 -295 -188 -376 -440 -418 50 -106 -217 166 203 282 109 134 443 131 207 384 154 44 7 -240 -178
2626a78p9O6j79K66k58K22nJ1K36l8L43P1m88L65J26m53Nj96K78Q3m95J07p7L4
$$ -178 -257 -191 -370 -104 -362 -140 -145 -134 102 64 407 478 -10 355 481 28 33 -163 115 198 -297 -190 -267 -233
2650b33k01M28k68R6o7r5P37k80Q4J04o0o0K96k17k4j77j01J92oo60l6N3L95j24
$$ -233 -434 -6 -274 -178 -245 -340 397 117 201 305 245 185 481 264 240 63 -38 154 148 -512 -548 -495 -100 -224
2674b24k89L24J14j84L87j10QJ8o6O01n5p04K86J12k11j93J54k1J04k91k2K55
$$ -224 -513 -189 -75 -259 128 18 26 44 -22 579 524 -180 106 218 7 -186 -32 -53 51 -240 -262 -7
2696gm15j2N33k43LJ56r6N34l79R6K79k77J64j80O4j77jk43L74k37m32K86o0O4
$$ -7 -422 -434 99 -144 -141 15 -81 453 74 170 449 172 336 156 220 43 42 -201 173 -64 -496 -210 -270 -206
2720b06J6j96N24Rk43J88K81j19l9N7l11M30l21n0J35m63j94N24k53J1J31j98
$$ -206 -190 -386 138 147 -96 92 373 254 215 272 -39 391 70 20 155 -308 -502 22 -231 -220 -89 -287
2742b87K71o6M2P7O8M6n8o1N23k56l02L29l8m85J98k12K56p9n48N54k30j38K8
$$ -287 -16 -82 -40 37 105 151 93 32 555 299 -3 326 288 -197 1 -211 45 -34 -582 -28 -258 -396 -368
2765c68L42N7o0R8M2L06l65l7M74j96n4j66K4J94l65j57J96k12p6L78m84K73j94
$$ -368 -26 31 -29 69 111 417 52 15 489 293 239 73 97 291 -74 -231 -35 -247 -323 55 -429 -156 -350
2788c50R1M62j04k34M87j31j45N1K06L0jo00L07N5l12p9K6K0K29n34P2M22k37
$$ -350 -259 203 99 -135 352 221 76 127 333 363 362 -238 69 124 -188 -267 -241 -221 8 -526 -454 -32 -269
2811b69K13J84j09K81l15J57L08k64L2K05m45Q3Qj53q6j58k5N39k68n60O96Mk0
$$ -269 -56 128 19 300 -15 142 450 186 218 423 -22 61 69 -84 -170 -328 -353 186 -82 -642 54 58 38
2834C8N3l40P53l95OM49l08q5J14j94J3j40l92K65P0l39J87Q7L1J06O2K9J01k80
$$ 38 91 -249 504 109 115 564 256 171 285 91 104 -36 -428 -163 -93 -432 -245 -158 -127 -21 41 70 171 -109
2858a09k2L63N0J9k00J39J26l67M9l9o9p3M2p5J02k55m8L61J4m52L54L76l52K55
$$ -109 -131 232 282 301 101 240 366 -1 48 9 -60 -133 -91 -166 -64 -319 -367 -6 8 -444 -90 286 -66 189
2882A89k63M39lr6J9J43n57K91q0j3k3k99L8N2o5j42L88k34J86k69M85O1l52J32
$$ 189 -74 365 362 266 285 428 -129 162 82 69 46 -253 -215 -163 -228 -370 18 -216 -30 -299 186 247 -105 27
2906B7L23j38j03M5j98j8j31KM21l68j99J75j34L42p7l98N67J77l40R6J18J34
$$ 27 350 212 109 154 -44 -62 -193 -191 230 -138 -337 -162 -296 46 -31 -429 138 315 -25 71 189 323
2928C23j32l1O6r7l20J89Q7l06J10m5j60J12q6L8J02r6J05J67P4L4j54J16K33
$$ 323 191 160 226 129 -191 -2 85 -221 -111 -156 -316 -204 -290 -252 -150 -246 -141 26 100 134 -20 96 329
2951C29l09j23M30l59J45N2k94L26k99l40L78k70R7K4r3K31K19k24J0L03j02j07
$$ 329 20 -103 327 -32 113 165 -129 197 -102 -442 -64 -334 -237 -213 -306 -75 144 -80 -70 233 131 24
2973B4J25j57J89q6J55q0m34P8K49j61%j69K26o4j65J65J52M3j11K15j09O7kl05
$$ 24 149 -8 181 95 250 170 -264 -186 63 -98 -98 -267 -41 -105 -270 -105 47 90 -21 194 85 152 150 -155
2997a55Q17l68k11J15j75k41J65j12j3J28k26R4m9J08J23J85l52K22p4l9L33k95
$$ -155 662 294 83 198 23 -218 -53 -165 -178 -50 -276 -182 -231 -123 0 185 -167 55 -19 -58 275 -20
3019b0L14j14l04J92k06J7K95l90K4Q0l2j42K62j43K74k52K49J98k95j42N44k47
$$ -20 294 180 -124 68 -138 -121 174 -216 -192 -112 -144 -286 -24 -167 107 -145 104 302 7 -135 409 162
3041A62k2j74n1K18j05k86L30l29l2J81o5r7K78k53K16J22k41K24J46k04K56M3
$$ 162 140 -34 -85 133 28 -258 72 -257 -289 -108 -173 -270 8 -245 -29 93 -148 76 222 18 274 317
3063C17Ll1l98K14P8l65K70j46j18N7r0k07L44rj61K45%J11R9%m8M8k35L00Jj36
$$ 317 320 289 -109 105 183 -182 88 -58 -176 -119 -209 -416 -72 -81 -242 3 3 114 213 213 165 213 -22 278 279 143
3089A43j56j77N4Q4n7kP2p4j2L4Q1R4o1k0J84j50J78r2j18J54P3n9n9p8k71J76
$$ 143 -13 -190 -136 -52 -109 -111 -39 -113 -125 -91 -10 84 23 3 187 37 215 123 5 159 232 173 114 36 -235 -59
3115e9l9J06j74n5J0r8K14m2K47m6R7rj82K71k47M70m21mK7p8j76J39J14m5n4
$$ -59 -98 8 -166 -221 -211 -309 -95 -137 110 64 161 152 -30 241 -6 464 43 39 66 -12 -188 -49 65 20 -34
3140c4j51L3R9k26J44K9O8K25rK13r5k19l3J68k23J96L4k25J17j27k49PJ91j17
$$ -34 -185 -152 -53 -279 -135 -106 -38 187 178 391 296 77 44 212 -11 185 219 -6 111 -16 -265 -258 -67 -184
3164a84K88k75J0J25R0J33N5k11K74O9j82o6p6K12j33k18O8knR9l47K79k04r5
$$ -184 104 -171 -161 -36 54 187 242 31 305 374 192 126 50 262 129 -89 -21 -23 -28 71 -276 3 -201 -296
3188b96O2J81J48j17K9m6J58M5j72N2P6rk86l1J55j70Q4K32j54k05J67J2o9K94
$$ -296 -234 -53 95 -22 7 -39 119 164 -8 44 120 111 -175 -206 -51 -221 -137 95 -59 -264 -97 -85 -154 140
3212A40j45J4Q0j15K00K1l18J79J51k08P6l4q3J45p8J95l62k93R1K71k8k1L23
$$ 140 -5 9 89 -26 174 195 -123 56 207 -1 75 41 -42 103 25 220 -142 -435 -344 -73 -101 -122 201
3235B01r5j2k5k25L61k1n4Q5O2k08m5J1MN2k19O9j3j03K20j56L29m78K20K87j5
$$ 201 106 94 69 -156 205 184 130 215 277 69 24 35 39 91 -128 -59 -72 -175 45 -111 218 -260 -40 247 232
3260B32qp3JJ82j47k96J27L0L1P8p4j16o9o6O0m6r4J04L75l89K53j62J27J0R8
$$ 232 224 151 152 334 187 -109 18 48 79 157 83 -33 -102 -168 -108 -154 -248 -144 231 -158 95 -67 60 70 168
3285A68j8L9J1j09M2j45J76k41q0K12k23j14P2l3J63k03J88L5J78o9N9Q1pO2j07
$$ 168 150 189 200 91 133 -12 164 -77 -157 55 -168 -282 -210 -243 -80 -283 -95 -60 118 49 108 189 182 244 137
3310A37l7M8k40N3kj31l8Q9r3K66j15j25N3J39J20J02k74K51p9j07K55j26k29
$$ 137 100 148 -92 -39 -41 -172 -210 -121 -214 52 -63 -188 -135 4 124 226 -48 203 124 17 272 146 -83
3333h3L45j63J17k77j68K71j57j42J55J88q3J34k24K12j71p8J14K92k13M8J94
$$ -83 262 99 216 -61 -229 42 -115 -257 -102 86 3 137 -87 125 -46 -124 -10 282 69 117 311
3354C11l88K52r3j19J51r3k87L15j96l23M26k16K02Q4r4K53j38P4m6RP4k9k05
$$ 311 -77 175 82 -37 114 21 -266 49 -147 -470 -44 -260 -58 26 -68 185 47 121 75 84 158 129 -76
3377g6K18r9lJ23j92j92J51J9l64K21l4J06K84k98J25J05j04K79k31J8K59m48
$$ -76 142 43 40 163 -29 -221 -70 -51 -415 -194 -228 -122 162 -136 -11 94 -10 269 38 56 315 -133
3399a33K44Q9k22R7K1j43J31j94J69P3l17J6K91k01Q5K50j65o3o7O4J49n7O0k49
$$ -133 111 200 -22 75 96 -47 84 -110 59 132 -185 -169 122 -79 6 256 91 28 -39 25 174 117 177 -72
3423g2o9J32J12m11P4J29Rm4J29r7J86j91K54L2j11Q8J5N3j87m8R8N1j80j10K73
$$ -72 -141 -9 103 -308 -234 -105 -96 -140 -11 -108 78 -113 141 173 62 150 165 218 31 -17 81 132 -48 -158 115
3448A15j00j28J8R4j29K87l14L3J06j38J86j26L07L2k03K25r6m2q2j44q9L42q6
$$ 115 15 -113 -95 -1 -130 157 -157 -124 -18 -156 30 -96 211 243 40 265 169 127 45 -99 -188 154 68
3471F8Kj07Q3k15J22j12J35j5J44j9m4No3J50P1Ml4j63J84k62K02k18O9p8K6m6
$$ 68 70 -37 46 -169 -47 -159 -24 -39 105 86 42 47 -16 134 205 209 175 12 196 -66 136 -82 -13 -91 -65 -111
3497a11P7k93R2R7R2Q3j72J54N1M5N9j00Q2j7l5o9j05J53j20J60l22L03j41j60
$$ -111 -34 -327 -235 -138 -46 37 -135 19 70 115 174 74 156 139 104 35 -70 83 -37 123 -199 104 -37 -197
3521a97J50l9l8J03r8M17j53J62k32J1J70l64J40n9j00k68L56k7r6K02k9j55R2
$$ -197 -47 -86 -124 -21 -119 298 145 307 75 86 256 -108 32 -27 -127 -395 -39 -66 -162 40 11 -144 -52
3544e2J48j77J18J41k91P9J98j85l2L15qm2L2n05K14k83L13J13l13J49j50J57
$$ -52 96 -81 37 178 -113 -34 164 -21 -53 262 254 212 244 -261 -47 -330 -17 96 -217 -68 -218 -61
3566f1J21r6j20J91J51k6k18J22R1J22l84J08K3O8j57k1L57k95j15O0J64j19l0
$$ -61 60 -36 -156 35 186 160 -58 64 155 277 -107 1 24 92 -65 -86 271 -24 -139 -79 85 -34 -64
3589f4J10J89j73J72k71k06L40O0k41M8J45J41m68R0J37L0l1j79J10J83j77j27
$$ -64 46 235 62 234 -37 -243 97 157 -84 -36 109 250 -218 -128 9 39 8 -171 -61 122 -55 -182
3611a82J77K1J54k78K8L9R3jK18k57J61j73nJ31r7j73J94K7k58J38J09qj94P0
$$ -182 -5 16 170 -108 -80 -41 52 51 269 12 173 0 -5 126 29 -144 50 77 -181 -43 66 58 -136 -66
3635f6j02J85q2J42j15M14k21Rk13P1j23J48j8K1l38Q9R1K71k04koo0K86j41j39
$$ -66 -168 17 -65 77 -38 376 155 164 -49 22 -101 47 29 50 -288 -199 -108 163 -41 -43 -49 -109 177 36 -103
3660a03J84m1J20q3j6j53L01p6r0j30p8Rl3M9J18k90K15k8J24N3O3j44J71j4j50
$$ -103 81 40 160 77 61 -92 209 133 43 -87 -165 -156 -189 -140 -22 -312 -97 -125 -1 52 115 -29 142 128 -22
3685b2K33j84K0J31o9j91J54k25o1J71j35J19N0j28J76l13J91Q0O4q9J66j04j65
$$ -22 211 27 47 178 109 -82 72 -153 -214 -43 -178 -59 -9 -137 39 -274 -83 -3 61 -28 138 34 -131
3708a31K21q7K02l00J25j10j24L1Q6N8m5J10r9J40m1j0N5j57J82L3j29K2M8k06
$$ -131 90 3 205 -95 30 -80 -204 -173 -87 -29 -74 36 -63 77 36 26 81 -76 106 139 10 32 80 -126
3732a26M3L46k10L2q9l2k5Q7k53J44N9l9j69J90n3P2j58M33k54n8L68l75K4K2
$$ -126 -83 263 53 85 -4 -36 -61 26 -227 -83 -24 -63 -232 -42 -95 -23 -181 252 -2 -60 308 -67 -43 -21
3756b1O7j0p2j14K2J44k01Q0K5J7J06J13k42J7R0j4M9J21J26j78J6j26Oj06J04
$$ -21 46 36 -36 -150 -128 16 -185 -105 -80 -63 43 156 -86 -69 21 7 56 177 303 125 141 15 21 -85 19
3781A9k08K61j02j1K07k50N8k8%M2p7o7M52k09m2Q2P7l26J02R1j82J51j55L3j00
$$ 19 -189 72 -30 -41 166 -84 -26 -54 -54 -12 -89 -156 296 87 45 127 204 -122 -20 71 -111 40 -115 -82 -182
3806a82jK01n6j24J95Rm2M8q8Q7p2K74k60J67k0j66J19j27J68j64m9J6o7q3O8
$$ -182 -183 18 -38 -162 33 42 0 48 -40 47 -25 249 -11 156 136 -30 89 -38 130 -34 -83 -67 -134 -217 -149
3831a49J07j43J75K3J41l18R4L2J39L8l38K52K30j16k69K6m2OQ8k93L05j9m0L
$$ -149 -42 -185 -10 13 154 -164 -70 -38 101 139 -199 53 283 167 -102 -76 -118 -112 -24 -317 -12 -31 -71 -68
3855f8L7j47J26j01J46nK5J4O8k44P3K25r0j24J57r6l8r6M2N9j1j45jK11J45k7
$$ -68 -31 -178 -52 -153 -7 -12 13 27 95 -149 -76 149 59 -65 92 -4 -42 -138 -96 -37 -48 -193 -194 17 162 135
3881A35j47J93j37l1N4l9J01k84J39j12J45k6N1l46K62K2Qk25J95k01K61L4n5
$$ 135 -12 181 44 13 67 28 129 -155 -16 -128 17 -9 42 -304 -42 -20 -12 -237 -42 -243 18 52 -3
3904cq8j67M06j98M4N5j65K85j86l6J82l47J99J03j25n8j19L87j03k06l6J52J00
$$ -3 -91 -258 148 -50 -6 49 -116 169 -17 -53 129 -218 -19 84 -41 -99 -218 169 66 -140 -176 -24 76
3927G6p4ol8J05L1k58K83j58j07J41J32j12J8m1n4o4J29N5o6L8J89k90J69n4p0
$$ 76 2 -4 -42 63 94 -164 119 -39 -146 -5 127 15 33 -8 -62 -126 3 58 -8 30 219 -71 98 44 -26
3952b6J09k44R0R3K2m5J43k03L9j5l93L09K23r9J78l59J16K4o8Qj32K75k5oJ58
$$ -26 83 -161 -71 22 44 -1 142 -61 -22 -37 -430 -121 102 3 181 -178 -62 -38 -106 -98 -230 45 20 14 172
3977A72q1j37K5q5L7J61m49J98K13m3p6k5J22m9k7J08lr1J41n5n7p1K37j65k27
$$ 172 91 -46 -21 -106 -69 92 -357 -159 54 11 -65 -90 32 -17 -44 64 61 -30 111 56 -1 -72 165 0 -227
4002b27J63K7J5P1j07j0j10R0K30l0j23R6l8j78L03j75J49L8k09K24Nj34q2j06
$$ -227 -64 -37 -22 49 -58 -68 -178 -88 142 112 -11 85 47 -131 172 -3 146 184 -25 199 204 70 -12 -118
4026a18m7n5J10k45L05L9k29J33J0J11j04l71M60J27l07J95J0J85k76j62K85j82
$$ -118 -165 -220 -110 -355 -50 -11 -240 -107 -97 14 -90 -461 -1 126 -181 14 24 209 -67 -229 56 -126
4048a26J97n4p0j50J44j87J95k8q4J77J10oj22K80l30J01N4O1k54J15j72P2N6
$$ -126 71 17 -53 -203 -59 -246 -51 -79 -163 14 124 118 -4 276 -54 47 101 162 -92 23 -149 -77 -21
4071b1Mk57J39jQ4M6J0q1K26k92K26k9j74J95rL2j48j11L15k20L7n4PR1K7k46
$$ -21 -17 -274 -135 -136 -52 -6 4 -77 149 -143 83 54 -120 75 66 98 -50 -161 154 -66 -29 -83 -76 15 42 -204
4097b04J41J45Mj07l8N5J10P4j82l5J98k0k91K16o6R0j26O1Qp6j57p9K18o5J65
$$ -204 -63 82 86 -21 -59 -4 106 180 -2 -37 161 141 -150 66 0 90 -36 25 33 -43 -200 -279 -61 -126 39
4122C9j66R3J03p8O7Oj02q1K92n22L16J24j01P8o3K6o1j15Q4K05k18N1L6q0Q6
$$ 39 -127 -34 69 -9 58 64 -38 -119 173 -349 -33 91 -10 68 5 31 -30 -145 -61 144 -74 -23 13 -67 19
4147A9J12q1j16K61j50p4Q2P0j90oK01k36J38oj79J66r2m3M7P6M5P3j52J62q4
$$ 19 131 50 -66 195 45 -29 53 123 -67 -73 128 -108 30 24 -155 11 -81 -124 -77 -1 44 117 -35 127 43
4172D3m2j18K60n3J14k37P8j43K96j63M9m2k26L2K48k05K3j1o9J37j18K62j58
$$ 43 1 -117 143 90 204 -33 45 -98 198 35 84 42 -184 -152 96 -109 -86 -97 -166 -29 -147 115 -43
4195d3J71J2j66K31l55J08K14o7j50N9n9j15J52j12K18j38J77j19k27N9R6o7K5
$$ -43 128 140 -26 205 -150 -42 172 105 -45 14 -45 -160 -8 -120 98 -40 137 18 -209 -150 -54 -121 -96
4218i6J09O4m7K88n00K80j37k2J73L7j14rl8J7R1o9rj42J09J05j58L39k09J20
$$ -96 13 77 30 318 -182 98 -39 -61 112 149 35 26 -12 5 96 27 18 -124 -15 90 -68 271 62 182
4242A82l10J45J08r9j0k77J99J02K5n5P6n3m8j3m3k17K96J00O6k00P4n0j18K49
$$ 182 -128 17 125 26 16 -261 -62 40 65 10 86 33 -15 -28 -71 -288 8 108 174 -26 48 -2 -120 129
4266A29r8Mk42k1J22P4k01J21K09k58K58j83K9j50J69Q8j19Q8n4L2K6N4P4p7O8
$$ 129 31 35 -207 -228 -106 -32 -233 -112 97 -161 97 -86 -57 -207 -38 50 -69 19 -35 -3 23 77 151 74 142
4291A42j16o0P8L2p9k0j24M2J24m4J7R1l0k25Q8J87q3J13l8m3Q3j92J12j26P1
$$ 142 26 -34 44 76 -3 -23 -147 -105 19 -25 -8 83 53 -172 -84 103 20 133 95 52 135 -57 55 -71 0
4316@K4j40J11q8L7Q2m1J03q4p4m5J56J96mj68lk13kK21m6R2k69p7K26j44J31
$$ 0 24 -116 -5 -93 -56 26 -15 88 4 -70 -115 41 237 233 65 62 -151 -153 68 22 114 -155 -232 -6 -150 -19
4342a9Q8q1J5m3j05R3l3J59j61J62o2R2j41K02j68M2n7q7P3j39KJ68jJ71j49J8
$$ -19 69 -12 3 -40 -145 -52 -85 74 -87 75 13 105 -36 166 -2 40 -17 -104 -31 -170 -168 0 -1 170 21 39
4368C9M2o0m8L33k08R8k83N0R6k26K64j56K32j15j99O7J49j00L0j94K06jj07o4
$$ 39 81 21 -27 306 98 196 -87 -37 59 -167 97 -59 173 58 -141 -74 75 -25 5 -189 17 16 -91 -155
4392a55L08j23M4o7R1P4Kj32p5K04k67J93m3j41l6L07l27P8mp3k1J28M5K64j81
$$ -155 153 30 74 7 98 172 174 42 -33 171 -96 97 54 -87 -123 184 -143 -65 -69 -142 -163 -35 10 274 93
4417I3k27J49K27j70M2r8r8J90j64J91k21o3j2N5J6J08j55k5J86n2J85j64J86
$$ 93 -134 15 242 72 114 16 -82 108 -56 135 -86 -149 -161 -106 -90 18 -137 -162 24 -28 157 -7 179
4440A79o8o4Rm6l7JR5J6q0j59P0J39j92K7P4K0k02M77l35J48j0q0Q3J1N7k26K31
$$ 179 111 47 56 10 -27 -26 69 85 5 -154 -84 55 -137 -110 -36 -16 -218 259 -76 72 62 -18 65 76 133 -93 138
4467A38j59N9q1l3M2j26p9L33r9k12K25q8K00o4q9N1J6j78J81m0J12J98m91K72
$$ 138 -21 38 -43 -76 -34 -160 -239 94 -5 -217 8 -80 120 56 -33 18 34 -144 37 -3 109 307 -184 88
4491H8P4k54r6J63j77K26j21j86K80k1Q1k9j03J37J16j63q7P5J03j98N5L73l43
$$ 88 162 -92 -188 -25 -202 24 -97 -283 -3 -24 57 28 -75 62 178 15 -72 3 106 -92 -37 336 -7
4514gQ0l70L88J6o8p5J25l42Q0J17l0L03j6k92J95J22l98K66l3p4O2K01l76M1
$$ -7 73 -297 91 107 39 -36 89 -253 -173 -56 -86 217 201 -91 104 226 -172 94 61 -13 49 250 -126 -85
4538h5J26l26M33j80J23j41L7P3p8o8qK86j33j5R5j72K86k80L7P3P7l36K00n6
$$ -85 41 -285 148 -32 91 -50 -13 60 -18 -86 -94 192 59 44 139 -33 253 -27 10 83 160 -176 24 -32
4562c2j18J17r3L10k08l0J05P0k40K18Q5l85M0j01K20O8J72j51n8j01L2J34q0
$$ -32 -150 -33 -126 184 -24 -54 51 121 -119 99 184 -201 -161 -262 -42 26 198 47 -11 -112 -80 54 -26
4585b6j24L5J46K2Nq6l4J1L09q7k74K86k41N1j86J35M8n6m5J26j78K48p6k6J47
$$ -26 -150 -115 31 53 58 -28 -62 -51 258 171 -103 183 -58 -7 -193 -58 -10 -66 -111 15 -163 85 9 -17 130
4610A30l19MK29N2k68L08jl75L42l4J81k02q6N0l7JN7lr4L0j04J86J28j81k9J06
$$ 130 -189 -185 44 96 -172 136 135 -240 102 68 249 47 -39 11 -26 -25 32 29 -65 -35 -139 47 175 -6 -35 71
4636G1j1k52J30K51j11O7l94J98m6K2J55k7j57J18j30q2J22O2J30j63L4q5L53
$$ 71 60 -192 -62 189 78 145 -249 -51 -97 -75 80 53 -104 14 -116 -198 -76 -14 116 -47 -13 -98 255
4659B55j91j15r5K97l5j9o1j7r8K27N2k90K54j93p0n3J16J07k70J54J2J78j56
$$ 255 64 -51 -146 151 116 97 36 19 -79 148 200 -90 164 -29 -99 -152 -36 71 -199 -45 -33 145 -11
4682a1J5k1O6K97j26l06O7J26j45j68K13n0J33k52J13J40pl23M08p7o9K0q0M4
$$ -11 4 -17 49 346 220 -86 -19 107 -38 -206 7 -43 90 -162 -49 91 84 -239 169 92 23 43 -37 7
4706Gq8J57k27J85O8j69K40l00L6l2J49k95J23k7L25Pq7r5J43J7q2J14j00r9L3
$$ 7 -81 76 -151 34 102 -67 173 -127 -91 -123 26 -269 -146 -173 152 159 72 -23 120 137 55 169 69 -30 3
4731CRJ33m8j55J48q4M6k05J77J5N0Nr4k38K42j10J97R2q0Q2j18k70K54O6o3J5
$$ 3 12 145 97 -58 90 6 52 -153 24 39 89 94 0 -238 4 -106 91 183 103 185 67 -203 51 117 54 69
4757F9j33j39J62O6J01k44L72l55J37P7n6nj28Q8R1k87J96l3K4J72jN0l56N5N0
$$ 69 -64 -203 -41 25 126 -118 254 -101 36 113 57 52 -76 12 103 -184 12 -21 3 175 174 224 -132 -77 -27
4782b7J56l84m8L20l7n3N7j20J09J37J2j9K9n0L7p8n4J20o3m8J9q3J04j87J32
$$ -27 129 -255 -303 17 -20 -73 -16 -136 -27 110 122 103 132 82 119 41 -13 107 44 -4 15 -68 36 -151 -19
4807a9j41J77j89J46m9j0K12j83J23q1K94k50o7j57K53rL4k02J36J75l34J62n8
$$ -19 -160 17 -172 -26 -75 -85 127 -56 67 -14 280 30 -37 -194 59 50 84 -118 18 193 -141 21 -37
4830c7M0k0l3P1O2J49j46l26K26Ko9j3QK54l10K26R3j86r7J3J45m4o8N3Ok18L76
$$ -37 3 -17 -50 21 83 232 86 -240 -14 -12 -81 -94 -86 168 -142 84 177 -9 -106 -93 52 8 -60 -7 -1 -219 157
4857A57j50L11j34j04J64k19Q5j44K9o4J53n0j5n6J69k11P9m0k6KO5j60k04M64
$$ 157 7 318 184 80 244 25 110 -34 -5 -69 84 34 19 -37 132 -79 0 -40 -66 -64 1 -159 -363 101
4881A01j49K46l3j97P7k09L29k09J32r6l8L6J01k39K00K3j11p5K0K15l00J77J40
$$ 101 -48 198 165 -32 45 -164 165 -44 88 -8 -46 -10 91 -148 52 75 -36 -111 -91 124 -176 1 141
4904A41m5n0k90J53J65N5j17j38L76k60J16J4k97J12ON5r4J49rN6j52jL1OJ29
$$ 141 96 46 -244 -91 74 129 12 -126 250 -10 106 120 -177 -65 -59 -4 -98 51 42 98 -54 -55 -24 -18 111
4929A11p5J13j42j51J11J20r5j76M7N2OM5j87K53J38k13J5p3J30O5M4l7j72J18
$$ 111 36 149 7 -144 -33 87 -8 -184 -137 -85 -79 -34 -221 32 170 -43 -28 -101 29 94 138 101 -71 47
4953D7J31k67K52m7j44m6K27k76j25J63Lk0J23k27K43m8p9J02M3j80Q5O5r1J63
$$ 47 178 -89 163 116 -28 -74 153 -123 -248 -85 -82 -102 21 -206 37 -11 -90 12 55 -125 -40 25 -66 97
4977I7KRn1J7q7K80l33j6J07j26J48O3k67K68j11j5K5K08J35n9j77l8Qj89J48
$$ 97 99 108 57 74 -13 267 -66 -82 25 -101 47 110 -157 111 0 -15 10 218 353 294 117 79 87 -102 46
5002D6j17Q5P0j60L8j08K14j08j34J99pR1k75J15J98k7Ljn1K5N3l01J11k0k19
$$ 46 -71 14 84 -76 -38 -146 68 -40 -174 25 18 109 -166 -51 147 120 123 122 71 96 149 -152 -41 -61 -280
5027b80L21j56O3j04j5J79j63j25L56j8k69K50J0N7QN0n3j09p0K57k83q4N4J66
$$ -280 41 -115 -52 -156 -171 8 -155 -280 76 58 -211 39 49 106 114 164 111 2 -68 189 -94 -178 -124 42
5051D2N2j22k3P7P9j07L8p5J55j48j5K05j12j9j20N8o0J23K0j58J80j9j95R6J09
$$ 42 94 -28 -51 26 105 -2 36 -39 116 -32 -47 158 46 27 -93 -35 -95 28 48 -110 70 51 -144 -48 61
5076F1N8k52J54o2n3Q9K0J59o7k16K22J5k12O1j8K49j57j19J13n9j53J95k03M4
$$ 61 119 -133 21 -41 -94 -5 15 174 107 -109 113 128 -84 -23 -41 208 51 -68 45 -14 -167 28 -175 -131
5100a31K3K76j28j6l8J75r7k15J74j76J85n3k39K73j3n4J52j26j03K0J88J0l3
$$ -131 -108 168 40 24 -14 161 64 -151 23 -153 32 -21 -260 13 0 -54 98 -28 -131 -111 77 87 54
5123E4j81J84J21j70j27J78r8j32J63J22k23K52k17j82L67m77K02J85q6Pj77K40
$$ 54 -127 57 178 8 -119 59 -39 -171 -8 114 -109 143 -74 -256 111 -366 -164 21 -65 -58 -235 5
5145EL7j41Q9k07Q2K06O1j83j4K37k18j36K82n0p4K2k1J03n9j00J13r7J34o4O5
$$ 5 42 -99 -10 -217 -135 71 132 -51 -65 172 -46 -182 100 50 -24 -2 -23 80 21 -79 34 -63 71 7 72
5170G2j59J71m9q5R6J61j92l6n6J64o2lJ8n5p0l7O4J39k36L50j21P7ol6j12K33
$$ 72 -87 84 35 -50 46 207 15 -21 -77 87 25 22 40 -15 -85 -122 -58 81 -155 195 74 151 145 109 -3 230
5196B30o9j18L5q2r5J28j92M16l40N3J87m26L56j04Q5n6L4j27oj7J23M3O8N5j12
$$ 230 161 43 78 -4 -99 29 -163 253 -87 -34 153 -273 83 -21 64 8 42 -85 -91 -108 15 58 126 181 69
5221F9rJ26j31Oj49Kj79K16J78j32K10l85J76n1j34K21R1j28%j30J54K1q7j0J48
$$ 69 60 186 55 61 -88 -86 -265 -49 129 -3 207 -178 -2 -53 -187 34 125 -3 -3 -133 21 42 -45 -55 93
5246I3j01k0R8pk2k9J00l55N4J22J11J67j95K39n1j34j25J46Q7j34j09l7j47K58
$$ 93 -8 -28 70 63 41 12 112 -243 -189 -67 44 211 16 255 204 70 -55 91 178 44 -65 -102 -249 9
5270Ij4o7L09l55L40k35J30k76J28L1J18j69K30r7OK6m4J71m8k48j12J41k43J95
$$ 9 -5 -72 237 -118 222 -13 117 -159 -31 0 118 -51 179 82 88 114 70 241 193 -55 -167 -26 -269 -74
5294g4J4J9M2N0R9j99Q9M3j46K49j90J26L7k68J17J08j1J35l22j24O5K35j23J18
$$ -74 -60 -41 1 51 150 -49 40 83 -63 186 -4 122 159 -109 8 116 105 240 -82 -206 -141 94 -29 89
5318H9k92K98j48J00p8Q0r7J02J0M5N0k14J76M5j26O9p5j97LK50k96Q3J05j22
$$ 89 -203 95 -53 47 -31 49 -48 54 64 109 159 -55 121 166 40 109 34 -163 -160 90 -206 -123 -18 -140
5342a40L73k23j5j38K47k01K66m1j35M1q5L0J48k9K9k05%O5Nj26j62J24J12j36
$$ -140 233 10 -5 -143 104 -97 169 128 -7 34 -51 -21 127 98 127 -78 -78 -13 -8 -134 -296 -172 -60 -196
5366a96J35j09J28j51J74N6l7R1K5j93L3PQ9j2j83J19ok20K8K9L38q6j46L59j72
$$ -196 -61 -170 -42 -193 -19 37 0 91 116 -77 -44 -37 52 40 -143 -24 -30 -250 -222 -193 145 59 -87 272 100
5391A00k03Q4L6j03M1o1P3O8m5M2n8o3L0K9K14O5n25K49J42k13M4J88k30J71J34
$$ 100 -103 -19 17 -86 -45 -106 -33 35 -10 32 -26 -89 -59 -30 184 249 -276 -27 115 -98 -54 134 -96 75 209
5416B09j40j42J63p5O5l8l8N3J01l3m49K72P1j45K57p9k58K86j12r7L19j28q0
$$ 209 69 -73 90 15 80 42 4 57 158 125 -324 -52 19 -126 131 52 -206 80 -32 -129 190 62 -18
5439a8P0Ko0o5K1QJ60j79R8o2j3n2k7L2J00k5k56P4K42j5J47k28P2K21l54J30
$$ -18 52 54 -6 -71 -50 -42 118 -61 37 -25 -38 -90 -117 -85 15 -10 -266 -192 50 35 182 -46 26 247 -107 23
5465B3K09j14j49j6lJ30l56K88N3j30J60r1j15J00k6Q7k7q9k3j53L14P7k7rp1
$$ 23 232 118 -31 -47 -50 80 -276 12 65 -65 95 4 -111 -11 -37 50 23 -66 -89 -242 72 149 122 113 42
5490D2j9j67Q6R1J08nk2j50m6k9K72q0q2k17Q7Q2L6J06P6l08j28K27J2J42J04
$$ 42 23 -144 -58 33 141 136 114 -36 -82 -111 161 81 -1 -218 -131 -49 -13 93 169 -139 -267 -40 -28 114 218
5515B18q3k50R1qR7l2p7k6MK63k49N2K5j08j1J63k58K83L7j00R2j15Q6j60R0n6
$$ 218 135 -115 -24 -32 65 33 -44 -70 -66 197 -52 0 25 -83 -94 69 -189 94 131 31 123 8 94 -66 24 -32
5541c2j50L79j43j08M3J5N5j36m9J55K6j68J55l6q4K0Q5j18j84M42k67P6J21j50
$$ -32 -182 197 54 -54 -11 4 59 -77 -126 29 55 -113 42 6 -78 -58 27 -91 -275 167 -100 -24 97 -53
5565e3L4P0m7J16k08J9j5J61j69J60J34j76j06R1O8J76p9j57r7L8m5K0o7o7L46
$$ -53 -19 51 4 120 -88 -69 -84 77 -92 68 202 26 -80 11 79 255 176 19 -78 -40 -85 -65 -132 -199 147
5590A47N2k09QK37j63M6k29J08J35l3J56k44K11l08Q7O7q5k4J75p3J45j69o9k80
$$ 147 199 -10 -2 235 72 118 -111 -3 132 99 255 11 222 -86 1 68 -17 -41 134 61 206 37 -32 -312
5614c12M68m2j76K52j05J5k03K46n2j86R8J46j42j85L2kk3L09k58N6R3N3j00o2
$$ -312 156 114 -62 190 85 100 -103 143 91 -95 3 149 7 -178 -146 -148 -171 138 -120 -64 29 82 -18 -80
5638h0J62j19P2Q3j48J6J51k36k2L18o7l41N1L8j7M11k44k27L69mj24j10J65j60
$$ -80 82 -37 35 118 -30 -14 137 -99 -121 197 130 -211 -160 -122 -139 272 28 -199 170 166 42 -68 97 -63
5662f3K5N7J24j46k1m2P9j04J20n6j3K7n2j06N7r5L44r4j16P8q5L10k45q9J52
$$ -63 -38 19 143 -3 -24 -66 13 -91 29 -27 -40 -13 -65 -171 -114 -209 135 41 -75 3 -82 228 -17 -106 46
5687D6n2K11j17j78n0R7J13Q8k48Pj22R8Q2J6j22J11j50K54lj32j92L56j00M3
$$ 46 -6 205 88 -90 -140 -43 70 158 -90 -83 -205 -107 -25 -9 -131 -20 -170 84 81 -51 -243 113 13 56
5711E6j37J74m7J15q0p4j13P1K60k31k54M42j88P1Mj9l4J20j95P8P5k1K17j74
$$ 56 -81 93 46 161 81 7 -106 -35 225 -6 -260 182 -6 65 69 50 16 136 -59 19 94 73 290 116
5735A16k26O2k4J48j7m6J07j55JR9J9j05N0J22j10O1J1p6j05M8J63j56k7p6K25
$$ 116 -110 -48 -72 76 59 13 120 -35 -34 65 84 -21 29 151 41 102 113 37 -68 -20 143 -13 -40 -116 109
5760A09j82O9q8J43O7l58R1o1J88J30k28J14l4J57j18l00L24n5J39j65l3J18k0
$$ 109 -73 -4 -92 51 118 -240 -149 -210 -22 108 -120 -6 -40 117 -1 -301 23 -32 107 -58 -91 27 7
5783GJ43j39N3K2j28J43n8j65K54n0p2l9O5j55J42J31o3j04M0o6J79j22j9j33
$$ 7 150 11 64 86 -42 101 43 -122 132 82 10 -29 36 -119 23 154 91 -13 27 -39 140 18 -1 -134
5807a34K03j7K6Q9K5Ok64L50j58j50K12o7j51Q2L5J06j95OP8%q7P5j75J24M4k25
$$ -134 69 52 78 167 192 198 -66 284 126 -24 188 121 -30 52 87 193 -2 4 82 82 -5 70 -105 19 63 -162
5833a62K35m5L1K8k29ML0K7J10J29k43K05k87J98pj9R1j29Q5l0J49j93J67k67
$$ -162 73 28 59 87 -142 -138 -108 -81 29 158 -85 120 -167 31 24 5 96 -33 52 22 171 -22 145 -122
5857a22jJ86j94K01N8k3j29P8j49K04j2P9k06J13p4r0L12k45j0q6J84j74N6j43
$$ -122 -123 63 -131 70 128 105 -24 54 -95 109 97 176 -30 83 9 -81 231 -14 -24 -110 74 -100 -44 -187
5881a87K85K21l33j25K22J02k46J84j41j6J46r8R4m1J5N4l8p3k29L12j89J28n4
$$ -187 98 319 -14 -139 83 185 -61 123 -18 -34 112 14 108 67 82 136 98 25 -204 108 -81 47 -7
5904gj18J53L45l38j4o0K14k61n8R9j47J84r7J15j18Q5O4k24J66j1m3N3%L5K31
$$ -7 -125 28 373 35 21 -39 175 -86 -144 -45 -192 -8 -105 10 -108 -23 41 -183 -17 -28 -71 -18 -18 17 248
5929B48k65K8q0K1L49j33k20J99M5r9r2j90K22J02n7p0J14K2k16o2J91J20k09
$$ 248 -17 11 -69 -48 301 168 -52 147 192 93 1 -189 33 135 78 8 122 144 -72 -134 57 177 -32
5952c2O5R8j48J10j85j80L34J45l38j2N4K1J69k31R8r1l6L38j95l2n8L7K50m5
$$ -32 33 131 -17 93 -92 -272 62 207 -131 -143 -89 -68 101 -130 -32 -123 -159 179 -16 -48 -106 -69 181 136
5976A36p9k8J0k26N11m36P9m5n4m4p9R4J65p0R9n9n6J62rL9j68J78o4K37m36L09
$$ 136 57 29 39 -187 324 -112 -33 -78 -132 -176 -255 -161 4 -66 33 -26 -82 80 71 110 -58 120 56 293 -143 166
6002A66R5j13k71K21j7J2k13K3J34r7K65k29P4j48q9K41Q9Rk47M33l32P3k3lj18
$$ 166 261 148 -123 98 81 93 -120 -97 37 -60 205 -24 50 -98 -187 54 143 152 -95 338 6 79 56 53 -65
6027f5J78j18Q9o3J17o0Q0l48R9O8l8j74J48q1K90l3k21L22j43j42K7J53j8p0
$$ -65 113 -5 84 21 138 78 158 -190 -91 -23 -61 -235 -87 -168 122 89 -132 190 47 -95 -68 85 67 -3
6051co5K97l51J7J06j90J12M2r5K94k47R2q5K02r5p3O0Jj05M6N7j84M6M2R4j42
$$ -3 -68 229 -122 -105 1 -189 -77 -35 -130 164 -83 9 -76 126 31 -42 18 19 -86 -40 17 -167 -121 -79 15 -127
6077a27L09m16K68P0j37J30r1n5J44k06J74j9k16J60k4M0n1n1J0P0j01pK26j80
$$ -127 182 -234 34 104 -33 97 6 -49 95 -111 63 44 -172 -12 -36 4 -47 -98 -88 -18 -119 -126 100 -80
6101h0R8m2K1o2q3J31J63j20J58j87K03m28K57J12k44J08p9K49k43J14k60K36
$$ -80 18 -24 -3 -65 -148 -17 146 26 184 -3 200 -228 29 141 -103 5 -74 175 -68 46 -214 22
6123B2q0q0m0L17q2j47K45k64j9J02n8R2R4j42R0j25J25P9o8k7j85K51j41M5r3
$$ 22 -58 -138 -178 139 57 -90 155 -109 -128 -26 -84 8 102 -40 50 -75 50 129 61 34 -151 100 -41 4 -89
6148h9r1K42k11K82p9L08k66j17O7p7J26q3K07r2j55q8J04k87K81M8J36j36j47
$$ -89 -180 62 -149 133 54 362 96 -21 46 -31 95 12 219 127 -28 -116 -12 -299 -18 30 166 30 -117
6171a17l6K24l8p8k8j05J23J07r0J81%J15j44l93K23J08p4k5j59L48j81j22P6
$$ -117 -153 71 33 -45 -73 -178 -55 52 -38 143 143 258 114 -279 -56 52 -22 -47 -206 142 -39 -161 -85
6194h5Q6l55L28J74m8J79p5l72kK04j95J06K93j83j72J59j30K25l77L20J5j38
$$ -85 1 -354 -26 148 100 279 204 -168 -170 34 -161 -55 238 55 -117 42 -88 137 -240 80 95 -43
6216d3n6L5j14J5J98j2j42M3J61l8j77K13r9J45qK0k94O6j23K26O2j46j22K58
$$ -43 -99 -64 -178 -163 35 23 -119 -76 85 47 -130 83 -16 129 121 141 -153 -87 -210 16 78 -68 -190 68
6240F8J24r8k41J46p1j9L02m5n6m3q2J00o9Np1j7J22j65J9J00j62K42l0o8R6m3
$$ 68 192 94 -147 -1 -72 -91 211 166 110 67 -15 85 16 21 -50 -67 55 -110 -91 9 -153 89 59 -9 87 44
6266D4%pj20N5Q4k4K30l77O1J55j72L8m5L0R0R5r8Rj47oQK01M8Q4k11J61l68J17
$$ 44 44 37 -83 -28 56 32 262 -115 -54 101 -71 -33 -78 -48 42 137 39 48 -99 -105 -97 104 152 236 25 186 -182 -65
6294f5Q3L7O1Pj21rl6j79K16j71K83j73J42R8R5k45K9qQ6k15Q2j3j29OJ74Lj47
$$ -65 18 55 116 123 2 -7 -43 -222 -6 -177 106 -67 75 173 268 23 52 44 130 -85 -3 -16 -145 -139 35 38 -109
6321a09k98L10K79M5k11M9J02k15k2R5k7j28K0J84Q0k60q9L2N5J56J67k76P0q5
$$ -109 -407 -97 182 227 16 65 167 -48 -70 25 -2 -130 -110 74 154 -106 -195 -163 -108 48 215 -61 9 -76
6345g6j13J37j25K16r9j8J20j26R9RQ2l2nO3j15q3J27j62p0K77j97P1M4J6k2k5
$$ -76 -189 -52 -177 39 -60 -78 42 -84 15 24 106 74 69 132 17 -66 61 -101 -171 106 -91 -20 24 40 18 -7
6371gpM6p8j26J95K1j42J4mJ53J06n7p3O9j15l41N77j41k60K72j63k1M6j1J82
$$ -7 -14 32 -46 -172 23 44 -98 -84 -88 65 171 114 41 110 -5 -346 231 90 -170 102 -61 -82 -36 -47 135
6396A35k94K87L1k61J04J11j73j02K55K8p9O1k6J13j61j55J39J01j44pO3ok4P1
$$ 135 -159 128 159 -102 2 113 -60 -162 93 121 42 103 77 190 29 -126 13 114 -30 -37 26 20 -4 67
6420F7l84K71J8m4PJ12o7Lj85K21K93q2k74q3j2r8l8J69N6J9Q2j57Q0K05m8j02
$$ 67 -317 -46 -28 -72 -65 47 -20 -17 -202 19 312 230 -44 -127 -139 -237 -275 -106 -50 -31 51 -106 -26 179 131 29
6446B9J1j17J00J92j24p6j12J8m0J59j58L8m9L5J32j57k46M67k18L1L15k39M1
$$ 29 40 -77 23 215 91 15 -97 -79 -119 40 -118 -80 -129 -94 38 -119 -365 102 -116 -85 230 -9 32
6469C2J47j97pN0r3Q9jM4k44K22j78J97J47k06l2L5M3o8j18L36k08j54R0Q9r1
$$ 32 179 -18 -25 25 -68 21 20 64 -180 42 -136 61 208 2 -30 5 48 -20 -138 198 -10 -164 -74 15 -76
6494g6J60J29l64R6k3l2J46l25J22K34r3P8M3j08J07p3JK4l8Q6j02K0o9N2J86
$$ -76 84 213 -151 -55 -78 -110 36 -289 -167 67 -26 52 95 -13 94 21 22 46 8 94 -8 12 -57 -5 181
6519A81l09p4K83j82K07k05J18j9j45K5K12n2j0J58o2k05M4m5K5K15j71m8k66
$$ 181 -128 -202 81 -101 106 -99 19 0 -145 -120 92 40 30 188 126 -79 -35 -80 -55 160 -11 -59 -325
6542c25K60J66r5m4J8j89J67p5m5K7R3K49j45o7J04k77J66J17j67NJ36r6j59M33
$$ -325 -65 101 6 -38 -20 -209 -42 -117 -162 -135 -42 207 62 -5 99 -178 -12 105 -62 -57 79 -17 -176 257
6566B57j24l88L91k01k53L78L3j46j15L3K33j22K8j2J02j58J53Q9k28L07l48K59
$$ 257 133 -255 136 -65 -318 60 93 -53 -168 -135 98 -24 4 -8 94 -64 89 178 -50 257 -91 168
6588A68l7j83j11J23N4j95K33j42K28j06k64J68K08j07L0R0k9q9K2j98J8L19n9
$$ 168 131 -52 -163 -40 14 -181 52 -90 138 32 -232 -64 144 37 67 157 128 39 61 -137 -119 200 141
6611A41j29m3k4o7R1P5K2k1j87M41k80m0K19Rk46O6k1p3k0L9r1J92j10o1R8j02
$$ 141 12 -31 -55 -122 -31 44 66 45 -142 299 19 -21 198 207 -39 27 6 -67 -87 -48 -139 53 -57 -118 -20 -122
6637a22J42n9L0K5K7j14J10J31j95Q4k4j00M6N0j21K5J74j3k28J58P6nj78P7j41
$$ -122 20 -39 -9 16 43 -71 39 170 -25 59 35 -65 -19 31 -90 -65 109 96 -132 26 102 97 -81 -4 -145
6662a45K30j47K8M3J3Q3o3J11j18n8O4k1P8J05j76L06n32J75k8J4j25rK18j45
$$ -145 85 -62 -34 9 22 105 42 153 35 -23 41 20 98 203 27 333 -199 -24 -52 -38 -163 -172 46 -99
6686i9MK48j40n1K36j63j15J82j44R6k0J22Mk16K35K5l85J25o2J26j9J97k2k15
$$ -99 -95 153 13 -38 198 35 -80 102 -42 54 34 156 160 -56 179 204 -181 -56 -118 8 -11 186 164 -51
6710e1k5J73n2J14j25j47K32p4K30m40J92L8l9J57l26M25l62Q4Q1k06P1M4R5j44
$$ -51 -76 97 45 159 34 -113 119 45 275 -165 27 65 26 183 -143 282 -80 4 85 -121 -50 -6 89 -55
6734e5R0k1n5J48o3J12j94J08Q5j99L13n82M13k30P4j6o7K57r2k22K53J03q7N6
$$ -55 35 14 -41 107 44 156 -38 70 155 -44 269 -313 100 -130 -56 -72 -139 118 26 -196 57 160 73 129
6758A29n9j6j16J55k61J28J27%k18J90j15j63J53P8n0j51J47K70j56p7P5j83R5
$$ 129 70 54 -62 93 -168 -40 87 87 -131 59 -56 -219 -66 12 -38 -189 -42 228 72 -5 70 -113 -18
6781a8L2J89j60O5j23N4j3L6l6P5j82K13j39J41l18K49j11K26p7k06K84l08P2
$$ -18 14 203 43 108 -15 39 26 62 26 101 -81 132 -7 134 -184 65 -46 180 103 -103 181 -127 -55
6804e5o9j2L0N3O1l3p0J09L9KN8k44K25%j75m6J00O2q6l8K10k12Q9Ppj02r4K39
$$ -55 -124 -136 -106 -53 8 -25 -95 14 53 55 113 -131 94 94 -81 -127 -27 35 -51 -89 121 -91 -2 5 -2 -104 -198 41
6832D1m3k43J00J73K48m3m07K76Lk69K43j58O8J32m4m7k10K15O5j11k98J11K00
$$ 41 -2 -245 -145 28 276 233 -174 102 105 -164 79 -79 -11 121 77 30 -180 35 100 -11 -309 -198 2
6855Bj28P5P8P3k22J27K1J4j01j2Q5R4M4k9j14N7j13k3J04Q7j92M8M9P5j4r0j2
$$ 2 -126 -51 27 100 -122 5 26 40 -61 -73 12 106 150 121 7 64 -49 -72 32 119 -73 -25 24 99 85 -5 -17
6882a7o6K05k16J52k3M2kj43j55L18J50l04O2J42k29j24K30p5L3K6j53K03j18
$$ -17 -83 122 -94 58 35 77 75 -68 -223 95 245 -59 3 145 -84 -208 22 -53 -20 6 -147 56 -62
6905f2P8lj02J5j02J87J3J95l01J32m2J25lj12Q0j0J54j89J37l60M43r7n6k07
$$ -62 16 13 -89 -74 -176 11 24 219 -82 50 8 133 130 18 98 88 242 53 190 -170 273 176 120 -87
6929h7j33K10J03j0J21j48l3jJ4j72R5o0R8J71k54J93j80R7j07K09k28L9j07K8
$$ -87 -220 -10 93 83 204 56 23 22 36 -136 -41 -101 -3 168 -86 107 -73 24 -83 126 -102 -63 -170 -142
6953a42j03J57R8p9R6oO7J95l77J36J01j18j48R5J05k01J41lo4l5j22J4K71j17
$$ -142 -245 -88 10 -69 27 21 88 283 -94 42 143 25 -123 -28 77 -124 17 14 -50 -85 -207 -193 78 -39
6977c9J60O8o3l39J52j06K73l04K52j14N7J44j81P3o3R2O2N0m2k4j37r3k3J14
$$ -39 121 189 126 -213 -61 -167 106 -198 54 -60 -3 141 -40 33 -30 62 124 174 132 108 -29 -122 -145 -31
7001c1p8Q2N6J00k42J70m2J01j24k0n2l4K20q1j0k15p2L71M4j79M6p0j46L52j32
$$ -31 -109 -27 29 129 -113 57 15 116 -8 -28 -80 -114 106 25 15 -200 -272 99 143 -36 10 -60 -206 146 14
7026A4q5J94n9Q4j56j11J54j66K36j41j8l0P6rJ03l58K10j4J44m1Q8M1j98J50
$$ 14 -71 123 64 148 -8 -119 35 -131 105 -36 -54 -84 -8 -17 86 -272 -62 -76 68 27 115 156 -42 108
7050A08j18L5J41j14p5J7N1L2N7m41J91P8J0k03K08n9OQ3J66j14n6K08k18J82
$$ 108 -10 25 166 52 -23 -6 45 77 134 -307 -116 -38 -28 -231 -23 -82 -76 7 173 59 3 211 -7 175
7074A75k43N6Kp2PJ45L9j18k8J60k76K71q8j09K20k2l06J84J4j11L16l69J65q5
$$ 175 -68 -12 -10 -82 -75 70 109 -9 -37 123 -153 118 30 -79 141 119 -187 -3 11 -100 216 -153 12 -73
7098g3J16j15L31j72r9P2j99J29J48k38J59j87M1M05l11j79K80mj56Q0rj04J39
$$ -73 43 -72 259 87 -12 60 -139 -10 138 -100 59 -128 -87 318 7 -172 108 104 -52 28 19 -85 54
7121E4J34k63RJ04k02JJ97j05J2NQ0j22K10o9p3k4J5J28k73J48j51K78j04q1J54
$$ 54 188 -75 -66 38 -164 -163 34 -71 -59 -54 26 -96 114 45 -28 -52 -37 91 -182 -34 -185 93 -11 -92 62
7146F2j62N4l6J74k79L04j77J70k02K44q4o3M9p6j8J57j40k9M5J23j82M0m0Q3
$$ 62 -100 -46 -82 92 -187 117 -60 110 -92 152 68 5 54 -22 -40 117 -23 -52 -7 116 -66 -26 -66 17
7170A7j20J70j36J15O2r7J7O6L2l44Q7j4RJ37j73L20k0p5j46J33l2qN9j02o8J41
$$ 17 -103 67 -69 46 108 11 28 94 126 -218 -131 -145 -136 1 -172 148 128 53 -93 40 8 0 59 -43 -111 30
7196C0k11J38Q7p1J53k95L47R4m42J36L1k10J55L5k7K13k78J88j21J16j57L07
$$ 30 -181 -43 44 -27 126 -169 178 272 -170 -34 -3 -213 -58 -23 -50 163 -115 73 -48 68 -89 218
7218B18m00l3K25j43K70k14J45j6O8k59K33RP4l59J49J94j55k68J47K07l9m6O9
$$ 218 -182 -215 10 -133 137 -77 68 52 120 -139 94 103 177 -182 -33 161 6 -262 -115 92 53 7 76
7241G6l1j80QN6n9K24r7N9J3N2j2J1k48J62k54K09j23N0K44k04J71k81K54j88
$$ 76 45 -135 -127 -71 -130 94 -3 56 69 121 109 120 -128 34 -220 -11 -134 -84 160 -44 127 -154 100 -88
7265h8J7k19J96Q4J58Ql53K17J09k60K93j09k19m4K00j16J79k79Q1J51J10o5j98
$$ -88 -71 -290 -94 -10 148 156 -197 20 129 -131 162 53 -166 -210 -10 -126 53 -226 -145 6 116 51 -147
7288a47N6K6j51K89J5j3j40M7j88K02m3L1O7K7O5j40M5r9n2K57Q7j81j60P0j87
$$ -147 -91 -65 -216 73 88 75 -65 -18 -206 -4 -47 -16 51 78 143 3 48 -51 -103 154 241 60 -100 -30 -217
7313b17K40m4m4J10K07k98K37l09K25j23M9N1j88q5R2J8p4J5N3K2J67k61K02r1
$$ -217 23 -21 -65 45 252 -46 191 -118 107 -16 33 84 -104 -189 -97 -79 -153 -138 -85 -63 104 -157 45 -46
7337d6L0J23R4n23K81L00k09k16J20l2J8L6k78J30K84j07n7mLJ28j09M1n5N4R5
$$ -46 -16 107 201 -322 -41 259 50 -166 -46 -78 -60 -24 -302 -172 112 5 -52 -56 -53 75 -34 7 -48 6 101
7362A01J11q3j54J22p4n4J01k9q2K29Ql33J22q8j0r6L00j46J93j09r2j02m3J2
$$ 101 212 129 -25 97 23 -31 70 41 -41 188 196 -137 -15 -103 -113 -209 91 -55 138 29 -63 -165 -208 -196
7386a96K24j1j27n2J44Q5k66L03j81L31l87M55m32K18M1k85L55l03Q5j26J62j98
$$ -196 28 17 -110 -162 -18 67 -199 104 -77 254 -133 322 -110 108 149 -136 219 -84 1 -125 37 -161
7408a61L88m1k81P7j6J66l1O6j78M4j62K3j39K79q1l8J61j02j84M55k42k00L44
$$ -161 227 186 -95 -18 -34 132 101 167 -11 33 -129 -106 -245 34 -47 -85 76 -26 -210 245 3 -197 147
7431A47m8K03k77lj84J9L12j63prk77L79M9p8k76L00J0p0j9L1K18j96jK41l53
$$ 147 99 302 25 22 -162 -143 169 6 -1 -10 -287 92 141 63 -213 87 97 27 8 39 257 61 60 301 -52
7456e2J40j07O1j34J50p3q8j17P3K1L14j56P0J45j88K2j90n6K32R3k17J98n2K
$$ -52 88 -19 42 -92 58 -15 -103 -220 -147 -126 188 32 102 247 59 81 -109 -165 67 160 -57 141 89 91
7480I1M4m31J19M1K36p8J09m4n6Q9k01J44o2ml4o4Q8o5Q3P1j69J73j13J13m2p0
$$ 91 135 -296 -177 -136 100 22 131 87 31 120 -81 63 1 -3 -37 -101 -13 -78 5 76 -93 80 -33 80 38 -32
7506c2M4l2m7K05l87M37k05n2J99Rj88J16J7j6N4k02J16M2r6j99K46k4N8o7Mn
$$ -32 12 -20 -67 138 -249 188 -17 -69 130 139 -49 67 84 68 122 -80 36 78 -18 -217 29 5 63 -4 0 -5
7532ej51J95q2J99J58m53K71P1k9o9j05rQJ2j22J74J5j20j00J16r9j36K59j01
$$ -5 -156 39 -43 156 314 -139 132 203 174 105 0 -9 -1 11 -111 63 78 -42 -142 -26 -125 -261 -2 -103
7556a03J08J37l97L87l9j13J0J74m41K15L07l21N6N0R6j71j3L8k08K88k53K22
$$ -103 5 142 -255 132 93 -20 -10 164 -277 -62 245 -76 -20 30 126 -45 -58 -20 -228 60 -193 29
7578B9J96k22K69k59o0m2p3K88r1o4N4R2k05K08j78Q1j11K7M0O6l6K0Q2q6Q7N0
$$ 29 225 3 272 13 -47 -89 -162 126 35 -29 25 117 -88 120 -58 23 -88 -61 -21 45 9 29 111 25 112 162
7604A62K9l08l0K82l8j80J81j20R8J25j95Kj6k41M2M6k8J11K30m22L19P1o8r1
$$ 162 191 -117 -147 135 97 -83 98 -22 76 201 6 8 -8 -249 -207 -161 -189 -78 152 -270 49 120 52 -39
7628c9R2k16L52j61j1O7j78J99j79O7j93L47j45J65j43j41K26l6n1j87K04J23
$$ -39 53 -163 189 28 17 84 -94 105 -74 -7 -200 147 2 167 24 -117 109 73 22 -165 39 162
7650A62j06r0P9j91J35J93l43L3J01q5J45pl47J69j37K20j07J29J31Q1j34J01
$$ 162 56 -34 45 -146 -11 182 -161 -128 -27 -112 33 26 -321 -152 -289 -69 -176 -47 84 165 31 132
7672A32j56r5R7J64k28K10j27j86K24p1n8R5M3J2k37K14J18k7j76J58j48M3pl
$$ 132 -24 -119 -22 142 -86 124 -3 -189 35 -36 -94 1 44 56 -181 33 151 124 -52 106 -42 1 -6 -9
7696iR5j51m3L00j0j69j47J19q7J30k23J82k26K70L9pj18N3lo5j19J39J75n1l4
$$ -9 86 -65 -108 192 182 13 -134 -15 -102 28 -195 -13 -239 31 70 63 -55 -2 -5 -70 -189 -50 125 74 40
7721D0k10J19O6L2oj26J53l82L99j07K6L4j34J9K74k83R7l0Kj3K28k09q3J50l64
$$ 40 -170 -51 15 47 41 -85 68 -314 85 -22 4 38 -96 -77 197 -86 11 -19 -17 -30 198 -11 -94 56 -308
7746c08L14J26j64o1Q7j5N4q6J5J06Q2j05N0J98k32j48K48j11j03J18l58K30J52
$$ -308 6 132 -32 -93 -6 -21 33 -53 -38 68 150 45 95 293 61 -87 161 50 -53 65 -293 -63 89
7769H9Lo8L3j12j12K49o5Q8K46k82j2k6m9L1r1J44R1j17L3J8o9q8J02jJ0q7j92
$$ 89 92 24 57 -55 -167 82 17 105 351 69 57 31 -18 13 -78 66 157 40 73 91 22 -66 36 35 45 -42 -234
7796b34MK40o1j14Q5J5nJ01q9J26J04j32O7j84J22M6N2o8r0o4P2k66L13QN5n4
$$ -234 -230 10 -51 -165 -80 -65 -70 31 -58 68 172 40 107 -77 45 91 143 75 -15 -79 -7 -273 40 48 103 49
7822D9r8J59ok03Q1J50k07p0J83J1N2P9l94J11J55N2k75R5K08k0k53J98j27L3
$$ 49 -49 110 104 -99 -18 132 -75 -145 38 49 101 180 -214 -103 52 104 -171 -76 132 112 -141 57 -70 -37
7846c7K4lKM2O5j90Q6J05Q5Mj51p6p9NJ06K86k84r3L1j24K07j42PK12j83K03r2
$$ -37 -13 -16 -14 28 93 -97 -11 94 179 183 32 -44 -123 -118 -12 274 -10 -103 -72 -196 11 -131 -124 88 -95 108 16
7873A6L7n0j30K08k22L23j28O2k09J33m1kK44r5j31J03j72j4M1J34L8r6j6P9K1
$$ 16 53 3 -127 81 -141 182 54 116 -93 40 -1 -3 241 146 15 118 -54 -68 -27 107 145 49 33 112 133
7898A33n5k93N88l17j24l63K41K02j63nN1R9L0o7j2n0k7M7P0J46J24k28Ol3M0
$$ 133 78 -215 373 56 -68 -431 -190 12 -151 -156 -105 -6 24 -43 -55 -105 -132 -85 -15 131 255 27 33 0 40
7923D0J57k68N2p1O4J50k22K61j36K4q3ro6J7M2j74K89J8J3k27K06j20J79m4q8
$$ 40 197 -71 -19 -90 -26 124 -98 163 27 51 -32 -41 -107 -90 -48 -222 67 85 98 -129 77 -43 136 92 4
7948DM3k38M04l47J41K2j67J19K29k27k2P2j6j65O9M0O5q6J26j6N1J03j86j30
$$ 4 47 -191 213 -134 7 29 -138 -19 210 -17 -39 33 17 -148 -79 -39 26 -60 66 50 101 204 18 -112
7972a12r7J10K40k18k00L74k52K05j85J05J18k4o4k3K1J43Q8p9j40kJ55P4k38
$$ -112 -209 -99 141 -77 -277 97 -155 50 -135 -30 88 64 0 -23 -2 141 229 150 10 8 163 237 -1
7995aj47J67N8P2j48j27M7M6k2J75j11p2Q8j5J59k10J45M4J9j85R2o8J7K7j29
$$ -1 -148 19 77 149 1 -126 -79 -33 -55 120 9 -63 25 10 169 -41 104 148 167 -18 74 6 23 50 -79
8020g9k8K82k75M4K02k8j36j49m5J58j33o6K45K41k84O1q4P7j54J94k16P3P4o9
$$ -79 -107 175 -100 -56 146 118 -18 -167 -212 -54 -187 -253 -8 233 -51 10 -74 3 -151 43 -173 -100 -26 -95
8044i5R3J11k33j5K79p1r7K52l46QL05l11K10j54Q2PP5j21J1k6l3q2K33j05J06
$$ -95 -2 109 -124 -139 140 69 -28 224 -122 -114 191 -120 90 -64 18 25 100 -21 -10 -36 -69 -151 82 -23 83
8069H3p9J33l01J73p7q1L14o5J2n3o8j27J08K17k68J39n4K2j0n7J05j15j25J39
$$ 83 4 137 -164 9 -68 -149 165 100 112 59 -9 -136 -28 189 -79 60 6 28 18 -39 66 -49 -174 -35
8093c5j41L19P3j18J19l02K26k41J47p4P0m0PJ74%k02j80K40%j27l3n5J72J75
$$ -35 -176 143 216 98 217 -85 141 -100 47 -27 43 3 10 184 184 -18 -198 42 42 -85 -118 -173 -1 174
8117A74m02L30M8j51p2J27Q2m8j25J62J9k36j17J30j73M15k21j49K57J95k30P0
$$ 174 -228 102 150 -1 -73 54 136 88 -37 125 144 -92 -209 -79 -252 163 -58 -207 50 245 15 85
8139H5M8o0j8q4J74k94J89J91j05j55n7R0j23K93j87p6L8M2r5N8K24n5r7L8r9
$$ 85 133 73 55 -29 145 -149 40 231 126 -29 -86 4 -119 174 -13 -89 -51 -9 -104 -46 178 123 26 64 -35
8164c5O1R6k8k40M3K90j49L6q7L6j99J94N7j86p2K5%K46j60j25K31M4j6O2k4q2
$$ -35 26 122 94 -146 -103 187 38 74 -13 23 -176 18 75 -111 -183 -158 -158 88 -72 -197 34 78 62 124 100 18
8190A8l8
$$ 18 -20
8191b0
$$ Imaginary data points
##PAGE= N=2
##DATA TABLE= (X++(I..I)), XYDATA
0@%%%%%%%%%%%qJ6j6J6j9K7l2M0m8N6p2Q8j04J20j36J60j86K11k43K82l23L65
$$ 0 0 0 0 0 0 0 0 0 0 0 0 -8 8 -8 8 -11 16 -16 24 -24 32 -40 48 -56 64 -72 88 -98 113 -130 152 -171 194
33A94m15M70n30N97o70P48q35R31j034J149j276J413j560J720j898K093k305K539
$$ 194 -221 249 -281 316 -354 394 -441 490 -544 605 -671 742 -818 902 -996 1097 -1208 1331
51A331k798L083l399L753m151M602n119N713o407P235q241R493j1099J3245j6278
$$ 1331 -1467 1616 -1783 1970 -2181 2421 -2698 3015 -3392 3843 -4398 5095 -6004 7241 -9037
66i037K0930k9046M7240j63127M6855L02467j18673k12786k9271J66185J6574
$$ -9037 11893 -17153 30087 -133040 -86185 216282 97609 -115177 -144448 21737 38311
77C8311k2665k64l24r5384J0528J31068L1795j14081p4016Q0857O4325n1395j6069
$$ 38311 15646 15382 15058 -80326 -69798 61270 93065 -21016 -95032 -14175 50150 -1245 -17314
90a7314K6554p652n2958M3350N3926l2121n8987L3987O2739n6713l8220O9557
$$ -17314 9240 1588 -51370 -8020 45906 13785 -45202 -11215 51524 -5189 -43409 26148
102B6148M4262q2088n8443R5863O1109q4502p7834Q6588O9057p8416o1974N5704
$$ 26148 70410 -11678 -70121 25742 86851 2349 -75485 11103 80160 1744 -60230 -4526
114d526O8330n1914m7771M0247K2041l6908L201O2866k6359p8881J2890J04582
$$ -4526 63804 11890 -35881 4366 26407 -10501 -7300 55566 29207 -49674 -36784 67798
126F7798J0127j11791k3170P9187L5975n6231k7268L3684L652k4591P100L0778
$$ 67798 77925 -33866 -57036 22151 58126 1895 -25373 8311 11963 -12628 -5528 25250
138B5250k8036k3037L5627J8504m0571k9752O1373M1120o2255o0805M7652P0372
$$ 25250 -2786 -25823 9804 28308 -12263 -42015 19358 60478 -1777 -62582 -14930 55442
150E5442k5349n5636m486L2908l196o366K7927j2161n0337o792O3666K9863m9952
$$ 55442 30093 -25543 -30029 2879 -317 -6683 21244 9083 -41254 -48046 15620 45483 -4469
163d469m4258K6183M0775j1326j0200M379m347j4068L590K9031q63k4403n964
$$ -4469 -48727 -22544 18231 6905 -3295 1084 -3263 -17331 -13741 15290 14427 -9976 -15940
176a5940J0600p642l38K9104K960m2126l2566M8450N8447l2391o2253N284N5657
$$ -15940 -5340 -12982 -13320 15784 18744 -23382 -55948 -7498 50949 18558 -43695 -38411 17246
189A7246J2904l1190j3597J7638n19j2826J8827J1274j8924k2545J1963K7911
$$ 17246 30150 -1040 -14637 3001 2482 -10344 8483 19757 833 -21712 -9749 18162
201A8162r036k2917N679J6146r417o856J2414Q309j0715j3793J8090J3469j5765
$$ 18162 9126 -13791 -8112 8034 -1383 -8239 4175 12484 1769 -12024 6066 19535 3770
214C770p735J2091N567j2204k755J1239K853k0214j320K3925k694k2811m865K3129
$$ 3770 -3965 8126 13693 1489 -1266 9973 12826 -7388 -8708 15217 12523 -10288 -15153 7976
228G976J1612k0375j3358J5625J1666q418o98J778m312l760Q345J3128j5507j8979
$$ 7976 19588 -787 -14145 1480 13146 4728 4030 5808 1496 -2264 6081 19209 3702 -15277
242a5277J3507J8939j2208k0446O996J9372m796k3228O242K1335l860j4244j150
$$ -15277 -1770 17169 4961 -15485 -8489 10883 6087 -17141 -10899 10436 6576 -7668 -8818
255h818J1478K073n565M413K597j3780l155J9928M717j8568j4804J3217J6906
$$ -8818 2660 4733 -832 3581 6178 -7602 -10757 9171 13888 -4680 -19484 -6267 10639
268A0639j0948j2581N896L896n304L158R487k480j4511M26K2197J694j9011k418
$$ 10639 -309 -12890 -6994 -3098 -8402 -5244 4243 1763 -12748 -12322 9875 11569 -7442 -9860
282i860J3646M294j1274l503J1441r51j4816K846J3879l724j0675j245R855J777
$$ -9860 3786 8080 -3194 -6697 4744 3793 -11023 -8177 5702 1978 -8697 -9942 -87 1690
296A690p204N189N294r770j908J4286O088j2465j1965J1617J5886j1346j2835
$$ 1690 -5514 -325 4969 -4801 -6709 7577 13665 1200 -10765 852 16738 5392 -7443
309g443O046O471l253n710L671L967q235k865J2305J203j0167O04Q679K966q415
$$ -7443 -1397 5074 1821 -3889 -218 3749 -4486 -7351 4954 6157 -4010 -3406 5273 8239 -176
324a76j704J2116o10j1997J504R217j352p428k704N903K09p899M473M625p482
$$ -176 -1880 10236 9626 -2371 -867 8350 6998 -430 -3134 2769 2978 -4921 -448 4177 -3305
339c305l739P098P300m586j0596N368J2629m101p273J633K195Q20j313J041m35
$$ -3305 -7044 54 7354 2768 -7828 -2460 10169 6068 -1205 428 2623 3443 2130 3171 2736
354B736q011n61R780j049r324j640N010M973m311l768P133K26n700K628N294Q19
$$ 2736 -5275 -5836 3944 2895 -6429 -8069 -3059 1914 -2397 -6165 968 1194 -4506 -1878 3416 4235
370D235l462l829M007J596l671K404M47o403k265L527N152j219q376j03N988N29
$$ 4235 773 -3056 951 2547 -1124 1280 1727 -4676 -6941 -3414 1738 519 -7857 -7960 -1972 -1443
386a443J391J371l194j062O82N289M550o018l943K520O33P86O55r64k284m942
$$ -1443 -52 1319 -1875 -2937 -2255 3034 7584 1566 -2377 143 776 1562 2217 1253 -1031 -5973
402e973m58Q642J226n989l256O72N489L130j794K67j630j969M985K496j238p75
$$ -5973 -6431 2211 3437 -2552 -5808 -5136 353 3483 1689 1956 326 -1643 3342 5838 4600 3825
418C825l566k52J405j007K200M6m632j987j020K727P019j94n654o132p7J3257
$$ 3825 259 7 1412 405 2605 2651 -1981 -3968 -4988 -2261 4758 4564 -1090 -7222 -7299 5958
434E958J0055r637j3832j633J3347J2126o889j3681l295L735P604L790n277p191
$$ 5958 16013 6376 -7456 -9089 4258 16384 9495 -4186 -7481 -3746 3858 7648 2371 -4820
448d820n553J918J3114M551r052r737N81J3082O900r399o316N363M544j827o743
$$ -4820 -10373 -8455 4659 9210 158 -9579 -8998 4084 10984 1585 -4731 632 5176 3349 -3394
463c394K553Q855m493j1407j31Q173N437o432q221N201M087n320N67Q055N110
$$ -3394 -841 8014 3521 -7886 -8017 156 5593 -839 -9060 -3859 228 -5092 -4525 3530 8640
478H640q980j4349Q124K1605J745j7738j4162O484J8111K853j0545p066n054K64
$$ 8640 -340 -14689 -6565 15040 16785 -953 -15115 -8631 9480 12333 1788 -5278 -10332 -10068
492a0068R857J0462J27j8683j7559J5976K9015K688k5136k0814J3374K8608K545
$$ -10068 -211 10251 10378 -8305 -25864 -9888 19127 21815 -3321 -24135 -10761 17847 20392
505B0392j8766j2182L246J1394M241l962k848o478m805P160Q500o10r805p189
$$ 20392 1626 -10556 -7310 4084 8325 4363 1515 -4963 -9768 -2608 5892 5282 -4523 -11712
519a1712J0222J0515o495q420K989J0823K831j3130o293J1844R568m899j2180
$$ -11712 -1490 9025 2530 -5890 -2901 7922 10753 -2377 -8670 3174 12742 7843 -4337
532d337m495Q451O239k407k450m907m687K276Q153Q108l662j5843m472J4094J4641
$$ -4337 -8832 -381 5858 3451 1001 -3906 -8593 -6317 1836 9944 6282 -9561 -14033 61 14702
547A4702J127j7657j2900J0170J5590K842j0149j1812L17N580L562N329j704j2272
$$ 14702 15829 -1828 -14728 -4558 11032 13874 3725 -8087 -7770 -2190 1372 6701 4997 -7275
561g275q046P424J7823M758j9048j2433J2085J5708n9j2651m326R422J533o726
$$ -7275 -15321 -7897 9926 14684 -4364 -16797 -4712 10996 10937 -1714 -6040 3382 4915 -1811
575a811L01N527J315p980p398O222Q984k927p019k515M463L656l368J543O917
$$ -1811 -1510 4017 5332 -2648 -10046 -3824 5160 2233 -4786 -7301 -2838 818 -2550 -1007 5910
590E910k472r542j548J2214J2131j0240j8533J995J6570N875j0941j1625M552
$$ 5910 3438 -6104 -7652 4562 16693 6453 -12080 -10085 6485 12360 1419 -10206 -5654
603e654P712l732j418N112n41o558l877Q749J1120n905j0910J338P884M660l929
$$ -5654 2058 -1674 -3092 2020 1479 -5079 -8956 -207 10913 5008 -5902 -4564 3320 7980 4051
618D051n651L107P53m294J078K926O01l372o148K233O899m24k700j915L87M327
$$ 4051 -1600 1507 2260 -2034 -956 1970 2571 -801 -6949 -4716 2183 1759 -941 -2856 -2469 1858
634A858k61j249L241R8k711j618O53N345O17o752k730J230J955K718k040l301
$$ 1858 1597 348 3589 3687 976 -642 11 5356 5973 -779 -3509 -2279 -324 2394 354 -2947
650b947j099j772M091O694j712o231l582M842J0129q71r013k169L656M394O36
$$ -2947 -4046 -5818 -1727 4967 3255 -2976 -6558 -1716 8413 7542 -1471 -3640 16 4410 5046
665E046m803j958m3j025L115J047l616j679N0K687K228k418m30K544j47P12K71
$$ 5046 243 -1715 -1758 -2783 332 1379 -2237 -3916 -3866 -1179 1049 -1369 -1799 745 598 1310 1581
682A581q90J384N6l33l20l764J111M641k314m854j170K887L543l011l182L096
$$ 1581 691 2075 2131 1798 1478 -2286 -1175 3466 1152 -3702 -4872 -1985 1558 -1453 -4635 -1539
698a539J348j318J484J581Q21k290j436M425J727l731p65l07N1P09l50k17k389
$$ -1539 -191 -1509 -25 1556 2377 87 -1349 3076 4803 1072 307 0 51 760 410 193 -2196
715b196l107M658L085m146k598J881L771O88k899R56K773k376O04K712p99k991
$$ -2196 -5303 -645 2440 -1706 -4304 -2423 1348 2036 -863 93 2866 490 1094 3806 3007 16
731A6j298K859K707n366l212L644Q27j065j250l28J326o41P79L863k710k810M031
$$ 16 -1282 1577 4284 -1082 -4294 -650 177 -888 -2138 -2466 -1140 -1781 -1002 2861 151 -2659 1372
748A372K904j378l333N3M684r32n441J672K205k206j567o62K022k09l070K352
$$ 1372 4276 2898 -435 -382 4302 3370 -2071 -399 1806 -400 -1967 -2629 -607 -816 -3886 -1534
764a534K690l147K35K737P00k05j761J846K572l748l14K983j827k195K94R37L40
$$ -1534 1156 -1991 -1756 981 1681 1476 -285 1561 4133 385 71 3054 1227 -968 -674 263 603
781F03l737j047M844r15l466J309J722J043r84l04L278n38k747L209J541k335
$$ 603 -3134 -4181 663 -252 -3718 -2409 -687 356 -628 -932 2346 1808 -939 2270 3811 1476
797A476j399j7J792o54l465J428Q50k879L89J649N1j009j543L251K845l540l48
$$ 1476 77 60 1852 1198 -2267 -839 11 -2868 -2479 -830 -779 -1788 -3331 -80 2765 -775 -1123
814a123L023P06o60j486Q73K001k607j222J896j523j469R99q3m26j802n7L474
$$ -1123 1900 2606 1946 460 1333 3334 727 -495 1401 -122 -1591 -592 -675 -1101 -2903 -2960 514
831E14p15j904J750J101O3j47L73K004q84k781K324J474j985j205q05M58J49j948
$$ 514 -201 -2105 -355 746 809 662 1035 3039 2155 -626 1698 3172 1187 -18 -823 -365 -216 -2164
849b164J307R82k750j70J860R53M85j415M69J858j152J423K346k224k185K29J594
$$ -2164 -857 125 -2625 -2795 -935 18 503 -912 -443 1415 263 1686 4032 1808 -377 -148 1446
866A446J695l024k372J631r68j23J506r47m14j444K4M421N67k657N08L58R46J566
$$ 1446 3141 117 -2255 -624 -1592 -1715 -209 -1156 -1570 -3014 -2990 1431 1998 -659 -151 207 1153 2719
884B719r49J77r41j906K200K74k588QL06o10p53j385K789K029l767p69K947J428
$$ 2719 1770 1947 1006 -900 1300 1574 -1014 -1006 -700 -1310 -2063 -3448 -659 1370 -2397 -3166 -219 1209
902A209L80j153M77J529k958J35M959p59m218k858R64N031o74m566p90O2J125
$$ 1209 1589 436 913 2442 -516 -381 4578 3819 -399 -3257 -2293 2738 2064 -2502 -3292 -3230 -2105
919b105L100j92j529j419q73M149K941j973n28k311n38M256J966k184m287l093
$$ -2105 995 803 -726 -2145 -3018 1131 4072 2099 1571 -740 -1278 2978 4944 2760 -1527 -4620
935d620M850L453m722k580J658J145n32j623L009K755m420j448M838J860j969
$$ -4620 230 3683 -1039 -3619 -1961 -816 -1348 -2971 38 2793 -1627 -3075 1763 3623 1654
950A654k545J956L598l393m078L280K931j823l835k445L207K993j167j336k931
$$ 1654 -891 1065 4663 1270 -2808 472 3403 1580 -2255 -4700 -1493 1500 333 -1003 -3934
965c934m27M991K246j906j693m24J990P56K86L023k084p360J230O864K730o709
$$ -3934 -4361 630 2876 970 -723 -1147 843 1599 1885 4908 2824 -4536 -3306 3558 6288 -421
981d21p481M376P204l398m156K083K271k134k913N051O470n350o822L857O288
$$ -421 -7902 -3526 3678 280 -3876 -1793 478 -1656 -4569 482 6952 1602 -5220 -1363 4925
996D925O65n324k941L492J449k462j16o26m37R05k001j86J650J171N16l373o12
$$ 4925 5590 266 -2675 817 2266 -196 -312 -938 -1375 -470 -2471 -2657 -1007 164 680 -2693 -3305
1013c305N459J452l923j76K868J095l774k473P172K139r587m054P029O044m536
$$ -3305 2154 3606 -317 -493 2375 3470 -304 -2777 4395 6534 -3053 -7107 -78 5966 1430
1028A430r089L027P726k494m162K716K704j250l609K659O186k661n413J904K689
$$ 1430 -7659 -4632 3094 600 -3562 -846 1858 608 -3001 -342 5844 3183 -2230 -326 2363
1043B363J38j690j486J009p32j777K000q6j819J763n87j623Q20K701K226l278
$$ 2363 2501 811 -675 334 -398 -2175 -175 -261 -2080 -317 -904 -2527 -1707 994 3220 -58
1059e8l968N122M439l866l015J525L183j897m667L329M467n622m692L423M439
$$ -58 -4026 1096 5535 1669 -1346 179 3362 1465 -3202 127 4594 -1028 -5720 -2297 2142
1074B142j011n007M25M924j741j583L653P81k271j912K448M232k483m239J872
$$ 2142 1131 -3876 -3451 1473 -268 -1851 1802 2583 312 -1600 848 5080 2597 -1642 230
1089B30P54j311Q12j83j351k321M90M874j498m740J905M415r56k969M92M813L6
$$ 230 984 -327 485 302 -1049 -3370 -2880 1994 496 -4244 -2339 2076 1120 -1849 -1357 3456 3492
1106C492n656J987M494k406l032P98K628j177m742J385N018l072m262K162L337
$$ 3492 -2164 -177 4317 1911 -1121 -323 2305 1128 -3614 -2229 2789 -283 -4545 -2383 954
1121I54l61k826P28L788j678k076L807P88k527j248J655K181k598k483L222j73
$$ 954 593 -2233 -1505 2283 605 -1471 2336 3124 597 -651 1004 3185 587 -1896 1326 1153
1137A153l958J012K550n63l078p77M572Q67m229R50L580l12k017R5L480l74m605
$$ 1153 -2805 -1793 757 194 -2884 -3661 911 1778 -2451 -1501 2079 1767 -250 -155 3325 2951 -1654
1154a654J452M223l004l430J306K549r57m578J512M525k500l207L070J942j186
$$ -1654 -202 4021 1017 -2413 -1107 1442 485 -4093 -2581 1944 -556 -3763 -693 1249 63
1169F3j857J855L637k607k834M038J376l194j507J638J890k660k955L374R78m046
$$ 63 -1794 61 3698 1091 -1743 2295 3671 477 -1030 608 2498 -162 -3117 257 1235 -2811
1185b811J26K604K95k003p98L695J235m358J456L868j425k221M68K602O3m575
$$ -2811 -2685 -81 214 -1789 -2587 1108 2343 -2015 -559 3309 1884 -337 131 2733 2796 -1779
1201a779P37L635k509l078J529J977p93l093J134M076k107k656L264K000j884
$$ -1779 -1042 2593 84 -2994 -1465 512 -281 -3374 -2240 1836 -271 -2927 337 2337 453
1216D53j260J727K691k153l355L750R95l524q04J697R32k465j947L153J066l832
$$ 453 -807 920 3611 1458 -1897 1853 2848 -676 -1480 217 1149 -1316 -3263 -110 956 -2876
1232b876N22L164l48j543j92L302P24l765O00L792j437k570O25J664m22l098J55
$$ -2876 -2354 810 462 -1081 -1273 2029 2753 -1012 -412 3380 1943 -627 -2 1662 1240 -1858 -1703
1249a703L358k342k601K179J675j176j726R04L367j442k465L109J349j701n79
$$ -1703 1655 -687 -3288 -1109 566 -610 -2336 -1432 1935 493 -1972 1137 2486 785 206
1264B06R55J499j606k630K372Q31k951k59J324J71j587j202K683R66k810Q49K676
$$ 206 1161 2660 1054 -1576 796 1627 -1324 -1583 -259 -88 -1675 -2877 -194 772 -2038 -1189 1487
1281A487q55j000M25K058L18k906O40K624k206j994J303P63o63k076K72K531j791
$$ 1487 632 -368 57 2115 2433 -473 167 2791 585 -1409 -106 657 -6 -2082 -1810 721 -1070
1298a070j737K206J144o28r05O63K502q34j888K114O39j418m09O18J78j090j597
$$ -1070 -2807 -601 543 -85 -990 -327 2175 1341 -547 1567 2206 788 379 997 1175 85 -1512
1315a512J337M43k313M44R65l65R4k66J047J144k015R01J938r86k52M91L72K19
$$ -1512 -175 268 -2045 -1601 -636 -1001 -907 -1173 -126 1018 -997 -96 1842 856 604 1095 1467 1686
1333A686j852q8J983j696j581P86J08k0p08l42J743p53r26J868N08m85K3k6J797
$$ 1686 -166 -254 1729 33 -1548 -762 -654 -674 -1382 -1724 19 -734 -1660 208 716 231 254 228 2025
1352B025Jj884R66J06j413K40M65o10n17j110P59J380j852K1J060k86K30q2O80
$$ 2025 2026 142 1108 1214 -199 41 506 -104 -621 -1731 -972 408 -1444 -1423 -363 -649 -419 -501 179
1371A79J707j517l36J780l73o37j48l66O64j118r16J284n77j257P08j89o4L98
$$ 179 1886 369 33 1813 1440 803 655 289 953 -165 -1081 203 -374 -1631 -923 -1112 -1176 -778
1389g78k15J222j69j032K057O23j049K3K18K37K10j470J213Pk465QR97N94j032
$$ -778 -993 229 60 -972 1085 1708 659 682 900 1137 1347 -123 1090 1097 -1368 -1360 -363 231 -801
1408h01j710R46K196j239n34J208J3N24n38N45J252p21j071J012j08l52J56j201
$$ -801 -2511 -1565 631 -608 -1142 66 79 603 65 610 1862 1141 70 1082 974 622 778 -423
1426d23j79o9j57O96j192n96J554qp20O11O89Q04o20j119K250Q78j746o16O54
$$ -423 -602 -671 -828 -132 -1324 -1920 -366 -374 -1094 -483 206 1010 390 -729 1521 2399 653 37 691
1445F91Q74r07j939Q55J520k159j027Q01Q54O32k054J80K280o9p55P46m19Q92
$$ 691 1565 658 -1281 -426 1094 -1065 -2092 -1291 -437 195 -1859 -1679 601 532 -223 523 104 996
1463I96L10r33R34m01n25M24j293l22J417j077j054J2M80J210j099j249K163O79
$$ 996 1306 373 1307 906 381 805 -488 -810 607 -470 -1524 -1512 -1032 178 -921 -2170 -7 672
1481F72j022j49J064J428n49k358J629J803j555j519J11P78L73k051l51J969r75
$$ 672 -350 -499 565 1993 1444 -914 715 2518 963 -556 -445 333 706 -1345 -1696 273 -702
1498g02r95O32L82Q01q8j065J545K80J37M10q38m8P52j38m77o36n5O47r94j271
$$ -702 -1697 -1065 -683 118 30 -1035 510 790 927 1337 499 451 1203 1065 588 -48 -103 544 -450 -1721
1518a721J611L67j515p01J085J475k86k169J778J911r90j115O53J419m0k157J31
$$ -1721 -110 257 -1258 -1959 -874 601 315 -1854 -76 1835 845 -270 383 1802 1762 -395 -264
1535b64J746j359j015J69R7N82j419k37J692o41n37N71L64N01M09k82L90j84j28
$$ -264 1482 123 -892 -723 -626 -44 -1463 -1700 -8 -649 -1186 -615 -251 250 659 377 767 583 455
1554D55J389q68j494J045J86m25j122l25J296n83j790J293J243m92j136N72J945
$$ 455 1844 976 -518 527 713 288 -834 -1159 137 -446 -2236 -943 300 -192 -1328 -756 1189
1571A189N9k173J431J376r61p95L00Q46J7k034L52J087j114j210N69P22j11j064
$$ 1189 1248 -925 506 1882 921 126 426 1272 1289 -745 -393 694 -420 -1630 -1061 -339 -450 -1514
1589a514L22J691r10m73J717j19k61Q5M02N82j007p81J383j95j922P19K57m53
$$ -1514 -1192 499 -411 -884 833 714 453 538 940 1522 515 -266 1117 922 -1000 -281 -24 -477
1607d77o21m04J530J6k142J262J555m04n06Q6J475K95k164P77J816j382j123M67
$$ -477 -1098 -1502 28 44 -2098 -836 719 315 -191 -105 1370 1665 -499 278 2094 712 -411 56
1625E6M04J72j808K43J426j419r96J377M59l14k58M04J390j035o45J783K56j301
$$ 56 460 632 -1176 -933 493 -926 -1922 -545 -86 -400 -658 -254 1136 101 -544 1239 1495 194
1643A94J68N75N50j300j064J429O0k091O86Q23m06p99m34J647M49j735P32J932
$$ 194 362 937 1487 187 -877 552 612 -1479 -793 30 -376 -1175 -1609 38 487 -1248 -516 1416
1661A416m73j005K93R82K22j607K54J798j304j674N87O19m32j095K86J607j212
$$ 1416 943 -62 231 1213 1435 -172 82 1880 576 -1098 -511 108 -324 -1419 -1133 474 -738
1678g38r03J557K89l45JN20J028q92o53J503J87j699J35P47q3j093p89J368K87
$$ -738 -1641 -84 205 -140 -139 381 1409 517 -136 1367 1554 -145 -10 737 654 -439 -1228 140 427
1697D27k119K97J409k55o86j89J545P84k111P91J954p60j068L71Q60k5j693R6
$$ 427 -1692 -1395 14 -241 -927 -1116 429 1213 -898 -107 1847 1087 19 390 1250 1225 -468 -372
1715c72J352j114j371R08N38m62q54J7J930q52r70J757M57o29k27O12P89o59j429
$$ -372 980 -134 -1505 -597 -59 -521 -1375 -1358 572 -280 -1250 507 964 335 108 720 1509 850 -579
1734e79J752J60j885J93M76l7r84o59J326M40j997M16J917m43m27j10J058P13
$$ -579 1173 1333 -552 -359 117 80 -904 -1563 -237 203 -1794 -1378 539 96 -331 -441 617 1330
1752A330j470K78J909j316j190Q73K68O7j452k21J503r48j439J286K86m85j52
$$ 1330 -140 138 2047 731 -459 414 682 749 -703 -924 579 -369 -1808 -522 -236 -721 -873
1769h73K98J434n41p37J301M57q58j4M75L83p27j308J040L62j811R5Q79l12m84
$$ -873 -575 859 318 -419 882 1339 481 467 942 1325 598 -710 330 692 -1119 -1024 -145 -457 -941
1788i41n42J232O84j485L72J545j87q65L31Q63M21j367j68J518q61j237M83N34
$$ -941 -1483 -251 433 -1052 -680 865 678 -187 144 1007 1428 61 -107 1411 550 -687 -204 330
1806C30n13q36l17J330l82j043J031M99k56J6K20P58o0q11R43O93j307oL61j80
$$ 330 -183 -1019 -1336 -6 -388 -1431 -400 99 -157 -141 79 837 777 -34 909 1602 295 289 650 470
1826D70n53o63N89L52j523j65J199R6n41l02Q36Q37q87r9J270R6p32R1M32N10
$$ 470 -83 -746 -157 195 -1328 -1493 -294 -198 -739 -1041 -205 632 -255 -354 916 1012 280 371 803 1313
1846A313j416l46J121n84j117L76J91Pl13j93J031l55o69J051O15n67K12L6Q14
$$ 1313 -103 -449 672 88 -1029 -653 -462 -455 -768 -961 70 -285 -954 97 712 145 357 393 1207
1865A207m40j221J112M15q83k75J94k18l7j130N55R61j238l3R71K18k69j71K15
$$ 1207 767 -454 658 1073 190 -85 109 -109 -146 -1276 -721 240 -998 -1031 -60 158 -111 -282 -67
1884f7J176p14k11J102n55m00K02j25p0n52l99Q99o66r01Q81J94o04j09L43J159
$$ -67 1109 395 184 1286 731 331 533 408 338 -214 -613 286 -380 -1281 -400 -206 -810 -919 -576 583
1904E83j15j383J196J190r63l54K29N69jj232K61Q40p92n88R4j02J1j47k09Q42
$$ 583 468 -915 281 1471 508 154 383 952 951 -281 -20 820 28 -560 -466 -568 -557 -704 -913 -71
1924g1l56j64R13m60M53K60j99K71O1l11O13n72j019J057k30n44j2n65R10k61
$$ -71 -427 -591 322 -138 315 575 376 647 708 397 1010 438 -581 476 246 -298 -310 -875 35 -226
1944b26j374J098Q00n06k05K97P45P7o71J10J094m66o60J66O7L46p56n38N07m23
$$ -226 -1600 -502 298 -208 -413 -116 629 706 35 145 1239 773 113 279 346 692 -64 -602 -95 -518
1964e18l29L52l90M93k7j5L11n4K19Q52o47J24O90m17J7l86QN30p19o84K76K57
$$ -518 -847 -495 -885 -392 -419 -434 -123 -177 42 894 247 371 1061 644 661 275 283 813 94 -590 -314 -57
1986e7m85l34j69Q66J68q07P12N55q8j99K1N64L79p67k06P04n45j60k47l23N43
$$ -57 -542 -876 -1045 -179 -11 -818 -106 449 361 162 183 747 1126 359 153 857 312 152 -95 -418 125
2007A25n82l24N47n30Q4M42l34J10M95k7J96J22j71R16n07k66M56l51K0n53k27
$$ 125 -457 -781 -234 -764 -680 -238 -572 -462 33 6 202 324 153 1069 562 296 752 401 421 -132 -359
2028c59M88Rj148L55J25K28j75k09O34L97o31M01O61m71J96j9L5M20o40l61O04
$$ -359 129 138 -1010 -655 -530 -302 -477 -686 -52 345 -286 115 776 305 501 482 517 937 297 -64 540
2049E40q81J43K1l10j18M7j37N58m43nP85j11j13L47K72np9j84O27k08r65N27
$$ 540 -341 -198 -177 -487 -605 -558 -695 -137 -580 -585 200 89 -24 323 595 590 511 327 954 746 -219 308
2071C08j40j46l70l12N80j96n95J8O00k96K92rL81N77o68K37O53m69p1K27k75
$$ 308 168 22 -348 -660 -80 -276 -871 -853 -253 -549 -257 -266 115 692 24 261 914 445 374 601 326
2092C26J78o81j53N31r73O5N05m92j20K94k13Q91p8l82Q37J54o15L89J77K76m11
$$ 326 504 -177 -330 201 -772 -707 -202 -694 -814 -520 -733 158 80 -302 535 689 74 463 640 916 505
2113E05l80M53j4j009M4L09k62k62k70M18O08r09J99P86m68M01jL83K39k78j19
$$ 505 125 578 564 -445 -401 -92 -354 -616 -886 -468 140 -769 -570 216 -252 149 148 531 770 492 373
2134C73L67o45M0K15l13j25l50k64M64m99j63Q06l72J0O1M03N92k46l73Q39K00
$$ 373 740 95 135 350 37 -88 -438 -702 -238 -737 -900 -94 -466 -456 -395 8 600 354 -19 820 1020
2155A020r39M45O4k02J2q35N41J48j080L15N0J39k64n9L06M59p18O12O46m28K5
$$ 1020 81 526 590 388 400 -435 106 254 -826 -511 -461 -322 -586 -645 -339 120 -598 14 660 232 257
2176B57L40q7M30p05j03N29n90n26M26j81j77o3l14P27l70m38R55K38p14M67Q1
$$ 257 597 510 940 235 132 661 71 -455 -29 -210 -387 -450 -764 -37 -407 -845 110 348 -366 101 182
2197A82M83k39n35O69K74o89j16L06k96j64m18L71K42j003J57P49l47J62N6J93
$$ 182 665 426 -109 560 834 145 29 335 39 -125 -543 -172 70 -933 -776 -27 -374 -212 -156 37
2217C7N35l67j44Q43l22j82K19l47O8m01O4M76o53o81M94M1j30j12J21M82j91
$$ 37 572 205 61 904 582 400 619 272 340 -61 3 479 -174 -855 -361 -320 -450 -562 -441 41 -150
2238a50k24P77J60m72K53K73J08k75l96M16K49r49j76N01j82l20l31M44K21o28
$$ -150 -374 403 563 91 344 617 725 450 54 470 719 -230 -406 95 -87 -407 -738 -294 -73 -701
2258g01R9O79lk28L22R1M28n31P1N12m00k20K50k12j21k58k35L32j85l75L52m4
$$ -701 -602 77 74 -154 168 259 687 156 227 739 339 119 369 157 36 -222 -457 -125 -310 -685 -333 -377
2280c77n9L96nM25j39n62Q47kl54Q2L86j56j10n91K28J93q31L5M50r6j93k83K45
$$ -377 -436 -40 -45 380 241 -321 526 524 170 252 638 482 372 -219 9 202 -629 -594 -144 -240 -433 -716 -471
2303d71O65m33k17R83l94K21j2J30qj06l44O04l83p43N44j98mk17j34M21l10o03
$$ -471 194 -239 -456 527 133 354 342 472 464 358 14 618 235 -508 36 -162 -166 -383 -517 -96 -406 -1009
2325a009Q61K71k86L17m7L52N3l85K15P49r87P8J39l60Q6o52J17N62n15j53M92
$$ -1009 -148 123 -163 154 107 459 512 127 342 1091 104 182 321 -39 47 -605 -488 74 -441 -594 -102
2346a02l84J77J38j3L47K21j34K69k60lM21n4n69N4j2M6m23m67O12q8m51Q3J33
$$ -102 -486 -309 -171 -184 163 384 250 519 259 256 677 623 54 108 96 142 -281 -748 -136 -224 -675 -592 -459
2369d59L78Q0m77N88L40m12j0K84J54J71m20J33L27m26l07K91m89K8j35l68L68
$$ -459 -81 -1 -478 110 450 38 28 312 466 637 217 350 677 251 -56 235 -254 -226 -361 -729 -361
2390c61k13QO04k45N1M80K2Q8j75r8N64l67k56L76l48r4l75r6N08p8q46M09L80
$$ -361 -574 -566 38 -207 -156 324 346 434 259 161 725 358 102 478 130 36 -339 -435 73 -5 -851 -442 -62
2413f2k90K73k34L19J26k47L13N69l76l4j79J92J43n97j38L91n33J60P9n40J43
$$ -62 -352 -79 -313 6 132 -115 198 767 391 357 178 370 513 -84 -222 169 -364 -204 -125 -665 -522
2434e22O1J71K49j31q7P38l71m1J82K1K09j86l17M79k77p8N5j44k40m8l97M32
$$ -522 -461 -290 -41 -172 -259 479 108 67 249 270 479 293 -24 455 178 100 155 11 -229 -277 -674 -242
2456b42J31m23OO96j83J47l07L81J32l1n3M07k22k97J47m99L29j91k53K64m89
$$ -242 -111 -534 -528 168 -15 132 -175 206 338 307 254 661 439 142 289 -210 119 -72 -325 -61 -550
2477e50J11L21j65j72K89N6J88Kj12N10j11k28J11J42O7%n44K27N6o54L89p1k41
$$ -550 -439 -118 -283 -455 -166 -110 78 80 -32 478 367 139 250 392 459 459 -85 142 198 -456 -67 -138 -379
2500c79M2k80K16L82k01K5K31R5K35q%J42k97K3M07n51r9P2l35j88J73l6J88j53
$$ -379 -337 -617 -401 -19 -220 -195 36 131 366 358 358 500 203 226 633 82 -17 55 -280 -468 -295 -331 -143 -296
2524b96j58K80K38j71O8J4L30j0m09O41L1n56L32k89m0J68m51n7K23j19l67M07
$$ -296 -454 -174 64 -107 -39 -25 305 295 -114 527 558 2 334 45 5 173 -278 -335 -112 -231 -598 -191
2546a91j10K00k33K17q5L5M30J55k46L17l94J89K0j10j71J94m66k5K04j25j94
$$ -191 -301 -101 -334 -117 -202 -167 263 418 172 489 95 284 304 194 23 217 -249 -274 -70 -195 -389
2567c89kl1L61k8k14O03l14j3J59J96m7Q4l13M12r8l35J35n4l29M0k67M7M50m53
$$ -389 -391 -422 -61 -89 -303 300 -14 -27 132 328 281 365 52 464 366 31 166 112 -217 -177 -444 -397 53 -400
2591d00o2N45m62L26L00o5J50k69J10N70n15o7L86k82j30k82O8J1k35j42M41m05
$$ -400 -462 83 -379 -53 247 182 332 63 173 743 228 161 547 265 135 -147 -79 -68 -303 -445 -4 -409
2613d09J68J0l00M37K09p9L07m6j90K47p2L47j99m19R3l5n12L74J03l75K47l35
$$ -409 -241 -231 -531 -94 115 36 343 297 107 354 282 629 430 11 104 69 -443 -69 34 -341 -94 -429
2635d29O9M44n91K70N28k92j39N30j03L16l63p3K84j68m32K14j56J2j68j21K48
$$ -429 -360 84 -507 -237 291 -1 -140 390 287 603 240 167 451 283 -149 65 -91 -79 -247 -368 -120
2656a20j67j25K68J44j85K77k8J8K34k00K76J01k38K0J50k48%l46M3K71n77J39
$$ -120 -287 -412 -144 0 -185 92 64 82 316 116 392 493 255 275 425 177 177 -169 -126 145 -432 -293
2678b93J2Q6KR0K2J37l6n9L74n3J3j01J28J43m90J09kj56m04N62l06q4Q7k16K00
$$ -293 -281 -195 -193 -103 -81 56 20 -39 335 282 295 194 322 465 -25 84 82 -74 -478 84 -222 -306 -219 -435 -235
2703b35K09l92N51k8j03K42nn0J52k56L76q9l82J86j20n1j50l65J5M82l88m0M16
$$ -235 -26 -418 133 105 2 244 239 189 341 85 461 372 -10 176 56 5 -145 -510 -495 -13 -401 -441 -25
2726b5j90N7L6Q9L76j92r0M51k89j32J86l00J40Q0k13J58l73l24L46K14k98L61
$$ -25 -215 -158 -122 -33 343 151 61 512 223 91 277 -23 117 197 -16 142 -231 -555 -209 5 -293 68
2748F8n24M00L0q0M38K02m21K35J07o1l6m05O0J99l33j56Q4m0J01k63j84O35k95
$$ 68 -456 -56 -26 -106 332 534 113 348 455 394 358 -47 13 212 -121 -277 -193 -233 -132 -395 -579 56 -239
2771b39MK85j76K00q8J56K44l84N5L28k77k65L31k14j86N5k00K92K4n06K17M75
$$ -239 -235 50 -126 74 -14 142 386 2 57 385 108 -157 174 -40 -226 -171 -371 -79 -55 -561 -344 131
2793A31l31J21K95j39K19k12J99K10l81j28L17j39N5j41l73L90k91k51L24j73
$$ 131 -200 -79 216 77 296 84 283 493 112 -16 301 162 217 76 -297 93 -198 -449 -125 -298
2813b98j06L58l66N48k22k7K36Ro6J95nk3M3m90L80pl31N7M9k23m3J11J82N2l95
$$ -298 -404 -46 -412 136 -86 -113 123 132 66 261 256 233 276 -214 166 159 -172 -115 -66 -289 -332 -221 -39 13 -382
2838c82K65J91k22J85K9J08R7k97k0L71m20J04j2p4K5j33l6J7j20p5L65q6p0N6
$$ -382 -117 74 -148 37 66 174 271 -26 -46 325 -95 9 -3 -77 -52 -185 -221 -204 -324 -399 -34 -120 -190 -134
2862a34k2M19k9l15O51j84l20K21n7L2j90l45M04k4m76P3L4O3J34j99K67O9l22
$$ -134 -156 263 234 -81 570 386 66 287 230 262 72 -273 131 107 -369 -296 -262 -199 -65 -264 3 72 -250
2885b50L37K52m66N23k47m8K40m36J17L55l15l35M65l16j94J54j46J18k66J78
$$ -250 87 339 -127 396 149 101 341 -95 22 377 62 -273 192 -124 -318 -164 -310 -192 -458 -280
2905b80L16J02o8O0J00r0N5j30K96k67p0J05Q3l03j10R7j46K02k37N3M21m19K99
$$ -280 36 138 70 130 230 140 195 65 361 94 24 129 212 -91 -201 -104 -250 -48 -285 -232 189 -230 69
2928F9Q0l8J55l02K35N7p7k8O2n8jP9k81M1k78J2J24q4R6R4r0K07k07K57q7K96
$$ 69 149 111 266 -36 199 256 179 151 213 155 154 233 -48 -7 -285 -273 -149 -233 -137 -43 -133 74 -133 124 37 333
2954C33k82L06n1k21J42j91J78k40j61J45J2n3j94j15J29K13q1k4K70m20L17N4
$$ 333 51 357 306 85 227 36 214 -26 -187 -42 -30 -83 -277 -392 -263 -50 -131 -155 115 -305 12 66
2976F6K30j39j74L8L46k42j05K36k49j36L1q1M5J00k48R1J92l12L04o1L00J79
$$ 66 296 157 -17 21 367 125 20 256 7 -129 -98 -179 -134 -34 -282 -191 1 -311 -7 -68 232 411
2998D11l63J56J57l50L52r0j86Kk35J42n7J6j80j97J04M6K25p7J74k02J62O8j55
$$ 411 48 204 361 11 363 273 87 89 -146 -4 -61 -45 -225 -422 -318 -272 -47 -124 50 -152 10 78 -77
3021g7J59J03r1J08J43n57M43l13j89J94Kp7j15p2K50J4k14M10k74J04J15Ll4
$$ -77 82 185 94 202 345 -212 231 -82 -271 -77 -75 -152 -267 -339 -89 -75 -289 121 -153 -49 66 69 35
3044C5K25o6J54k5m13J80K9k19M0Pq1J51m96L30K52k30j8J48m2J96k18M0J33r7
$$ 35 260 194 348 323 -90 90 119 -100 -60 -53 -134 17 -479 -149 103 -127 -145 3 -39 157 -61 -21 112 15
3068A5j6J72k44K86j54L5J32k22j35KJ4N3l1k15M28q6j28J32R1k53L38O0j60J76
$$ 15 -1 171 -73 213 59 94 226 4 -131 -129 -115 -62 -93 -308 120 34 -94 38 129 -124 214 274 114 290
3092B90j0j33j54r2n3jj10m5p5K33J61k41K67j93J36N6P0J74L0m07l1M12j96j36
$$ 290 280 147 -7 -99 -152 -153 -263 -308 -383 -150 11 -230 37 -156 -20 36 106 280 310 -97 -128 284 88 -48
3116d8K19k53o3J41p5j10J43k44L37k89l5p3K59O1J9j37L02j6k96K46J18P4r6
$$ -48 171 -82 -145 -4 -79 -189 -46 -290 47 -242 -277 -350 -91 -30 -11 -148 154 138 -158 88 206 280 184
3139A84k34R8o0j04K6K7j22J19j25L8J06k68L8K46N7j11Q6J98Qnr8J77k55j03
$$ 184 -50 48 -12 -116 -90 -63 -185 -66 -191 -153 -47 -315 -277 -31 26 -85 1 199 207 202 104 281 26 -77
3163g7o7K73m03J31N9l33N04j66q1n2J90M6L7J15k29J46K51p3k37Q0N5%j72L1
$$ -77 -144 129 -274 -143 -84 -417 87 -79 -160 -212 -22 24 61 176 -53 93 344 271 34 114 169 169 -3 28
3187B8j75J56l41K26j58L9J95n6j74K30L28j80q4O5n7N5r3J02j71K23J68k33l41
$$ 28 -147 9 -332 -106 -264 -225 -30 -86 -260 -30 298 118 34 99 42 97 4 106 -65 158 326 93 -248
3210b48K6K64k25q0J44J34j9M7N4N1m4JO8j05j9o7J95j25J51m0q9k92J46j24P7
$$ -248 -222 42 -183 -263 -119 15 -4 43 97 148 104 105 173 68 49 -18 177 52 203 163 74 -218 -72 -196 -119
3235a19P3m2j39L43k42K0K16j12J59r5J8K08j89J56m1k1p9k25l6J41k42q8l0M42
$$ -119 -46 -88 -227 116 -126 -106 110 -2 157 62 80 288 99 255 214 193 114 -111 -147 -6 -248 -336 -366 76
3259G6q5j64J14q0J72O5j28K56j46NJ30l43L05k76K36j21k01J80N6j59K52j09
$$ 76 -9 -173 -59 -139 33 98 -30 226 80 85 215 -128 177 -99 137 16 -185 -5 51 -108 144 35
3281C5l80L33n0n6J63l27M21K06o0j77Ol9rK94m77L19k99kj6j86J11R0q5K01P5
$$ 35 -345 -12 -62 -118 45 -282 139 345 285 108 114 75 66 360 -117 202 -97 -99 -115 -301 -190 -100 -185 16 91
3306I1k79K64M8j48L00j45j5k5j06J59j47k23K03j35J69j31m5r4L04j19Qr5J08
$$ 91 -188 76 124 -24 276 131 116 91 -15 144 -3 -226 -23 -158 11 -120 -165 -259 45 -74 -66 -161 -53
3329e3QJ56l37M38q9j89J52K7J28o3q6j64J57j71Q4q9J00r3K8J35k93K45m6j06
$$ -53 -45 111 -226 212 123 -66 86 113 241 178 92 -72 85 -86 -2 -91 9 -84 -56 79 -214 31 -15 -121
3353a21K07k4J25k58J13JJ96L7j20k37K72l45k8J89j7j79K23l86L01O0m1J57k13
$$ -121 86 62 187 -71 42 43 239 276 156 -81 191 -154 -182 7 -10 -189 34 -352 -51 9 -32 125 -88
3376h8J60j33R9J93L2n04J30J10q7Lk7j3k0J03J0n8j65L46l73J16J62J33o6J07
$$ -88 72 -61 38 231 263 -241 -111 -1 -88 -85 -112 -125 -145 -42 -32 -90 -255 91 -282 -166 -4 129 63 170
$$ [...]
8191B5
##END NTUPLES=NMR FID
##END=
