##TITLE=1H_Pr 53-2D
 200.13MHz,CDCl3.
 8 sc
 
6.3.2026
##JCAMPDX= 6.0         $$ Bruker NMR JCAMP-DX V2.0
##DATA TYPE= NMR FID
##DATA CLASS= NTUPLES
##ORIGIN= UXNMR, Bruker Analytische Messtechnik GmbH
##OWNER= pz
$$ XWIN-NMR		Version 3.5
$$ Fri Mar  6 13:31:37 2026 Russian Standard Time (UT+4h)  she@DPX200
##.OBSERVE FREQUENCY= 200.1313
##.OBSERVE NUCLEUS= ^1H
##.DELAY= (6, 6)
##.ACQUISITION MODE= SIMULTANEOUS
##.ACQUISITION SCHEME= undefined
##.AVERAGES= 8
##.DIGITISER RES= 18
##SPECTROMETER/DATA SYSTEM= spect
##.PULSE SEQUENCE= zg30
##.SOLVENT NAME= CDCl3
##.SHIFT REFERENCE= (INTERNAL, CDCl3, 0, 14.3821)
##AUDIT TRAIL= $$ (NUMBER, WHEN, WHO, WHERE, WHAT)
$$ ##TITLE= Audit trail, XWIN-NMR		Version 3.5
$$ ##JCAMPDX= 5.01
$$ ##ORIGIN= Bruker BioSpin GmbH
$$ ##OWNER= she
$$ F:/spectra/data/she/nmr/H-C/1/audita.txt
$$ ##AUDIT TRAIL=  $$ (NUMBER, WHEN, WHO, WHERE, WHAT)
(   1,<2026-03-06 13:30:16.65 +0400>,<she>,<DPX200>,
      <created by zg, POWCHK disabled, PULCHK disabled
       configuration hash MD5:
       00 E9 B6 7A A2 85 ED C7 34 08 36 98 17 FE 4E 26
       data hash MD5: 16K
       BA 31 02 68 CC 66 D0 05 72 AD 36 00 8F 7D 8E 41>)
$$ ##END=
$$ 
$$ hash MD5
$$ 2E 40 77 F9 66 84 8D 6B A6 E5 E5 E3 15 35 17 63
##$RELAX= 
##$RELAX= 
##$RELAX= 
##$RELAX= 
##$RELAX= 
##$RELAX= 
$$ Bruker specific parameters
$$ --------------------------
##$DU= <F:/spectra>
##$EXPNO= 1
##$NAME= <H-C>
##$PROCNO= 1
##$TYPE= <nmr>
##$USER= <she>
##$AMP= (0..31)
100 100 100 100 100 100 100 100 100 100 100 100 100 100 100 100 100 100 
100 100 100 100 100 100 100 100 100 100 100 100 100 100 
##$AQSEQ= 0
##$AQ_mod= 1
##$AUNM= <au_zg>
##$AUTOPOS= <>
##$BF1= 200.13
##$BF2= 200.13
##$BF3= 200.13
##$BF4= 200.13
##$BF5= 200.13
##$BF6= 200.13
##$BF7= 200.13
##$BF8= 200.13
##$BYTORDA= 1
##$CFDGTYP= 0
##$CFRGTYP= 5
##$CHEMSTR= <none>
##$CNST= (0..31)
1 1 145 1 1 1 1 1 1 1 1 1 1 1 1 1 1 1 1 1 1 1 1 1 1 1 1 1 1 1 1 1 
##$CPDPRG= <>
##$CPDPRG1= <>
##$CPDPRG2= <>
##$CPDPRG3= <>
##$CPDPRG4= <mlev>
##$CPDPRG5= <mlev>
##$CPDPRG6= <mlev>
##$CPDPRG7= <mlev>
##$CPDPRG8= <mlev>
##$CPDPRGB= <>
##$CPDPRGT= <>
##$D= (0..31)
0 0.7 0 0 0 0 0 0 0 0 0 0.03 0 0 0 0 0 0 0 0 0 0 0 0 0 0 0 0 0 0 0 0 
##$DATE= 1772789416
##$DBL= (0..7)
120 120 120 120 120 120 120 120 
##$DBP= (0..7)
150 150 150 150 150 150 150 150 
##$DBP07= 0
##$DBPNAM0= <>
##$DBPNAM1= <>
##$DBPNAM2= <>
##$DBPNAM3= <>
##$DBPNAM4= <>
##$DBPNAM5= <>
##$DBPNAM6= <>
##$DBPNAM7= <>
##$DBPOAL= (0..7)
0.5 0.5 0.5 0.5 0.5 0.5 0.5 0.5 
##$DBPOFFS= (0..7)
0 0 0 0 0 0 0 0 
##$DE= 6
##$DECBNUC= <off>
##$DECIM= 32
##$DECNUC= <off>
##$DECSTAT= 4
##$DIGMOD= 1
##$DIGTYP= 9
##$DL= (0..7)
0 120 120 120 120 120 120 120 
##$DP= (0..7)
150 150 150 150 150 150 150 150 
##$DP07= 0
##$DPNAME0= <>
##$DPNAME1= <>
##$DPNAME2= <>
##$DPNAME3= <>
##$DPNAME4= <>
##$DPNAME5= <>
##$DPNAME6= <>
##$DPNAME7= <>
##$DPOAL= (0..7)
0.5 0.5 0.5 0.5 0.5 0.5 0.5 0.5 
##$DPOFFS= (0..7)
0 0 0 0 0 0 0 0 
##$DQDMODE= 0
##$DR= 18
##$DS= 0
##$DSLIST= <SSSSSSSSSSSSSSS>
$$ [...]
##$SUBNAM0= <"">
##$SUBNAM1= <"">
##$SUBNAM2= <"">
##$SUBNAM3= <"">
##$SUBNAM4= <"">
##$SUBNAM5= <"">
##$SUBNAM6= <"">
##$SUBNAM7= <"">
##$SUBNAM8= <"">
##$SUBNAM9= <"">
##$SW= 18.0517328524113
##$SWIBOX= (0..15)
0 0 2 0 0 0 0 0 0 0 0 0 0 0 0 0 
##$SW_h= 3612.71676300578
##$TD= 16384
##$TD0= 1
##$TE= 0
##$TE2= 300
##$TE3= 300
##$TEG= 300
##$TL= (0..7)
0 120 120 120 120 120 120 120 
##$TP= (0..7)
150 150 150 150 150 150 150 150 
##$TP07= 0
##$TPNAME0= <>
##$TPNAME1= <>
##$TPNAME2= <>
##$TPNAME3= <>
##$TPNAME4= <>
##$TPNAME5= <>
##$TPNAME6= <>
##$TPNAME7= <>
##$TPOAL= (0..7)
0.5 0.5 0.5 0.5 0.5 0.5 0.5 0.5 
##$TPOFFS= (0..7)
0 0 0 0 0 0 0 0 
##$TUNHIN= 0
##$TUNHOUT= 0
##$TUNXOUT= 0
##$USERA1= <user>
##$USERA2= <user>
##$USERA3= <user>
##$USERA4= <user>
##$USERA5= <user>
##$V9= 5
##$VALIST= <valist>
##$VCLIST= <CCCCCCCCCCCCCCC>
##$VD= 0
##$VDLIST= <DDDDDDDDDDDDDDD>
##$VPLIST= <PPPPPPPPPPPPPPP>
##$VTLIST= <TTTTTTTTTTTTTTT>
##$WBST= 1024
##$WBSW= 4
##$XGAIN= (0..3)
0 0 0 0 
##$XL= 0
##$YL= 0
##$YMAX_a= 202834
##$YMIN_a= -215024
##$ZGOPTNS= <>
##$ZL1= 120
##$ZL2= 120
##$ZL3= 120
##$ZL4= 120
##$ABSF1= 10
##$ABSF2= 0
##$ABSG= 5
##$ABSL= 3
##$ALPHA= 0
##$AQORDER= 0
##$ASSFAC= 0
##$ASSFACI= 0
##$ASSFACX= 0
##$ASSWID= 0
##$AUNMP= <proc_1d>
##$AZFE= 0.1
##$AZFW= 0.1
##$BCFW= 1
##$BC_mod= 2
##$BYTORDP= 1
##$COROFFS= 0
##$CY= -3
##$DATMOD= 1
##$DC= 2
##$DFILT= <>
##$DTYPP= 0
##$F1P= 0
##$F2P= 0
##$FCOR= 0.5
##$FTSIZE= 0
##$FT_mod= 4
##$GAMMA= 1
##$GB= 0.15
##$INTBC= 1
##$INTSCL= 1
##$ISEN= 128
##$LB= 0.25
##$LEV0= 0
##$LPBIN= 0
##$MAXI= 10000
##$MC2= 0
##$MEAN= 0
##$ME_mod= 0
##$MI= 1.114404
##$NCOEF= 0
##$NC_proc= 0
##$NLEV= 6
##$NOISF1= 3.799351
##$NOISF2= 2.8
##$NSP= 1
##$NTH_PI= 0
##$NZP= 0
##$OFFSET= 14.38212
##$PC= 1
##$PHC0= -3703.904
##$PHC1= 10.79232
##$PH_mod= 1
##$PKNL= yes
##$PPARMOD= 0
##$PSCAL= 0
##$PSIGN= 0
##$REVERSE= no
##$SF= 200.129724274929
##$SI= 16384
##$SIGF1= 3
##$SIGF2= 2
##$SINO= 400
##$SIOLD= 16384
##$SREGLST= <1H.CDCl3>
##$SSB= 0
##$STSI= 0
##$STSR= 0
##$SW_p= 3205.1282051282
##$SYMM= 0
##$S_DEV= 0
##$TDeff= 0
##$TDoff= 0
##$TI= <>
##$TILT= no
##$TM1= 0
##$TM2= 0
##$TOPLEV= 0
##$USERP1= <user>
##$USERP2= <user>
##$USERP3= <user>
##$USERP4= <user>
##$USERP5= <user>
##$WDW= 1
##$XDIM= 8192
##$YMAX_p= 0
##$YMIN_p= 0
$$ End of Bruker specific parameters
$$ ---------------------------------
##NTUPLES= NMR FID
##VAR_NAME=  TIME,          FID/REAL,        FID/IMAG
##SYMBOL=    X,             R,               I
##VAR_TYPE=  INDEPENDENT,   DEPENDENT,       DEPENDENT
##VAR_FORM=  AFFN,          ASDF,            ASDF
##VAR_DIM=   8192,          8192,            8192
##UNITS=     SECONDS,       ARBITRARY UNITS, ARBITRARY UNITS
##FACTOR=    0.0002768,     1,               1
##FIRST=     0,             0,               0
##LAST=      2.2672688,     0,               0
##MIN=       0,             -215024,         0
##MAX=       2.2672688,     202834,          0
$$ Real data points
##PAGE= N=1
##DATA TABLE= (X++(R..R)), XYDATA
0@%%%%%%%%%%%%%%%%%%%%%%%%%lPqRj2J5j6J6j8K1k3K4k5K9l5M0m3M4n0N8o2O6
47C4p4Q3r1J01j11J23j36J51j70J90k13K44k81L25l84M66n83P62j057J600k816
68a837O570l8392j81365J15955K61733l5470j79180l4251P6254K2005j035M4968
80E5955k4058j13059j7854J36819N6351r9930q6461N4231O6484k7850n380K3480
92A8728k3766m5437M0304O8787k6482o8432J8955N7962l7987l0633N5873K6948
104E4820q5368m7725J02557O7635j01564q9596R4769Q9732p0124q4908N4010Q2947
116F7185m6259n9315M0041L9074m4961j4018N6120j545q0459j1455J04624K2127
128G1159j08753m9636Q3782O1692m8635n2235J6180K7998o281J5762J3267m0114
$$ y = [0, 0, 0, 0, 0, 0, 0, 0, 0, 0, 0, 0, 0, 0, 0, 0, 0, 0, 0, 0, 0, 0, 0, 0, 0, 0, -3, 4, -4, 5, -7, 8, -8, 8, -10, 11, -12, 12, -13, 16, -19, 21, -22, 22, -28, 30, -32, 34, -40, 43, -48, 53, -58, 65, -71, 80, -90, 100, -113, 131, -150, 175, -209, 257, -326, 436, -621, 979, -1837, 4733, -33659, -215024, -99069, 162664, 127194, -51986, -86237, -9983, 12022, 10987, 55955, 31897, -81162, -99016, 37803, 94154, -5776, -92237, -38006, 28478, 628, -4752, 18728, -5038, -50475, -10171, 58616, 32134, -36298, -17343, 40619, 2632, -28001, 27872, 54820, -30548, -78273, 24284, 91919, -9645, -99241, -4472, 85260, 15136, -69772, -15762, 67185, 20926, -38389, 1652, 40726, -4235, -18253, 37867, 36322, -44137, -55592, 49032, 71159, -37594, -87230, -3448, 58244, 9609, -42626, -26446, 1552, -4729, 11033, 24300, -15814]
140a5814k3889M7558M2366m6810m9825M3161N3538m9750n6267M7429N5274l6551
152A0420o1795K5689N2282j7569l0129K7905J1644m4529j722O5647K4992p5253
164a2418m8060O5667N9360l7106n2660R605K2780m453k463K0331j2410m5461Q222
177b9066M9624Q065l5836j2345J7223J240p707K9477K1634n2735m3907M6660O7218
190E9545k0958p6144j1893N4489K2018k3086j1664r397j3277J3366L9946Q455
202C1400n3557k9877N1488M7006k9574m0567R048L0180J35j6332Q333P68k2178
215a3727K786K7328j900k9389o740K6704J0646k6379l673K5381q07k0235M537
228e468K3909p6k5689j982K7582j63k1937p06R550l316q356P245P537j9741j4629
$$ y = [-15814, -39703, 7855, 50221, 3411, -46414, -3253, 50285, 535, -55732, -8303, 46971, 10420, -51375, -25686, 26596, 9027, -21102, 6803, 18447, -26082, -27804, 37843, 62835, -12418, -60478, 5189, 64549, 27443, -25217, -15612, 7168, 2715, 252, 20583, 8173, -37288, -29066, 20558, 28623, -7213, -19558, -2335, -1095, -8802, 20675, 42309, -10426, -54333, -7673, 59545, 38587, -37557, -49450, 5039, 27057, 3971, -7693, -17090, -30367, -17001, 22945, 31400, -22157, -52034, -546, 46460, 16886, -23681, -14633, 15547, 15682, -650, 7683, 8451, -13727, -10941, 16387, 14487, -14902, -21642, 5062, 15708, -10671, -14344, 11037, 10230, -10005, -5468, 18441, 18365, -7324, -9306, 18276, 18113, -3824, -4530, 5020, 1704, -6652, 593, 8130, -11611, -26240]
243b6240K6662J9790k4182k3831J5769L0442n200k4773L428J6449l222m925O560
256F727n19j1428m973J5538O100k0743p045J6404M112j3481k821J4490N416j6640
270h863k878K1406M953j4342l926R549M687o030o28O921r300j2651J2797J3003
284A4698j1747j9601K638K1482K216j8260k242J0977K033j18K349J36n702k854
298c995J3458O183j6939q760J2199P078q964j0949M623Q605q790n608R667K440
312B48o987j739P483O301n470l206R180J7o743M358N619l192r503j000J1645p75
328F236j4059P4P782l19l427r36M138P4m357O554O794o994l350O822M864k924
344F972p676K292P157o092o357L851M13l699k911J270M347m441l201P120R88l441
$$ y = [-26240, 422, 20212, -3970, -27801, -12032, 18410, 13210, -11563, -8135, 8314, 5092, 167, 6727, 6208, -5220, -10193, 5345, 11445, -9298, -16343, 61, 4173, -9308, -12129, 2361, 7777, -8863, -11741, 9665, 14618, 276, -3650, 5899, 10586, 4556, 3928, 10849, 1549, -11102, 1695, 14698, 2951, -16650, -14012, 7470, 9686, -8574, -10816, 161, 2194, 2076, 4425, 4561, -1141, -3995, 9463, 15646, -1293, -10053, 2146, 9224, 260, -10689, -6066, 2539, -6251, -11859, -2192, 248, -6739, -8478, -995, 5306, -164, -3370, 5810, 5827, -916, 3442, 9061, 5869, -3634, -4634, 7011, 6236, -7823, -7749, 33, -286, -3713, -4649, -511, -437, -4794, 1760, 8554, 1560, -1790, 5032, 9896, 6972, -704, 1588, 8745, 2653, -3704, 147, 560, -3139, -6050, -4780, -433, -4874, -8075, -955, 33, -3408]
360c408K679L533l1l110o1Q637l91j0623m91N920K156l379p285r22L040J7L700
377a9L9r005j082R194Q034j164j0431q28J1016L341j473k662m819l43K713K960
393E471J014q152o941M119M719R98k369n318N4L738L304M521k373n058K677L192
409C596J874R46k510j858k647k525N709K752q104n267M47M435K760l961K0K909
425a424l691n78O816O957j73j0614n161J1473R756k884j0855q446M969Q903J036
440F084l964q397o165M787J0296N473n322j5448j441J8348J2825n981j7248m798
454a0951J6707J0380p722r575k426L863J875l538J851M92q166k561N981O315j189
469A336q799O14J1051m1p160J504Q141M534j0298j0556J0173J3095m675j4414
$$ y = [-3408, -729, 2804, 2773, -337, -398, 8239, 7848, -2775, -3266, 2654, 4810, 1431, -5854, -6776, -3736, -3719, -19, 20, -8985, -10067, -873, 7161, 5997, -4434, -5262, 5754, 9095, 7622, 4960, 141, -202, 2511, 5471, 6485, -1667, -8608, -4489, 230, 1228, -1141, -6459, -6405, -2667, 637, 5158, 2785, -2273, 404, 3596, 5470, 6416, 3906, 2048, -599, -3124, 2585, 5337, -2767, -8034, -7587, -3152, -392, -4353, -4333, -1424, -5115, -5693, 1123, 8080, 7907, -2707, -7868, 3605, 13361, 10477, -378, -8824, -3855, 5048, 6084, 2120, -6277, -12442, -7655, 2641, 8114, 2792, -12656, -14097, 4251, 17076, 11095, -6153, -10951, 5756, 16136, 8414, -1161, -3587, 276, 2151, -1387, 464, 956, -7210, -9771, -3790, 2525, 1336, -7463, -6849, 4202, 4161, -2999, -1495, 6646, 11180, 882, -9674, 499, 13594, 8919, -5495]
483e495p209Q543R880m796m891o57m094p02P703J1707J433j9178j1899J9394K3701
498B3440k117k5543j5899J7071K2091k766j5917j1285j81Q774O771M237o056j9384
512a6764m658K1347K0042n936k7363r633K5159K1227q815j9561n775J2421Q901
525A0592n902m271qm254l364K278P382J954j1554p062J0463Q940k468p583N56
540d301J1019l14j0652J923J2381L275j2400j3629Q656J7165l418j5966o312O480
554f093Q497j707k528J788n809n320R496J4328Q36j6764j2282J5038K0160l410
568A6230j8244j0238Q639J3089j624q789m849j893K129M072L385R39q403p311
582a2868R251J3158Q26j1770q232J1224J1619p216r511K825P109k703j0602J353
$$ y = [-5495, -12704, -4161, 5719, 923, -3968, -4625, -8719, -9421, -1718, 9989, 11422, -7756, -19655, -261, 23440, 21323, -4220, -20119, -3048, 19043, 16277, 360, -10925, -11106, -2332, 4439, 8676, 2620, -16764, -21422, -75, 19967, 14031, -13332, -22965, 2194, 23421, 14606, -4955, -10730, 1691, 10592, 4690, 419, 411, -3843, -7207, -4929, 2453, 4407, -7147, -14209, -3746, 5194, 2726, -4857, -4301, 6718, 6404, -4248, -2325, 10056, 13331, 931, -12698, -4042, 13123, 9705, -6261, -12573, -6093, 2404, 697, -1831, -43, -5852, -11172, -1676, 12652, 13488, -3276, -15558, -520, 19640, 16230, -2014, -12252, -3613, 9476, 7852, -937, -5786, -7679, -5550, -1478, 1907, 2846, -5557, -12868, -3617, 9541, 10367, -1403, -9635, 1589, 13208, 5992, -3519, -694, 6415, 3712, -6890, -5537]
596e537J1090k606j1528j468P704N628n326l970P029J359p067K738J0195L907
610A2148r931j1711P373J5069q9j2407j1434K238J3915L541r089q544k305P478
624c748P570q71k145m885m719P895J2571J276j2469j1791Q830J7425l359j5172
638c592n164O246O703l471n075K024k473l212N670N175k035n321o92P807L970
653F560m909o01J838j53O72r86m35o08k985R37J036m250M98J997j017p85l91J950
671a632K341j666K026L453l663j609M791L506k424p003m90P112n54o007j272L06
687b785k04O5P10J939l504l422O286N662k718m030Q14N250J714l748L1J043k293
704H10J44Q64j758j845j694J668O66l845M69M473j216k003Q98L688K632l107j104
$$ y = [-5537, 5553, 2947, -8581, -10049, -2345, 3283, -2043, -6013, 1016, 2375, -4692, -1954, 8241, 12148, 2217, -9494, -2121, 12948, 12859, 452, -10982, -8744, 5171, 8712, -377, -8921, -11226, -3748, 3822, 2951, 806, -4079, -8798, -903, 11668, 12944, 475, -11316, -2486, 14939, 11580, -3592, -8756, -2510, 4193, 722, -4353, -2329, -4802, -8014, -2344, 2831, 796, -4525, -5217, 2590, 6560, 1651, 1050, 2888, 2735, 3407, 2421, 1986, 1378, -1607, -670, 366, -3884, -3386, -1389, -2406, -3191, -3582, -1632, 709, -957, 1069, 4522, 859, -750, 4041, 7547, 5123, -1880, -2370, 4742, 4188, -1819, -3091, -2785, -2989, -2924, -2214, -275, -3779, -7201, -915, 4747, 2029, -2001, -1187, 4063, 5777, 2029, 2060, 3103, 810, 954, 1818, 60, -1785, -3479, -1811, -1145, -4990, -4521, -48, -1264, -3267, -2369, 1319, 3951, 844, -260]
721b60M161J44j824O62r9q28k352k83K923l156m392K193J914o94j342k65K959
738e39N83j852L293J726k444P31J955R64j401k991J569K144m578j482J842r55
754a435j333j665J531K544k811j200M460K66m9O04P1K001m16m34K146k047k827
771e94K235K99j813k380j377L094k27m134J803K018j243Q85Q11J610O15j557K221
788B266K719k853l67J413p9j054k403l99J791k854j680J759q31n28L33J16K327
805c24p28n95L767m1j645J801J046M91j264k519J995L57l053Pm01j435J03m12
823b850P81J22k228J880K874q77K10J001Q48J029r31R70J669k962j722K079J14
840B007j222k838j069K068r36j470J867k54j187J120J673K285o33j863K667J178
$$ y = [-260, 3901, 4045, 2221, 2883, 2784, 1956, -396, -679, 2244, -912, -5304, -3111, -1197, -1891, -3233, -3498, -539, 44, -1808, 1485, 3211, 767, 1498, 3453, 4417, 3016, 25, 1594, 3738, -840, -2322, -480, -1435, -2768, -4433, -2902, -358, -3169, -4369, 91, 357, 308, 912, 983, 2984, 2568, 2134, 4280, 2233, -594, 1641, 1940, 127, -2253, -3630, -536, -763, -4897, -3094, -1076, -2319, -1434, -623, 987, 1602, 45, 2266, 4985, 2132, 1765, 3178, 3099, 2045, -358, -757, 1034, -1820, -3500, -1741, -2572, -3100, -2767, -2651, -324, -1052, -1647, 2120, 2079, 434, 2235, 3281, 3772, 2508, -11, 1984, 2341, -712, -705, -1106, -2541, -2438, -2850, -2069, -1947, -4175, -2295, 579, -298, -88, 913, 1761, 2790, 1859, 2829, 4498, 1536, -186, 1893, 2007, 785, -2053, -3122, -1054, -1990, -3460, -1593, -1847, -3034, -1914, -241, 2044, 1411, -452, 2215, 3393]
856C393j448J235lj304j210j317J806K35m072p22R90m01O85M7P44j60j992K481
874a013M995j516j868j53J046L040p84k072k87k551N1L057j451l066j455k1K757
891a291j9j600K128o92j134L544K458m46k409j019M900J058n081N6J867j250k270
908a200j259K155R53m543j284M038j72m49K98R47J676j834K91M717L9k695p89
925H89p15K483J679k964k795k631J173N157j751n739j29K625K290K18n64J929
941A155j527l123N856O058l538p356j152Q071L646p900m251L427P32k117q43K184
957f78N81n032r36O739K621k907l057Q23M861J747k428j80j050k9K158k251j743
974g61J440m14k596k437J843N409k889o978L385O603l76m262K02O408m67p227
$$ y = [3393, 1945, 3180, 3177, 1873, 663, -654, 1152, 1387, -2685, -3407, -2417, -2818, -2133, -2086, -1342, -1502, -3494, -1013, 3982, 2466, 598, 445, 1491, 4531, 3747, 1675, 1388, -1163, -1112, 1945, 494, -2572, -4027, -4048, -1291, -1310, -2910, -782, -1474, -2608, 936, 3394, 2948, 539, -480, 4420, 5478, 397, 453, 2320, 1070, -1200, -2459, -304, 649, -3894, -5178, -1140, -1312, -1761, -1463, -516, 1160, -674, -383, 4334, 4373, 1678, 889, 174, 2657, 4336, 1372, -1423, -4054, -2881, 2276, 525, -5214, -5343, -2718, -428, -210, -774, 1155, -372, -3495, 2361, 8419, 4881, -2475, -3627, 4444, 8090, 190, -4061, -634, 98, -2019, -2862, -678, -97, -5129, -6065, 674, 3295, 388, -2669, -1846, 3015, 4762, 2334, 2154, 1104, 1075, 3233, 982, -761, 679, 265, -2331, -4768, -2925, 2484, -405, -7383, -3998, 2605, 2229, -2033, -1831, 4577, 4110, -3117]
990c117L214Q319k207r601k623R299M988r569o571N148L513j863k341J269K022
1005a20l086p55O188K415l719k494J064M270K102l171k812j185J737L678l666
1020D46n117K097L208j801l883J074O611j240p861L236Q692o30o739p35P918K005
1036G281q898o99P981l89q182k766O312M207p828m525N938K260l288k97K353J676
1052A136k435q76N754J603m082p30N90Q80K190j049k766l598J23O121r6q179r28
1069f342N298K207k959j848M500J642o106K409Q049j524p028o98P175K586q168
1084h07l281O545o9n412j141L885J325m976j666O138O06m205J738L217l63j556
1100b2Q19L593j551l857K870J975l659j828K093P12l205l022M458K456n661j562
$$ y = [-3117, 97, 8416, 6209, -3392, -6015, 3284, 8272, -1297, -7868, -2720, 793, -1070, -3411, -2142, -120, -3206, -3961, 2227, 4642, 923, -1571, -507, 3763, 5865, 2694, -118, -1303, 434, 4112, 446, -4671, -2574, 634, -1167, -5050, -3976, 2635, 1395, -6466, -3230, 5462, 4832, -1907, -2642, 5276, 7281, -1617, -2316, 5665, 5276, -2906, -5672, 640, 4847, -2981, -7506, -1568, 692, -2596, -2893, -540, 1136, -1299, -2175, 3579, 5182, 1100, 370, 960, 1840, 4030, 2981, 215, -3383, -3260, 2861, 2765, -5414, -6342, -1044, 1163, -1796, -3644, 856, 2498, -3608, -1199, 6850, 5326, -1702, -2400, 4775, 7361, -807, -4088, 2457, 2388, -3024, -4165, -280, 1045, -3931, -5597, 541, 1147, -3058, -1320, 1897, 1534, -22, 797, 4390, 2839, -1018, 1852, 3827, 168, -1660, 433, 1145, -2060, -5082, -624, 1832, -3829, -5391]
1116e391N399J713l060q62M535K276n643k59O902j06o075j297M359J802n881k225
1132c813M651n20m617J158L435q09l489O26N875m96m707K570M524j711k701J382
1148A358K768j799m321K607K769m882k147K533J674k954k758L857L215m542j391
1163d013N694J393l121j156L906K425m617j564N251p18m786q6K793j05m605j219
1179d528N297p29m938K023M228q10l014Q53N099l89m606K684L899k838k676J317
1195H72K006j562m401J904L227m516k014L751Q35k252j725L263L142l429j401
1210b300M973N97k757%K681Q35l715j692M299o38n502P58K798q01k980m36M095
1227B15K68m399K238M221j429k053J544K945l17l684J878L007l322k887K086J113
$$ y = [-5391, 8, 1721, -1339, -2201, 2334, 4610, -1033, -1292, 5610, 5504, -571, -1868, 2491, 4293, -1588, -3813, 838, 318, -4299, -3141, 294, -515, -4004, -3378, 2497, 2001, -2706, -136, 4388, 2677, -24, 1358, 4126, 2327, -1994, 613, 3382, -1500, -3647, -1114, 560, -2394, -5152, -1295, 1920, -2622, -4013, 1681, 3074, -47, -1203, 2703, 5128, 511, -1053, 4198, 3480, -1306, -1392, 1401, 1296, -3309, -4528, 769, 40, -4898, -2875, 1353, 543, -2471, -1618, 3481, 3092, -1514, 1170, 5069, 2231, -445, 872, 2878, 1316, -3085, -1181, 2046, -2470, -4484, -733, 102, -2150, -3875, -612, 2530, -899, -2300, 2673, 3270, 513, 513, 3194, 4029, 314, -1378, 2921, 2283, -3219, -2461, 337, -464, -3444, -3880, 215, 483, -3916, -1678, 2543, 1114, -939, 605, 3550, 3233, -451, 1427, 4434, 1112, -1775, 311, 1424]
1243A424j901k863J196K757k859j765L365J021j927l43K402K525k236j595M091
1258C292M69l526K82J798k74k675j586L099m92l977O70K787r90j775L46K999L93
1275H40k888J939L447j523j875J587J849p57l094N41K745k904k266J546O25j415
1291a603j493R31K177j737r37K887J088j753M33J674J286j575j060K527j36l036
1307c27L84R80q96j441j008J917k76l002J490K408j097q42N47K491P37k211Q25
1324F79K495j324j338J281j03o33j731j65J745j917j768J530J30q84J04N73J453
1341A27n71j151L015O92j698R73P73O7o72j376J439J69l183L47J100r65r96r00
1359b810J272J091j626O25K449q77k35Q61P87Q97j081l51J441j134j243J240o99
$$ y = [1424, -477, -3340, -2144, 613, -2246, -4011, -646, 375, -1552, -1895, 507, 3032, 796, -799, 3292, 3761, 235, 517, 2315, 2041, -634, -2220, 879, 387, -3590, -2920, -133, -1123, -2898, -2552, 447, 840, -2048, -109, 3338, 1815, -60, 1527, 3376, 2619, -475, 66, 2811, -93, -2359, -813, -188, -1603, -3096, -2165, 12, -1725, -2662, 225, 1313, -440, -7, 1667, 2953, 1378, 318, 2845, 2709, -327, 57, 1037, 141, -1300, -2308, -391, -667, -3669, -2179, 229, -868, -1710, -1163, 1328, 2065, -146, 679, 3174, 1850, 512, 1793, 1690, 1057, -674, -839, 906, -1011, -2779, -1249, -1119, -2003, -1899, -1326, 127, -444, -1595, 1420, 2112, 414, 1387, 2160, 2227, 1555, 179, 1618, 1787, -1396, -1049, 51, -914, -1910, -2810, -1538, -447, -2073, -1448, 1001, 124, -111, 750, 1537, 2434, 1353, 1002, 2443, 1309, 66, 1306, 607]
1376F07j119o31o22J237r79j611J770P08r92R41O69R62l87p53K333J214k481o3
1394H03Q46J70q44j718L52Q10k068o27J156j21j86o59K93J937k84rJ199l91L83
1413A042R92k36l21j57m89O59j548p52J283j220j687K49J138P35j575j291K633
1430e45J667j724K12J577R35m75j812K099J577k698j325Q75N95k05k457n48J771
1447d81p96q99P06J94M91L70l81J366O84k66N13p92L28J672j183j588K92K99L40
1466H69k121j405K484P6k722K14J812J264r15j863K532K846k270r10J775J023
1482B689n36k383P28J770j757k348J063M10j89j022j279J821J19m27P34J1L75
1499b21J382l26o0Q32J8L45j023p32J751l20k955j48J238O52j780k157K243J774
$$ y = [607, -512, -1143, -1765, -528, -1507, -3118, -1348, -640, -1632, -691, -22, 940, 553, -200, 2133, 3347, 866, 803, 1649, 1819, 975, -743, -391, 419, -1649, -2276, -1120, -1241, -1427, -2086, -1793, 144, -140, -149, 1050, 659, 1042, 2034, 1798, 1477, 1320, 831, 1490, -58, -810, 473, -747, -2434, -2185, -1047, -312, -1887, -3178, -545, 1122, -602, -390, 1187, 2122, 1647, -165, 1934, 3511, 813, -512, 363, 958, 753, -1704, -2252, -481, -1277, -2176, -1470, -1276, -785, -415, -796, 570, 1254, 988, 1501, 709, 1037, 2709, 1526, -62, 230, 529, 869, -1252, -2657, -173, -97, -2819, -2605, -793, 471, -444, -2307, 225, 3071, 801, -109, 1666, 2689, 2153, -230, 498, 2268, 511, -1837, -774, -364, -553, -1575, -2854, -1033, -914, -1341, -607, -596, -221, 1161, 835, 775, 1607, 1625, 1970, 947, 215, 1966, 1646, -1309, -1457, -219, 433, -1347, -3504, -1261, 513]
1517E13k456l74K111J515p56j649J942K691j964j876J766P27p37j803k86J665
1533A029j463j914Q91L29p7j42l86Q06P13j61Q93J81n24J321O12j177J03L81L65
1552A780j104j762J489N65k747p55J231J280j249j643J774K376j848m54J967J072
1568A972q35j371J430J938j864j799J514L02j312j524L23J250j474j136J600K64
1584g22j074Q43R31K16p8p6J757l4j313J054Q48j436m78j16L91p03k205J127J375
1603C07k269n90J660N87m3j519J603K416j766r53K481L83j187q09P24J498k092
1620D31j906J914J4j903l73P69N24q39j256K212J059j695Q84J659k92l78k19J324
1638A929K84k114J86J469j425j247L87L59n08j999R79J897j383j334K245R31o45
$$ y = [513, -1943, -2317, -206, 1309, 553, -1096, 846, 3537, 1573, -303, 1463, 2190, 1453, -350, -636, 1029, -434, -2348, -1457, -1128, -1205, -1347, -1733, -927, -214, -375, 518, 699, 175, 1496, 2108, 931, 1034, 1415, 1780, 676, -1086, 403, 968, -1779, -2534, -1303, -23, -1272, -2915, -1141, 1235, -613, -1067, 900, 1972, 1137, -234, 1196, 3134, 1270, -529, 985, 1287, -25, -1549, -1226, 24, -1450, -2586, -986, -722, -1796, -953, -22, 194, 116, 40, 1797, 1763, 450, 1504, 2352, 916, 438, 322, 713, 10, -2195, -1068, 307, -1962, -2552, -892, -305, -348, -1867, -264, 2152, 386, -567, 1914, 2297, 1110, 301, 1025, 2523, 431, -1475, 439, 453, -1450, -1823, -1054, -530, -1369, -2625, -413, 646, -1049, -165, 1494, 1202, 824, 605, 1929, 2213, 99, 285, 1754, 329, -918, -531, -172, -680, -2679, -1700, 197, -1186, -2520, -275, 656, 11]
1655A1r09J632K009j513j483K129P17k127p09N23J024j917j830K203L05j901l33
1672b169J358M86q19k84J931J145j874N77J728m60q68K7J117l62k319L11J783
1689A308j688j479Q29O57o53j325Q11K315j207j331K340J137j032n73J037J569
1705B715j422j714J907M87k486n41Q67K58j218j551J927P28k022K69J674M50o71
1722c43p3J625R96j827R5K115j181j135K7Q62k09k239m2J610j103j713J169Q40
1740e26m76n17O02K310j094j149K076R52j339k97P40Q81j405j801J439O01k247
1757a250n31J218J09j016p73J401J395j910K51K296o8p91J16R53R77j761n91J610
1775A635n16j980P96ml42j237o7J125k42j238J280Q88m08m02R91J311m66j446
$$ y = [11, -898, 734, 2743, 1230, -253, 1876, 2593, 466, -243, 280, 1304, -613, -2443, -240, 65, -1836, -2169, -811, -325, -1144, -1428, 503, 1648, -226, 351, 2079, 1619, 751, 778, 1895, 1533, -786, -475, 1308, -380, -1859, -1030, -373, -1026, -2351, -1540, 775, -432, -1763, 577, 1714, 682, 109, 1146, 2715, 1293, -421, 1486, 1973, -513, -1054, -187, 71, -1147, -2698, -771, -43, -2065, -1796, -122, 328, -343, -416, 1209, 2205, 378, 473, 2588, 1407, 272, 299, 1161, 952, -1287, -1329, 281, -822, -2535, -1366, -526, -1002, -1519, -917, 1393, 299, -850, 1226, 2178, 839, 542, 1282, 2163, 758, -1043, 396, 997, -1250, -1781, -563, -454, -1470, -2243, -842, 553, -1357, -1106, 1190, 1122, 331, 447, 1400, 2377, 616, 25, 1635, 1119, -861, -65, -69, -411, -1648, -1715, -590, -832, -2070, -790, 98, -310, -712, 279, 1590, 1124, -322]
1793c22J765R44j829l43O90K64j290j515J091Q58k092m09J500K23p25l24J243
1810b71J384j187k09J881o4n20k95O80P7j356m09J117o06j603K50M55k08o95j33
1829a712J538l54j105J615R01r19K20R66N31m23j225J092M29j262q94N31L17r96
1847g50j251P49J262j501k61J282M58m91K89Q29P45p11k60J494k81j152J93J71
1865H14l40r96k93Q30m53j522Q46N12n09j67J02J365L41j102J184J015q52L9K08
1884A022M58j44j604K58Q92j166p97K51k42j0j6k37R40l41P9J348m88J20Q52q0
1904A095J71m35j73Q63o90j107N52q3p37m66l04J096m59j260Q75J182m21m33L63
1923c71J314N78j087n2J604q26p10J60j4J38j127p01Q78l95o95K75l29L43M61
$$ y = [-322, 1443, 2387, 558, 215, 905, 1169, -121, -1636, -545, 313, -1779, -2188, -688, -465, -1190, -1514, -271, 1113, -74, -283, 1598, 1534, 1014, 719, 1399, 1476, 120, -289, 828, 222, -1381, -1131, -676, -884, -1579, -1712, -174, -528, -1633, -18, 883, -36, 184, 1150, 1681, 1258, 33, 1125, 1554, 292, -602, -71, 246, -750, -2001, -1252, 10, -1491, -1752, -470, -12, -503, -214, 615, 1360, 649, 389, 1883, 1602, 450, 643, 814, 474, -522, -815, 15, -438, -1960, -1114, -602, -1111, -1278, -1176, 189, 530, -572, 612, 1627, 775, 814, 1022, 1480, 1336, -268, -10, 882, -284, -1081, -830, -1072, -1082, -1098, -1335, -395, -736, -657, 691, 203, 323, 1175, 1095, 1266, 831, 658, 1521, 831, -276, 276, 193, -544, -1010, -1314, -218, -677, -1937, -1062, 120, -301, -734, -371, 943, 1521, 434, 382, 1986, 1160, 450, 610, 596, 734, -393, -1094, -216, -611, -1306, -1031, -1360, -1017, -556]
1942e56k60Q61MJ11R44m09l39J018j16k87l80q0N71p90j483N22N03o25p38J2R60
1963e57M38j257L32J768j88l94K48P35O48j259L0P76m29q25k20k16l2k37p11N23
1983h27j76k05O01j14%Q73J64K70j13J15Q83m25o69P41m6p42m20l86O58l02j776
2004a896O24J064p40l39M35M27R32j022K84J689o51j3K1Q3N42r75o47Q44l36r26
2024f00J59l28j63J32n53P62Rk47R15J30k59P99M39j98k06q2N06r1j280P30K41
2045H15j319k56l99M67L27j476N03J503n98n31Q02M87P96q06j07J429m02o63M41
2064A013k95j22n88k75L87l58j094O23J06p23N21K32J81N03l50R17N41j128Q04
2083H95P32n62m55k25L62p6j234L0P14q82p00L84M07M65r07K21J319l14l84P52
$$ y = [-556, -816, 45, 49, 160, 1104, 695, 356, 1374, 1258, 971, 591, 511, 1082, 292, -1191, -669, -166, -791, -1529, -1517, -557, -119, -1376, -1044, 724, 536, 142, 390, 1125, 1773, 514, 544, 1320, 891, 66, -154, -370, -402, -639, -1350, -827, -1003, -1208, -607, -721, -721, 152, 316, 586, 473, 588, 1471, 1046, 377, 1118, 1072, 330, -90, -476, 182, -120, -1896, -1272, -208, -948, -1287, -852, -425, 507, -515, -231, 1458, 807, 794, 815, 898, 1440, 465, -182, 662, 326, -600, -441, -769, -932, -800, -1353, -591, -582, -829, 86, 216, -43, 756, 1195, 997, 791, 709, 1215, 1124, -156, 574, 815, -504, -760, -1159, -692, -365, -1841, -1338, 165, -433, -964, -162, 325, 1121, 315, 208, 1637, 1235, 572, 1013, 718, 596, 8, -267, 120, -238, -1332, -709, -603, -1326, -805, -573, -392, 111, -239, 678, 1219, 91, 895, 1627, 1065, 610, 385, 747, 671, -563, -533, 181, -701, -1401, -1017, -610, -145, -1052, -831, 488, 174, -210, 542]
2103E42L71J96k37l21Q19n86q62O22j61j040K31l08K57m57o34J094P6m65K81Q29
2123B47J72o4l8O86M10j157K05R12o17o91l14M74Qj628jJ257o79n40K82P01L63
2144a2l59J05J409n6q63R02k0j78l04k82L76k95j091N03j8p98J60p1K62n7n84
2165a271J123O72r83M81R09k01J62l38L35N19j302k40R39m25j112J35r6N49r90
2184a134l43J566m88q12R88M96O1L5k30J073J3j033O98K76p86m57J18o3l62r65
2204a349M80Q35j321K56N98P2J27k88R62O52q00M8Q80j43n80J58Q0J47r89m05
2224e80O01l25j157P14KJ62l38j15J193p8q41J136P65l46L7j69P13l32j077K91
2244B56L59r91l13L52j45K0r43N43Q63o25l74J191J15m4j38M64R95p21n62P49
$$ y = [542, 913, 1109, 872, 551, 1370, 784, -78, 544, 383, -657, -426, -734, -477, -934, -1568, -474, -398, -863, -582, 247, 419, 355, 317, 1003, 1413, 256, 461, 1373, 756, 65, -249, 225, 233, -1395, -1396, -139, -818, -1358, -1076, -375, -12, -371, -266, 1143, 1087, 224, 1126, 1106, 928, 624, 342, 718, 423, -668, -165, -183, -981, -821, -892, -630, -687, -1271, -148, 524, -459, 22, 931, 730, 892, 554, 889, 1408, 106, -134, 805, 380, -732, -597, -693, -144, -1134, -1477, 89, -399, -1211, -223, 273, 334, 369, 139, 1212, 1225, 192, 890, 1166, 380, -77, 41, -22, -384, -1349, -869, -34, -1355, -1099, -501, -429, -302, -590, 372, 1024, 224, 272, 1152, 1009, 429, 587, 667, 814, -175, -580, 21, -304, -1461, -747, -745, -583, -921, -1036, 157, 79, -762, 374, 1139, 793, 830, 661, 1374, 1042, -35, 256, 615, -376, -689, -337, -482, -462, -1405, -862, 1, -624, -998, 193, 308, 264, 126, 590, 1585, 864, 302, 1051]
2264A051k88o82k3O1O8p60p29J083k24r99O92L07K35m3j40R77J18j092J259M26
2284A297m58k91r6L87r1j415J84P67r73m05M54J00l4l72N1J182o25o0R77mJ0J82
2306G67k20M91o43r7N73m93r39K49j63J9n30l74J051p3r14Q06O41j82M1O3Q28
2327I01L05j159M19Q20o18n90J04k5l0p70j10O47o80l21L66J10L45k9R2Q95m43
2348B29l10J062m4m77K77p4j17n30l91N28j78j025O7N62j82k06J59L33M17p81
2368f81M52R78J25l68p7M55M05j203O2P55n69m76k37j09nn2n10P30m55n6P69L4
2390c3j29L54K11M85j44l97P46j89p03o1K90l22l44p88O57K20j064J86Q93k85
2410d17P1l38P78Q22p73K40N04j83j36j05J18J06m53o77O81n43n84K13j88J5J33
$$ y = [1051, 763, 81, 58, 119, 187, -573, -1302, -219, -443, -1442, -750, -443, -208, -251, -391, 586, 704, -388, 871, 1297, 839, 548, 452, 839, 748, -667, -483, 284, -689, -1094, -640, -540, -574, -946, -895, 287, -338, -398, 579, 575, 585, 767, 547, 1038, 395, 298, 871, 378, -561, -312, -475, -456, -986, -1360, -309, -382, -1296, -490, 151, -31, 10, 73, 901, 1206, 47, 466, 1286, 668, 78, 182, 157, 127, -643, -753, -106, -786, -1107, -741, -631, -286, -315, -223, 672, 229, -81, 981, 937, 460, 737, 663, 546, 16, -375, 153, -25, -1050, -983, -421, -603, -809, -650, -317, 100, -681, -229, 749, 874, 506, 429, 884, 1289, 86, 148, 903, 334, -142, -379, -488, -493, -545, -1055, -325, -780, -836, -67, -33, -162, 192, 403, 888, 744, 347, 1093, 904, 201, 140, 430, 108, -236, -1024, -367, -147, -1211, -1025, -132, -417, -346, -684, 94, 916, 143, 383, 887, 704, 568, 463, 581, 687, 234, -443, 238, -305, -889, -676, -864, -849, -716]
2431g16j01M36n0J5O88L76k67K75O4J52k63l84M86n7j115K83ml58J79q64N77P53
2453A05r19J40O17L6J15%L12O34k25n66O30l84k1j00l97p2q3m93M42l28l58M88
2475d27j29j63M47J26L54j52O4N44M18o69J02J13P9j61o44k7J70o78O5M01k92
2496d59k44l02L75M59L8k75R84j16q2RK0N01j76k65M6l87k27J62k72l87J67m67
2518h98L89j95j75O39J09l80N67J32L18q4j5M54L45q08p5J76l94k2m35j19N36
2539F5p86l24O72k28q8K54J31P04k51j49P69j51j2K06m45M35m42m42M03m99n16
2560f94L75j66l76L06o4L99K4k72O17L36n72K71L36K96k12m33K94K52o05l18K09
2581Ck07k58P9m17O10l89m23R43j64J8J49L12M23j96j64N17m4o74M75l76k28j80
$$ y = [-716, -817, -381, -431, -416, 272, 648, 381, 656, 720, 872, 609, 225, 711, 654, -461, -178, -182, -540, -361, -1225, -648, 105, -814, -674, -57, -21, 94, 94, 406, 1040, 815, 249, 879, 495, 474, 374, -23, -95, -178, -671, -229, -557, -915, -427, -556, -719, -272, -146, 208, 56, 120, 664, 1082, 413, 515, 628, 707, 546, -98, -125, 45, -633, -568, -167, -459, -703, -1005, -630, -171, -133, -408, 576, 460, 378, 387, 407, 908, 732, 467, 513, 126, -101, 61, -211, -598, -431, -898, -509, -704, -879, -240, -131, -511, 56, 188, 506, 422, 407, 861, 1206, 398, 323, 499, 105, 83, -352, -471, 65, -721, -1045, -373, -601, -689, -435, -304, 400, 149, 0, 769, 618, 606, 812, 367, 802, 360, -82, 321, -178, -694, -319, -485, -861, -555, -619, -220, -196, -468, 149, 485, -87, 184, 520, 816, 604, 171, 465, 717, 112, -206, 3, -204, -462, -383, -800, -190, -579, -1002, -59, -223, -205, -56, 256, 679, 483, 319, 836, 792, 118, 593, 217, -11, -191]
2603a91o6Nk25l67J43N26o54L17J76K33L85k49J97N39m48J70K34pj93o37K11J17
2625B16m56l60L86k44l90J70Q5L05r3P5L98L21j30K10J59m9k7j52J66k77o56K56
2647h7J9l84n5k72K12K27n86M86M16k55J63L36L50j51n7n9P30n33k25K72l57J25
2669C15k85m64K75l01k16K76o9l19K13M18n2K45Q2M41J7m53K53L47k04m47p9N4
2691D7K91q63P4K97n56O3R0L0M43m03L70M25j28p0J87L09m6J18k54K54k10o16
2713a48M52k56o02J05n2L27m05j82N71J07n41N70M17J27j69q0L73J20m39r8M27
2734F24l83l04m36J48K92o35KO21n00o0L78R1L25l55L01N04K2m09M41mm34J14
2756C43l3k9k91m72L01K05q27J88P3L83m57p5R53K31p28M24L22P2rk59M14j38
$$ y = [-191, -257, -252, -477, -844, -701, -175, -829, -512, -336, -103, 282, 33, 230, 769, 321, 491, 725, 718, 525, -112, 99, 216, -240, -600, -214, -458, -848, -678, -593, -288, -381, -306, 92, 413, 283, 493, 652, 603, 576, 424, 590, 313, -343, -87, -68, -452, -507, -779, -567, -340, -926, -440, -24, -279, -116, 220, 570, 419, 362, 303, 1033, 500, 275, 547, 190, 315, 30, -434, -159, -460, -676, -400, -469, -788, -575, -157, -209, 36, 118, 559, 576, 123, 376, 723, 519, 72, -7, 47, 338, -525, -451, -154, -710, -647, -557, -527, -84, -487, -117, 308, 180, 110, 297, 606, 560, 678, 424, 678, 468, -148, 304, 48, -554, -449, -501, -174, -579, -761, -190, -83, -624, -54, 363, 490, 321, 241, 614, 734, 295, 197, 624, 241, -63, -499, -351, -59, -694, -692, -71, -571, -631, -253, -162, 163, -192, 109, 613, 635, 226, 667, 663, 229, 343, 310, 281, -10, -482, -181, 24, -803, -615, -542, -159, -616, -691, 262, 493, -235, 189, 511, 583, 574, 315, 729, 591]
2778E91o04q6M32n78q0Nj83O3j22j81O57j37m27R01m2j12L48q3L15l84m4L62k07
2801D04n29k9k5J99l68m88M35L33q74K50O17j48Q2n0M15M69o86M52K94j02l41
2822C10r9J63j34l11l24K90k61k43J50j24J10J21J78L59l02Q3L89J93j19k17K17
2843D29P0Q7q70N32j65m62m4J22J22l71j01K40J68m13O20l4K77K40k25M17K34
2864H73l79k26N70m94l48m1l03N12n16l83N50j94j66L81j5j30K07Q2L14L0k4L30
2886F30J39n67M8r4rL6l33j55K45n64j17K46K21K27m84M48M27m61J67M69o8j2
2908D39r6j49L63k73l72L77r2o14K34j60pr3j29K57j17l4L24K95J6k18L44J5K67
2931E77m65M25Q6n40P2m8k10K2l27P7K56l06j29K66M25l15%K90L39k12m9K44Q1
$$ y = [591, -13, -99, 333, -245, -325, -320, -503, -440, -562, -743, -86, -223, -650, 251, 209, 97, 445, 362, 677, 293, 249, 611, 404, -125, -154, -179, 20, -348, -836, -401, -68, -942, -692, -75, -223, -141, -191, 224, 693, 7, 459, 753, 651, 310, 211, 374, 240, -71, -395, -105, -366, -609, -459, -583, -473, -352, -174, 185, -117, -34, 355, 548, 429, 212, 429, 499, 586, -284, 248, 83, -379, -423, -301, -179, -550, -651, -411, -243, -656, -36, -70, 207, 447, 222, 639, 873, 494, 268, 838, 344, -4, -45, -348, 164, -352, -735, -185, -379, -545, -164, -179, -309, -102, -20, 294, 324, 300, 630, 769, 202, 250, 156, 147, 183, -150, -305, -60, -624, -741, -495, -274, -47, -531, -83, 344, -117, 50, 519, 451, 439, 343, 194, 557, 284, -88, 289, 197, -417, -183, -343, -350, -443, -572, -315, -432, -466, -142, 153, 169, -49, 295, 310, 577, 112, 537, 623, 83, 155, 107, -103, -81, -408, -331, -75, -381, -510, -244, 181, -134, -134, 156, 495, 283, 234, 478, 559]
2954E59M4k18kl6l31l40M19k87m03J26J39j03K73k11L89J22m52N06R9j3J4N0J75
2977E19M4o72Q4M33o35k9J12oj54j13j40M37k40J04L78q5pJ11K12N5j33J6K68
3000E59j93p0k07k69Q5r8k94K81j06k89K85J75j73K68j19O5N16j95J34L09n55
3021A09Q0J35p4m2j33l86J54l40jJ94l89M78j57J32K1J87M3L62j1j12L22k73J97
3044D96q3k85j08J30k74o1j86%k4j47J22M31n28L12L06j39J84P3L5J01K47k73
3066C29J85k90k90K64m28%j6k25J33k14n1M45%J47J95j81K19J37k10L70l4k12
3088B73K90k30j29k64j61J20J27k79l4J72m69K56r5J53K87r5J95K43r7j2J57j45
3110B63K13l07Pp5n8k39J24k47j73K53k01J99L2r3L87l02J17L87j45K34O5k25
$$ y = [559, 603, 385, 383, 347, 16, -324, 95, -192, -595, -469, -330, -433, -160, -371, 18, 140, -312, 194, 293, 280, 294, 344, 519, 563, -109, -25, 408, -227, -256, -144, -150, -304, -417, -557, -120, -360, -256, 122, 37, 30, 141, 353, 408, 275, 291, 559, 366, 296, 89, -180, -95, -193, -487, -206, -312, -601, -316, -141, -314, -46, -165, -100, 416, 221, 355, 664, 109, 189, 324, 250, 208, 75, -311, -157, -497, -498, -304, -693, -215, -372, -240, -219, -32, 11, 373, 362, 250, 572, 299, 496, 413, 128, 20, 150, -124, -185, -371, -371, -395, -542, -420, 11, -517, -205, 101, -38, 146, 219, 254, 355, 602, 329, 514, 224, -66, 198, -230, -230, -246, -471, -338, -552, -603, -158, -158, -11, 184, 3, 222, 359, 149, 519, 485, 273, 563, 333, 204, -60, -221, -101, 26, -253, -287, -115, -584, -328, -423, -270, 17, -78, 117, 360, 263, 251, 408, 263, 476, 169, 176, 101, 43, -196, -72, -319, -492, -239, -440, -241, -209, -302, 85, -217, -100, 287, 142, 376, 441, 216]
3132B16L11L9k04r8N3l08r2k03n2J32j68K25k22p7K77K3J88L36k03j51M38jk83
3155A76N1J3m2M3m07O0k12j24K71k17m3P0o8L25jR6K67L8k19L28M8k66K65k80
3179A72k83O08p60N4qk5n6j70J72m0O7r0L71J16j77J26J59J18o6j16L34j86m39
3202a19L10j98j75J28l20K90j76k11L22J0l87J66M8L50J80j84K71L36l00J42N6
3223E39j12l06j67k18L6Rl17M05l74J55J63k63L23j7l1N17r6K1J28j57Q8M8j43
3246B31K07m17j48J88j85l07J14J4l0P5j6K51Q9k30R7J48K09J79l28K76R4m03
3268A08j17L56l42J03l64j07J55k44O7K58j40O1J15M0J57L39k49K87j08J60k9
3289E06P3k63m38J61kj02m76K13K76m46L21M3K00k95K97j19K27P4k5K27k2j43
$$ y = [216, 527, 566, 362, 264, 317, 9, -83, -286, -338, -206, -374, -149, -371, -448, -171, -148, 40, 376, 173, 22, 460, 459, 176, 227, 240, 198, 241, -166, -106, -318, -442, -171, -388, -431, -361, -429, -104, -105, -9, 258, 296, 77, 405, 453, 187, 452, 172, -111, 497, -263, -209, -217, -242, -298, -468, -296, -336, -269, -359, 12, 128, -49, 77, 236, 354, 288, 172, 506, 320, -119, 191, -7, -182, -54, -374, -84, -260, -471, -149, -139, -526, -360, -312, 38, 218, 34, 305, 641, 341, 483, 539, 427, 121, -46, -264, -228, -219, -536, -131, -505, -350, -187, -450, -127, -144, -175, 342, 246, 267, 395, 238, 326, 374, 231, 438, 21, -127, 61, -124, -431, -317, -303, -333, -258, -274, -23, 66, -164, -67, 81, 290, 469, 141, 417, 511, 108, -9, 347, 5, 108, -256, -363, -208, -452, -385, -127, -267, -206, -91, -51, 106, 445, 196, 483, 375, 535, 506, 579, 316, -122, 39, 37, -65, -541, -328, -52, -498, -177, -134, 66, -229, 68, -51, 176, 250, 225, 452, 430, 287]
3311B87R1j97K70m27j06m1o5j11J47l89L19K4k61J43J77j55K35M11j93J11j89
3332H1K88J17m15Q3J28l07n8m8O0o1k58k6K21j62L22r5O5M28j46k8K09j48j56
3355I4M01K9m34P6l24K78k00l06K09j73K22j38M8K5K81l00L84M6J6m4J03k83L40
3378C50j08o5K00k71n8m8lk84j77K38J67l08J10N39n35J29M53j32J5o1J64j9k88
3401HJ6L42l60j5j58Q3J4j17p3J41j82J30J40m5OL20Nj21J51j31J58J2j17k1k55
3426f9l3K56n08J57Q1k22N9kJ48k4J58k62M15j10J32j09K25q8K1k42K79j76j23
3449c7k64M06m23M4N8j0K15j09J00j28P4J7K15j44K11j44PK35j28k21PM4J90k24
3473ik16J40j55J7R4j86M3M06j76J52j52k61M17L1J08P8J06l19N1k10n1P0k59
$$ y = [287, 378, 181, 451, 24, -82, -123, -188, -299, -152, -541, -222, -198, -459, -316, -139, -294, -59, 352, 159, 270, 81, 369, 486, 71, 154, 282, -25, -83, -131, -71, -132, -390, -416, -195, -357, -35, -130, -65, 363, 217, 189, 398, 250, 94, 495, 524, 90, 166, -158, 120, -80, -386, -177, -350, -128, -266, -218, -193, 88, -212, 172, 218, 234, 190, 293, 10, 350, 242, 177, 377, 106, 48, 0, -3, -287, -464, -226, -59, -367, -257, 282, -253, -124, 329, 197, 212, 151, 315, 296, 8, 24, 366, 6, -9, -167, -84, -70, -187, -260, -119, -301, -171, -31, -76, -70, 250, 255, 134, 285, 154, 312, 324, 207, 186, -69, -102, 154, -354, -197, -116, -338, -279, -281, -133, -157, 1, -261, 154, 44, 176, 67, 292, 204, 225, -17, 262, 86, -37, -301, 105, -318, -274, -216, -226, -11, -120, -20, -148, -74, -57, 158, 14, 225, 81, 88, 323, 195, -26, -19, 25, 215, -9, -225, -85, -240, -223, -129, -315, -272, 134, -42, 110, -42, -303, 114, 145, 253, 331, 437, 118, 169, -41, -92, -22, -281]
3496b81J99n7O5J4j25p8K2J15K22Q2P9j25K02k1j77K03Nj40k1j32k6j53j03J72
3520e9N6m53K59p5lJ06m5R6J7L43j85L3K33n6j28K2L2j95o0P0l49J91j76N3K21
3545e2q0n2J36j03K00L8J11l0M3K04o0j78M4j47J44k51j21J6J09m99J23K72j9
3568a52n9k5p1K07K29k4J58J30l09J92J16j80l9n0k43K45l74J04j55R7L0J06j35
3591b02R7j55M00p2m0J79j6R9J22k94O2O7j16q0r1j7j06q9K6Kk42J11J82J03k78
3616c48M65j75L00j42r2K3K93r2k2k25J03k22R2j34K66k63j95L01j23R8l4p4p6
3639b76M06O7j80j06N06l0j79j46Q1k35O6j2l87L56j02j48J76j96K13r1J70k59
3661c06K83K9J11j75K87R5k87O9R6k25J38o3j69R2l24L38r3j82r5M22l13J3M51
$$ y = [-281, -82, -139, -74, -60, -185, -263, -241, -126, 96, 178, 257, 132, 334, 313, 136, 339, 344, 204, 183, 51, 25, -128, -231, -59, -3, -456, -197, -272, -275, -169, -214, -118, -101, 242, 57, 90, 323, 267, 139, 161, 193, -2, -62, 8, -341, -150, -326, -273, -52, -132, -184, -48, -151, 49, 87, 198, 168, 211, 415, 355, 177, 221, 74, 218, -33, -154, -138, -29, -528, -405, -133, -152, -211, -236, -307, -100, 129, 105, 263, 393, 84, 276, 392, 212, 173, 123, -120, 125, -249, -145, -300, -203, -173, -67, -202, -105, -260, 140, 68, 28, 207, 191, 290, 412, 118, 180, 247, 131, 51, -40, -57, -163, -252, -226, -224, -466, -355, -173, -70, -348, 117, -58, 242, 100, 8, 31, 324, 232, 210, -15, 88, -134, -42, -176, 90, -173, -368, -67, -190, -92, -126, -200, -276, 130, 197, 17, -89, 417, 387, 208, 62, 143, -92, -26, -38, -425, -69, -171, -319, -143, -339, -126, -217, -47, -306, -23, 6, 117, -58, 229, 324, 37, 106, 202, -23, 115, 52, -117, -25, -349, -11, -104, -286, -381, 41, -272, -259, 192]
3684A92j08M4M4j42K47j17l5J58k35r2J4j4J29j03m72L57r3M3P5k99M63j0p7J84
3708A53j28J53o1N1O8j51L9k7j69o7j44K29l05K02KJ4L2k70j1L51R1m6J45J03
3732B54N6k2j43K02j44k38Q8l18K00k2j67N5N6M8o3J56j01L0K43MJ66n0o6R9l10
3757A3K76j83j88L22l53n8J22j85J77j31J14j10J23q6J74k4K9n8J36O4L4J32j81
3780A59q1j61J95J14o18M12j53Q3p7l00K53L45m30qJ24L39j54J7J50M9j17pr1
3803D3j8J92j74P3k98K30j34m9r4R4n0J89k31N5P8P4J68p3K26o7o0r4K01k36J24
3828A69j96k67N11o10K12j91l7K35l8RM00k27LK34k7m56M49J9j5m2k89J16J35
3851I7j73j31R1k25K33j07K45p1J2j36J97j32L32p9K38j01j04j98J16J11r2j03
$$ y = [192, 84, 128, 172, 30, 277, 160, 125, 283, 48, -44, -30, -44, 85, -18, -490, -133, -226, -183, -108, -407, 56, 46, -31, 153, 25, 178, 117, 168, 236, 85, 124, 97, -72, -139, -283, -54, -359, -157, -155, -141, -109, -379, -390, -39, 52, 6, 151, 254, 310, 288, 145, 347, 203, -35, 53, -265, -65, -87, -254, -199, -143, -95, -158, -2, -103, -73, 170, 174, 340, 290, 224, 323, 13, 289, 106, -82, 240, -113, -171, -49, -234, -57, -188, -74, -184, -61, -147, 27, 3, 32, -26, 110, 174, 208, 340, 159, 78, -83, 112, 226, -392, 20, -133, -50, -127, -427, -174, 171, -259, -267, -143, 196, 42, 59, 209, 258, 141, 134, 43, 25, 217, 43, 116, -182, 48, -86, -135, -229, -135, -185, 4, -227, -172, -94, -20, 148, 75, 301, 234, 174, 80, 281, 45, 169, -27, -294, 217, -393, -181, -372, -409, -174, -212, -203, 197, -30, -27, 207, 180, -276, 173, 192, 177, 135, -154, -38, 97, -76, -207, -116, -341, -108, -215, 30, -41, -29, -165, 32, -100, 232, 153, 391, 290, 186, -12, 104, 215, 123, 20]
3873B0r4m5l6k19L58j27l2L6M7J4K24o1K66j42k46K45k40J26j09J78k29J02j90
3896a54k42N40m28J86j33O1k02J77K55r5J80o5j30j23K45Q8m8l6J33j50Q8k31
3918h4r8P5j54J13r6n9R5K85k92J07J56j32K73mn5J26j50j04J37j70K3M5N0l24
3942b37K55k01J19o9n7J54p9K04Q0j0j85n5K44rq3R6J3r8L11m20l3K32k23J7N4
3967B0J18l54K39lj85M2J33J60j02K9K85j64j84J82q3n5j22m8M6j06LK73m15K52
3991c9J0o6j78N6J0J05J07l8M29n4l57J97k39M7J06j05j0j47L8P8j20n3Q4J7j50
4016b72L98j85J24O3o2j07O8L2N8R2l92K95j79o5K80l41N3J08k06P2L82l04p2
4039a60K14k43M04p7j01m3K05p5l00L51M8l10O9K20k05j12j25J2P8k3R4K8Q5j36
$$ y = [20, -74, -119, -155, -374, -16, -143, -175, -139, -92, -78, 146, 85, 351, 209, -37, 208, -32, 94, -15, 163, -66, 36, -154, -396, 144, -284, -98, -231, -170, -372, -195, 60, -35, 145, 80, -50, -173, 72, 160, 112, 76, 209, 59, 147, -84, -182, -107, -261, -148, -244, -303, -208, 77, -215, -108, 48, -84, 189, 185, 130, 256, 106, 2, 139, -31, -8, 37, 87, -237, 18, -183, -64, -133, -190, -36, -115, 89, 169, 159, -26, -81, 163, 154, 71, 167, 180, 82, 393, -27, -60, 172, -51, -34, 20, 138, -216, 23, 20, -165, -123, 10, 170, 68, 97, 382, 218, 34, 216, 133, 78, -44, -92, -46, -152, -149, 124, -291, -39, -29, -95, -273, -217, -207, -102, 5, -33, 396, 342, -15, 182, -57, -10, 96, -9, -19, -166, -128, -50, -170, -223, -139, -122, -272, 126, -59, 65, 128, 66, -41, 27, 59, 117, 209, -183, 112, -67, -132, 148, -193, -140, -32, -238, -166, 216, -88, -160, 54, -189, 215, 138, 37, -6, 199, 124, -176, 175, 223, -87, -18, 202, -3, -115, -240, -228, -150, -173, -79, -51, 34, -102]
4063a02K75J20l50J4R4Q0l4k20J61p7K01j68o6j93K31n5O8j29L5L40j57P6o6J7
4087I5o1L13l54J81k70K9k7L9k4O3l6j82J09p4P3j39J24k2J20NN9M3m4jJ47J00
4113B66r1pm5n3n0n6k29K44k07J80l6j6L5j67P1K54m18N47k73O5P8P7J33k29j26
4138e3M08k17k76J81k93J74r1j7j88L87j30M1J10N7N0j16NJ77q4j2J68j75j41
4161c5K55j80oLQk8o4j43OP0p9J32j08L99m5r0J72k6j48j4k7J01J0j62o9Ql07
4188c67K31j55L04r0N3n5K29r5k2J04j28J2J80k23J18k6r6J77m4k37L02k76O5
4211c9Mk53J72J02J78j66j09K40j94K50J73l03K2J3k4Pk02O7K6O3j03L09l80j00
4235b47Q5M2lp0J29M1K52k5o1O3j53j52RJ33L5lj76J42l56L36j79j52J14P4q7
$$ y = [-102, 173, 293, -57, -43, 51, 131, 97, -123, 38, -39, 162, -6, -72, -265, -34, -89, -21, -150, -115, 225, 68, 144, 78, 95, 34, 347, -7, 174, -96, -67, -94, -55, -79, -16, -52, -234, -125, -199, -126, -265, -141, -163, -43, -38, 21, 64, 20, 19, 166, 266, 175, 168, 123, 70, 20, -36, -265, -21, -228, -48, -84, -100, -65, -232, -161, 93, -325, 222, -51, 14, 92, 169, 302, 73, -53, 355, 138, -138, 43, -250, -76, -167, -184, -372, 15, -115, -74, 36, 93, 143, 27, 32, 209, 125, 113, 281, 106, -35, 220, 40, 34, 37, 45, 17, -47, -190, -184, -114, -193, -61, -169, 230, 185, 95, 267, 241, 93, 79, 52, 153, 163, 1, -68, -60, -367, -136, -291, 13, -77, -24, -79, 150, 55, 33, 137, 9, 21, 201, -22, 96, 70, -26, 151, 107, -130, 172, -104, -39, -35, -288, -116, -14, 164, -2, -111, 129, -65, 185, 358, 55, 77, 90, 66, 73, -129, -62, -36, 27, -76, 233, -147, -247, -162, -120, -123, -193, -64, -23, 229, 204, 143, 206, 53, -99, -90, 43, 78, 75, -101, 41, -315, 21, -158, -310, -196, -122, -209]
4260b09R6L62l08L2N9J5k41J68rJ10Q0j16lJ53l22M6j8J48k01O7o7o7J42J54k81
4285b10J44P4o0J76k0qj10Q6O6o2J16l87n8L7J9J73q9NK12l29K5J68M4M7k92L12
4311G9q7J13J11l19J70j19jq5J22J49j12j24j92K67k1r7L02q2k1j08N1k3K36R0
4335B99l20R5N6k52J88k29J08J05k99q0K50J92n8o6j96K52j65J21qR9j2j23J52
4358A09K5j49K45r1l32M14k66j8nK0k6L1J16k1k7k49J58J36k07J75p5j3J58j24
4382a6r8J77j91P3j30J51j48L14m88L74k23L5j4J00K3r0m9L93l6k00J91l1o8n2
4406cJ49k38R3O2p1k1N0l25Q7o9nK99k59L64p4j11J00P6k24K14l0k2M8j39j1k70
4432c30K33P6N2qj56o1L63k78J46K21j93r8K09o7j09r4L03k38j41J7J15P1l17
$$ y = [-209, -113, 249, -59, -27, 32, 47, -194, -26, -35, 75, 155, 39, 36, 189, -133, -87, -105, 43, -158, -91, -158, -225, -83, 71, -210, -66, 8, -52, 124, 104, 96, -14, 72, 138, 76, 192, -195, -253, -216, -197, -24, -113, -108, 104, -225, -200, -32, 12, 59, -233, 79, -8, 105, 216, -103, 67, -52, -53, -138, -16, 133, 21, -103, -295, -28, -49, -146, 156, 74, 53, -55, -4, -27, 209, 299, -21, 74, 130, -122, 66, -163, -55, 50, -249, -329, -79, 113, 55, -11, -207, 45, -120, 1, -7, 92, 80, -43, 109, 134, -15, 230, 139, -193, 221, -45, -63, -68, -48, -74, -43, 73, 52, 25, -224, -66, 70, -137, 38, -37, -50, 108, -16, -114, 63, -128, -55, -185, -34, -182, 132, -356, 18, -205, -170, -184, -84, -61, -151, -200, 193, 157, -43, 148, 117, 49, -3, 146, -92, 1, 63, -8, -29, 21, -304, -217, -286, -291, 8, -251, 113, 39, -72, 28, 104, -120, 94, 64, 42, 90, -49, -60, -330, -97, -21, 31, 23, -133, -194, 169, -109, 37, 258, 65, -33, 176, 109, 0, -94, 209, -29, -170, -153, -38, 33, -284]
4455b84J44N6N5R9L6m4j04k03L97j07J16j88J64P7k13lJ2P0k87K63r9N6J9q0P8
4480C0lq4n9N4o7k2K08P1J15l86K85j28Ol0l6J63j86K13k14J29Mk84J84L26l63
4505g4K53r6m2N4k34L93l19K41p4j48J18j27N5o1J0Po2kJ01qj36J52j53K57K4
4530A29Q2k2q7o5k6M9K7K8k16K7Q3J34k26J31k03J4K8l9J4J40n6j23K85J58k00
4555F6j00R9J11j43j24P9j0LN7j49K0J9N9j17M2n3q4J62p5J60L6J8L3J0j36j3
4581c0K25k53J47J30j89P7k46R6LP3p8q0J96k61J04J26j59l4M6J64L9r7L9j12
4605g4J9K5Q0j57k95M85j43j05j06M09m11pK86j91K67l4p5nqN4j74J58J22R1k27
4630a6l0%JM8m7n6K33l5k81J12J40N4j34O4J37j44L0o1J44l1k96J1M7l4J85k63
$$ y = [-284, -140, -84, -29, 70, 106, 62, -42, -245, 152, 45, 161, -27, 137, 214, 1, -2, 10, 80, -207, 56, -43, 13, 32, -48, 30, 27, -57, -116, -62, -129, -151, 57, 128, 243, -143, 142, 14, 20, -10, -46, 117, -69, 144, -70, 59, 63, -221, -37, 289, -74, 179, 83, 41, 95, -139, 254, -65, 176, 102, -46, 72, -55, 0, -61, -51, -44, -106, -108, -7, -15, -151, 1, -152, 105, 129, 211, 189, 102, 37, 11, 60, 87, 115, -101, -74, 9, 143, -83, 48, -155, -141, -113, -152, -138, 2, -54, -177, 108, 266, 66, -34, 65, 176, 33, -91, -12, -22, -19, 38, -111, -91, -72, -13, -130, -88, -141, -225, -63, -138, 22, 58, 76, 109, 119, -17, -30, 195, -58, 89, 219, 30, 107, -139, -43, -40, 33, -45, -125, 71, -190, -86, 40, -119, -153, -107, 57, 96, -1, 38, -74, -55, -30, 50, -107, -402, 83, -60, -165, -271, 138, -273, -280, 6, -185, 82, 48, -27, -32, -40, 14, -160, -2, 120, 211, -16, -46, -46, -45, 3, -44, -100, 133, 98, -183, -71, 69, 123, -11, 53, 190, 46, 76, 15, 159, 128, -168, -157, -110, -144, 41, -222]
4656b22L27k29Q3J4J51k9j19L4J68j84O5j0R9l9j14J26P5j67J06j92nOK3o9J93
4681I1j43l9j8RJ52K4O6J2m8n7P5k62K83o6q0l23K26J15k04J99k07K2K4K71j27
4706eq4J60p1k1O6l2J39k51J57j32J53j93j80J29K01j4j93K03q0m2K6o9K00k37
4730a70N0J20j8J04j40J33J6j06J02J66k43j02m2J7n5K50k01R2JP2l6jJ01j79
4754f9K19k35N7j26L37o9j44N8m4k23N6J05l1lo1K23r2L7n4K99l5j85J1N3l0L3
4780H7p5m7J06j25l9Q2J39m61K63J33q5q4j6M9M5J56k39K88k48K71j36O6J9k01
4804e2K54j62J6J23L4k35J25J77j62j18Pk9j25J38M7R1J51m00K29j90J94k26J23
4827A0J26o4j91P9J74j40j9k4n4Qj00j23K95j2j0p0L33j51j67M8j9M5R8j37m6
$$ y = [-222, 105, -124, -41, -27, 124, 95, -24, 10, 178, -6, 59, 49, 148, 109, -5, 121, 196, 29, 135, -57, -62, -56, -33, -102, 91, -52, -91, -109, -100, 52, 76, 142, 154, 106, 49, 124, -138, 145, 79, -1, -324, -98, 17, -187, 12, -195, -173, -149, 122, -5, -89, 71, 0, -21, 45, 13, 152, -99, 58, -74, 79, -114, -294, -165, 36, 22, -171, 32, -48, -90, -64, -133, 67, -170, -120, 0, -18, 86, -54, 79, 95, -11, 91, 257, 14, -88, -130, -113, -168, 82, -119, -27, -26, 46, 10, 9, 110, -69, 150, -85, -28, -154, 183, 114, -30, 28, -16, -239, -183, -78, -109, -112, -173, 50, -42, -5, -59, 240, 205, 20, 31, 84, 54, 87, 12, -35, 71, -54, -93, -11, 128, -333, -70, 63, -22, -106, -122, -73, -28, 128, -111, 177, -71, 200, 64, 130, 149, -52, 202, 40, 56, 179, 213, -22, 103, 280, 118, 0, 7, -22, -147, -9, 38, 129, 280, -120, 109, -81, 113, -113, 10, 136, 72, -119, -40, 134, -6, -25, -49, -103, -95, -195, -318, -23, -35, -45, -115, 218, 67, -100, -52, -71, -26, 72, -65, -111]
4852a11K0K9m4K47j09j98K98l33K29O3k55J50J41k08J59k0J25m9j91J39Pk52Q
4875a55R5j1J12J03k18J30K8j45j37K82k57K67oN9k11Q2O4Qj09K46j40j96J99
4898I0p2K5n5j45J08m7j34K57L6j22J02k0o6K99o1j16j13K64r5r9o4j41k1L4L07
4923A51k62O9J8k4j4jj3K62p1m2Oj22l2L86j00j45j96J12oj05J12J31nl1J40k62
4949d4k33K63K65l55J88q8n2P8R9j18J08j06j7j4J7r8j59K51pj68K00o0q0J7K
4974a11K90Nk19j68L58l00K18N0k92J76j16J95j54K7j4M1j10J85j92Q0J74n5J5
4997H3ro8j34J96J72k88J89j57J35q4k3O3j08K74l52rM43j66j43J91j86r7n7J66
5021C1k69K99J50l63J60N4J06j76J52j58J27J49k78J4j0K58m70N8J82l6p5K31
$$ y = [-111, -91, -62, -106, 141, 32, -166, 132, -201, 28, 91, -164, -14, 127, -81, 78, 58, 183, 134, -57, 82, 89, -163, -155, -60, -71, 41, 144, -74, 56, 84, -61, -198, 84, -173, 94, 88, 147, -64, 18, 82, 90, -19, 227, 87, -109, 90, 18, 43, -12, -157, -49, -96, -230, 27, 63, -59, 43, 23, -43, 256, 195, 79, -34, 230, 135, 36, -28, -169, -190, -156, 151, -111, -42, -24, -48, -62, -63, -76, 186, 115, 73, 79, -43, -75, 311, 211, 66, -130, -18, -24, -129, -17, 114, 109, 78, 218, -44, -277, -14, 251, -104, 84, -4, -56, 22, 121, 3, 111, 5, -12, -26, -9, -107, -266, -15, -22, -190, 10, -50, -130, -113, -111, 179, 184, -35, -203, 155, -145, 73, 123, -169, 7, -109, 86, -68, -41, -55, -14, -124, 61, -131, -51, 123, 68, 83, 74, 6, -128, 68, 240, -48, 141, -16, 119, 35, 12, 75, -33, 241, -111, -120, 323, 157, 14, 205, 19, -78, -135, 31, -238, 61, 211, -152, 8, 62, 168, -8, 144, -14, 113, 262, -16, -2, -12, 246, -224, -166, 16, -20, -95, 136]
5043A36kr2j44K09r0N4k37J96j7j68J13J49k39J11K09m12K68r8mR8p9K19J29k43
5067F6m0lkO6J04j04j18l5J26j68J17j3o1J65k95K86j42R8q2N3j00l8K41K1j31
5092A1m3k0%qJ1R4m3M7j27M6o7K89j60j27M9jK3J46l4o1j06J74j36j07J60P0m5
5119C5j75J53J1j48J30j69J51q9J03j29L73k31k5N3k07K77o7l4K29k19r6P5L1
5142C2K8l57J61L73m99N07j64k47J38p9Q0J61q9j26K21k07j7K16o8m9j42K28q0
5165B1j07J99r4j76K46k24J03j5J08l6qP2n9P8N3o7l1N4k61J06kJ77l8k29K44
5190A14l5k17O7p9k0J49K85n01K89rJ20j76M8j27j72K34J8N7R7j97J2q1J54J24
5214A54k09J01n6k7J80k8k33K14J40l83J94j38KK26L4l23L00k45J63P2k6k32P7
$$ y = [136, 134, 42, -102, 107, 17, 71, -166, 30, 13, -155, -42, 107, -132, -21, 188, -224, 44, -54, -58, 40, -39, 180, 309, 66, 26, 23, 21, 87, 191, 87, -31, -66, 60, -108, 9, -4, -65, 100, -195, 91, -51, 47, -35, 18, -82, -120, 121, 142, 11, -32, -52, -52, -60, -49, 45, 2, 49, -78, -32, -99, 190, 30, -97, -48, -49, -26, 120, 86, 25, -81, 93, -43, -150, 10, 80, 35, -140, 13, 24, -124, 6, -163, -12, -101, 2, -127, 246, 15, -10, 43, -164, 113, 46, 12, 241, 22, -74, 1, 32, 60, -297, -136, 237, -262, 245, 81, -166, -28, -107, -27, 134, 45, -81, 140, -67, -84, 132, 64, 15, -127, 101, 21, -86, 113, 19, -157, 89, -135, -32, -47, 61, 25, 17, 89, 30, 108, 161, 94, 63, 117, -144, -38, -40, 137, 99, -130, 114, 79, -138, -71, -150, -170, -21, 264, -237, 52, 43, 163, -13, 35, -92, -264, -30, -12, 45, 142, -55, -43, -124, 30, 154, -55, 46, -10, -37, 143, 115, -118, 96, 236, -147, 47, -91, -89, 137, 171, -152, 148, -97, 66, 138, 112, -120, -43]
5237d3R0p9j01J79m3J7j1j60L01Mj9n1K7k68j8O7o3j3K19n6q3J12k84K63qM0N7
5264G6j02pj6J28J7O0j30P3j43k01J84J98j44j2NQ7l55M71k63K76j69l6j9J95
5288A73j28j69m1J92Pk48K05M7JL1q8m7L56m24r3K91k9j84K25jJ54j65j24K62
5312B03j44k37J73K11k39Q7j80j9J01l1l8j6l2K56j11o7J9j01J84j13J11J96m1
5335A72j09j62P5Q0k08L4J63Pj83M3j40J10q1M43k11j42%Q5PK74k53R1K2j36j13
5360a32J38K56k13M6k06J36J16l32K24j73J48N5j33J4%J34j78q1J62L1J06r1J9
5383D6N9l17J08J02o1N9m9K13k67m9K65l8O9j60P3m0J14j76P9j00K55j80r2j7
5407a04M13o23M54j44p5J9j41O9R8J6k23n8J44P1K40j24J01j95J42p9j18J4j41
$$ y = [-43, 47, -32, -133, 46, 3, 20, 9, -151, 150, 154, 135, 84, 111, -157, -175, -108, -171, -184, 35, -21, -104, 8, -276, -13, -21, 19, 76, -26, -33, -49, 79, 96, 156, 26, 99, -44, -245, -61, 137, -7, -19, -14, 73, -282, 189, -74, 202, 33, -3, -22, 173, 45, -124, -165, 27, 34, -214, -9, 38, 39, 70, -18, -65, 291, -133, -226, 65, 36, -148, 77, 76, 230, 65, -59, 203, 59, -178, -5, 206, -33, 54, -126, -145, -44, -75, -113, -129, -161, 95, -16, -83, -64, -165, 19, -94, 17, 213, 172, 63, -99, -24, 56, -152, -118, 45, 52, -131, -88, -228, -118, -199, 244, 33, -109, -109, -24, -17, 257, 4, 95, 117, -19, -132, 6, 262, 49, 95, -111, 25, 141, -191, 33, -140, 8, 63, -70, -56, -56, 78, -100, -181, -19, 12, 118, 27, 46, 105, -212, -104, -2, -63, -4, -53, 160, -107, -156, 109, 71, 140, -20, 53, 13, 127, -49, 30, -70, 185, 5, -87, -104, 309, -314, 140, -4, -79, -60, -201, -132, -34, -18, -241, -299, -155, -84, 156, 32, 133, -62, 80, 1, -117, -103, -244]
5430b44K91J17k99K54n4k09J19qO1j45P6K7M6m8k49N24m71K52j30J57o7l6k32
5453b68L07j6lj58R2J43k20m9R7j4K24q5J98o2l84J57J40L2q7J28j48N6j00Q0
5477F0j04j88J99j82K90J5r5P0j25J68J67Ql10R1p4l5J57j27J36j29nj33N5j5
5501a06J49r4p0J5P2R7j05K25k4j21N9n0j78K94l7j87K7N5L1J44j66J03j25l9
5525c1q0O4J06p0p3N4j7k6K08k98J63P0N8l90M47l41J25N9j83J15K83l93j18Q4
5549a84j6L09j74J43k10J31J68j56K1q9J08j14Q8J01k11P8kM5L7k68K73l06J67
5572f1J12q3J42J2j44j9K90l17J3N0k4K42k05k07L44j04K0j08P7K8k32P9O7J62
5596A34k46J25O2j09K22N6r6j20M1j6K7k75j1K66j17J71q7L5Q1j62q2K56j81m4
$$ y = [-244, 47, 164, -135, 119, 65, -144, -25, -33, 28, -117, -41, -14, 32, -16, -265, 259, -212, 40, -90, 67, 0, -36, -268, 39, 23, 20, -138, -46, 97, -123, -172, -75, -89, 135, 50, 248, 186, -198, -41, 99, 131, 44, 172, 24, 80, -20, 60, -44, -232, -33, -215, 75, 90, -5, 65, -60, 108, 275, 283, -27, 64, -10, -45, 112, -15, 121, -8, -13, -146, -91, -106, 43, -51, -121, -106, -34, 63, -42, 183, 159, 38, 97, 47, -131, 163, 126, -61, -34, 21, 52, 196, 30, 133, 8, -31, -111, -47, 59, -11, -84, -30, -47, -73, 135, -163, 0, 70, 128, -262, 185, -156, -31, 28, -155, -40, 243, -150, -268, -184, -200, 109, -65, 78, -132, -1, 167, 11, 32, -57, 51, -63, 25, 126, -85, -7, -9, 36, 73, -195, 78, -228, -61, 51, -32, 110, 122, -22, -41, 249, -68, -55, -5, -29, 213, 8, -199, 145, 41, 61, -47, 30, 58, -174, -95, -28, 134, -112, 13, 75, -34, 188, 244, 148, 28, 69, 53, 80, -195, -206, 60, -57, 114, 27, 62, 143, -19, -101, 155, -26, -70]
5620g0N0j33R0n0K58j6j88n0j27J89k6q8J12j41K4J88k15O9L8j33K22J21j5n0
5644E9j45j34j7R5K43L5k29q2J28J29j11M1j23K06l58O7J07l7J71mP7j35O6k2
5668B7lrK02k69J57L7r0j93K21l06J39J91j68r0Q4R5m7j17K64Ok82K91J8l1j54
5693b7M7L4J17r3r7j34R4K8J4l8R8Q9p4j36K51j08o1o8N5J72r4j51L75m84j7K29
5719B1q3J68N8k77J87k78N8o7L20k27K60p1J1R9k1J1k82n6K44J42r4L6j76R7k7
5744E3j65Q1o6l3J06m2j19K4L33l44L05r0j78K14m5M6j89K98k7o0j80J16o6J37
5768A09k55J94p8K06k19KN0k48L81q0j49J44Lk22K30j58j2K5J48j38q7J20j38
5791a72K4L6R4j2M9m2J76j82O5l1J97k81J7pJ52M1M1l58L16j73j57K11RR6j7L3
$$ y = [-70, -20, -153, -63, -113, 145, 129, -59, -109, -236, -47, -73, -161, -49, -190, -166, 22, -193, -124, -86, -219, 3, 124, 109, 59, -86, -220, -237, -142, 101, 136, -93, -175, -47, 82, -29, 12, -111, 95, -263, -196, -89, -126, 45, 41, 118, -17, 49, 27, 24, 15, 217, -52, 105, 142, 52, -141, 80, -226, -87, 104, -64, -154, -70, 25, -22, -139, 125, 131, -151, 140, 158, 127, -27, 20, 54, 171, 78, -19, -153, -59, -31, -17, -55, 43, 132, 58, -78, 173, 65, 4, -64, -9, 163, 69, -82, 293, -191, -208, 21, -62, 106, 164, -113, 74, -204, -146, -213, 107, -120, 140, 69, 80, 179, 158, 169, -113, -169, 75, 217, 123, 159, -17, 80, 53, -112, -31, -97, -130, -24, -66, -185, -161, 172, -172, 133, 43, -135, 79, 34, 80, -109, 189, 162, 102, -78, 38, -28, 109, -146, 48, -30, 176, -43, -41, 9, -239, 142, 62, -87, 57, 60, -162, 68, -90, -102, -77, 71, -67, -154, -34, -172, -148, -112, -18, -30, 19, -23, 153, -29, 36, 5, 202, -79, -62, -69, 83, 124, 165, -193, 123, -50, -207, 4, 13, 109, 92, 125]
5817A25o4r5M8m2K4M2L4M5k66J12Q4J25l15L3n0j01L73j93q4K20J22j77o9J08
5841C9j93P0J91j04R5J6l04L87l40J80M3q0R7j07k79K34Q7k9j7q5K83k7k42K13
5865A28p9n8R9j85K68k9j67J82j68P3j31J67Ooj52M8O6j47K79k92J72k3J22R2
5889B65k27j02Q3j13L24l27Q4O6o1Qj2j67L06l66K59n5J24J41j59j58J9N1L6J1
5913C0l4K01K01m11Q9J14k65N3p1J63l6k60K07q1K9n2K55n8q8Q3J26j23j03M4
5937A3K0r0K02j40m1j28J64J5q9qJ03l1l03M07j48L3K00M6j01r8J83k42m7K37
5961A57j25Q9j13k44K68P5k01P4N2j20J93q6k46K58N5J04M4j9j71mk1J40q6j5
5985E8J51k34J46l2l19J55n7R6n1Pj12J14L21j54n9J3q5J49q4R4j17L4j26Q4N1
$$ y = [125, 61, -34, 14, -28, -4, 38, 72, 117, -149, -37, 47, 172, -143, -110, -160, -261, 112, -81, -165, 55, 177, 0, -69, 39, -154, -84, 107, 3, 98, 114, -190, 197, -143, 37, 80, 0, 97, -10, -289, -55, 32, 3, -14, -99, 184, 157, -85, 128, 49, -9, 90, -95, 173, 144, -23, 159, -9, 64, -67, 100, 106, 100, -52, -4, 62, -85, 194, -98, 74, 51, 173, 265, 38, -64, 19, -94, 230, -97, -13, 53, -8, 0, -12, -179, 127, -239, 20, -35, 89, 230, 71, -87, -68, -17, 19, 30, -4, 197, 398, -13, 76, 190, -75, -22, -93, 70, 34, -226, -19, -100, -71, -123, 132, 74, -14, 69, 195, 72, -31, 13, 33, -57, 145, 5, -36, -164, 0, 15, -74, -82, 21, -10, -313, 94, -54, -21, 179, 225, 124, 26, 209, -33, -80, 157, 32, 121, 8, -236, 32, 107, -94, -20, 32, -88, 105, 19, -227, 31, 86, 190, 234, 215, 44, 40, 19, 159, 73, 58, 209, -25, 121, 89, -230, -75, -132, -36, -87, -80, -192, -78, 243, 89, 30, 43, -42, 107, 23, 117, 0, 34, -92, -8, 43]
6010D3J44l16J35Q8j20N7O9l46K60kJ50j99j36J87Q4j99L35j36j25J99l96L17
6032I3j27Q0j55J06M9p0J59n2k44K24J0J4o0q0J33k14J33P1J62p3r2q3J06j40
6056e0J03Nk17J46m1OR3k11J48Q4m5Nk1N9j3J19M0j03j12J01k47J35j18P8J65
6081A09k48n2K22J18j03k36K14l6R9m3j7J81j16k78J67J52M7m4r6k15K14k58J95
6104b4O2k9j48K79J06l14J75j64R2o5J45j0j25J90q8k2j26r1J01o3M4L9N6k9J8
6129IM3m8L9J45l41J78p2J20J6k3j32K91k90R8J17k24j21J41mRj43M4Q3J48j78
6154i5L55j30j87J99M2k63J74m9Q6j2k67J6n5J82J75l34j6L48l53P8J06M6lJ41
6178A84N0j16j72P9l6l3N0j03j54M69j72o1l8j70K30j22Q7J57k91N3L24l37J03
$$ y = [43, 187, -129, 6, 94, -26, 31, 100, -246, 14, 12, 162, -37, -173, 14, 98, -101, 234, 98, -27, 172, -224, 93, -34, 46, -109, -3, 46, -24, 135, 83, -161, 63, 73, 87, 27, -53, 80, -134, -1, 70, 232, 159, 67, -16, 90, -50, 53, 58, -159, -13, -54, -48, 45, -166, -18, 66, 21, 26, 5, 64, 51, 170, 210, 107, -5, 96, -151, -16, -134, -56, 109, -139, -191, 31, 149, 46, -190, 24, -12, 87, 44, 27, 208, 92, -186, -19, 133, 180, 136, 40, -175, 39, -219, -24, 38, 9, -139, 140, 246, -68, 107, -57, 35, -30, 115, 105, -20, 170, 82, 60, -66, -157, -56, -119, -75, -36, 20, -9, 9, 52, 4, 43, 188, -153, 25, -47, 73, 89, 66, -66, 225, -65, 33, 150, -74, -195, -54, -58, -49, -192, -148, -65, 83, -95, 260, 130, -57, 142, 184, -79, 95, 46, 132, 120, -147, -131, -186, -4, 171, -163, -179, 169, -184, -106, 0, 46, 43, 184, 234, 118, -54, 25, -11, -44, 6, -97, -251, 218, 46, -15, -53, -223, 7, -115, -28, 129, -162, -109, 215, -122, -19]
6201a9P4k95L99k27M7K29k53R0kk34M54l56J67L3L0l30M2N4J22q7Q9P0k42N13
6225C68m02K45j79k2q5q6P0R8Q2j72J34j82J32K1p1J03m4J39J03j12j09O3j09
6248a5J09q1K2P7k51Q6K54m02m5K85l3q1j48L03l44L2J83K8L81l22M4m2J04j48
6272dJ33j03J76j30M9k01j16K27k42J27j42M00k03N4M0k3Rj77K84o1j53J73o5
6295E2Q3l1j18k65K76r7L5r6L2J40q9J40l8R7j52P9L8J52k15j26j34L58k7j13
6319a9j58K56l19K66K87k08r5j2k80L99J7j54L00o1k84J68J73k85K26r0n8k19
6341a50J99j58j41L73j39K6k18J01o4P5J90l5j75N2Q0r6J67O6k96K28p9J0j33
6364a17o4J17J8m9m7Q9Q2k06K20l00K87R8J1j16M7j3n6P5N0k73K72j24J76k20
$$ y = [-19, 55, -240, 159, -68, -21, 208, -45, 45, 43, -191, 263, -93, 74, 107, 137, -193, -151, -97, 25, -62, 27, 97, -145, 368, -34, 211, 32, 10, -75, -161, -91, 7, 89, -83, 51, -131, 1, 22, -49, 54, 10, 149, 252, 140, 31, 94, -15, 94, 13, 35, 112, -139, -53, 201, -201, -246, 39, 6, -75, -223, 80, -264, -232, -49, -21, 360, 38, 82, 40, 144, -4, 129, 26, 202, 72, 121, -80, -196, 31, -211, -84, -226, 174, -29, 25, 65, 42, 51, -126, 158, 97, -56, 117, 52, 135, 104, -14, -279, -3, -100, -65, -161, -129, 11, -78, 62, 24, 121, -31, 48, 86, 238, 23, -103, -237, 121, 94, -19, -177, 79, -240, 26, 313, 105, 10, -2, -282, 117, 134, -20, 280, 219, -65, 103, 276, -9, 217, 127, 69, -150, 49, -109, -250, 123, -16, 10, -208, -107, -171, -96, 94, 59, -116, -64, 16, -80, 87, 153, -143, 85, 6, 16, -117, -181, -64, -46, -95, -142, -53, 29, -177, 43, -257, 30, 128, 139, 23, 70, 57, 1, 76, 126, -147, 125, 1, 177, -43]
6388d3J22Q6n8k50K81lj19O8k18L7K96q1l7J07j75j65K34K8L9j71J05L1k57N6
6412h7J04k6k25K55j33p9J93j17J77j5Nk10M04k38k7n6J80o9J81kl51J9K56m52
6436c13J47NJ02M9j52J01q0L60q1k25K09j3j48j07J07O6P0O7k46K6m1O8j8np6
6461a28K49l1j52J71n4j30J58k19J21J13q4J34k17p0J97l44L26k00J9LJ02M3k73
6484b66M46j49K1J91l38mL5o8K41l31P0J69j53J59n9o2p3nK59o2Q3j70J8K6N7
6509C5L2j41J33j33P9N1L2n7m3L0pJ83k17m4j39K84k58J94j62O5J89j18k7Q3n
6534C9MJ3k76K71m2J46j42o5J22m7l8J0l3r8M9J60m2j7M2j13R1r1p7j11L2K59
6560D6l7mo0J73l8k01k9M17j34j81p8K60j72M3j63J43J05M6l92L32q1n2j50K74
$$ y = [-43, 79, 165, 107, -143, 138, 135, 16, 84, -134, -97, 199, 118, 81, 188, 13, -152, 82, 110, 149, -22, 83, 114, -143, -87, 17, -9, -234, 21, -112, -191, 2, -115, 62, 47, 52, -158, 246, 8, -19, -75, 105, 36, 217, 215, -136, -117, 139, -313, -166, -161, -59, -10, -162, -61, -141, 219, 138, -87, 122, 109, -39, -146, -39, 27, 97, 164, -82, -56, -97, -29, -47, -52, -128, 121, 90, -62, 109, 55, -75, 83, -136, -15, 98, 14, 148, -69, -139, 58, -286, 40, -160, -141, -138, -36, 7, -266, 180, 31, 52, 243, -95, -99, -64, -132, 109, -222, -152, 17, -136, 23, -36, -98, -171, -176, 83, 21, 104, -66, -48, -22, 35, 67, -74, 59, -74, 5, 56, 88, 31, -12, 18, 11, 194, -23, -67, -206, 78, -180, 14, -148, -83, 106, -12, -39, 44, 39, 43, 56, -220, 51, 9, 155, 13, -52, 70, 23, -15, -5, -38, -136, -87, 73, 31, 14, 56, -57, 34, -57, -134, -245, -213, 46, 9, 5, -55, 118, 80, -121, -150, 267, 133, -48, -126, 134, -38, 5, -158, -15, 90, 136, -256, 76, -5, -57, -207, 67]
6584F7J90l54K08p7K4j00M8q4J20J02j53j33J01J8P5k03k0K82M0j42J81K8m05
6607a87K48m8O8j35o4o7J82o7j59J86k15K4J2R2j02K14l22M89o4K0k7l6Q0j66
6631d4l0K87j91l41K84q4m4K48j28J7J75l54K65m0J3k23K93Q5k84Q6M5p6j8N6
6655cJ13k01k7J05j60L77k80k5p3J95j04K16l7j03J63k01K55o0k8r5Q9L1k05J79
6679A21J46l84J87m4j03q3m7O2J78j59L43k30J43k19J53Pj29j0j3O9P7o3l8K5
6703a1J15r6j24J58O4k32K17j38P5m5o8L13m0j49l2k12J83K27j54k87K13K45j16
6726A06j63o8J14K31l06J89P3k55r4L29j8L0r6L3j67O8J3O1J9R9k30J8n7K65k56
6751f2O6j21oK17q7n7J70Q6j87j87J79J34k30J71n7j62l2K63j12j0m3J43l76J97
$$ y = [67, 257, -97, 111, 34, 58, -42, 6, -78, 42, 144, -9, -142, -41, -23, 52, -151, -171, 111, 151, 9, 190, 218, -187, 61, 13, 81, -54, -118, -185, -3, -70, -229, -43, -258, -234, -222, -130, -232, -18, -340, 149, 85, 105, 78, 42, 122, -44, -74, 213, 22, -319, -35, -119, -163, 85, -43, -26, 149, -205, 60, 20, 33, -190, 103, 188, -96, -10, 35, -41, -59, -3, 110, -91, -118, -13, -173, 204, -76, -101, -174, 21, -83, 133, 96, -7, 156, -45, 210, 150, 122, 27, 116, 147, -58, 121, 267, -117, 70, 26, -77, -160, -207, -145, 33, -126, 217, -13, 130, -89, 64, 71, -58, -68, -81, -12, 65, 2, -36, -11, 104, 8, -116, 42, 106, -126, 91, -47, 28, -17, -85, 228, 188, 39, 7, -205, -22, 205, 51, -236, -23, 222, 106, -57, -125, -11, 220, -86, 103, 176, -79, -173, 156, 138, 168, 72, 105, -62, 6, 19, 80, 99, 198, -32, -14, -71, 194, -62, 4, -117, -123, 94, 7, -50, 120, 206, 19, -168, 11, 145, -85, 86, 29, -133, -165, 98, -14, -24, -67, 76, -300, -103]
6775a03j49L92j41RK1p7K40l48P8pO5O3j30J24K01l12q6j18M59q6Pk61R3L8J22
6800I4k24L42k96N6o3r2M43j13r3P4k33P1j30J49qm5q5K38k54p9N09j67j9r7J08
6825H6J50j05q9P9j68K19j84O8j45J01l9j13K2p5J17L3P3n3J14j54J88m8q2J13
6849A08j27P1j40L59j69j2j68K05Q4l46J96j39K2k01L80l76K20j77K05j3R9k29
6871a48R0L88j76q1J13j54j59J96oj31R8m4n9p1q1M6J83o1J83j38j8J29m8K82
6895C33l10J2P8ln7n1J5J52j72J99l28j18K16N6Q8j32j30K80j07j1K66j00k2j70
6919a6p5K69k30J35l6m0p5L0l2m4o6M6K32k27o8K65m1JJ29Kj49P6l26L47k37j21
6945b51K61L1n8j32J03N9j1j12L7n8J78R2j16R7K5j21j98L65k47k8L0K6L6q3o6
$$ y = [-103, -252, 140, -1, 8, 29, -48, 192, -156, -78, -85, -20, 43, -87, 37, 238, -74, -160, -278, 181, 95, 102, -159, -66, -28, 94, -130, 212, -84, -28, -91, -183, 260, 147, 54, 128, -105, -34, -164, -15, -23, -68, -153, 85, -169, -248, 261, 94, 75, -22, 86, 236, 131, 42, 121, -47, 172, -12, 56, -89, 12, -27, -140, -118, -193, -76, -43, 30, -23, 91, -63, 125, 77, -5, 108, -19, 52, -88, 271, 102, 90, -78, 127, 211, -135, 61, -78, -56, -257, 123, -253, -33, -210, -5, -18, 81, -148, -58, 330, 154, 73, 186, 32, -127, 69, 63, -68, 30, -14, -73, -144, -225, -179, 4, -57, 126, -12, -30, 99, 51, 333, 23, 35, 113, 110, 53, 2, 17, 169, -3, 196, -132, -250, -34, 22, 110, -22, -152, 128, 21, 10, 276, 176, 154, -16, -91, 178, -52, 83, 47, 7, -68, -38, -70, -114, -180, -134, 98, -129, -197, 68, 27, 28, 157, 159, 10, 86, -240, 107, -130, -251, 10, 41, -17, -149, -46, 13, 2, -110, -73, -131, 47, 139, 23, 120, 145, 24, -174, 191, -56, -84, -54, -28, 8, -75, -141]
6970a41J83K6j3j2j2j88N1P9o7J44J1r3J8J30q8j48K47j29p7K93l98K23o1j28
6994a50O4O6o1q8J83O4p9p2lM10l01O1J06j31j33m5J48N0j27p0K9j0R5j45R4l2
7020g7Q2j73n1L8L06k00J77p9J10Qk13K36j48j60J47R0l37K54j16m4J92K4k36
7043a70K16R6K4j50r7M5J36j60j09L08k45J53j73K05r5p6n9K48k41o6L21Q5n4
7066A42k69J96j17n1J23j1q1O6K1P4o7P5o1j60R8Q0k1j04j38P7J95k04K81J14
7090B58k95l4J69k8N7k69n3J44Q4o8K13l75K0K55n3N0j06j20J18J33j05n2L8L14
7114B95k90k2J70j49r6J11O4q7p5O3rnp2M0J5k16K40P7j74O0K34k93N2r3J76K2
7140C8m3J78j45Mj26J48N8k52K04j84O8q4l3K61k90K81M5l23J31L5k6K7QNl3K2
$$ y = [-141, 42, 68, 55, 43, 31, -157, -106, -27, -94, 50, 61, -32, -14, 116, 28, -120, 127, -2, -79, 214, -184, 39, -22, -150, -86, -20, -81, -169, 14, 78, -1, -73, -76, 334, 33, 94, 200, 69, -64, -109, 39, 89, -38, -108, -79, -89, 6, -139, -45, -77, 5, -168, -219, -181, 125, -75, 102, 23, 133, 141, -72, 164, 16, -144, 3, 93, -244, 10, -106, -150, 42, 66, -170, 46, 142, 166, 16, -81, -36, 100, -60, -169, 139, -106, 47, -126, 79, -16, -92, -151, 97, -144, -210, 111, 196, 142, -127, 69, -48, -99, 24, 13, -68, -2, 19, 93, 26, 101, 40, -120, -22, 58, 37, -67, -205, -128, 67, -137, 144, 258, -37, -71, 98, 70, 127, -142, -195, -51, 33, -35, 178, -197, -177, 78, 25, 75, -31, -151, -33, 100, -5, -57, -19, 295, 5, -17, 153, 4, -92, 19, 83, -4, -79, -16, -25, -30, -102, -62, -47, -263, -23, 54, -120, -60, 174, -119, -67, -160, 16, 38, -5, 173, 28, 32, -94, 54, 112, -140, 64, -120, -52, -136, -169, 92, -198, 83, 128, -195, -64, -29, -55, -28, -20, -15, -48, -26]
7166b6L8rk9J18k96J67j11J74j09J94j90p2J82p8Np8R5J16L6q5J31j63o9l5J78
7191H4k62L13j00J22k06k0o4K09r7K8J30p5o9Ok8J5Mm6K41j33m8Qj80J78O4k59
7217a85Q3J68k9K00k54J28j18m7jL5r8P5K75k99N7n4j19Q0J57j22L0k96L78kj67
7242a25J04m3p6J78J37k56K26k34K81k66l7J27j42O9J48j9j54J83l3j80J2J34
7264C4N4k19j74P2K61j22O4K01j78J6k0N6k28L51l02J62j09n2O6j25nK33j00r6
7288a60l2R4K46k91J37R4n5K7J52n1k37L8Nj9K2J7p7M4J22l3k31O2JJ42j50K76
7314A43k98J90Q8o2J42o8N7l27j7L12l21J72k8n7J11p5K43m16K1P9j6o8K72j31
7338e4O2LO0j93L20N7l58K31m1n8P5q0M8q4l8n1j88K12J24p1j67K18j50J65M6
$$ y = [-26, 12, 3, -26, 92, -204, -37, -148, 26, -83, 111, -79, -151, 31, -47, -42, -120, -25, 91, 127, 42, 173, 10, -59, -94, 84, -178, 135, 35, 157, -49, -69, -133, 76, -21, 7, 137, 62, -7, -1, -29, -14, -10, -56, 185, 52, 4, 12, -168, 10, 74, -185, -102, 66, 37, 237, -17, 111, -7, -54, -55, -20, -118, -43, 232, -67, -10, -64, -183, -103, 54, -68, -38, -334, 44, 42, -125, -21, -64, -140, 38, 175, -81, 145, -89, 192, -74, -111, 16, -126, -57, 91, 72, -82, 101, 68, -112, -100, 34, 88, -131, -305, -233, 28, -94, -30, 171, -7, 9, -11, 45, -183, 168, -134, 28, -81, -133, -67, -192, -197, 36, -64, -160, -192, -98, 148, -143, -6, 88, 33, 60, 212, 161, -76, -38, -33, -52, -30, -13, -90, -46, 76, 43, -188, -126, -125, 17, -133, 143, -155, 35, 123, 61, 203, 135, 192, -135, -152, 160, -161, 11, -17, -74, 37, -38, 205, -211, -190, -111, -127, -195, 77, -54, 8, 11, 71, -122, 198, 255, -103, 128, 87, 29, 104, 24, 72, -12, -50, -101, -289, -77, 47, -24, -191, 27, -123, 42, 88]
7363H8L4M0p4j03r7R0r5M7K9K48k51O5J33Pj06k60J76m9L0J31j76J14Q4%k50R7
7389d8K89j40n1p1N8q4M8j22j30L58j13j1J31r5J3j05K68j96O5j9j90NK50p2j56
7414a18Q8j07Q3M9j06K69k04j55K97q0Q7k05Q3k08K51J18l8j14k11M05p0r0j07
7437h3J80k96J01R1l1K1n0j3K25j58j27L10k32K6K26l36L71k69j27L35j4oj23
7460B1O4m6k00Q3J27j39q1K44p7kj7p1J03M3PM9m6o0J86j88P8j31J21j71NK17
7486A19l66L37j06J08p4j22J71j00Q3%k27L15q5j12K03j7j13j04r2M3P5m1r5L61
7510A61m34J46N2pJ51l21O05j93n5q6Q7k9q6K49k62J98m7NP5j91j38n4j01J81
7534i4m2K04q0oO6J06O8l70J99m2QJ22k21M4J55r6k3j60N3J58J01m49K95k0L9
$$ y = [88, 122, 162, 88, -15, -112, -22, -117, -70, -41, 207, -44, 21, 154, 161, 55, -205, -29, -78, -48, 83, -93, 21, 105, 105, -145, -48, 241, 101, 50, -21, 37, -47, 1, -121, -251, 107, -6, -17, 114, 19, 32, -73, 195, -1, 64, 45, -145, -140, 110, 38, -118, -30, -137, -54, -5, -111, 158, -46, -201, 96, 16, 103, -102, -19, -227, 24, 142, 104, -10, -221, 184, 114, 24, -83, 97, -199, -98, -7, -38, -17, -67, -80, 145, -13, -140, 170, -62, -36, 190, -146, 225, -44, -171, 164, 150, 144, 21, 85, 39, -161, -78, 49, -90, -171, 73, -4, -6, -23, -94, 9, 52, 59, 108, 62, 2, 188, 0, 78, -53, 68, -103, -98, 119, -247, 90, -16, 92, 18, -104, 67, -33, 50, 50, -177, 138, 53, -59, 144, 127, 14, -90, -182, -139, -64, -105, -200, 161, -273, -127, -75, -82, 69, -252, 353, 160, 105, 19, 106, 77, -9, 240, -22, 176, 129, 134, 209, 18, -120, -174, -275, -94, -136, 68, -12, -18, 48, 154, 222, -148, 51, 9, 17, 139, -82, -38, 117, 21, -2, -162, -109, 49, 150, -299, -4, -24, 15]
7559A5j4J36k12J35l2k1J01k39O8L7Nq5K11j33j57L22k58J02j02M6J23n4O2q2
7583b6J17k6kJ08k22J06j28J98k74K15j72p1J02K16j61N6j52J6O4j5J69j12O3
7606F9j12N7J90J12j58O1j93lk30L12k7j62K1R9J4l52L30j56J43J4R1r5P1lnm3
7632D5N1p8l%Q0k39J99j30N6J76j51r9k8L35o8j41q5J45p4nO6k0P2o0j86J77j46
7659a11J72j42K14j43k16J68J8k61K89k08K08l4K0j8Q9j62J82J69k59L23R7n51
7681a56l58L71R9K6K55k66P6p7Pj40J94J56p5q9K9Q2q0k25K72Q6k16N2J8r5n9
7706a13q5K21j28jm3Q0P9l35K90J7j24J30j28L35j81R0Q1K2n4m3n7m3k39R9R2
7731c8kl5N8J4k99L69j01K39O2j83rm9N3ro3RM8K0p9k45M09j84p4K75l10J99j23
$$ y = [15, 1, 137, -75, 60, 28, 7, 108, -131, -63, -26, -21, -106, 105, -28, -185, 137, -121, -19, -121, -75, 48, -6, 56, -26, 91, 65, 63, 171, -51, 55, -73, 125, -149, 66, -106, -177, -75, 141, -20, 36, -116, -100, -36, -51, 118, 6, 69, -43, 14, 204, 316, 158, 219, 26, 23, -207, 105, 78, -84, -63, 36, 50, -302, 28, -128, 15, 29, 120, 25, 96, 93, 88, 45, 96, 18, 15, 15, 95, -144, 55, -75, -19, 157, 6, -93, -121, 214, 146, 5, -80, 65, -9, -14, 52, 32, 104, 44, -142, 35, -111, 61, -81, 133, -10, -226, -58, -40, -301, -12, -220, -12, -46, -26, -44, 45, -117, 65, 234, -25, 298, 395, -156, -514, -143, -44, -18, 237, -29, 47, -30, -23, -163, 31, 187, 112, 23, 52, 134, 54, -171, 101, 187, -29, 23, 41, -54, -113, -198, 23, -105, -106, -149, -69, 10, -325, -35, -18, -142, -12, -140, 195, 14, 104, 185, 207, 153, 110, 53, 10, -229, -130, -38, -40, -75, -17, -3, -302, 67, -34, 205, 267, 84, 75, 26, 79, 70, 7, 16, 64, 84, 5, -240, 169, -15, -89, 186, -124, 75, -48]
7758d8R2Pj24J73k21k6K20r8k3R1j5R4K5j59J15J1k73J07R0J5p2pK00jj86kj6
7785c1J27L7M3r2N0j12j70K6R9Qo2j64J64j0m1l3J51Q7OM3M4n6j64M05l42j13
7811a00P7j86J80kNJ58l69J68l7k1R7j45K49K0r7O5j11j39J82o3k1O0k67K48J46
7836I7m5kk9j9j77J68j17R2j10O3J3pJ22J9m5J17Pj67R4j15L58m76K38o8l2p2
7862i3j22L66j07j1j56K6j26J31m4L29j86j82O1P5K47J23l63J27o0j16K9J2j9
7885e9P2l6M1q9l4K36j4l63N4J63J41J02q7r8L9j38J41m8j85K05K40k35o6o1q3
7910a62M4p3J49r4j43L42q0n5j5l4M59l40K34l9r5jq5o8R1K1j27m5N0j2j51R3
7936a36J17M8k8o9K61k67L03k16K48k64pJ60k88K41k23j8K48j49n7l7J25l12K35
$$ y = [-48, 44, 51, -73, 100, -121, -147, 73, -25, -48, 43, 28, 122, 147, -12, 103, 114, -159, -52, 38, 53, -19, -26, 174, 173, -13, -15, -31, 96, 133, 176, 84, 134, 22, -148, -122, -23, -15, -77, -241, -77, -87, -128, -161, -10, 77, 83, 126, 170, 114, -50, 355, 13, -100, -23, -209, -29, -31, -26, 132, -237, -69, -106, -127, -30, -175, 74, 94, -3, 62, -49, -188, -6, -69, -90, -30, -297, -49, 97, 52, 50, 21, 2, -175, -7, -124, -32, -142, -79, -66, -73, 49, 68, 23, 140, 147, -20, 74, -41, 317, -159, 79, 11, -21, -93, -215, 151, 44, 33, -123, -97, -223, -92, -136, 193, 7, -175, -114, -39, 208, 331, -32, 95, 35, -81, -52, -40, -59, 13, -23, 18, -71, -105, 131, 117, -246, -192, -29, 112, 214, 127, 29, 68, -70, 71, 23, -162, 43, 283, 48, -18, -79, -162, -118, -191, -42, -136, -279, 63, -17, -72, -87, -121, 338, -2, 232, 193, 98, 97, 12, -56, 35, 56, -71, -116, -66, -78, -229, -136, -19, 29, 1, -68, 193, -74, 229, 13, 261, -3, -10, 150, -138, 103, -120, -138, 110, -39, -96, -133, -8, -320, -85]
7959h5K9J4o2K32j93K10R7k49O9l27L94k07J01qn5k0m5K95l66K00P0j87R5j82
7983a80J30o4K14j22K45k40n7K65j36n7j59K21k1j53M5K2o1K39k14K23j02N1j37
8006d8n8K52j7m5J6p2K29j78j66J56J9J8P6j29j54Q3m9J68l9J85l41O0O2pQ7n0
8032E8K1k15J36J25k58K31k2pj67j2rj05K06q3J62k32M6N8L3n7k9K58rL3j34q7
8058e9R9R2l68K74r5p8p1J60J74j94m6M9J09J26p4q1N8K08k55M8j81K79k80J48
8082D2l9M8k48J61k0j25N2j02J67k54L48J5j24L7J24j66J09J20j89K24K5k44j50
8105a89M19m47K81j61L4J54k35J67M3o5o1J11q5K8J4M6j1R9j87K53k17N1p1l0
8129e9O0n3n1Q5j4p3J65J2o7R7j44P3J4j10K98j78J4j31K35j64q3J07j49J01k29
$$ y = [-85, -56, -42, -104, 128, -65, 145, 242, -7, 62, -265, 129, -78, 23, 15, -40, -60, -105, 190, -176, 24, 94, -93, 2, -180, -50, -114, 100, -22, 223, -17, -74, 191, 55, -2, -161, 60, 39, -114, -69, -47, -108, 131, -83, 140, 38, 89, -48, -106, 146, 129, 84, 100, 28, 257, 79, -87, 69, 88, 106, 182, 53, -101, -18, -67, 101, 62, 247, -94, -34, 28, 21, 108, 58, 79, -136, 0, 125, -133, 98, 76, 69, -98, -110, -119, -224, -18, -101, 61, -171, -125, -67, -34, -91, -120, 138, 129, 162, 28, -59, 40, 132, -236, 38, -57, -135, -206, -46, 128, -66, -112, -63, 46, 172, 98, 17, 75, 283, 28, 76, -105, 174, -106, 42, 3, 51, -197, -36, -56, -181, -129, -231, -64, -318, 30, 45, -79, -42, 82, -84, 25, 145, -44, 180, 205, -39, -189, 230, -217, 64, -97, -63, 91, -144, 23, 66, 1, -60, 51, -34, -6, 8, 54, 43, 142, -45, 208, -9, 42, -29, -59, 1, -52, -103, -18, -32, -105, 60, 72, 5, 102, -42, 31, 45, -65, 233, 55, 69, -62, 173, 9, -74, 33, -116, -15, -244]
8154b44K03lj20K60j10K1j24L06k9j37lm5J1n8K09k27L1J84O5j97j02J74j37K3
8178d9r1J34rJ05p7p9L39k70J06N6Q5j90J2
$$ y = [-244, -41, -44, -164, 96, -14, 7, -117, 189, 160, 23, 20, -25, -14, -72, 137, -90, -59, 125, 190, -7, -109, 65, -72, -49, -140, -6, -15, 90, 13, -66, 273, 3, 109, 165, 250, 60, 72]
8191G2
$$ Imaginary data points
##PAGE= N=2
##DATA TABLE= (X++(I..I)), XYDATA
0@%%%%%%%%%%%qJ6j6J6j6K4l2M0m8N6o9P8q9J05j29J52j76K05k32K66l04L45l92
34b08M42m99N62o30P06p87Q76r76J084j200J328j470J622j789J974k174K394k637
52a382K908l208L541l917M341m825N385o040O822p768Q942j0450J2466j5310J9662
67A1167k7236M4156j52252M7667K79332j14105j82996m0226J50937L2449k6545
78B2348L561o348r6540K1846J23599L9904j22113q2876P9072P7410l8268l7428
90a5833J9306j0090l6351M1246N3661k6129p5804K7708O4312k2893m1473M5103
102B2763K9515p5098l1919R0754N8557j07369q3341R8923Q5875q1144r3551O3744
114b2291Q1069m7152p3066M3356N2947m2489k0647M7494Q494o8184q15R3937J4614
$$ y = [0, 0, 0, 0, 0, 0, 0, 0, 0, 0, 0, 0, -8, 8, -8, 8, -8, 16, -16, 24, -24, 32, -37, 41, -48, 57, -72, 80, -96, 109, -123, 143, -161, 184, -208, 234, -265, 297, -333, 373, -414, 462, -514, 570, -630, 698, -772, 850, -939, 1035, -1139, 1255, -1382, 1526, -1682, 1859, -2058, 2283, -2542, 2843, -3197, 3625, -4143, 4799, -5651, 6815, -8495, 11167, -16069, 28087, -124165, -76498, 202834, 88729, -94267, -134493, 16444, 48893, 22348, 25909, 19561, -76979, -55133, 68466, 108370, -13743, -96619, -17547, 59863, 21595, -15833, 3473, -6617, -42968, -1722, 51939, 25810, -49994, -22286, 42026, 19133, -22340, 22763, 52278, -22820, -54739, 36015, 94572, -12797, -96138, 2785, 88660, 7516, -86035, -22291, 58778, 11626, -61440, -18084, 34863, -7626, -28273, 19221, 27715, -40469, -41284, 52653, 67267]
127F7267j09046l9467J00756N3119o6091o3679K9868M1858j0793m201O321k6660
139b0748j8983M9833L4449m4639m4346M4672N5804m7189n1746M7539N6600m4714
151A6532o0284K9458N5751k0291m5635K1066J6965l4554m476N5607J2460p2372
163b9773l4469P3126N9880n2934n6546K2181L9061k892j3615J0418j0185l4607
175c0355R372M9305k459m6560j2388K3783J0733j1123J5283J2938m1656k9861
187e2988N5032N8982l4935p2195L104O9952J9278l9923j9978K890n34J2627K6360
200B7672o360m9106k1135N5050M1058m1583m3607J8997L8806j392k0969L817R139
213A0387j4266K044K6067m816k9168m589K6572P699k8505r324K4187N90k3831
$$ y = [67267, -41779, -81246, 19510, 72629, 6538, -57141, -27273, 14585, 3792, -409, 5912, -20748, -39731, 10102, 44551, -88, -44434, 238, 56042, 8853, -42893, 4646, 61246, 16532, -43752, -14294, 41457, 21166, -24469, -3403, 13562, -20992, -25468, 30139, 42599, -29773, -64242, 8884, 68764, 15830, -40716, -18535, 20526, 17634, 4019, 14437, 4252, -30355, -20983, 28322, 25863, -20697, -33085, -9302, 1431, -9692, 5591, 18529, -23127, -52988, 2044, 61026, 26091, -46104, -43000, 26952, 46230, 6307, -13671, -10781, -11315, 1312, 27672, 21312, -27794, -48929, 6121, 47179, 5596, -38011, -19014, 19792, 18400, -2569, 1248, 10387, -3879, -1835, 24232, 19416, -9752, -14341, 12231, 19930, -8575, -17899, 6288, 6878, -16953]
226a6953L694K1115j413k3504k39K9021K547k3624L83J7138r50p889M388O186
240I900j4013j2978K3169J5300k8192k3347J9897K7307j0494k7716M204K3337
252F374k115q231O465K808p160j039J4981N998j8520q175J8451M113j6368m585
266g003J1497L223j7111m748J9584L819j8279l158J3054N499n164k067P800l405
280C541r443J2541J2047j3504j7567N818J9113q50k2656l862J3632J440n494j71
294e415N1l039K65J0654O882j4513o397J6886Q615j0287q692O065R466p568q328
309e355P941K166r776k576N876L967o236n217Q441K951o543L906P801l305n834
324a793K235J1409L58j4157K28R801j522p135j639J573k07n419K073N998p545
$$ y = [-16953, -13259, 7856, 6443, -17061, -17300, 11721, 14268, -9356, -8973, 8165, 7215, -674, 3714, 9900, -4113, -17091, 6078, 21378, -6814, -30161, -10264, 17043, 6549, -21167, -16963, 6374, 4259, -3972, 2493, 5301, -1859, -2898, 12083, 18081, -439, -8614, 9837, 13950, -2418, -7003, 4494, 7717, -9394, -14142, 5442, 9261, -9018, -12176, 878, 6377, 1213, -854, 6946, 3541, -5902, 6639, 18686, 5182, -12385, -6567, 12546, 11696, -10960, -14822, -1190, 250, -5244, -5415, -5364, -8403, -8138, 2516, 9398, -5115, -11512, 5374, 13989, 3702, -4990, 1075, 10541, 2973, -5355, 2586, 4752, -5024, -7600, -1724, 2243, -3993, -9210, -769, 2182, -4361, -455, 7346, 4041, -1793, 442, 11851, 12209, -1948, -1720, 8081, 6559, -576, -2215, -642, -849, -6268, -4195, 1803, -5742]
339e742m507Q342M530k935n004L541R321k971o874N936K709m316k066Q69K250
354C083m206n365M848J373o680J105L305j232j608Q96P379J470q764J542J0208
369G354J717m018m834K38N589m14j008j792q507j380Q874L328o015r762m3J2661
385A988L159n369j920p76K572N744K373n12n927m956O370N023l094m787n171l79
401e662L970Q20m04l038n318L131N671P77M08j528m81K016O53N119L159p662m589
418b958L661M129K33n352l632K300k703k030N691L303l277q547j656J3645R381
433A2188o730r489k323Q769J0864k116p985n877k425O487Q068j965r747j2604
447a4885J576J7777P241j2403j5517Q87J9020J0242j1399r375L244P548L566l351
$$ y = [-5742, -10249, -1907, 2623, -312, -5316, -1775, 7546, 4575, -2299, 3637, 6346, 2030, -36, 833, 3083, -1123, -6488, -1640, -267, -6947, -5842, -2537, -3769, -5377, -4481, 2898, 4368, -4396, -2854, 7354, 9071, 5053, 219, 457, 6046, 5632, 4624, 2832, -5675, -7055, 1819, 5147, -868, -10630, -10673, 1988, 5147, -222, -2142, -2918, -346, 5398, 7771, 7259, 1332, -3624, 2746, 7769, 4675, -112, -5283, -5662, -1692, -872, -1276, -4314, -9632, -6501, -830, -53, 355, -1173, -1654, 362, 1015, 6134, 9293, 1631, -2958, 703, 4832, 5065, -287, -3919, -1619, -4322, -6352, -661, 2642, -635, -9182, -10838, 2807, 12188, 5458, -4031, -6354, 2415, 13279, 11163, 3178, -2699, -5124, 1363, 9431, 7466, -2281, -14885, -13309, 4468, 11709, -694, -16211, -15324, 3696, 13938, 2539, -6836, -3592, 3956, 7522, 4171]
461D171n82R45o354k728P070K866m971q970n11R948l72q660J466Q291K001p634
477d024o318J2506J3377p363j3329j489J1653R448p150r634L13j091l95O093M613
492G210m739j6939o245K1796J9096j1147k4829o170K3721K2378r562j9863m990
505a0283P609J1800M103m240r379j4038L96K1222J1558j5814k5573k241K8119
518C239J7558j7109k0295K170J7559J0155q205o466L099n14j346L989M444j575
532F703j1456o027J0576P331p223q981R93R115P00r875K524J2809J068j1252p527
547a0522J1689J7396o597j7639j574J0326P489m876p700m30k722l998Q422R423
561H687n666j5913o094J8190J8277q754j8792k798J4485J3499m344j2006k627
$$ y = [4171, 3589, 4534, -1820, -4548, 2522, 5388, 417, -8553, -9064, 884, 512, -8148, -6682, 1609, 3610, -4024, -10342, 2164, 15541, 8178, -5151, -6640, 5013, 14461, 7311, -2323, -2010, -3101, -3496, 2597, 7210, 2471, -14468, -20713, 1083, 20179, 9032, -15797, -21967, 1754, 24132, 14570, -5293, -10283, -2674, 9126, 13229, 8989, -390, -14428, -14032, 7190, 18748, 2934, -22639, -24880, 3239, 20797, 3688, -16607, -14437, 3122, 13277, 5072, -1394, 1705, 1191, -155, 3834, 8278, 6703, -4753, -10780, -204, 7127, -96, -9077, -8084, 1031, 1731, -8144, -5620, 7189, 8257, -2995, -10522, 1167, 18563, 11966, -5673, -7247, 3079, 10568, 5692, -2008, -2438, -5160, -9158, -736, 8687, 3021, -12892, -18986, -796, 17481, 8727, -10065, -12863, 1622, 15121, 10777, -1229, -3856]
574c856K635L310L311j025l683p391n167Q921J0236m548j2610m415J2874J1776
588A0368q428r214O058Q515j390q187J935J1141k902j2552j14Q689K594p261o370
603g118N129J835o897J651R106M44r313o804J0425J5391l442j3902m770P323J3707
618A2765O15j3081p716K188P288M836n644o340k834j818P390R911l743j2233n757
633a4173J2310J6770n201j6493n52J1193O608m163p503J324N26l581L802L007
647C874n449n631q2O699L357o347j538M051J422R21Q04J75R90j088Q22K188l230
664A938j150K411j988k770l68K28R14k595o27L003k321k272N577L523k475m634
680c606K019Q319O47p013k51K445J16n46o76n96k983m164M565M295n552m232J890
$$ y = [-3856, -1221, 2089, 5400, 4375, 692, -6699, -11866, -2945, 7291, 2743, -9867, -14282, -1408, 10368, 1940, -7274, -1216, 7299, 5909, -2278, -343, 10798, 7896, -4656, -4770, 3919, 6513, -748, -7118, -1989, -154, -7051, -5400, 3706, 4150, -5163, -11967, -1542, 13849, 10407, -3495, -8265, -942, 12765, 13380, 299, -7417, -5229, 2059, 6895, 1251, -5089, -7923, -9741, -2351, 7560, 3817, -8416, -14173, -1863, 14907, 9706, -6787, -7339, 3854, 10462, 6299, -1204, 120, 646, -2935, 867, 3874, -1575, -7206, -7288, -589, 2768, -3579, -5117, -1066, 356, 1277, 2081, 2256, 3246, 2158, 2980, 5168, 1938, 788, 3199, 1211, -1559, -1927, -1699, -785, -3380, -4007, -1004, -3325, -5597, -20, 3503, 1028, -3606, -1587, 6732, 7379, 366, 115, 2560, 2676, 2130, 1454, 858, -2125, -6289, -1724, 2571, -2981, -7213, -5323]
697e323M933K094l467j79L724n02O90K328r74j220k73J229P05m119j254L463k060
714b05m163M92K526J089l530j676M499J808j894J554J432ppM98K812j508m520
731h00K013K621k806k473r09Q25O1k919J303J900k981O54L444P16n08r97K262
748A406L475k647j632L139l77j845j034q4J567l312k943L062L58k558L47j44J375
765a847O87n35K697L12k012L584J912k079j018k18K029Q4m283m40K102k467j235
782b727M33j99M15j513N20L272j693p76L783O44l40j31J76K443j619k319K164
799B533o01k229l72p83J60p88j942J900N97k558J863J930K81J53o96K441K594
816D483k528K95J061j402J65l77q26m08k625O2K198k286j646J083L33Q71p4P29
$$ y = [-5323, -390, 1704, -1763, -1942, 1782, 1280, 1970, 4298, 3324, 2104, 1831, 3060, 3765, -354, -1608, 1855, -205, -4368, -3876, -1350, -261, -3791, -5467, -968, 840, -1054, 500, 1932, 1925, 1918, 2416, 5228, 3720, -800, 1213, 3834, 1028, -1445, -2354, -1529, -1468, -4387, -3084, -1184, -4165, -3511, -67, 649, 141, -856, 1406, 4881, 2234, 602, 3741, 3364, 1519, 485, 401, 1968, -1344, -4287, -1225, -867, -3425, -3078, -3222, -1847, -1160, -1695, 1002, 1314, -698, 2886, 4798, 2719, 1701, 1483, 3512, 3596, -687, -1127, 975, -1492, -2727, -2294, -2493, -2078, -3591, -3071, 201, -1492, -2268, 1515, 2159, 1819, 1688, 1864, 4307, 2688, 369, 2533, 1932, -297, -669, -1452, -1292, -2080, -4022, -2122, -1525, -4083, -2220, -290, -9, 144, -552, 1889, 4483, 1955, 2250, 3311, 1909, 2074, 1697, 871, 463, -2162, -2100, 98, -2188, -3834, -2751, -2418, -1547, -1621, -892]
834h92K453j509o11L805J165j707j224k78K057n46k814O43o60k664N78O14j71
851a761q67k113K343K306j442J115J738q24N50O12J893J175l700p95K237j048
867A419p24p49j283n78k141J158L458k209l084J559K084K656K49k043J137K25
883A134Q33L343j104l753l56P84J555j021l603O50l81k141K289J643k099j773
899d000N40M515K161m289K18M363o62j312J96J638Q59m423j927L724m45k775p85
916b404j47M89j172o43L932O17l557Q81J878K544K163k380k365L28K376L863k429
933C974o694K93K956Q38j613k546J60m41k442M761M922m611n622K121Q669L553
949H278p681l941N967K188k448j283R07J22m791j491N728Q09n878k577J862M352
$$ y = [-892, 1561, 52, -559, 3246, 4411, 2704, 1480, 1202, 3259, 2713, -101, 542, -118, -2782, -2204, -1590, -1761, -2628, -4741, -2398, -92, -1534, -419, 1319, 495, 1045, 1657, 3550, 4725, 1025, 230, 2467, 1419, 695, -54, -1337, -1915, -4056, -2898, 560, -1649, -4733, -3174, -1090, 1566, 1815, -228, 909, 1134, 1967, 5310, 4206, 453, 97, 881, 2436, 1415, -2188, -1538, -1919, -4060, -1771, -128, -2227, -4000, -3460, 1055, 3216, -1073, -855, 3508, 2846, 1534, 1730, 3368, 4227, -196, -2123, 1601, 1156, -1619, -2404, -2551, -2062, -3234, -3877, 55, 672, -2885, -2004, -126, 2418, 4581, 2201, -164, 164, 2540, 6403, 3974, -2720, -2427, 529, 1367, -246, -2792, -2632, -3073, -5515, -754, 4168, -443, -6065, -3944, 4725, 8278, 597, -3344, 2623, 4811, 2363, 1080, 1987, 2109, -2682, -4173, 1555, 2364, -3514, -6091, -4229, 123]
965A23Q24k888l95J607J139K504q33j152K134M34k461j246J710L232l345p256
981e869K380O389k264n558l20N360N86o094K301Q889k249q454J118R736M478r280
997A149o671P062N003m319l766M82J212k644j789M571Q67n159j727L102M110J753
1013C236l577j857J846K963L233k528n277K907L720k752l803L26M033j714p888
1028g132K350Q121k386p010p6P779K678p629q81R627N81q009o65P256L176p322
1044D58n143N856K900n082j879J745Q3k198j157M365J497m564l41L129J544K083
1060C296n85k295j044J800M923l43q257j177O336L75m383k616K683J440m945L20
1076d472P278j609o729J391P387K764o838k658P737J831o184n67L792M95m766
$$ y = [123, 947, -1941, -2336, -729, 410, 2914, 2081, 929, 3063, 3497, 1036, -210, 1500, 4732, 1387, -5869, -3489, 2900, 636, -4922, -5242, 118, 704, -5390, -3089, 5800, 3551, -4903, -3785, 5951, 10429, 1149, -5522, 1540, 6543, 2224, -1542, -1060, 152, -2492, -4281, 290, 1157, -4002, -5729, -2627, 1483, 3236, -341, -2198, -352, 2611, 5844, 3316, -1961, 946, 4666, 1914, -1889, -1563, 2470, 756, -7132, -4782, 3339, 953, -6057, -6133, 1646, 4324, -3305, -4186, 5441, 6022, -1987, -2652, 4604, 7780, 458, -4685, 1171, 4071, -1011, -2890, -1145, -1062, -3260, -4417, -52, 1445, -3119, -3460, -331, 1213, 3296, 2711, 416, -628, 1172, 6095, 5752, -2505, -3682, 2654, 3029, -1354, -3970, -1287, 153, -4792, -4472, 2806, 1197, -5532, -4141, 3246, 6010, -828, -3486, 4251, 6082, -102, -669, 3123, 3618, -1148]
1091a148k347M870N81o030ML770q96k012R23K877M4l281L018L741k939j407L186
1108B954J043k638k354L345K246o256k562M742Q97m347j653L495J942m405r60
1123d511O990O39n868N78N489K124m682k238N255P87n408K21L221j954m076Q1
1139c352M241o57n791J838M972j837k786K551L221q19l142K907L939l689k612
1154a016L511J063k940k942K239K723m956k673N095P26m413o80L741K460l758
1169a820j397O066R89m808Q48M094j24l571j236M354k46o203P24M145k159l662
1185d006M29L644r4m502K160N140k585k286K973K854r97l103J529L990l711l246
1201a811L514N51l289k055J984K216l530k688M628J092l649P70L282R13k049j263
$$ y = [-1148, -3495, 1375, 1956, -4074, -4070, -300, -1196, -3208, -2285, 592, 636, -2645, 373, 4114, 1175, -232, 2954, 3997, 1359, -995, 2350, 4596, -1660, -4222, 520, 1417, -2930, -4583, -1088, 854, -3551, -4511, 2479, 3118, -2750, -2172, 3317, 5441, 759, -1479, 3776, 4563, -845, -624, 2597, 643, -3433, -3352, 889, 232, -5559, -3721, 1251, -586, -3372, -821, 2400, 1581, -1561, 1346, 5285, 1596, -1016, 2495, 3558, 618, -2324, -85, 2638, -2318, -4991, 104, 830, -3583, -4263, -522, 1938, -1820, -3217, 2849, 3838, -970, -122, 3972, 3848, 277, -959, 3395, 3149, -3054, -2330, 1815, -344, -4006, -3577, 67, -27, -4529, -2369, 2771, 186, -2100, 873, 3727, 2730, -373, 1156, 5146, 1435, -1811, 1703, 2254, -1035, -3090, -1106, 1110, -2420, -5108, -480, 612, -3037, -2267, 1015, 1928, -121, -1384]
1217a384N026O53m784O51L617j232l087r07L215k02n389P64L822k180k410J444
1233b383K751ml040K021M230k187k633L173K054j900k104R79K558l107l066K830
1249A72Q35l340r21J986J175k011j830L736J723l018N33L273K28j693m20K544
1265B972P23m106J33L022j977k633N6J994n75l349P30L612j544j936K064K042
1281A228k00j573J145L350j704k370K196Q91j644j535j4J419j892k476K304Q41
1297c4k976J73J776P24o41q47K640J266k470J069J977m97r33l87J125K90l350
1314a095J84K201j983k016O32J095O7j682J70L101p54j342K233R16l55p30M09
1331A051K340j247k307J179M49j805n14M3J5p49j482J868O78j941Q01J707J9J89
$$ y = [-1384, 3642, 4295, -489, 162, 3779, 2547, -540, -1447, 1768, 1566, -3823, -3059, 763, -1417, -3827, -2383, 368, 364, -2676, -655, 3575, 1388, -1245, 1928, 3982, 2082, -22, 957, 3515, 408, -2658, 172, 1007, -2333, -3254, -1268, -93, -2104, -3934, -198, 1525, -1493, -960, 2313, 2541, 848, 428, 2972, 3695, -411, -278, 2744, 767, -1866, -1810, 184, -391, -3740, -3010, 602, -942, -2878, -814, 1228, 1028, -545, 600, 3950, 2246, -124, 2072, 2963, 1319, -216, -230, 1189, -703, -3179, -875, -34, -3010, -2837, -1061, -337, -978, -1825, 815, 2081, -389, 680, 2657, 2160, 1227, 840, 1965, 2255, -1095, -911, 1290, -693, -2709, -2077, -982, -915, -2597, -2427, 674, -80, -1422, 811, 1727, 1372, 642, 1051, 3391, 2144, -163, 1016, 1465, -340, -854, -811, -796, -1545, -3027, -1159, -481, -2422, -1621, 86, 105, 294]
1349B94k67J815J042k423L20K387j506j206m14K79M62k094p55J772q68j680J156
1366a686N95O29n12l24K240K58r81J838P9j079L56K12K76p17j940P04O77k177
1384a552k32O09n28lq73J816J682k087k48K424R20n87n76O04J461j617j115J401
1402A499n74j317l82m54N91n41j244R15J10l64J376K15k58P33M00Q77J58r51J625
1421B414k7k202L70O87j84j655j787J553J228k543p35J870P12q20q04K019K214
1438B310k148r42K567J108m73j601n59J959q31j885M37m58o60l5p94N64M32q48
1456a857N87L81J42J996l08j375J296J295J06j009j303K209K23l222m53J962l81
1473B89j671j648J504K379k688j420K586J394n39j091J034K903j113k175J712
$$ y = [294, 27, 1842, 2884, 461, 781, 3168, 1662, 456, 42, 321, 783, -1311, -2066, -294, -1162, -2842, -1686, -1091, -462, -974, -1298, 942, 1200, 219, 2057, 2136, 1057, 1413, 1625, 1901, 1184, -756, -52, 625, -1552, -1784, -1175, -1703, -1706, -2579, -763, 919, -1168, -1416, 1008, 1928, 1341, 765, 1369, 2830, 1213, 98, 1499, 925, -392, -774, -1228, -637, -1178, -2422, -1507, -1397, -1761, -385, -170, -428, 305, 705, 1582, 1740, 789, 2414, 2387, 185, 555, 1242, 1058, -597, -2384, -831, 397, -2146, -2881, -1011, -299, -1119, -1923, 96, 2310, 162, -780, 1787, 2895, 2422, 821, 262, 2221, 1390, -495, -58, -516, -1176, -1211, -2005, -1441, -1009, -1857, -1270, -889, -747, 1249, 941, -434, 862, 2157, 2263, 1254, -49, 2160, 2383, -839, -1292, 670, 289, -1382, -3030, -1526, 853, -1835, -3255, -669, 725, 186, -905, 129, 3032, 1919, -256, 1456]
1488A456J109o48j527j154J121K47j828N4l13m89R59m52l34J018M38J02L88q2
1506F5J863L42k248L34J989L49j876j883J518J512k871j796K079N81j630j279
1522b951J473K447j291j760K167J858q45q23K86J938m31j988Q96O30j320m58o21
1539g93RJ03q53K49o5o54J302O18r21M67J164Q29m15q78J798R35k261q54J632
1558A412M86k080j690J025J687k171k320K628Q22j002j010J324K386j022j566
1573a091K200J428j514m09N18J089j053j898J234J93k015o6M87j66n40j65J076
1590f92N45j517J069J573q02NJ144P43j24j613M85J756k333j114R63K89j241j327
1608b191N22J920j531j553K302R24j213j82J532J714j035j559K289Q58k346j77
$$ y = [1456, 2565, 1917, 390, -764, 357, 604, -1224, -1170, -1483, -1972, -1013, -1465, -1799, -781, -343, -241, 147, 65, 1928, 2270, 22, 356, 2345, 2694, 818, -1065, 453, 1965, -906, -2702, -623, -42, -1672, -2951, -1478, 969, -322, -2082, 85, 1943, 1098, 275, 561, 2499, 2068, 80, 976, 1606, 286, -172, -793, -784, -681, -1534, -1285, -1350, -2004, -702, -84, -1005, -538, 626, 1455, 1040, 162, 1960, 2895, 634, -220, 1412, 1898, -182, -1872, -847, 840, -1331, -3651, -1023, -201, -1203, -2213, -889, 1497, 475, -1091, 1109, 2537, 1023, 614, 1132, 2221, 1168, -730, 504, 697, -1318, -1384, -897, -1063, -1603, -1768, -692, -147, -1664, -595, 978, 176, 181, 1325, 2068, 1944, 331, 816, 2572, 239, -875, 88, 377, -864, -2191, -1669, 251, -1280, -2833, -531, 393, -820, -1002, 530, 2244, 1209, -350, 1939, 2797, 451, 274]
1624B74R12o3j147j557J124M45j981j08J654m27p69J93J676P81j416K14K549p56
1642A598j203J144L84l15j803L63J395j646k079J720M91j441r93Q32J730j257
1658a080j188K405J664j712l69J734Q99j231j260J728P63k668n36J500l68j775
1674a494m70Q44J038j935k41K513m76j122J180J313M46j457L18J940r21j369J049
1691A156N72j243j266J9J268j368j855J552J248j512n81J285J408l79j473K368
1707A199J149j831k28J424K44j187j263J141R69k765n97J742n58j037o47J411
1723h34N97j353J42K302R0j486J076J273M2j163j79J760r34k316J061P73j228
1740c77r83O8J157q26j912J814J641j678J12J102J318m99j273J754J367k083n79
$$ y = [274, 1186, 1123, -24, -1581, -457, -12, -1993, -2101, -447, -874, -1643, -1450, 226, 1007, -409, -195, 2354, 1598, 395, 1539, 1923, 1608, -195, 168, 1563, -83, -2162, -442, 49, -1392, -2385, -1553, 177, -1080, -2268, 137, 1801, 89, -280, 1454, 2353, 1122, -138, 1590, 2353, -315, -851, 649, 281, -1494, -1964, -1120, -82, -2017, -2258, 255, -221, -1343, -163, 1150, 1596, 139, 457, 2397, 1476, 107, 1156, 1728, 485, -781, -762, 506, -862, -2717, -1165, 83, -1429, -2010, -725, 683, 304, -1169, 1199, 2348, 517, 289, 1713, 1957, 770, -493, 648, 1617, -1148, -1745, -3, -561, -1598, -2245, -834, -237, -1590, -1448, 854, 944, -542, 534, 1807, 1849, 686, 507, 2267, 1333, -983, 78, 851, -377, -1360, -1292, -135, -961, -2873, -1059, 582, -1096, -984, 118, 1436, 937, -336, 1418, 2785, 702, 123]
1757A23J689n42j333r07M92R21j866j084K053j53r44j5J175R71j185k1K232q7
1775A519j501R83N73l08q07n22J353o79j826M45P80j251o54Q91O43n29j074J577
1793c87J217j127j3J688M30p02q08R12J029k101q73J644k50j826j29L30Q26j375
1811a515p76J958O04j312N38J004M07k57m31J447J70j532M32Q42p74q83l86M64
1829@m58j474Q19Q09j207l37J188O83k13m57P98J498j030k74J186M3n71r15L57
1848D45P29j228j244J105l02q73n0M45L56n19Q7Q99M16o13Q20O96m6j02l55R91
1868A657l21j499L96O46j174o66l9N55j69j404P79J497j157j30R70Q02J71o82
1886B32L75J397q50o80O34k16o52l4n83M37n26j290R71l05n05P05R3K30K89N8
$$ y = [123, 1812, 1270, -63, -970, -478, 443, -1423, -2507, -454, -607, -1551, -1566, -391, 580, -605, -626, 1606, 1519, 18, 1001, 1574, 1266, 459, -63, 1290, 611, -1215, -770, 10, -1241, -1895, -1004, -361, -890, -1964, -387, 830, -297, -310, 1378, 1808, 1106, 298, 1210, 2239, 138, -735, 909, 659, -1167, -1296, -966, -140, -1515, -2291, -333, 271, -1041, -503, 501, 908, 651, 220, 1667, 1837, 305, 737, 1579, 805, -78, -464, 0, -458, -1932, -1113, -304, -1511, -1848, -660, 23, -190, -647, 151, 1649, 619, 345, 1531, 1574, 1003, 88, 445, 1174, -54, -1298, -193, -495, -1368, -1418, -973, -617, -1136, -1049, -150, 266, -347, 473, 1169, 1123, 1021, 666, 1657, 1336, -163, 233, 879, -295, -961, -1000, -445, -614, -2018, -1239, 258, -899, -1029, -59, 743, 914, 232, 607, 2004, 1154, 474, 1108, 892, 240, 206, -377, 60, -466, -1756, -785, -1090, -1595, -890, -797, -567, -278, -220]
1906b20J002K79j011Q91R14p90l18l13N93j65j855L47Q94j022q60K58P64J86q13
1925a239QJ682k69m26Q72K86M58m93m31J108k67j052J46l29n17L69o76l97M54
1944g13n38O03k33k57R93M43n11M96M11N80q0j029P23O61r09q60O3N45j72j527
1964a311l50J344m49o86K25O81O22p60r1J417L47n27L12M88J38k81q72L90kr99
1984c64n3l18m16L99j08m13K43k24J001J17o29Q16Q68l62J17M50M13j01j500L51
2004B87Q23r40r58J27N7K45r54l15J304Lq35O62N60N31p2n15J182K38r93P29j13
2025A053n68J36p34n1K38j062L32l4p63M81N79m43K93K63N51N43q62O13J029n84
2045A010m38K02J28J23j380l80J130n94j317O17K81p7l24j25J013K89o44P49M13
$$ y = [-220, 782, 1061, 50, 941, 1855, 1065, 747, 434, 1027, 862, -993, -646, 248, -774, -1634, -1376, -612, -426, -1239, -1231, 451, 182, -244, 628, 914, 1372, 879, 448, 1556, 1289, 237, 383, 54, -463, -94, -770, -1167, -713, -1251, -648, -881, -1138, -145, 298, -213, 283, 694, 1274, 1194, 165, 888, 1549, 640, -220, -157, 388, 216, -1311, -1661, -317, -766, -1452, -1227, -546, 76, -684, -775, 642, 989, 462, 774, 1262, 1400, 1119, 247, 637, 635, -364, -417, -735, -1151, -752, -860, -1273, -1030, -1254, -253, -136, -765, 51, 919, 557, 674, 1124, 1537, 1436, -64, 287, 1110, 170, -788, -661, -604, -359, -1313, -1628, -324, -321, -1156, -494, 66, 597, 525, 10, 1192, 1430, 437, 1166, 1053, 485, 621, -113, -164, 74, -988, -656, -690, -1453, -972, -393, -836, -543, -280, 271, 814, -48, 565, 1594, 1010, 572, 774, 902, 1025, -355, -735, 395, -199, -1516, -899, -618, -695, -1019, -1144, -131, 158, -486, 263, 676]
2064F76P8J17n1K93J76j020L10K31j220M6J02n01R4o69N33O01j115L07J121K6
2084A35k95O22J78P26o75j85J053o72r50L44J86l08q48p56J345m31r89P03M17
2103d00k81K57j35J111J31q62Q75N78j76m38M0K26p49n06M49j79r71j13N09k43
2123h77l04K04M24Q09r08L79J413k64o20M09O29J45r86l58R57m82j417M15L14
2142a18k95q19j86J145j5j019Q33O11k32J46K25N52L88r49N62N82j207L99j06
2161D97l01l55q29K76N65j107j83J068l44l67N39M77R23n17k66J513k67j075N97
2180H44J26o5o66p04R24n34j097L23L84l71k65j9Q41M97r77O69J090o23j45P80
2200A012j7J08p32j66Q29j079l92K77j7n06l22N8P15q09m02J457J1j17J53L84
$$ y = [676, 754, 871, 820, 1113, 1289, 269, 579, 810, -410, -364, -262, -763, -669, -1338, -805, -204, -1319, -1012, 109, 135, -160, 462, 640, 1366, 691, 506, 1559, 887, -63, 281, 467, 159, -689, -1445, -100, -531, -1520, -817, -400, -681, -424, -559, 552, 683, -179, 696, 1274, 1098, 660, 700, 926, 177, -329, 120, -59, -1030, -1143, -634, -877, -1181, -977, -553, 256, -652, -273, 1140, 876, 256, 665, 1294, 1439, 453, 95, 1052, 570, -847, -432, -118, -413, -1232, -1418, -273, -288, -1307, -474, 137, -95, 51, 276, 828, 1216, 267, 829, 1411, 204, 603, 497, 196, -159, -988, -712, -147, -1254, -1437, -369, -713, -1080, -541, -64, 859, 342, 76, 1589, 1322, 247, 844, 970, 905, 239, -465, 459, -75, -1172, -849, -465, -836, -1101, -1120, -279, 218, -759, -90, 1000, 377, 232, 1012, 995, 1103, 371, 205, 1034, -45, -437, -160, -177, -683, -1005, -947, -232, -1041, -1443, 14, 25, -92, 61, 445]
2220D45O32k87p28J157j19r81K04J31j74p20l94M97P4j331M62R99o79J15L84Q00
2240D87j9q05P50J102r25j97N18J49k65p39k61P13j102n88P20o2l65k23K84P04
2260a24k61l70J136L52o78N37O09o1k58n52O91l12j110J08K25m78l16m4L99n3
2280e60r22N27J176k88l65N98P34J94r77N14Q17n93p46N56k22m37m42j56L72m75
2300f95p20P70L12o83P98j07P71l06o3R25J3p63N64L69m39n88l35M36K03j505
2320a043J92O43o99m06L30M83M83o77N9J391l58j97M56L58M1o57j24O48m84r83
2340e44N04j51l70l42j0K14P8m52O51M62q01O03N43P2J8k52P23R9r96M67L40o78
2362A78p45J33J55K82j172nQ06l67j30K83O08L52j63k09R29N3l40K41l69K1m8
$$ y = [445, 1077, 790, 62, 1219, 1100, 119, 323, 454, 280, -440, -834, -337, -263, -1594, -1132, -133, -812, -697, -313, 487, 468, -337, 413, 1515, 590, 393, 911, 1060, 795, 56, -205, 508, -594, -1182, -462, -524, -889, -1112, -828, -124, -385, -755, 381, 733, 55, 592, 1201, 1140, 882, 330, 1021, 709, -401, -293, -68, -546, -862, -906, -507, -560, -1482, -955, 221, -67, -432, 166, 900, 1094, 117, 631, 1448, 855, 109, 665, 443, 6, -436, -592, -220, -695, -1415, -645, -333, -1016, -218, -325, 446, 140, 77, 1002, 1015, 252, 816, 1185, 746, 158, -177, 259, 462, -1043, -851, -208, -907, -1313, -983, -500, -17, -694, -635, 756, 398, 201, 657, 1015, 1056, 399, 275, 923, 439, -544, -40, -191, -561, -903, -913, -699, -621, -1073, -422, 40, -761, -158, 385, 457, 475, 223, 946, 1045, 49, 516, 856, 178, -567, -434, -279, 3, -1169, -1174, -368, -735, -865, -582, 26, 378, 215, 6, 935, 988, 648, 889, 520, 541, 493]
2383D93m73N3j82o15L42j04o41M23L2J82J08k28R18J09m72M05N28p8l0l32L27
2404G65Q1j117r6Q54o81n22j10J14P37p44m64Q75K43j20N82k26N21j03l25N88
2424H52n4n14L55k62m07K35o49n3k9o06N21K67p88L57N82J72P3j40Q78L7l59n4
2446D14O47k75l48k60o3N24r26m66L57k27p4l2J30L06k7k22N94K74l79P83j21
2467F09oK36k10j49K04o66J31k60m84O0J36l44J83o43O56N45n91J95Q25k5K22
2488F24l67L65N37p74m9L41l29k37l94k69K68k75m59O32K2l75L01j4M90N1K6L61
2510D76L38o24N32M34q33K87l59p2j10n16j06K79m54K8K20J9J46l61M51P10l82
2531A03J1N40L4P6k1l02M39l11q93M58q4m83Lj04J53m2l34K39K55l01N28K90O5
$$ y = [493, 20, 73, -109, -724, -382, -486, -1127, -704, -672, -490, -382, -610, 308, 417, -55, 350, 878, 800, 770, 438, 765, 846, -271, -367, 487, -194, -716, -826, -712, 25, -719, -1183, -308, -65, -185, 397, 171, 692, 589, 264, 852, 798, 284, 639, 377, -30, 205, -444, -497, -526, -1132, -611, -344, -1132, -775, -193, -21, 52, -88, 790, 827, 468, 414, 1061, 786, 438, 178, 115, 639, -287, -753, -396, -623, -697, -729, -599, -293, -320, -542, 52, 326, -53, 730, 609, 603, 839, 629, 480, 684, 18, 149, -111, -595, -535, -399, -743, -560, -1203, -547, -2, -593, -398, 427, 402, 624, 257, 622, 1159, 385, 336, 677, 348, 111, -283, -552, -284, -559, -1018, -386, -364, -739, -438, -452, 38, 89, 115, 476, 814, 190, 722, 1156, 323, 610, 251, 179, 69, -447, -553, -274, -728, -700, -480, -461, -315, -676, -225, 485, 103, 114, 654, 688, 764, 743, 441, 880, 569, -324, 134, 50, -433, -430, -534, -381, -423, -757, -518, -263, -564, -36, 254, 319]
2554C19K82r3P6M24p01J8N07n58k06j42j48j81k44P6K90n54o3N89J22K53j51L5
2576e0P87l68L8K82j59j30lk03J82l25m83J31J19n72P6N9J6K17l04N05M70n43
2598b58L15O83m72L22j66K75o7m78O0M9n76k75L39k14J56o92K57M50Q4k08N35
2619A19j23M49qK61K31K8q27Q02l41n03J0k85n3k33l58M01k4l16L20K95j88L66
2641B3R4K17K58n09L67N38m33l96K65j10M9o25j86O62n93l93K46J78k61J32l3
2662e10N99L1l17N99Qk20K86J1K28k64m23K14l4n97n1J89k26j17p6K6L79m43L16
2685c92N87j56O8L44P6K69n58J80L90l78l86O9k24k76k43Q2M35n63q5K79K42J17
2707a23m0J98O03lm45M29l7l96K68J5j29m39m18N48j89n48l8L33j32j05K9O22
$$ y = [319, 601, 508, 584, 1008, 307, 325, 832, 274, 68, -74, -222, -403, -647, -571, -281, -835, -898, -309, -187, 66, -85, -50, 737, 369, 407, 689, 530, 400, 397, 194, 376, 51, -432, -301, -182, -754, -678, -619, -603, -386, -690, -185, 285, -258, 57, 740, 268, 590, 424, 699, 632, 154, 214, 263, -313, -588, -249, -463, -307, -999, -742, -292, -208, -416, 119, -4, 445, 437, 698, 929, 957, 130, 932, 591, 88, 98, -187, -240, -473, -831, -430, -454, -770, -450, -155, -343, 23, 117, 334, 592, 83, 450, 988, 555, 159, 424, 314, 363, -262, -448, 214, -379, -772, -526, -348, -609, -477, -510, 89, 120, -197, 402, 410, 190, 476, 487, 715, 451, 28, 242, 208, -389, -440, -251, -477, -594, -670, -644, -265, -708, -392, 195, 39, 107, 451, 527, 796, 238, 418, 808, 430, 44, 113, -111, -387, -630, -548, -113, -676, -761, -482, -240, -123, -163, 35, 638, 635, 190, 619, 582, 186, 454, 469, 340, -99, -517, 31, -158, -706, -744, -411, -543, -648, -619, 3]
2729CJ80m16L12N13j26k24J85J07L31m83n86Q46o16o37J43K36k57j4k97M12j27
2750e15r0N41J83J7K0L21K09j41l61M11J47q09O2K13l34j69l66L39K03o44r9P97
2772f5k3p3k00L73M58l51N4P47l45j94Q9j19Q2n33l49O70m48k77J7J38q9l28N56
2795b10K18r6j55O35J81m28J64K18J71l58k80J92N5m00l29J99N4l40k59N22k3
2816b69l55J92L48J78J49o2J85K57k54j57L97o6n08M8k40k0k46k60K98O4k34J60
2838c95L06k79O1M05O4K45k84K52N76o47j3K59r7l43l84L4N34p37j41L21j67j10
2860e40L33p5J91k0j14O25Oj04R5N7j9L7l90K62r2n11L21j67n60K52j03O9L4k05
2884f18M27L33k70K26L13J53q3k46K13K06m02j30J66k30k70l46P3K97m83L4N72
$$ y = [3, 183, -233, 79, 592, 466, 242, 427, 534, 865, 382, -204, 642, 26, -611, -468, -232, -489, -503, -800, -388, -515, -605, -64, 119, 136, 156, 477, 686, 545, 184, 595, 742, -67, -5, 208, -126, -295, -661, -322, -119, -763, -862, -65, -88, -161, -361, 12, 470, 119, 173, 920, 575, 381, 470, 351, 433, -100, -449, 221, -227, -504, -487, -349, -438, -766, -210, 8, -88, -243, 392, 573, 145, 309, 527, 698, 340, 60, 252, 307, -93, -422, -223, -169, -509, -768, -246, -269, -624, -432, -84, 94, 243, 181, 366, 623, 369, 212, 609, 543, 35, 83, -157, -177, -423, -683, -385, -321, -555, -395, -89, -368, -307, 98, 162, 407, 123, 375, 951, 304, 291, 550, 453, 110, -274, -240, 294, -443, -584, -263, -430, -540, -207, -282, -91, -111, -225, 400, 406, 302, 397, 454, 435, 472, 82, 344, 252, -259, 62, -105, -665, -413, -516, -447, -413, -618, -191, 142, -128, 98, 411, 564, 481, 235, 448, 654, 252, 122, 288, 58, -212, -558, -485, -188, -671, -637, -65]
2905f5j07j28L57r7L28k9o3K39K75n35J08J16k96m1n2r2p9m35J91K01l24R8M8
2928c82K02R0j64K17P16o40M7L98J20j79p2j27J88k14m69J13o6k84o5n7L80l3
2950b81k83L01L84j21K08L10p3m1j41K47J22p55M93q2k99n3l81K50j95n9pL62
2972i4k22n8L41P7Q5Q4n0M11J5k95K87j98k42k78n7J85l35l60M01O6m30K93m1
2995d15J30N08k18K83l0k9J81m8J78M7m03M1L61p08J19lm59K76j60J53k79n4K05
3018c24N30k15k7N9J00L50j60k2M50k78m58L30j65j61Lk75N1K3m97L81j6l00K97
3041c24J80J67j5J79L10k5m76K43J78j36j81q3l26K93p4l88K53k40o2K30k33N30
$$ y = [-65, -172, -300, 57, -40, 288, 259, 196, 435, 710, 175, 283, 399, 103, 62, 10, -82, -161, -596, -405, -204, -528, -430, -382, -180, -90, -254, -37, 679, 39, 86, 484, 604, 425, 353, 226, 414, 200, -269, -156, -222, -506, -571, -628, -248, -281, -564, -263, 121, 0, 208, 518, 445, 404, 263, 510, 632, -123, 370, 288, -11, -64, -445, -195, -390, -449, -456, -94, -316, -374, -33, 44, 129, 213, 163, 574, 589, 294, 581, 383, 141, -137, -194, -9, -344, -704, -303, -237, -667, -374, -415, -285, 223, 5, 288, 258, 229, 410, 362, 540, 587, 184, 225, 586, -122, -3, -6, -465, -189, -349, -196, -475, -529, -324, 206, -9, -36, 23, 123, 473, 313, 291, 741, 463, 5, 335, 170, 9, 12, -263, -212, -189, -686, -305, -321, -621, -324, -144, 23, 8, 187, 497, 472, -4, 239, 417, 281, 100, 17, -309, -16, -90, -478, -225, -465, -527, -297, -530, 0]
$$ [...]
8191h5
##END NTUPLES=NMR FID
##END=
