##TITLE=1H_Pr 53-25
 CDCl3
 8 sc, 
 24.10.2022
##JCAMPDX= 6.0         $$ Bruker NMR JCAMP-DX V2.0
##DATA TYPE= NMR FID
##DATA CLASS= NTUPLES
##ORIGIN= UXNMR, Bruker Analytische Messtechnik GmbH
##OWNER= root
$$ XWIN-NMR		Version 3.5
$$ Mon Oct 24 15:47:16 2022 Russian Standard Time (UT+4h)  she@DPX200
##.OBSERVE FREQUENCY= 200.1313499994
##.OBSERVE NUCLEUS= ^1H
##.DELAY= (6, 6)
##.ACQUISITION MODE= SIMULTANEOUS
##.ACQUISITION SCHEME= undefined
##.AVERAGES= 8
##.DIGITISER RES= 18
##SPECTROMETER/DATA SYSTEM= spect
##.PULSE SEQUENCE= zg30
##.SOLVENT NAME= CDCl3
##.SHIFT REFERENCE= (INTERNAL, CDCl3, 0, 15.7039)
##AUDIT TRAIL= $$ (NUMBER, WHEN, WHO, WHERE, WHAT)
$$ ##TITLE= Audit trail, XWIN-NMR		Version 3.5
$$ ##JCAMPDX= 5.01
$$ ##ORIGIN= Bruker BioSpin GmbH
$$ ##OWNER= she
$$ F:/spectra/data/she/nmr/H-F/1/audita.txt
$$ ##AUDIT TRAIL=  $$ (NUMBER, WHEN, WHO, WHERE, WHAT)
(   1,<2022-10-24 15:46:21.46 +0400>,<she>,<DPX200>,
      <created by zg, POWCHK disabled, PULCHK disabled
       configuration hash MD5:
       00 E9 B6 7A A2 85 ED C7 34 08 36 98 17 FE 4E 26
       data hash MD5: 16K
       66 2F EF D7 CE BB BC 5C AF 72 5E 70 9C C9 7A FF>)
$$ ##END=
$$ 
$$ hash MD5
$$ 4A B0 96 22 4A F1 22 EF D9 DF 54 29 FB BE 83 7F
##$RELAX= 
##$RELAX= 
##$RELAX= 
##$RELAX= 
##$RELAX= 
##$RELAX= 
$$ Bruker specific parameters
$$ --------------------------
##$DU= <F:/spectra>
##$EXPNO= 1
##$NAME= <H-F>
##$PROCNO= 1
##$TYPE= <nmr>
##$USER= <she>
##$AMP= (0..31)
100 100 100 100 100 100 100 100 100 100 100 100 100 100 100 100 100 100 
100 100 100 100 100 100 100 100 100 100 100 100 100 100 
##$AQSEQ= 0
##$AQ_mod= 1
##$AUNM= <au_zg>
##$AUTOPOS= <>
##$BF1= 200.13
##$BF2= 200.13
##$BF3= 200.13
##$BF4= 200.13
##$BF5= 200.13
##$BF6= 200.13
##$BF7= 200.13
##$BF8= 200.13
##$BYTORDA= 1
##$CFDGTYP= 0
##$CFRGTYP= 5
##$CHEMSTR= <none>
##$CNST= (0..31)
1 1 145 1 1 1 1 1 1 1 1 1 1 1 1 1 1 1 1 1 1 1 1 1 1 1 1 1 1 1 1 1 
##$CPDPRG= <>
##$CPDPRG1= <>
##$CPDPRG2= <>
##$CPDPRG3= <>
##$CPDPRG4= <mlev>
##$CPDPRG5= <mlev>
##$CPDPRG6= <mlev>
##$CPDPRG7= <mlev>
##$CPDPRG8= <mlev>
##$CPDPRGB= <>
##$CPDPRGT= <>
##$D= (0..31)
0 1.2 0 0 0 0 0 0 0 0.06 0 0.03 0 0 0 0 0.0002 0 0 0 0 0 0 0 0 0 0 0 0 
0 0 0 
##$DATE= 1666611980
##$DBL= (0..7)
120 120 120 120 120 120 120 120 
##$DBP= (0..7)
150 150 150 150 150 150 150 150 
##$DBP07= 0
##$DBPNAM0= <>
##$DBPNAM1= <>
##$DBPNAM2= <>
##$DBPNAM3= <>
##$DBPNAM4= <>
##$DBPNAM5= <>
##$DBPNAM6= <>
##$DBPNAM7= <>
##$DBPOAL= (0..7)
0.5 0.5 0.5 0.5 0.5 0.5 0.5 0.5 
##$DBPOFFS= (0..7)
0 0 0 0 0 0 0 0 
##$DE= 6
##$DECBNUC= <off>
##$DECIM= 32
##$DECNUC= <off>
##$DECSTAT= 4
##$DIGMOD= 1
##$DIGTYP= 9
##$DL= (0..7)
0 120 120 120 120 120 120 120 
##$DP= (0..7)
150 150 150 150 150 150 150 150 
##$DP07= 0
##$DPNAME0= <>
##$DPNAME1= <>
##$DPNAME2= <>
##$DPNAME3= <>
##$DPNAME4= <>
##$DPNAME5= <>
##$DPNAME6= <>
##$DPNAME7= <>
##$DPOAL= (0..7)
0.5 0.5 0.5 0.5 0.5 0.5 0.5 0.5 
##$DPOFFS= (0..7)
0 0 0 0 0 0 0 0 
##$DQDMODE= 0
##$DR= 18
##$DS= 0
##$DSLIST= <SSSSSSSSSSSSSSS>
$$ [...]
##$SUBNAM2= <"">
##$SUBNAM3= <"">
##$SUBNAM4= <"">
##$SUBNAM5= <"">
##$SUBNAM6= <"">
##$SUBNAM7= <"">
##$SUBNAM8= <"">
##$SUBNAM9= <"">
##$SW= 18.0517283424941
##$SWIBOX= (0..15)
0 0 2 0 0 0 0 0 0 0 0 0 0 0 0 0 
##$SW_h= 3612.71676300578
##$TD= 16384
##$TD0= 1
##$TE= 0
##$TE2= 300
##$TE3= 300
##$TEG= 300
##$TL= (0..7)
0 120 120 120 120 120 120 120 
##$TP= (0..7)
150 150 150 150 150 150 150 150 
##$TP07= 0
##$TPNAME0= <>
##$TPNAME1= <>
##$TPNAME2= <>
##$TPNAME3= <>
##$TPNAME4= <>
##$TPNAME5= <>
##$TPNAME6= <>
##$TPNAME7= <>
##$TPOAL= (0..7)
0.5 0.5 0.5 0.5 0.5 0.5 0.5 0.5 
##$TPOFFS= (0..7)
0 0 0 0 0 0 0 0 
##$TUNHIN= 0
##$TUNHOUT= 0
##$TUNXOUT= 0
##$USERA1= <user>
##$USERA2= <user>
##$USERA3= <user>
##$USERA4= <user>
##$USERA5= <user>
##$V9= 5
##$VALIST= <valist>
##$VCLIST= <CCCCCCCCCCCCCCC>
##$VD= 0
##$VDLIST= <DDDDDDDDDDDDDDD>
##$VPLIST= <PPPPPPPPPPPPPPP>
##$VTLIST= <TTTTTTTTTTTTTTT>
##$WBST= 1024
##$WBSW= 4
##$XGAIN= (0..3)
0 0 0 0 
##$XL= 0
##$YL= 0
##$YMAX_a= 230107
##$YMIN_a= -273063
##$ZGOPTNS= <>
##$ZL1= 120
##$ZL2= 120
##$ZL3= 120
##$ZL4= 120
##$ABSF1= 10
##$ABSF2= 0
##$ABSG= 5
##$ABSL= 3
##$ALPHA= 0
##$AQORDER= 0
##$ASSFAC= 0
##$ASSFACI= 0
##$ASSFACX= 0
##$ASSWID= 0
##$AUNMP= <proc_1d>
##$AZFE= 0.1
##$AZFW= 0.1
##$BCFW= 1
##$BC_mod= 2
##$BYTORDP= 1
##$COROFFS= 0
##$CY= 11.3945322036743
##$DATMOD= 1
##$DC= 2
##$DFILT= <>
##$DTYPP= 0
##$F1P= 2.36226072786647
##$F2P= -0.459571619588291
##$FCOR= 0.5
##$FTSIZE= 0
##$FT_mod= 4
##$GAMMA= 1
##$GB= 0.15
##$INTBC= 1
##$INTSCL= 1
##$ISEN= 128
##$LB= 0.24
##$LEV0= 0
##$LPBIN= 0
##$MAXI= 10000
##$MC2= 0
##$MEAN= 0
##$ME_mod= 0
##$MI= 1.114404
##$NCOEF= 0
##$NC_proc= 0
##$NLEV= 6
##$NOISF1= 3.799351
##$NOISF2= 2.8
##$NSP= 1
##$NTH_PI= 0
##$NZP= 0
##$OFFSET= 15.70392
##$PC= 1
##$PHC0= -18042.46
##$PHC1= 23.2007
##$PH_mod= 1
##$PKNL= yes
##$PPARMOD= 0
##$PSCAL= 0
##$PSIGN= 0
##$REVERSE= no
##$SF= 200.130013532006
##$SI= 16384
##$SIGF1= 3
##$SIGF2= 2
##$SINO= 400
##$SIOLD= 16384
##$SREGLST= <1H.CDCl3>
##$SSB= 0
##$STSI= 0
##$STSR= 0
##$SW_p= 3612.71676300578
##$SYMM= 0
##$S_DEV= 0
##$TDeff= 0
##$TDoff= 0
##$TI= <>
##$TILT= no
##$TM1= 0
##$TM2= 0
##$TOPLEV= 0
##$USERP1= <user>
##$USERP2= <user>
##$USERP3= <user>
##$USERP4= <user>
##$USERP5= <user>
##$WDW= 1
##$XDIM= 8192
##$YMAX_p= 0
##$YMIN_p= 0
$$ End of Bruker specific parameters
$$ ---------------------------------
##NTUPLES= NMR FID
##VAR_NAME=  TIME,          FID/REAL,        FID/IMAG
##SYMBOL=    X,             R,               I
##VAR_TYPE=  INDEPENDENT,   DEPENDENT,       DEPENDENT
##VAR_FORM=  AFFN,          ASDF,            ASDF
##VAR_DIM=   8192,          8192,            8192
##UNITS=     SECONDS,       ARBITRARY UNITS, ARBITRARY UNITS
##FACTOR=    0.0002768,     1,               1
##FIRST=     0,             0,               0
##LAST=      2.2672688,     0,               0
##MIN=       0,             -273063,         0
##MAX=       2.2672688,     230107,          0
$$ Real data points
##PAGE= N=1
##DATA TABLE= (X++(R..R)), XYDATA
$$ [...]
1806B93n30M54L18l72k08O05M10p99k08N96P0n96L9L93l95l25J84K43q21K32Q44
1827D27m23o61K17P33m52l77M00J83m75J40O37J16q39J86Q08k17n55M00Q17p38
1847C27n24K35P95o72o42P15k0o18L1O79m47o86K38M41k52O9k4J84m41K90N76
1868B54j46l93J26P08o55K67K42k3m99K16N72l57m65O26L35r82l54Q47J14j035
1888f02K5R94j9j070N36J85%q59N22O96r40oL98M85n07j0M09M3l36N9K20K06l87
1911D2J7J22p7j8r8K73j41j01J43n44L02K05m92l98L30O10p83Q9M96Q4l32j73
1933d44O62N0j071P17N75j56o26K04Q17n36n43O68O28o59m07L33M92q45l43L43
1953a41L15m61k99O86M1n84k01O67K37n10j83J26N21m30j03O78K0l19j99N82K66
$$ plain form
1806 293 -237 217 535 163 -45 560 970 171 -37 559 629 33 72 465 70 -255 -71 172 -649 -417 427
1827 427 4 -657 -440 293 -159 -536 -136 47 -428 -288 349 465 -374 -188 620 403 -152 248 1065 327
1847 327 -197 38 833 161 -481 234 214 -404 -373 306 -141 -827 -589 -148 -400 -331 -355 -171 -612 -322 254
1868 254 108 -285 -159 549 -106 161 403 380 -119 97 669 312 -153 473 808 -174 -528 319 433 -602
1888 -602 -577 417 398 -672 -136 49 49 -810 -288 408 -532 -538 -140 345 -162 -172 237 280 -56 3 223 429 42
1911 42 59 181 104 86 -12 261 120 19 162 -382 -80 125 -367 -765 -435 175 -608 -519 -23 61 -271 -444
1933 -444 218 268 -803 -86 489 333 -293 -89 728 192 -351 317 945 286 -121 212 704 -141 -484 -141
1953 -141 174 -287 -586 100 141 -443 -644 23 260 -250 -433 -307 214 -216 -319 359 379 60 -139 443 709
1974G09p40M5O64J03r26M9N88j2p67n1P50l81q85M57O43m40m83J89N47j39l33
1995d13J40K81J73n39J57L43J42l90k1O68l02l56J91P37m51n93M83J94k05p51
2015e12J84P09n22n09L28N85o63j43K91K98k71q85O57R92q29j82P09K83o81j91
2035c52P74K31p10j17J002m12n06Q4N96n80m06O38K52m39m37J45L38m20j90L68
2055a41K30k54l43L20K6J85k55K92k4J97P7l53K18L41l34q3J21M21k89k48N61
2076F65k13p69K26N24k49n10j95R27m35p38L46Q37p14k29O04K64q63r5Q24O0p90
2097e23R6J084k78p18L83P77o06m71M66L39l97j02K77N7o59qN50l6p06K67p7j01
2119c86oJ85l2k21J06K49k54j69O54j8k59j53R33k27n57N24J88l78m46O69K5n59
$$ plain form
1974 709 -31 14 678 781 -145 -96 492 480 -287 -338 412 31 -854 -397 246 -194 -677 -488 59 -80 -413
1995 -413 -273 8 181 -358 -201 142 284 -106 -127 541 239 -117 74 811 360 -233 250 444 239 -512
2015 -512 -328 381 -141 -650 -322 263 -400 -543 -252 46 -225 -1110 -453 539 -290 -472 237 520 -161 -352
2035 -352 422 653 -57 -174 828 416 -90 -6 590 10 -396 242 494 55 -382 -237 101 -319 -509 -141
2055 -141 89 -165 -508 -188 -162 23 -232 60 36 233 310 -43 175 516 182 99 220 641 352 104 665
2076 665 452 -317 -91 433 184 -326 -521 406 -29 -767 -421 416 -298 -527 77 341 -522 -617 207 267 -523
2097 -523 -427 657 379 -339 44 821 215 -256 210 549 152 50 327 384 -275 -283 267 231 -475 -208 -285 -386
2119 -386 -392 -207 -239 -460 -354 -105 -359 -528 126 108 -151 -304 629 402 -155 369 557 179 -267 402 427 -132
2141a32l33J107l43o69L76M58l25q60M52L50k82m44M22K68n71k09P93N5p70L86
2161b71O65j86m52L21J89l3j05K40k13l71J52L60j22k11K80j60o6j10L5J74o16
2182e00L48J50j15j61J13M50r61J88P60k70k25J42M94l00n49P25K73m38l37O20
2202D07J14n94m9O11l57l29J30L68j59n51L75K56o66r7O40j90l26l12O94k7m48
2223e10K21M29j30o6K53J45l06j57P17m22k97P28J16n67k85N42L6n66j26N70m22
2244i7j89J23L42l99k34K93J99l53l84Q65J24q65N26L50j75l98L99L44k89m0K58
2265D00k9l41J72L74m62l23K00K67n59P0J41J40o73N46J53o0n51Q2P95n69j50
2286c77K85J30j23o8M01N8n38J53N82m78k63N52L29o40O4K19L2k88m1J22N8n70
$$ plain form
2141 -132 -465 642 299 -370 6 464 139 -721 -269 81 -201 -645 -223 45 -526 -735 58 113 -657 -271
2161 -271 394 208 -244 77 266 233 128 368 155 -216 -64 296 174 -37 243 83 17 -93 -58 116 -500
2182 -500 -152 -2 -117 -278 -165 285 -676 -488 272 2 -223 -81 413 113 -436 289 562 124 -213 407
2202 407 521 -73 -122 489 132 -197 -67 301 142 -409 -34 222 -444 -541 99 -91 -417 -729 -35 -62 -510
2223 -510 -289 140 10 -56 197 342 36 -121 596 174 -123 605 721 154 -131 411 447 -119 -245 325 -97
2244 -97 -286 -163 179 -220 -454 -161 38 -315 -699 166 290 -575 -49 301 126 -272 127 471 182 142 400
2265 400 371 30 202 576 114 -209 -9 258 -301 -231 -90 50 -623 -77 76 16 -535 -453 342 -227 -377
2286 -377 -92 38 -85 -153 248 306 -232 -79 503 25 -238 314 643 3 67 286 318 30 -11 111 169 -401
2308d01N81k4l89j69J28L30m57L54np9J1R0K64Lk62K17j02n3J32J79K0l22R6J41
2332B83q4l01L88j25k21k38O70l53j32j23M69j51p87P03Pk07k26M00N0l60J95
2353a43K76j0l04J11L93p8j22K32k06J14O4k58J3K31k11m4p6j6J41o9k24l6K38
2376A6j52q2K19q1l75J68O85l14l17j05M89K75o71J12L42j0l0o0L97j57m8n8M9
2399B92p1k89M37j08m83j37L73N9p1k31N3r0j0rJ23J12k9j23J37J63q3J95k50
2422d0L38q4r4o4R1J11n09L74L71o57J03K89P3n45m5K59J41k66l02M29m3j24q3
2445b77M85l47R5k92L56K42m49N1M45m9l66K66J21K15o80L64K44j30m13P8M06
2466C65l55n1l22M71l2j82p7K02O1m25P5K09P9n22L56K94k0l97M03K04k18l18
$$ plain form
2308 -401 180 156 -233 -402 -274 56 -401 -47 -52 -131 -120 -30 234 237 -25 192 90 37 169 348 368 46 142 283
2332 283 199 -102 286 161 -60 -298 372 19 -113 -236 233 82 -705 -2 5 -202 -428 -28 22 -338 -143
2353 -143 133 123 -181 -70 323 245 123 355 149 263 327 69 82 313 102 58 -18 -34 107 38 -186 -222 16
2376 16 -136 -218 1 -80 -455 -287 398 84 -233 -338 151 426 -245 -133 209 199 169 109 506 349 301 243 292
2399 292 221 -68 369 261 -222 -359 14 73 2 -229 -176 -266 -276 -285 -162 -50 -79 -202 -65 98 15 210 -40
2422 -40 298 214 120 56 147 258 -251 123 494 -163 -60 229 302 -243 -288 -29 112 -154 -456 -27 -70 -194 -277
2445 -277 208 -139 -44 -336 20 262 -187 -136 309 260 -106 160 281 496 -184 180 424 294 -119 -41 365
2466 365 10 -41 -363 108 76 -106 -183 19 80 -345 -270 -61 18 -504 -148 146 126 -271 132 336 118 -200
2488b00L57L63p4o21K18J55K06k87Q0J31m23r8L00K9o6l15M3O4O5k53j37M50o6
2511g9k38K47K38j82k63L01J86k96j18N18p6j66M0K04j30j38j80L68J69m94j27
2532b16N96k66k78N2K33l06l66j4M97k5j94m5M25j27m62N44K84k25j57L91k63
2553G8L5r2K59K2k04k46L05j65n2j29l6K08Q8j03k14L52m36J56j7L79j31l93j19
2576d55N11J0k17m3K36L01m68J63K09n1k08J07L03m01p3L8M83p1n25K94l0l1r0
2599hK76n53j04L39L38m87k71K53K20J20j82J09n2J86k81J37O3qk9K54l10K58
2621B68J0k18M2K48m92J58J01K71n95j39R8L73k07k92L63L23l54m02K89J29j56
2642a82P5J69om75K73M47k83j66K84K40l16m14N83K81m60j35J95J34l11r5L05
$$ plain form
2488 -200 157 520 446 -175 43 198 404 117 197 328 -95 -193 107 136 70 -245 -202 -138 -73 -326 -463 -13 -79
2511 -79 -317 -70 168 -14 -277 24 210 -86 -204 314 238 72 112 316 186 48 -132 236 405 -89 -216
2532 -216 380 114 -164 -112 121 -185 -551 -565 -68 -93 -287 -332 93 -34 -496 48 332 107 -50 341 78
2553 78 113 21 280 302 98 -148 157 -8 -60 -189 -225 -17 71 -32 -246 106 -330 -174 -191 188 57 -336 -455
2576 -455 56 66 -151 -194 42 343 -125 38 247 196 -12 95 398 -3 -76 -38 445 374 -151 143 113 82 -8
2599 -8 268 -285 -389 -50 288 -199 -470 -217 3 123 -59 50 -2 184 -97 40 103 95 66 320 10 268
2621 268 278 60 102 350 -142 16 117 388 -207 -346 -248 125 -82 -374 -11 312 -42 -444 -155 -26 -182
2642 -182 -107 62 56 -419 -146 301 18 -148 136 376 60 -354 229 510 50 -85 110 244 -67 -162 143
2663A43j94k21M19k95j14L4MJ50k49O1M15j84M4K41j12k86J19L06p2n9j0M92l60
2686B72l60J73K89m99K66J76l65j54J65K05j16m37K01L53l73k77K39K28k14J63
2706f5J01j38j21J42N20m22k88L96P6K7n54N10R8k23j41L26l39O1K23j24r2n8
2728h5K00k11k39J93L9o7l48K94L30m78L50J33r4j44L91J06j78l15K05O9j76j73
2750a98M95J05m04m3N55l23l91J15M28l50k15L53K0k93o08O49P0k24L5p4K0l7
2772c15R3M14n45L17K44K5k95K99j9j43j6R8K87m78J27M5K13m38l13P02l65k66
2794c29K26K96m26J16J12L46l43l48N72l43L4j42P26m41l04J65M59j60o2J09j24
2815A39j55k8J28k53J44K93n3j23k80L72j34k72K22%n0j17K60kk13j53M80p7j42
$$ plain form
2663 143 -51 -272 147 -148 -262 -228 -224 -74 -323 -262 153 -31 13 254 142 -144 -25 281 209 150 140 632 272
2686 272 -88 85 374 -125 141 317 -48 -202 -37 168 52 -385 -184 169 -204 -481 -242 -14 -228 -65
2706 -65 36 -102 -223 -81 439 17 -271 125 201 228 -326 184 282 59 -82 244 -95 -34 189 65 -27 -85
2728 -85 115 -96 -335 -142 -103 -170 -518 -224 106 -372 -22 111 17 -127 264 370 192 -123 82 151 -25 -198
2750 -198 297 402 -2 -45 510 187 -204 -89 339 -11 -226 127 147 -146 -754 -105 -35 -259 -224 -298 -278 -315
2772 -315 -222 192 -353 -36 208 233 -62 237 218 75 59 157 444 -34 93 138 351 -87 -400 302 -63 -329
2794 -329 -103 193 -233 -117 -5 341 -2 -350 222 -121 -87 -229 497 56 -248 -83 376 216 154 263 139
2815 139 -16 -44 84 -169 -25 268 215 92 -188 184 50 -222 0 0 -50 -167 93 91 -122 -275 205 128 -14
2838a4k63M95K5k25R6K41k13k65M33J89o95j17N19l0k59m7K3K36k34j05J81N8
2860B9l3r9m7M9J83n5j32l41L38K05k04J78P4N8m00K64J88k60j07K23M5j26J27
2883A57m5N6k02j54K84j58k31J24K41l31n1J92J72q7m73N41mk02J13J26n7k41
2905b30L59p4J27n21L69L12l11j6K52J55l22k67J04J83k90P3K3q1J35j7l7Q3j23
2928a14L3j57J20J39k3m0JL46l81J09J90m1j66k4J93J09n43O6L07L4o02K37N84
2951C77n69O7L4Pk08J71J01J35l13j18P1L58j29j67J34J17j02j07L84k39l5J66
2973A35j14m8K25K0q9J16r0k72K81j22j27J23k94L60j36j04k2O0J21L8m74L64
2995d9J45l72J72K0N3m7p0L65p9j60J54j67m6J49ol2k7Q6K87j63k14J36O9J02
$$ plain form
2838 -14 -277 218 243 18 114 355 142 -123 310 499 -196 -313 206 176 -83 -130 -107 129 -105 -210 -29 29
2860 29 -4 -103 -150 -101 82 27 -105 -446 -108 97 -107 71 145 203 -197 67 255 -5 -112 111 156 30 157
2883 157 112 168 -34 -188 96 -62 -293 -169 72 -259 -310 -118 54 -33 -506 35 31 -171 -58 68 11 -230
2905 -230 129 55 182 -339 30 342 31 15 267 422 100 -167 -63 120 -170 -97 -74 -155 -20 -37 -74 9 -114
2928 -114 -81 -238 -118 21 -2 -42 -41 305 -76 33 223 182 16 -8 185 294 -249 -183 124 158 -444 -207 377
2951 377 -192 -125 -91 -84 -292 -121 -20 115 -198 -316 -245 113 -16 -183 -49 68 -34 -141 243 4 -31 135
2973 135 21 -27 198 218 129 245 155 -117 164 42 -85 38 -256 104 -32 -136 -158 -98 23 61 -413 -49
2995 -49 96 -276 -104 -84 -31 -78 -148 217 138 -22 132 -35 -81 68 62 30 3 89 376 213 -1 135 204 306
3019C06o03Q8J20J43k60K25M5J7k91j3J68L07k05q2L81l22J42q4k57N03k75J2
3041F5J42N3j13J8O9k03M9k82K58j07l06J93q6L46Kj68m4N0J44k35K84J19j4j43
3065I1j21K88j46m9KJ78k06K5K23n7j90J04J55l02j46L75r0k75J2M4J02m28K43
3088a68K52J16k29l01L35j4k07Q2J97l8j27j14L11nk8k17J97R8j92J70J27k95
3110e0m6J82M1q5q2P6k5J3j40N5l9M2M5k2J55m26K05j5J64j34J4k3M0J7k6K51
3136A87r5K23k52j43K01o9j60L43k31k6N8Pj45O7N2j48J49j32k53K48J7O7p9J21
3160GJ05j54K78j23l3k20M95m22Q9K18p6k15J88J69l20M5o6K38L2k48q7O6k92
3183c26J99M7J16M5j93p5K81l47J12K32j66J90k71K14K4j53q3M65l90M5K68n5
$$ plain form
3019 306 -297 -209 -89 54 -206 19 64 81 -210 -223 -55 252 47 -35 346 24 166 82 -175 328 53 65
3041 65 207 260 147 165 234 31 80 -202 56 -51 -357 -164 -250 96 98 -70 -114 -64 80 -155 129 248 234 91
3065 91 -30 258 112 63 65 243 37 62 285 228 38 142 297 -5 -151 224 134 -141 -129 -85 17 -411 -168
3088 -168 84 200 -29 -330 5 -9 -216 -134 63 25 -102 -216 95 90 62 -155 42 140 -52 118 245 -50
3110 -50 -96 86 127 42 -40 36 11 24 -116 -61 -100 -58 -13 -35 120 -306 -101 -116 48 -86 -72 -95 -55 -38 -64 187
3136 187 92 315 63 -80 121 52 -108 235 4 -22 36 43 -102 -35 17 -131 18 -114 -367 -119 -102 -35 -114 7
3160 7 112 -42 236 113 80 -140 355 -67 22 240 164 -51 137 306 -14 31 -35 203 235 -13 -100 -34 -326
3183 -326 -127 -80 36 81 -112 -187 94 -253 -141 91 -75 115 -156 58 82 -71 -154 311 -79 -34 234 179
3205A79j87M2j1K4q1r8J21j06L2J31r7j54L9J32k9J30n4j44J07j13J29L9q1M4
3229fl6K73k36rL28m23L12j13J09l03J29R9J48l68m6J76Rl00L28j86J86m7k02
3252a78J2J49k84L51k40K33J97Q2k64j05J01J80j87Lo9j25j6J54L35m04K88j39
3274G4K68m92P4M2J62j28j76J15l4R4rj04j77P1M23r8k5j96K54j88NL39j31j25
3298C8n7J1q0r3K35O8j90j22J80L62n12j75K69J18n6k06PJ45K35j02p0pj59L34
3322A73M8l46J45O4M2m3j70M85n07n7K66N8q9N8n8k76K75l8Rj76Q8j86L97j42
3346B0j39j52K01J57j44m2L3N5K99j97k59QK11n1J41k86K73L45n38Q4p2N8J4O9
3370H8j12m9m0R5l9j9rJ47j83k9l9L3o1K09P0k3l3J06k4k5l7nJ25j33K40k28n
$$ plain form
3205 179 -8 34 23 47 -34 -132 -11 -117 -85 46 -51 -205 -166 -34 -63 67 13 -131 -24 -137 -8 31 -50 -6
3229 -6 -42 231 -5 -14 314 -109 203 90 199 -104 25 124 272 -96 -142 34 43 -257 71 -115 71 24 -178
3252 -178 -166 -17 -301 50 -190 43 240 322 58 -47 54 234 47 50 -19 -144 -160 -6 329 -75 213 74
3274 74 342 -150 -76 -34 128 0 -176 -61 -95 -1 -10 -114 -291 -220 203 105 80 -116 138 -50 -45 294 163 38
3298 38 -19 -8 -88 -181 54 122 -68 -190 -10 352 -160 -335 -66 52 -4 -210 -203 -58 177 75 5 -2 -161 173
3322 173 221 -125 20 84 126 83 -87 398 -109 -166 100 158 69 127 69 -207 68 30 39 -137 -49 -235 162 20
3346 20 -119 -271 -70 87 -57 -99 -66 -11 288 91 -168 -160 51 0 141 -145 128 473 -65 19 -53 5 19 88
3370 88 -24 -73 -113 -18 -57 -76 -85 62 -121 -150 -189 -156 -217 -8 62 39 6 112 88 63 26 21 146 13 253 25 20
3397B0J62q4K82j10l70J51kj18j00L17k85K23l9j77RL39l33K20k6l9O8J9j22n5
3421e0j0L2J87l05O0K16j52q0K0N8Q1J5J58k53O9O9l07J48J43j72q2l4K09q8j25
3446a93J42J52M7o1j50L83j40l17K55J29l17J33q0Jm5R6J95k57J14N1j05l20M52
3469A65k67R7J37j70k11K57k35K40j5P7J34R5o59J86R3P4k20K07m4J70k32P1K2
3492b8K56k95o7J44k2n6qK0j79L1J05K42Kk70J0J54k45J30J9O7q2m5J52l3k0n
3518b3m2Q1j11K41j72J00k75J01K5K34k32k0p9M07l65L4L69m88J12K6J55J19k05
3541hk01J04m5l7J34N6l9J49l23K36J4o1J72O6l32L4o1K17n0M0k85L36j75J72
3565A13l61L13K0j82n9Qk17M36k47L4K84m35L22J21k76L7K10j14N6j61N3K86j06
$$ plain form
3397 20 182 98 380 270 -100 51 49 -69 -169 148 -137 86 47 -130 -121 218 -115 105 79 40 108 127 5 -50
3421 -50 -60 -28 159 -146 -86 130 -22 -102 -82 -24 57 72 230 -23 46 115 -192 -44 99 -73 -155 -189 20 -68 -193
3446 -193 -51 101 148 87 -63 320 180 -137 118 247 -70 63 -17 -16 -61 35 230 -27 87 138 33 -287 165
3469 165 -102 -5 132 -38 -249 8 -227 13 -2 75 209 304 -355 -169 -76 -2 -222 -15 -59 111 -121 -50 -28
3492 -28 228 -67 -134 10 -12 -68 -76 -56 -235 -204 -99 143 145 -125 -115 39 -206 -76 -57 10 -72 -117 35 2 -18 -23
3518 -23 -65 16 -95 146 -26 74 -201 -100 -75 159 -73 -93 -172 235 -130 -96 273 -215 -103 -77 78 197 -8
3541 -8 -209 -105 -150 -187 -53 3 -36 113 -210 26 40 -21 151 217 -115 -81 -142 75 25 65 -220 116 -59 113
3565 113 -248 65 85 -97 -156 -148 -365 71 -176 -142 142 -293 29 150 -126 -89 121 7 63 -98 -45 241 135
3588A35p1J0m4K3r0o8K18j40J13l19K24l42K71j6R7Q4k69M05j78J0r0j27K97j36
3612cJ92j07q5O8Q5j70pO7K78j93j40L2J82j81Q3Q3j37j72J25o3k16J49J57J50
3636A77l47l5J98n7l8J98k50J21J96j28j10P0J36l24J65j20l3L3K34j65L30j14
3658A37j03P8j71K0lJ51k89K02l0J38L9m16J87mJ04j04J32j88J92J1n4J56k33
3681d8r0L21QO1k25N7k31qJ45J04J49k47l9j26q7j2J23J65j8k65J2M08j29p7L8
3706a1j62J14J8N0M5k05N8M60l51j20L05l8k0O3m1m52J38J11K48k85KJ10j04n4
3730a21J92j40o1K00k56J37MJ79M9k80p9K58K48l30k0Q4k59M9J55k25L53j31J07
3753A13p5j38J50j83j3K11N0Q5k05m1K2k17j97M27K7j3J9%J33j5j25p7L7K64o4
$$ plain form
3588 135 64 74 30 53 -37 -105 113 -27 86 -233 -9 -351 -80 -96 1 85 -184 221 43 53 -37 -164 133 -3
3612 -3 189 82 -3 65 150 -20 -27 40 318 125 -15 17 199 18 101 184 47 -125 0 -63 -279 -130 27 177
3636 177 -170 -205 -7 -64 -102 96 -154 -33 163 35 -75 -5 131 -193 -28 -148 -181 -148 86 -79 251 137
3658 137 34 112 -59 -39 -42 109 -180 22 -8 130 169 -247 -60 -64 40 -64 68 -120 72 83 29 185 -48
3681 -48 -138 183 191 252 27 84 -147 -155 -10 94 243 -4 -43 -169 -256 -268 -145 20 2 -263 -251 157 28 -49 -11
3706 -11 -173 -59 -41 9 54 -151 -93 367 16 -104 201 163 143 206 165 -287 -149 -38 210 -75 -73 37 -67 -121
3730 -121 71 -69 -130 70 -186 -49 -45 134 183 -97 -176 82 330 0 -20 64 -195 -146 9 -216 137 6 113
3753 113 38 -100 50 -133 -146 65 115 200 -5 -46 -24 -241 -438 -11 16 3 22 22 155 140 15 -62 -25 239 175
3778A75j69L02m88L4N0L47l88JL73l95j82M32K51l07j7M0M8j1p5k30L03r7o5K36
3802A68j08j57J07Q9M4j9j46P5l7K00j99j74K94j2j32K06k49J4j14L63l16J11
3824HqPl3ql6j87K73j52r9l3L67k07K21j20Q0k%l44M40k3lj16J42l3R4J76m23
3851a9j20J99m9o1K34pm2l00K11j5l93L97j03J28j99J55m3k71M48k27p3Q0N5m1
3875e6K41k58O1J28j00J44q9m5L03l67O4j93J6L2R2j37J31q4nK09j49L59k11o
3899H0j0J37k71j10K14j83M16m22J46K2j72R9K15M5p8K0P8k20n1K3J43j44L5J77
3923A89n2k9k83K73l6o3l21M92k13k9K69k87K08qj91M20k93k28J89j52M12k61
3945FK21k38j52O0J04P2P8k20O0l0j00M45m57J22K7j24J67k7j79O3j18J39R0K09
$$ plain form
3778 175 6 308 -180 -146 -96 251 -137 -136 237 -158 -340 92 343 36 19 59 107 96 21 -209 94 -3 -68 168
3802 168 60 -97 10 99 143 124 -22 53 16 216 17 -157 137 125 -7 199 -50 -36 -150 213 -103 8
3824 8 0 7 -26 -34 -70 -257 16 -136 -235 -268 99 -108 113 -7 73 71 71 -273 167 144 141 25 167 134 228 404 -19
3851 -19 -139 60 11 -50 184 177 135 -165 46 31 -362 35 -68 60 -139 16 -27 -298 150 -77 -150 -70 -15 -56
3875 -56 185 -73 -12 116 16 160 71 26 329 -38 26 -167 -151 -119 -27 -164 -33 -117 -122 87 -62 297 86 80
3899 80 70 207 -64 -174 40 -143 273 -149 -3 19 -153 -54 161 206 128 148 226 6 -45 -22 121 -23 12 189
3923 189 137 108 -175 98 62 -1 -322 170 -43 -72 197 -90 118 110 -81 339 46 -182 7 -145 267 6
3945 6 227 -11 -163 -103 1 73 151 -69 -9 -39 -139 306 -151 -29 -2 -126 41 14 -165 -102 -220 -81 9 218
3969B18l60J98J3j57J34J27o9K42l79O1p1J08k16L08l12K46j34j81L30k71L0j29
3991b64L0R7J81j88J59rL1j50j0J46l3O6J53K0k00l4M0J40j20pQ7r0j01m1J06
4016IJ15l22J17L0J37l38J73jK08k74P4J17J97l8nm4j3k15K01N4k02J88j41j6
4040A1K28j09j78J22N4o3k25J84j32J35J08n8j49p0q1L29l88N5J54J44K62l35
4062bk2j72M20j81O0%J12k14N3J8r8K20k56N2M3j51J29jl0n1J15j02J92j47j5
4087b8j18K60l13K43J88k20k15J10r7M54l03k3J16J02K7k02K2jK41n14O0K85J29
4110B03l73L55l69K65J36m7j88j01J26m6%j32K23j5l7K7Q1j12K6j79K71k25%K84
4134A73k70K07j39j14J22M1j61L12L9j42j96J51r6m5N0J92J8m64M85k92K47j17
$$ plain form
3969 218 -142 56 69 -88 46 173 104 346 -33 28 -43 65 -151 157 -155 91 -43 -224 106 -165 -135 -264
3991 -264 -234 -137 44 -144 15 6 37 -113 -123 23 -10 56 209 229 29 -5 35 175 55 48 135 45 -56 -97 9
4016 9 124 -198 -81 -51 86 -252 -79 -80 128 -146 -72 45 242 204 199 155 142 -73 128 182 -20 168 27 11
4040 11 239 130 -48 74 128 65 -160 24 -108 27 135 77 -72 -142 -223 106 -282 -227 -73 71 333 -2
4062 -2 -24 -196 224 43 103 103 215 1 54 72 -26 194 -62 -10 33 -118 11 10 -20 -71 44 -58 134 -13 -28
4087 -28 -146 114 -199 44 232 12 -203 -93 -190 264 -39 -62 54 156 183 -19 3 2 243 -271 -211 74 203
4110 203 -170 185 -184 81 217 170 -18 -119 7 -39 -39 -171 52 37 0 27 108 -4 22 -157 114 -111 -111 173
4134 173 -97 110 -29 -143 -21 20 -141 171 210 68 -128 23 -73 -118 -68 124 142 -322 163 -129 118 1
4156AJ38N7l8j41J83j54n3K04k06K30r7k04J32KJ31j60l1j32O3O3L6k19K76n1
4180C0j08K6P0J08j73K93k65M9J0k85P5L46j59n2Q9j82L7K7l5K46j18n2qo1j10
4205b02J71q1J66j16R9J08j31J4M4j30L5p8p0q3M03k83P5K4j6J72j93J13j82J43
4229BK30j89q3M2j24J76O4j10K38k52J77k12K2J66j59k96J38N7J32K57n19J90
4251e3R1K7k49L62j64R3O2p4J15l07K0J07j64M40l65n4J10L2j52P9J04p5j25k08
4275c48M49o3j8R9j75j3j5J7Q4j41K78k67L3j69nK91j70J71Q5J71k76K8M3j15
4299b6J36p7J13J10k47J4j6j57J67qk17K39q5K66l47mL02k55M7Pj01rm7J84j0
4324b1K9q8K0J33J03j17R1j74J46j19L4p4J37m16L25j19Rj02J23r8K65L5j89M2
$$ plain form
4156 1 139 196 158 17 200 46 -7 197 -9 221 124 -80 52 54 185 25 -6 -138 -75 -12 24 -195 81 30
4180 30 -78 -52 18 126 -47 246 -19 30 40 -245 -170 176 17 -35 54 -128 -91 -64 -99 147 29 -23 -31 -92 -202
4205 -202 -31 -112 54 -62 37 145 14 28 72 -58 -23 -101 -171 -254 149 -134 -59 -35 -51 121 -72 41 -141 2
4229 2 232 43 -40 2 -122 54 118 8 246 -6 171 -41 -19 147 -12 -308 -170 -113 19 276 -243 -53
4251 -53 38 65 -184 178 14 107 169 95 210 -97 -77 30 -134 306 -59 -113 -3 29 -123 -44 60 -15 -140 -348
4275 -348 101 38 20 119 -56 -69 -84 -67 17 -124 154 -113 -80 -249 -254 37 -133 38 123 294 18 46 89 -26
4299 -26 110 33 146 256 9 23 7 -150 17 9 -208 31 -54 212 -135 -139 163 -92 -45 -38 -139 -148 -195 -11 -21
4324 -21 8 -80 -60 73 176 59 150 -24 122 3 37 -37 100 -316 9 -110 -101 -203 -80 -178 87 122 -67 -25
4348b5j90L63j60k32LP9L81m04K16K58k81j8j16J90k0Jq8K52k76M5J6j86L01j24
4372a5l3MK43k60o3R6j7O5J52k56J81j00jR0K21k72J79l12J9K07j52O2J21k28
4396f9J48k59O4K69k29O2J8p0N6P0j94J9N3L1j03J16Ok3P0kj6j32K7L53k27o0
4422b2K02k20J33J42j41j17J23o8k22M54l56j77L52O0j01k57K55k82L13lJ11j63
4444A6j11J01j02l3K85k17q3l8K20k05K5J36k69J97j50N54j94n5J9j91J88j02
4466iL41m42J15K90l84K35k58L25l34J8K5J02k13j03L40K0k53K29o0J27O8o4n8
4489E7J23p2j02j99Q5M7j51J38J29n04L80r9n1M2k5j29M91l28NM07m04M0k5J59
4513A4RM7j42J03M2j2j34J22NJ05k42J59m1j96J55Q9o8q2K72j85O5l2n7j23K46
$$ plain form
4348 -25 -215 148 -12 -244 -241 -162 219 -185 31 289 8 -10 -126 64 44 45 -43 209 -67 -22 -6 -192 109 -15
4372 -15 -48 -44 199 -61 -124 -28 -45 20 172 -84 97 -3 -4 86 307 35 214 -98 -79 128 -24 38 159 -69
4396 -69 79 -180 -116 153 -76 -14 4 -66 -10 60 -134 -115 -62 -31 -134 -18 -12 -35 35 33 17 -115 -88 265 38 -22
4422 -22 180 -40 93 235 94 -23 100 32 -190 264 -92 -269 83 143 42 -215 40 -242 71 68 179 16
4444 16 -95 6 -96 -129 156 -61 -144 -182 38 -167 -142 -6 -275 -78 -228 326 132 77 96 -95 93 -9
4466 -9 332 -110 5 295 -89 146 -112 213 -121 -103 -78 24 -189 -292 48 68 -185 44 -16 111 179 115 57
4489 57 180 108 6 -193 -108 -61 -212 -74 55 -449 -69 -168 -219 -177 -202 -331 160 -168 -163 244 -160 -120 -145 14
4513 14 23 70 -72 31 73 61 -73 49 54 159 -83 76 35 -161 -6 83 15 -67 205 20 85 53 -4 -127 119
4538A19j74J70J15l25L8J64j13k07L64J03l08J8J36J53k07J04q5j1k88N14Q2o64
4560c02J33K33j72J15p6J81j20J82j73j03J06m5OL5L3r5j63J54J4K23j75r9J98
4583I0j58J19r4J5K12m58K89j36J80j37p5J74r6L6R3o4r4L49l63K40j38j08J1
4606a13%J86r6Q5M7j68J28Mj96K75l33R3P9p4L07p9r7K43k47k62K68j51J01M3
4630D3R4j56K5k0J41J36j47L1j74M0j95Q4m6J30L9M3o4j26K23n3mr4M6r4L1O6
4656aJ9O0K25k57P3J5o5r9J44j68J94P7k46N3q0k7QJ85J7p6nl8j63J63J07l9m4
4683C2j32K02m7j72K42k4r2j19j9M19k68j07k08N21l05P8J64J78l35J05K1n7j10
4706c3j49k9K72M4q0j08L64n2j62n5o7j3K75J8j68q9k6J28J2k86J45j14K64j9
$$ plain form
4538 119 -55 115 230 -95 -57 107 -6 -213 151 254 -54 -36 100 253 46 150 65 54 -234 280 362 -302
4560 -302 -169 64 -108 7 -69 112 -8 174 1 -102 4 -41 -35 0 33 -62 -225 -71 -57 166 -9 -108 90
4583 90 -68 51 -43 -28 184 -274 15 -121 59 -78 -153 21 -75 -39 54 -10 -104 245 -118 122 -16 -124 -113
4606 -113 -113 73 -23 62 109 -59 69 73 -123 152 -181 -88 -9 -83 224 145 48 291 44 -218 50 -101 0 43
4630 43 137 -19 6 -14 127 263 116 147 -27 13 -182 -98 -144 -14 25 68 4 -122 101 48 44 -50 -4 -98 -67 -1
4656 -1 18 78 303 46 119 134 69 -30 114 -54 140 217 -29 24 -56 -83 -75 110 127 51 46 8 -155 8 115 76 32
4683 32 -100 102 55 -117 125 101 9 -110 -129 290 22 -85 -293 228 -77 1 165 343 8 113 134 77 -33
4706 -33 -182 -211 61 105 25 -83 281 229 67 12 -55 -68 207 225 57 -32 -58 70 82 -204 -59 -173 91 72
4730G2j52R3j00N9j88J44P4J1J07j92J87j79lJ8J58k00Q5J58Ml8j24q5j18L8L70
4755A99l0k13P0k59L74k82K69l32N4L47j79k70K57l6Q3J7j14K01l2j81Q9p3r0
4778a31L04k19J20o8l2J43p2K9m7KJ47k70J25k87L99j09k06K94J31k11k76K20
4800a4j23L68m8j64j31L55j30m8j41J9L5O2J6j34J39j17J76j30L33m7j38j99J15
4823E4j52K19k45J55p2K17r3l01M52l79K18m5j46L69l2Pk46M24m32M8J01j9k70
4846a68L66k88Q6m7MK34k11n4K36k40n0J85j10R8k0j74K6L65k82J66l48J54pK00
4870A21m6LJ44k50K44k45J87l26L59j14%N0k93J92J35k66L58j05j57j62J53Q4
4892F6p5J02k48L29m9k47K73l24J30r5J71P8O9m33L10N6l6J07j10k64J28J00Q6
$$ plain form
4730 72 -80 13 -87 -28 -216 -72 2 13 120 -72 115 -64 -67 -49 109 -91 -6 152 156 118 -6 -91 -209 -171 199
4755 199 169 -44 26 -233 141 -141 128 -204 -150 197 18 -252 5 -31 52 69 -45 156 124 -57 32 -41 -131
4778 -131 173 -46 74 6 -26 117 45 74 27 29 176 -94 31 -256 143 34 -172 122 253 42 -234 -14
4800 -14 -137 231 183 19 -112 243 113 65 -76 -57 -22 40 56 -78 61 -56 120 -10 323 276 138 -61 54
4823 54 -98 121 -124 31 -41 176 83 -218 234 -145 73 28 -118 251 219 226 -20 404 -28 20 121 102 -168
4846 -168 198 -90 -4 -51 -47 187 -24 -78 158 -82 -132 53 -57 41 21 -153 -127 238 -44 122 -226 -72 -79 121
4870 121 75 78 222 -28 216 -29 158 -168 191 77 77 127 -166 26 161 -105 253 148 -9 -171 -18 66
4892 66 -9 93 -155 174 125 -122 151 -173 -43 -138 33 111 180 -253 57 113 77 184 74 -190 -62 38 124
4915A24k66JlL21k44O9j03L91j25K5m32q4N45p0L1n01K75O0m0Kl3J85N7l97L51
4940A39K7l51J13j30Q2k42N71L7j41L2KR5j71k6j19J42j65J84j23l2q0J14Q3L4
4964G5Q8j76O3j68J27j09L6J13k01Q7k8K46k08l1N1J31j44K53k07j82J29L9K54
4987B38k52k2K21K8j69l9M5m7J65k3J3k58O2Lm7J2K50j44l43L24J59j40r5K17
5011A58k45J58Q6j02k58j58N2K65J3J12l23j2J87m7N0q7J74M9j07k22M78k97k5
5034a01NR3K2l3R4J58l73O2L0o6J10q8qL26k58J02m29J23J5J90J3NP8j94J46M4
5060F6j25l7K34j28q4K11m0j22J11k2K7n6L8n0k26L23R9j86j06PM8j57Q9N9j7
5085d4j14m1P3q0L24lj60J52O3k49K47M7l4j96Q6j29J46K0k36K31Q0K4j13k75
$$ plain form
4915 124 -142 -141 -144 177 -67 2 -101 290 165 190 -242 -326 219 149 180 -321 -46 14 -26 -24 -57 128 185 -212 139
4940 139 166 -185 -72 -202 -120 -362 209 246 105 137 139 234 63 37 -82 60 -105 79 -44 -76 -156 -42 41 75
4964 75 163 -13 50 -118 9 -100 -64 49 -152 -65 -93 153 -55 -86 -35 96 -48 205 -2 -184 -55 -16 238
4987 238 -14 -36 185 213 44 5 50 3 168 145 158 -100 -38 -35 -82 -70 180 36 -307 17 176 36 -59 158
5011 158 -87 71 157 55 -203 -361 -309 -44 -31 81 -242 -254 -67 -114 -64 -151 23 72 -35 -257 221 -76 -101
5034 -101 -96 -3 19 -14 80 238 -135 -73 -43 -109 1 -87 -95 231 -27 75 -354 -231 -216 -26 -13 -8 70 -124 22 66
5060 66 -59 -96 138 10 -74 137 97 -25 86 64 91 35 73 23 -203 120 219 33 -73 -66 -18 -175 -86 -27 -44
5085 -44 -158 -199 -126 -206 118 115 -45 107 170 -79 168 215 181 -15 71 -58 88 108 -128 103 183 207 94 -181
5109a81o2M75m55K15L2N7j37j63M8K96l04J92P2K06k43K7K21k57m6J49mk38o0
5132a60J51k9P0K6m8r7J47o0N0K3r2p7N6n4K16j85K51l94Q4N3K0J80r7K70k51
5157E3L7j71J57J2m6q4J20j61K73j11j20k24J77K02L1j42P8P6r3k48k11L78k23
5180b40L5J20J67o7j42L18l5l05L40j90j10J86j38L8L6j5p8J22k16J0K13M0j05
5203a6K21j83J09k72J10j60K54k5J47k9l1n3p1k06L5K2L3K43r5l0n9J25l0j57
5227a18J61J24L5j62k45K35P0k58L62l93m4J43j52M37l2Jj63M5j29oJ2J36l83
5250c24N00k67J04K08j74k2J47j44K3J22k79K96l13J17R3j08j02K6L11k1k38K96
5272B51k33K3j30K50q7q9q4O6r4L9L04k28K36n36K67J14R3l8N6l50O9M0J39N5
$$ plain form
5109 -181 -243 232 -223 -8 24 81 -56 -219 -171 125 -179 13 85 291 48 75 296 39 -7 142 138 -100 -160
5132 -160 -9 -38 32 58 10 -87 60 0 50 73 -19 -96 -40 -94 122 -63 188 -206 -122 -69 -49 131 34 304 53
5157 53 90 -81 76 88 42 -42 78 -83 190 79 -41 -265 -88 114 145 3 81 157 64 -184 -395 -17 -240
5180 -240 -205 -85 82 15 -127 191 156 -149 191 1 -109 77 -61 -23 13 -2 -80 42 -174 -164 49 89 -16
5203 -16 205 22 131 -141 -31 -191 63 38 185 156 125 72 1 -205 -170 -148 -115 128 33 3 -56 69 39 -118
5227 -118 43 167 202 40 -205 30 100 -158 204 -189 -233 -90 -242 195 163 164 1 46 -83 -89 -77 59 -324
5250 -324 176 -91 13 221 47 25 172 28 51 173 -106 190 -123 -6 87 -21 -123 -97 214 193 -45 251
5272 251 18 41 -89 161 74 -15 -99 -33 -127 -88 216 -12 224 -312 -45 69 162 124 180 -170 -101 -61 78 133
5296A33k84J43P4m5j45J76L6j20nR5j29n4J85O1k38J31p5J83l12J8M43k82p4j8
5320a03j57K44Jj10J65rK60m26J88j39o4J12J18j53J26k00K45j09p6m5J31RK6
5343C4k45P8L50m68J86J27P9l32J76q7J96k74Q6N3J98k58M04m56J39l16L57J6
5365D3O0j00r1P8r6j54M62l05K0O1l3J49q4J32m11K04m2M9j60L89n65M67k33J58
5389bj23J8J17m1p8L1J1L6Q4j69N3j57J42o1M4O5J27m0j06J24j29r3J06j4Q8K42
5415B75K5k12kJ4O4k43J27j66J26o9J04k07K13J30k62Q4J72k11K12k16K75j4m10
5438a91L59k13O7j49k8p3L70k16L5J16j71n3M58k11K6l13L65l5j92K6r9p3J68
5461b7P7j98K19j29J08j03J5n3O0j26r4J51o0J77o3rO9J71r9n7Q9k37L81m36J46
$$ plain form
5296 133 -151 -8 66 21 -124 52 88 -32 -37 58 -71 -125 60 121 -117 14 -61 122 -190 -172 271 -11 -85 -103
5320 -103 -260 -16 -15 -125 40 31 291 -135 53 -86 -150 -38 80 -73 53 -147 98 -11 -87 -132 -1 8 34
5343 34 -211 -133 217 -251 -65 62 141 -191 -15 -102 94 -180 -94 -41 157 -101 303 -153 -14 -330 27 43
5365 43 103 3 -88 -10 -106 -260 202 -103 -83 -22 -55 94 10 142 -269 -65 -107 -58 -218 171 -394 73 -160 -2
5389 -2 -125 -107 10 -31 -109 -78 -67 -31 53 -116 -63 -220 -78 -139 -95 -30 97 57 -49 75 -54 -147 -41 -55 33 275
5415 275 300 88 86 100 164 -79 48 -118 8 -61 43 -164 49 179 -83 1 173 -38 174 -42 233 219 -191
5438 -191 168 -45 22 -127 -155 -228 142 -74 -39 77 -94 -147 311 100 126 -187 178 143 -49 -23 -122 -195 -27
5461 -27 50 -148 71 -58 50 -53 -38 -91 -31 -157 -251 -100 -160 17 -46 -55 14 185 86 29 118 -119 262 -174 -28
5486b8R5p1K4k12J09j6K35o4J06m37K36J06q5j41J28j57N3K04j02M8j59k39N37
5509A70o3M7k17J16j02O8j66K32k8q9O8lq8k7K09j73K95o4j05p5j0J30Nj85J31
5534G6p6J11m7l37L15j34m7K71l27L60j41k44J49J11J2j95J54lP0q8K49k61L51
5557C29p6l28O1k18K07j70J77J98k47J47o8q1N4p2K8J90r1J38p5o6j80j02M42
5580A97k68ok69M16R5k38J50P8L9m24L62o9M1r3k0K7p5j29K63j99K76p9l40J70
5604i5R2J21k53QJ86Q7k52R0j35J32J78k07j92R6R8J04L0k65K58K64n47M24l30
5627a08k7J86L9j41K47j27q5J13k26K93l01J76q5O6Q1p2L5J7l39L35l6j53K02
5650I0j02K4k8P9J02N8L7l48M1J46q8J17j46K05k66Q8k9J7j05K49p8j69j1o6P1
$$ plain form
5486 -28 67 -4 20 -192 -83 -99 136 72 178 -259 -23 83 -2 -143 -15 -172 -119 85 -17 31 -128 -367 170
5509 170 107 154 -63 53 -49 19 -147 85 57 -32 36 33 -55 -82 127 -46 249 185 80 5 -5 125 130 -55 76
5534 76 0 111 64 -273 42 -92 -139 132 -195 165 24 -220 -71 40 52 -143 11 8 78 -10 239 -22 329
5557 329 253 -75 -14 -232 -25 -195 -18 180 -67 80 12 -69 -15 -87 -59 131 40 178 103 37 -143 -245 197
5580 197 -71 -77 -346 70 165 -73 77 155 194 -230 132 63 104 11 -9 18 -57 -186 77 -122 154 75 -265 -95
5604 -95 -3 118 -135 -127 59 146 -106 -16 -151 -19 159 -48 -240 -144 -46 58 88 -177 81 345 -202 222 -108
5627 -108 -135 51 90 -51 196 69 -16 97 -129 164 -137 39 -46 20 101 29 64 81 -258 77 41 -112 90
5650 90 -12 12 -16 63 165 223 260 -88 -47 99 11 128 -18 187 -79 9 -20 -3 -108 141 63 -106 -117 -183 -112
5675a12p1K91p6O5j29l3L3k39K16J5n9K47K82m11j85K50j30n0p9Q8K23n2o2m9
5699b7n2R7k96J38j20M10j00j57K91K49n04R0j1L1J51l34K44Lj86J32r7r1J85
5722D6M0j06K4r8J17J9j81J09N6L57l51k10K43j01P7oj62Q4m2o7J05J7lJ1K61
5747B39j96j08J7j45J96J06m0q5N5k58K12P4J42k75n6J37l2j38k5J10L8J34N9
5770A61j88o3M1m9K62O5k30P7j97R3J92k02J43k76M5k06L35r3K33j8l54L01k52
5793a80J69O9j86n2Q0J45j19K97j86j71J54q3j11J32q2J75J38j46k16L09j24J9
5815C1n7O2o2J41j58n8K51j38q3m8J03J47j30n9J5k29K26k12J46J1L4J09pl6Q6
5840H5p7N4J89j21k93L14l67L06k5Lk24K51k32J99p9Nj3N5J01j33j6J85j31K80
$$ plain form
5675 -112 -183 108 32 97 -32 -65 -32 -271 -55 -40 -99 148 430 19 -166 84 -46 -96 -175 -87 136 84 22 -27
5699 -27 -79 18 -278 -140 -260 150 50 -107 184 433 -71 19 8 39 190 -144 100 103 -83 49 -48 -139 46
5722 46 86 -20 4 -94 23 42 -139 -30 26 383 32 -178 65 -36 41 35 -127 -43 -85 -152 -47 -30 -33 -22 239
5747 239 43 -65 -48 -193 3 109 69 -16 39 -219 -7 67 209 -66 -122 15 -17 -155 -180 -70 -32 102 161
5770 161 -27 -90 -49 -98 164 229 -1 76 -121 -28 164 -38 105 -171 -126 -332 3 -90 143 125 -229 72 -180
5793 -180 -11 58 -128 -180 -100 45 -74 223 37 -134 20 -63 -174 -42 -124 51 189 43 -173 136 12 31
5815 31 -26 36 -26 115 -43 -101 150 12 -71 -119 -16 131 1 -58 -43 -272 -46 -258 -112 -101 -67 42 35 -1 85
5840 85 8 62 251 130 -163 151 -216 90 65 68 -156 95 -137 62 -17 -12 -25 30 131 -2 -18 167 36 316
5864C16k93K4O5Ok01R4J1k7R1q2k1J52Q6j06kkk02J18R5j93K05Q7l03K34j48o7
5890f3Q5j34J19P7J0j50J04K06k91J97k74J84j19oL14l8j69o8J20M9j6k34R1j41
5914a47K1J50j2l26N01j57j5r9M0J25j36J29Km8J45k87j06K28j9J3P3L3n3j55
5938a00N0n1J47j30J13O6o0j40J0R9k6J3Q4n1o1K00o4l4j20J33j05Pm8K43J4q3
5964A06k12M24k54m48L79K61r9j2j2k27K72j37j28K51j65K13l3m43K80L0K3k39
5986a70J73K86l39J87k28k87N08p0k03J90n8K08l08JJ18J44k95J07Q6k71K15j88
6008a94J87O2j50K42Rl35J28J3J55j47K12J53l69K06l52K20n1J21m30K87O3m5
6030a5P4j3p1k54L57j47N8J96j70r4J74k04J18K03j16j45K3K4j90J07K00j8j7
$$ plain form
5864 316 23 47 112 118 -83 11 22 -5 86 4 -17 135 221 115 113 111 -91 27 122 -71 134 221 -82 152 4 -63
5890 -63 22 -112 7 84 94 -56 48 254 -37 160 -114 70 -49 -55 259 221 52 -16 104 153 137 -97 -6 -147
5914 -147 -126 24 12 -314 187 30 15 -84 -44 81 -55 74 76 28 173 -114 -220 8 -11 2 75 108 55 -100
5938 -100 -50 -101 46 -84 29 95 35 -105 -95 4 -22 -9 75 24 -37 163 99 65 -55 78 -27 -20 -68 175 189 106
5964 106 -106 318 64 -384 -5 256 157 145 133 -94 178 41 -87 164 -1 212 179 -264 16 46 69 -170
5986 -170 3 289 -50 137 -91 -378 130 60 -143 47 -11 197 -111 -110 8 152 -143 -36 50 -221 -6 -194
6008 -194 -7 55 -95 147 156 -179 -51 -38 117 -30 182 335 -34 172 -180 40 -11 110 -320 -33 30 -15
6030 -15 59 46 -25 -279 78 -69 -11 185 15 -79 95 -109 9 212 96 -49 -26 -2 -192 -85 115 97 80
6053H0j25J20L8k61J52k17L54l75M62l53O8Jj3L2j81L16j05K52m39J4J91N2R9
6076A62j3k39K08k48R8J17Rlk37Q0J96p0K3l9pp8m5J26j81R3J07j29J10k17K31
6101E4N2l5j32J5Mp1M01r5p9l05l3K10J89p2p9K85l54j04k3J61j24K76l46J42
6125f3j4P9k27L06r9R4j13j00L8j3J53N3q2j48J52r7j42J58M0N2m0O8l1j22RN8
6151c1N0k57M07j28o0j34L05k51L6m3K33M5j60J15m9N4k28N5P8n4J31q7KJ85m11
6176a97K6J92l3j19K52l4o7k30L62k54j19K84k91K02j58J36J72k48k42K08M53
6197B95n68K41R4n5j10P2j71J08J27J43L5j06J00m16J63K3J68l16Q0J05J5K6Q
6220F1j55J14k16L56p0o5K4k06J02M5kj16J14MmkN3Rj63K62k55k32M27j71j32
$$ plain form
6053 80 -45 75 113 -148 4 -213 141 -234 228 -125 -57 -56 -69 -37 -218 98 -7 245 -194 -180 11 63 162
6076 162 149 -90 118 -130 -32 85 94 91 -146 -66 130 60 83 44 37 -41 -86 40 -141 -48 59 -70 40 -177 54
6101 54 106 71 -61 -46 -42 -113 288 193 114 -191 -224 -14 175 103 24 309 -45 -149 -172 -11 -135 141 -205 -63
6125 -63 -77 2 -225 81 -18 76 -37 -137 -99 -112 41 94 12 -136 16 -81 -223 -65 -25 27 -13 55 24 -98 -89 -31
6151 -31 19 -238 169 41 -19 -153 152 -99 -63 -106 127 172 12 127 78 132 -96 -41 37 -17 114 27 29 214 -197
6176 -197 -171 21 -12 -131 121 87 20 -210 152 -102 -221 63 -228 -26 -184 -48 124 -124 -366 -158 295
6197 295 -273 -32 62 7 -103 -31 -202 -94 33 176 211 105 205 -211 -48 -25 143 -173 -93 12 27 53 61
6220 61 -94 20 -196 160 90 25 49 -157 -55 -10 -12 -128 -14 -10 -14 -16 37 46 -117 145 -110 -342 85 -86 -218
6245b18J84m9k3L11j02k08j43J64P4j04Q5J15p2L8O7r6K3O3j78J98P4j11o6L3
6269E9P6m70K61R3L9P3j69L4R3k53J39Om0N3r3l5M0J5n6J80O8K46k93p3K4j49
6295a32J47j26J39J77k13N8J14k29P9j11J78k32J84j45R1pJ86j84Jr6J01J87R
6318A76j63p8o0J02L05l52O2j11O3Q4J00k16J21Q7j60M6N9p3J43j16L5Q3k06j09
6342a78n3K82J06j99q1Kn0K34o0o9K58k21o9J43j63K5k7q7J33K20l10K84J36l60
6366a04J85O8l16k1K59L8l71L02n1Q3JN3L41m67j19J60j03R4r7n4l8J16P1p1M9
6391Hk09p0L73m4q4O1j24J37j22n1J7K09K7k6j80M1J39r8O5j22q2Q7k1J40j15
6416d4J06j75Q7O6Oj95K27k9m0m0K04Kr6j62K2j0k02K88n8o1q5M9J78J22j46j59
$$ plain form
6245 -218 -34 -83 -106 205 103 -105 -248 -84 -10 -114 -29 86 14 52 119 23 46 109 -69 129 203 92 26 59
6269 59 135 -335 -74 19 58 131 -38 -4 89 -164 -25 -19 -59 -6 -99 -134 -94 -79 -135 45 113 359 66 -7 17 -132
6295 -132 15 -111 28 205 -8 50 164 -65 14 -97 81 -151 33 -112 -21 -28 158 -26 -25 -121 -20 167 176
6318 176 13 -65 -125 -23 282 -70 -8 -119 -56 28 128 -88 33 120 -40 6 65 -8 135 19 54 137 -69 -178
6342 -178 -231 51 157 -42 -123 -121 -171 63 3 -66 192 -29 -98 45 -118 -93 -120 -207 -74 146 -164 120 256 -104
6366 -104 81 149 -167 -188 71 109 -262 40 -11 72 73 126 467 0 -119 41 -62 32 -65 -119 -157 -41 30 -41 8
6391 8 -201 -271 102 58 -26 35 -89 48 -74 -125 -108 101 128 102 -78 -37 102 4 69 -53 -135 -48 -69 71 -44
6416 -44 62 -113 -26 40 46 -149 78 49 9 -31 173 175 79 -83 -61 -71 -273 15 -43 -104 -189 -140 38 160 14 -145
6442a45j3Q5K3M6j05P6n7J15J40j53j01L39j48q5J5Kr2N7J71k35j62J8PR5J85
6467G8k98L90j78O9J22J9j03j03L2j12J02q9r6J57J02l07K44j85K19k06r9L24
6489H2N3k32m4L09j62n7J0Q0J36j54o2j94O7J71O6R8j78L6l3%K20k69j27J93j3
6514do1J07K5Q4j72O6P6m8K42j06j32N5j08J48k61q0K43J54j38j75p3J07n6J20
6538A3j4P8J79j25j55lJ87J27o5j41k02L4J22n8k10J82j25K17j4j40J17q6K24
6561A42k71R5K0%m0R0n1l7K54k98J00k16J96rR1J19k2j22k44L20N9j00P5r5j80
6586a24J95J8j48L0N5M5J9l7j0O8m5k02Q6k47M93qp6k34M3Q0k70Q6L7J43n6J89
6612A30J94m81K64r1q7J04J01j96j31K31O3k5j4J22j17R0k13%Q3j56j14P0O8J98
$$ plain form
6442 -145 -158 -73 -50 -4 -109 -33 -90 25 165 12 -89 250 102 17 32 34 -58 -1 170 -65 -227 -209 -202 -107 78
6467 78 -220 170 -8 61 183 202 99 -4 28 -84 18 -71 -167 -10 92 -215 29 -156 63 -143 -242 82
6489 82 135 -97 -141 168 6 -51 -41 39 175 21 -41 -235 -168 3 69 167 -11 25 -8 -8 212 -57 -184 9 -4
6514 -4 -65 42 67 151 -21 45 121 73 315 209 77 132 24 172 -89 -169 74 228 90 -85 -158 -51 -107 13
6538 13 -1 77 256 131 -24 -27 160 287 222 81 -121 -87 35 -23 -233 -51 -176 41 27 -113 4 -82 142
6561 142 -129 -34 -14 -14 -54 36 -15 -52 202 -96 4 -212 -16 -25 66 185 163 41 -203 117 176 76 151 56 -124
6586 -124 71 89 -59 -29 26 71 90 53 43 111 66 -136 -50 -297 196 188 112 -122 -79 1 -269 -183 -146 -3 -59 130
6612 130 324 -157 107 16 -71 33 134 -62 -193 38 101 76 62 184 67 157 -56 -56 27 -129 -243 -173 -105 93
6636I3n5J04n6r6K15l08L9N6J75l39J33M3J44j88Q3j23K72j14j17n0K83j19N9
6659A34j27P0L5n9k4k80K43j36K33j62K26k99K32j13J2j85Q1n2O3J55n6p2K4P0
6683A3j04K4P2J6oL8k45L03k84j4L4j88L13L9o5L1p7L54j92o2j32J19j00J97j38
6708e4Oj3J15o1N2m2k80m5K17J78o3j17J79J1q3j68O2R3mJ21n12L99j2K1j75P0
6734a05n6J39l0j34OJL54j93J40j24j14rJ10Lj0M1j84N2J50j68J8J83l48K56J65
6759A43m37M65M2l29R6k36M8K78R7j39k88L15J34j11k74O1J01j28L08N9k8l96
6781b19J76P2P8j40q9J61J88k04j09J64L1k64R8j18J66o8r7J90lL6j55K10j37
6804c3k8m3L56j94r9N5J5J11k40J93k89K97p7k39L10j23l4j44K31M8o3M22k99
$$ plain form
6636 93 38 142 86 -10 205 -103 -64 -8 167 -172 -39 4 148 -40 43 -80 192 78 -39 -89 194 75 134
6659 134 7 77 112 53 29 -251 -8 -144 89 -73 153 -146 86 -27 -15 -200 -119 -171 -108 47 -9 -81 -57 13
6683 13 -91 -67 5 21 15 53 -192 111 -173 -187 -153 -341 -28 11 -54 -23 -100 254 62 0 -132 -13 -113 84 -54
6708 -54 -48 -61 54 -7 45 3 -277 -322 -105 73 10 -107 72 83 0 -168 -106 -13 -17 104 -408 -9 -21 0 -175 -105
6734 -105 -161 -22 -52 -186 -180 -179 175 -18 122 -2 -116 -125 -15 -12 -22 19 -165 -113 37 -131 -113 70 -278 -22 143
6759 143 -294 171 213 -116 -20 -256 -208 70 167 28 -260 55 189 78 -196 -135 -34 -162 146 205 177 -219
6781 -219 -43 29 107 -33 -122 39 227 23 -86 78 109 -155 -57 -175 -9 -77 -174 16 13 49 -106 104 -33
6804 -33 -61 -104 252 58 -41 14 29 140 -100 93 -196 101 24 -215 95 -28 -62 -206 25 73 10 432 133
6827A33j32j65J57L6Oj23J39k58L53n1j11J22j18m6Q0J23r1j51K53j06k6j95J90
6850A9K12k50J13qn8m3M0q2J66m04K88l8q0J1J48j72L62l75L06k18K67j38r3J25
6874I8q0j9J13k23N9R0k67J81k83K53n7R1K59k69m3K69k80R2M6j07l0L4J88j56
6898d1l8K71j34j91ML56k10P1J4K8k7n3j07q4Q5k09K09Q9k23J00O1J90j88n7Q0
6923dk3l6J2o3J03q3M2J39k9j5j0j2j02j07j75N68m56K56n8J30l38L24j64P3o2
6948i0l0N0K3K76j74J09j10j69k47M91J29j29j03L7Rl82M66r2l37L43j12n2J58
6971F4o4J35k73L05j29lP9l0r7Q3j21j45J24O1j69K70M6j11J07j79j70r7M13l4
6995F5R8k44R0Mp8M4M7J3J5ON5k05m2Q2J6J81k19oP4L2P1p4Q5R3j39J44k93o8
$$ plain form
6827 133 1 -164 -7 29 35 -88 51 -207 146 95 -16 106 -12 -58 22 145 54 -97 156 50 24 -171 19
6850 19 231 -19 94 86 28 -15 25 -57 109 -295 -7 -45 -125 -114 34 -138 224 -151 155 -63 204 66 -27 98
6874 98 18 -1 112 -111 -52 38 -229 -48 -331 -78 -135 -44 215 -54 -97 172 -108 -16 30 -77 -107 -73 115 -41
6898 -41 -79 192 58 -133 -129 227 17 88 102 130 103 50 -57 -141 -56 -265 -56 33 -190 -90 -29 161 -27 -84 -4
6923 -4 -27 -63 -51 -114 -11 -94 -52 87 58 43 33 21 -81 -188 -363 205 -251 5 -53 77 -261 63 -101 -28 -90
6948 -90 -120 -70 -47 229 55 164 54 -115 -362 129 258 129 26 63 72 -310 156 64 -273 70 -42 -94 64
6971 64 0 135 -138 167 38 35 114 84 -13 70 -51 -196 -72 -11 -180 90 136 25 132 -47 -217 -314 99 65
6995 65 163 -81 9 13 -65 -21 26 39 54 60 115 -90 -132 -50 -34 147 -72 -78 -4 28 99 25 110 203 64 208 -85 -153
7023a53O3R9J27j21j25n5J34L09k16J5j03P5j4Q2p0M2l79K30N1j05M7l13M26j02
7047e6M1m9R5J61K2l47K82p0l58K23J14MQ7k43J5L08l79l6J27j93J21R0k2K1L00
7072B58k50j66K76n3p6l3Q1j18J29k29L37n3k63K11l0J27j08k11j05K47n0K18
7094A39m7J44k14q5J5J18j06Q6L7m1L2J7j36J17Kj86M2k0J90n3m6M6J18l70L01
7119A00P4l16L38k91K71k53N4j94K48N4j43K37k82J09J02J33j78j37J10j26n6
7140a46J77l3M8j34mK37r0K25l34M7J15k28J76q8q5m1J40J14k00J56l6Qr0P0J39
7165A43K9l29K58J76k30Q0k62K31M2j66p9J74Pl38J03K04J04m58L70j31jJ43K1
7188I1q2K12j98J75m27K45J9J28k80K72k57O3J65k5R0l67K8K30l68O6J36NP9k4
$$ plain form
7023 -153 -90 9 136 15 -110 -165 -31 278 62 77 -26 49 35 117 47 89 -290 -60 -9 -114 -67 -380 46 -56
7047 -56 -15 -64 31 192 214 -133 149 79 -279 -56 58 62 149 -94 -79 229 -150 -186 -59 -252 -131 -41 -63 -42 258
7072 258 8 -158 118 65 -11 -44 37 -81 48 -181 156 103 -160 51 21 148 40 -171 -276 -29 -79 139
7094 139 92 236 22 -63 -48 70 -36 50 87 46 78 95 -41 76 78 -108 -66 -86 104 51 5 51 169 -201 100
7119 100 174 -142 196 -95 176 -77 -23 -217 31 85 -58 179 -103 6 108 241 63 -74 36 -90 -146
7140 -146 31 -2 46 -88 -92 145 55 280 -54 -7 108 -120 56 -32 -117 -158 -18 96 -104 52 16 24 -66 4 143
7165 143 172 -157 101 277 47 127 -135 96 138 -28 -107 67 74 -264 -161 43 147 -311 59 -72 -73 70 91
7188 91 9 221 23 198 -229 16 35 163 -117 155 -102 -39 126 101 191 -176 -148 82 -286 -220 -84 -79 0 -24
7212b4M7k36K40k7J12j15j05O6j22q6P4J5K98j0J07l08K21k88J68p5l4J5Kr4K92
7237A33N4j22K19m84K40j64J11n8L8j25L71l37K0O3J79j22O8R2l16N32k75Q3l39
7260a39J7L36j16P3n4o0J41l19K44j42J55k84n0J76j47J81k8RM9p0J29o8j1N7
7284G9j94K09r6L3J7on8K14L7n00J85q0J24jj09J81N5k31L43j46j94J48j48J49
7308A1n7R3l41L54p6p2K42m17J92K85k17j68LJ20J49k50K27j67L51k61J43k3j89
7331f8J96j11l5J57j27Rj25K30k78K14rl37K16l5K58M8j66m9J60m3j54qp1J6K60
7356A48l09L37l29J27M6%J55j37k85L93n3J85m10L31j07l03K54J5j4r3r6m0L02
7379A17j98J56l52J09O1J40O6k16j2J56j34L4J0J75j97K34Jp6k39n3L20M8j26
$$ plain form
7212 -24 23 -213 27 0 112 -3 -108 -42 -164 -250 -176 -161 137 127 234 -74 147 -141 27 -48 -82 -67 -65 -159 133
7237 133 187 65 284 -200 40 -124 -13 -71 -33 -158 213 -124 -104 -41 138 16 84 176 -140 392 117 200 -139
7260 -139 -122 214 98 171 117 57 198 -121 123 -19 136 -148 -198 -22 -169 12 -16 -7 42 -28 101 33 22 79
7284 79 -115 94 -2 31 48 42 -16 198 235 -265 -80 -160 -36 -37 -146 35 90 -141 202 56 -138 10 -138 11
7308 11 -46 47 -294 60 -16 -88 154 -263 -71 214 -3 -171 -168 -48 101 -149 78 -89 262 1 144 121 -68
7331 -68 128 17 -18 139 12 21 -104 126 -152 62 53 -284 -68 -103 155 203 37 -12 148 105 -49 -57 -128 -112 148
7356 148 -161 176 -153 -26 20 20 175 38 -247 146 93 278 -132 199 92 -211 43 58 44 -49 -145 -185 117
7379 117 -81 75 -277 -168 -107 33 99 -117 -129 27 -107 -73 -63 112 -85 149 150 74 -165 -218 102 150 24
7402B4rJ71k43K44k00n5R3R6q2j70K53J0k37J95j66K46j82J52L4j84k3j51O6J42
7426B4p6O4n8l9Q5j89K16J02m5L5j69Q2J5R5m28K57j94n6J62R5j45J72j41j3N0
7451i9L05k19k7J89j81J62j64K00l53K44j37K03K8q7r2J40j51L9R5L9o1j25O0
7474Hl6p0J47qj49pJ65pn0R2j73L2M1k22L56k28J08J37j57J71l35K83m61K75J69
7499H1J29l05m6K33j63jJ15q5L5J74l51M76n4k63J36j65J51J28l08L97l30R6L0
7522A10l20L08j28J47j63O7m3J42k1n2j19j24K8k7K64J45j13j39Q3P2j68j00n1
7545b02K45J45j0k23J80p4K03k05J31k76J21j71K12m8k90M13m00L66j37J1R9J8
7567A08r6P6p9M8Q7k1k82J69J73k7j26J02K8j71J08k51R1J42l1oK01m67O1J46
$$ plain form
7402 24 15 186 -57 187 -13 -68 25 121 39 -131 122 132 -105 90 -76 170 -12 140 174 -10 -33 -184 -118 24
7426 24 -52 12 -46 -85 0 -189 27 129 84 119 -50 32 47 142 -286 -29 -223 -279 -117 -22 -167 5 -136 -149 -99
7451 -99 206 -13 -40 149 -32 130 -34 166 -187 57 -80 123 151 64 -28 112 -39 0 95 134 73 -52 8
7474 8 -28 -98 49 41 -108 -115 50 43 -7 85 -88 -56 -15 -237 119 -109 -1 136 -21 150 -185 98 -363 -88 81
7499 81 210 -95 -141 92 -71 -72 43 -42 -7 167 -184 292 238 -25 111 -54 97 225 -83 314 -16 80 110
7522 110 -210 98 -30 117 -46 21 -22 120 99 47 -72 -196 -168 -195 69 214 101 -38 45 117 -51 -151 -202
7545 -202 43 188 178 -45 135 61 264 59 190 -86 35 -136 76 28 -262 151 -249 117 -20 -9 90 108
7567 108 12 88 9 57 144 123 -159 10 183 156 30 132 160 -11 97 -154 -63 79 48 42 243 -224 -163 -17
7591a7KJ69r8j26k29J98Q8l9J47k0r0J76O5n8o4j94o8l1R6K41o4k25K01j2mk7
7617A7P1k46p8L22K00k95j92L06O5l72J88jp5L20j92p1J61j93J03j7J11o9j13
7640e0K3R7P6j05L2l56K37J73r0L4l5m8J64l59J51K03k77J47m8Nk3J71l28J33
7664g3M0J55m11J23L14j38j4j37J28j4P9J05k26n5J18o1k9K6K34P7k92K38j96
7687io6K9J36k18P3L2o0pJ80j80J93k7j73L99l50M6P4r0J53R9j43k00J73k7J69
7712B06k83j19J64K3j42jR2J79n8Poj55L4J46q8j02Q4jJ61r0K25l45J9O6j01L5
7738e0J07J58k61Q1n5M2r2R8j76M27l02j87QJ28l8J87o1n5j21J65L1P9J36k40
7762Ij98J75O7Mn5k3P1q0O1n0o9K56j18j62K50k30P7K07j68J62k48J65j21K0k27
$$ plain form
7591 -17 -15 154 56 -70 -299 -101 -13 -52 95 75 -15 161 226 168 104 -90 -158 -189 -93 148 84 -141 60 48 44 17
7617 17 88 -158 -236 86 286 -9 -201 105 170 -202 -14 -15 -90 230 38 -33 128 -65 38 21 132 63 -50
7640 -50 -27 70 146 41 73 -283 -46 127 37 71 36 -12 152 -207 -56 147 -130 17 -31 -26 -49 122 -206 -73
7664 -73 -33 122 -289 -166 148 10 -4 -141 -13 -27 52 157 -69 -124 -6 -67 -96 -70 164 241 -51 187 -9
7687 -9 -75 -46 90 -128 -55 -23 -83 -90 90 -90 103 76 -97 302 -48 -2 72 -18 135 234 91 -109 64 37 206
7712 206 -77 -196 -32 -9 -151 -152 -60 119 61 68 62 -93 -59 87 -1 -103 -19 -20 141 51 276 -69 -50 16 -85 -50
7738 -50 57 215 -46 35 -20 22 -70 28 -148 279 -23 -210 -202 -74 -112 75 14 -41 -162 3 34 113 249 9
7762 9 -189 -14 53 57 2 -21 50 -30 31 -19 -88 168 50 -112 138 -92 -15 192 24 186 -62 103 -18 2 -225
7787b25J62nK21n7k15R0o2J39o9q2j43J46O6K6r4ML14l35K36j37J27p6k57K69
7811D3N1k11J98k52K69j93J23L0J51k80O0L0J36J3p0o2RK03k83M9J32k68J1K52
7835A41k96J31J7j3J27j31J12m5j94J12J41k68kj3K51J78j30l6M6k71J11K64l78
7858a46r1L60J65k27n4K3m5R8j60kL0M9M5J74j83k3q4K44k17N4k18K27j8Q8j08
7883a9k64L71j48K94l24J74q2l6P4o3J29O2k33J55J7r4K75n31M35k38J23j93L65
7906B49j02j82J41l87P2J95O7K3k68L7p0K15J5j97K29N3j21k8J01q6j56K40m7
7929gR1R3k32J39j62J93k64l0K20rO0L4r7J07p5P3J04p6k27p1l5P5nJ56j40L2
7955e3Q1k43K07p0L43l36J25l69M65j58j79M3K78j24K0m8K2J8pJ46j16j10J36
$$ plain form
7787 -225 -63 -68 153 96 -119 -29 -91 48 -21 -103 -246 -100 -34 -8 -102 -98 216 -119 117 -20 107 31 -226 43
7811 43 94 -117 81 -171 98 -95 28 58 209 -71 -11 19 155 168 98 36 45 248 -35 14 146 -122 -111 141
7835 141 -155 -24 -7 -20 107 -24 88 43 -151 -39 102 -166 -168 -181 70 248 118 82 128 -143 -32 232 -146
7858 -146 -237 123 288 61 7 30 -15 83 -77 -79 -49 0 45 219 36 13 -71 173 -44 10 -208 19 1 89 -19
7883 -19 -283 88 -60 234 -90 84 2 -34 40 -23 106 168 -65 90 107 13 288 -243 192 -46 77 -116 249
7906 249 147 -35 106 -281 -209 -14 53 76 -192 -155 -225 -10 5 -192 37 90 -31 -59 42 -44 -200 40 -7
7929 -7 84 177 -55 84 -78 115 -149 -179 41 32 92 126 29 136 61 134 238 162 -65 -136 -171 -96 -101 55 -85 -53
7955 -53 28 -215 -8 -78 265 -71 54 -315 150 -8 -187 -144 134 10 30 -18 4 22 15 161 45 -65 71
7978G1J9o4l5P2R2k32N0R6M4k00J54p6O6nj04k0K3M0p3J70p7j44K32k13L8L24
8004B48k16K18j34P0j07j15K14l31n6K64L2l4m1j93J05K87q0j63J30n9No7K8N1
8028E6J07j47l48L24j30l3K47J21m1j01J25J16l98K25J11k75j15j9j93N23l25
8049a70m8J06p0J73J2J51l34J44K35q0N5k08rj47R4R8J66o4q4j59K37j99K40l44
8073b05J45O3n5K04k59K23R5k80M1o4O9K19q1k66K26j38R1o2L3K0J79j26j11m2
8097h1L07l71K02L5l22K81LJ00j20j09J87k56K51l4j26m1J81M1k85J12N4N0l16
8120b57K20Q6m5n6j99R6L18l07J35%Q4j51K8%MK50j81K49m35K92k87K46k29J81
8144D2Ql0Q1r4J1l7q0O9J75j0j49J18o3j6j80J46J88j94K1J00k5k47J87k26O1
$$ plain form
7978 71 90 26 -9 63 155 -77 -27 69 113 -87 67 -9 57 52 -52 -72 -49 -9 -82 88 11 -133 99 -114 -76 248
8004 248 32 250 116 186 79 -36 178 -153 -209 55 87 53 12 -181 -76 211 131 -32 98 39 44 -23 5 56
8028 56 163 16 -332 -8 -138 -171 76 197 156 55 180 296 -102 123 234 -41 -156 -175 -368 155 -170
8049 -170 -218 -112 -182 -9 3 154 -180 -36 199 119 174 -34 -43 -190 -96 2 168 104 20 -139 98 -101 139 -205
8073 -205 -60 3 -52 152 -107 116 211 -69 -28 -92 -23 196 115 -151 75 -63 28 -34 -1 19 198 72 -39 -81
8097 -81 226 -145 57 92 -230 51 54 154 34 -75 112 -144 107 73 -53 -94 87 128 -157 -45 9 59 -257
8120 -257 -37 49 4 -52 -251 -155 163 -144 -9 -9 75 -76 -48 -48 -44 206 25 274 -161 131 -156 90 -139 42
8144 42 50 20 101 7 18 -19 -99 -30 145 135 -14 104 41 25 -155 -9 179 -15 6 106 81 -166 21 -205 -144
8169a44L07p7j56j45K61K1j5l46L32p1k02O8K35J27j38l1j06K5J17j8j74M03
$$ plain form
8169 -144 163 86 -70 -215 46 67 52 -294 38 -33 -235 -167 68 195 57 26 -80 -55 62 44 -130 273
8191B73
$$ Imaginary data points
##PAGE= N=2
##DATA TABLE= (X++(I..I)), XYDATA
0@%%%%%%%%%%%%%%Qj6J6j6J6k2L0l2L6m4N0n8P1q0Q9j04J20j37J54j75J99k23
36a18K51k82L15l49L88m34M82n30N85o48P14p87Q67r56J053j160J280j411J560
55H20j728J920k143K401k706L077l534M111m874N931p486J0004j4756K6662j08837
70i1138j81925L19584J83586k20308j78595J34679J20700l5308m6718k6840m9591
81g1874O4492J30319n6773j97488K8315K17618J3684k10783m7057J65588O7814
92A03855j04400o4868L4128M0684K6503j828p0396l8877R1711O9541r2076p8581
104h4604P9667O9013n9610l4499M2906r094l2083N7297L1085r5826l8685J16915
116D2482M5037j22361m6282J09643L4716q9166j0663O3656k5879m5070O7277L5906
$$ plain form
0 0 0 0 0 0 0 0 0 0 0 0 0 0 0 0 8 -8 8 -8 8 -14 16 -16 20 -24 26 -32 39 -41 48 -56 64 -73 81 -94 105 -118
36 -118 133 -149 166 -183 205 -229 253 -277 308 -340 374 -413 454 -502 551 -609 671 -740 820
55 820 -908 1012 -1131 1270 -1436 1641 -1893 2218 -2656 3275 -4211 5793 -8963 17699 -91138
70 -91138 -273063 46521 230107 9799 -168796 -34117 86583 51275 4557 -22283 -71874
81 -71874 -7382 122937 66164 -131324 -103009 114609 128293 -82490 -129547 36041 103855
92 103855 -545 -65413 -31285 9399 35902 34074 -36322 -75199 16512 86053 -6023 -84604
104 -84604 -4937 64076 4466 -30033 12873 3779 -28304 28993 60078 -35748 -74433 42482
116 42482 87519 -34842 -81124 28519 63235 -25931 -36594 27062 1183 -43887 23390 59296
128E9296j06107l6392J31321M2135j40809m7457J32590N0403j05926m0784P2783
139A1053K2820l5954N405O603l5593J4112O2098k3477q2106K1796Q8175j6094
151C8838q1912Q013O4135m238m0235L680J1836r154J2820J5853l3463k1999M6112
164A0286K4357n1504j8897N3056J1295m9287L531M6772j7826m2910L0301L9489
176C8663l8049l4369L9903K6638l7811j4815L1632k781k6091K1817K1499m2419
188a6183k2783N7250K5796o6632l1467O6115L5511n5965l4519L9436K8283j7854
200F988j2828j514m947J7599K6183k4518m4982K4562N7640j7713o2142P678N6566
213B8572K250m3031r086K2265R206r57n523k0365m063L4528J4058m3010k3491
$$ plain form
128 59296 -46811 -83203 48118 90253 -50556 -98013 34577 84980 -20946 -61730 11053
139 11053 33873 -2081 3324 9927 -25666 -11554 50544 27067 -55039 -33243 54932 38838
151 38838 -43074 -35061 29074 24836 -15399 -11719 117 -9037 3783 19636 -13827 -35826 10286
164 10286 34643 -16861 -35758 17298 28593 -20694 -17163 29609 11783 -31127 -826 38663
176 38663 614 -33755 6148 32786 -5025 -19840 11792 9011 -17080 4737 26236 -16183
188 -16183 -38966 18284 44080 -22552 -54019 12096 47607 -8358 -42877 -3441 24842 6988
200 6988 -5840 -7354 -12301 5298 31481 6963 -38019 -13457 44183 26470 -35672 -27994 28572
213 28572 30822 -12209 -21295 970 10176 9219 3696 -16669 -20732 13796 27854 -15156 -38647
226c8647M3765K8989l7031k8305K8503K3268j7189j2605Q671M20j774J2814j038
239I841k2680J666K9431n86l0992m36K8877o45k4719K306J7103p430j1410J1769
253B095M378j6592M1J8933l395j9047N592J7810p182j2967R448P836j0118j488
267d656J2665l543j3741Q627J5242j0890j5565J2425J4609j2728j2292J0918Q064
280I135j0017l761P102k560o025P725L440j2984k122J6394J638j8281q94J8428
294G218R78j5530l63J2314K01o928J322K714k401K417N784o455q032R104J0279
309A2622j0716j2587J0187J1444r568j0891O834P606n133m012L164q93j448N021
323A630O30q970N41J0882J0j1305O47J1114O60r117K69P682j63m701J032K301
$$ plain form
226 -38647 5118 34107 -2924 -31229 -2726 20542 3353 -9252 -581 -161 -1935 10879 9841
239 9841 -12839 -11173 18258 17672 -13320 -13756 15121 14476 -10243 -7937 9166 1736 -9674 2095
253 2095 6473 -10119 -10078 8855 5460 -13587 -7995 9815 2633 -10334 -886 6950 -3168 -4656
267 -4656 8009 4466 -9275 -648 14594 3704 -11861 564 15173 2445 -9847 1071 9135
280 9135 -882 -4643 2459 -101 -6126 1599 5039 -7945 -10067 6327 7965 -10316 -11210 7218
294 7218 8196 -7334 -7697 4617 4818 -2110 -788 1926 -475 1942 7726 1271 -6761 2343 12622
309 12622 1906 -10681 -494 10950 1382 -9509 -2675 4931 -202 -4214 -1050 -1943 -3391 1630
323 1630 2260 -6710 -6169 4713 4723 -6582 -5935 5179 5839 -3278 -3009 4673 4510 -191 841 3142
339C142k400J5K865k219m894L848M255m956n584N572M432n974m087N216K503m181
355b447j190L115l26j361K289O56l084O08N114l71m607K91N298N33m494n08K973
372B489J42j813Q40q41k666J000L963k084n807J588N985q67n509j182L546J996
388G80j058k221j747K043M810L13n114j954N239N292k794o630L2O605L652n152
404B096o209J075P618K685p405p612N166R616k002j0567k618Q646M271m317o168
419e725o42N224N833j890q463k527R895Q217p606j1474M231J3867J134j3064n480
434h470J0083Q425n240q472n34N220M582j242o460n312M979R336j612j2741l732
449a1190J2299Q624r255j2717M922J4050P43j1718l696P711N954k359m207j742
$$ plain form
339 3142 742 757 3622 1403 -3491 357 4612 -344 -5928 -356 4076 -1898 -5985 -769 1734 -2447
355 -2447 -3637 -522 -848 -2209 80 736 -2348 -1740 3374 3003 -1604 -1313 3985 4518 24 -484 2489
372 2489 2631 818 1658 817 -1849 -849 3114 1030 -4777 -3189 2796 1929 -3580 -4762 -1216 780
388 780 -278 -2499 -4246 -2203 2607 2920 -2194 -4148 1091 6383 3589 -3041 -3009 3596 7248 2096
404 2096 -4113 -3038 4580 7265 -140 -7752 -2586 7030 5028 -5539 -8157 489 4760 443 -5725
419 -5725 -6367 -1143 4690 2800 -5663 -8190 1705 9922 2316 -9158 -4927 8940 10074 -2990 -8470
434 -8470 1613 10038 4798 -3674 -4208 1012 5594 4352 -2108 -7420 -2441 6895 5283 -7458 -11190
449 -11190 1109 9733 478 -12239 -7317 6733 7476 -4242 -7938 -227 5727 3368 -839 -2581
463b581J059M662M181l890r584J171J2613L542j4133r153J3326J2482j0836j4753
477a1894N666J2899k383q895m32L393m0K201L247o250p737Q801J3325o884j7667
492a2650L471K0849J972k0158o566J7531R101j1509r084N493O029j234r32j858
506D55n570N49J0323K917j3923q515J3016J3815j0471j7589N201J9112Q58j7486
520g308m891J4361O661q725m900M941J603k011M021K060r280m590J4012Q256j5912
535a702j2599J4547J5900j2538j7498P782J6246n024j3039K913P302l249k395
548c354O199j765j0423M356J5389k952k0053R64K2333L479k0111o968J6451R643
562A3188j0384r874M040P953L98l289l098k156J190O331J569r727p091J0315J2232
$$ plain form
463 -2581 -1522 3140 7321 3431 -6153 -4982 7631 11173 -2960 -12113 1213 13695 2859 -11894
477 -11894 -6228 6671 4288 -4607 -5039 -1646 -1686 515 3762 -2488 -10225 -1424 11901 5017 -12650
492 -12650 -9179 11670 13642 -6516 -13082 4449 13550 2041 -7043 -1550 4479 3245 2313 455
506 455 -5115 -4566 5757 8674 -5249 -13764 -748 13067 2596 -14993 -9792 9320 10178 -7308
520 -7308 -12199 2162 8823 98 -4802 139 1742 -269 3752 5812 -3468 -8058 5954 14210 -1702
535 -1702 -14301 246 16146 3608 -13890 -6108 10138 5114 -7925 -5012 2290 -959 -3354
548 -3354 2845 1080 -9343 -4987 10402 7450 -12603 -11639 10694 14173 -5938 -12906 3545 13188
562 13188 2804 -7070 -3030 4923 5321 2032 -1066 -3222 -2032 4299 5868 -3859 -10950 -635 11597
577A1597q272j7095M264J8861P64j7986n541J5608Q919j1108r065O901P667k365
591C149l725J048j032j098O220L083j0141o161J2336Q929j2570j1949J0693J2543
605A1325q797j2480N446J0316l538p319K346L727k562q67L873q26n136K016O983
620D507j302o965L74P068J270n522k052M027K904k816k487J333Q66m78p96J108
636A039n85k579N13L374j062m495l08N563J337n464k672N021L750l932l628L506
652f22L868k580j794K016P57k192J751K316k927k588L948K800m815l195M009K939
668C691l702l021K273K521k150k103R83J675j029p73L92N62J05l47M24K10K93
685DK74J67K6N44R80j195q49Q58J314m15j498j57N96Q72r23j786k05K150N44k365
$$ plain form
577 11597 3325 -13770 -9506 9355 10119 -7867 -13408 2200 11119 11 -9054 -2153 5514 3149
591 3149 -576 472 -560 -1658 4562 7645 -2496 -8657 3679 12608 38 -11911 -1218 11325
605 11325 2528 -9952 -4506 5810 2272 -5047 -2701 1026 -1536 -2403 1470 644 -4492 -2476 4507
620 4507 3205 -3760 -3386 3682 4952 -570 -2622 1405 4309 1493 -994 339 1205 727 -69 1039
636 1039 454 -2125 -1612 1762 700 -3795 -4103 1460 2797 -2667 -5339 -318 3432 -500 -4128 -622
652 -622 3246 666 -1128 888 1645 -547 1204 3520 593 -1995 1953 4753 -62 -3257 752 3691
668 3691 -11 -3032 -759 1762 -388 -2491 -1508 167 -862 -1635 -1243 -681 -576 -923 -499 -289 4
685 4 278 445 471 1015 1995 800 -49 809 2123 1708 210 53 649 1521 598 -1188 -1393 757 1301 -1064
705a064j873J377K676r22l167L18L060N21j928j185J320J816N43j552j142J424
721B22K328k55k903l07K971J076k354k212J405K108l40k307j087J208J604j159
737bk356J66K146M27j690j177R00K261q6j867m04J827J142r90j016Q44J458M9
755A632o65j003Q98N87n0j006k92N87R9n29p38J14L75k80o45k63K14M22n70j04
775a217P8O56R0l3K89K25j50J64J45N45K05k30l17L43N57o39%Q6n2K2o29j54O2
798D6q6k39m65j29K21J36l67m14L46N22l82r8K15O60J44m70M52N82j52N5M4K39
820H60j67J54Q9l86J91J98k65q88jP79l70r16n79J296j57p46m95M13M78K05m19
841g26l22J46R98M06r77m38J331J274j383o76J114Q70o81k48J15o7p9J95j65j430
$$ plain form
705 -1064 -2937 -1560 1116 194 -2973 -2655 405 926 -1002 -2187 -867 949 1492 -60 -1202 222
721 222 2550 2295 -608 -915 2056 3132 778 -1434 -29 2079 1739 -568 -1655 -447 1157 -2
737 -2 -2358 -2192 -46 381 -1309 -2486 -1586 675 589 -1278 -1682 145 1287 297 -719 125 1583 1632
755 1632 967 -36 862 1449 1399 393 101 688 787 258 -480 -366 9 -271 -916 -1179 -965 -543 -1113 -1217
775 -1217 -1139 -483 -393 -426 -137 88 -62 102 247 792 997 767 450 793 1350 711 711 797 745 767 138 -16 46
798 46 -40 -279 -744 -873 -652 -516 -883 -1297 -951 -429 -811 -909 -694 -34 110 -360 92 674 522 577 621 860
820 860 693 847 936 550 741 939 674 -214 -215 564 194 -722 -1301 -5 -162 -908 -1403 -990 -512 -307 -726
841 -726 -1048 -902 96 502 -475 -913 418 1692 309 -367 747 1617 936 688 803 736 657 852 687 -743
861g43L70J064k38j817l0J163N40j495j78O99j0Q0K6k71k36J062R61j021p44J252
881D34R89o16o40Q08P0n29L7J425j664j336J511J571k084j723J789J225j662j537
899a932J423R59k149K45J684o45j742J530K280j953k037K313K201j528k123J923
915D49J586j086j077P81M06k19j40j5q4q31K23O35l51j243k1O81O87p85j267m8
935a719K001M74k485o32K871J203l053l47L350k5k933J216L026j909l353L211
951H96L447m041l983M524L931m828m017M586L311n094k619M619J182m475m46M778
967A771o17m943J855M903k092m246J972M723j521m073J277L406n32k864N62K122
983A703m06j218J85J145n17j505M94J382q98j926J4K618L22l696r47M339J204
$$ plain form
861 -743 -373 691 453 -1364 -1394 -231 309 -1186 -1364 -665 -675 -595 -569 -840 -1076 -14 947 -74 -818 434
881 434 1423 807 167 975 1045 516 553 1978 314 -1022 489 2060 -24 -1747 42 1267 -395 -1932
899 -1932 -509 450 -1699 -1454 230 -415 -2157 -627 1653 -300 -2337 -24 2177 649 -1474 449
915 449 2035 949 -128 653 1059 840 700 685 601 -230 -7 628 277 -966 -987 -306 381 -404 -1671 -1719
935 -1719 282 756 -1729 -2361 510 1713 -1340 -1687 1663 1638 -1295 -79 2947 1038 -2315 896
951 896 4343 302 -3681 843 4774 -54 -4071 515 3826 -1268 -3887 732 1914 -2561 -3007 1771
967 1771 1154 -3789 -1934 2969 877 -3369 -1397 3326 1805 -2268 -991 2415 1883 -981 -419 1703
983 1703 1297 79 264 1409 892 -613 -119 1263 365 -1561 -1547 1071 1393 -2303 -3250 1089 2293
1000B293m533j705N372J427n575l30N736k16n767J895O066k951n875M234N695
1015E766m929n613N333N361n511m928N110L591n139k856N061J595n538n35N227
1030A995l28n522J178N568j567m772J274M541p66l664Q53K922m68j229J96N75
1046G86J59rj78l25O43o05q52O63J400k292j685K891J911l963k431M712K100n030
1064b105k329N386J933n420q17N692j21n018J208M991j968m930L414N015m072
1079H59m514M645L547m772l074M541K228m414j283L743j69l908R88L664j890l109
1095b918K346K231k523j548K179J103j669K16J238o10o91J773k64j788J047J851
1111A973r80j843J654J016k011o41K285k79k888R73K618j941k770K407K392k912
$$ plain form
1000 2293 -2240 -3945 1427 2854 -2721 -3051 2685 2469 -3298 -1403 4663 1712 -4163 71 5766
1015 5766 837 -4776 557 5918 407 -4521 589 4180 -959 -3815 1246 2841 -2697 -3232 1995
1030 1995 1667 -3855 -2677 2891 1324 -3448 -2174 2367 1601 -2063 -1210 1712 1244 15 211 786
1046 786 945 936 758 433 1076 471 -381 282 1682 -610 -2295 596 2507 -1456 -3887 825 2925 -2105
1064 -2105 -4434 952 2885 -2535 -3352 2340 2219 -2799 -1591 3400 1432 -3498 -84 4931 859
1079 859 -3655 990 4537 -235 -3309 1232 3460 -954 -2237 1506 1337 -2571 -1583 2081 191 -2918
1095 -2918 -572 1659 -864 -2412 -233 870 -799 -583 655 45 -646 1127 863 -925 122 1973
1111 1973 993 -850 804 1820 -191 -832 1453 1174 -1714 -741 1877 -64 -2834 -427 1965 -947
1127i47k293L527J543l515q51L871o04k810J072L456j620k854K363K704l358j679
1143a995L669J236l597p19L579l98l468J286K776k454k230K558J391l221n96K804
1159F21L0l224J305K620j896j734K014J964k748o53K870L06k342O40K270j069
1175I74k032J673J554j991j203K425M03k991L71K068p24k328J382J622k054j520
1191b371K544P55k652j47K886m89k567J698K078j667j513K228J266k809j67K914
1207A987n92k670J145K494j834j754K003J266k299j223K329m4k393L85J918p86
1223f8j934J259K075k263j141K149J169k363k47K412l36j542P99J470r89j024
1239e74J864O51k286q8K067k85k231O16J871j361j690J624N98j578n30K022n91
$$ plain form
1127 -947 -3240 287 1830 -1685 -2536 1335 731 -2079 -1007 2449 829 -2025 338 3042 -316 -1995
1143 -1995 1674 2910 -687 -1406 2173 1775 -1693 -407 2369 -85 -2315 243 1634 -1587 -2183 621
1159 621 651 -2573 -1268 1352 -544 -2278 -264 1700 -1048 -1701 1169 1475 -867 -227 2043 974
1175 974 -1058 615 2169 178 -1025 1400 1803 -1188 -817 1251 527 -1801 -419 1203 -851 -2371
1191 -2371 173 928 -1724 -1871 1015 526 -2041 -343 1735 68 -1445 783 2049 -760 -927 1987
1207 1987 1395 -1275 -130 2364 530 -1224 779 2045 -254 -1477 852 808 -1585 -1200 718 -68
1223 -68 -2002 -743 1332 -931 -2072 77 1246 -1117 -1364 1048 712 -830 -31 1439 450 -574
1239 -574 1290 1941 -345 -433 1634 1349 -882 -266 1605 244 -1446 178 776 -802 -1332 690 99
1256I9j914Q20K011j289j697J586J538j797n97J708O56j688K59J858p78j411J105
1273D69J339j363j350J812P45k047n52J817j11k068O90J318j198j111J308R27
1289F25j696n44J654Q6j449M93J568n91j067R95J207j300k24J117K27j250k5J151
1307I77J00j624Q40N14p74l63O25J8j075L37P90q28r46P81R38q85p94J152K94
1326G7n56M0J174n15q20M24J353r40n24Q31O00p25n22J095J59j435L80O85m64
1345C17r60M69N48p06n83N40L42p35j80O33J79m89o9L11K48k08o1O64l37M0N63
1366E26k2j11J49P4k21J49J11k12n89J81N58o20l58j08P98n67l57J3P10n62j9
1387d77N9kk09Q3L27J73j89L4M65L7J7k90P18K01n80k76M54K65k17n17J06M30
$$ plain form
1256 99 -1815 -995 1016 -273 -1970 -384 1154 -643 -1240 468 1124 -564 -305 1553 775 -636 469
1273 469 1808 445 -905 907 1652 -395 -947 870 759 -1309 -619 699 -499 -1610 -302 625
1289 625 -1071 -1615 39 125 -1324 -831 737 146 -921 74 1281 -19 -243 874 1101 -149 -174 977
1307 977 1077 -547 293 807 33 -330 295 313 -762 -425 365 -463 -1409 -628 310 -575 -1369 -217 77
1326 77 -479 -439 735 220 -600 -176 1177 237 -287 544 1144 419 -103 992 1151 -284 96 781 317
1345 317 -643 -174 374 -332 -915 -375 -33 -768 -948 -315 -136 -625 -694 -383 -135 -343 -404 260 -77 -37 526
1366 526 504 393 542 616 395 544 655 443 -146 35 593 -27 -385 -493 305 -262 -619 -606 104 -458 -477
1387 -477 -418 -420 -629 -546 -219 -46 -235 -201 264 301 318 28 746 947 367 91 545 810 593 76 182 612
1409F12o15j08M8J21n57l40N01N29p09o82R96K33r53j51J239P7o56k07J024L23
1429G25p57j05P85J28k99k83L89K89q51k29O76O1p03n70J251k08j107j72J145
1448A65J96j490K1R28M84j061J0J313K5j281L16J249p6j634L84J802j10j789M61
1467h7J889j041j730R73J430j223j438J041J152j030j212J027Q58r80r87J066
1483b92R73j216o33R07R16j202n77J326R00j032q59J144R01r33j010J229N11r13
1501A40n75P66Q83j148r28J086P59j416r41J522Q45j822q98J837N54j899k80J841
1519C26M52j814R9J684J32j966N34K203q76j697Q79J562n75j798Q83J365o54j586
1537h47P17J118r77j047R25Q78j088o71P37M51o82n51R55K15m34n58O74N80m93
$$ plain form
1409 612 -3 -111 -63 58 -499 -839 -338 191 -518 -1200 -204 29 -924 -1075 164 241 -415 -622 402 725
1429 725 -32 -137 648 776 477 194 583 872 21 -208 468 529 -174 -744 507 299 -808 -980 165
1448 165 361 -1129 -1108 -180 304 -757 -747 566 591 -690 -374 875 799 -835 -451 1351 1241 -548 -87
1467 -87 1802 761 -969 4 1434 211 -1227 -186 966 -64 -1276 -249 609 -371 -1358 -292
1483 -292 681 -535 -1168 -261 655 -547 -1124 202 1102 70 -789 355 1256 323 -687 542 1053 140
1501 140 -435 331 1214 66 -862 224 983 -433 -1374 148 993 -829 -1727 110 664 -1235 -1515 326
1519 326 778 -1036 -937 747 879 -1087 -553 1650 774 -923 -44 1518 943 -855 28 1393 739 -847
1537 -847 -130 988 11 -1036 -111 767 -321 -992 -255 196 -486 -1037 -82 133 -301 -859 -185 395 -98
1556i8k72M88N16k04o40L15Q49l58p24K46J115n05j460O52Q46n77j223R14J026
1575I06j622q24J688O02j664m24J507Rj339J86J614j07j438N10J599q58q94O83
1593A34J218r39q99J303N48j120n58Q52J99j007m6N55j21q18N00J90l32n18R64
1612A05l35m58L69J59l13J36O16k35j75K90N19p91j74N61M74o10k01R03q3j049
1632b92K99P98o98n29O29M87j172o87J495Pj421j26J341m6q03K55J036p49q48
1651a024R80N30n36n07R04N45j107k2J001k3p24J7R48n79p37M62N35j113n8Q36
1671C28j84r74K48N95n15l55P32J05q12K58R14l83n03N41N71k60m27M02L26n87
1691B0P5O98j47r03M20N29m73n04M01L14p29l76O15L06p89k97J172l98q37K91
$$ plain form
1556 -98 -370 118 634 430 -210 105 954 596 -128 118 1233 728 -732 -80 766 189 -1034 -120 906
1575 906 -716 -1540 148 750 -914 -1338 169 178 -1161 -975 639 532 -906 -396 1203 345 -549 134
1593 134 1352 413 -486 817 1365 245 -313 539 738 -269 -315 240 119 -699 -199 -9 -341 -859 105
1612 105 -230 -688 -319 -160 -473 -337 279 44 -131 159 678 -113 -287 274 748 138 -63 840 757 -292
1632 -292 7 805 107 -422 207 694 -478 -1165 330 337 -1084 -1210 131 85 -718 -463 573 -176 -1024
1651 -1024 -44 486 -50 -557 347 892 -215 -237 764 741 17 34 982 403 -334 128 663 -450 -508 328
1671 328 144 -830 -582 13 -502 -857 -125 -20 -832 -574 340 -43 -546 -5 566 306 -121 281 607 20
1691 20 95 793 646 -257 163 692 219 -285 116 430 -299 -675 -60 246 -543 -840 332 -66 -903 -612
1711f12Q32o56m89R70M17q72o1R02J33r87N42O96m21m51L48L71m51r4L92O7p73
1732a97R7N52m59o50M25L54q20O3L85J71o90J5P90j27k69K53M36m03m77Q41L80
1753F70q02R8P83qr33M78O01p18o46P88K30r44j19J012l45p77K34O84n18l73K94
1774c11N31p57j42P87l97m76N04O16p8p90P38P05p18k96O91J63o52o2N51N9q15
1795a49K54N34l88r97O83M21q03m70J007j24n23N1P47l01m64L78K82n66k5N66
1815A13K63m82J83M95l18k49M87L9n89k55R70k03n01j7O33o83n64N43N05o35m88
1836g53P70M7p77R6P86j89n05P0P46j40p66N85Q06p65j46P27M5o72J95Q61o73
1857C48n16L85K27n82j35L39K36o61j69N76l22l42J97M63m52l07O50J30l13p6
$$ plain form
1711 -612 220 -436 -925 45 462 -410 -471 431 564 -423 119 815 394 -57 291 662 211 117 509 576 -197
1732 -197 -100 452 -7 -657 -232 122 -698 -635 -250 -79 -769 -754 36 -91 -360 -107 329 -74 -551 290 670
1753 670 -132 -34 749 741 -192 286 887 169 -477 311 541 -403 -522 490 145 -632 -398 286 -232 -605 -311
1774 -311 220 -537 -679 108 -289 -765 -261 355 277 -513 225 930 212 -84 607 770 118 56 607 666 -149
1795 -149 105 639 251 -746 -63 358 -445 -915 92 -32 -555 -504 243 -58 -522 -144 138 -428 -453 113
1815 113 376 -106 77 572 254 5 492 531 -58 -313 657 454 -47 -64 569 -114 -678 -135 370 -265 -753
1836 -753 17 64 -713 -617 169 -20 -525 -455 291 151 -615 -30 776 11 -135 592 637 -35 160 1021 348
1857 348 -168 217 444 -138 -273 66 302 -359 -528 48 -274 -616 -419 44 -408 -715 -65 65 -248 -324
1877c24Q60m45m50K42Q47p89j86N84K18n74j31P98n2p27O1M44k98o40M77M43l78
1898b0o48L78O86o56m28N13l1m96J1N19K31l06L57l3K42k7q4J55q6q7j59K2K82
1921C35L18n67k56L89K17o70m3N18k17o59p9O01K20p18M9Q52m55m55K17O89k04
1942H2n15L21P73o38l48O61M23p66k38P25L20o57l77Q27Rq83LK93K77q92j55P49
1964fOm37j69O26Q2p18q2N25K71m23j16J047l68o57J10Q78m8m48R1O71j54q61
1986a80K90N90m38o28J09O95j99q87K15P83k89o31J11M37j28r2j59O32l7m13j06
2007c25P81k43m65J38J058p77m39J86P49l99l87Q7O85k78q23N44N62q98n81P46
2027g9N30o08n36O03N27j002k10J021J2q56J10R32K25j253L44Q28j86o18J07Q31
$$ plain form
1877 -324 536 91 -359 -117 730 -59 -245 339 557 -17 -148 650 598 -129 -68 376 78 -562 -85 358 -20
1898 -20 -668 -290 396 -260 -688 -175 -206 -702 -691 -172 59 -247 110 77 319 292 208 363 277 190 31 53 335
1921 335 653 86 -170 219 436 -234 -277 241 24 -635 -714 -113 107 -611 -562 290 -165 -620 -403 286 82
1942 82 -433 -112 661 23 -325 336 759 -7 -245 480 800 143 -234 593 602 -281 -278 15 292 -600 -755 -6
1964 -6 0 -437 -606 20 102 -616 -698 -173 98 -325 -441 606 238 -419 -309 569 521 73 164 835 681 -180
1986 -180 110 700 262 -366 -257 438 239 -648 -433 350 61 -570 -459 -22 -150 -242 -401 231 194 -219 -325
2007 -325 456 213 -252 -114 944 167 -272 -86 663 264 -123 -36 649 371 -452 92 654 -244 -825 -79
2027 -79 451 -157 -693 -90 437 -565 -775 246 258 -598 -488 444 669 -584 -240 588 402 -216 -109 722
2047G22m74l01K72L18m98j02L97k82o0Q9j64k55j13Q2l0K17p2l0Q7n7J06l96M28
2070a16K47Q0k74j2L97N9l80K1N52l0n08j17Q43k57p37K70L59k72o76O82L52p33
2092b50k25O58k66l89j51Q86l12p23M33P27k98o50K51P13k68n92N82L52k88j34
2112E6M61j0k94o4K74m37J08j38J02j14j44Q0j71l07M55J89n07l2O67k31l65K91
2134a31M08k75p05R11L14r65O9J056j54o24K18Q89p32n69M83M91o51m06L10M34
2154C71p02k43Q61j82o73o4O27l29J3j5M54l18j57K94L23n20J24N75k47k40K96
2175B48K69o22j96N98K54n69k0N08n33m16O11K17m82k45P06k18n96J51O08l53
2195h0m57J92P75o28k97R42p8l05j56N58j21o51J91J085m26n78k1N00l04l48M69
$$ plain form
2047 722 248 -53 219 537 39 -63 334 52 -8 81 -83 -338 -451 -369 -399 -182 -254 -284 -197 -254 -148 -544 -116
2070 -116 131 211 -63 -75 322 381 1 22 574 544 36 -81 762 505 -232 38 397 125 -551 131 483 -250
2092 -250 -475 183 -83 -472 -623 263 -49 -772 -339 388 90 -560 -309 404 136 -456 126 478 190 56
2112 56 517 507 213 149 423 -14 94 -44 58 -56 -200 -120 -291 -598 -143 46 -461 -493 174 -57 -422 -131
2134 -131 277 2 -703 208 522 -443 -374 682 528 -96 122 1011 279 -290 193 684 33 -373 -63 371
2154 371 -331 -574 287 105 -568 -632 -5 -334 -321 -336 118 -200 -357 -63 260 -260 -136 439 192 -48 248
2175 248 517 -105 -301 297 551 -18 -38 470 -63 -479 132 349 -133 -378 328 110 -486 -335 273 -80
2195 -80 -537 -345 430 -198 -495 447 369 64 -92 466 345 -306 -115 970 544 -34 -55 445 141 -207 262
2216B62K42o31J0J8j27j47j60O49k94m20M72J3m19K12K15r4m1K19J58j17k48N23
2238B95O2n43K38N25l96m26M00L03n91k4M62K39n17l66M88m5o82L04K70J0l74
2259c68J16N26l00j78J97J90m05j02O89r6l40M06P8l75j32Q57l53n08Q9L70j60
2280B01n49K53M12m50j60K01K96k33m17O18l07q8J28L44l26n40O98L55m83n9N40
2301D34k8p73J97O46j38n70M80P2j68k14M7K23l82k25L01l2lM7K08p87M27K28
2323a0o7k37k3L80m1r2l3P16q12M14OJ10l44J72L37L2m83P2O56n02n00L07K42
2346C00l07l21N19J28m71J08J89j92m10M35Kk18k31L34K50m57K58L47j35j41Q8
2367G5R9j50k05M53j02k38J61K01k86k59L93M4l95k82P01k99k06PM07j7o29J36
$$ plain form
2216 262 504 -127 -117 -99 -226 -373 -533 116 -178 -598 -126 -113 -532 -320 -105 -199 -240 -21 137 20 -228 295
2238 295 357 -186 52 577 181 -245 155 458 -133 -157 305 544 27 -339 149 104 -578 -274 -4 6 -368
2259 -368 -252 274 -26 -204 -7 183 -222 -324 365 269 -71 335 413 38 -94 763 410 -98 -9 361 201
2280 201 -348 -95 317 -133 -293 -92 204 -29 -446 172 -135 -223 -95 249 -77 -617 81 436 -47 -106 434
2301 434 406 -367 -170 476 338 -232 248 320 152 -62 -15 208 -174 -399 -98 -130 -133 -86 122 -665 -238 -10
2323 -10 -77 -314 -337 43 2 -90 -123 593 -219 195 201 311 -33 139 476 508 25 97 753 251 -249 58 300
2346 300 -7 -328 191 319 -152 -44 145 -47 -457 -22 -20 -238 -469 -135 115 -342 -84 263 128 -13 75
2367 75 174 24 -181 272 170 -68 93 294 8 -251 142 186 -209 -491 210 -89 -295 -288 119 102 -527 -391
2389c91O61k39n74L57N58l93k11M53J61j42j63J60L05k92j45pL33k66j02j06J65
2410A22j40j80MR3M6k07N9R6p8K4j08J39M2j45P7M34j55l68M76r8J01k56l7N22
2434D63l06l93M01L03j78m58L53J37o14J5J58K24p3k49L04K8k52k63N47q7l15
2455b55k20O49j82l98R2N16L4j11k43M46Pk16m2L97k48m28J86L52l41j05l9R4
2477e5J68j90n0J4o2j34J70O2m8L1o9K22p4l18J25L38k9j82M86j59k59k15L54
2500A26K01q6m7K0j26J26j99J01K00l26m71M01J88O3n94K05J62k26j01K59J25
2521Aj97J15J18J88m93J64K99J46m46L7K26K59l45k23N03m23p9j08O74m72j51
2542b07L31J82l66n84L01M12j98m8L7K49j47j90J47K70J11j81j97J58M2j07Q0
$$ plain form
2389 -391 270 31 -543 -186 372 -21 -232 221 382 240 77 237 542 250 105 98 431 165 63 -43 122
2410 122 -18 -198 -194 -101 -55 -262 -203 -107 -185 -161 -269 -130 -88 -233 -156 278 123 -245 231 133 234 -22 -59 463
2434 463 157 -236 165 468 290 -168 185 322 -292 -277 -119 105 32 -217 87 115 -137 -400 147 60 -255
2455 -255 -475 174 -8 -406 -314 202 236 125 -118 328 335 119 77 474 226 -202 -16 336 -5 -110 -149 -55
2477 -55 113 -77 -127 -113 -175 -309 -139 -77 -125 -94 -163 59 -15 -333 -208 130 101 -81 405 246 -13 -228 126
2500 126 327 241 194 214 88 214 15 116 316 -10 -481 -80 108 171 -423 -218 -56 -282 -383 -124 1
2521 1 -196 -81 37 225 -268 -104 195 341 -105 -68 158 417 72 -151 352 -71 -150 -258 416 -56 -207
2542 -207 124 306 -60 -644 -343 69 -129 -177 -140 109 -38 -228 -81 189 300 119 -78 80 122 15 95
2563I5K34nj88n1K73m64J69l67M02p9j31p6r3K55k69N0K22j63o4k82O11j68l32
2586d21K90N34o17J0L00K32k80o5K21J01l78KN17k57j37K1Q1j48k39Q4M05m75
2608b19L9K90j09l20K98j62r4O7K43j7k02P8M60n32J57M17k90L03l90J17M0l29
2630a55L47K63l91m38N19Q1k93o6J93K15o24ML03j19k88J75K81J21o82J76N32
2651A54r6k38J91K53m38P2K04L95m60J54K40l29n0O9O6l73J88J70j97r9q4K00
2673hM2j73p7J62k77J21J52p6k72K83Q6Kq2J32L50k28l99M10o2k03J4N69k90m34
2697b58L08K53j83k66K44K23p86K19M52k75l34J56J39j51P3m4L90l44j3L22K52
2718C77l52k47K86J02k50M67j58j29k82M04L1l68J46J78j71k19L39j66k30o7M21
$$ plain form
2563 95 329 324 136 85 358 -106 63 -304 98 19 -112 -188 -281 -26 -295 -245 -23 -186 -250 -532 79 -89 -421
2586 -421 -131 403 -214 -204 96 328 48 -17 204 305 -73 -71 446 189 52 73 154 6 -233 -149 256 -219
2608 -219 -180 110 1 -319 -21 -183 -277 -210 33 16 -186 -108 352 -180 -23 394 104 407 17 134 174 -155
2630 -155 192 455 64 -374 145 226 -67 -133 60 275 -349 -345 -42 -161 -449 -274 7 128 -554 -378 154
2651 154 58 -180 11 264 -174 -102 102 497 37 191 431 102 52 121 187 -186 2 172 -25 -124 -208 -8
2673 -8 34 -139 -216 -54 -331 -210 -58 -134 -406 -123 -37 -35 -117 15 365 137 -262 148 86 -117 -103 466 176 -258
2697 -258 50 303 120 -146 98 321 -465 -246 206 -69 -403 -247 -108 -259 -186 -230 160 -184 -197 125 377
2718 377 25 -222 64 166 -84 383 225 96 -186 218 249 -119 27 205 34 -185 154 -12 -242 -309 112
2739A12k94j39L83l6J6m45M2O03l08j96L38K03l95J1M29j16l52J10M05j8m01K19
2761A71j6j01j19K6K38m64p8L12k19j25L09o3K15k40J42j7l22L92j1P4l39O9K01
2784C5j8m11O83N5m69K24J66N2n31K77K26j62j33j38L96o07J47J32Q8M5n36L76
2806a03J27k64K26J1k34K88RP1k52m8L54J21l72J95J58p21L56K50n7j33K18N1
2828B51n45k8N25K3r4l74L47R3m17M4M46n3n40K07N8L0k99M62m5j62j62N72j1
2851C28m79nM73j27l01Q5K19j41MJ10j53M3k49ML30m29K17J89j74k13N9J06j05
2874b09j43L20k96L22K55r5j43Q1j21J33j26L5J89M0k16N9J30K51r30O39L65o43
2896a03k7R9lj28k55N95j95k51K00K90k89m18N26R4l0l11K33K51k27K6Q5j9L9
$$ plain form
2739 112 -182 -321 62 26 42 -403 -361 242 -66 -262 76 279 -116 -105 324 208 -144 -34 371 353 -48 171
2761 171 155 54 -65 -39 199 -265 -343 -31 -250 -375 -66 -129 86 -154 -12 -29 -351 41 30 104 -235 -166 35
2784 35 17 -394 289 344 -125 99 265 317 -214 63 289 127 -6 -144 252 -355 -208 -76 12 57 -479 -103
2806 -103 24 -240 -14 -3 -237 51 60 131 -121 -169 185 306 -66 129 287 -434 -78 172 115 -18 200 251
2828 251 -294 -322 203 226 132 -242 105 198 -219 -175 271 218 -322 -115 -57 -27 -326 136 91 -71 -233 339 328
2851 328 -151 -156 317 190 -111 -26 193 52 56 166 13 56 -193 -189 141 -288 -71 118 -56 -269 -210 -104 -209
2874 -209 -352 -32 -328 -6 249 154 11 92 -29 104 -22 13 202 242 26 85 215 466 -464 175 540 -103
2896 -103 -130 -31 -34 -162 -417 178 -17 -268 -68 222 -67 -485 41 135 105 -206 27 278 51 77 162 143 182
2919A82j35L8J75M8j47j85K5j7K11l37l8L79l31l6k5J75j96J05Rk3j46J82K36
2942A49j1l07n5K63J36q2j70K80j04m08M30K31l86k44M57J80l42k03j7J41j6P1
2964gM4j26n2j37K66M9l14J84r5j10K79J12k41K94k09M03j85p8J09j72K25L6j49
2987A26k4mJ34j64Kk36K15j62j37M4J53j90R5J84q3p5k46L08J76j14j08P8J09
3010H1NL9P4j07q9J66q0l5j30J33j24K00j57l6K67j61l37K9K08J99l02l0J66R0
3034F9j88K04j08j49K13o4K64j10m64M65J8j02j83K63J45j66j52mK98j92k15J27
3056c1K06j30j62k32L21Q9j52j54J49lJ21j46K58k22K6Q7L06m62j04L53R9k11
3078FJ04LQ7J5j81nJ29l5p2q6J89j03j68P6j4K2j11j25L62k42j10L91L4n9k80
$$ plain form
2919 182 47 85 260 308 161 -24 1 -16 195 -142 -180 199 -132 -168 -193 -18 -214 -109 -100 -123 -269 -87 149
2942 149 138 -169 -224 39 175 93 -77 203 99 -309 121 352 -34 -278 179 359 17 -186 -203 -62 -78 -7
2964 -7 37 -89 -141 -278 -12 37 -277 -93 -188 -298 -19 93 -148 146 -63 340 155 77 186 14 239 275 126
2987 126 102 98 232 68 70 -166 49 -113 -250 -206 -53 -243 -148 36 -47 -122 -368 -60 116 2 -106 -28 81
3010 81 86 125 199 92 3 169 89 54 -76 57 -67 133 -24 -60 207 46 -291 -262 -54 145 -157 -187 -21 69
3034 69 -119 85 -23 -172 41 -23 241 131 -333 132 150 48 -135 128 273 107 -45 -49 249 57 -158 -31
3056 -31 175 45 -117 -349 -28 61 -91 -245 -96 -99 22 -124 134 -88 -62 25 331 -131 -235 118 217 6
3078 6 110 113 200 215 34 29 158 123 51 -35 154 51 -117 -41 -55 -33 -144 -269 93 -149 -259 132 166 107 -173
3103a73J72J95k17M5j10K52j88J43k7jm7NJ69r2j0l59MJ0K58Pj58L16k09l73K99
3128h9PM6n8j36K14K7m30N57%m57L96j7K32l31Q6L42l26j63J89L7J73k22J44K6
3152B47k27k8j9Q5j55k06J96J07k67O0p6N49k15Nl6j28J38J40k13J5m8J05OL35
3176C70l35r3O0J10K38l86k9J33n1k87N9J82J2J17k51J30l3m4mj70K56l36M91
3199A39k08j8J0K07j03l2n7K15k06n5Q4J48m5K8M0K9l5r2j18R3j76l1M5J86j82
3224a34n8P5L9j89L51p6M1P4l38J27K00k25J92P5k1l3o0L04l65N3j17R0K16j76
3248D5k21J72K9n0K01j44j62L43k08l52L02j0n1k39K58j19K77j07n0q0J80N6k8
3271D2J16m0j71K41k92J76J17k4j81M3L8r1q1J35J10m14K49k3j0nJ22K6k54l3
$$ plain form
3103 -173 -1 194 -23 22 -88 164 -24 119 92 91 44 49 218 126 116 -243 -239 -229 29 36 -122 194 -15 -388 -89
3128 -89 -82 -36 -94 -230 -16 11 -419 138 138 -319 77 60 292 -39 47 389 63 -100 89 126 299 77 221 247
3152 247 20 -8 -27 58 -97 -303 -107 0 -267 -207 -283 266 51 56 20 -108 30 170 -43 -28 -76 29 35 370
3176 370 35 -58 2 112 350 -36 -65 68 17 -270 -211 -29 -17 100 -151 -21 -54 -98 -102 -272 -16 -352 139
3199 139 -69 -87 -77 130 27 -5 -62 153 -53 -108 -24 124 79 107 147 176 141 49 -69 24 -152 -183 -138 48 -134
3224 -134 -192 -117 -78 -267 84 8 49 123 -215 -88 112 -113 79 154 133 100 40 344 -21 32 -85 5 221 45
3248 45 -176 -4 25 -25 176 32 -130 213 5 -347 -45 -55 -106 -345 -87 -206 71 -36 -86 -166 14 70 42
3271 42 158 118 -53 188 -104 72 189 165 -16 27 65 -26 -107 28 138 -276 -27 -50 -60 -65 57 83 -171 -204
3295b04L14j48qJ65j26P9n8P0K06l8l24K07k26K64m9J11l09J32p7J78m00K96K1
3318G6j52k34K85l29P7K05K1r5o3n1M06k80M6j39L27j87m2K50r6k6m5J22j59L03
3342B20m8Mp5k55j03M39m20J44O5l5k2m4L16k06m74L75K29j39k21Q5M27j93l4
3365C5K88j31lp3M1J53j38k53nR8q0K62n7l76J34j1Mj07J66l5QJ53L6j86r7L69
3391A95r5p4m9K19k4j42j08M82l62k70K98J28J7l48J11N5J1k37K15Q8k3k80L24
3414A31L0j49k72K34Q9j84k44K65K76j61j26K58k2p1j1k55J27K35k4K3j05K34
3436B78j74k9j33J74j13N3p7Q3Q9k51J70p5r3j43K17R3j81r1O7J35l57L58o0J86
3460A26k45L83k35j3j31J95Q2m04M62k2j57L73m76R5j47J90j59p0M5J00r5j36
$$ plain form
3295 -204 110 -38 -46 119 -7 72 14 84 290 252 -72 135 -91 173 124 235 -74 58 -19 159 -241 55 76
3318 76 -76 -310 -25 -354 -277 -72 -51 -146 -209 -260 146 -134 -88 -227 100 -87 -129 121 25 -1 -46 76 -83 220
3342 220 172 176 101 -154 -257 182 -238 -94 -29 -64 -86 -130 186 -20 -494 -119 110 -29 -250 -165 262 69 35
3365 35 323 192 189 116 157 310 172 -81 -86 12 -68 194 137 -239 -105 -116 -112 -219 -53 -88 -80 73 109 -77 -174 195
3391 195 100 26 -23 196 172 30 -78 404 42 -228 70 198 215 -133 -22 33 44 -193 22 110 87 -193 131
3414 131 161 12 -260 -26 63 -121 -365 -100 176 15 -111 147 125 54 43 -212 -85 150 126 149 44 278
3436 278 104 75 -58 116 3 56 -21 62 151 -100 70 -5 -98 -241 -24 69 -112 -203 -136 -1 -358 0 -60 126
3460 126 -119 264 29 16 -115 80 162 -242 220 198 41 414 -62 33 -114 76 -83 -153 -108 -8 -103 -239
3482b39k8J06Q4j18K98j98J37nj09P2o9n2M93l0l93M5O8J5J00j94p4K13L8k46
3506h6J75k17K65l7j41l15J72L32l28J13j48L33ok53J60j40J85j4r8K23l00J87
3528F2K1O7j09K45k20J98k42L1j58K50k2m5j54P6N7k64K97Jl6l65K76N2n4O9j26
3553i3l0J73J6j50n6M16k82n4K44rj09J34K7j70j24lR3J08j71P3No7n0m3J06N9
3579D3l11K90j22L33l22k24L22p8k17N84k38j75J52J27j24j26L99l36K15l4ol5
3601A17J71n63K99N9j62Q9n5P5q9j77R3K92M8l29M8M2J54j90J42k77O4K7N1J60
3625H9J51j48j15J30j6K41n74K80m5K3L5l5p5q9K33k20qk7J54r7JJ45j61J24m3
3650d7L9k8p7M23m81L38o5j65L3N8j2M0k3k9J38k7o8j91J10j65Q7J61J4l59J10
$$ plain form
3482 -239 -267 -161 -77 -195 103 -95 42 37 -72 0 -69 -121 372 342 -51 -6 62 77 177 -17 -91 122 160 -86
3506 -86 89 -128 137 100 -41 -356 -184 148 -180 -67 -215 118 112 -141 19 -121 64 50 -48 175 -125 62
3528 62 83 150 41 286 66 264 22 53 -105 145 123 78 -76 0 57 -207 90 91 55 -310 -34 18 -36 33 -93
3553 -93 -123 50 66 -84 -140 276 -6 -60 184 175 66 200 227 57 -67 -70 23 131 -40 33 38 -29 -79 -122 -16 43
3579 43 -268 22 -100 233 -89 -313 9 -69 -286 298 60 -115 37 164 40 -86 313 -23 192 158 152 117
3601 117 288 -275 24 83 -79 10 -45 30 -59 -236 -143 149 197 -132 -84 -42 112 -78 64 -213 -149 -122 -71 89
3625 89 240 92 -23 107 91 332 -242 38 -7 16 51 16 -59 -148 85 -135 -143 -170 -16 -113 -112 33 -128 -4 -47
3650 -47 -8 -36 -113 310 -171 167 102 -63 -30 28 16 56 33 4 142 115 47 -144 -34 -199 -112 49 63 -296 -186
3675a86M0k2n5L1Q5K00j48j30LJ11J68p2J05J28Jp4J9j18j81j44L94q5R0k45N9
3700b6K85O3j53l62K66k25K46k9J22l24J82o4k02K36j33RK93L9k18M6K26l85J14
3723Fq3J82k34K27k77K71k11R9k1N8j46J63j73R6R8m4l51N04j57k12L71K0k18
3746c2k5M7K13j93K7o7L20j65j07p1K22j25R0J66l50j05R3K39n8j94j2m7r8L66
3770A34j30M1j93j75M36j54K4K7k40J71j37K65n0J37k2P0j76j43J44L8P5j34m8
3793d0kr7K12lJj37j59J53J14L8k40L09k08j01R0J54k70L77l56J53j2K75l36L16
3817B31m5j04N0j18J96k45k1j17J8L83l16N2N1j25l8M2Q4M0n3j60O9k00K70J43
3841H7k61J94j30L9J39k66L46k64J4J95l7j32Q1r2K6M4L3K41m06P7N6j46J8P7
$$ plain form
3675 -186 -146 -168 -223 -192 -107 93 -55 -185 -182 -71 97 25 130 258 259 185 204 86 -95 -239 155 70 160 -85 -26
3700 -26 259 322 169 -193 73 -152 94 65 187 -137 45 -19 -221 15 -118 -109 184 223 5 51 277 -108 6
3723 6 -77 105 -129 98 -179 92 -119 -20 -41 17 -129 34 -139 -43 55 11 -340 164 7 -205 166 186 -32
3746 -32 -57 -10 203 10 37 -30 290 125 18 -53 169 44 134 300 -50 -155 -62 177 119 -75 -87 -134 -232 134
3770 134 4 45 -148 -323 113 -41 -17 10 -230 -59 -196 69 19 156 134 204 28 -115 29 67 142 8 -40
3793 -40 -42 -139 73 70 71 -66 -225 -72 42 80 -160 149 -59 -160 -70 84 -186 191 -165 -12 -24 251 -85 231
3817 231 186 82 132 14 210 -35 -56 -173 -155 228 -88 -36 15 -110 -148 -106 -22 18 -35 -195 -126 -326 -56 87
3841 87 -174 20 -110 -71 68 -198 148 -116 -102 93 56 -76 5 -87 -61 -17 16 257 -149 -72 -16 -162 -144 -67
3865f7k1Q7n7n9L23j82l5j31o7M62l37J55p3o9J60k01J57J74k50K82k27j34M45
3888C35m36m6J29J53k24K78m01O6J39j15J46lJ8l01K70k75J91K06p6j75p1M08
3910B16k77J26j19L9j46K56p5j27P7J7J57l21J78R8l2J32k2k81K26k79m5j43M33
3933H8k72J56J4J09O6r6n2K1m7j23M23q1j46j42J77L16l40j41K04p3k89J97o9
3956a00PL25j49j48N3J8m5nP5j09j98O5O9J40N9k98Q8J20P1J13k55p6L30Ll48
3981a95J62l9J40lk33L98j05j96R0K03n0n4k85J17J26q8j02J23j75K53m9L9r4
4004a7J13j72k7J91k21L91q9k09L15j37nk01N1L1N6m4J9j8k3k6j22J65P4j23j35
4029a63L8J31k6J21j53K18l50L99k31K1J77r7p5J03q5j17J80j34j02J82m1K25
$$ plain form
3865 -67 -88 -1 -58 -117 206 24 -11 -142 -209 253 -84 71 -2 -71 89 -112 45 219 -31 251 24 -110 335
3888 335 -101 -147 -18 135 -89 189 -212 -146 -7 -122 24 21 39 -262 8 -267 -76 130 54 -121 -192 216
3910 216 -61 65 -54 -15 -161 95 20 -107 -30 -13 144 -177 1 99 67 199 177 -104 122 -157 -202 -345 88
3933 88 -184 -28 -14 95 161 65 13 34 -13 -136 287 206 60 -82 95 411 71 -70 134 61 -228 -31 -100
3956 -100 -93 232 83 -65 -12 6 -39 -44 31 -78 -276 -211 -142 -2 57 -241 -153 -33 38 151 -104 -180 150 153 -195
3981 -195 -33 -72 68 65 -168 230 125 -71 19 222 172 118 -167 -50 76 -12 -114 9 -166 87 38 77 -17
4004 -17 96 -76 -103 88 -133 258 169 -40 275 138 133 -68 -17 14 70 26 45 27 4 -22 -144 21 95 -28 -163
4029 -163 -125 6 -20 101 -52 166 -184 215 -16 5 182 85 10 113 28 -89 91 -43 -145 37 -4 221
4051B21k53J01l00R9P2j29K20j10l6J25o5l3J33j88o3M17m17K1K36J47j81J19
4073A36k11k9J62n3J1J61N6k87j09m3J80J66m02K27L39l38j17K7L35m24K99k66
4095a80Q2l3NK79m05O17k48j67q0R8Q4N1n0k1J73m60M36j27J44n2j7k12M5K08
4119A70j52J68l54j61K96M2j41j36J72M1K28j14J5j76J10j9J1K34l13K45j59R
4141A6j74L30m00K76n2J07j88jQ3KL7j89K66R6k19O1j01m9p2J06qO2j72K56ll2
4167C8p2oM6K78k30K9k11J75J69l56L12l73M33k74P1J21j66K2P4P1l2L7l9k4j46
4192e3P1n6K5L3J07q1p2Rk46L04q5m5J27J23KJ0j39n8R9j31N6o6j4K24l43J55
4218d4K1K75k25l8l3J58J46n10M1J21Q1L3l36J51J51o9L7J44j22m2K42p0Mm5m7
$$ plain form
4051 221 -32 69 -231 -132 -60 -189 31 -79 -115 10 -55 -88 45 -143 -206 211 -206 -185 51 198 17 136
4073 136 -75 -104 58 5 16 177 233 -54 -163 -206 -26 140 -262 -35 304 -34 -151 -124 211 -213 86 -180
4095 -180 -98 -131 -126 153 -252 365 117 -50 -130 -32 52 103 53 32 205 -255 181 54 198 146 129 -83 -38 170
4119 170 18 186 -168 -329 -33 9 -132 -268 -96 -55 173 59 74 -102 8 -11 0 234 -79 166 7 16
4141 16 -158 172 -228 48 -4 103 -85 -86 -3 -1 36 -153 113 209 -10 51 -50 -99 -171 -65 -73 -11 -183 73 70 38
4167 38 -34 -40 6 284 54 83 -128 47 216 -140 172 -201 232 -42 29 150 -16 6 80 151 119 156 117 93 -53
4192 -53 18 -38 -13 20 127 46 -26 -17 -263 41 -44 -89 38 161 163 173 34 -24 75 -56 0 -66 -80 144 -199 -44
4218 -44 -23 252 27 -11 -44 114 260 -250 -209 -88 -7 26 -310 -159 -8 -77 -40 104 -18 -60 182 112 116 71 24
4243B4j94J84k57N79m83L40p9j05j3n0k10K1J51J63q3j1L6q3M1N3J12o2m1K7j20
4268f0M9J71k89J92k1j67L29r5k17K72r2j43J16j98K65j29j81K90k60PJ88j68
4290a41J72j33L91m81J39j55J83K1K08j25k66J98J70j07p2p3Q3M4K1l0r9J29q9
4313a2Np5j7q6L09l44Q6J50q2J15j13K89n5q5k41j1J17M5j5K4j20K18j89p0M5
4338a12n8J80J21J21o6l19q2L39j5l51k7M00j14J4j31l3M1j53K49p2n5J53R0m28
4362c08q7K35J30L69R6k84k2n5p5J42k32J10LQ2m0j51M6J49k24M3K28j20r0M6
4386ij20nL69l81J24N6pPr0r0K05P6q2oM0J98l00MN3j4j94K59o3r6J78K6l36J62
4414c6L9J73k33R1j0K3j77Q1n2J60j4j56M7J07J30k9j45J67r9K4Pr7j5L7j9l3
$$ plain form
4243 24 -170 14 -243 336 -147 193 114 9 -4 -54 -264 -243 -92 71 -12 -23 13 -70 -29 24 136 74 33 60 -60
4268 -60 -11 160 -129 63 42 -125 204 109 -108 164 72 -71 45 -153 112 -17 -198 92 -168 -161 27 -141
4290 -141 31 -102 289 -192 -53 -208 -25 -4 204 79 -187 11 181 74 2 -71 12 56 77 47 -52 77 -12
4313 -12 -7 -82 -99 -185 124 -220 -134 16 -66 49 -64 225 170 85 -156 -167 -50 -5 -20 4 -116 102 -87 -157 -112
4338 -112 -170 10 131 252 186 -133 -215 124 109 -242 -269 131 17 31 -100 -133 -92 -245 4 -68 -123 30 120 -308
4362 -308 -395 -160 -30 339 435 151 129 74 -1 141 -91 19 22 104 64 -87 -41 108 -116 -73 155 35 -55 -9
4386 -9 -129 -134 235 -146 -22 34 27 34 -56 -146 59 135 53 47 87 285 -15 -11 42 28 -166 93 30 -66 112 138 -198 -36
4414 -36 3 176 -57 34 24 47 -130 -49 -101 59 45 -111 -64 43 173 144 -1 166 67 91 98 1 -14 23 4 -29
4440b9m5J40j81J90j51K74m0r9j38j9p3q6K56Q5Oj02J50j68K05j68J32k39J06
4463Fk72M32k60Q3J7n7L61k24j2K5q7M5r6j64M90k33q6N7P9k22J49Q7p0j82j19
4488b53K76r9L6J66M6k50L13k98J16j94J85R4K5l65J74lL61l88J47J43k68L2j5
4511a9Q0M8m11K86Q3R6l6k79M0O1kQ7r4P3P2n6K04l26RJ17k08M19l38m2K25q0
4537Ij44L97k82j63J31k0J91j33O2K09j37j51R4q1l07L48J89l0q2L7j28%j66J51
4561fLk01L34k11N2J60j82J41Q8k61J50k9Nr9R5M0j93r8n2M01j73o3K36j71kJ02
4587F6k60J59J88k28J8j48K65k19L10j65J57j81L6o2J1P3k67L71J4qo9o9j70j10
4611b88J97m9P7J41k85K71j36j09K13j2K9o1j77J36L5J55j85K08K0k4o3J67k35
$$ plain form
4440 -29 -74 66 -115 75 -76 198 158 59 -79 -98 -171 -257 -1 84 90 -12 138 -30 175 7 139 -100 6
4463 6 -266 166 -94 -11 6 -51 310 86 74 99 12 57 -39 -203 287 54 -32 25 104 -118 31 118 48 -134 -253
4488 -253 23 -76 -40 126 172 -78 235 -63 53 -141 44 138 163 -202 -28 -31 330 -58 89 232 -36 -4 -19
4511 -19 61 109 -302 -16 67 163 127 -152 -112 -51 -53 34 -60 13 85 29 233 -93 -84 33 -175 244 -94 -136 89 9
4537 9 -135 262 -20 -183 -52 -72 119 -14 48 257 120 -31 63 -18 -325 23 212 182 100 137 9 9 -157 -6
4561 -6 -3 -204 130 -81 -29 131 -51 90 178 -83 67 38 43 -56 39 79 -114 -212 -264 137 -36 -99 137 -34 -36 66
4587 66 -194 -35 153 -75 -57 -205 60 -159 151 -14 143 -38 -2 -64 -53 20 -247 124 138 130 61 -8 -178 -288
4611 -288 -91 -140 -63 78 -207 64 -72 -181 32 20 49 -12 -189 -53 -18 137 -48 160 180 156 93 260 25
4634B5K9L0j37J00p9j64M10n11L34j37P1L0k1M8j54K69J08k85J71j95J34o3N4
4657F7q2L12l24J49m4N2q0j99K62k64O9P7n2L57l80J41j49r9p1K38J24k07J90
4680H7k73l2jK43J59p5l09K31Mk64Q3k22L73j10J56j2J32j82J70j61o9rq6j73
4704c40J31M26j25Nj00N4l48K11K72l27K76k61J10J41J7Q8k35k5k1J7l06K80Q2
4727B2l0J9J5O9j52K03j89J52p0k11L99k35K42k97j9nM5L1k1K56r4l06K60R3j88
4752a1K16m0k26L43k08k0L08m67N4J9P9Jl34L77k31l8K17j03q8L42j93O0J6j34
4776f1K20k85J89j08j52K11l2M1K24k40j03K29N0j12M4JQ0k10k2K35k93j56L05
4799E5Q7k16Q4k22K75l01K88j17J29k28P6J64j28J55P1k77Q1M5K00j71k0K53k31
$$ plain form
4634 25 54 84 -53 47 -32 -196 214 -297 37 -100 -29 1 -20 28 -126 143 251 -34 137 -58 76 13 67
4657 67 -15 297 -27 122 78 130 50 -149 113 -151 -82 -5 -57 300 -80 61 -88 -187 -258 -20 104 -103 87
4680 87 -186 -218 -219 24 183 108 -201 30 34 -230 -147 -369 4 -106 50 38 170 -12 158 -3 -72 -81 -167 -340
4704 -340 -209 217 92 97 -3 51 -297 -86 186 -141 135 -126 -16 125 142 230 -5 -30 -51 -34 -340 -60 22
4727 22 -8 11 26 95 -57 146 -43 109 39 -172 227 -8 234 -63 -82 -87 -42 -11 -32 224 130 -176 84 177 -11
4752 -11 205 165 -61 282 74 54 362 -105 -51 -32 47 48 -286 91 -140 -178 39 -64 -152 190 -3 57 73 -61
4776 -61 159 -126 63 -45 -197 14 -18 23 247 7 -96 133 183 71 115 116 196 -14 -36 199 -94 -250 55
4799 55 142 -74 10 -212 63 -238 50 -67 62 -166 -90 74 -54 101 172 -105 -24 21 221 50 30 283 52
4822E2k06J25J36k77N5o9J59j97L33j08j46J20j0N1j31K38pJ67m35J15M9K60l06
4845c2r2j81J40L14j90K31l73M41r0n3Q9j71p8J75k36K06n6L8j98J21r7J99O1
4868A68o2Q1k06j11K14o5k6J3j0Q0K07k16k65J21L04j3l98J41K0k7J1p4J72k67
4892b08K03J75k80J58j18n6K3K66j23k53K77j23l6P0M3K01m53J76jJ21j55K10
4914A17r2J31P5k3j06j74j48M00k06K5P9K10l29k1K14j22Mj51k00l7L69l24L91
4937H2J5J6k15J36K5k20L59k50j77K64j50J19K13m50M55k99L43k17j82L1K79k64
4959h7J73J49m08J15O2L6M9j61K14k25J23q3K1K14k04J43k85J69m0J82k1r4K76
4982C18m43L42j68K6j36J8j34J13O4J03L2n2j90R5Q2J3j5k03PJ53j34k12K14k6
$$ plain form
4822 52 -154 -29 107 -170 -115 -184 -25 -222 111 3 -143 -23 -33 18 -113 125 118 285 -150 -35 14 274 -32
4845 -32 -124 -305 -165 149 -41 190 -183 258 168 115 204 33 -45 130 -106 100 44 82 -116 5 -92 107 168
4868 168 106 187 -19 -130 84 19 -7 6 -4 76 283 67 -198 -77 227 214 -184 -43 -23 -50 -39 -113 59 -208
4892 -208 -5 170 -110 48 -70 -126 -103 163 40 -213 64 -59 -95 -25 18 219 -234 -58 -59 62 -93 117
4914 117 25 156 231 208 102 -72 -220 180 -26 -1 78 288 -41 -62 152 30 34 -117 -317 -354 15 -309 82
4937 82 97 113 -102 34 59 -161 198 -52 -229 35 -115 4 217 -233 222 -77 266 49 -133 -102 177 -87
4959 -87 86 235 -173 -58 4 40 89 -72 142 -83 40 -43 -22 192 -12 131 -154 15 -25 157 136 42 318
4982 318 -125 217 49 75 -61 -43 -177 -64 0 103 135 83 -107 -12 70 83 68 -135 -128 25 -109 -321 -107 -133
5006a33P2J52j97L21k6j63k1J26l17L89j39r5k9K14j17k11J88n7J42m73N28k60
5028a06o8L45k52J23k52L46q3p4J6m5R9m9N5po6J48r6K36k67J32j30J96l80O0
5052a19q1J88j14M7J20p4J98k69J40j82L19j58J00k21J47m6j1L3J45k7j06k32
5074b03K58j2J34j33j51M07l48K69j20J14k39k06L57j95o2n1K02k10J01jk2pJ93
5097G5j89K31j45j33K37j97K18n2N0J31k80K19j89J09j89P6m0J44j98K82k84J99
5119G5J53j10J1l32K36m41K44J20P4O1k06p6J09K53j71NK6l2j17J23j50J73R9
5142A27k06Ll3J84j01L4n4k60J91JO2J30j6j94K01K1j57l6kQ3q2O1j17o4K47p
5168A6l9K5j08J88j76R8q7l8K93J07m25j55K42Q5M0m8j62K48k41l4J65P1j31m8
$$ plain form
5006 -133 -61 91 -106 215 189 26 5 131 -186 203 64 -31 -60 154 37 -174 14 -43 99 -374 154 -106
5028 -106 -174 171 -81 42 -210 136 53 -21 -5 -50 49 0 55 48 -18 130 34 270 3 135 5 201 -179 -119
5052 -119 -200 -12 -126 -79 41 -33 165 -104 36 -146 173 15 115 -106 41 -5 -16 17 162 135 29 -203
5074 -203 55 43 177 44 -107 300 -48 221 101 215 -24 -230 127 -68 -130 -181 21 -189 -88 -89 -111 -118 75
5097 75 -114 117 -28 -161 76 -121 97 45 95 226 -54 165 -24 85 -104 -28 -68 76 -122 160 -124 75
5119 75 228 118 129 -203 33 -408 -164 -44 30 91 -115 -191 -82 171 0 5 31 -1 -118 5 -145 28 127
5142 127 -79 -76 -109 75 -26 8 -46 -306 -115 -114 -52 78 62 -132 69 90 -67 -103 -105 -22 -104 -43 -160 -224 23 16
5168 16 -23 2 -106 82 -94 4 -83 -121 172 279 -146 -301 -59 26 66 18 -144 104 -137 -171 -6 65 -66 -114
5192a14K15jl07JJ50l8J22j09p0K62n5Pp1q8j3Q7N1J1o2j62l2J74M4L4J74q7L63
5219D86n76N8m1N1J46j5j31P9L7K1m4rk07J15q0K29k04JP6Q9j52K64j43k47L21
5244A24k25L24k73n0k7L56k59QJ33mJ47j58n1j08J4q7Q5L2l6pP3R4k25R9K09l34
5270a46m3PL29k85J70Jl5p7J3J72j3Oj52o7J15Ql44M03m6O6p2j76K80j27K37l88
5296a64Q5q8L10k48K7n8Q7K14l72K2L61j76J22k08J67r2k34N67l81LJ59j78P0
5319ej04q0Q8J08l52J48J42L39m18J32N1j12J12n6l5n8K69o0p4k55J75L01j67
5342H9j04J65l05J09J66N0l93N95m86R3k15L08L2n2j67K9j37J48M6Kl86M76P6
5365A39n8j66o6K83n5K1J11k67J09m1J13%k67JK39j61J40j69J27K3O3m7k43J85
$$ plain form
5192 -114 101 100 -207 -206 -56 -94 28 -81 -151 111 56 63 -8 -96 -109 -22 29 40 -22 -184 -216 -42 2 36 210 123 486
5219 486 -90 -32 -73 -22 124 109 -22 57 94 115 71 62 -145 -30 -110 119 -85 -84 -8 81 -71 193 50 -197 124
5244 124 -101 223 -50 -100 -127 229 -30 -22 111 107 254 96 45 -63 -49 -136 -51 -19 -55 -62 11 105 -120 -21 188 -146
5270 -146 -189 -182 147 -138 32 33 -2 -79 -66 106 93 99 -53 -120 -5 3 -341 62 16 82 10 -166 114 -13 224 -164
5296 -164 -79 -167 143 -105 -78 -136 -49 165 -207 -185 176 0 122 -86 81 -11 -245 322 -59 -56 103 -75 -5
5319 -5 -109 -189 -101 7 -345 -197 -55 284 -134 -2 49 -63 49 -7 -42 -100 169 109 35 -220 -45 256 89
5342 89 -15 150 -155 -46 120 170 -223 372 -114 -21 -236 72 104 52 -115 -86 -223 -75 -29 -27 -413 63 139
5365 139 81 -85 -151 132 77 98 209 -58 51 10 123 123 -144 -143 96 -65 75 -94 33 56 119 72 -171 14
5389A4j25J10ol5K37j56j59L24k30J07K5j97j0K38j02M6p0j46K20j08J03o7J00
5412A13r8N6L9j51j23K8L4L0K37j50r4K52l0J10k71J15j44J13M3l11Q1K75k72
5435a18j71J54J64J30k10L2L8j67K03J64k91o8l76M26Q6J15j16j24J48K36m08
5456a53K74j50M0J01k42P9J60J1j04J35Ln5j35r7J99k73P5J76J37j42l50K6J40
5479a45L50k81M3q4K30m5k70K40l34K46j21r9M82p1j34j62O0J73j4j07J06K26
5501B89k38k81O6K34q8K34j07M2LM0j03k51K84j16J89j01k90M4Q9J09q8j86J13
5524a13J83j83K57j97n12O37q7j66J01J28j30Kj46K28n0J8m5j19L96l78L96n27
5546c07P9K13J39l5j08pN2J40k03J50j96L9J29p2QK8j18pN2P7J17j39j40R0L8
$$ plain form
5389 14 -111 -1 -7 -42 195 39 -120 204 -26 81 106 -91 -101 137 35 81 11 -135 85 -23 80 13 113
5412 113 15 71 110 -41 -164 -136 -102 -72 165 15 -79 173 143 253 -18 97 -47 66 109 -202 -121 154 -118
5435 -118 -289 -135 29 159 -51 -19 19 -148 55 219 -72 -140 -516 -90 -4 111 -5 -129 19 255 -153
5456 -153 121 -29 11 112 -130 -51 109 120 16 151 154 99 -36 -133 66 -207 -132 44 181 39 -311 -285 -145
5479 -145 205 -76 -33 -117 113 68 -202 38 -296 -50 -171 -270 212 141 7 -155 -95 78 64 -43 63 289
5501 289 51 -230 -164 70 -18 216 109 151 154 194 91 -160 124 8 197 96 -194 -150 -61 48 -40 -226 -113
5524 -113 70 -113 144 -53 -565 72 -15 -181 -80 48 -82 -80 -226 2 -48 -30 -75 -194 202 -176 220 -307
5546 -307 -228 -15 124 89 -19 -26 26 166 -37 113 -83 -44 85 13 21 49 -69 -76 -24 53 170 31 -109 -19 19
5571A9K0L0o3LJ86k14oL06j43m3l53M63l25J60l2J66j98m7J70M5j09l2o2L1K47
5596B19l09o7Q1J32n1j55J74J9j20K87j04l4l4l04J58J20j52Q9J74J06k92K17
5618A54j3j14j20J23p7l9J40q7K1J09R2l41K99k17l0K85j97j7k51K52l4J80l5
5641H3P0j85k77L66o2J55l0o6J27j5j29R4j36J11k48K67j77k59M81k03j91K88
5663F4k78N18k59j06K8M0L9J50l42K73k55J31l05K0P6P9L28k78j2N6p0P4J14j93
5687a08K06Mk82J95j76K85L6l36J19O0J11k25M2K32j0k53P7M9oj99J75q2n6J88
5711D6q9j85O4K03j15L06k60m6J04J45o1j13l2j13K99j83J39r6J01j05k06K33
5733C6J18j69J41l00L17J17l42mj4M7O4l2K06l54K8J63j65J20j93J12P4J53N1
$$ plain form
5571 19 39 69 6 9 195 -19 -25 281 138 95 -258 205 -120 40 8 174 -24 -71 99 144 35 3 -59 -28 219
5596 219 -90 -157 -76 56 5 -150 24 43 -77 210 106 72 38 -266 -108 12 -140 -51 123 229 -63 154
5618 154 141 27 -93 30 -47 -86 54 -33 -12 97 189 -152 147 -70 -100 185 -12 -29 -280 -28 -62 118 83
5641 83 153 -32 -309 57 -5 150 120 54 181 166 37 131 -5 106 -142 125 -52 -311 170 -33 -224 64
5663 64 -214 304 45 -61 -33 7 46 196 -146 127 -128 3 -302 -282 -206 -127 201 -77 -89 -33 -103 -29 85 -108
5687 -108 98 102 -180 15 -161 124 160 -176 -57 3 114 -111 -69 163 153 -100 -23 26 20 -179 -4 -86 -142 46
5711 46 -43 -228 -164 39 -76 230 -30 -76 28 173 112 -1 -33 -146 153 -30 109 13 114 9 -197 36
5733 36 154 -15 126 -174 143 260 -82 -86 -100 -53 11 -21 185 -169 -141 22 -143 -23 -216 -104 -30 123 174
5756A74j96N7J08n2J1J58l43M7J15O9l82K21J0n5L4M2l9J98j14J07j31N1OL8r1
5781D3n3O2j95J58J73k66M6J53p8l35L30j71J72J29l12l0J57j28L47j45j03K1
5803b5J48J15l27K97j46j07j13J92J49m5j27KQ9j49l8M2j50J05J29%j65L09j83
5826Bo1r4K33k33K08k3K5j5J82l40J94k44L31l98K71k3O3r2j10R0n8Q1o0K31j15
5851D5l05K99j74R1J60j44k7n0J91j30k14K86R5k40M70k39j95K2l3J76l43M09
5873A50k49J71K6k85K37j46K42k24L42n08J29J24k83L38M1j24O5l9k20J85k6p2
5895a26J56jm2R1j49R6j42K38k47Q6J39j54P0L8k96R5K06k03N2J41M0K3o7r4n1
5920a01L69l34j16K79k6m7P2k28P4k5P7mk50J86K7J77j18J8k01L37k30q0J03M1
$$ plain form
5756 174 -22 35 143 91 102 260 -83 -36 79 148 -234 -13 -3 -58 -24 18 -21 177 63 170 39 90 96 134 43
5781 43 -10 52 -143 15 188 -78 -32 121 43 -292 38 -133 39 168 -144 -174 -17 -145 202 57 -46 -25
5803 -25 123 238 -89 208 62 -45 -158 34 183 138 11 13 102 -47 -85 -43 -193 -88 41 41 -124 185 2
5826 2 -59 -153 80 -153 55 32 57 42 224 -116 78 -166 165 -233 38 15 78 -14 -124 -34 -92 -11 -71 160 45
5851 45 -260 39 -135 -44 116 -28 -55 -105 86 -44 -258 28 123 -117 353 114 -81 -59 -92 84 -259 150
5873 150 -99 72 98 -187 50 -96 146 -78 264 -244 -115 9 -274 64 105 -19 46 7 -213 -28 -54 -126
5895 -126 30 29 -13 78 -71 25 -117 121 -126 -40 99 -55 15 53 -243 -148 58 -145 -93 48 88 111 44 -50 -101
5920 -101 268 -66 -182 97 71 24 96 -132 -58 -83 -6 -10 -260 -74 -47 130 12 30 -171 166 -64 -144 -41 0
$$ [...]
8191a80
##END NTUPLES=NMR FID
##END=
