##TITLE=1H_Pr 53-2
 CDCl3
 8 sc, 
 20.09.2022
##JCAMPDX= 6.0         $$ Bruker NMR JCAMP-DX V2.0
##DATA TYPE= NMR FID
##DATA CLASS= NTUPLES
##ORIGIN= UXNMR, Bruker Analytische Messtechnik GmbH
##OWNER= root
$$ XWIN-NMR		Version 3.5
$$ Tue Sep 20 13:59:35 2022 Russian Standard Time (UT+4h)  she@DPX200
##.OBSERVE FREQUENCY= 200.1313499994
##.OBSERVE NUCLEUS= ^1H
##.DELAY= (6, 6)
##.ACQUISITION MODE= SIMULTANEOUS
##.ACQUISITION SCHEME= undefined
##.AVERAGES= 8
##.DIGITISER RES= 18
##SPECTROMETER/DATA SYSTEM= spect
##.PULSE SEQUENCE= zg30
##.SOLVENT NAME= CDCl3
##.SHIFT REFERENCE= (INTERNAL, CDCl3, 0, 15.7039)
##AUDIT TRAIL= $$ (NUMBER, WHEN, WHO, WHERE, WHAT)
$$ ##TITLE= Audit trail, XWIN-NMR		Version 3.5
$$ ##JCAMPDX= 5.01
$$ ##ORIGIN= Bruker BioSpin GmbH
$$ ##OWNER= she
$$ F:/spectra/data/she/nmr/H-F/1/audita.txt
$$ ##AUDIT TRAIL=  $$ (NUMBER, WHEN, WHO, WHERE, WHAT)
(   1,<2022-09-20 13:36:22.18 +0400>,<she>,<DPX200>,
      <created by zg, POWCHK disabled, PULCHK disabled
       configuration hash MD5:
       00 E9 B6 7A A2 85 ED C7 34 08 36 98 17 FE 4E 26
       data hash MD5: 16K
       60 6A 6B AF E1 76 D6 B7 56 BC 50 71 0F 91 7E 0B>)
$$ ##END=
$$ 
$$ hash MD5
$$ F2 8A E5 85 0F 71 94 1F A8 F5 29 6B 40 DD 17 7F
##$RELAX= 
##$RELAX= 
##$RELAX= 
##$RELAX= 
##$RELAX= 
##$RELAX= 
$$ Bruker specific parameters
$$ --------------------------
##$DU= <F:/spectra>
##$EXPNO= 1
##$NAME= <H-F>
##$PROCNO= 1
##$TYPE= <nmr>
##$USER= <she>
##$AMP= (0..31)
100 100 100 100 100 100 100 100 100 100 100 100 100 100 100 100 100 100 
100 100 100 100 100 100 100 100 100 100 100 100 100 100 
##$AQSEQ= 0
##$AQ_mod= 1
##$AUNM= <au_zg>
##$AUTOPOS= <>
##$BF1= 200.13
##$BF2= 200.13
##$BF3= 200.13
##$BF4= 200.13
##$BF5= 200.13
##$BF6= 200.13
##$BF7= 200.13
##$BF8= 200.13
##$BYTORDA= 1
##$CFDGTYP= 0
##$CFRGTYP= 5
##$CHEMSTR= <none>
##$CNST= (0..31)
1 1 145 1 1 1 1 1 1 1 1 1 1 1 1 1 1 1 1 1 1 1 1 1 1 1 1 1 1 1 1 1 
##$CPDPRG= <>
##$CPDPRG1= <>
##$CPDPRG2= <>
##$CPDPRG3= <>
##$CPDPRG4= <mlev>
##$CPDPRG5= <mlev>
##$CPDPRG6= <mlev>
##$CPDPRG7= <mlev>
##$CPDPRG8= <mlev>
##$CPDPRGB= <>
##$CPDPRGT= <>
##$D= (0..31)
0 1.2 0 0 0 0 0 0 0 0.06 0 0.03 0 0 0 0 0.0002 0 0 0 0 0 0 0 0 0 0 0 0 
0 0 0 
##$DATE= 1663666581
##$DBL= (0..7)
120 120 120 120 120 120 120 120 
##$DBP= (0..7)
150 150 150 150 150 150 150 150 
##$DBP07= 0
##$DBPNAM0= <>
##$DBPNAM1= <>
##$DBPNAM2= <>
##$DBPNAM3= <>
##$DBPNAM4= <>
##$DBPNAM5= <>
##$DBPNAM6= <>
##$DBPNAM7= <>
##$DBPOAL= (0..7)
0.5 0.5 0.5 0.5 0.5 0.5 0.5 0.5 
##$DBPOFFS= (0..7)
0 0 0 0 0 0 0 0 
##$DE= 6
##$DECBNUC= <off>
##$DECIM= 32
##$DECNUC= <off>
##$DECSTAT= 4
##$DIGMOD= 1
##$DIGTYP= 9
##$DL= (0..7)
0 120 120 120 120 120 120 120 
##$DP= (0..7)
150 150 150 150 150 150 150 150 
##$DP07= 0
##$DPNAME0= <>
##$DPNAME1= <>
##$DPNAME2= <>
##$DPNAME3= <>
##$DPNAME4= <>
##$DPNAME5= <>
##$DPNAME6= <>
##$DPNAME7= <>
##$DPOAL= (0..7)
0.5 0.5 0.5 0.5 0.5 0.5 0.5 0.5 
##$DPOFFS= (0..7)
0 0 0 0 0 0 0 0 
##$DQDMODE= 0
##$DR= 18
##$DS= 0
##$DSLIST= <SSSSSSSSSSSSSSS>
$$ [...]
##$SUBNAM2= <"">
##$SUBNAM3= <"">
##$SUBNAM4= <"">
##$SUBNAM5= <"">
##$SUBNAM6= <"">
##$SUBNAM7= <"">
##$SUBNAM8= <"">
##$SUBNAM9= <"">
##$SW= 18.0517283424941
##$SWIBOX= (0..15)
0 0 2 0 0 0 0 0 0 0 0 0 0 0 0 0 
##$SW_h= 3612.71676300578
##$TD= 16384
##$TD0= 1
##$TE= 0
##$TE2= 300
##$TE3= 300
##$TEG= 300
##$TL= (0..7)
0 120 120 120 120 120 120 120 
##$TP= (0..7)
150 150 150 150 150 150 150 150 
##$TP07= 0
##$TPNAME0= <>
##$TPNAME1= <>
##$TPNAME2= <>
##$TPNAME3= <>
##$TPNAME4= <>
##$TPNAME5= <>
##$TPNAME6= <>
##$TPNAME7= <>
##$TPOAL= (0..7)
0.5 0.5 0.5 0.5 0.5 0.5 0.5 0.5 
##$TPOFFS= (0..7)
0 0 0 0 0 0 0 0 
##$TUNHIN= 0
##$TUNHOUT= 0
##$TUNXOUT= 0
##$USERA1= <user>
##$USERA2= <user>
##$USERA3= <user>
##$USERA4= <user>
##$USERA5= <user>
##$V9= 5
##$VALIST= <valist>
##$VCLIST= <CCCCCCCCCCCCCCC>
##$VD= 0
##$VDLIST= <DDDDDDDDDDDDDDD>
##$VPLIST= <PPPPPPPPPPPPPPP>
##$VTLIST= <TTTTTTTTTTTTTTT>
##$WBST= 1024
##$WBSW= 4
##$XGAIN= (0..3)
0 0 0 0 
##$XL= 0
##$YL= 0
##$YMAX_a= 378030
##$YMIN_a= -469537
##$ZGOPTNS= <>
##$ZL1= 120
##$ZL2= 120
##$ZL3= 120
##$ZL4= 120
##$ABSF1= 10
##$ABSF2= 0
##$ABSG= 5
##$ABSL= 3
##$ALPHA= 0
##$AQORDER= 0
##$ASSFAC= 0
##$ASSFACI= 0
##$ASSFACX= 0
##$ASSWID= 0
##$AUNMP= <proc_1d>
##$AZFE= 0.1
##$AZFW= 0.1
##$BCFW= 1
##$BC_mod= 2
##$BYTORDP= 1
##$COROFFS= 0
##$CY= 11.3945322036743
##$DATMOD= 1
##$DC= 2
##$DFILT= <>
##$DTYPP= 0
##$F1P= 2.36226072786647
##$F2P= -0.459571619588291
##$FCOR= 0.5
##$FTSIZE= 0
##$FT_mod= 4
##$GAMMA= 1
##$GB= 0.15
##$INTBC= 1
##$INTSCL= 1
##$ISEN= 128
##$LB= 0.24
##$LEV0= 0
##$LPBIN= 0
##$MAXI= 10000
##$MC2= 0
##$MEAN= 0
##$ME_mod= 0
##$MI= 1.114404
##$NCOEF= 0
##$NC_proc= 0
##$NLEV= 6
##$NOISF1= 3.799351
##$NOISF2= 2.8
##$NSP= 1
##$NTH_PI= 0
##$NZP= 0
##$OFFSET= 15.70392
##$PC= 1
##$PHC0= -18044.7
##$PHC1= 26.00069
##$PH_mod= 1
##$PKNL= yes
##$PPARMOD= 0
##$PSCAL= 0
##$PSIGN= 0
##$REVERSE= no
##$SF= 200.130013532006
##$SI= 16384
##$SIGF1= 3
##$SIGF2= 2
##$SINO= 400
##$SIOLD= 16384
##$SREGLST= <1H.CDCl3>
##$SSB= 0
##$STSI= 0
##$STSR= 0
##$SW_p= 3612.71676300578
##$SYMM= 0
##$S_DEV= 0
##$TDeff= 0
##$TDoff= 0
##$TI= <>
##$TILT= no
##$TM1= 0
##$TM2= 0
##$TOPLEV= 0
##$USERP1= <user>
##$USERP2= <user>
##$USERP3= <user>
##$USERP4= <user>
##$USERP5= <user>
##$WDW= 1
##$XDIM= 8192
##$YMAX_p= 0
##$YMIN_p= 0
$$ End of Bruker specific parameters
$$ ---------------------------------
##NTUPLES= NMR FID
##VAR_NAME=  TIME,          FID/REAL,        FID/IMAG
##SYMBOL=    X,             R,               I
##VAR_TYPE=  INDEPENDENT,   DEPENDENT,       DEPENDENT
##VAR_FORM=  AFFN,          ASDF,            ASDF
##VAR_DIM=   8192,          8192,            8192
##UNITS=     SECONDS,       ARBITRARY UNITS, ARBITRARY UNITS
##FACTOR=    0.0002768,     1,               1
##FIRST=     0,             0,               0
##LAST=      2.2672688,     0,               0
##MIN=       0,             -469537,         0
##MAX=       2.2672688,     378030,          0
$$ Real data points
##PAGE= N=1
##DATA TABLE= (X++(R..R)), XYDATA
$$ plain form
0 0 0 0 0 0 0 0 0 0 0 0 -8 8 -8 8 -16 16 -24 31 -32 40 -48 59 -72 81 -97 113 -133 153 -177 203 -233 266
32 266 -303 343 -387 436 -490 548 -614 683 -763 847 -941 1042 -1152 1273 -1405 1550 -1707
49 -1707 1881 -2073 2283 -2517 2775 -3067 3392 -3767 4194 -4688 5270 -5969 6821 -7891 9280
64 9280 -11161 13869 -18118 25784 -43921 179986 -64472 -453930 55332 315084 32531
75 32531 -216236 -25665 109000 70649 -13705 -67116 -117361 26228 193968 64093 -226506
86 -226506 -143133 172625 161691 -132349 -150089 78379 121569 -43100 -95698 -19397 45224
97 45224 70048 41930 -79540 -111152 57015 145821 -25170 -119756 36468 104448 -41047
108 -41047 -77981 37845 48151 -17997 9469 18582 -63713 -47233 77814 58311 -78167 -51465
$$ packed form
0@%%%%%%%%%%qJ6j6J6k4L2m0N5o3P2q8J07j31J53j78K10k46K86l30L80m36M99
32B66n69O46p30Q23r26J038j162J297j446J610j788J983k194K425k678K955l257
49a707L588l954M356m800N292n842O459p159P961q882R958j1239J2790j4712J7171
64I280k0441K5030l1987M3902o9705K23907k44458l89458N09262K59752k82553
75C2531k48767J90571J34665l8351q4354n3411n0245J43589J67740j29875k90599
86b26506Q3373L15758j0934k94040j7740K28468M3190j64669n2598P6301O4621
97D5224K4824k8118j21470l1612J68167Q8806j70991r4586J56224O7980j45495
108d1047l6934J15826J0306o6148K7466R113q2295J6480J25047j9503j36478K6702
$$ plain form
120 -51465 70799 10461 -96751 10091 110098 -30694 -112886 49336 99440 -83131 -97998
131 -97998 112906 117323 -101698 -111258 82171 89267 -55967 -39978 59668 15390 -49518 7481
143 7481 31202 -31434 -11641 62280 9461 -84324 -28971 69202 25653 -52105 -14569 29767
155 29767 -15214 -30005 23421 14961 -30709 9145 44807 -29057 -61082 34223 70647 -16918
167 -16918 -46081 20395 25286 -24569 -3154 38483 3 -30442 14973 22830 -36022 -25496
179 -25496 45830 27323 -44582 -25945 26195 -2715 -29508 20651 31662 -38729 -40908 40934
191 40934 32792 -52291 -25956 66436 30794 -64109 -30945 52979 30310 -25715 -5433 18514
203 18514 -6133 -9269 17440 5621 -17796 9056 26903 -18528 -40391 12723 37089 -10678
$$ packed form
120e1465J22264o0338j07212J06842J00007j40792q2192J62222N0104j82571j4867
131i7998K10904M417k19021r560J93429P096j45234J5989R9646m4278o4908N6999
143G481K3721o2636J9793P3921n2819r3785N5353R8173m3549p7758L7536M4336
155B9767m4981j4791N3426q460m5670L9854L5662p3864l2025R5305L6424q7565
167a6918k9163O6476M891m9855K1415M1637l8480l0445M5415P857n8852J0526
179b5496P1326j8507p1905J8637N2140k8910k6793N0159J1011p0391k179Q1842
191D0934q142q5083K6335R2392l5642r4903L3164Q3924k2669n6025K0282K3947
203A8514k4647l136K6709j1819k3417K6852J7847m5431k1863N3114K4366m7767
$$ plain form
215 -10678 -28959 7290 6654 -23523 -4228 25913 -3008 -26201 9960 21660 -23472 -23590 31299
228 31299 30501 -22838 -21100 19466 12469 -12088 5769 19797 -5618 -13451 9444 7046 -14008
241 -14008 -106 22095 -992 -27255 -4507 16307 -4930 -14506 11548 8123 -24968 -14866
253 -14866 21263 7999 -22285 -559 24510 -4641 -26647 5377 26637 1441 -10859 5870
265 5870 5690 -7423 2443 14084 30 -6913 8300 5780 -15607 -9175 17888 10657 -17473 -12509
279 -12509 9043 -92 -14806 1060 12717 -6611 -13647 4801 4463 -11997 61 19007 1528
292 1528 -18649 -726 17553 2679 -7949 6556 11828 -2368 -6320 2780 4005 1424 6422
305 6422 2511 -12102 -8868 10056 7649 -12752 -9023 11031 3010 -18822 -9925 12609 6816 -9559
$$ packed form
215a0678j8281L6249o36l0177J9295L0141k8921k3193L6161J1700m5132j18N4889
228C1299p98n3339J738M0566o997k4557J7857J4028k5415p833K2895k398k1054
241a4008J3902K2201k3087k6263K2748K0814k1237r576K6054l425l3091J0102
253a4866L6129j3264l0284K1726K5069k9151k2006L2024K1260k5196j2300J6729
265E870j80j3113R866J1641j4054o943J5213k520k1387O432K7063p231k8130M964
279a2509K1552r135j4714J5866J1657j9328p036J8448l38j6460J2058J8946j7479
292A528k0177J7923J8279j4874j0628J4505N272j4196l952R100J225k581M998
305F422l911j4613L234J8924k407k0401L729K0054q021k1832Q897K2534n793j6375
$$ plain form
319 -9559 -5117 2656 -2674 -1558 7178 3133 -4409 3758 7458 -4623 -6459 9934 13301 -2397
333 -2397 -7987 2765 6484 -1540 -2649 3894 2026 -4992 -3907 -1536 -4181 -1620 5508 -308 -12014
348 -12014 -5747 7211 1828 -8701 -1056 8716 611 -8159 -1281 6366 4995 2813 1397 -1935
362 -1935 -636 5753 5356 -1318 -1145 4916 3328 -5106 -5435 3391 5227 -1876 -5216 -1773 -2757 -3889
378 -3889 1070 2102 -4595 -5862 971 1689 -3911 -3278 3450 4466 743 -2492 -2286 1254 7416 6910
394 6910 -1607 -4812 2103 7806 2747 -4525 -2047 6045 5409 -4551 -8852 -1548 5373 4048 -4079
409 -4079 -10177 -5464 5464 5358 -6228 -9439 1727 7970 110 -8369 -4976 5796 10824 3048
423 3048 -8398 -6394 8148 13470 1681 -9976 -3177 10829 10140 -5738 -12153 1652 13486
$$ packed form
319i559M442P773n330J116Q736m045p542Q167L700j2081j836J6393L367j5698
333b397n590J0752L719q024j109O543j868p018J085K371k645K561P128n816j1706
348a2014O267J2958n383j0529P645R772q105q770O878P647j371k182j416l332
362a935J299O389l97o674J73O061j588q434l29Q826J836p103l340L443r84j132
378c889M959J032o697j267O833P18n600O33O728J016l723l235K06L540O162n06
394F910q517l205O915N703n059p272K478Q092o36r960m301P304O921j325q127
409d079o098M713J0928j06j1586l211J1166O243p860q479L393J0772N028p776
423C048j1446K004J4542N322j1789j1657O799J4006o89j5878o415J3805J1834
$$ plain form
436 13486 4612 -11967 -12340 2063 11603 3272 -12275 -13745 3386 13699 -703 -16601 -7441
449 -7441 12792 13499 -6006 -17668 -2358 19078 14304 -10633 -16176 6122 20979 5382 -15183
462 -15183 -8767 13028 15847 -4536 -17014 -3737 13648 9115 -8781 -15265 -3531 10176 7541
475 7541 -9003 -14746 1061 13180 744 -14716 -7039 9974 9741 -3188 -7198 -924 5482 6650
489 6650 2904 -2256 -2872 2970 8171 3510 -6587 -5048 6757 9621 -2862 -10709 -3564 6790
503 6790 5617 -3711 -9879 -5727 4174 6248 -3055 -10806 -3835 8323 8300 -6043 -14277 -274 18494
518 18494 10835 -14197 -15823 11170 22618 -1508 -19356 -920 20122 9038 -12532 -10873 6410
531 6410 10110 926 -6729 -8112 -2090 7422 6146 -10270 -14969 3933 15174 -2524 -18572 -4033
$$ packed form
436A3486q874j6579l73J4403R540q331j5547j470J7131J0313j4402j5898R160
449g441K0233P07j9505j1662J5310K1436m774k4937n543K2298J4857j5597k0565
462a5183O416K1795K819k0383j2478J3277J7385m533j7896o484J1734J3707k635
475G541j6544n743J5807J2119j2436j5460P677J7013k33j2929m010O274O406J168
489F650l746n160o16N842N201m661j0097J539J1805K864j2483p847P145J0354
503F790j173r328o168M152R901K074r303p751O971J2158k3j4343q234J4003J8768
518A8494p659k5032j626K6993J1448k4126j7848J8436K1042j1084k1570J659J7283
531F410L700r184p655j383O022R512j276j6416m699J8902J1241j7698j6048J4539
$$ plain form
545 -4033 14699 5903 -11431 -6937 7405 6975 -649 -647 1427 -888 1539 6762 3172 -5348 -2008
560 -2008 8325 5817 -5721 -7170 2136 6914 861 -6841 -5821 620 3022 -638 -4181 -4156 -2244
575 -2244 2384 3832 -2588 -9014 -751 12179 5476 -12587 -8775 13726 15413 -7212 -13843 6685
589 6685 16794 -781 -12604 703 11253 1897 -5867 -1540 101 -2263 1695 3736 -5977 -8559
603 -8559 3776 7214 -6342 -10666 2466 8114 -2942 -8617 1096 6977 -15 -3713 2342 4296
617 4296 -1027 -1115 4787 4106 -1080 -1390 1964 2884 473 -1092 -652 1282 1956 -517 -4120 -3120 507
634 507 1403 -1024 -4150 -4373 797 4465 -1243 -8423 -2349 8677 4583 -8246 -6385 7660 10165
649 10165 -2980 -8218 2891 9544 2026 -4358 530 4303 1243 -215 -120 -2508 -2132 3930 2574
$$ packed form
545d033J8732q796j7334M494J4342m30p624KK074k315K427N223l590q520L340
560b008J0333k508j1538j449R306M778o053p702J020O441K402l660l543K5J912
575b244M628J448o420o426Q263J2930o703j8063L812K2501J687k2625o631K0528
589F685J0109j7575j1823J3307J0550r356p764M327J641k364L958K041r713k582
603h559J2335L438j3556m324J3132N648j1056n675R713N881o992l698O055J954
617D296n323q8N902o81n186l10L354R20k411j565M40J934O74k473l603J000L627
634E07Q96k427l126k23N170L668n708p180O074J1026m094j2829J861J4045K505
649A0165j3145n238J1109O653p518o384M888L773l060j458R5k388L76O062j356
$$ plain form
664 2574 -5847 -6181 2479 3547 -3971 -6107 -400 2685 -304 -2824 -2255 36 2216 1809 -527 -1654
680 -1654 1264 3854 2692 -939 -787 2451 3122 366 -366 1175 1151 743 392 -1049 -2263 -256 984
697 984 -909 -3160 -2155 -732 -306 -500 -1855 -2506 40 2108 -532 -3040 -618 4044 2358 -2105
713 -2105 -1202 3143 3948 470 -656 1456 2682 937 397 42 -69 343 875 -656 -2678 -1150 1002
730 1002 -348 -2276 -2218 -928 -713 -541 -1665 -1773 29 1121 267 -1413 151 2317 2037 132 -496
747 -496 1819 3329 742 -811 1287 2861 1441 -1418 -640 1052 723 -534 -2017 -1617 -69 -236
763 -236 -2424 -2474 -144 110 -1435 -2156 -693 195 5 -558 -546 164 1341 1089 216 500 1571 2404 1451
782 1451 -219 55 2210 2058 -283 -1034 815 1368 -555 -1604 -816 -10 -245 -1542 -2599 -1162 211
$$ packed form
664B574q421l34Q660J068p518k136N707L085k989k520N69K291K180m07k336j127
680a654K918K590j162l631J52L238O71k756p32J541k4m08l51j441j214K007J240
697I84j893k251J005J423M26j94j355o51K546K068k640k508K422M662j686m463
713b105R03M345Q05l478j126K112J226j745n40l55j11M12N32j531k022J528K152
730A002j350j928N8J290K15J72j124j08J802J092q54j680J564K166k80j905o28
747d96K315J510k587j553K098J574j420k859P78J692l29j257j483M00J548j67
763b36k188n0K330K54j545p21J463Q88j90n63J2P10J177k52q73K84J071Q33r53
782A451j670K74K155j52k341p51J849N53j923j049P88Q06k35j297j057J437J373
$$ plain form
799 211 -636 -2635 -1331 559 257 -1027 -748 1151 1872 236 -354 866 2534 1346 378 1124 1760
816 1760 943 914 389 -66 383 812 -230 -1679 -779 111 -910 -1884 -1094 -615 -1284 -1443 -897 -816 -615 -252
836 -252 -42 -82 -478 285 1281 815 397 1139 1603 794 839 1294 932 82 940 1155 -651 -1264 370 561
856 561 -1312 -1844 -778 -724 -1086 -842 -1324 -1730 -633 780 -496 -2150 -189 2333 857 -1376 -710
873 -710 2259 1875 -152 190 1614 1452 848 1409 504 -708 1109 1876 -848 -2121 404 1143 -1255
890 -1255 -2009 -618 -569 -1351 -381 -676 -2162 -1654 1145 1066 -2452 -2092 2379 2684 -1261 -1419 2489 2397 -201
909 -201 229 2231 326 -396 2427 1851 -2157 -1156 3241 1825 -3744 -2384 2005 1111 -2859 -2145 -174
926 -174 -582 -1578 -766 -610 -1100 -303 1040 -208 -1118 72 1483 1004 -35 886 906 884 1588 1371 -485
$$ packed form
799B11q47j999J304J890l02j284K79J899P21j636n90J220J668j188r68P46O36
816A760q17k9n25m55M49M29j042j449R00Q90j021r74P90M79o69j59N46Q1K01L63
836b52K10m0l96P63R96m66m18P42M64q09M5M55l62q50Q58K15j806o13J634J91
856E61j873n32J066N4l62K44m82m06J097J413j276j654J961K522j476k233O66
873g10K969l84k027L42J424j62o04N61r05j212J817P67k724j273K525P39k398
890a255p54J391M9p82R70k95j486N08K799p9l518L60M471L05l945j58L908r2k598
909b01M30K002j905p22K823n76m008J001M397j416n569J360M389q94l970P14J971
926a74m08r96Q12J56m90P97J343j248r10J190J411m79j039R21K0k2P04k17j856
$$ plain form
945 -485 110 2152 1395 -1546 -435 1679 -600 -2178 495 1019 -3094 -2913 2240 1017 -5195 -3381
961 -3381 3903 2182 -5468 -3017 4379 2559 -3754 -971 3826 924 -1676 2265 3195 -1962 -1222 5285
977 5285 2277 -4676 -1876 5586 2626 -4531 -2396 3330 1250 -3250 -2207 493 -356 -1679 -459
992 -459 -632 -1922 -1178 1369 443 -1998 -805 1243 1155 212 -302 -960 982 3283 1470 -2418 -244
1009 -244 4540 1873 -3327 -392 3101 -140 -2320 1019 507 -3672 -954 4088 -917 -6967 -818
1024 -818 6105 -175 -7513 -1719 6092 937 -5154 -927 4002 541 -1484 1727 1447 -2200 1251
1039 1251 5284 -64 -5142 1805 6573 -502 -5888 652 4639 -371 -3333 -474 524 -1396 -372
1054 -372 118 -2675 -2228 1828 1183 -3401 -2377 2329 1331 -1430 -246 1509 -461 359 3050 1174
$$ packed form
945d85N95K042p57k941J111K114k279j578K673N24m113J81N153j223o212J814
961c381P284j721p650K451P396j820o313K783M797k902k600L941R30n157P40O507
977E285l008o953K800P462k960p157K135N726k080m500J043K700q49j323J220
992d59j73j290P44K547r26k441J193K048q8r43n14o58J942K301j813l888K174
1009b44M784k667n200K935L493l241k180L339n12m179K718N042n005o050O149
1024h18O923o280p338N794P811n155o091M227M929l461k025L211k80l647L451
1039A251M033n348n078O947M768p075n386O540L987n010k962K859R98j920J024
1054c72M90k793M47M056o45m584J024M706r98k761J184J755j970Q20K691j876
$$ plain form
1070 1174 -2670 774 5477 641 -3722 852 4389 -267 -2608 955 1131 -2489 -641 2395 -1503
1085 -1503 -4768 810 3675 -2579 -5838 1091 4533 -1849 -4608 1094 3132 -924 -814 1867 41
1100 41 -1333 3084 3529 -2682 -2138 5071 3810 -3914 -2101 4496 2468 -3141 -1205 1690 -906 -2114
1116 -2114 885 -332 -3658 -1142 3017 -933 -4914 -220 3487 -644 -3277 1061 2451 -1322 -1565
1131 -1565 2431 1261 -1777 1386 4049 -289 -2484 2519 3272 -1640 -1919 2261 1231 -2812 -413
1146 -413 2023 -1259 -3376 707 2166 -3039 -3326 1736 1045 -3468 -1799 2421 368 -2863 849 2684
1162 2684 -965 -1321 3220 2045 -2677 -176 4512 1107 -3017 1093 3840 -781 -2613 1543 1863
1177 1863 -2185 -1335 1695 -225 -3639 -403 1994 -1715 -3411 655 1588 -2258 -2343 2048 1190 -2443
$$ packed form
1070A174l844L444M703m836m363M574L537m656k341L563J76l620J848L036l898
1085a503l265N578K865o254l259O929L442o382k759N702K038m056J10K681j826
1100D1j374M417M45o211N44P209j261p724J813O597k028n609J936K895k596j208
1116b114K999j217l326K516M159l950l981M694L707m131k633M338J390l773k43
1131a565L996j170l038L163K663m338k195N003P53m912k79M180j030m043K399
1146d13K436l282k117M083J459n205k87N062o91m513J669M220k053l231L712J835
1162B684l649l56M541j175m722K501M688l405m124M110K747m621j832M156L20
1177A863m048Q50L030j920l414L236K397l709j696M066R33l846q5M391q58l633
$$ plain form
1193 -2443 68 2858 -181 -1906 1847 2880 -1286 -1286 3138 2017 -2110 -2 3213 88 -2588 937
1209 937 2228 -1960 -2417 1550 779 -3068 -1788 1887 -426 -3283 -127 1556 -1217 -2244 1620 1504
1225 1504 -1971 -556 3007 835 -1830 1142 3124 -321 -1504 2054 1969 -1335 -660 2389 1000 -2078
1241 -2078 -53 1950 -1157 -2777 408 1322 -2210 -2519 1224 304 -2466 -1144 1541 -417 -2287 1154
1257 1154 1849 -1380 -1033 2578 1218 -1653 179 3216 477 -1480 1058 2247 -295 -886 1565 1047
1273 1047 -1290 -556 1338 -613 -2354 -208 1022 -1387 -2662 398 862 -1950 -1562 1729 199 -1616
1289 -1616 328 1841 -413 -1395 1432 1808 -731 -330 2189 954 -786 578 1470 -244 -1280 714
1305 714 1165 -1254 -1332 368 161 -1937 -1151 621 -569 -1921 -85 760 -929 -910 892 150 -1107
$$ packed form
1193b443K511K790l039j725L753J033m166%M424j121m127K108L215l125k676L525
1209I37J291m188m57L967p71l847J280L675k313k857L156J683k773j027L864j16
1225A504l475J415L563k172k665K972J982l445j183L558q5l304O75L049j389l078
1241b078K025K003l107j620L185R14l532l09L743r20k770J322K685j958j870L441
1257A154O95l229L47L611j360k871J832L037k739j957K538J189k542n91K451n18
1273A047k337P34J894j951j741K146J230k409j275L060M64k812L88L291j530j815
1289a616J944J513k254r82K827L76k539M01K519j235j740J364Q92j714j036J994
1305G14M51k419p8J700k07k098P86J772j190j352J836Q45j689J9J802p42j257
$$ plain form
1322 -1107 -32 1578 173 -729 1285 1937 -93 -117 1475 886 -574 35 1457 42 -1099 121
1338 121 1197 -584 -1488 133 551 -1410 -1262 55 -110 -1585 -530 553 -407 -1025 369 888 -698
1355 -698 -470 932 721 -138 -21 1239 706 261 720 312 353 306 629 26 -404 -341 448 -237 -906 -490
1375 -490 -201 -689 -682 -486 -268 -559 35 120 -1039 -712 431 942 -376 -413 870 1288 229 -194 707 906
1395 906 226 528 278 335 -15 587 676 -280 -803 -330 334 -485 -1322 -715 117 -412 -965 -817 156 159 -471
1416 -471 -778 -120 360 -22 291 258 318 -24 612 1058 88 -119 851 1665 400 -810 108 797 225 -971
1436 -971 -783 448 24 -1131 -809 -163 -619 -1333 -203 58 -667 -742 169 620 -677 -794 599 1231 -225
1455 -225 -943 716 1970 578 -704 582 1434 295 -491 386 1048 -905 -793 898 155 -1579 -1103
$$ packed form
1322a107J075J610j405r02K014O52k030k4J592n89j460O09J422j415j141J220
1338A21J076j781r04J621M18j961J48J317j65j475J055J083r60o18J394N19j586
1355f98K28J402k11q59J17J260n33m45M59m08M1m7L23o03m30O3P89o85o69M16
1375d90K89m88PJ96K18k91N94Q5j159L27J143N11j318l7J283M18j059m23R01J99
1395I06o80L02k50N7l50O02Q9r56n23M73O64q19q37O07Q32n29n53J48R73Lo30
1416d71l07O58M80l82L13l3O0l42O36M46r70k07R70Q14j265j210R18O89n72j196
1436i71J88J231m24j155L22O46m56p14J130K61p25p5R11M51j297j17J393O32j456
1455b25p18J659J254j392j282J286Q52j139p86Q77O62j953J12J691p43j734M76
$$ plain form
1472 -1103 920 306 -2043 -1632 1034 424 -1617 -1286 920 301 -1029 -10 816 324 -654 659 1015
1489 1015 91 -271 1188 1612 -137 -832 443 1733 47 -1470 -460 1229 -3 -1547 -681 295
1505 295 -455 -1024 -845 122 -494 -1107 -171 654 -809 -1008 515 1577 -207 -1018 741 1950 199 -1077
1523 -1077 1095 2010 -279 -823 1017 1076 -773 -731 1051 278 -1644 -633 1120 -440 -2127 -732 1227
1540 1227 -144 -1817 -768 936 -322 -1584 -195 790 -400 -308 680 891 49 184 1110 920 223
1557 223 -135 1098 590 22 -713 131 826 -414 -655 -354 0 -194 -733 -761 -532 -390 -860 -421 -67 -422
1577 -422 -541 146 708 -347 -498 674 1472 -500 -578 1410 1222 -489 138 1249 707 -614 91 1171
1595 1171 -344 -1009 -16 995 -662 -1473 -36 350 -989 -1390 -144 356 -794 -898 690 181 -1015
$$ packed form
1472a103K023o14k349M11K666o10k041L31K206o19j330J019Q26m92r78J313L56
1489A015r24l62J459M24j749o95J275J290j686j517J010J689j232j544Q66R76
1505B95p50n69J79R67o16o13R36Q25j463j99J523J062j784q11J759J209j751j276
1523a077K172R15k289n44J840N9j849M2J782p73j922J011J753j560j687J395J959
1540A227j371j673J049J704j258j262J389R85j190R2R88K11q42J35R26j90o97
1557B23l58J233n08n68p35Q44O95j240k41L01L54j94n39k8K29J42m70M39L54l55
1577d22j19O87N62j055j51J172P98j972p8J988j88j711O27J111n42j321P05J080
1595A171j515o65R93J011j657q11J437L86j339m01J246N00j150j04J588n09j196
$$ plain form
1612 -1015 258 974 -104 -465 1011 1424 -55 -21 981 675 -84 370 607 232 -88 -45 119 -267 -377
1631 -377 317 -426 -845 -210 -141 -629 -852 -124 -175 -624 -136 579 -335 -728 627 611 -493 -355 1143 867
1651 867 -454 483 1235 633 -451 886 968 -182 -494 271 626 -985 -766 357 81 -1285 -567 569
1669 569 -247 -1294 -102 484 -640 -1064 479 838 -439 59 995 420 -129 457 1207 8 349 445
1687 445 363 -72 75 474 -21 -54 71 307 -597 -977 -51 -377 -732 -545 131 -319 -938 -51 573 -647
1707 -647 -633 629 517 -469 -68 1310 418 -339 487 1197 267 -112 835 968 -135 -409 505 430 -675
1726 -675 -641 561 -168 -1151 -336 410 -699 -980 -250 31 -1150 -410 172 -108 -443 114 583 331 40
1745 40 666 919 113 269 954 443 70 494 653 39 -81 413 253 -291 -397 56 23 -681 -416 301 -731
$$ packed form
1612a015J273P16j078l61J476M13j479L4J002l06p59M54K37l75l20M3J64l86j10
1631c77O94p43m19O35O9m88k23P28n1m49M88P15r14l93J355j6j104J38J498k76
1651H67j321R37P52o02j084J337Q2j150l12P65L55j611K19J123k76j366P18J136
1669E69q16j047J192N86j124m24J543L59j277M98R36n75n49N86P50j199L41R6
1687D45q2m35J47L99m95l3J25K36r04l80R26l26l55J87O76m50o19Q87O24j220
1707f47J4J262j12r86M01J378q92p57Q26P10r30l79R47J33j103k74R14p5j105
1726f75L4J202p29r83Q15P46j109k81P30K81j181P40N82k80l35N57M69k52k91
1745D0O26K53q06J56O85n11l73M24J59o14j20M94j60n44j06M53l3p04K65P17j032
$$ plain form
1766 -731 -921 143 85 -436 -271 374 306 -323 313 541 169 -99 660 741 52 -21 907 575 -63 243 479
1787 479 46 -421 -4 556 -342 -447 -124 121 -697 -707 107 -298 -908 -121 262 -465 -714 319 419 -266
1807 -266 -48 748 579 -105 50 626 317 -108 808 692 -162 -199 546 368 -378 -265 346 -83 -565 -196
1827 -196 -78 -415 -841 -110 13 -850 -415 322 -149 -526 88 602 -68 49 631 583 108 105 711 410 -8
1848 -8 321 720 96 -266 120 377 -360 -243 -37 76 -691 -606 -124 -551 -663 -340 65 -731 -564 428 -53
1869 -53 -244 234 521 493 -144 721 546 333 301 589 306 202 632 462 131 -305 218 435 -524 -571 92
1890 92 -71 -461 -717 304 -459 -751 -126 320 -190 -686 0 360 -105 -257 169 404 265 174 628 485
1910 485 485 269 576 184 -65 150 272 44 -148 -176 15 -248 -242 -418 -280 -167 -99 -276 -509 -54 3 -589
$$ packed form
1766g31j90J064n8n21J65O45o8o29O36K28l72k68P59Q1o89p3R28l32o38L06K36
1787D79m33m67M17N60q98j05L23K45q18j0Q14m05o10P87L83p27k49J033J00o85
1807b66K18P96j69o84J55N76l09m25R16j16q54l7P45j78p46J13O11m29m82L69
1827a96J18l37m26P31J23q63M35P37m71l77O14N14o70J17N82m8m75lO06l01m18
1848hL29L99o24l62L86K57p37J17K06J13p67Q5M82m27j12L23M05p96J67R92m81
1869e3j91M78K87k8o37Q65j75k13l2K88k83j04M30j70l31m36N23K17r59m7O63
1890I2j63l90k56J021p63k92O25M46n10m96O86L60m65j52M26K35j39r1M54j43
1910D85%k16L07l92k49K15J22k28j92k8J91k63Oj76J38J13O8j77k33M55N7n92
$$ plain form
1932 -589 -298 323 72 -233 209 287 -3 -23 548 496 49 -55 637 660 -184 -179 544 573 -517 -624 -343 -127
1954 -127 -510 -665 113 -336 -892 -429 134 -102 -1039 -263 165 -230 -464 270 339 174 24 409 653 465
1974 465 129 404 731 49 136 20 578 -163 -250 332 44 -119 -619 -9 247 -447 -432 -193 -300 -487 -410
1995 -410 -13 -109 -391 124 311 9 -173 125 488 319 224 414 521 356 246 204 391 399 52 -308 221 39
2017 39 -354 -366 162 64 -532 -450 104 -124 -577 -292 70 -14 -521 -124 572 251 -186 -98 659 228 -135 374
2039 374 921 -73 31 595 420 -458 -434 422 185 -460 -347 274 -78 -815 -429 -8 -83 -617 -250 84 -269
2060 -269 -526 170 -134 -52 127 192 5 20 158 535 456 263 500 212 189 344 74 -106 -118 262 146 -395
2082 -395 -199 183 -208 -716 39 25 -764 -486 278 -218 -816 -290 411 -23 -398 278 722 -107 -217 566
$$ packed form
1932e89K91O21k51l05M42P8k90k0N71n2m47j04O92K3q44NP23K9j090j07K81K16
1954a27l83j55P78m49n56M63N63k36r37P76M28l95k34P34O9j65j50L85K44j88
1974D65l36K75L27o82Q7j16N58p41q7N82k88j63n00O10K56o94J5K39j07j87P7
1995d10L97r6k82N15J87l02j82K98L63j69r5J90J07j65j10m2J87Ql47l60N29j82
2017C9l93j2N28r8n96Q2N54k28m53K85L62q4n07L97O96l21m37Q8P57m31l63N09
2039C74N47r94J04N64j75q78K4Q56k37o45J13O21l52p37L86M21p5n34L67L34l53
2060b69k57O96l04Q2J79O5j87J5J38L77p9j93K37k88k3J55k70j80j2L80j16n41
2082c95J96L82l91n08P55j4p89K78P64m96n98N26P01m34l75O76M44q29j10P83
$$ plain form
2102 566 446 -258 -30 470 463 -399 140 305 159 -377 20 180 -357 -433 286 -67 -587 -473 90 -323 -266
2123 -266 -64 61 -323 -354 -43 58 190 234 617 190 -29 320 802 101 36 828 530 -344 -77 450 -204
2144 -204 -581 141 433 -809 -488 211 47 -933 -582 156 -284 -776 36 406 -399 -386 412 362 -340 -222
2164 -222 392 398 71 38 649 527 -402 299 564 -200 51 272 412 -390 -258 85 -259 -468 -195 137 -554
2185 -554 -489 -268 -249 -631 80 496 77 -336 259 354 -414 -143 834 487 -100 445 710 84 -138 237 441
2206 441 -374 -498 435 426 -595 -349 404 -356 -885 -326 298 -541 -540 -43 117 -378 -263 318 267 -177 127
2227 127 595 152 -304 459 435 205 -184 474 224 -72 227 733 30 -574 -26 -116 -347 -510 307 -124 -337
2248 -337 -200 -9 -293 -641 122 395 -356 -220 272 111 -261 140 581 149 -194 481 704 -146 -155 399 581
$$ packed form
2102E66j20p04K28N00pq62N39J65j46n36L97J60n37p6P19l53n20J14N63m13N7
2123b66K02J25l84l1L11J01J32M4L83m27k19L49M82p01o5P92k98q74K67N27o54
2144b04l77P22K92j242L21O99j64r80L51P38m40m92Q12L70q05J3P98n0p02J18
2164b22O14Ol27l3O11j22r29P01K65p64K51K21J40q02J32L43l44k09K73L32o91
2185e54O5K21J9l82P11M16m19m13N95R5p68K71R77l47n87N45K65o26k22L75K04
2206D41q15j24R33rj021K46P53p60n29N59O24q39JM97J60m95J15N81n1m44L04
2227A27M68m43m56P63k4k30l89O58k50k96K99N06p03o04N48r0k31j63Q17m31k13
2248c37J37J91k84l48P63K73p51J36M92j61l72M01M41m32l43O75K23q50rN54J82
$$ plain form
2269 581 77 -159 376 212 -413 -25 217 -215 -423 174 -52 -362 -251 61 -154 -609 -331 192 -153 -115
2289 -115 225 422 -132 115 585 210 -204 286 833 -133 126 456 468 -15 -197 378 12 -614 -195 192
2309 192 -574 -477 -502 225 -501 -503 -26 -113 -321 -191 392 -24 -227 324 539 135 -118 179 459 243 367 376
2331 376 319 -174 143 343 146 -195 186 127 -226 -159 262 -448 -411 -77 -30 -330 -293 141 88 -697 -367 754
2353 754 -62 -211 248 557 -105 -120 291 469 -215 146 170 182 -15 31 353 120 -129 -51 85 -125 -236 -59
2375 -59 214 -469 -184 -22 -165 -380 -37 39 0 -166 80 338 251 479 40 313 184 247 481 332 -51 15
2397 15 -22 10 153 205 -47 -134 38 121 -323 -386 -250 -306 -217 -225 34 -158 -80 -293 -23 -207 -182 338 221 7
2421 7 12 316 191 62 178 382 302 52 64 111 188 36 -20 -36 -189 -241 -62 -238 -269 -97 167 -334 -436 86
$$ packed form
2269E81n04k36N35j64o25L88K42m32k08N97k26l10J11L12k15m55K78N23l45L8
2289a15L40J97n54K47M70l75m14M90N47r66K59L30J2m83j82N75l66o26M19L87
2309A92p66R7k5P27p26kM77q7k08J30N83m16k03N51K15m04k53K97K80k16J24R
2331C76n7m93L17K00j97l41L81n9l53O7M21p10L7L34M7l00L7M34n3p85L30J121
2353G54q16j49M59L09o62j5M11J78o84L61K4J2j97M6L22k33k49P8J36k10j11J77
2375e9K73o83K85J62j43k15L43P6l9j66K46K58q7K28m39K73j29O3K34j49l83O6
2397A5l7L2J43N2k52q7J72Q3m44o3J36n6Q9qK59j92P8k13K70j84K5N20j17k14
2421GNL04j25j29J16K04q0k50J2M7P7j52n6j6j53n2J79j76l1J72K64n01j02N22
$$ plain form
2445 86 -267 -365 -140 147 -45 -68 465 176 -86 -194 450 264 90 224 273 386 179 478 399 7 7 57 -149
2468 -149 -198 -319 -94 140 -245 -281 -478 23 -133 -119 -195 -157 -115 -325 -71 97 57 168 392 87 394 -62
2490 -62 33 -164 233 59 -4 174 88 86 -136 209 -40 -263 -91 169 136 -157 248 45 -312 -363 -123 -31 195
2513 195 -298 9 -94 -290 124 343 185 154 272 91 -14 60 56 85 150 -88 1 233 119 -299 -3 -281
2535 -281 45 -476 -83 -217 -106 -520 -249 270 26 -192 -189 187 112 -59 19 259 219 -220 331 154 47 50
2557 50 380 85 -1 -198 167 182 -33 51 -29 -82 -354 -226 -115 -265 -271 -53 -186 -73 -197 -18 3 205 34
2580 34 253 54 441 302 24 178 412 -82 -387 403 496 103 77 249 123 5 -17 355 -55 -433 -17
2601 -17 73 -125 -307 -255 43 -277 -406 -65 359 98 -286 63 385 -174 185 138 172 -45 239 383 156 -289
$$ packed form
2445H6l53r8K25K87j92k3N33k89k62j08O44j86j74J34M9J13k07K99p9l92%N0k06
2468a49m9j21K25K34l85l6j97N01j56J4p6L8M2k10K54J68m0J11K24l05L07m56
2490f2R5j97L97j74o3J78q6kk22L45k49k23J72K60l3k93M05k03l57n1K40R2K26
2513A95m93L07j03j96M14K19j58l1J18j81j05P4mK9O5k38Q9K32j14m18K96k78
2535b81L26n21L93j34J11m14K71N19k44k18LL76p5j71P8K40m0m39N51j77j07L
2557E0L30k95q6j97L65J5k15Q4q0n3k72J28J11j50oK18j33J13j24J79K1K02j71
2580C4K19j99L87j39k78J54K34m94l05P90R3l93k6J72j26j18k2L72m10l78M16
2601a7R0j98j82N2K98l20j29L41M24k61l84L49L22n59L59m7L4k17K84J44k27m45
$$ plain form
2623 -289 195 285 -234 113 284 8 -76 -204 -50 -3 -92 65 -70 -264 -177 -162 -172 -336 -149 -287 -3 -130
2645 -130 244 249 -48 269 235 262 80 131 407 -300 32 94 190 146 30 182 -169 -374 -148 -46 -340 -401 -52
2668 -52 -27 -320 -394 37 58 -145 -210 194 -7 -134 166 132 -136 60 397 391 -149 54 412 -45 26 76 -33
2691 -33 -223 166 21 -94 -188 58 49 -349 -321 -100 -190 -330 -376 19 -39 -44 -198 42 247 -236 219 212 -123 -142
2715 -142 230 471 118 10 513 145 -53 -37 65 -71 -217 292 10 -585 -384 27 -165 -528 43 -157
2735 -157 -161 -462 -172 363 -131 7 123 146 -82 223 227 245 -57 182 267 -191 76 204 191 -212 -121 -32 -90 -206
2759 -206 -224 389 -84 -519 -220 -132 -329 -249 86 -178 -236 39 199 183 219 103 234 53 -14 317 171 86 6
2782 6 162 -42 169 122 315 22 141 172 41 -336 -329 387 -394 -345 -3 39 -305 -219 124 73 -167 -185 21 38
$$ packed form
2623b89M84R0n19L47J71k76q4j28J54M7q9J57j35j94Q7J5j0j64J87j38K84j27
2645a30L74Nk97L17l4K7j82N1K76p07L32O2R6m4j16J52l51k05K26J02k94o1L49
2668e2K5k93p4M31K1k03o5M04k01j27L00l4k68J96L37on40K03L58m57P1N0j09
2691c3j90L89j45j15r4K46rl98K8K21r0j40m6L95n8nj54K40K05m83M55pl35j9
2715a42L72K41l53j08N03l68j98J6J02j36j46N09k82n95K01M11j92l63N71k00
2735a57ml01K90N35m94J38J16K3k28L05MJ8l02K39Q5m58K67J28j3m03R1Q9n8j16
2759b06j8O13m73m35K99Q8j97Q0L35k64n8K75J60j6L6j16J31j81o7L31j46q5q0
2782FJ56k04K11m7J93k93J19L1j31l77PP16p81M9L42M2l44Q6L43n1k40j8K06J7
$$ plain form
2806 38 -136 170 471 70 148 67 382 55 35 262 16 -63 -40 -44 95 -99 -45 -62 -67 -75 -41 -49 -369 -307 -173 -166 -240
2833 -240 -140 309 -159 241 143 -35 -493 48 72 123 51 45 363 -28 351 166 208 168 245 197 -7 -575 97
2856 97 159 -40 18 200 -415 -151 -247 -53 -16 -479 19 156 -209 -199 140 229 264 -199 355 282 -22 -85 366
2879 366 129 179 136 207 168 -132 91 -35 65 -19 -96 19 -458 -130 11 -145 -225 119 96 -68 258 84 -120
2902 -120 -126 282 89 22 52 38 358 41 159 317 165 -199 70 489 -96 -258 -75 265 -168 -117 -22 45 39
2925 39 -256 183 -56 -155 -176 -83 -294 -335 72 105 6 -151 34 179 168 104 238 157 -8 14 324 167 76 150
2949 150 86 -4 -148 6 -63 -320 -161 60 90 -33 87 -98 -321 -108 378 -153 -144 30 98 -87 133 252
2971 252 -77 -102 14 383 37 42 292 92 195 -110 83 59 -160 70 26 -278 -132 -220 -97 -255 -154 -43
$$ packed form
2806C8j74L06L01m01P8q1L15l27k0K27k46p9K3mJ39j94N4j7nqL4ql20O2J34Pp4
2833b40J00M49m68M00r8j78m58N41K4N1p2oL18l91L79j85M2m0P7m8k04n68O72
2856I7O2j99N8J82o15K64r6J94L7m63M98J37l65J0L39Q9L5m63N54p3l04o3M51
2879C66k37N0m3P1l9l00K23j26J00q4p7J15m77L28J41j56q0L44k3j64L26j74k04
2902a20oM08j93o7L0j4L20l17J18J58j52l64K69M19n85j62J83L40m33N1R5O7o
2925C9k95M39k39r9k1R3k11m1M07L3r9j57J85J45j1o4J34q1j65K2L10j57r1P4
2949A50o4r0j44J54o9k57J59K21L0j23J20j85k23K13M86n31RJ74O8j85K20J19
2971B52l29k5J16L69l46NK50k00J03l05J93k4k19K30m4l04J46q8J23j58J01J11
$$ plain form
2993 -43 155 118 -207 137 148 -186 77 -8 -36 -41 259 -89 198 71 129 208 185 389 -51 -202 345 -51 -4 -84
3017 -84 -184 -142 -159 -87 56 -157 -105 -169 -65 70 129 -167 -81 -77 -35 40 40 109 -17 283 46 82 129 -52 89 114
3043 114 44 128 161 85 184 247 -163 -42 -243 -81 -26 -21 76 136 -86 13 -91 159 -345 183 -31 115 131 327
3067 327 59 63 97 315 147 81 32 115 -219 -153 56 239 -27 -44 -50 204 -154 -61 -138 -116 -359 64 -87 -107 -40
3092 -40 -16 -4 -266 -258 255 339 21 -48 44 14 100 79 79 77 22 152 45 120 -27 -253 -77 142 -96 6 -87 50
3118 50 -117 -126 31 -289 -126 94 -15 -135 -289 212 -51 -2 -42 108 258 158 96 170 57 248 188 -6 123
3141 123 33 155 86 -262 -81 -10 -129 92 -253 -61 -471 -156 43 -255 -199 -3 21 105 80 195 -108 -89 -51
3164 -51 311 150 143 50 94 201 112 185 29 -58 -297 208 120 15 -12 93 71 -156 -60 -82 -385 20 -209 -48
$$ packed form
2993d3J98l7l25L44J1l34K63q5k8nL00l48K87j27N8P9k3K04m40j51N47l96M7q0
3017h4j00M2j7P2J43k13N2o4J04J35N9k96Q6MM2P5%O9j26L00k37L6M7j81J41K5
3043A14p0Q4L3p6R9O3m10J21k01J62N5NR7O0k22R9j04K50n04N28k14J46J6J96
3067C27k68ML4K18j68o6m9Q3l34O6K09J83k66j7oK54l58R3p7K2k43M23j51k0O7
3092d0K4J2k62QN13Q4l18o9R2l0Q6k1%kn5J30j07P5j47k26J76K19k38J02r3J37
3118E0j67rJ57l20J63K20j09j20j54N01k63M9m0J50J50j00o2P4j13J91o0j94J29
3141A23r0J22o9l48J81P1j19K21l45J92m10L15J99k98N6J96K4Q4k5J15l03J9L8
3164e1L62j61pr3M4J07q9P3j56q7k39N05q8j05k7J05k2k27R6k2l03M05k29J61
$$ plain form
3188 -48 -348 -212 -79 16 155 71 82 24 245 78 -136 2 236 221 -84 -18 202 -53 -86 -158 8 47 -259
3211 -259 -41 -220 -461 -345 -34 -55 -107 -250 267 65 -32 126 131 20 16 34 184 26 60 30 111 188 -88 176
3235 176 19 4 279 -87 -145 -130 132 -15 -155 -85 -338 51 -57 -379 17 -229 37 -80 100 -252 -246 15
3257 15 -72 8 -3 214 105 160 109 -80 49 181 18 263 173 -335 122 -88 -204 -263 157 -112 143 -216 -262
3280 -262 -84 -133 -1 -92 -36 33 -141 262 7 265 -133 261 -162 343 221 -194 24 81 35 -95 161 10
3302 10 -180 116 29 276 205 114 205 -262 -172 -298 -94 -369 -126 -99 -51 -125 -35 42 222 34 -109 160 279 293
3326 293 102 61 107 158 57 56 -20 22 207 -270 -55 -49 -168 -14 58 223 3 -77 225 -182 -192 -44 -14 -105 -65
3351 -65 -258 249 -64 -10 19 64 161 151 309 94 55 72 177 -73 -49 121 46 -126 -214 -132 70 9 67 -203 -395
$$ packed form
3188d8l00J36J33R5J39q4J1n8K21j67k14J38K34j5l05O6K20k55l3p2J66L9l06
3211b59K18j79k41J16L11k1n2j43N17k02r7J58Nj11mJ8J50j58L4l0Q1P7k76K64
3235A76j57j5K75l66n8J5K62j47j40P0k53L89j08l22L96k46K66j17J80l52OK61
3257A5q7Q0j1K17j09N5n1j89J29J32j63K45r0n08M57k10j16n9M20k69K55l59m6
3280b62J78m9J32r1N6O9j74M03k55K58l98L94m23N05j22m15K18N7m6j30K56j51
3302A0j90K96q7K47p1r1R1m67R0j26K04k75K43K7M8p4R0P7J80j88j43K69J19J4
3326B93j91m1M6N1j01jp6M2J85m77K15Oj19J54P2J65k20q0L02m07j0J48L0r1M0
3351f5j93N07l13N4K9M5R7j0J58k15l9J7J05k50K4J70p5j72q8Q2K02o1N8k70j92
$$ plain form
3376 -395 -316 -33 125 -152 150 -99 -149 61 -75 -43 217 119 -110 50 -166 212 94 221 68 61 56 -32 -103
3399 -103 -103 85 -245 -74 110 109 -152 215 -210 -192 -219 -153 -20 98 -111 -25 205 95 -118 -149 171 74 294
3422 294 205 87 -136 -72 300 107 -82 341 -34 215 -14 148 39 -65 49 -199 -34 -351 -55 -265 -429
3443 -429 -160 -383 -229 -185 91 -50 -211 -48 130 107 -15 -126 -70 95 201 86 330 -105 58 -161 17
3464 17 -169 70 341 86 -159 -136 -32 -10 -422 92 17 -182 65 -107 146 -24 -132 -53 147 -2 63 77
3486 77 79 266 421 -53 213 55 329 60 42 29 124 161 50 -211 -133 -164 158 -201 -236 -71 -101 -324 19 -152
3510 -152 -180 -77 -154 -69 196 -129 7 -8 74 237 -30 9 56 -28 -78 217 191 157 136 57 -17 -100 223 134 -1
3535 -1 -306 63 256 -221 5 -336 -137 5 -320 -82 -79 56 -57 144 22 -57 -170 62 184 -155 229 -83
$$ packed form
3376c95P9K83J58k77L02k49n0K10j36L2K60r8k29J60k16L78j18J27j53pnq8p1
3399a03%J88l30J71J84jk61L67m25J8k7O6J33J18k09Q6K30j10k13l1L20r7K20
3422B94q9j18k23O4L72j93j89M23l75K49k29J62j09j04J14k48J65l17K96k10j64
3443d29K69k23J54M4K76j41j61J63J78k3j22j11N6J65J06j15K44m35J63k19J78
3464A7j86K39K71k55k45K3J04K2m12N14p5j99K47j72K53j70j08P9K00j49O5J4
3486G7KJ87J55m74K66j58K74k69j8j3R5L7j11k61P8l1L22l59l5J65l0k23L43j71
3510a52k8J03p7Q5K65l25J36j5Q2J63k67L9M7q4n0K95k6l4k1p9p4q3L23q9j35
3535al05L69J93m77K26l41J99J42l25K38LJ35j13K01j22p9j13K32J22l39L84l12
$$ plain form
3557 -83 61 212 34 69 -58 -96 -31 140 206 64 -115 -83 37 -179 57 -226 -263 -98 74 -343 55 -6 71
3580 71 116 -21 142 -71 164 -352 100 182 16 -74 -153 119 195 -87 -27 -25 190 -28 -81 -53 -53 -140 -282 -184 -73
3605 -73 35 -57 86 236 -70 56 -65 144 69 116 47 275 28 88 172 103 173 129 -43 150 65 174 145 -106
3629 -106 -126 -98 62 -367 -18 22 -109 90 -149 -48 19 -105 -30 72 -54 -189 -6 -1 233 104 -71 81
3651 81 351 43 206 75 -88 64 104 18 85 101 -171 53 -150 11 -171 -74 186 -76 26 -54 -124 -38 -295
3674 -295 -33 63 177 66 158 307 269 16 -51 -132 10 1 97 200 -116 155 63 -114 -72 -109 -53 -21 216 -126
3698 -126 78 -83 -135 67 -235 -61 -168 -106 -70 -197 44 228 -197 103 -225 21 -103 -186 -97 87 26 92
3720 92 -156 -138 -55 -208 -82 -60 -115 21 -110 -161 -9 -76 20 -66 -205 9 -98 171 95 105 -154 15 63 128
$$ packed form
3557h3J44J51j78L5j27l8O5J71O6j42j79L2J20k16K36k83l7J65J72m17L98o1P7
3580G1M5j37J63k13K35n16M52Q2j66r0p9K72P6k82O0KK15k18n3K8%q7j42R8J11
3605g3J08r2J43J50l06J26j21K09p5M7o9K28k47O0Q4o9P0m4j72J93q5J09k9k51
3629a06k0K8J60m29L49M0j31J99k39J01O7j24P5J02j26j35J83NK34j29j75J52
3651H1K70l08J63j31j63J52M0q6O7J6k72K24k03J61j82R7K60k62J02q0p0Q6k57
3674b95K62R6J14j11R2J49l8k53o7q1J42rR6J03l16K71r2j77M2l7N6L2K37l42
3698a26K04j61n2K02l02J74j07O2L6j27K41J84m25L00l28K46j24q3Q9J84o1O6
3720I2k48J8Q3j53J26K2n5J36j31n1J52o7R6q6j39K14j07K69p6J0k59J69M8O5
$$ plain form
3744 128 -118 -13 -102 -114 204 198 -104 300 -104 112 102 317 153 -162 -8 -115 -60 -128 -100 -77 -92 -147 62 -7
3768 -7 -190 -73 -68 -85 7 -43 -52 -154 -44 114 47 222 -31 169 193 -71 355 19 -16 -129 -143 -76 174 -117 -106
3793 -106 -47 -281 -154 124 53 -236 -119 -102 -102 -3 -18 -35 64 -62 41 -259 77 73 95 204 219 -261 146 -45
3817 -45 8 182 21 -94 -296 -1 -274 -254 -55 139 -106 -1 93 -139 52 -240 -112 -43 21 236 136 166
3839 166 -9 -15 260 -31 -239 163 284 -97 -138 193 182 -80 -41 7 89 20 67 -76 -99 -55 112 -189 -97 229
3863 229 -26 15 -180 132 -155 -64 37 -3 -137 -158 170 -40 -85 186 86 -174 277 39 129 -36 32 100 168
3886 168 58 -212 163 90 12 -89 -16 -116 -217 -127 -85 -14 -159 -248 63 -54 -113 58 139 161 165 48 -114 114
3910 114 224 309 216 -40 264 -178 -117 -14 92 48 -239 -76 -61 65 -33 -200 -275 -183 -92 -61 -48 -89 -3 -158
$$ packed form
3744A28k46J05q9j2L18ol02M04m04K16j0K15j64l15J54j07N5o8K8K3j5n5K09o9
3768gj83J17Nj7R2n0rj02J10J58o7J75k53K00K4k64M26l36l5j13j4O7K50k91J1
3793a06N9k34J27K78p1k89J17J7%R9j5j7R9j26J03l00L36mK2J09J5m80M07j91
3817d5N3J74j61j15k02K95k73K0J99J94k45J05R4k32J91k92J28O9O4K15j00L0
3839A66j75oK75k91k08M02J21l81m1L31j1k62L9M8Q2o9M7j43k3M4J67l01R2L26
3863B29k55M1j95L12k87R1J01m0j34k1L28k10m5K71j00k60M51k38R0j65O8O8O8
3886A68j10k70L75p3p8j01P3j00j01R0M2P1j45q9L11j17n9J71Q1K2Mj17j62K28
3910A14J10Q5r3k56L04m42O1J03J06m4k87J63J5J26r8j67p5R2R1L1J3m1Q6j55
$$ plain form
3934 -158 -28 -202 118 -89 99 -131 -1 62 -221 54 75 120 159 395 -137 5 -46 -297 -155 97 -175 -143
3956 -143 25 -173 -133 53 13 -49 -84 168 -260 -38 -51 371 -145 -95 239 106 5 68 79 -17 190 -77 -76 5
3980 5 -68 108 -163 66 53 -130 -115 -232 -148 -139 66 -144 -257 153 274 36 -326 85 177 74 131 -60 200
4003 200 298 315 -51 115 -44 -60 98 454 167 85 411 121 13 -273 -169 -341 -256 -242 79 -105 -180 -181 -368
4026 -368 -323 -94 -258 3 -86 325 46 218 273 51 257 343 274 19 264 180 137 171 103 284 53 205 -203
4049 -203 52 220 -23 -126 -239 40 0 73 -84 -84 -269 -194 -337 -57 -217 -47 50 -44 176 -91 -71 283 -65
4072 -65 119 104 196 107 -11 89 55 -138 298 45 81 37 -42 -79 -32 -16 65 -207 -71 155 -105 -50 -81 -142 -13
4097 -13 147 -81 -102 245 100 -193 68 222 126 3 51 -27 7 116 92 -45 -25 -121 -1 129 75 -61 -223
$$ packed form
3934a58J30j74L20k07J88k30J30O3k83K75K1M5L9K36n32J42n1k51J42K52k72L2
3956a43J68j98M0J86m0o2l5K52m28K22j3M22n16N0L34j33j01O3J1r6K07k67JQ1
3980Ep3J76k71K29j3j83J5j17Q4RK05k10j13M10J21k38l62M11R2j03N7j91K60
4003B00R8J7l66J66j59j6J58L56k87q2L26k90j08k86J04j72Q5J4L21j84p5jj87
4026c68M5K29j64K61q9M11k79J72N5k22K06Q6o9k55K45q4m3L4o8J81k31J52m08
4049b03K55J68k43j03j13K79m0P3j57%j85P5j43K80j60J70R7r4K20k67K0L54l48
4072f5J84j5R2q9j18J00l4j93M36k53L6m4p9l7M7J6Q1k72J36K26k60N5l1o1J29
4097a3J60k28k1L47j45k93K61J54r6j23M8p8L4J09k4j37K0r6J20J30n4j36j62
$$ plain form
4120 -223 10 31 -159 -192 -25 1 2 4 144 107 -276 255 -43 -34 169 145 -18 203 -138 167 193 -215 -20 6
4144 6 -66 -55 50 -120 -203 -85 -54 -65 171 -179 -258 -265 -232 -282 33 62 303 245 42 -56 58 187 -43 42 -2 86
4170 86 32 68 72 133 259 33 -111 48 -133 118 29 -262 73 162 -173 94 -280 -68 -18 -71 -77 -108 -340 35
4194 35 -68 -39 66 -86 143 144 220 79 291 106 26 469 77 225 248 -127 200 17 107 107 216 119 -213 -66
4218 -66 24 -109 -170 60 73 -140 -89 73 93 -55 121 133 -19 -47 84 33 79 -130 43 109 151 -295 -47 -90
4242 -90 -159 -202 -87 8 -98 -71 -16 10 8 -135 -108 -76 33 36 -71 -33 118 -178 -242 134 74 -27 268 -16 235
4267 235 87 47 23 183 18 -231 -133 69 -56 -133 32 -3 -257 -21 111 -34 -72 -169 -128 41 -217 -173 125
4290 125 -25 -72 188 -43 -143 -4 112 243 -97 217 12 151 68 50 250 159 46 -96 103 22 -284 171
$$ packed form
4120b23K33K1j90l3J67K6JKJ40l7l83N31k98RK03k4j63K21l41L05K6m08J95K6
4144Fp2J1J05j70q3J18L1j1K36l50p9pL3n0L15K9K41n8k03r8J14J29k30Q5m4Q8
4170H6n4L6MO1J26k26j44J59j81K51q9k91L35Q9l35K67l74K12N0n3ol1k32L75
4194C5j03K9J05j52K29JP6j41K12j85q0M43l92J48K3l75L27j83R0%J09r7l32J47
4218f6R0j33o1K30J3k13N1J62K0j48J76J2j52k8J31n1M6k09J73O6M2m46K48m3
4242i0o9m3J15R5j06K7N5K6kj43K7L2J09Lj07L8J51k96o4L76o0j01K95k84K51
4267B35j48m0k4J60j65k49R8K02j25p7J65l5k54K36J32j45l8r7M1J69k58M4K98
4290A25j50m7K60k31j00J39J16J31l40L14k05J39q3j8K00r1j13j42J99q1l06M55
$$ plain form
4312 171 -3 17 7 -117 96 1 -13 214 -174 203 42 -164 66 200 18 13 165 -30 360 -83 -52 189
4334 189 -283 122 -41 84 292 -114 -28 64 -74 -177 1 -161 -52 -74 -25 66 -118 -32 -1 -3 9 232 119
4357 119 -104 -23 106 -8 -110 148 -109 216 90 445 116 -38 130 -142 28 -144 -473 -76 23 -128 -19
4378 -19 -10 -196 -62 -167 22 -222 369 126 62 29 -22 -71 168 40 -54 283 -10 51 -99 -145 -148 -260 163 3
4402 3 -185 -41 141 71 -1 98 24 -377 166 -132 -132 28 -100 -153 -241 23 27 -243 -282 -254 88 108 99 -19 -92 -21
4428 -21 -22 86 -26 -4 -77 46 62 136 -161 -168 212 -5 4 -154 -296 90 -51 -299 -33 260 94 192 2 -147
4452 -147 144 -95 1 180 139 173 94 -128 33 64 170 16 148 86 -272 44 19 -79 -27 -199 -180 19 -190
4475 -190 81 -30 -6 -52 -21 -173 -113 143 173 54 -110 -376 121 55 -11 -96 50 -88 9 77 326 68 73 283
$$ packed form
4312A71j74K0j0j24K13r5j4K27l88L77j61k06K30J34j82nJ52j95L90m43L1K41
4334A89m72M05j63J25K08m06Q6R2j38j03J78j62J09k2M9R1j84Q6L1kJ2K23j13
4357A19k23Q1J29j14j02K58k57L25j26L55l29j54J68k72J70j72l29L97R9j51J09
4378a9Rj86J34j05J89k44N91k43o4l3n1m9K39j28r4L37k93O1j50m6lj12M23j60
4402Cj88J44J82p0p2R9p4m01N43k98%J60j28n3q8K64Mk70l9K8L42K0rj18p3P1
4428b1jJ08j12K2p3J23J6P4k97pL80k17Rj58j42L86j41k48K66K93j66R8j90j49
4452a47K91k39R6J79m1L4p9k22J61L1J06j54J32o2l58L16k5r8N2j72J9J99k09
4475a90K71j11K4m6L1j52O0K56L0j19j64k66M97o6o6q5J46j38R7O8K49k58NK10
$$ plain form
4499 283 -41 -72 -292 -116 11 98 -21 -154 -17 0 -211 -31 143 132 -95 160 -120 143 -80 -124 -67 12
4521 12 245 -7 12 175 29 2 -54 41 -25 92 26 -14 -153 -178 70 -66 -195 -433 -16 -164 -209 -90 -270
4544 -270 230 88 -301 -93 59 44 50 208 -47 -61 -3 54 196 87 -156 185 40 88 161 61 150 100 54 -110
4568 -110 -26 -116 -107 -18 -172 167 375 -241 -37 -83 -70 -35 255 -99 54 -153 -156 -144 3 -31 34 181 25 -90
4592 -90 -107 255 -167 79 103 -372 0 150 -141 76 -128 154 183 3 -37 134 -165 17 13 172 94 230 -111
4615 -111 18 338 232 3 18 97 31 101 150 55 163 246 -304 122 -157 -140 -88 40 -414 52 -240 -394 264
4638 264 30 -234 -104 -32 76 202 -130 60 70 -24 -91 77 98 255 241 325 224 78 14 52 110 77 184 25
4662 25 242 -35 -20 30 238 88 -126 -25 -55 203 70 -237 -6 -151 129 340 -51 -79 130 4 -66 187
$$ packed form
4499B83l24l1k20J76J27Q7j19j33J37J7k11J80J74j1k27K55k80K63k23m4N7P9
4521A2K33k52J9J63j46k7n6R5o6J17o6m0j39k5K48j36j29k38M17j48m5J19j80
4544b70N00j42l89K08J52j5OJ58k55j4N8N7J42j09k43L41j45M8P3j00Q9n0m6j64
4568a10Q4r0RQ9j54L39K08o16K04m6J3L5K90l54J53k07lJ2J47l4O5J47j56j15
4592i0j7L62m22K46K4m75L72J50k91K17k04K82K9j80m0J71k99J82mJ59p8J36l41
4615a11J29L20j06k29J5P9o6P0M9r5J08Q3n50M26k79J7N2J28m54M66k92j54O58
4638B64k34k64J30P2J08J26l32J90J0r4o7J68K1J57j4Q4j01j46o4L8N8l3J07j59
4662B5K17k77J5N0K08j50k14J01l0K58j33l07K31j45K80K11l91k8K09j26p0K53
$$ plain form
4684 187 -172 18 218 -143 -27 57 -3 48 39 2 -15 -381 -174 2 -155 -128 -430 -81 -190 -90 48 107 -96
4707 -96 -158 -116 37 -261 -70 190 84 85 -178 144 312 52 -225 143 173 -119 257 80 183 -93 129 -88
4729 -88 -199 55 -65 -136 273 -214 -185 -23 -208 95 98 95 166 30 -7 113 -6 99 -115 142 75 -39 -32 -20
4753 -20 -112 -303 185 -114 -111 318 118 464 -144 -239 -34 327 7 -92 -234 -95 -13 51 -169 -14 -319 -144 -110
4776 -110 6 -133 224 381 142 95 -206 101 -76 -46 60 45 65 4 -437 74 -57 -64 14 71 -268 -71 13
4799 13 -133 -206 -148 128 -38 196 243 106 -169 94 204 244 49 112 98 186 180 107 276 13 166 -78 123 134
4823 134 13 -23 134 -96 -283 -11 -43 -339 -192 373 101 -106 40 -46 -26 -125 85 178 2 200 90 -192
4845 -192 -178 27 27 267 -13 276 83 11 -202 261 37 58 -99 11 -58 -203 111 -119 -18 -181 24 157
$$ packed form
4684A87l59J90K00l61J16Q4o0N1rl7j7l66K07J76j57K7l02L49j09J00J38N9k03
4707i6o2M2J53k98J91K60j06Jk63L22J68k60k77L68L0k92L76j77J03k76K22k17
4729h8j11K54j20p1M09m87K9J62j85L03LlP1j36l7J20j19J05k14K57o7j14PJ2
4753b0r2j91M88k99LM29k00L46o08r5K05L61l20r9j42J39Q2O4k20J55l05J75L4
4776a10J16j39L57J57k39m7l01L07j77L0J06j5K0o1m41N11j31pP8N7l39J97Q4
4799A3j46p3N8K76j66K34M7j37k75K63J10M0j95O3j4Q8op3J69k63J53k44K01J1
4823A34j21l6J57k30j87K72l2k96J47N65k72k07J46q6K0r9K10R3j76J98j10k82
4845a92J4K05%K40k80K89j93p2k13M63k24K1j57J10o9j45L14k30J01j63K05J33
$$ plain form
4867 157 79 93 -131 78 -132 54 -119 281 -221 56 205 68 -90 168 -45 21 0 134 -100 105 18 -189
4889 -189 -86 -127 -148 45 130 -269 -137 -437 -54 -61 -127 -206 64 -154 -12 -168 -56 -35 15 189 76 -13 97
4912 97 92 -26 133 -279 125 -34 237 -163 179 197 97 -111 -155 11 -196 -130 -190 -103 -2 -88 -152 96 88 -7
4936 -7 -155 2 -113 85 -44 130 -115 16 222 -12 -44 -69 -245 134 -3 -72 -18 -60 -105 -315 32 44 52 49
4960 49 -130 -163 -85 -293 225 116 251 -15 -39 -42 98 -284 -225 -66 64 58 2 235 76 180 88 150 47 70
4984 70 175 -24 -213 192 -99 88 2 -184 -109 -43 -162 113 131 -1 60 212 38 -9 -18 19 160 -167 9
5007 9 176 -135 177 67 -108 99 -138 21 95 -95 105 -201 162 -43 288 -20 -165 -116 -24 -194 20 -166
5029 -166 15 26 -76 138 -271 -45 230 -53 227 68 188 -18 357 29 331 206 -15 62 -111 -103 -138 -4
$$ packed form
4867A57p8J4k24K09k10J86j73M00n02K77J49j37j58K58k13O6k1J34k34K05q7k07
4889a89J03m1k1J93Q5l99J32l00L83po6p9K70k18J42j56J12K1N0J74j13q9J10
4912I7nj18J59m12M04j59K71m00L42J8j00k08m4J66k07O6o0Q7J01q6o4K48qr5
4936gj48J57j15J98j29J74k45J31K06k34l2k5j76L79j37o9N4m2m5k10L47J2Ql
4960D9j79l3P8k08N18j09J35k66k4lJ40l82N9J59J30on6K33j59J04r2O2j03K3
4984G0J05j99j89M05k91J87q6j86P5O6j19K75J8j32O1J52j74m7rL7J41l27J76
5007IJ67l11L12j10j75K07k37J59P4j90K00l06L63k05L31l08j45M9R2j70K14j86
5029a66J81J1j02K14m09K26K75k83K80j59J20k06L75l28L02j25k21P7j73Ql5J34
$$ plain form
5051 -4 -352 -170 -147 -150 -267 -84 -261 -52 -235 -177 -284 -82 114 -89 -81 9 65 231 127 90 98 93 97 278 53 -34
5077 -34 -92 34 -138 210 34 -25 -2 -165 16 -77 -82 38 1 101 -76 31 -243 32 27 104 -182 271 264 108
5101 108 11 94 104 188 331 26 -83 -205 104 153 286 26 -191 105 -238 -308 -311 -30 -222 89 -166 13 4
5124 4 -167 -96 -165 -39 56 40 -150 32 -64 61 94 159 -236 113 116 4 50 -103 89 -139 -11 310 251 -217
5148 -217 -149 -199 -51 -127 -125 167 -47 -383 25 -7 -284 -40 -137 -118 -94 133 -4 -58 -21 243 161 78 173 -183 -47
5173 -47 350 58 -84 191 41 -179 -234 137 18 -227 -196 83 286 -98 22 -61 -107 53 -26 -134 -62 -95 -133
5196 -133 191 60 15 -74 293 263 176 -30 120 -88 136 92 -93 -194 -101 130 71 21 -57 9 183 -224 -42
5219 -42 -80 -185 -239 -310 8 78 -74 143 194 275 173 39 56 43 91 21 142 25 -271 -324 51 265 -118 -106
$$ packed form
5051dl48J82K3lj17J83j77K09j83N8j07K02J96k03QR0N6J66j04l7QnMJ81k25q7
5077c4n8J26j72L48j76n9K3j63J81r3nJ20l7J00j77J07k74K75nP7k86M53pj56
5101A08r7Q3J0Q4J43l05j09j22L09M9J33k60k17K96l43p0lK81j92L11k55J79r
5124Dj71P1o9J26R5j6j90J82r6J25L3O5l95L49Lj12M6j53J92k28J28L21n9m68
5148b17O8n0J48p6KK92k14l36M08l2k77K44r7J9K4K27j37n4L7K64q2q3R5l56J36
5173d7L97k92j42K75j50k20n5L71j19k45L1K79K03l84J20q3m6J60p9j08P2l3l8
5196a33L24j31m5q9L67l0q7k06J50k08K24m4j85j01R3K31n9n0p8O6J74m07J82
5219d2l8j05n4p1L18P0j52K17N1Q1j02j34J7j3M8p0J21j17k96n3L75K14l83J2
$$ plain form
5243 -106 39 -53 -224 37 -59 174 1 78 -93 -210 31 -113 -42 27 91 68 80 -57 -43 66 348 107 95
5266 95 172 173 -44 -114 7 25 -22 -194 -31 33 -14 148 -66 -25 -84 -230 -90 8 -123 164 -44 36 -88 -243
5290 -243 -228 -122 -75 -155 108 -174 -77 122 92 -241 22 1 197 157 164 0 -171 20 -73 -101 77 135 20 -134
5314 -134 -64 -51 -97 -1 -72 -138 -28 -186 -186 134 115 -58 -105 -89 153 33 -271 -162 222 284 -30 -111 36 7 22
5339 22 156 -165 -166 -58 -183 -39 -114 -60 -218 53 -216 -148 -25 -60 -65 -105 -12 283 -162 -22 -116 194 144 -132
5363 -132 78 -71 113 -34 124 52 -45 -70 -197 -95 55 -183 -68 -155 196 -8 -16 -133 55 59 32 -188 134
5386 134 -24 -63 -147 166 -19 135 -86 38 243 -233 110 -85 -90 165 59 -187 -140 -269 6 -43 -21 1 65
5409 65 -128 -194 -244 -34 5 -167 78 144 -1 -42 37 -126 -228 -38 -53 -73 267 -88 72 -79 104 -71 -177
$$ packed form
5243a06J45r2j71K61r6K33j73P7j71j17K41j44P1O9O4k3J2j37J4J09K82k41j2
5266I5P7Jk17p0J21J8m7j72J63O4m7J62k14M1n9j46J40R8j31K87k08Q0j24j55
5290b43J5J06M7q0K63k82R7J99l0l33K63k1J96m0Pj64j71J91r3k8J78N8j15j54
5314a34P0J3m6R6p1o6J10j58%L20j9j73m7J6K42j20l04J09L84O2l14q1J47k9J5
5339B2J34l21jJ08j25J44p5N4j58K71k69O8J23l5nm0R3K95m45J40r4L10n0k76
5363a32K10j49J84j47J58p2r7k5j27J02J50k38J15q7L51k04qj17J88Mk7k20L22
5386A34j58l9q4L13j85J54k21J24K05m76L43j95nK55j06k46M7j29K75m9K2K2O4
5409F5j93o6n0K10L9j72K45O6j45m1P9j63j02J90j5k0L40l55J60j51J83j75j06
$$ plain form
5432 -177 156 67 278 -163 -99 -205 39 84 -162 -39 -336 10 -236 63 -164 -135 -38 -91 -34 -31 320 20 -35
5455 -35 116 -145 322 -8 -180 242 42 288 63 -62 -319 -33 -64 9 -186 18 144 -203 290 -67 12
5476 12 -314 -171 40 195 131 -284 -152 -312 -3 -230 6 -124 -99 276 -7 157 1 159 150 -17 -149 -117
5498 -117 117 24 211 -33 -79 -130 73 123 -163 76 36 -18 -204 -87 77 -89 15 -39 -2 131 -31 -86 58
5521 58 -61 161 205 -93 148 6 128 -33 -166 -45 85 -199 52 -126 33 20 -112 20 65 -34 42 83
5543 83 -27 -307 159 -3 192 193 -98 -36 -301 -138 154 98 244 29 -152 272 69 91 62 33 18 111 72 26
5567 26 -92 -110 -52 -216 -43 170 -211 1 2 -110 259 -130 -200 1 114 214 172 -37 -16 -70 12 205 130 44
5591 44 73 89 72 -72 -164 -115 -121 167 -384 278 -4 -157 -254 -173 -52 -312 -57 23 -50 -212 -25 117 108 65 151
$$ packed form
5432a77L33q9K11m41O4j06K44M5k46J23k97L46k46K99k27K9R7n3N7LL51l00n5
5455c5J51k61M67l30j72M22k00K46k25j25k57K86l1P3j95K04J26l47M93l57P9
5476A2l26J43K11J55o4m15J32j60L09k27K36j30K5L75k83J64j56J58rj67j32L2
5498a17K34r3J87k44m6n1K03N0k86K39m0n4j86J17J64j66J04n4L7J33j62n5J44
5521E8j19K22M4k98K41j42J22j61j33J21J30k84K51j78J59j3j32J32M5r9P6M1
5543H3j10k80M66j62J95Jk91O2k65J63K92n6J46k15j81M24k03K2k9k9j5R3l9m6
5567B6j18j8N8j64J73K13l81K12Jj12L69l89p0K01J13J00m2k09K1n4Q2J93p5q6
5591D4K9J6j7j44r2M9oK88n51O62k82j53r7Q1J21k60K55Q0p3j62J87J42rm3Q6
$$ plain form
5616 151 119 -132 -95 119 130 38 -86 -77 142 179 -11 207 -197 34 8 -224 20 -37 -48 -230 82 -35 83
5639 83 -43 -115 -47 165 -87 120 -206 -61 13 57 -243 197 311 -183 71 44 32 -110 -60 -42 55 -261 -360 -294
5663 -294 35 91 -31 -40 -122 128 -284 -126 149 -41 -35 -300 150 -55 149 -9 -321 149 59 -83 252 185 267
5686 267 6 51 20 55 -48 -185 84 19 -62 -67 -302 -64 46 -149 -44 -161 -111 11 59 105 -128 -193 -7 -58
5710 -58 -26 -146 39 -58 -105 4 194 108 101 -119 202 -109 -119 -118 -120 7 0 -34 9 -60 113 -188 -81 103 -192 -139
5736 -139 77 -154 -269 -218 -41 -76 136 -114 26 38 22 -91 -268 -91 43 -54 -40 13 65 71 -117 245 -52
5759 -52 -24 -201 -250 104 10 -43 81 -54 -201 -164 -53 -179 71 4 47 -10 -183 46 -138 12 125 -56 -140
5782 -140 -137 -111 50 292 20 -100 -101 33 -191 396 -107 85 40 -131 232 -1 -99 129 67 -16 156 149 -126 -181
$$ packed form
5616A51l2k51L7K14J1r2j24RK19L7j90K18m04K31k6k32K44n7j1j82L12j17J18
5639H3j26p2O8K12k52K07l26J45P4M4l00M40J14m94K54k7j2j42N0J8R7l16r9O6
5663b94L29N6j22rq2K50m12J58K75j90Ok65M50k05K04j58l12M70r0j42L35o7Q2
5686B67k61M5l1L5j03j37K69o5q1nk35K38J10j95J05j17N0J22M8M6k33o5J86n1
5710e8L2j20J85r7m7J09J90q6pk20L21l11j0JkJ27pl4M3o9J73l01J07J84k95N3
5736a39K16k31j15N1J77l5K12k50J40J2j6j13j77J77J34r7J4N3N2Oj88L62k97
5759e2K8j77m9L54r4n3J24j35j47L7J11j26K50o7M3n7j73K29j84J50J13j81q4
5782a40LK6J61K42k72j20jJ34k24N87n03J92m5j71L63k33r8K28o2q3J72pk75n5
$$ plain form
5806 -181 -130 6 -4 -88 162 -10 -44 91 208 -58 202 32 127 -76 -279 181 101 19 -245 21 -137 -196 -102
5829 -102 229 82 -159 39 132 11 -43 44 95 -241 81 70 17 242 -117 134 -50 91 231 -240 151 56
5851 56 171 185 -9 24 171 69 -65 70 -22 -3 -24 -16 -43 -144 -7 82 -138 144 -75 3 -78 -213 248 259
5875 259 -52 -14 -149 178 -101 206 -157 97 96 48 -91 14 139 -192 -105 -93 69 131 -168 -128 -85 10 113
5898 113 62 209 -7 249 98 -148 -64 9 -210 26 243 306 -48 150 197 -135 -39 -41 -58 -43 134 88 126 106
5922 106 -185 53 82 -52 -367 128 27 89 -147 -75 79 -69 41 108 138 -24 96 -59 -31 -36 -246 -13 42
5945 42 365 159 26 228 59 -82 31 -137 -77 -27 -25 -84 -279 101 30 -278 -79 29 111 -95 35 -169 45
5968 45 84 -139 64 284 143 218 226 -63 102 14 -63 199 254 2 18 170 -17 -89 -129 97 94 -132 -122 -287 24
$$ packed form
5806a81N1J36j0q4K50j72l4J35J17k66K60j70R5k03k03M60q0q2k64K66j58n9R4
5829a02L31j47k41J98R3j21n4Q7N1l36L22j1n3K25l59K51j84J41J40m71L91r5
5851E6J15J4j94L3J47j02j34J35r2J9k1Qk7j01J37Q9k20K82k19P8q1j35M61J1
5875B59l11L8j35L27k79L07l63K54jm8j39J05J25l31Q7J2J62O2k99M0M3R5J03
5898A13n1J47k16K56j51k46Q4P3k19K36K17O3l54J98M7l32R6kj7J5J77m6L8k0
5922A06k91K38K9j34l15M95j01O2k36P2J54j48J10O7L0j62J20j55K8nk10K33N5
5945D2L23k06j33K02j69j41J13j68O0N0Kn9j95L80p1l08J99J08Q2k06J30k04K14
5968D5L9k23K03K20j41P5Qk89J65q8p7K62N5k52J6J52j87p2m0K26lk26J0j65L11
$$ plain form
5993 24 233 -68 -105 37 323 1 -71 166 128 -251 56 -4 58 16 56 163 38 142 -70 30 -9 67 40 -277
6017 -277 200 274 -64 83 -92 4 -113 -21 -126 -126 -75 -118 -55 -230 60 49 -417 106 -125 83 3 58 188 176
6041 176 -279 298 -172 157 -121 -106 39 -24 125 211 230 -259 -178 -127 -143 -256 -19 86 30 -40 86 13 -134
6064 -134 91 51 53 -16 74 41 114 -145 150 -155 -153 -68 73 249 -120 -89 29 31 -75 -39 -100 22 -11 -98 66 -30
6090 -30 -146 78 -77 7 -134 -122 111 -54 -8 -171 -159 0 -63 -84 -87 -82 145 -120 -90 324 146 25 0 -65 -70
6115 -70 -152 49 27 161 -137 -111 201 80 -85 272 105 15 184 -103 27 -187 71 191 156 142 -288 40
6137 40 -18 -87 59 -15 -177 -175 -46 -18 -4 98 27 130 -83 158 237 -50 -76 -133 -218 -119 5 -89 -162 -70 130 309
6163 309 -172 137 124 72 -278 -118 163 -106 117 -2 264 -69 -32 378 13 35 -47 137 -113 15 -50 114
$$ packed form
5993B4K09l01l7J42K86l22p2K37l8l79L07o0O2m2M0J07j25J04k12J00l9P6k7l17
6017b77M77P4l38J47j75R6j17R2j05%N1m3O3j75K90j1m66N23k31K08q0N5J30j2
6041A76m55N77m70L29k78J5J45o3J49Q6J9m89Q1N1j6j13K37J05n6p0J26p3j47
6064a34K25m0Ko9R0l3P3k59K95l05KQ5J41J76l69L1J18Kj06L6o1J22l3q7J64r6
6090c0j16K24j55Q4j41J2K33j65M6j63J2J59o3k1lNK27k65L0M14j78j21k5o5n
6115g0q2K01k2J34k98K6L12j21j65L57j67r0J69k87J30k14K58J20l5j4m30L28
6137D0n8o9J46p4j62KJ29K8J4J02p1J03k13K41P9k87k6n7q5R9J24r4p3R2K00J79
6163C09m81L09j3n2l50J60K81k69K23j19K66l33L7M10l65K2q2J84k50J28o5J64
$$ plain form
6185 114 29 -131 56 63 -81 208 265 -9 144 48 -148 111 -154 -3 163 124 32 -314 99 -57 41 69 -38
6208 -38 -92 -320 -38 93 36 46 70 80 -28 -59 -109 -159 126 -33 12 -63 36 -102 51 -281 -215 138 -77 -10 -200
6233 -200 3 -11 180 132 117 239 -92 202 -44 9 98 68 -206 -250 100 -110 172 -254 105 -163 -60 157
6255 157 -165 133 -192 226 285 -305 6 88 48 14 111 27 -75 -101 42 -122 161 -86 33 -100 163 7
6277 7 -58 3 48 -204 116 -47 -23 -168 57 206 152 133 -134 24 122 65 113 18 87 205 -63 64 -69 19 58
6302 58 60 -141 54 100 122 -149 -90 -77 162 -109 153 90 -102 -126 -110 55 -308 -7 78 -253 13 106 97 179 -339
6327 -339 142 -81 288 191 148 190 1 29 50 326 -52 14 55 128 -25 -41 -102 -189 -301 -67 -210 93 79 74 115
6352 115 12 100 -153 -162 118 -195 -84 158 -203 -75 151 -627 121 124 83 159 -60 -63 102 -53 -325 46 -153
$$ packed form
6185A14q5j60J87Pj44K89N7k74J53r6j96K59k65J51J66l9r2l46M13j56R8K8j07
6208c8n4k28K82J31n7J0K4J0j08l1n0n0K85j59M5p5R9j38J53l32O6L53k15O7j90
6233b00K03j4J91m8j5J22l31K94k46N3Q9l0k74m4L50k10K82m26L59k68J03K17
6255A57l22K98l25M18N9n90L11Q2m0l4R7q4j02k6J43j64K83k47J19j33K63j56
6277Go5O1M5k52L20j63K4j45K25J49n4j9k67J58R8n7M8r5O9J18k68J27j33Q8L9
6302E8Kk01J95M6K2k71N9J3K39k71K62o3j92k4J6J65l63L01Q5l31K66R3rQ2n18
6327c39M81k23L69r7m3M2j89K8K1K76l78O6M1P3j53j6o1q7j12K34j43L03j4nM1
6352A15j03Q8k53rK80l13J11K42l61J28K26p78P48Lm1P6k19lJ65j55k72L71j99
$$ plain form
6375 -153 256 -148 -349 50 18 223 -164 190 -39 -193 -64 -154 -103 -64 85 105 -120 61 97 -93 111 156
6397 156 221 180 -216 144 68 -53 98 238 -24 2 -36 -62 -140 126 100 -75 37 61 244 230 151 -65 -240 -69
6421 -69 -55 24 176 66 -284 -5 180 108 -91 -2 5 39 -27 311 -20 -15 166 11 -62 5 -2 -73 27 -94 149
6446 149 97 71 -283 -276 75 -88 54 -155 298 224 24 -45 115 11 -42 -103 -112 308 -8 54 127 -336 -25 118
6470 118 228 -126 -147 -30 140 -151 -133 3 -82 -84 -61 -190 259 -111 -74 -194 -64 196 -34 -135 77 8 -15
6493 -15 -26 -30 253 -47 36 278 -119 100 237 166 7 0 74 37 -52 -13 -67 -133 -96 -334 -223 23 -68 -35 143 144
6519 144 -84 -117 -81 198 89 107 -158 47 81 -77 -21 -156 -114 105 -123 -21 -194 117 -44 11 175 0
6541 0 142 15 -84 247 41 139 104 26 -35 -139 -87 -73 14 -200 8 -200 86 -142 -38 -13 -48 -14 51 133 112
$$ packed form
6375a53M09m04k01L99l2K05l87L54k29j54J29r0N1L9J49K0k25J81L6j90K04M5
6397A56O5m1l96L60p6j21J51J40k62K6l8k6p8K66k6j75J12K4J83j4p9k16j75J71
6421f9J4P9J52j10l50K79J85p2j99Q9PL4o6L38l31NJ81j55p3O7pp1J00j21K43
6446A49n2k6l54PL51j63J42k09M53p4k00o9J60j04n3o1rM20l16O2P3m63L11J43
6470A18J10l54k1J17J70k91J8J36q5kK3j29M49l70L7j20J30K60k30j01K12o9k3
6493a5j1mK83l00Q3K42l97K19J37p1j59pP4l7q9L9n4o6L7k38J11K46r1L3J78J
6519A44k28l3L6K79j09J8k65K05L4j58N6j35M2K19k28J02j73L11j61N5J64j75
6541@J42j27r9L31k06R8l5p8o1j04N2J4Q7k14K08k08K86k28J04K5l5L4O5Q2k1
$$ plain form
6566 112 -106 -116 -206 40 -122 -169 -153 -150 131 -309 168 43 -136 148 13 -169 -337 148 84 52 -116 3 67
6589 67 -52 108 -29 360 -172 -60 27 -213 -46 -98 -116 65 -103 111 -17 -108 -12 -62 -159 -298 -127 190 -147
6612 -147 99 -159 51 34 -18 82 -5 -148 -77 97 87 -22 -134 77 73 108 -32 -60 85 -61 -71 6 -104 -312
6636 -312 -114 40 110 -32 -62 -169 -38 -264 -70 -146 -39 118 -303 92 37 194 -97 -21 -13 -143 14 214
6658 214 100 127 32 37 -152 -26 -90 155 134 -34 271 148 -134 -212 -135 -264 -45 23 51 47 60 269 106 -296
6682 -296 -133 -15 202 -138 73 251 191 191 -93 -2 -111 -137 -73 42 -186 -61 -12 -18 -218 7 -288 34 -103
6705 -103 12 62 117 -199 -100 55 -20 -142 244 -159 74 49 133 -11 -169 -73 -44 -28 0 110 -328 -5 -24 -34
6729 -34 66 160 107 42 196 -217 -378 -76 -106 -320 -77 144 -179 -88 67 -169 -330 150 190 224 -384 -29 99
$$ packed form
6566A12k18j0r0K46j62m7J6LK81m40M77j25j79K84j35j82j68M85o4l2j68J19O4
6589F7j19J60j37L89n32J12Q7k40J67n2j8J81j68K14j28r1R6n0r7j39J71L17l37
6612a47K46k58K10j7n2J00q7j43P1J74j0j09j12K11mL5j40k8J45j46j0P7j10k08
6636c12J98J54P0j42l0j07J31k26J94p6J07J57m21L95n5J57k91P6Qj30J57K00
6658B14j14K7r5Nj89J26o4K45k1j68L05j23k82p8P7j29K19O8K8mJ3K09j63m02
6682b96J63J18K17l40K11J78o0%k84R1j09k6O4J15k28J25M9ok00K25k95L22j37
6705a03J15N0N5l16R9J55p5j22L86m03K33k5Q4j44j58R6K9J6K8J10m38L23j9j0
6729c4J00R4n3o5J54m13j61L02l0k14K43K21l23R1J55k36j61M80M0L4o08L55J28
$$ plain form
6752 99 -3 92 73 118 156 -13 43 -289 -47 15 62 91 58 -47 -52 -2 67 54 -179 -119 65 34 41 -102 -90 -10 -246
6779 -246 163 174 -11 128 17 -105 -114 -12 28 -101 230 -169 45 -28 -44 135 97 -137 -30 24 -259 174 108
6802 108 -295 -83 -62 -113 150 134 -60 35 -100 135 154 -5 199 -52 -5 19 -79 -75 -30 15 -126 171 -303 136
6826 136 -115 -363 -62 24 50 -29 284 -235 -99 -157 250 -135 -32 -172 119 3 -2 152 -169 128 65 56 -239
6849 -239 20 -5 -117 -86 11 -40 -101 55 126 -194 -121 -139 70 -193 -131 -7 38 108 -37 38 116 152 -71 -4 124
6874 124 5 -323 -180 143 -12 124 -67 -109 10 -63 26 239 79 -14 -43 -49 179 -108 28 -153 -118 -151 130
6897 130 -122 -153 -60 -135 1 -91 -70 -74 -52 148 156 10 35 -26 -5 80 289 -8 -90 27 -33 10 343 -149 14 -104
6923 -104 -17 21 172 111 -3 20 -256 -283 -119 -201 -9 59 -280 340 254 0 95 36 146 95 -104 191 -10 -105
$$ packed form
6752I9j02R5j9M5L8j69N6l32K42O2M7K9l3j05nN0O9j3k33O0J84l1Pj43J2Q0k36
6779b46M09J1j85J39j11j22rJ02M0j29L31l99K14p3j6J79l8k34J07N4k83M33o6
6802A08m03K12K1n1K63j6j94R5j35K35J9j59K04k51M7K4r8MM5M5j41K97m74M39
6826A36k51k48L01Q6K6p9L13n19J36n8M07l85J03j40K91j16nJ54l21K97o3rk95
6849b39K59k5j12L1R7n1o1J56P1l20P3j8K09k63O2J24M5P0j45P5P8L6k23O7J28
6874A24j19l28J43L23j55J36j91m2J19p3Q9K13j60r3k9oK28k87J36j81L5l3K81
6897A30k52l1R3p5J36r2K1mK2K00Qj46K5o1K1Q5K09k97q2J17o0M3L33m92J63j18
6923a04Q7L8J51o1j14K3k76k7J64q2J92O8l39O20q6k54R5n9J10n1j99K95k01r5
$$ plain form
6947 -105 125 -261 229 82 108 -46 78 191 -234 62 225 46 -208 136 -180 14 -17 -169 -162 65 -104
6968 -104 -111 -45 -113 102 -131 317 -263 323 144 -184 156 118 -23 304 -15 -133 -195 -124 102 -73 92 3 -53
6991 -53 -182 82 -102 1 -137 -60 5 18 162 -291 -89 4 118 12 -170 -78 -122 23 -48 252 167 -96 340
7014 340 -45 76 9 138 16 -113 260 197 -269 -131 -206 -107 112 80 -101 -99 1 164 52 -156 77 -2 -186
7037 -186 28 191 209 -5 74 -1 65 22 139 -38 135 -41 -35 -136 -166 -264 76 86 32 -223 36 -30 146 -154
7061 -154 6 142 -281 -29 -76 157 -143 16 196 -272 -46 107 -213 178 43 -246 -115 -28 57 39 102 -250
7083 -250 -91 -97 78 -82 289 -138 141 -136 -8 -64 -20 -50 -41 14 -17 135 1 -148 25 -97 181 125 7
7106 7 202 105 -2 128 -77 67 -24 168 49 -331 55 64 207 44 -164 312 65 51 -173 -153 -101 89 -117
$$ packed form
6947a05K30l86M90j47K6j54J24J13m25K96J63j79k54L44l16J94l1j52PK27j69
6968a04pO6o8K15k33M48n80N86j79l28L40l8j41L27l19j18o2P1K26j75J65q9n6
6991e3j29K64j84J03j38P7O5J3J44m53K02R3J14j06j82R2m4J45p1L00q5k63M36
7014C40l85J21o7J29j22j29L73o3m66J38p5R9K19l2j81KJ00J63j12k08K33p9j84
7037a86K14J63J8k14P9p5O6m3J17j77J73j76Oj01l0r8L40J0n4k55K59o6J76l00
7061a54J60J36m23K52m7K33l00J59J80m68K26J53l20L91j35k89J31Q7Q5j8O3l52
7083b50J59oJ75j60L71m27K79k77J28n6M4l0RN5l1J52j34j49J73j22K78n6j18
7106GJ95r7j07J30k05J44r1J92j19l80L86RJ43j63k08M76k47j4k24K0N2J90k06
$$ plain form
7129 -117 -42 171 28 7 135 -116 -47 95 52 21 144 113 57 -157 57 143 -24 17 242 62 -20 60 281 -284
7153 -284 -84 196 148 152 -49 52 98 148 -109 -23 -87 -33 -62 226 161 -57 49 216 9 51 -131 51 100 -71
7177 -71 107 214 -25 100 -14 65 134 57 -62 7 141 39 129 -5 69 160 80 -3 -67 -112 -94 216 -126 83
7201 83 46 460 6 -36 209 -50 -347 -18 -31 108 -155 60 136 172 -195 165 27 -121 103 -110 -64 187
7223 187 -65 252 116 98 16 41 -79 -8 -51 382 132 60 177 -50 -295 -206 -13 -78 -33 -95 10 166 -31
7246 -31 -241 202 -201 163 17 -75 89 -87 144 -4 -28 -270 -142 159 -53 74 13 176 169 164 117 -128 -111
7269 -111 139 14 90 -307 -126 405 -86 52 -48 -157 -14 206 -10 92 -82 -76 -20 99 54 258 382 -7
7291 -7 335 -54 -179 -74 131 -128 -326 -65 90 -117 -322 -265 -337 122 -37 7 -281 26 -65 76 -2 -65 17
$$ packed form
7129a17P5K13j43k1J28k51O9J42m3l1J23l1n6k14K14Q6j67M1K25j80q2Q0K21n65
7153b84K00K80m8Mk01J01M6N0k57Q6o4N4k9K88o5k18J06J67k07M2j82J82M9j71
7177g1J78J07k39J25j14P9O9p7j19O9J34j02R0j34P4R1q0q3o4m5J8L10l42K09
7201H3l7M14m54m2K45k59k97L29j3J39k63K15P6L6l67L60j38j48K24k13M6K51
7223A87k52L17j36j8q2K5j20P1m3M33k50p2J17k27k45Q9J93o5M5o2J05J56j97
7246c1k10M43m03L64j46r2J64j76K31j48k4k42J28L01k12J27o1J63pnm7k45J7
7269a11K50j25P6l97J81N31m91J38j00j09J43K20k16J02j74ON6J19m5K04J24l89
7291gL42l89j25J05K05k59j98K61J55k07k05N7p2M59j59M4k88L07r1J41p8o3Q2
$$ plain form
7314 17 -52 -46 3 -105 -38 56 142 -237 -20 167 -205 51 79 43 32 -8 -19 42 -120 -92 169 49 112 -22 15 -1
7340 -1 -101 177 19 93 -174 -16 63 -142 -263 2 -92 86 -176 200 24 160 -19 37 -27 -135 33 39 232
7363 232 -35 180 38 269 -102 -226 45 186 -70 74 -159 27 45 273 -139 39 -169 24 -279 -2
7383 -2 97 -87 -98 4 -119 31 -1 9 -124 -5 -62 2 -12 -95 214 39 76 -27 50 -152 20 47 164 65 74
7408 74 101 -68 258 -63 -96 -186 342 -142 24 132 -80 13 -192 67 -71 -236 -129 -11 -7 157 10 -71 51
7431 51 76 -172 109 -112 -58 -42 8 31 -90 79 88 35 44 187 -276 72 -102 -266 -82 -143 -108 -2 96 7 73
7456 73 -15 -29 -70 116 -67 92 -20 -304 133 128 48 -21 -34 -226 348 104 -107 155 -126 123 31 -6 -186 20
7480 20 -19 -61 49 -73 -58 -81 -293 -241 -61 150 0 162 -114 47 -195 44 114 -125 248 94 -19 152
$$ packed form
7314A7o9OM9j08O7R4Q6l79K17J87l72K56K8l6j1m0j1O1j62K8K61j20O3j34L7j6
7340aj00K78j58P4k67J58P9k05j21K65r4J78k62L76j76J36j79N6o4j08J68OJ93
7363B32k67K15j42K31l71j24K71J41k56J44k33J86J8K28m12J78k08J93l03K77
7383bR9j84j1J02j23J50l2J0j33J19n7O4j4q3L09j75L7j03P7k02J72K7J17r9R
7408G4K7j69L26l21l3r0N28m84J66J08k12R3k05K59j38j65J07J18MJ64j47q1J22
7431E1K5k48K81k21N4J6N0K3j21J69Rn3RJ43m63L48j74j64J84o1L5J06R8q9O6
7456G3q8j4m1J86j83J59j12k84M37nq0o9j3j92N74k44k11K62k81K49r2l7j80K06
7480B0l9m2J10j22J5k3k12N2J80K11j50J62k76J61k42K39P0k39L73j54j13J71
$$ plain form
7502 152 -7 -151 36 118 19 -203 -202 -139 76 -276 -158 -10 39 191 134 28 12 -80 3 3 44 148 -197 30
7526 30 -148 -181 64 23 2 -91 10 -3 117 -256 173 -90 17 1 19 -29 37 65 64 -54 10 124 195 45 -236
7551 -236 9 -201 210 -49 -191 14 26 248 -72 -104 -161 129 70 -163 -117 137 -72 145 -123 -10 23 -153
7573 -153 -68 -195 -314 -183 -166 116 -241 100 59 247 52 -15 -4 -4 77 211 -8 -67 124 51 160 -191 -272 76
7597 76 -165 16 -178 7 -47 -28 97 36 -26 -11 -47 -60 132 -31 33 57 80 -37 -23 -141 -27 23 -90 191
7621 191 147 2 -142 187 -9 269 19 60 -37 -72 -201 159 -63 -35 253 -103 -182 -100 -56 -132 -85 64 -141
7644 -141 -194 -88 32 161 -62 15 -66 138 68 95 -220 -180 -49 6 212 -22 -44 -140 84 -68 20 217 -296
7667 -296 58 135 -60 -169 -64 -201 38 95 228 -102 136 340 -176 76 132 74 111 -51 101 92 -139 84
$$ packed form
7502A52j59j44J87Q2r9k22JO3K15l52J18J48M9J52n7j06j6r2Q3%M1J04l45K27
7526C0j78l3K45m1k1r3J01j3J20l73M29k63J07j6J8m8O6K8jj18O4J14P1j50k81
7551b36K45k10M11k59j42K05J2K22l20l2n7K90n9k33M6K54k09K17k68J13L3j76
7573a53Q5j27j19J31J7K82l57L41m1J88j95o7J1%Q1J34k19n9J91p3J09l51q1L48
7597G6k41J81j94J85n4J9J25o1o2J5l6j3J92j63O4K4K3j17J4j18J14N0j13K81
7621A91m4j45j44L29j96K78k50M1r7l5j29L60k22K8K88l56p9Q2M4p6M7J49k05
7644a41n3J06J20J29k23P7q1K04p0K7l15M0J31N5K06k34k2r6K24j52Q8J97n13
7667b96L54P7j95j09J05j37K39N7J33l30K38K04n16K52N6n8L7j62J52rk31K23
$$ plain form
7689 84 82 -220 15 -52 -68 21 58 -145 288 -166 129 52 232 -203 4 0 36 87 -248 113 -29 203 -124 -104
7713 -104 22 -93 9 72 115 273 -114 21 218 55 244 147 115 -172 181 15 58 -129 -49 -52 4 78 -8 -49
7737 -49 -87 13 74 -62 -83 174 79 -310 176 -148 90 -154 4 -20 307 25 -86 111 213 59 3 43 -98
7760 -98 -143 142 69 -42 -286 -42 -66 90 8 99 14 -5 -330 -2 140 -139 -32 -233 289 -45 75 -91 -21
7783 -21 45 87 -129 196 -3 -122 -20 1 -149 77 4 -138 -218 -85 52 -114 250 -9 142 116 87 72 212
7806 212 -178 -340 -27 131 -205 36 -6 -155 -284 -16 44 -96 -215 125 -50 150 -263 -81 -37 89 67
7827 67 79 -70 -193 -202 -258 -11 -73 -124 -66 67 -95 66 114 115 0 198 -34 -26 -271 40 -16 176 127 -78 84
7852 84 161 -36 -255 -84 -62 -156 -68 208 -37 36 -227 5 -35 198 227 216 142 37 -94 28 -160 10 -62 -199
$$ packed form
7689H4kl02K35o7j6Q9L7k03M33m54K95p7J80m35K07mL6N1l35L61j42K32l27K0
7713a04J26j15J02O3M3J58l87J35J97j63J89r7l2k87L53j66M3j87Q0lN6P4q6m1
7737d9l8J00O1j36k1K57r5l89M86l24K38k44J58k4L27k82j11J97J02j54n6M0j41
7760i8m5K85p3j11k44K44k4J56q2R1q5j9l25L28J42k79J07k01N22l34J20j66P0
7783b1O6M2k16L25j99j19J02K1j50K26p3j42q0J33J37j66L64k59J51k6k9j5J40
7806B12l90j62L13J58l36K41m2j49j29K68O0j40j19L40j75K00m13J82M4J26k2
7827F7J2j49j23rn6K47o2n1N8J33j62J61M8Jj15J98k32Qk45L11n6J92m9k05J62
7852H4P7j97k19J71K2r4Q8K76k45P3k63K32m0K33K9j1p4j05j31J22j88J70p2j37
$$ plain form
7876 -199 109 -26 173 35 4 -58 7 -63 26 -109 9 -79 -57 134 -85 -44 -87 -213 -94 216 -45 106 54
7899 54 -173 57 21 208 -27 104 -73 -54 123 98 -18 170 10 128 3 23 312 -85 -25 -52 138 115 53
7922 53 -60 41 -61 198 68 214 38 238 -39 -94 23 -225 -33 38 -46 -245 24 -234 54 95 2 11 -33
7945 -33 22 14 -59 103 119 -67 -231 -157 101 -109 -10 66 -156 -48 27 53 -40 60 79 32 43 2 -79 149 44 235
7971 235 57 -102 24 267 111 145 15 60 -64 68 103 -143 -73 37 17 4 104 254 209 38 172 99 132
7994 132 -16 61 -63 175 -66 -28 -132 -88 -15 86 144 -166 136 -164 61 213 107 -101 131 -152 42 42
8016 42 -91 64 147 -65 15 -219 125 50 -3 -101 -112 -130 117 62 -383 249 199 101 148 4 -132 -205 -160 251 44
8041 44 10 34 99 4 -90 -38 155 -87 -157 267 -204 215 51 -86 -238 17 -137 -239 31 6 -95 -114 95
$$ packed form
7876a99L08j35J99j38l1o2O5p0Q9j35J18q8K2J91k19M1m3j26J19L10k61J51n2
7899E4k27K30l6J87k35J31j77J9J77k5j16J88j60J18j25K0K89l97O0k7J90k3o2
7922E3j13J01j02K59j30J46j76K00k77n5J17k48J92P1q4j99K69k58K88M1r3Rm4
7945c3N5qp3J62J6j86j64P4K58k10R9P6k22J08P5K6r3J00J9m7J1m1q1K28j05J91
7971B35j78j59J26K43j56L4j30M5j24J32L5k46P0J10k0j3J00J50m5j71J34p3L3
7994A32j48P7j24K38k41L8j04M4P3J01N8l10L02l00K25J52j06k08K32k83J94%
8016D2j33J55Q3k12Q0k34L44p5n3r8j1j8K47n5m45O32n0r8M7j44j36p3M5M11k07
8041D4l4K4O5r5r4N2J93k42p0M24m71M19j64j37j52K55j54j02K70k5j01j9K09
$$ plain form
8064 95 -88 106 65 -66 -91 -111 -287 62 151 -69 10 293 81 8 56 -68 -196 -106 -188 107 -337 69 -109
8087 -109 -56 63 -267 -44 -12 46 47 -33 53 -36 78 145 68 136 65 404 22 61 -24 -12 -30 53 -57 -200 -10 -74
8113 -74 -26 -3 -187 -171 -106 172 -258 -95 -26 -12 -135 174 165 -279 -250 141 -266 -50 -32 -85 359 -105 21 -20
8137 -20 -37 -63 47 -118 107 38 172 -254 -281 5 74 -40 -143 59 252 -18 -221 -56 -341 47 -77 5
8159 5 -79 -172 85 110 -63 62 172 -16 276 93 -127 10 170 -36 -132 27 242 40 40 106 175 181 -162 225
8183 225 201 -50 -90 -27 89 79 -213 13
$$ packed form
8064I5j83J94m1j31k5k0j76L49Q9k20P9K83k12p3M8j24j28R0q2K95m44M06j78
8087a09N3J19l30K23L2N8Jq0Q6q9J14O7p7O8p1L39l82L9q5J2j8Q3j10j43J90o4
8113g4M8K3j84J6O5K78m30J63O9J4j23L09rm44K9L91m07K16J8n3M44m64J26m1
8137b0j7k6J10j65K25o9J34m26k7K86O9j14j03K02J93k70k03J65k85L88j24Q2
8159Eq4r3K57K5j73J25J10j88K92j83k20J37J60k06r6J59K15k02%O6O9Ol43L87
8183B25k4k51m0O3J16j0k92K26
8191A3
$$ Imaginary data points
##PAGE= N=2
##DATA TABLE= (X++(I..I)), XYDATA
$$ plain form
0 0 0 0 0 0 0 0 0 0 0 0 0 0 8 -8 8 -8 8 -16 16 -23 24 -28 32 -40 48 -55 64 -72 82 -95 107 -122 138 -155
34 -155 177 -197 221 -248 276 -307 341 -380 420 -464 513 -566 624 -688 757 -836 920 -1015
52 -1015 1119 -1235 1366 -1516 1687 -1886 2120 -2399 2739 -3164 3712 -4448 5489 -7072 9754
67 9754 -15125 29961 -153770 -469537 77892 378030 5201 -266101 -19980 162590 56973
78 56973 -60962 -65428 -48360 61806 165985 22418 -217908 -105366 204340 160516 -153399
89 -153399 -159193 100632 132609 -67211 -114214 7697 69909 41990 -8735 -86168 -84332 67405
101 67405 133760 -39636 -136192 28023 112929 -37512 -88175 46043 70528 -22478 -16136
112 -16136 19249 -34789 -27687 79108 59186 -76746 -57243 72882 31410 -83323 -66
$$ packed form
0@%%%%%%%%%%%%Qj6J6j6J6k4L2l9M7n2O0p2Q8j03J19j36J54j77K02k29K60k93
34a55L32l74M18m69N24n83O48p21Q00q84R77j079J190j312J445j593J756j935
52a015K134k354K601k882L203l573M006m519N138n903O876q160R937j2561J6826
67I754k4879M5086j83731l15767N47429L00138l72829k71302K46121J82570j05617
78E6973j17935m466J7068J10166J04179j43567k40326J12542L09706m3824l13915
89a53399n794K59825L1977j99820m7003J21911O2212k7919n0725p7433J836J51737
101F7405O6355j73396r6556J64215Q4906j50441n0663J34218K4485r3006O342
112a6136L5385n4038P102J06795j9922j35932J9503J30125m1472j14733Q3257
$$ plain form
123 -66 102294 -24492 -117979 34069 101515 -69677 -100094 97040 103674 -114432 -120362 90948
135 90948 103014 -66491 -63305 58703 28185 -53334 181 45865 -13420 -15513 51427 11436
147 11436 -73404 -16607 82049 31537 -60238 -22449 38376 -2705 -31828 17912 20579 -30948
159 -30948 -7973 32238 -25003 -56927 30611 66047 -27631 -61958 16288 35724 -20339 -10851
171 -10851 35172 4219 -32722 9605 29894 -21429 -18829 46682 30056 -44359 -26693 36558
183 36558 13768 -26090 11733 28545 -33196 -40288 36781 34530 -49071 -32108 56279 23981
195 23981 -70171 -33461 58390 31144 -39835 -18855 21297 168 -11635 15820 11581 -14104
207 -14104 4940 25145 -11756 -30911 19795 42994 -9326 -32917 8086 17358 -15380 -5545
$$ packed form
123f6J02360j26786r3487J52048O7446j71192l0417J97134O634k18106n930K11310
135I0948J2066j69505L186J22008l0518q1519N3515M5684n9285k093O6940l9991
147A1436q4840N6797R8656n0512r1775L7789O0825m1081k9123M9740K667n1527
159c0948K2975M0211n7241l1924Q7538L5436r3678l4327P8246J9436n6063R488
171a0851M6023l0953l6941M2327K0289n1323K600O5511j6626p4415J7666O3251
183C6558k2790l9858L7823J6812o1741p092P7069k251q3601J6963Q8387l2298
195B3981r4152L6710R1851k7246p0979K0980M0152k1129j1803K7455m239k5685
207a4104J9044K0205l6901j9155N0706K3199n2320k3591M1003R272l2738R835
$$ plain form
219 -5545 24091 -1360 -29714 2403 19936 -20162 -25113 25851 24990 -30666 -29266 19300 16504
232 16504 -14946 -1983 16864 -5211 -15709 9813 13557 -7658 685 21155 1741 -22661
244 -22661 185 24842 2444 -13874 8217 10007 -20356 -13541 22032 10358 -24239 -7540
256 -7540 19730 -5930 -29053 2732 25392 -3409 -20709 553 7157 -6542 -142 12945 766
269 766 -8349 6104 8667 -9102 -3541 20557 12972 -15917 -10439 14343 7539 -11057 840 13134
283 13134 -5326 -15735 3007 6235 -10586 -4244 12937 -2726 -22963 -3800 16908 920
295 920 -13676 1571 9486 -4572 -8431 4607 7631 2103 3875 2698 -7135 -3055 14055 11315
309 11315 -9110 -6957 12283 6283 -15157 -6826 14933 7291 -13108 -8898 3215 -1524 -4313
$$ packed form
219e545K9636k5451k8354L2117J7533m0098m951N0964q61n5656J400M8566k796
232A6504l1450J2963J8847k2075j0498K5522L744k1215Q343K0470j9414k4402
244b2661K2846K4657k2398j6318K2091J790l0363O815L5573j1674l4597J6699
256g540K7270k5660k3123L1785K2660k8801j7300K1262O604j3699O400J3087j2179
269G66r115J4453K563j7769N561K4098p585k8889N478K4782o804j8596J1897J2294
283A3134j8460j0409J8742L228j6821O342J7181j5663k0237J9163K0708j5988
295I20j4596J5247P915j4058l859J3038L024n528J772j177r833M080J7110k740
309A1315k0425K153J9240o000k1440Q331K1759p642k0399M210J2113m739k789
$$ plain form
322 -4313 2963 -336 -8273 -2137 3830 -5241 -7285 7627 10641 -5078 -9955 4338 9782 699
336 699 -1417 5469 4639 -2318 -973 3713 1910 1415 5483 529 -9945 -3859 8612 2389 -9841
351 -9841 -4127 5835 -2350 -11136 -3283 5580 1546 -3208 -3156 -3602 -1021 4452 4116 -1756 -1595 5152
367 5152 3943 -2917 -1746 7344 8143 -624 -3817 983 2072 10 2635 3235 -3559 -5452 1181 1912
383 1912 -4403 -4438 1557 1336 -4190 -5606 -3871 128 4194 2104 -4751 -5781 2258 7487 1989 -4535
399 -4535 -281 7873 5923 -3384 -4703 3788 9866 4612 -4001 -6854 -391 7937 5004 -6801 -9028
414 -9028 1963 6763 -3497 -10704 -4577 5016 6043 -3425 -11635 -6120 7753 9952 -3289 -11799
428 -11799 -1836 11598 8257 -6490 -8821 6106 15894 3452 -11328 -6931 8885 13804 1521
$$ packed form
322d313P276l299p937O136N967r071k044J4912L014j5719m877J4293N444r083
336F99k116O886q30o957J345M686j803m95M068m954j0474O086J2471o223j2230
351i841N714R962q185q786P853Q863m034m754N2m46K581N473l36n872J61O747
367E152j209o860J171R090P99q767l193M800J089k062K625O00o794j893O633P31
383A912o315l5N995k21n526j416J735L999M066k090o855j030Q039N229n498o524
399d535M254Q154j950r307j319Q491O078n254q613k853O463Q328k933j1805k227
414i028J0991M800j0260p207O127R593J027r468q210N515J3873K199j3241q510
428a1799R963J3434l341j4747k331J4927R788j2442j4780M397J5816M919j2283
$$ plain form
441 1521 -12161 -9099 7559 13215 -3069 -16868 -5150 13405 8156 -12426 -18326 244 17340
454 17340 7189 -16757 -16583 8506 18947 88 -17673 -6051 15589 14659 -7128 -14883 2742
467 2742 18044 8654 -9899 -11404 3669 14244 6390 -9754 -11580 4186 12888 -1346 -16204
480 -16204 -6337 10867 6571 -9042 -11183 -1037 5085 2953 -2305 -5447 -3185 2635 6448 1387
494 1387 -6017 -2731 8774 9520 -3177 -8584 1987 10987 6256 -4180 -7173 -473 7629 6182
508 6182 -4385 -9635 -1748 8229 4231 -9790 -13606 1432 14812 3416 -18593 -14931 11831
521 11831 18913 -6635 -20722 610 20789 6612 -15162 -8472 11461 12993 -405 -7061 -2994
534 -2994 4406 9467 5289 -8457 -10689 6756 14967 -4102 -18814 -2307 15422 3129 -15206
$$ packed form
441A521j3682L062J6658N656j6284j3799J1718J8555n249k0582n900J8570J7096
454A7340j0151k3946J74K5089J0441j8859j7761J1622K1640r30k1787p755J7625
467B742J5302r390j8553j505J5073J0575p854j6144j826J5766Q702j4234j4858
480a6204R867J7204m296j5613k141J0146O122k132n258l142K262N820L813n061
494A387p404L286J1505P46j2697n407J0571R000m731j0436k993O700Q102j447
508F182j0567n250P887R977l998j4021l816J5038J3380j1396k2009L662K6762
521A1831P082k5548j4087K1332K0179j4177k1774O690J9933J532j3398o656M067
534b994P400N061m178j3746k232J7445Q211j9069j4712J6507J7729j2293j8335
$$ plain form
547 -15206 -8704 7424 5499 -5173 -5444 -424 -897 96 4230 1384 -5611 -1365 8512 5615 -5495
562 -5495 -4755 5960 9273 925 -5675 -2376 4713 5126 -421 -3798 -2142 175 2391 1701 -4055 -8038
578 -8038 -729 8937 759 -14273 -8489 12173 11409 -11034 -15615 6748 16117 -2955 -13692 1806
592 1806 13573 2443 -6655 -211 4847 1459 2705 4291 -2707 -5327 5415 7705 -5475 -9782
606 -9782 3242 8503 -4048 -9852 237 6026 -2419 -7436 -647 2783 -2524 -3154 2719 2932 -2737
621 -2737 -2395 2504 3491 526 -216 1140 2883 3195 615 -1670 -277 3578 3571 80 -2837 -1943 1835
638 1835 3462 -2336 -7935 -1660 6939 1777 -10505 -7237 6574 6960 -6740 -10000 2367 9018
652 9018 -119 -6458 -127 5284 2147 -867 747 558 1361 4934 3794 -3749 -3491 4951 5829 -3079
$$ packed form
547a5206O502J6128j925j0672k71N020m73R93M134k846o995M246R877k897j1110
562e495P40J0715L313q348o600L299P089M13n547l377J656K317K216o90n756l983
578h038P309R666q178j5032N784K0662p64k2443m581K2363R369j9072j0737J5498
592A806J1767j1130r098O444N058l388J246J586o998k620J0742K290j3180m307
606i782J3024N261j2551n804J0089N789q445n017O789L430n307o30N873K13n669
621b737L42M899R87k965p42J356J743L12k580k285J393L855pl491k917Q94L778
638A835J627n798n599O275Q599n162j2282L268J3811L86j3700l260J2367O651
652I018r137o339O331N411l137l014J614j89Q03L573j140p543K58Q442Q78q908
$$ plain form
668 -3079 -5214 1355 3680 -858 -3844 -2388 96 411 -553 -2779 -3290 -589 1749 -85 -3202 -1991
684 -1991 1845 2633 -312 -828 1465 1980 1417 1425 623 518 2154 3032 767 -1378 -53 1483 801 -667
702 -667 -1426 -1837 -230 519 -1674 -4301 -1830 1896 60 -3950 -2972 1837 1946 -1572 -2302 636 2308
719 2308 708 -245 911 1241 1819 2233 1190 -493 1005 2990 749 -1120 -429 687 326 -445 -1336
736 -1336 -1445 -411 274 -1467 -3316 -1492 458 -77 -2267 -2350 189 1914 -588 -1829 562 3007
752 3007 1058 -941 353 2603 2162 842 133 480 2047 1335 -593 -977 1190 1186 -1196 -2087 -534
769 -534 -93 -846 -1843 -2075 -1113 -226 -846 -1543 -1091 -101 635 -517 -1369 -34 1812 1717 -78 -486 1804
788 1804 2706 762 150 1634 2076 1020 -211 -209 305 1362 -260 -1721 -1270 636 -573 -2026 -1923
$$ packed form
668c079k135O569K325m538k986J456K484L15r64k226n11K701K338j834l117J211
684a991L836P88k945n16K293N15n63Qq02j05J636Q78k265k145J325J536o82j468
702f67p59m11J607P49k193k627K471L726j836m010R78M809J09l518p30K938J672
719B308j600r53J156L30N78M14j043j683J498J985k241j869O91J116l61p71q91
736a336j09J034O85j741j849J824J950n35k190q3K539J725k502j241K391K445
752C007j949j999J294K250m41j320p09L47J567p12j928l84K167mk382q91J553
769e34M41p53r97k32R62Q87o20o97M52R90P36j152q52J335J846r5j795m08K290
788A804R02j944o12J484M42j056j231KN14J057j622j461M51J906j209j453J03
$$ plain form
805 -1923 34 -32 -1743 -2293 -452 721 -280 -1148 -178 1265 535 537 670 983 1273 1890 759 -178 995
824 995 2296 780 -540 741 803 -102 -560 -627 -404 -993 -943 -746 -1132 -1645 -860 -196 -846 -1456 -980 42
844 42 -275 -426 506 675 -104 970 1911 721 280 1900 2354 283 189 1061 1229 85 244 -286 -1061
863 -1061 -128 474 -992 -2622 -1084 787 -575 -3299 -1901 987 508 -2012 -1414 345 672 -325 258
880 258 429 3 1559 2580 91 -827 1887 3165 521 -1004 1032 1484 19 -34 100 -1231 -1332
897 -1332 642 239 -2975 -2920 1109 1470 -2792 -3341 737 1231 -1545 -1329 996 14 -896 1849 2017 -1316
915 -1316 -763 3867 2677 -2268 -785 3807 2575 -1598 -1125 1584 772 -702 -792 -279 -817 -732 2 -1183
933 -1183 -2372 -1269 283 -933 -1810 -687 202 -297 398 499 -726 -110 2263 1550 -939 -125 3076
$$ packed form
805a923J957o6j711n50J841J173j001q68R70J443p30KJ33L13K90O17j131r37J173
824I95J301j516j320J281O2r05m58o7K23n89N0J97l86n13P85O64o50o10M76J022
844D2l17j51R32J69p79J074R41j190m41J620M54k071r4Q72J68j144J59n30p75
863a061R33O02j466j630J538J871j362k724J398K888m79k520N98J759L27r97N83
880B58J71m26J556J021k489r18K714J278k644j525K036M52j465n3J34j331j01
897a332J974m03l214N5M029L61m262n49M078M94k776K16K325r82r10K745J68l333
915a316N53M630j190m945J483M592j232m173M73K709q12j474r0N13n38Q5P34j185
933a183j189J103J552j216q77J123Q89m99O95J01j225O16K373p13k489Q14L201
$$ plain form
950 3076 1403 -1081 1369 2634 -893 -1188 3166 2266 -4082 -2539 4004 2082 -5604 -3414 4088 1400
966 1400 -5352 -2939 2618 58 -3754 312 1898 -2396 -1945 3946 2340 -4233 -1498 6232 2979
981 2979 -4125 -1258 5088 2812 -2270 -1453 2665 1738 -931 -45 306 -1481 -1023 876 -211 -2939
997 -2939 -1604 819 -261 -1879 -1642 -1050 -166 1487 138 -3238 -600 4011 1518 -3274 -251 4292
1013 4292 1365 -1592 1588 2379 -1456 249 4425 233 -5610 261 6497 -98 -7557 -1400 5846
1028 5846 403 -6703 -1965 3457 -182 -3601 -303 644 -2733 -117 3890 -796 -5072 1492 6682
1043 6682 -262 -5398 1747 6354 738 -3075 750 2833 324 274 1028 -1199 -1478 1924 1349 -2722
1059 -2722 -2592 1700 997 -2755 -1934 304 -732 -1363 876 -234 -3229 -171 4263 -121 -4079 693
$$ packed form
950C076j673k484K450J265l527k95M354r00o348J543O543j922p686K190P502k688
966A400o752K413N557k560l812M066J586m294M51N891j606o573K735P730l253
981B979p104K867O346k276n082Q17M118r27k669Q86L51j787M58J899j087k728
997b939J335K423j080j618K37N92Q84J653j349l376K638M611k493m792L023M543
1013D292k927k957L180P91l835J705M176m192n843N871O236o595p459O157P246
1028E846n443p106M738N422l639l419L298R47l377K616M007m686m276O564N190
1043F682o944n136P145M607n616l813L825K083k509n0P54k227k79L402n75m071
1059b722J30M292p03l752Q21K238j036o31K239j110k995L058M434m384l958M772
$$ plain form
1075 693 4746 521 -2717 1589 2986 -686 203 3263 30 -3108 1564 4130 -1858 -5230 1288
1090 1288 4812 -2200 -5345 541 2875 -1820 -2920 691 -193 -2186 818 1810 -3258 -3038 4333 3223
1106 3223 -3789 -2028 4989 3067 -2913 -909 3240 903 -1099 1637 1694 -1932 9 3132 -453
1121 -453 -4326 -235 3394 -965 -4292 -250 2073 -2002 -2888 1143 564 -2718 -149 2700 -870 -3234
1137 -3234 1942 3415 -1403 -2135 3259 2658 -1682 -61 3284 582 -1988 1632 3322 -1529 -2784
1152 -2784 2319 1999 -2968 -2241 2278 185 -3026 -790 1828 -1783 -2962 1228 1024 -3007 -1358 3552
1168 3552 723 -3289 518 4062 -195 -2241 2264 3143 -1123 -1101 2878 1248 -2100 320 2872 -675
1184 -675 -2814 923 2080 -2122 -2669 1520 685 -3003 -1374 1871 -631 -3168 408 2246 -1742 -2266
$$ packed form
1075F93M053m225l238M306J397l672Q89L060l233l138M672K566n988l372O518
1090A288L524p012l145N886K334m695j100L611q84j993L004R92n068K20P371j110
1106C223p012J761P017j922n980K004M149k337k002K736N7l626J941L123l585
1121d53l873M091L629m359l327M042K323m075q86M031n79l282K569K849l570k364
1137c234N176J473m818p32N394o01m340J621L345k702k570L620J690m851j255
1152b784N103l20m967P27M519k093l211K236K618l611j179M190k04m031J649M910
1168C552k829m012L807L544m257k046M505Q79m266K2L979j630l348K420K552l547
1184f75k139L737J157m202n47M189q35l688J629L245k502k537L576J838l988n24
$$ plain form
1200 -2266 2303 1774 -2112 -392 3106 898 -2038 1383 3291 -237 -1625 2151 2105 -2027 -789 2637
1216 2637 658 -2557 -204 2019 -1547 -2598 757 711 -2669 -1786 1609 307 -2997 -333 2047 -1073
1232 -1073 -2044 1295 2373 -1184 -761 2526 1464 -1448 287 2739 493 -1824 1407 2464 -988
1247 -988 -1666 1648 1003 -2261 -1012 1364 -672 -2688 58 1023 -2089 -2063 1021 731 -2675 -910 2130
1264 2130 77 -2172 572 2282 -143 -944 1527 1872 -789 49 2358 1051 -1278 394 2316 -318
1280 -318 -1751 794 1443 -1550 -1852 1058 195 -2547 -914 1289 -1024 -2170 387 1195 -1425 -1297
1296 -1297 1290 1098 -1097 -189 1811 417 -580 1127 1928 127 -417 1791 1562 -599 -107 1300 521
1313 521 -1251 -107 644 -1018 -1525 130 49 -1665 -877 553 -569 -1710 -269 849 -1080 -1175 844
$$ packed form
1200b266M569n29l886J720L498k208k936L421J908l528j388L776m6m132J238L426
1216B637j979l215K353K223l566j051L355m6l380Q83L395j302l304K664K380l120
1232a073r71L339J078l557M23L287j062k912J735K452k246k317L231J057l452
1247i88o78L314o45l264J249K376k036k016K746R65l112K6L084k90l406J765L040
1264B130k053k249K744J710k425q01K471L45k661Q38K309j307k329J672J922k634
1280c18j433K545O49k993l02K910q63k742J633K203k313j146K557Q08k620J28
1296a297K587j92k195R08K000j394r97J707Q01j801n44K208k29k161M92J407p79
1313E21j772J144P51j662n07J655q1j714P88J430j122j141J441J118j929r5K019
$$ plain form
1330 844 1062 -599 18 1562 765 -404 743 1713 85 -591 1216 1691 -327 -745 1059 680 -1002
1347 -1002 -428 772 -582 -1593 -341 114 -1485 -1330 95 76 -1310 -609 370 162 -545 256 428 368
1365 368 523 646 706 236 559 1131 580 81 325 749 180 -169 369 -165 -437 78 -243 -956 -1064 -168
1385 -168 -33 -1015 -1266 5 442 -871 -1101 38 220 -89 69 833 463 337 656 1200 616 26 776
1404 776 1378 376 -539 219 1109 472 -469 -482 268 142 -704 -1174 -923 -339 -517 -762 -707 -589 -705 52
1424 52 223 -283 -556 454 1181 90 -639 682 1450 814 -414 64 1451 1063 -180 -92 626 327 -206
1443 -206 -222 -46 -428 -827 -342 60 -1150 -1433 55 628 -907 -1754 79 1167 -362 -1253 182 1589
1461 1589 415 -694 665 1331 -8 -155 1273 897 -886 -177 1653 1018 -1699 -992 1324 962 -1730
$$ packed form
1330H44K18j661O17J544p97j169J147R70j628o76J807M75k018m18J804l79j682
1347a002N74J200j354j011J252M55j599J55J425j9j386P01R79k08p07Q01J72o0
1365C68J55J23O0m70L23N72n51m99K44M24n69l49N38n34k72N15l21p13j08Q96
1385a68J35r82k51J271M37j313k30J139J82l09J58P64l70j26L19N44n84n90P50
1404G76O02j002r15P58Q90o37r41j3P50j26q46m70K51N84j78k45N5J18j16P57
1424E2J71n06k73J010P27j091p29J321P68o36j228M78J387l88j243Q8P18k99n33
1443b06j6J76l82l99M85M02j210k83J488N73j535q47J833J088j529q91J435J407
1461A589j174j109J359O66j339j47J428l76j783P09J830o35k717P07K316l62k692
$$ plain form
1478 -1730 -1544 667 301 -1484 -1271 275 -309 -1198 -357 662 -396 -1023 311 1062 -317 -843 636
1495 636 1813 389 -841 466 1892 517 -1125 161 1498 215 -1024 -227 650 -374 -1044 -85
1511 -85 -110 -928 -1376 -302 829 -1187 -1910 158 1167 -864 -1770 884 1914 -525 -1490 912 1357
1528 1357 -685 -90 2071 1048 -962 -65 1529 577 -1351 -8 1828 -20 -1540 -329 961 -97
1544 -97 -1685 -402 380 -386 -1040 -214 329 -834 -842 473 504 -680 -37 948 754 131 -104 639 994 129
1564 129 -29 523 1019 366 65 122 312 220 -413 -446 101 -272 -964 -571 -48 -876 -1405 -68 532 -1054
1584 -1054 -1293 726 680 -922 -826 972 601 -829 234 1435 163 -493 825 1529 -31 -776 594
1601 594 1102 -373 -868 348 603 -776 -793 202 -260 -1108 -393 314 -578 -1439 -155 616 -785 -592 334
$$ packed form
1478a730J86K211l66j785K13J546n84q89Q41J019j058o27J334P51j379n26J479
1495F36J177j424j230J307J426j375j642J286J337j283j239P97Q77j024o70R59
1511h5k5q18m48J074J131k016p23K068J009k031r06K654J030k439r65K402M45
1528A357k042N95K161j023k010Q97J594r52j928J343J836j848j520J211J290j058
1544i7j588J283P82p66o54Q26N43j163qJ315L1j184O43R85j94o23k35P43L55q65
1564A29j58N52M96o53l01N7J90r2o33l3N47l73o92L93N23q28n29J337O00j586
1584a054k39K019m6j602R6J798l71j430J063J201j272o56J318P04j560p45J370
1601E94N08j475m95J216K55j379j7R95m62q48P15P07q92q61J284P71j401J93R26
$$ plain form
1620 334 377 -278 -18 877 301 341 702 555 32 342 792 392 -245 564 639 -363 -554 331 -111 -638 -244
1641 -244 67 -668 -1101 -268 -63 -1097 -1051 330 426 -826 -284 677 219 -356 396 986 285 -176 755 1054
1661 1054 -261 -234 1005 1074 -409 -172 1198 488 -985 -547 363 -600 -984 63 198 -1080 -736 112
1679 112 -251 -1213 -365 254 -168 -328 497 607 -136 301 770 465 163 1111 595 433 64 286 373 -408
1699 -408 53 415 33 -551 -179 93 -452 -928 -120 71 -1150 -903 120 -656 -1062 -337 601 61 -374
1718 -374 612 820 -145 -133 820 748 -198 -32 1122 461 -238 217 690 -38 -540 -172 18 -1020 -589 -28
1738 -28 151 -684 -253 115 -502 -837 -76 70 -538 -310 410 232 -375 284 714 234 106 941 621 36
1758 36 15 860 479 1 274 379 -151 -542 4 64 -585 -463 53 -206 -670 -555 244 -222 -866 -222 266
$$ packed form
1620C34M3o55K60Q95n76M0L61j47n23L10M50m00o37Q09P5j002j91Q85m42n27L94
1641b44L11p35m33Q33K05j034M6J381R6j252N42R61m58n75P52N90p01m61R31K99
1661A054j315K7J239O9j483K37J370p10j473M38R10r63l84J047J35j278L44Q48
1679A12l63r62Q48O19m22j60Q25J10p43M37M69l05l02R48n16j62l69K22Q7p81
1699d08M61L62l82n84L72K72n45m76Q08J91j221K47J023p76m06P25R38n40m35
1718c74R86K08r65J2R53p2r46J66J154o61o99M55M73p28n02L68J90j038M31N61
1738b8J79q35M31L68o17l35P61J46o08K28P20j78o07O59M30m80j28Q35l20n85
1758C6k1Q45l81m78K73J05n30l91N46O0o49J22N16k59m64J15P99m66o44O44M88
$$ plain form
1779 266 -285 -259 677 443 -233 89 516 461 82 485 809 448 -10 399 658 22 -291 546 45 -546 -136
1800 -136 193 -115 -744 -111 470 -670 -651 66 -150 -619 -238 97 -273 -304 -23 629 12 80 715 415 58
1821 58 169 999 341 200 244 713 169 -134 175 253 -528 -182 52 -100 -735 -298 142 -589 -885 -223 -36
1842 -36 -616 -241 153 144 -238 163 624 202 -221 365 613 86 202 649 547 -127 151 338 -265 -97 260
1863 260 -106 -543 -580 260 -275 -720 -272 176 -368 -571 -308 -63 -302 -147 359 108 140 75 806 471 -396
1884 -396 434 805 168 -185 712 531 -227 -5 224 112 -343 -177 265 -317 -670 -325 229 -665 -956 -153
1904 -153 309 -331 -257 148 117 -143 30 104 -7 -21 248 609 311 146 254 342 643 445 389 457 303 378 -266
1927 -266 -399 57 51 -456 -727 -42 -169 -626 -564 52 -141 -475 -19 107 -477 -385 309 474 -97 -180 654 671
$$ packed form
1779B66n51K6R36k34o76L22M27n5l79M03L24l61m58M09K59o36l13Q37n01n91M10
1800a36L29l08o29O33N81j140J9P17k16m69L81L35l70l1K81O52o17O8O35l00l57
1821E8J11Q30o58j41M4M69n44l03L09P8p81L46K34j52o35M37M40p31k96O62J87
1842c6n80L75L94rl82M01M61m22m23N86K48n27J16M47j02o74K78J87o03J68L57
1863B60l66m37l7Q40n35m45M48M48n44k03K63K45k39J55N06k51L2o5P31l35q67
1884c96Q30L71o37l53Q97j81p58K22K29j12m55J66M42n82l53L45N54q94k91Q03
1904a53M62o40P4M05l1k60J73P4j11j4K69L61k98j65J08Q8L01j98n6O8j54P5o44
1927b66j33M56on07k71O85j27m57O2O16j93l34M56J26n84R2O94J65n71q3Q34J7
$$ plain form
1949 671 89 118 786 611 164 -83 695 194 -544 -76 418 72 -407 -292 -46 -388 -741 -225 4 -370
1969 -370 -760 -232 201 -83 -240 -115 238 -17 -127 344 448 -2 -76 608 556 16 86 670 355 -173 -266
1990 -266 237 148 -491 -456 146 -31 -766 -368 158 -442 -525 -199 -170 -600 -215 -43 470 -53 -189 113 400
2011 400 348 150 46 391 173 -227 -8 433 465 79 74 382 120 -439 -235 350 252 -715 -311 -37 -164 -663
2033 -663 -148 207 -28 -541 94 512 -31 -302 345 552 -210 37 831 649 86 300 1022 291 -248 282
2053 282 394 -40 -674 15 -193 -405 -628 182 71 -561 -201 -67 -352 -188 -63 18 -272 -393 268 -27
2073 -27 114 271 425 198 3 540 422 27 334 433 378 -337 293 495 -199 -256 387 32 -639 -202 290
2094 290 -70 -618 -85 588 -420 -549 343 231 -507 -223 297 441 -390 132 607 100 -626 403 834
$$ packed form
1949F71n82K9O68j75m47k47P78n01p38M68M94l46m79J15K46l42l53N16K29l74
1969c70l90N28M33k84j57J25L53k55j10M71J04m50p4O84n2n40P0N84l15n28r3
1990b66N03q9o39L5O02j77p35L98N26o00q3L26K9m30L85J72N13n23j36L02K87
2011D00n2j98j04L45k18m00K19M41L2l86nL08k62n59K04N85r8r67M04K74j27m99
2033f63N15L55k35n13O35M18n43k71O47K07p62K47P94j82n63K14P22p31n39N30
2053B82J12m34o34O89k08k12k23Q10j11o32L60J34k85J64J25Q1k90j21O61k95
2073b7J41J57J54k27j95N37j18l95L07R9n5p15O30K02o94n7O43l55o71M37M92
2094B90l60n48N33O73j008j29Q92j12p38K84N20J44q31N22M75n07p26J029M31
$$ plain form
2113 834 -174 -294 355 299 -343 -148 609 -8 -342 78 211 -606 -573 -370 46 -420 -469 124 -3 -275 -62
2134 -62 259 -202 -328 444 254 -222 196 611 -94 -136 452 682 -117 -261 708 366 -593 -220 528 -208 -583
2155 -583 11 385 -621 -675 237 -30 -601 -353 171 146 -491 -91 382 76 -267 -128 530 150 45 631
2175 631 567 -82 32 480 16 -67 169 759 -373 -149 64 29 -672 -412 414 -293 -681 -122 281 -604 -530
2196 -530 2 6 -560 -148 449 -24 -460 112 708 -86 108 510 810 -51 -194 737 319 -369 153 462 30
2217 30 -602 -196 25 -238 -568 -82 -92 -488 -342 137 -230 -348 -175 322 -273 -369 112 275 -389 212 435
2238 435 128 -54 542 184 280 -259 235 274 -419 39 372 -274 -687 -4 230 -401 -624 113 109 -614 -620 233
2260 233 -197 -602 -87 593 -244 -337 427 358 102 -139 527 474 89 170 671 290 -230 226 350 -342 -357 431
$$ packed form
2113H34j008j20O49n6o42J95P57o17l34M20J33q17L3K03M16m66m9N93j27k72K13
2134f2L21m61j26P72j90m76M18M15p05m2N88K30p99j44R69l42r59L73P48p36l75
2155e83N94L74j006n4R12k67n71K48N24k5o37M00M73l06l43J39O58l80j05N86
2175F31o4o49J14M48m64q3K36N90j132K24K13l5p01K60Q26p07l88N59M03q85P4
2196e30N32Mn66M12N97m73m36N72N96p94J94M02L00q61j43R31m18o88N22L09m32
2217C0o32M06K21k63l30M86j0l96J46M79l67j18J73M97n95r6M81J63o64O01K23
2238D35l07j82N96l58R6n39M94L9o93M58L33o46m13O83K34o31k23P37mp23oQ53
2260B33m30m05N15O80q37r3P64o9k56k41O66n3l85Q1N01l81n20M56J24o92j5P88
$$ plain form
2282 431 47 -433 -225 80 -282 -493 -266 -177 -100 -418 -8 -52 -250 54 452 -200 -437 270 544 41 121
2303 121 633 512 -71 267 417 289 -224 71 327 -281 -494 257 -84 -409 -396 138 -177 -322 -156 32
2323 32 -265 -441 -17 65 -313 -30 364 124 9 84 149 147 -236 629 329 67 116 523 345 -307 35 2 -390
2346 -390 -171 247 -80 -300 -144 81 168 -388 -324 202 -374 -437 143 90 -100 -366 -56 236 -129 4 237
2367 237 304 -143 522 413 -60 45 262 117 178 -161 62 52 -436 -174 70 -190 -25 -298 -260 -316 -181 2
2389 2 -282 -267 48 394 -235 -192 201 312 -123 74 630 -80 -170 318 450 -63 38 356 369 -121 -102 152
2411 152 -30 -142 -227 -155 -79 -191 -111 -76 -113 -362 -58 -206 -68 -67 273 162 -246 53 178 339 94 190 98
2434 98 251 321 194 -209 18 117 18 -339 -128 98 58 -170 107 -295 -465 -280 -193 110 -395 -426 -187 159
$$ packed form
2282D31l84m80K08L05l62k11K27Q9P7l18M10m4j98L04L98o52k37P07K74n03Q0
2303A21N12j21n83L38J50j28n13K95K56o08k13P51l41l25J3N34l15j45J66J88
2323C2k97j76M24Q2l78K83L94k40j15P5O5kl83Q65l00k62M9M07j78o52L42l3l92
2346c90K19M18l27k20J56K25Q7n56O4N26n76o3N80n3j90k66L10K92l65J33K33
2367B37O7m47O65j09m73J05K17j45O1l39K23j0m88K62K44k60J65k73L8n6J35J83
2389Bk84J5L15L46o29M3L93J11m35J97N56p10r0M88J32n13J01L18J3m90J9K54
2411A52j82j12q5P2P6j12Q0L5l7k49L04j48J38JL40j11m08K99J25J61k45R6r2
2434I8J53P0j27m03K27R9r9l57K11K26m0k28K77m02j70J85Q7L03n05l1K39L46
$$ plain form
2456 159 -244 -242 25 -36 -187 238 490 84 216 226 197 134 204 237 430 110 54 -91 75 -68 7 -56 -174 199
2480 199 -68 -272 -243 -243 -30 -119 134 -276 -39 -89 148 22 135 69 147 355 119 530 178 137 300 242 248 6
2504 6 186 169 -83 -199 -145 135 -14 -299 -30 11 -423 -110 134 -155 -209 51 -64 -78 -68 134 183 210 91
2527 91 217 114 277 445 117 183 296 219 -104 47 156 74 104 -115 21 30 -193 -215 95 -248 -355 -154 -147
2550 -147 -95 -144 -42 270 -169 -60 297 279 -135 31 420 201 -27 294 256 224 -64 -359 401 147 145 108 -141
2573 -141 186 -30 -241 -10 -27 -307 -279 -125 -22 -154 -128 114 -139 27 -75 -220 112 187 -178 32 411
2594 411 80 157 159 -52 -128 267 212 150 78 95 100 -33 -147 257 -33 -259 -426 -24 108 -408 -135 271 -198
2617 -198 -474 39 97 -74 -40 189 140 138 -132 313 312 -186 200 354 280 54 -11 144 81 -227 -59 181 -260
$$ packed form
2456A59m03KK67o1j51M25K52m06J32J0k9o3P0L3J93l20n6j45J66j43P5o3j18L73
2480A99k67k04K9%K13q9K53m10K37n0K37j26J13o6P8K08k36M11l52m1J63n8Ok42
2504FJ80j7k52j16N4K80j49k85K69M1m34L13K44k89n4K60j15j4J0K02M9K7j19
2527I1J26j03J63J68l28O6J13p7l23J51J09q2L0k19J36Rk23k2L10l43j07K01P
2550a47N2m9J02L12m39J09L57j8m14J66L89k19k28L21l8l2k88k95P60k54kl7k49
2573a41L27k16k11K31j7k80K8J54J03j32K6K42k53J66j02j45L32P5l65K10L79
2594D11l31P7Kk11p6L95n5o2p2J7Nj33j14M04k90k26j67M02J32n16K73M06m69
2617a98k76N13N8j71L4K29m9kk70M45jm98L86J54p4k26o5J55o3l08J68K40m41
$$ plain form
2640 -260 -86 160 -349 -340 128 65 -89 -109 62 -105 -566 84 155 388 -278 101 382 223 93 501 205 -50
2662 -50 180 147 -223 -172 253 157 -127 -155 130 -405 -221 -121 14 -141 -503 -194 156 -322 -356 -143 127 -265
2684 -265 46 311 341 -217 31 360 -62 33 304 352 -152 52 295 1 -166 -180 -74 -257 -257 4 93 -76
2706 -76 -273 -233 -33 -369 -102 -64 -228 -112 -33 215 -183 -164 356 164 -106 -57 321 -66 -101 274 95 68 -25
2729 -25 169 41 -312 -336 232 88 -425 -157 72 -355 -181 115 -45 -180 -134 93 -122 -334 35 213 -262
2750 -262 -152 181 338 -14 99 87 467 -53 252 253 315 -127 -111 -24 -249 -172 20 -94 -456 -138 -161 -165 -461
2773 -461 -332 -264 -111 -196 -129 72 -253 5 237 254 -14 298 -11 -114 -75 -7 416 241 127 203 239 -140 -32
2796 -32 214 -19 -30 112 204 -210 -137 172 -328 -595 -156 -27 -275 -357 69 304 -346 -200 90 13 -21 138
$$ packed form
2640b60J74K46n09RM68o3j54k0J71j67m61O50P1K33o66L79K81j59j30M08k96k55
2662e0K30l3l70N1M25r6k84k8K85n35J84J00J35j55l62L09L50m78l4K13K70l92
2684b65L11K65L0n58K48L29m22R5K71M8n04K04K43k94j67j4J06j83%K61Q9j69
2706g6j97M0K00l36K67L8j64J16P9K48l98J9N20j92k70M9L78l87l5L75j79k7r3
2729b5J94j28l53k4N68j44n13K68K29m27J74K96j60j35M6K27k15k12L69J78m75
2750b62J10L33J57l52J13j2L80n20L05JO2m42J6Q7k25P7J92j14l62L18k3mk96
2773d61J29O8J53q5O7K01l25K58K32J7k68L12l09j03L9O8M23j75j14P6L6l79J08
2796c2K46k33j1J42R2m14P3L09n00k67M39J29k48q2M26K35o50J46K90p7l4J59
$$ plain form
2818 138 482 -67 -204 159 333 135 12 240 86 16 -371 197 -207 -339 -182 36 -73 -117 -166 -130 -425
2839 -425 -67 80 223 -267 -64 199 -123 29 41 157 -560 182 440 153 93 103 441 34 -23 267 178 -88
2861 -88 -148 315 -123 -205 -80 314 -86 -553 -14 320 -82 -385 -140 94 -135 -342 122 98 -2 134 385
2882 385 119 407 143 349 86 -228 176 -3 85 256 30 -285 11 68 -26 -16 29 32 -236 -171 130 -82 -137
2905 -137 -104 170 10 -224 158 130 235 -189 1 97 -5 -87 193 163 188 -19 340 32 328 -21 275 86
2927 86 -222 -141 131 95 -402 -67 -59 -109 -414 31 36 117 8 -156 68 -75 341 222 269 60 290 279 41 159
2951 159 281 81 31 243 328 -126 45 120 -287 -170 123 -230 -158 -193 50 -25 -209 -51 -152 65 -354 -98
2973 -98 -90 -60 66 231 338 -11 195 219 32 253 -22 188 -67 196 285 -105 246 -151 267 50 -136 -263
$$ packed form
2818A38L44n49j37L63J74j98j23K28j54p0l87N68m04j32J57K18j09m4m9L6k95
2839d25L58J47J43m90K03K63l22J52J2J16p17P42K58k87o0J0L38m07n7K90q9k66
2861h8o0M63m38q2J25L94m00m67N39L34m02l03K45K34k29k07M64k4j00J36K51
2882C85k66K88k64K06k63l14M04j79Q8J71k26l15K96N7r4J0M5Lk68O5L01k12n5
2905a37L3K74j60k34L82k8J05m24J90R6j02q2K80l0K5k07L59l08K96l49K96j89
2927H6l08Q1K72l6m97L35Qn0l05M45NQ1j09j64K24j43M16j19M7k09K30j1k38J18
2951A59J22k00n0K12Q5m54J71P5m07J17K93l53P2l5K43p5j84J58j01K17m19K56
2973i8QL0J26J65J07l49K06K4j87K21k75K10k55K63Q9l90L51l97M18k17j86j27
$$ plain form
2995 -263 -179 -202 -394 58 -149 -270 64 21 -11 161 -106 -76 -368 -79 191 62 143 16 -41 250 200 258 276
3018 276 215 45 98 261 -126 -91 199 -248 -251 -70 -150 -116 25 -200 96 75 -40 -123 -58 -121 -53 -27 27 18 204
3043 204 128 109 93 291 -70 347 -27 184 53 -97 62 -61 22 26 -81 85 -45 -62 -10 -262 -198 -261 -135
3066 -135 -127 -156 -173 105 -93 252 201 69 -90 -59 126 -289 -22 28 248 343 137 447 -112 21 -7 43 195
3089 195 -38 -227 -106 -215 -100 -300 4 38 -232 -42 -136 40 -73 -313 -163 149 222 -128 135 100 388
3110 388 79 318 -24 141 44 141 48 -176 41 175 34 -218 90 166 -130 -143 -325 66 -190 -272 -44 -8
3132 -8 -15 201 -18 -65 -51 -166 -41 299 -11 167 35 135 151 11 -31 96 252 115 45 -173 42 -119 -300
3155 -300 -95 -18 -125 102 154 -68 -107 -218 -163 -260 -180 34 -82 -219 -8 266 57 -35 84 123 88 52 163
$$ packed form
2995b63Q4k3j92M52k07j21L34m3l2J72k67L0k92K89K70j29Q1j27n7K91n0N8J8
3018B76o1j70N3J63l87L5K90m47lJ81q0L4J41k25K96k1j15q3O5o3O8K6N4rJ86
3043B04p6j9j6J98l61M17l74K11j31j50J59j23Q3Mj07J66j30j7N2k52O4o3J26
3066a35Qk9j7K78j98L45n1j32j59L1J85m15K67N0K20R5k06L10n59J33k8N0J52
3089A95k33j89J21j09J15k00L04L4k70J90r4J76j13k40J50L12P3l50K63l5K88
3110C88l09K39l42J65r7R7r3k24K17J34j41k52L08P6k96j3j82L91k56q2K28L6
3132hpK16k19m7J4j15J25L40l10J78j32J00J6j40m2J27J56j37p0k18K15j61j81
3155c00K05P7j07K27N2k22l9j11N5r7Q0K14j16j37K11K74k09r2J19L9l5l6J11
$$ plain form
3178 163 277 88 -312 272 284 60 -177 110 -94 -328 139 -178 151 -179 -99 -444 -346 -78 -43 -181 52
3199 52 -29 45 -55 -145 230 235 -51 124 80 213 -41 126 115 157 -276 222 98 -110 62 -172 -134 -32 -303
3222 -303 182 -114 -205 -35 -69 246 -57 3 307 -75 -181 216 95 182 -145 238 276 -27 148 192 -18 -260
$$ packed form
3178A63J14j89m00N84J2k24k37K87k04k34M67l17L29l30Q0l45R8K68L5j38K33
3199E2q1P4j00r0L75Nk86J75m4J33k54J67j1M2m33M98j24k08J72k34L8J02k71
3222c03M85k96r1J70l4L15l03O0L04l82j06L97j21Q7l27L83L8l03J75M4k10k42
$$ [...]
8191a73
##END NTUPLES=NMR FID
##END=
