##TITLE=1H_Pr 53-126
 CD3OD
 8 sc, 
 10.12.2021
##JCAMPDX= 6.0         $$ Bruker NMR JCAMP-DX V2.0
##DATA TYPE= NMR FID
##DATA CLASS= NTUPLES
##ORIGIN= UXNMR, Bruker Analytische Messtechnik GmbH
##OWNER= root
$$ XWIN-NMR		Version 3.5
$$ Fri Dec 10 13:06:23 2021 Russian Standard Time (UT+4h)  she@DPX200
##.OBSERVE FREQUENCY= 200.131346
##.OBSERVE NUCLEUS= ^1H
##.DELAY= (6, 6)
##.ACQUISITION MODE= SIMULTANEOUS
##.ACQUISITION SCHEME= undefined
##.AVERAGES= 8
##.DIGITISER RES= 18
##SPECTROMETER/DATA SYSTEM= spect
##.PULSE SEQUENCE= zg30
##.SOLVENT NAME= MeOD
##.SHIFT REFERENCE= (INTERNAL, MeOD, 0, 15.7039)
##AUDIT TRAIL= $$ (NUMBER, WHEN, WHO, WHERE, WHAT)
$$ ##TITLE= Audit trail, XWIN-NMR		Version 3.5
$$ ##JCAMPDX= 5.01
$$ ##ORIGIN= Bruker BioSpin GmbH
$$ ##OWNER= she
$$ F:/spectra/data/she/nmr/H-F/1/audita.txt
$$ ##AUDIT TRAIL=  $$ (NUMBER, WHEN, WHO, WHERE, WHAT)
(   1,<2021-12-10 13:04:45.73 +0400>,<she>,<DPX200>,
      <created by zg, POWCHK disabled, PULCHK disabled
       configuration hash MD5:
       00 E9 B6 7A A2 85 ED C7 34 08 36 98 17 FE 4E 26
       data hash MD5: 16K
       24 F3 79 73 9E 6B EB E6 08 D1 46 95 DE FE 83 B4>)
$$ ##END=
$$ 
$$ hash MD5
$$ 2C 21 33 38 2A A8 F4 78 C8 21 05 6F 68 99 11 7B
##$RELAX= 
##$RELAX= 
##$RELAX= 
##$RELAX= 
##$RELAX= 
##$RELAX= 
$$ Bruker specific parameters
$$ --------------------------
##$DU= <F:/spectra>
##$EXPNO= 1
##$NAME= <H-F>
##$PROCNO= 1
##$TYPE= <nmr>
##$USER= <she>
##$AMP= (0..31)
100 100 100 100 100 100 100 100 100 100 100 100 100 100 100 100 100 100 
100 100 100 100 100 100 100 100 100 100 100 100 100 100 
##$AQSEQ= 0
##$AQ_mod= 1
##$AUNM= <au_zg>
##$AUTOPOS= <>
##$BF1= 200.13
##$BF2= 200.13
##$BF3= 200.13
##$BF4= 200.13
##$BF5= 200.13
##$BF6= 200.13
##$BF7= 200.13
##$BF8= 200.13
##$BYTORDA= 1
##$CFDGTYP= 0
##$CFRGTYP= 5
##$CHEMSTR= <none>
##$CNST= (0..31)
1 1 145 1 1 1 1 1 1 1 1 1 1 1 1 1 1 1 1 1 1 1 1 1 1 1 1 1 1 1 1 1 
##$CPDPRG= <>
##$CPDPRG1= <>
##$CPDPRG2= <>
##$CPDPRG3= <>
##$CPDPRG4= <mlev>
##$CPDPRG5= <mlev>
##$CPDPRG6= <mlev>
##$CPDPRG7= <mlev>
##$CPDPRG8= <mlev>
##$CPDPRGB= <>
##$CPDPRGT= <>
##$D= (0..31)
0 1.2 0 0 0 0 0 0 0 0.06 0 0.03 0 0 0 0 0.0002 0 0 0 0 0 0 0 0 0 0 0 0 
0 0 0 
##$DATE= 1639127085
##$DBL= (0..7)
120 120 120 120 120 120 120 120 
##$DBP= (0..7)
150 150 150 150 150 150 150 150 
##$DBP07= 0
##$DBPNAM0= <>
##$DBPNAM1= <>
##$DBPNAM2= <>
##$DBPNAM3= <>
##$DBPNAM4= <>
##$DBPNAM5= <>
##$DBPNAM6= <>
##$DBPNAM7= <>
##$DBPOAL= (0..7)
0.5 0.5 0.5 0.5 0.5 0.5 0.5 0.5 
##$DBPOFFS= (0..7)
0 0 0 0 0 0 0 0 
##$DE= 6
##$DECBNUC= <off>
##$DECIM= 32
##$DECNUC= <off>
##$DECSTAT= 4
##$DIGMOD= 1
##$DIGTYP= 9
##$DL= (0..7)
0 120 120 120 120 120 120 120 
##$DP= (0..7)
150 150 150 150 150 150 150 150 
##$DP07= 0
##$DPNAME0= <>
##$DPNAME1= <>
##$DPNAME2= <>
##$DPNAME3= <>
##$DPNAME4= <>
##$DPNAME5= <>
##$DPNAME6= <>
##$DPNAME7= <>
##$DPOAL= (0..7)
0.5 0.5 0.5 0.5 0.5 0.5 0.5 0.5 
##$DPOFFS= (0..7)
0 0 0 0 0 0 0 0 
##$DQDMODE= 0
##$DR= 18
##$DS= 0
##$DSLIST= <SSSSSSSSSSSSSSS>
$$ [...]
##$SUBNAM2= <"">
##$SUBNAM3= <"">
##$SUBNAM4= <"">
##$SUBNAM5= <"">
##$SUBNAM6= <"">
##$SUBNAM7= <"">
##$SUBNAM8= <"">
##$SUBNAM9= <"">
##$SW= 18.0517287032376
##$SWIBOX= (0..15)
0 0 2 0 0 0 0 0 0 0 0 0 0 0 0 0 
##$SW_h= 3612.71676300578
##$TD= 16384
##$TD0= 1
##$TE= 0
##$TE2= 300
##$TE3= 300
##$TEG= 300
##$TL= (0..7)
0 120 120 120 120 120 120 120 
##$TP= (0..7)
150 150 150 150 150 150 150 150 
##$TP07= 0
##$TPNAME0= <>
##$TPNAME1= <>
##$TPNAME2= <>
##$TPNAME3= <>
##$TPNAME4= <>
##$TPNAME5= <>
##$TPNAME6= <>
##$TPNAME7= <>
##$TPOAL= (0..7)
0.5 0.5 0.5 0.5 0.5 0.5 0.5 0.5 
##$TPOFFS= (0..7)
0 0 0 0 0 0 0 0 
##$TUNHIN= 0
##$TUNHOUT= 0
##$TUNXOUT= 0
##$USERA1= <user>
##$USERA2= <user>
##$USERA3= <user>
##$USERA4= <user>
##$USERA5= <user>
##$V9= 5
##$VALIST= <valist>
##$VCLIST= <CCCCCCCCCCCCCCC>
##$VD= 0
##$VDLIST= <DDDDDDDDDDDDDDD>
##$VPLIST= <PPPPPPPPPPPPPPP>
##$VTLIST= <TTTTTTTTTTTTTTT>
##$WBST= 1024
##$WBSW= 4
##$XGAIN= (0..3)
0 0 0 0 
##$XL= 0
##$YL= 0
##$YMAX_a= 107156
##$YMIN_a= -211690
##$ZGOPTNS= <>
##$ZL1= 120
##$ZL2= 120
##$ZL3= 120
##$ZL4= 120
##$ABSF1= 10
##$ABSF2= 0
##$ABSG= 5
##$ABSL= 3
##$ALPHA= 0
##$AQORDER= 0
##$ASSFAC= 0
##$ASSFACI= 0
##$ASSFACX= 0
##$ASSWID= 0
##$AUNMP= <proc_1d>
##$AZFE= 0.1
##$AZFW= 0.1
##$BCFW= 1
##$BC_mod= 2
##$BYTORDP= 1
##$COROFFS= 0
##$CY= 11.3945322036743
##$DATMOD= 1
##$DC= 2
##$DFILT= <>
##$DTYPP= 0
##$F1P= 2.36226072786647
##$F2P= -0.459571619588291
##$FCOR= 0.5
##$FTSIZE= 0
##$FT_mod= 4
##$GAMMA= 1
##$GB= 0.15
##$INTBC= 1
##$INTSCL= 1
##$ISEN= 128
##$LB= 0.24
##$LEV0= 0
##$LPBIN= 0
##$MAXI= 10000
##$MC2= 0
##$MEAN= 0
##$ME_mod= 0
##$MI= 1.114404
##$NCOEF= 0
##$NC_proc= 0
##$NLEV= 6
##$NOISF1= 3.799351
##$NOISF2= 2.8
##$NSP= 1
##$NTH_PI= 0
##$NZP= 0
##$OFFSET= 15.70392
##$PC= 1
##$PHC0= -15877.59
##$PHC1= 18.6008
##$PH_mod= 1
##$PKNL= yes
##$PPARMOD= 0
##$PSCAL= 0
##$PSIGN= 0
##$REVERSE= no
##$SF= 200.130013532006
##$SI= 16384
##$SIGF1= 3
##$SIGF2= 2
##$SINO= 400
##$SIOLD= 16384
##$SREGLST= <1H.CDCl3>
##$SSB= 0
##$STSI= 0
##$STSR= 0
##$SW_p= 3612.71676300578
##$SYMM= 0
##$S_DEV= 0
##$TDeff= 0
##$TDoff= 0
##$TI= <>
##$TILT= no
##$TM1= 0
##$TM2= 0
##$TOPLEV= 0
##$USERP1= <user>
##$USERP2= <user>
##$USERP3= <user>
##$USERP4= <user>
##$USERP5= <user>
##$WDW= 1
##$XDIM= 8192
##$YMAX_p= 0
##$YMIN_p= 0
$$ End of Bruker specific parameters
$$ ---------------------------------
##NTUPLES= NMR FID
##VAR_NAME=  TIME,          FID/REAL,        FID/IMAG
##SYMBOL=    X,             R,               I
##VAR_TYPE=  INDEPENDENT,   DEPENDENT,       DEPENDENT
##VAR_FORM=  AFFN,          ASDF,            ASDF
##VAR_DIM=   8192,          8192,            8192
##UNITS=     SECONDS,       ARBITRARY UNITS, ARBITRARY UNITS
##FACTOR=    0.0002768,     1,               1
##FIRST=     0,             0,               0
##LAST=      2.2672688,     0,               0
##MIN=       0,             -211690,         0
##MAX=       2.2672688,     107156,          0
$$ Real data points
##PAGE= N=1
##DATA TABLE= (X++(R..R)), XYDATA
$$ [...]
$$ plain form
1847 31 -953 220 -1050 -712 572 -433 1016 899 -478 739 -559 -919 296 -1068 -79 719 -120
1864 -120 1352 496 -645 553 -1004 -525 147 -906 461 524 106 1335 -183 -466 257 -1246 -79
1881 -79 186 -777 965 428 223 1151 -634 -500 -175 -1395 417 -8 -355 1298 -45 416 813 -1345
1899 -1345 -375 -431 -928 943 24 85 1071 -143 461 87 -1318 209 -677 -278 1117 -183 467 864
1917 864 -633 522 -496 -1357 317 -710 168 989 -220 788 239 -592 427 -1052 -853 268 -504
1934 -504 725 946 -452 847 -149 -462 79 -1203 -351 479 -212 1050 371 -509 793 -669 -458 83
1952 83 -1222 198 526 65 1357 -330 -285 431 -988 -3 -160 -1045 850 373 248 1085 -684 -110
1970 -110 -132 -929 333 -508 -642 1165 142 541 733 -1042 -11 -378 -784 216 -400 119 1138 11
$$ packed form
1847C1r84J173j270L38J284j005J449j17j377J217j298l60J215j364R89P98q39
1864a20J472q56j141J198j557M79O72j053J367O3m18J229j518k83P23j503J167
1881g9K65r63J742n37k05R28j785J34L25j220J812m25l47J653j343M61L97k158
1899a345R70n6m97J871r19O1R86j214O04l74j405J527q86L99J395j300O50L97
1917H64j497J155j018q61J674j027Q78Q21j209J008n49q31J019j479J99J121p72
1934e04J229K21j398J299r96l13N41j282Q52Q30o91J262o79q80J302j462K11N41
1952H3j305J420L28m61J292j687M5P16j419R85j57q85J895m77j25Q37j769N74
1970a10k2p97J262q41j34J807j023L99J92j775J031l67m06J000o16N19J019j127
$$ plain form
1988 11 628 49 -1205 273 -500 -492 844 -381 551 1079 -246 509 -668 -817 392 -677 -79 734
2006 734 -568 1059 738 -711 465 -894 -807 516 -507 338 379 -326 994 -18 -530 214 -1436
2023 -1436 -299 591 -477 612 172 -274 997 -263 -276 -333 -1279 467 478 -292 1094 -231 -103 853
2041 853 -715 -193 -167 -853 760 308 279 841 -684 186 462 -984 -4 -488 -485 1144 294 357 460 -574
2061 -574 272 -8 -858 326 -773 30 1259 -229 452 190 -856 395 -368 -748 134 -525 552 858
2079 858 -411 661 -266 -717 628 -894 -398 737 -351 690 501 -316 494 -667 -203 343 -1002
2096 -1002 220 353 -315 1271 135 -568 289 -711 -176 247 -539 260 357 207 1102 -643 -277 170
2114 170 -978 548 117 -667 782 245 269 933 -656 -278 -386 -714 753 -94 -241 700 -364 503
$$ packed form
1988A1O17n79j254J478p73QJ336j225R32N28j325P55j177j49J209j069N98Q13
2006G34j302J627l21j449J176j359Q7J323j023Q45M1p05J320j012n12P44j650
2023a436J137Q90j068J089m40m46J271j260j3n7r46J746J1p70J386j325J28R56
2041H53j568N22K6o86J613m52k9N62j525Q70K76j446R80m84LJ629q50O3J03j034
2061e74Q46k80q50J184j099Q03J229j488O81k62j046J251p63l80Q82o59J077L06
2079H58j269J072r27m51J345j522M96J135j088J041j89q17Q10j161M64N46j345
2096a002J222J33o68J586j136p03Q57j000N35M23p86P99R7j50Q95j745L66M47
2114A70j148J526m31p84J449n37K4O64j589L78j08l28J467q47j47R41j064Q67
$$ plain form
2132 503 469 -1271 -274 -344 -262 862 -251 -36 688 -329 757 -156 -1198 450 -532 70 1090 -203
2150 -203 198 261 -107 615 -674 -929 253 -553 644 738 -690 508 102 -490 606 -692 -610 156 -211
2169 -211 931 276 -333 515 -416 -227 398 -1127 -73 497 -346 961 220 -217 342 -663 32 -84
2187 -84 -947 400 63 -150 954 -353 -212 340 -750 97 -1 -731 735 274 305 584 -860 16 153
2206 153 -652 351 -301 -442 864 185 346 314 -983 290 -274 -419 516 -640 198 946 -260 502
2224 502 -156 -1205 300 -138 -223 611 -593 583 610 -210 593 -647 -942 446 -461 153 431 -600
2242 -600 661 400 -191 262 -767 -255 430 -386 510 38 -534 905 63 -194 55 -1044 -170 508 -178
2261 -178 666 -175 -195 789 -569 -130 -190 -1039 439 143 -66 708 -196 41 468 -640 33 -399 -583 778
$$ packed form
2132E03l4j740R97p0Q2J124j113K15P24j017J086r13j042J648r82O02J020j293
2150b03M01O3l68P22j289k55J182q06J197R4j428J198m06n92J096j298Q2P66l67
2169b11J142o55o09Q48r31J89O25j525J054N70q43J307p41m37N59j005O95j16
2187h4q63J347l37k13J104j307J41N52j090Q47r8p30J466m61L1K79j444Q76J37
2206A53q05J003o52j41J306o79J61l2j297J273n64j45R35j156Q38P48j206P62
2224E02o58j049J505m38q5Q34j204J176K7q20Q03j240k95J388r07O14K78j031
2242f00J261k61n91M53j029N12O85q16Q96m72n72J439q42k57K49j099Q74O78o86
2261a78Q44q41k0R84j358M39o0q49J478k96k09P74r04K37M27j108O73m32j84J361
$$ plain form
2281 778 41 158 532 -574 332 305 -622 196 -457 -334 905 -65 222 330 -732 553 -100 -653 354
2300 354 -507 188 924 -313 367 -83 -607 572 -454 -454 281 -559 691 700 -474 387 -543 -551 746 -506
2320 -506 -108 195 -466 974 106 -558 302 -714 -257 421 -625 230 271 -227 977 -124 -230 96 -822
2339 -822 119 235 -589 378 -173 94 879 -540 -170 -55 -830 523 141 -367 719 -304 326 550 -806
2358 -806 -111 -153 -415 667 -60 -32 678 -350 523 280 -733 40 -418 -325 795 -401 274 349 -307 560
2378 560 -311 -790 116 -493 98 598 -376 457 203 -276 609 -578 -655 377 -353 796 618 -492 472
2397 472 -305 -186 356 -777 -189 192 -194 809 325 -373 668 -545 -111 164 -769 179 258 54 848
2416 848 -208 -225 415 -544 181 58 -751 619 118 127 670 -509 -231 112 -504 350 -98 -410 520 -86
$$ packed form
2281G78p37J17L74j106R06k7r27Q18o53J23J239r70K87J08j062J285o53n53J007
2300C54q61O95P36j237O80m50n24J179j026%P35q40J250Rj174Q61r30qJ297j252
2320e06L98L03o61J440q68o64Q60j016M57O78j046Q55M1m98J204j101j06L26r18
2339h22R41J16q24R67n51K67P85j419L70J15p75J353l82n08J086j023O30K24j356
2358h06O95m2k62J082p27K8P10j028Q73k43j013P73m58R3J120j196O75P5o56Q67
2378E60q71m79R06o09N91N00r74Q33k54m79Q85j187p7J032p30J149j78j110R64
2397D72p77J19N42j133N88L81l86J003m84o98J041j213M34K75r33R48P9k04P94
2416H48j056j7O40r59P25j23q09J370n01RN43j179K78L43o16Q54m48l12R30o06
$$ plain form
2436 -86 80 544 -660 58 -40 -576 499 -322 -46 534 -41 392 38 -912 70 -338 -197 569 -602 112
2456 112 547 -109 459 -156 -664 333 -332 129 363 -577 264 162 -298 504 -471 -536 318 -216 332 341 -373
2477 -373 598 6 -62 266 -865 -86 306 -366 555 4 -447 610 -196 -10 34 -664 298 144 -285 808
2497 808 -376 -50 609 -567 107 -90 -683 534 148 -15 490 -402 188 80 -491 296 -311 -572 553
2516 553 -78 133 336 -492 237 62 -410 93 -555 -34 768 -81 440 154 -661 526 -28 -423 409 -396
2536 -396 191 504 -154 369 -423 -441 510 -523 -8 408 -566 414 410 -271 171 -458 -483 165 -464 333 82
2557 82 -400 837 -15 -167 335 -544 -62 438 -459 420 83 54 506 -448 -91 116 -663 497 80 -500
2577 -500 542 -20 -53 468 -374 -13 27 -421 371 -89 -86 621 -335 434 441 -636 41 -110 -295 588 -204
$$ packed form
2436h6J66M64j204P18r8n36J075q21K76N80n75M33l54r50R82m08J41P66j171P14
2456A12M35o56N68o15n08R97o65M61K34r40Q41j02m60Q02r75o5Q54n34N48Rp14
2477c73R71n92o8L28j131P79L92o72R21n51m51J057q06J86M4o98R62j54m29J093
2497H08j184L26O59j176O74j97n93J217l86j63N05q92N90j08n71P87o07k61J125
2516E53o31K11K03q28P29j75m72N03o48N21Q02q49N21k86q15J187n54l95Q32q05
2536c96N87L13o58N23p92j8R51j033N15M16r74R80mo81M42o29k5O48o29P97k51
2557H2m82J237q52j52N02q79M82N00q97Q79l37k9M52r54L57K07p79J160m17n80
2577e00J042n62l3N21q42L61M0m48P92m60LP07r56P69Pj077O77j51j85Q83p92
$$ plain form
2598 -204 131 175 -378 173 -97 -534 303 -333 71 683 -394 55 286 -336 329 -132 -241 167 -560 112
2618 112 407 -503 421 -44 -353 354 -446 -264 173 -295 313 238 -237 366 -396 -220 248 -351 74 138 -505
2639 -505 509 88 -315 275 -455 -232 -109 -328 445 35 66 627 -317 -86 462 -583 9 115 -261 573
2659 573 -61 -110 399 -326 69 84 -405 396 -320 -181 574 -71 164 164 -395 127 -62 -147 445 -438 42 465
2681 465 -297 396 -163 -538 259 -244 -241 415 -241 100 221 -202 395 -271 -388 295 -371 184 426 -326 251
2702 251 6 -291 302 -370 -47 214 -366 350 68 -158 659 -365 130 339 -754 -25 52 -331 346 56
2722 56 -108 526 -303 100 -3 -607 356 -16 -117 627 -130 38 253 -352 43 -100 -253 260 -169 135
2742 135 540 -362 77 85 -646 281 -133 -236 504 -235 194 249 -312 220 -163 -282 344 -463 201 549 -372
$$ packed form
2598b04L35M4n53N51k70m37Q37o36M04O12j077M49K31o22O65m61j09M08p27O72
2618A12K95r10R24m65l09P07q00J82M37m68O08p5m75O03p62J76M68n99M25O4o43
2639e05J014m21m03N90p30K23J23k19P73m10L1N61r44K31N48j045N92J06l76Q34
2659E73o34m9N09p25L95J5m89Q01p16J39P55o45K35%n59N22j89q5N92q83M80M23
2681D65p62O93n59l75P97n03LO56o56L41J21m23N97o66j17O83o66N55K42p52N77
2702B51k45k97N93o72L23K61n80P16k82k26Q17j024M95K09j093P29P7l83O77k90
2722E6j64O34q29M03j03o04R63l72j01P44p57J68K15o05L95j43j53N13m29L04
2742A35M05r02M39Qp31R27m14j03P40p39M29N5n61N32l83j19O26q07O64L48r21
$$ plain form
2763 -372 332 17 -323 139 -287 -156 200 -295 219 229 -319 548 -110 -361 389 -299 40 351 -353 173
2783 173 53 -179 341 -330 -138 277 -361 184 252 -184 465 -117 -165 147 -473 171 82 -324 452 67 0
2804 0 436 -428 16 44 -519 32 -107 -256 389 -35 116 258 -351 422 -61 -323 419 -227 -234 378 -424 1
2826 1 178 -324 408 -93 -283 373 -187 198 427 -408 266 -206 -346 282 -169 -172 516 -273 269 44 -420
2847 -420 276 -230 -246 217 -199 358 126 -271 258 -52 -132 263 -321 -16 340 -235 285 47 -34 342 -341
2868 -341 -41 117 -302 245 4 -109 316 -203 166 276 -432 37 -76 -317 349 -32 -114 460 -391 -122
2888 -122 186 -423 264 36 -310 343 -98 77 356 -310 263 -177 -421 267 -174 62 238 -312 217 90
2908 90 -325 206 -169 -179 581 -48 124 370 -285 285 -21 -219 298 -363 -57 430 -300 380 119 -154 448
$$ packed form
2763c72P04l15l40M62m26J31L56m95N14J0n48Q67o58k51P50o88L39L11p04N26
2783A73j20k32N20o71J92M15o38N45O8m36O49n82m8L12o20O44q9m06P76l85o7
2804@M36q64M44K8n63N51j39j49O45m24J51J42o09P73m83k62P42o46pO12q02M25
2826AJ77n02P32n01j90O56n60L85K29q35O74m72j40O28m51lO88p89N42k25m64
2847d20O96n06j6M63m16N57k32l97N29l10q0L95n84L05L56n75N20k38q1L76o83
2868c41L00J58m19N47k41j13M25n19L69J10p08M69j13k41O66l81q2N74q51K69
2888a22L08o09O87k28l46O53m41J75K79o66N73m40k44O88m41K36J76n50N29j27
2908I0m15N31l75j0P60o29J72K46o55N70l06j98N17o61L06M87p30O80k61k73O02
$$ plain form
2929 448 -206 -102 230 -354 100 123 -249 442 -86 -217 258 -325 -55 187 -384 356 79 -84 606 -304
2949 -304 -28 165 -360 365 88 -271 324 -166 29 249 -426 85 29 -484 421 40 -165 353 -203 148
2969 148 21 -321 228 -299 -317 380 -166 9 387 -309 119 15 -287 373 -249 -76 318 -180 302 224 -446
2990 -446 178 -280 -253 221 -320 171 341 -269 266 63 -280 272 -378 144 364 -353 343 158 -127 345
3010 345 -263 -2 181 -372 210 243 -207 375 -119 -79 390 -153 -44 90 -397 88 45 -119 303 -317 220
3031 220 74 -457 249 20 -360 402 -135 -146 402 -291 132 18 -326 347 -93 -197 522 -164 176 131 -369
3052 -369 198 116 -304 186 -151 -134 273 -129 105 -85 -194 278 -263 -44 362 -322 68 84 -278 189 -103
3073 -103 -320 265 -234 204 58 -253 327 -58 -203 237 -372 -122 223 -371 157 151 -118 198 -362 2 39
$$ packed form
2929D48o54J04L32n84M54K3l72O91n28j31M75n83K70K42n71P40k77j63O90r10
2949c04K76J93n25P25k77l59N95m90J95K20o75N11n6n13R05l81k05N18n56L51
2969A48j27l42N49n27j8O97n46J75L78o96M28j04l02O60o22J73L94m98M82p8o70
2990d46O24m58K7M74n41M91J70o10N35k03l43N52o50N22K20p17O96j85k85M72
3010C45o08K61J83n53N82L3m50N82m94M0M69n43J09J34m87M85m3j64M22o20N37
3031B20j46n31P06k29l80P62n37j1N48o93M23j14l44O73m40j04P19o86L40m5n00
3052c69N67q2m20M90l37J7M07m02K34j90j09M72n41K19M06o84L90J6l62M67k92
3073a03k17N85m99M38j46l11N80l85j45M40o09K50L45n94N28ok69L16n60L64L7
$$ plain form
3094 39 -369 245 23 -296 470 185 15 382 -397 -53 215 -200 271 -257 -28 333 -263 93 100 -338 5
3115 5 13 -341 258 -26 -5 230 -430 69 24 -310 83 -261 -43 418 -174 167 341 -369 191 0 -319 310
3137 310 -166 -14 235 -216 348 -19 -187 264 -197 -111 194 -269 137 144 -222 348 -211 -186 266 -283 122
3158 122 308 -309 316 -30 -308 251 -298 -130 263 -159 243 180 -164 350 -287 43 139 -352 87 165 -234
3179 -234 410 85 -37 162 -198 18 -29 -471 68 -56 -199 501 -276 20 127 -335 97 197 -226 325
3199 325 -248 -19 289 -282 -5 34 -458 292 30 -134 182 -142 125 123 -199 215 -92 -297 343 -358 26
3220 26 200 -339 359 150 -201 134 -168 -146 210 -143 216 2 -219 346 -196 -110 328 -395 7 136 -299
3241 -299 186 -22 -212 52 -232 -186 49 -368 321 -41 -206 461 -311 -231 187 -387 9 118 -260 253 -123
$$ packed form
3094C9m08O14k22l19P66k85j70L67p79L44K68m15M71n28K29L61n96L56Pm38L43
3115EQl54N99k84K1K35o60M99m5l34L93l44K18M61n92L41J74p10N60j91l19O29
3137C10m76J52K49m51N64l67j68M51m61Q6L05m63M06Pl66N70n59K5M52n49M05
3158A22J86o17O25l46k78N59n49J68L93m22M02o3l44N14o37L30R6m91M39P8l99
3179b34O44l25j22J99l60K16m7m42N39j24j43P00p77K96J07m62M32J00m23N51
3199C25n73K29L08n71K77L9m92P50k62j64L16l24K67kl22M14l07k05O40p01L84
3220B6J74n39O98k09l51L35l02K2L56l53L59k14k21N65n42Q6M38p23M02J29m35
3241b99M85k08j90K64k84M6K35m17O89l62j65O67p72Q0M18n74L96J09l78N13l76
$$ plain form
3262 -123 -63 278 -364 179 163 -175 122 9 -54 335 -309 259 289 -206 129 -112 -328 271 -216 -158 307 -380
3284 -380 165 113 -173 169 -206 -164 219 -282 204 301 -121 295 -217 -135 392 -278 92 153 -311 280 158 -326
3306 -326 299 -246 -267 146 -281 249 171 -298 302 -182 -256 333 -249 15 70 -332 180 16 -224 352 -233
3327 -233 -18 196 -222 148 -102 -199 329 -241 71 303 -293 55 21 -114 146 -84 4 267 -348 -57 -39
3348 -39 -298 82 -125 -95 312 -222 106 176 -286 220 80 -278 108 -164 46 169 -144 258 31 -117 177
3369 177 -6 11 233 -147 218 174 -198 -43 18 -138 147 -239 105 429 -261 261 43 -401 172 -114 -128
3390 -128 228 -186 171 143 -234 285 -83 -191 381 -298 -181 209 -233 306 -95 -337 282 -134 -84 73 -190
3411 -190 156 -79 -204 253 -138 -49 168 -127 -45 -39 -292 278 -115 -143 326 -287 22 94 -392 115 -73 -126
$$ packed form
3262a23O0L41o42N43j6l38K97j13o3L89o44N68L0m95L35k41k16N99m87N8M65o87
3284c80N45n2k86L42l75M2L83n01M86R7m22M16n12Q2N27o70L70O1m64N91j22m84
3306c26O25n45k1M13m27N30p8m69O00m84p4N89n82K64N5m02N12j64k40N76n85
3327b33K15K14m18L70k50r7N28n70L12K32n96L48l4j35K60k30Q8K63o15K91J8
3348c9k59L80k07L0M07n34L28P0m62N06j40l58L86k72K10J23l13M02k27j48K94
3369A77j83J7K22l80L65m4l72J55O1j56K85l86L44L24o90N22k18m44N73k86j4
3390a28L56m14L57k8l77N19l68j08N72o79J17L90m42N39m01k42O19m16N0J57k63
3411a90L46k35j25M57l91Q9K17k95Q2Ok53N70l93k8M69o13L09P2m86N07j88n3
$$ plain form
3433 -126 287 -258 4 286 -47 43 63 -335 248 -44 -90 170 -183 207 33 -225 127 -102 -216 298 -215
3454 -215 51 166 -344 321 -64 31 298 -249 42 272 -144 207 -14 -213 189 -191 -156 180 -198 110 22
3475 22 -268 168 58 -35 82 -266 50 214 -213 170 16 -53 191 -163 22 -41 -311 233 61 -56 199
3496 199 -247 18 331 -160 295 73 -172 193 75 49 211 -201 148 176 -167 -7 -76 -80 232 -217 100 174
3518 174 -309 132 -19 -198 136 -364 61 79 -279 162 136 -175 246 -61 37 2 -315 -19 218 -153 -6
3539 -6 14 -258 179 -265 24 282 -102 295 112 -220 265 -131 -196 104 -134 97 94 -26 126 -2 -135 275
3561 275 -235 -88 2 -222 107 -60 60 264 -195 20 88 -262 266 -101 -33 264 -80 -56 224 -114 72
3582 72 106 -162 146 -167 59 198 -109 49 172 -187 173 -157 -201 265 -77 73 112 -149 187 41 -166
$$ packed form
3433a26M13n45K62K82l33R0K0l98N83k92m6K60l53L90j74k58L52k29j14N14n13
3454b15K66J15n10O65l85R5K67n47K91K30m16L51k21j99M02l80L5L36l78L08q8
3475B2k90M36j10r3J17l48L16J64m27L83j54o9K44l54J85o3k70N44j72j17K55
3496A99m46K65L13m91M55k22k45L65j18k6J62m12L49K8l43J60o9mL12m49L17P4
3518A74m83M41j51j79L34n00M25J8l58M41k6l11M21l07R8l5l17K96K37l71J47
3539fK0k72M37m44K89K58l84L97j83l32M85l96o5L00k38K31lj20J52j28j33M10
3561B75n10J47R0k24L29j67J20K04m59K15O8l50N28l67O8K97l44K4K80l38J86
3582G2L4k68L08l13K26J39l07J58J23l59L60l30m4M66l42J50L9k61L36j46k07
$$ plain form
3603 -166 149 -146 -64 147 -323 165 68 -196 193 -9 -151 81 -139 88 272 -285 238 -50 -298 214 -159
3624 -159 -68 248 -182 178 37 -115 401 -117 26 234 -237 -107 57 -153 175 -124 -66 314 -293 -43 37
3645 37 -193 195 -152 -81 236 -44 -11 94 -372 41 227 -279 131 -126 -6 177 -204 -5 -68 -146 247 -24
3667 -24 -36 254 -207 -39 122 -112 74 -168 -118 247 -162 5 244 -307 299 59 -125 309 -313 -67 170
3688 170 -198 300 125 -150 163 -113 107 237 -444 113 136 -289 361 1 -156 200 -235 -13 257 -268
3708 -268 210 78 -90 237 -149 -96 96 -178 124 99 -188 185 -233 -3 100 -130 116 128 -98 135 8
3729 8 10 150 -120 -24 62 -145 -26 -67 -252 98 2 84 41 -327 117 -37 -72 218 -52 11 267 -30 38 147
3753 147 -193 149 -81 -249 68 -334 -79 124 -122 127 29 -118 108 -104 43 225 -154 41 -59 -177
$$ packed form
3603a66L15k95Q2K11m70M88r7k64L89k02j42K32k20K27J84n57N23k88k48N12l73
3624a59R1L16m30L60j41j52N16n18J43K08m71J30J64k10L28k99N8L80o07K50Q0
3645C7k30L88l47P1L17k80L3J05m66M13J86n06M10k57J20J83l81J99o3p8L93k71
3667b4j2K90m61J68J61k34J86k42N0L65m09J67K39n51O06k40j84M34o22K46K37
3688A70l68M98j75k75L13k76K20J30o81N57K3m25O50l60j57L56m35K22K70n25
3708b68M78j32j68L27l86N3J92k74L02k5k87L73m18K30J03k30K46J2k26K33j27
3729HKJ40k70R6Q6k07J19m1j85L50r6Q2m3l68M44j54l5K90k70O3K56k97O8J09
3753A47l40L42k30j68L17m02K55K03k46K49r8j47K26k12J47J82l79J95j00j18
$$ plain form
3773 -177 250 -256 -69 -79 -76 163 89 -284 96 73 -2 237 -261 -57 72 -329 90 -22 -88 100 -13 12 145
3796 145 -205 79 40 -168 255 -35 -12 265 -194 87 64 -153 192 -291 0 38 -121 75 8 -138 165 17
3818 17 -170 281 -96 -93 208 -169 89 66 -143 62 -257 -84 205 -248 125 95 -257 176 -110 35 66 -115
3840 -115 91 123 -147 51 -9 -195 10 -208 82 156 -139 229 -71 -169 161 -64 -9 351 -138 57 -31 -134
3862 -134 -39 -149 -256 142 -150 -29 19 -207 115 125 -7 221 -88 36 114 -162 99 2 -186 269 -26 -5
3884 -5 274 -3 -37 -17 -188 -1 -129 -43 77 -192 191 176 15 146 -84 -27 270 -74 62 194 -137 169
3906 169 -31 -166 111 -119 -100 204 -178 7 91 -231 64 -2 -22 45 -119 68 222 -30 119 -20 -87 3
3928 3 41 56 104 -262 122 48 -64 58 -188 -147 137 -115 -46 64 -98 169 -45 -37 106 -185 32 146 -227
$$ packed form
3773a77M27n06J87j0LK39p4l73L80k3p5K39m98K04J29m01M19j12o6J88j13K5J33
3796A45l50K84l9k08M23k90K3K77m59K81k3k17L45m83K91L8j59J96o7j46L03j48
3818A7j87M51l77LL01l77K58k3k09K05l19J73K89m53L73l0l52M33k86J45L1j81
3840a15K06L2k70J98o0j86K05k18K90P4k95L68l00r8L30k25N5L60m89J95q8j03
3862a34R5j10j07L98k92J21M8k26L22J0j32K28l09J24P8k76K61r7j88M55k95K1
3884eK79k77l4K0j71J87j28Q6J20k69L83j5j61J31k30N7K97l44J36J32l31L06
3906A69k00j35K77k30J9L04l82J85Q4l22K95o6k0O7j64J87J54k52J49j39o7R0
3928CL8J5M8l66L84p4j12J22k46M1K84k52O9J10j62K67k14QJ43k91K17J14l73
$$ plain form
3951 -227 31 107 -107 145 -103 -106 255 -288 105 71 -190 115 -137 -41 244 -89 64 -59 -245 97 -58 -16
3973 -16 80 -64 101 257 -90 179 -67 -202 97 -56 18 154 -19 121 -182 -409 283 -168 -22 -40 -234
3994 -234 5 119 -109 80 -72 -40 155 2 -59 43 -191 49 89 -7 258 -207 -122 142 -38 27 -1 -160
4016 -160 226 -242 -21 88 -220 33 -47 -143 120 -23 -67 74 -186 -15 -2 -166 111 -62 -65 210 -134 -116
4038 -116 45 -268 10 4 -186 42 -208 59 131 -241 232 -3 -372 112 -205 -140 204 -246 111 95 8 219
4060 219 80 -174 113 -277 98 26 -263 124 38 -134 202 -160 -158 142 -129 59 -36 -150 286 -69 29 146
4082 146 -142 37 71 -152 197 -9 -119 165 5 -40 137 -234 75 -151 -158 237 -89 81 175 -178 -11 124
4104 124 -253 -25 -81 -86 163 -189 50 -110 -344 140 5 -356 108 -101 -82 205 -10 86 -91 1 109 -123
$$ packed form
3951b27K58P6k14K52k48lL61n43L93l4k61L05k52R6K85l33J53j23j86L42j55M2
3973a6R6j44J65J56l47K69k46j35K99j53P4J36j73J40l03k27O92m51J46j8j94
3994b34K39J14k28J89j52L2J95j53o1J02k34K40M0r6K65m65Q5K64j80O5k8j59
4016a60L86m68K21J09l08K53q0r6K63j43m4J41k60J71J3j64K77j73lK75l44J8
4038a16J61l13K78oj90K28k50K67P2l72M73k35l69M84l17O5L44m50L57j6q7K11
4060B19j39k54K87l90L75p2k89L87q6j72L36l62KL00k71J88r5j14M36l55R8J17
4082A46k88J79L4k23L49k06j10K84j60m5J77l71L09k26pL95l26J70R4l53J67J35
4104A24l77K28n6nK49l52K39j60k34M84j35l61M64k09J9K87k15R6j77R2J08k32
$$ plain form
4126 -123 -49 236 -74 -76 107 -224 177 -63 -148 302 -116 7 124 -23 200 13 -141 132 -66 -115 221 -177
4148 -177 -21 -9 -195 150 -83 -206 -64 -75 141 132 -109 196 -52 -166 338 -129 -43 98 14 273 15 73
4170 73 151 -85 59 115 -155 118 176 -66 262 50 -8 79 -10 131 -188 -277 6 -74 -47 358 -208 7 80 -154
4194 -154 237 -6 -158 -5 -133 108 73 -194 255 194 -147 305 -293 -105 235 -120 94 64 -81 41 -137
4215 -137 20 89 -280 48 214 -132 194 -35 -97 184 -84 29 -47 -243 51 -46 -13 172 -105 -143 167 -229
4237 -229 242 120 -234 52 62 -114 148 44 92 266 -146 226 68 -147 -30 -102 -45 77 -120 46 87 -139
4259 -139 105 -35 -184 280 -90 31 72 -133 264 -41 -175 173 -128 -130 299 -117 -88 90 -116 222 -213
4280 -213 117 44 -86 101 130 -145 -62 -128 116 76 -54 89 79 -248 73 62 -57 36 -138 67 197 -127 62
$$ packed form
4126a23P4K85l10kJ83l31M01k40q5M50m18J23J17j47K23j87j54K73j98m9L36l98
4148a77J56J2j86L45k33j23J42j1K16rk41L05k48j14N04m67Q6J41q4K59k58N8
4170G3P8k36J44N6k70K73N8k42L28k12n8Q7q9J41l19q9K83q0K7M05n66K15P3k34
4194a54L91k43j52J53j28K41l5k67M49o1l41M52n98J88L40l55K14l0j45J22j78
4215a37J57O9l69L28J66l46L26k29o2K81k68J13p6j96K94r7L3J85k77l8L10l96
4237b29M71j22l54K86J0j76K62j04M8J74m12L72j58k15J17p2N7J22j97J66M1k26
4259a39K44j40j49M64l70J21M1k05L97l05j34L48l01kM29m16K9J78k06L38m35
4280b13L30p3j30J87K9k75Q3o6K44m0j30J43j0l27L21j1j19R3j74K05J30l24J89
$$ plain form
4303 62 -41 -170 160 -157 117 23 -26 96 185 -193 194 -113 98 224 -133 130 -32 -140 256 82 -224
4324 -224 -61 -78 -7 183 -69 117 -101 -98 121 -28 -75 258 -213 184 23 -102 97 -233 34 342 -61 57
4346 57 52 -200 199 -75 -99 23 -274 269 178 -138 -42 30 -175 125 88 54 62 -175 234 83 -150 -37 -103 -93
4370 -93 10 -163 -34 -116 -88 256 -67 -115 105 -315 109 51 -131 -32 -72 -33 148 -162 -145 -137 -175 154 61 -134
4394 -134 163 -195 89 220 -74 151 141 -45 174 -122 -195 314 -169 14 140 -176 30 5 -98 166 -194
4415 -194 -62 -22 -106 195 54 -205 64 -99 -42 163 -210 19 8 -75 176 -6 -182 184 -14 174 41 -291
4437 -291 98 50 55 207 -186 -148 136 -109 268 21 -290 -81 -78 20 223 -181 115 -20 -75 247 107 -93 213
4460 213 -131 93 -23 -124 62 25 -155 -45 -35 -6 129 -93 152 104 -42 23 252 -25 224 -184 10 171
$$ packed form
4303F2j03j29L30l17K74r4m9J22Q9l78L87l07K11J26l57K63j62j08L96j74l06
4324b24J63j7P1J90k52J86k18LK19j49m7L33m71L97j61j25J99l30K67L08m03J18
4346E7nk52L99k74k4J22k97N43r1l16R6P2k05L00l7l4Qk37M09j51k33J13o6J0
4370i3J03j73J29q2K8L44l23m8K20m20M24n8j82R9m0L9J81l10J7Ql8L29r3j95
4394a34K97l58K84J31k94K25j0j86K19k96p3N09m83J83J26l16K06k5j03K64l60
4415a94J32M0q4L01j41k59K69j63N7K05l73K29j1q3K51j82j76L66j98J88j33l32
4437b91L89m8NJ52l93L8K84k45L77k47l11K09LR8K03m04K96j35n5L22j40k00L06
4460B13l44K24j16j01J86l7j80J10J0K9J35k22K45m8j46O5K29k77K49m08J94J61
$$ plain form
4482 171 -21 65 -7 11 146 -112 -16 -36 -217 211 -28 -12 2 -125 -14 206 -61 103 64 -144 178 110 31
4505 31 62 -207 -18 99 4 137 -19 -79 121 -10 173 72 -135 149 186 16 156 -206 3 138 -43 -30
4527 -30 -160 -147 170 -40 57 -14 -222 162 75 -1 22 47 81 270 -38 2 96 -251 320 -59 -144 89 -72 29
4551 29 113 -204 133 -60 -167 286 15 0 277 -210 105 -57 -175 8 -6 90 200 -59 -96 -24 -87 96 35
4574 35 -84 145 -175 8 341 -16 129 -54 -175 44 24 -80 9 -205 43 113 -245 148 6 -139 118
4595 118 -51 -68 84 -84 139 -75 53 175 -48 143 294 -164 231 -94 -80 220 29 -233 163 -83 54
4616 54 13 -274 137 -118 -169 151 -194 -71 137 -96 123 -6 -122 100 -54 46 150 -240 -1 185 -18
4637 -18 93 -38 19 151 -28 146 -72 -134 3 74 -42 27 -110 84 87 -90 252 -54 -199 123 -51 164
$$ packed form
4482A71j92Q6p2J8J35k58R6k0j81M28k39J6J4j27J11K20k67J64l9k08L22o8p9
4505C1L1k69J89J17r5J33j56o0K00j31J83j01k07K84L7j70J40l62K09J35j81J3
4527c0j30J3L17k10R7p1k08L84q7p6K3K5L4J89l08M0R4l47N71l79q5K33j61J01
4551B9Q4l17L37j93j07M53k71j5K77m87L15j62j18J83j4R6J10k59l7P2o3J83o1
4574C5j19K29l20J83L33l57J45j83j21K19k0j04Q9k14K48P0l58L93j42j45K57
4595A18j69j7J52j68K23k14J28J22k23J91J51m58L95l25J4L00j91k62L96k46J37
4616E4m1k87M11k55n1L20l45J23K08k33K19j29j16K22j54J00J04l90K39J86k03
4637a8J11j31N7J32j79J74k18o2J37P1j16O9j37J94Lj77L42l06j45L22j74K15
$$ plain form
4659 164 242 -255 1 2 138 203 -78 -68 145 -64 214 108 -60 3 -4 -112 237 -161 94 245 -106 223 5
4682 5 -94 138 35 133 106 -176 -2 -10 55 163 -64 -148 72 57 139 -10 -189 138 56 73 199 -23 -107 -39 -66
4707 -66 93 -151 -170 54 -75 15 -68 -155 -53 55 -215 122 -50 147 113 -37 83 -58 -302 32 -67 67
4729 67 59 -268 -64 -77 -195 13 -18 -107 170 -143 122 189 -122 51 92 21 79 105 10 165 -178 213 -144 -147 101
4754 101 -71 47 205 -229 101 132 -148 110 -14 -221 291 47 3 0 -347 222 37 94 130 -174 -173 174 -98
4777 -98 140 156 -127 107 -52 -82 44 -169 -172 72 -125 99 18 -62 95 -161 79 108 -36 78 86 -257 55
4800 55 -181 73 65 -92 41 -44 -167 226 74 -124 27 -133 -59 48 -127 179 1 -106 8 -130 70 170
4822 170 -138 57 -46 -114 97 -125 -44 204 75 105 56 -18 79 -51 -244 51 -67 -90 93 -83 29 -26 -116
$$ packed form
4659A64P8m97K56JJ36O5k81J0K13k09K78j06j68O3pj08L49l98K55J51l51L29k18
4682Er9K32j03R8k7k82J74qO5J08k27q4K20j5Q2j49j79L27q2J7J26k22q4O8k7
4707f6J59k44j9K24j29R0q3q7J02J08k70L37j72J97l4j50J20j41k44L34r9J34
4729F7ql27K04j3j18K08l1q9K77l13K65O7l11J73M1p1N8K6r5J55l43L91l57lK48
4754A01j72J18J58m34L30L1k80K58j24k07N12k44m4ll47N69j85N7L6l04JL47k72
4777i8K38J6k83K34j59l0J26k13lK44j97K24q1q0J57k56K40K9j44J14Ql43L12
4800E5k36K54qj57J33q5j23L93j52j98J51j60P4J07j75L06j78j07J14j38K00J00
4822A70l08J95j03o8K11k22Q1K48j29L0m9p4R7j30j93K95j18k3J83j76J12n5r0
$$ plain form
4845 -116 235 -80 14 75 -89 -107 -11 -160 106 -70 -24 -66 -27 27 -115 -64 -167 -74 -83 16 -190 137 66 -123 12
4870 12 -210 -116 2 -110 18 66 -178 -61 -73 -163 149 -30 170 81 -98 219 -26 -79 111 -23 57 54 -82
4893 -82 87 89 -192 -10 -140 -5 213 -38 -21 160 -97 187 -97 12 59 -149 -3 251 -52 21 206 -164
4915 -164 42 -38 1 73 -186 -73 -88 3 141 -20 -165 310 9 -113 12 -75 163 20 -137 170 38 -136
4937 -136 168 -177 101 102 -54 -92 -33 -29 18 86 -76 118 -130 -36 110 -84 145 -65 97 14 -150 126 -209
4960 -209 -72 97 -22 -194 32 -55 151 95 -75 161 -175 -162 13 -190 31 34 -116 106 -110 -93 158 -66
4982 -66 96 20 -157 62 59 -167 32 -277 -52 238 -19 -55 197 -42 -153 54 -82 213 -73 182 92 -14
5004 -14 -158 -5 -15 135 -38 85 24 -48 132 -42 -1 206 -83 -64 26 -137 103 2 -173 47 -9 42 62
$$ packed form
4845a16L51l15R4O1j64j8R6j49K66j76M6m2L9N4j42N1j03R3rR9k06L27p1j89J35
4870A2k22R4J18j12J28M8k44J17j2r0L12j79K00q9j79L17k45n3J90j34Q0lj36
4893h2J69Kk81J82j30J35K18k51J7J81k57K84k84J09M7k08J46K54l03P3J85l70
4915a64K06q0L9P2k59J13j5R1J38j61j45M75l01j22J25q7K38j43j57L07j32j74
4937a36L04l45K78Jj56l8N9MM7O8j62J94k48R4J46j94K29k10J62q3j64K76l35
4960b09J37J69j19j72K26q7K06n6j70K36l36J3J75k03K21Lj50K22k16J7K51k24
4982f6J62p6j77K19lk26J99l09K25K90k57l6K52k39j11K07j36K95k86K55r0j06
5004a4j44J53j0J50j73J23o1p2J80j74M1K07k89J9R0j63K40j01j75K20n6N1K0
$$ plain form
5027 62 66 -140 0 -145 101 -110 98 237 -102 77 112 -111 -108 -183 36 125 -59 172 11 39 124 225 -71
5050 -71 128 -118 -35 64 -68 -30 17 -74 -23 -30 -181 4 -93 138 86 -10 58 -74 -12 270 -57 70 -73 -37 22
5075 22 -7 -118 41 104 -7 243 -67 6 -6 -137 -70 132 -39 -3 -122 144 -56 -126 -1 -17 -169 146 -27
5098 -27 -92 65 4 152 -60 -73 63 -25 13 60 -182 5 -35 -49 88 -140 -121 118 -44 41 -78 42 60 18
5122 18 -55 238 -13 -33 -7 67 192 92 -110 186 -43 -47 57 -253 -74 -9 -105 119 -134 -1 84 -36 103
5145 103 113 -68 -21 -3 -234 73 -110 -24 45 -193 66 -47 -55 -33 -181 94 101 -128 -43 87 -173 175 76 86
5169 86 92 -62 -11 -6 -195 -98 71 -123 98 -63 -44 194 -206 -132 -124 -52 97 42 -14 230 -241 41 52 -132 78
5194 78 -66 -101 92 -162 9 83 -164 -40 -230 -188 137 -165 115 32 -99 32 196 -66 -86 -54 -78 29 23
$$ packed form
5027F2Mk06J40j45K46k11K08J39l39J79L5k23Lp5K19Q9j84K31j61K8Q5J01k96
5050g1J99k46Q3R9j32L8M7r1N1pj51J85r7K31n2r6O8j32O2K82l27J27j43L6N9
5075B2k9j11J59O3j11K50l10P3j2j31O7K02j71L6j19K66k00p0J25j6j52L15j73
5098b7o5J57o1J48k12j3J36q8L8M7k42J87m0j4J37k28J9K39j62Q5j19J20J8m2
5122A8p3K93k51k0K6P4J25j00k02K96k29mJ04l10J79O5r6K24k53J33Q5j20J39
5145A03J0j81M7J8k31L07j83Q6O9k38K59j13qK2j48K75Pk29Q5J30k60L48r9J0
5169H6Oj54N1Nj89R7J69j94K21j61J9K38m00P4QP2J49n5n6K44m71K82J1j84K10
5194G8j44l5J93k54J71P4k47J24j90M2L25l02K80q3j31J31J64k62k0L2k4J07o
$$ plain form
5217 23 174 10 -164 70 -139 -127 31 -216 -50 -17 29 -30 -55 -104 93 -128 -129 -18 -77 -49 29 -65 217 -119
5241 -119 -38 96 -128 145 -78 71 141 -103 25 18 -176 84 32 -207 20 -1 -72 21 -20 96 -227 -115 -75
5264 -75 72 -132 60 59 74 51 -95 2 -109 4 120 99 163 92 -13 -34 -15 -225 -27 65 -73 61 -150 -56
5288 -56 204 -71 62 -167 -83 117 -56 -88 -8 -106 86 -37 9 197 -5 56 258 -62 90 -52 -109 -51 -30
5311 -30 -181 25 -85 -106 -73 -222 56 3 -155 175 -37 -4 128 -44 74 -48 21 11 -37 -115 105 22 -30 246
5335 246 -69 83 -80 -102 -37 -129 -70 113 -70 44 -157 -83 -37 -121 -99 30 -178 170 126 -106 76 -168 -89
5358 -89 111 -270 -19 45 -97 72 -37 -276 -41 -13 34 20 -213 70 15 -132 201 -88 -28 61 -116 15 -156
5381 -156 -54 61 26 38 -13 36 -123 -81 -262 54 26 17 117 -48 4 -104 -115 79 76 -81 79 106 -39 70
$$ packed form
5217B3J51j64j74K34k09J2J58k47J66L3M6n9k5m9J97k21jJ11n9K8P8r4K82l36
5241a19Q1J34k24K73k23J49P0k44J28pj94K60n2k39K27k1p1R3m1J16l23J12M0
5264g5J47k04J92jJ5k3j46R7j11J13J16k1O4p1j05k1J9k10J98R2j38J34k11R4
5288e6K60k75J33k29Q4K00j73l2Q0r8J92j23M6J88k02O1K02l20J52j42n7N8K1
5311c0j51K06j10k1L3j49K78n3j58L30k12L3J32j72J18j22O9j0m8p8K20q3n2K76
5335B46l15J52j63k2O5r2N9J83j83J14k01P4M6q4K2J29k08L48m4k32J82k44P9
5358h9K00l81K51O4j42J69j09k39K35K8M7j4k33K83n5j47L33k89O0Q9j77J31j71
5381a56J02J15l5J2n1M9j59M2j81L16k8rJ00j65N2j08j1J94lj57J60K7j45J09
$$ plain form
5405 70 62 15 -115 -231 75 -62 -46 70 137 73 135 -134 29 84 -154 192 -127 69 86 -77 60 -129 17
5428 17 160 132 -3 210 -129 -151 -12 -103 88 95 -105 33 -60 -33 81 11 7 -21 6 -9 -140 15 44 24 -36 -59
5454 -59 -230 92 -105 -136 -166 32 127 -1 -171 79 -99 -127 93 137 136 42 -45 16 3 127 287 -131 80 137
5478 137 -102 55 -35 -159 86 -184 24 64 -55 85 92 -162 -85 -115 -38 108 -35 -178 176 -54 12 -13 -51
5501 -51 192 -218 -112 39 -74 189 27 78 166 57 -27 135 -125 140 54 168 25 -15 -49 -7 -190 96 48
5524 48 24 116 -13 -114 86 41 -103 -69 -162 166 25 -58 195 -34 -70 156 -19 -57 -7 -154 50 -161 104
5547 104 79 -95 -55 -67 68 185 46 -120 243 -24 -95 32 -7 103 -28 -5 138 -183 -3 -27 -108 46 -27
5570 -27 92 53 -103 78 -191 -80 104 144 -119 171 16 53 156 -21 21 114 30 21 -21 -84 69 -98 -9 105
$$ packed form
5405G0qm7j30j16L06j37J6J16O7o4O2k69J63N5k38L46l19J96J7j63J37j89J46
5428A7J43k8j35K13l39k2J39r1J91Pk00J38r3K7J14p0mk8K7j5j31J55K9k0o0k3
5454e9j71L22j97l1l0J98R5j28j70K50j78k8K20M4jr4q7O1j3J24J60m18K11N7
5478A37k39J57r0j24K45k70K08M0j19J40Pk54P7l0P7J46j43j43L54k30O6k5l8
5501e1K43m10J06J51j13K63j62N1Q8j09q4J62k60K65q6J14j43m0l4M2j83K86m8
5524D8k4R2j29j01K00m5j44L4r3L28j41q3K53k29l6K26j75l8N0j47K04k11K65
5547A04k5j74M0j2J35J17j39j66L63k67p1J27l9J10j31K3J43l21J80k4q1J54p3
5570b7J19l9j56J81k69J11J84M0k63K90j55L7J03j77M2R3q4rm2o3J53j67Q9J14
$$ plain form
5594 105 -50 46 -42 43 95 -32 -51 108 -122 -115 234 -90 113 -1 52 79 -136 100 146 -5 126 177 8 -71
5618 -71 -128 54 90 -24 -4 120 -114 72 51 74 15 -132 119 -122 -9 86 -87 -24 41 -46 -158 27 50 139
5642 139 67 -86 -63 -93 9 113 -161 -52 -135 -55 139 39 -120 156 13 -102 50 -1 27 35 -84 102 -146
5665 -146 78 129 -87 75 16 -87 -30 86 -24 49 15 146 100 -4 88 73 -17 33 -55 23 23 -156 21 -69 -37
5690 -37 174 -78 157 136 -140 149 -138 59 50 17 39 244 -4 148 66 25 83 63 -120 70 53 1 23 -72 -32
5715 -32 -134 -1 269 23 -133 100 -111 126 2 9 -55 -42 104 103 -53 75 86 -72 112 1 114 -26 -194
5738 -194 24 -37 -39 168 38 -59 140 -82 85 -107 1 17 -116 -32 109 -88 98 80 -7 161 -158 98 39
5761 39 -42 126 175 -78 -17 -16 -6 32 76 125 -25 -33 144 38 -96 53 -106 3 145 83 -89 -85 -63 -16 -108 54
$$ packed form
5594A05j55R6q8Q5N2j27j9J59k30PL49l24K03j14N3K7k15K36M6j51J31N1j69p9
5618g1n7J82L6j14K0J24k34J86k1K3n9j47K51k41J13R5j73O3O5q7j12J85K3Q9
5642A39p2j53K3l0J02J04k74J09q3Q0J94j00j59K76j43j15J52n1K8Qj19J86k48
5665a46K24N1k16J62n9j03N7J16j10P3l4J31m6j04R2j5r0N0q8P8%j79J77r0L2
5690c7K11k52K35k1k76K89k87J97rl3K2K05k48J52q2m1N8k0j83J90j7n2K2r5M0
5715c2j02J33K70k46j56K33k11K37j24Po4J3J46jj56J28J1j58J84j11J13j40j68
5738a94K18o1kK07j30r7J99k22J67j92J08J6j33Q4J41j97J86j8q7J68l19K56n9
5761C9q1J68M9k53O1JJ0L8M4M9j50qJ77j06j34J49j59J09J42o2j72MK2M7r2J62
$$ plain form
5787 54 7 22 -21 154 -45 98 62 -118 92 133 5 244 -165 -3 36 63 90 42 -60 12 100 -52 116 -120
5811 -120 165 -56 -171 -29 -147 -145 119 -11 -6 163 -235 -48 72 -37 -14 53 -116 -60 -114 -16 -141 -87 169
5834 169 -99 52 44 -61 48 95 -38 -20 75 -39 31 -48 -27 42 -32 129 29 23 69 -80 60 43 -88 20 -25
5859 -25 109 56 -5 189 45 -165 64 91 -277 -38 -96 -33 -48 -60 -43 99 -54 50 120 -5 240 -96 -155 -15
5883 -15 30 88 11 -80 198 78 192 -155 -83 112 70 51 13 -72 69 17 -145 5 26 -135 -22 12 -32 245 -37
5908 -37 38 -40 -207 109 -32 58 28 47 -19 180 -47 104 124 39 211 -130 101 14 -64 192 22 -101 53 -126
5932 -126 -73 -85 -186 43 144 99 43 -79 -133 -5 -86 70 -35 -178 -1 140 -30 86 -42 -66 161 -101
5954 -101 -35 100 -175 -10 -11 -62 120 -14 47 19 -75 159 -17 -66 88 84 -53 -128 -20 -15 102 -112 -23 -58 -52 160
$$ packed form
5787E4m7J5m3J75j99J43l6j80K10M1j28K39m09J62L9K7K7m8j02P2Q8j52J68k36
5811a20K85k21j15J42j18KK64j30NJ69l98J87J20j09K3O7j69N6n4R8j25N4K56
5834A69k68J51qj05J09M7j33J8R5j14P0p9K1O9p4J61j00oM6j49J40j7j31J08m5
5859b5J34n3o1J94j44k10K29K7l68K39n8O3j5j2J7J42j53J04P0j25K45l36n9J40
5883a5M5N8p7r1K78j20J14l47P2J95m2j9l8q5J41n2j62J50K1j61J13L4m4K77k82
5908c7P5p8j67L16j41R0l0J9o6J99k27J51K0q5J72l41K31q7p8K56j70j23J54j79
5932a26N3j2j01K29J01m5n6j22n4J28q1J56j05j43J77J41j70J16j28k4K27k62
5954a01O6J35k75J65jn1J82j34O1k8r4K34j76m9J54mj37p5J08NJ17k14Q9l5OK12
$$ plain form
5980 160 -121 39 -40 44 91 64 -139 4 30 116 21 -66 140 146 -159 127 -210 -99 -44 44 182 -112 -48 117
6004 117 -51 -65 135 110 112 94 -26 -115 -42 -1 234 -222 17 89 -7 252 -150 35 67 -48 -14 154 -160 109
6028 109 65 20 13 6 35 -99 -40 -42 87 -237 180 -122 1 189 -104 30 200 72 60 -188 -46 167 102 22
6052 22 -77 31 -83 -63 -12 -88 -120 -67 36 -97 -4 -12 -123 -5 26 -152 140 -146 -131 -74 -70 -99 -87 -247 71 -42
6078 -42 -80 87 -149 46 24 -84 102 -135 98 140 30 -211 46 26 33 145 -152 77 -70 -13 74 -141 15
6101 15 38 56 150 -76 28 -9 87 112 28 -136 -75 33 -16 96 -74 -44 -62 -161 72 -229 -90 184 -85 130
6125 130 91 -85 75 -53 17 -27 -3 97 112 94 -49 -74 117 49 38 104 28 -44 13 143 -117 -63 -15 -83 -123 4
6151 4 17 86 2 51 -64 -84 -107 -16 47 23 -37 5 -44 1 132 -196 34 -43 71 122 46 -24 -11 -46 -19 13 4 -67 82
$$ packed form
5980A60k81J60p9Q4M7k7k03J43K6Q6r5q7K06Ol05K86l37J11N5Q8J38k94O4J65
6004A17j68j4K00k5Kj8j20q9P3M1K35m56K39P2r6K59m02J85L2j15L4J68l14K69
6028A09m4m5ppK9j34N9kJ29l24M17l02J23J88k93J34J70j28j2k48J42K13o5q0
6052B2r9J08j14K0N1p6l2N3J03j33R3qj11J18L1j78K92k86J5N7Mk9J2j60L18j13
6078d2l8J67k36J95k2j08J86k37K33M2j10k41K57k0PJ12k97K29j47N7Q7k15J56
6101A5K3J8R4k26J04l7R6K5q4j64O1J08m9J12j70L0j8r9K33l01J39K74k69K15
6125A30l9j76J60j28P0m4K4J00J5j8j43k5J91o8j1O6p6p2N7J30k60N4M8o8m0J27
6151DJ3O9q4M9j15k0k3R1O3k4o0M2m9M5J31l28K30p7J14N1p6p0J3l5K7L2rp1J49
$$ plain form
6180 82 -13 -29 70 -105 -22 -101 -85 5 -47 15 -102 62 88 -145 -30 -101 -141 -29 -98 23 95 -158 -113 75 37 56
6206 56 66 -38 91 -19 108 -23 175 -41 106 -51 -6 23 -38 149 -51 7 6 58 93 77 -79 17 60 -58
6230 -58 -24 -109 62 -13 -29 167 -63 67 52 -38 -80 -10 -19 175 73 -2 192 70 80 14 -18 -7 147 -25 72 -130
6256 -130 123 10 18 114 -20 36 153 19 21 -9 -151 86 -24 9 244 41 -107 197 103 69 72 -108 -43 93
6280 93 -146 129 115 -65 122 18 -90 -129 -108 60 23 104 191 -221 13 24 -7 20 18 -131 -43 4 -117 114 -69
6305 -69 -94 15 101 -30 73 7 57 -43 160 80 21 18 -39 -140 36 0 65 50 -202 -40 43 8 -76 65 -7 39
6331 39 -14 172 -20 -69 -41 4 108 -84 -91 44 84 -93 25 17 -92 47 -4 40 31 -102 143 130 -137 105 -11
6356 -11 -111 58 -86 61 -46 -33 159 -6 44 51 -96 -156 64 -103 -120 2 18 17 -108 24 -98 -72 17 -220
$$ packed form
6180H2r5j6R9j75Q3p9J6R0n2O2j17J64K6k33J15p1m0J12o9J21P2k53M5J88l8J9
6206E6J0j04J29j10J27j31J98k16J47j57M5K9o1J87k00N8jN2L5j6j56R6M3j18
6230e8L4q5J71p5j6J96k30J30j5r0m2P0rJ94j02p5J94j22J0o6l2J1J54j72R7k02
6256a30K53j13QR6j34N6J17j34Kl0j42K37j10L3K35k03j48L04r4l4Lj80O5J36
6280I3k39K75j4j80J87j04j08l9K1J68l7Q1Q7m12K34J1l1K7kj49Q8M7j21K31j83
6305f9k5J09Q6j31J03o6N0j00K03q0n9ln7j01J76l6O5j5k52J62Q3l5q4J41p2M6
6331C9n3J86j92m9K8M5J04j92pJ35M0j77J18qj09J39n1M4rj33K45j3k67K42j16
6356a1j00J69j44J47j07J3J92j65N0Pj47o0K20j67j7J22J6jj25J32j22K6Q9k37
$$ plain form
6380 -220 -22 40 -54 -47 17 20 57 -132 -129 14 139 119 25 -39 -162 158 59 129 -80 39 -11 -32 75 21 35 101 -67
6407 -67 -84 -32 -3 146 172 -133 87 -17 -87 -59 -93 -127 90 -11 98 188 -41 170 -49 -21 76 -50 -35 63 -143
6432 -143 167 -53 95 99 30 82 8 -18 66 -72 -34 -14 74 53 88 55 219 51 14 89 -1 -68 102 -96 76 88
6458 88 11 -74 -132 -50 143 82 128 41 -141 -17 -44 17 146 50 -107 1 -9 -27 -65 -15 51 178 45 146 -79
6483 -79 99 64 42 69 -46 24 -171 -27 -9 38 -38 -43 -36 -61 111 -131 80 89 -10 50 -120 13 140 102 1 129
6509 129 6 187 299 169 -99 -112 -12 155 109 -35 228 -27 53 -66 28 116 -15 -113 39 -1 34 20 -162
6532 -162 110 -25 89 22 -31 74 19 -80 43 -25 -12 130 -81 42 237 -126 -107 175 -32 -98 -52 -106 -32 35
6556 35 -42 -96 63 78 65 77 69 -135 -36 144 -27 173 -10 -99 253 -47 8 68 24 223 69 -36 220 -66
$$ packed form
6380b20J98O2r4PO4LL7j89LJ43J25k0r4o4j23L20r9P0k09J19n0k1J07n4J4O6j68
6407f7j7N2K9J49K6l05K20j04p0K8l4l4K17j01J09R0k29K11k19K8R7j26J5R8k06
6432a43L10k20J48Mo9N2p4k6Q4j38L8K0Q8k1L5l3J64j68l7P5r0o7J70j98J72J2
6458H8p7q5n8Q2J93o1M6q7j82J24k7O1J29r6j57J08j0j8l8N0O6J27j33J01k25
6483g9J78l5k2K7j15P0j95J44J8M7p6nPk5J72k42K11Rr9O0j70J33J27l8j01J28
6509A29j23J81J12j30k68j3J00J67m6j44K63k55Q0j19R4Q8j31r8J52m0L5j4j82
6532a62K72j35J14o7n3J05n5r9J23o8J3J42k11J23J95l63J9K82k07o6M6n4P4O7
6556C5p7n4J59J5j3J2qk04R9J80j71K00j83q9L52l00N5O0m4J99j54j05K56k86
$$ plain form
6580 -66 114 93 -22 -9 -124 14 25 -143 -77 -96 -133 36 27 -4 19 -19 -67 139 -160 -89 50 -23 161 -71 -87
6605 -87 29 31 86 5 28 82 30 75 22 67 -150 116 -71 -109 210 -130 30 -53 -127 64 -74 128 -83 -51 94
6630 94 -149 -28 164 116 -1 166 -127 10 141 -110 82 -61 57 115 -48 87 26 -38 -60 -75 -22 87 99
6653 99 -69 20 27 -10 -77 -52 37 23 57 64 25 128 -20 111 53 3 109 155 -137 -24 136 -89 -138 -2 73 -19
6679 -19 -67 -112 111 10 121 1 31 116 74 42 -77 57 -57 128 22 91 -32 -28 61 -97 35 -116 -148 -39
6703 -39 40 -125 -15 -146 36 7 103 -14 99 -73 120 11 -58 135 80 144 185 -212 67 2 -131 231 -105
6726 -105 54 49 -96 -88 48 77 -31 137 11 94 55 -53 -32 -149 17 -95 57 90 -22 -150 28 -8 105
6749 105 -78 -27 -82 86 78 70 119 -16 -161 -14 -103 -107 -36 -79 38 83 -82 32 1 12 -17 -85 -25 81 21 -64 26
$$ packed form
6580f6J80k1j15J3j15J38J1j68O6j9l7J69rl1K3l8m8K06k99P1J39p3J84k32j6
6605h7J16KN5q1K3N4n2M5n3M5k17K66j87l8L19l40J60q3p4J91j38K02k11L2J45
6630I4k43J21J92m8j17J67k93J37J31k51J92j43J18N8j63J35o1o4k2j5N3J09J2
6653I9j68Q9Pl7o7K5Q9j4L4Pl9J03j48J31n8n0J06M6k92J13J60k25m9J36P5r2
6679a9m8m5K23j01J11j20L0Q5m2l2j19J34j14J85j06O9j23MQ9j58J32j51l2J09
6703c9P9j65J10j31J82k9R6j17J13j72J93j09o9J93n5O4M1l97K79o5j33L62l36
6726a05J59nj45QJ36K9j08J68j26Q3l9j08K1j17J66j12J52L3j12j28J78l6J13
6749A05j83N1n5J68qqM9j35j45J47q9mP1m3J17M5j65J14l1J1k9o8O0J06o0q5R0
$$ plain form
6776 26 -19 171 -41 -148 18 -6 80 29 95 -148 -45 -50 53 155 95 100 179 -48 89 35 166 9 138 203 139
6801 139 61 167 71 -77 33 90 -33 51 -1 7 136 -69 116 94 -38 33 -41 -12 16 15 45 16 10 63 -55 -77 228
6828 228 -92 135 -88 -14 95 -50 -112 66 -100 123 16 -43 67 -141 -89 158 55 109 98 -114 51 -8
6850 -8 72 72 -8 102 165 -88 31 35 31 236 -54 -154 49 59 130 -28 60 -29 -44 15 218 -32 126 -75 99 130
6876 130 -29 69 73 -171 164 -35 -90 80 -23 45 28 -81 52 158 70 -8 -49 114 39 -178 60 -96 -31 -86
6900 -86 38 52 121 -30 97 126 -49 6 0 15 -171 116 -68 2 -44 68 -156 -65 67 -121 -62 30 -59 41 -41
6925 -41 -126 -49 14 -151 71 25 -93 71 42 32 -48 -127 68 164 22 56 -37 7 -38 -42 65 39 37 -108 -92 49 32
6952 32 -30 189 2 46 -48 8 -63 92 -74 59 13 -69 27 56 -73 -143 41 -93 5 -7 -38 -154 52 125 -48
$$ packed form
6776B6m5J90k12j07J66k4Q6n1O6k43J03nJ03J02o0NP9k27J37n4J31j57J29O5o4
6801A39p8J06r6j48J10N7j23Q4n2QJ29k05J85k2j32P1p4K9K8jL0k9oN3j18k2L05
6828B28l20K27k23P4J09j45o2J78j66K23j07n9J10k08N2K47j03N4j1k12J65n9
6850hQ0%q0J10O3k53J19MmK05k90j00K03J0P1j58Q8q9j5N9K03k50J58k01J74L1
6876A30j59R8Mk44L35j99n5J70j03O8j7j09J33J06q8p8m1J63p5k17K38j56O5n5
6900h6J24J4O9j51J27K9j75N5oJ5j86K87j84P0m6J12k24R1J32j88N9R2q9J00q2
6925d1q5P7O3j65K22m6j18J64k9j0q0p9J95R6j42L4r3M4m5mJ07k6kj45J6J41j7
6952C2o2K19j87M4r4N6p1J55j66J33m6q2R6K9j29p0J84j34R8j2l1j16K06P3j73
$$ plain form
6977 -48 8 116 -65 11 125 -113 61 -90 -37 8 -13 -18 -8 22 53 17 -107 76 -130 -66 -92 -88 149 2 -95 -2
7003 -2 41 -2 7 -13 85 -76 28 92 51 -103 -56 -26 153 19 -77 -72 82 11 -112 -12 -88 177 5 -89 -3 22 28
7030 28 95 63 34 -31 23 -95 70 228 -114 15 57 -79 26 -51 107 -44 -41 4 214 -85 138 -43 79 -37
7054 -37 30 -88 -61 46 52 79 58 -14 -18 -196 129 109 -21 47 -14 53 20 101 137 46 -59 3 116 -40 -34 -67 69
7081 69 73 111 102 -35 25 -77 -144 -168 -12 -30 103 121 203 129 -24 45 -15 44 13 32 69 -42 19 96 54 -138 99
7108 99 -37 -88 41 33 204 95 -31 -151 146 124 -63 -133 -6 -20 -13 24 29 -87 -85 31 87 133 71 -79 220 37
7134 37 -20 -75 96 14 23 16 -49 -7 -31 -31 -95 115 -210 125 13 65 170 -32 -61 218 -56 -39 6 -84 -163 -119 -25
7161 -25 67 -44 48 -29 25 19 -8 4 113 -215 -69 125 83 -232 97 -85 59 165 -116 -28 -117 -45 154 1
$$ packed form
6977d8N6J08j81P6J14k38J74j51N3M5k1nJ0L0L1l6j24J83k06O4k6MK37j47r7R3
7003bM3m3Rk0R8j61J04O4m1j54M7L0J79j34r6NJ54p1j23J00p6K65j72r4Q6K5O
7030B8O7l2k9o5N4j18J65J58l42J29M2j36J05p7J58j51LM5K10k99K23j81J22j16
7054c7O7j18K7J07OK7k1p2mj78L25k0j30O8o1O7l3Q1L6r1j05O2J13j56Ol3J36
7081F9ML8rj37O0j02o7k4J56j8J33J8Q2p4j53O9o0N9l1J9L7j11O1P7m2j92K37
7108I9j36n1J29qJ71j09j26j20K97k2j87p0J27j4PL7Nj16KJ16N6M6o2j50K99j83
7134C7n7n5J71q2Rpo5M2k4%o4K10l25L35j12N2J05k02k9K79k74J7M5r0p9M4R4
7161b5R2j11R2p7N4ok7J2J09l28J46J94m2l15L29j82J44J06k81Q8q9P2J99j53
$$ plain form
7185 1 53 38 -22 49 -103 41 -120 39 6 116 131 75 5 -58 -60 -59 -50 2 -182 66 18 38 70 65 3 147 34 59
7213 59 57 8 10 145 -58 201 -16 -10 220 -65 135 -127 -109 172 -200 55 17 54 -1 -134 -170 105 51 93 61
7238 61 -40 180 -52 -194 216 11 41 -16 -9 188 -59 -107 123 -12 -89 102 -44 -83 58 -106 116 9 81
7261 81 64 8 86 -25 -215 -65 23 50 71 -111 -20 26 -107 -47 29 -122 17 -118 144 52 15 -139 -61 -91 80
7286 80 -90 -13 116 -100 16 53 -141 16 32 39 75 -50 12 -51 -130 -68 -34 -141 223 13 -67 46 53 -68 64
7311 64 -7 129 19 34 87 3 -91 15 -61 -57 147 -45 66 -150 -53 173 23 -165 -1 13 -128 -3 31 -3
7335 -3 -126 118 26 111 36 -35 49 -104 -1 -124 -5 -49 16 -77 7 -19 83 -27 -86 -95 38 -61 -15 -93 -78 -79 -124
7362 -124 -100 55 27 -70 51 100 111 -126 1 88 71 -61 68 62 97 103 28 -116 61 83 -22 -79 -120 -32 179 -29
$$ packed form
7185AN2j5o0P1j52J44j61J59l3J10J5n6p0o3kJRN2j84K48m8K0L2no2J44j13K5
7213E9km9KJ35k03K59k17OK30k85K00k62J8K81l72K55l8L7n5j33l6K75n4M2l2
7238F1j01K20k32j42M10k05L0n7PJ97k47m8K30j35p7J91j46l9J41j64K22j07P2
7261H1j7n6P8j11j90J50Q8K7K1j82R1M6j33O0P6j51J39j35K62r2l7j54P8l0J71
7286H0j70P7J29k16J16L7j94J57J6PL6j25O2o3p9O2L4j07L64k10q0J13Pj21J32
7311F4p1J36j10J5N3q4r4J06p6MK04j92J11k16R7K26j50j88J64J4j41J25L4l4
7335cj23K44r2Q5p5p1Q4j53J03j23J19m4O5r3Q4k6J02j10n9rJ33r9M6p8J5jm5
7362a24K4J55k8r7J21M9J1k37J27Q7j7j32J29oL5Op5j44J77K2j05n7m1Q8K11k08
$$ plain form
7388 -29 126 87 68 60 -151 16 -60 -54 79 118 -5 79 68 5 54 14 39 -35 -89 -97 -149 -36 -133 -65 114 -158 -135 136
7416 136 -29 26 162 -16 129 44 -45 57 -111 8 -26 -26 -33 50 -52 -134 -47 39 -7 25 -89 -5 112 70 -35
7441 -35 -29 48 96 45 105 -31 -34 33 -10 111 -87 -28 89 90 12 5 -106 49 -28 -72 173 -151 -7 161 -17 -2 21
7468 21 -69 -23 20 -38 71 32 -4 85 -189 104 -59 118 83 -71 133 4 71 -43 -2 57 108 30 45 10 62 45
7494 45 -20 47 8 -107 -39 -69 -8 79 17 92 155 -169 -40 -3 16 104 88 6 28 -29 -63 15 51 -59 98 45 -9 -108
7522 -108 -165 -40 50 -140 -126 44 71 -6 38 8 -144 -54 -63 -103 172 93 190 -80 41 -25 -48 78 186 197 1
7547 1 63 85 -52 -96 -57 30 3 75 50 59 29 -7 5 60 59 -172 143 -2 50 -9 70 -71 -19 4 115 -61 -149 -68
7575 -68 -12 0 156 -80 -99 64 138 63 24 -144 -36 -14 -43 124 -142 -16 62 20 -141 40 33 82 -125 -60 -47
$$ packed form
7388b9J55l9j9qk11J67p6OJ33L9j23Q4j1o3M9m0K5p4n4qn2J13r7O8J79k72K3K71
7416A36j65N5J36j78J45q5q9J02j68J19l4%pQ3j02q2Q7Q6m6L2j14Q4J17m2j05
7441c5OP7M8n1O0j36lO7m3J21j98N9J17Jp8pj11J55p7m4K45l24J44J68j78J5K3
7468B1r0M6M3n8J09l9l6Q9k74K93j63J77l5j54K04j29O7j14M1N9N1p8J5l5N2j7
7494D5o5O7l9j15O8l0O1Q7o2P5O3l24J29L7J9Q8j6q2K2n7l4P8L6j10J57n3n4r9
7522a08n7J25R0j90J4J70K7p7M4l0j52R0rm0K75p9R7k70J21o6k3J26J08J1j96
7547AO2K2j37m4L9Q7k7P2k5Rl0l6J2N5jk31L15j45N2n9P9j41N2K3J11j76q8Q1
7575f8N6J2J56k36j9J63P4p5l9j68J08K2k9J67k66J26P8m2j61J81pM9k07O5J3
$$ plain form
7600 -47 49 -72 -17 41 122 -62 -90 116 -29 19 -133 -65 -27 -64 9 -20 -64 32 2 17 -212 41 65 58 14 -26 -4
7627 -4 -75 -97 -33 -158 -90 -14 96 25 -2 27 -58 -75 -205 107 -14 -50 -10 -50 -35 54 98 29 -73 -48 -75 -98 100
7654 100 22 105 -31 96 12 85 -50 -44 5 69 -80 -84 45 -83 54 47 23 9 -144 37 -33 -36 63 73 -31 39 25
7681 25 -82 75 44 130 18 78 -77 180 66 18 26 11 77 -57 -52 87 -8 120 -110 -75 25 -7 106 -14 -240
7706 -240 -81 5 2 117 -41 -110 79 62 107 55 -3 34 44 -9 103 -68 95 -193 -214 68 4 -55 -12 13 50 46
7732 46 79 53 5 -17 80 33 149 93 101 62 170 -27 40 -128 -79 138 -33 -56 -141 -168 36 64 -121 -65 -4 -89 11
7759 11 28 -143 -66 21 -208 48 -44 -85 125 81 6 -47 43 -72 -30 -12 89 106 146 -59 57 -113 -16 -117 -80
7784 -80 -72 -126 -29 -189 -6 -212 51 9 118 3 67 31 16 -140 120 -25 -113 -111 -130 86 63 -49 -54 32 107 -47
$$ packed form
7600d7R6j21N5N8Q1j84k8K06j45M8j52O8L8l7P3k9m4R6l0J5k29K53K4pm4m0K2
7627dp1k2O4j25O8P6J10p1k7K9q5j7j30L12j21l6M0m0J5Q9M4o9j02K5k7k3J98
7654A00p8Q3j36J27q4P3j35OM9O4j49mJ29j28J37pk4j4j53J81p0lR9J0j04P0j4
7681B5j07J57l1Q6j12O0j55K57j14m8Qj5O6j34NJ39r5J28k30L5J00l2J13j20k26
7706b40J59Q6lJ15j58o9J89j7M5n2n8L7J0n3J12j71J63k88k1K82o4n9M3K5L7m
7732D6L3k6m8k2R7m7J16n6Ql9J08j97O7j68M9K17j71k3q5k7K04K8j85N6O1q5J00
7759A1J7j71P7Q7k29K56r2m1K10m4p5n3R0j15M2J8J01J7M0k05J16j70R7j01L7
7784h0Qn4R7j60J83k06K63m2J09j15O4l6j5j56K60j45q8Kj9K16k3j12nQ6P5j54
$$ plain form
7810 -47 -36 31 -4 -83 85 -32 -65 24 -20 -68 49 -158 -11 -88 -56 64 5 -55 7 -29 50 267 -103 23 -14 72
7836 72 27 -140 26 -62 88 -85 -162 -65 73 8 -179 -77 -28 137 48 2 -48 -37 -70 99 -13 -64 12 43 -77
7861 -77 -37 2 139 -4 -3 -29 -16 -56 64 178 -13 26 14 30 -32 59 -49 72 16 -6 -128 3 -42 57 36 -147
7887 -147 112 107 116 -6 32 18 -103 7 114 219 80 34 128 39 -19 -122 110 15 -74 -24 -106 57 -43 153 -17
7912 -17 -40 29 -44 -45 9 133 -35 -2 -49 -42 -61 47 -85 58 -107 -85 40 -71 39 118 135 74 -80 68 79 -70
7938 -70 73 105 14 52 52 -7 176 21 -11 -61 -6 4 -167 7 -22 -162 -59 -52 29 -69 57 -17 107 -22 9 18 2
7965 2 -32 12 32 161 66 43 13 -109 -37 -53 -15 39 70 119 102 -103 -99 77 -44 -1 -45 -47 -82 -2 21 -94 -32 -154
7993 -154 6 -69 44 -19 20 102 131 30 72 -44 75 -26 145 -77 -152 -2 155 44 -15 216 121 60 -141
$$ packed form
7810d7J1O7l5p9J68j17l3Q9m4m8J17k07J47p7L2J20n9o0O2l6P9K17l70J26l7Q6
7836G2m5j67J66q8J50j73p7R7J38o5j87J02M9J65q9m6n0J1l3J69j12n1P6L1j20
7861g7M0L9J37j43Jk6J3m0J20J14j91L9j2J6o2R1j08J21n6k2j22J31m5R9k1j83
7887a47K59nRj22L8j4j21J10J07J05j39m6R4q9n8j03K32r5q9N0q2J63j00J96j70
7912a7k3O9p3jN4J24j68L3m7Pj9J08j32J43j65K2J25j11J10P9J7o1j54J48J1j49
7938g0J43L2r1L8%n9J83j55l2n0N5J0j71J74k9j40J03PQ1r8J26p4J24j29L1Rj6
7965Bl4M4K0J29r5k3l0j22P2j6L8N4L1M9j7k05MJ76j21M3m4kl5Q0K3j15O2j22
7993a54J60p5J13o3L9Q2K9j01M2j16J19j01J71k22p5J50J57j11n9K31r5o1k01
$$ plain form
8016 -141 -5 52 44 30 57 -55 29 -8 -24 87 8 31 114 -184 6 177 62 -37 -26 -61 -80 -181 -23 -140 -53
8041 -53 -90 29 66 -64 -1 94 57 59 140 -85 -5 -17 -24 49 58 -171 -49 140 124 73 -97 -8 42 -41 41 -31 -72 -132
8069 -132 108 55 66 -28 -30 88 79 -13 -65 -58 31 -117 47 1 69 58 -2 -36 -25 189 -72 -16 31 -59 84 -45 -77
8096 -77 62 -75 47 3 147 -60 90 -24 -73 103 -114 -55 53 39 57 1 -29 -96 133 -51 151 122 -60
8119 -60 168 -87 -93 100 -73 -142 50 -49 -67 -109 13 -127 -42 6 -49 -6 9 -140 90 -51 -123 104 120 -108 31
8144 31 -35 -115 -85 41 -47 68 33 140 -78 -79 111 -17 -49 7 -73 90 -47 -31 -14 -47 -42 112 8 4 60 84 -122
8171 -122 14 -74 -13 -21 -119 66 -3 10 -52 -55 9 75 -43 -52 -32 -82 -26 202 -63 14
$$ packed form
8016a41J36N7qj4K7j12Q4l7j6J11p9K3Q3k98J90J71j15r9J1l5j9j01J58j17Q7
8041e3l7J19L7j30O3R5l7KQ1k25Q0j2pP3Rk29J22J89j6n1j70Q9N0q3Q2p2m1o0
8069a32K40n3J1r4kJ18rr2n2PQ9j48J64m6O8j1o0l4J1K14k61N6M7r0J43j29l2
8096g7J39j37J22m4J44k07J50j14m9J76k17N9J08j4J8n6l0o7K29j84K02k9j82
8119f0K28k55oJ93j73o9J92r9j8m2J22j40Q5M8n5M3J5j49K30j41p2K27J6k28J39
8144C1o6q0L0J26q8J15l5J07k18jJ90j28l2N6q0J63j37J6J7l3NJ54j04mN6K4k06
8171a22J36q8O1qr8J85o9J3o2lO4O6j18rK0n0N6K28k65P7
8191A4
$$ Imaginary data points
##PAGE= N=2
##DATA TABLE= (X++(I..I)), XYDATA
$$ plain form
0 0 0 0 0 0 0 0 0 0 0 0 0 0 0 0 0 -8 8 -8 8 -8 16 -16 16 -23 24 -28 32 -39 43 -48 56 -64 72 -82 92 -104 116
37 116 -130 145 -161 178 -197 219 -243 268 -296 326 -358 396 -435 480 -528 584 -644 714 -790
56 -790 882 -984 1107 -1250 1429 -1651 1937 -2319 2861 -3677 5054 -7780 15184 -75934 -211690
71 -211690 4654 37249 -40121 10947 79723 57903 41363 69972 12435 -113658 -72900 -12243
83 -12243 -41447 -4985 48195 65380 64815 -1974 -23134 -16270 -54034 -56750 -51330 -13680 76765
96 76765 68883 32667 39436 1674 -35051 -47935 -49783 -33969 -26614 34507 74289 24399 35980
109 35980 38461 -40048 -50111 -41658 -43766 867 20992 32272 46197 29321 16468 -20906 -45087
122 -45087 -35921 -54420 -17686 42208 33114 46180 44385 1624 -4940 -29858 -48220 -33947 -36409
$$ packed form
0@%%%%%%%%%%%%%%%qJ6j6J6j6K4l2L2l9M7n2O0p1Q2r1J04j20J36j54J74j96K20
37A16k46K75l06L39l75M16m62N11n64O22o84P54q31R15j008J112j228J358j504
56g90J672j866K091k357K679l080L588m256N180o538Q731j2834K2964r1118j35756
71b11690K16344L2595p7370N1068O8776k1820j6540K8609n7537j26093M0758O0657
83a2243k9204L6462N3180J7185n65o6789k1160O864l7764k716N420L7650R0445
96G6765p882l6216O769l7762l6725j2884j848J5814P355O1121L9782m9890J1581
109C5980K481p8509j0063Q453k108M4633K0125J1280J3925j6876j2853l7374k4181
122d5087R166j8499L6734N9894r094J3066j795m2761o564k4918j8362J4273k462
$$ plain form
135 -36409 10203 56128 37928 36599 24729 -9391 -31089 -49701 -31368 -22887 -20249 41003 48111
148 48111 19806 39025 4502 -40985 -35349 -40829 -23673 4383 16515 40079 41499 38123 18205
161 18205 -33415 -32205 -29040 -44217 -1072 18031 11559 38205 33100 11901 -16004 -48628 -26896
174 -26896 -15301 -19723 15574 29995 34451 40027 14428 -3914 -34387 -50005 -15418 -12964 -4670
187 -4670 30544 24948 31056 29407 -12859 -22828 -31644 -40872 -12284 6940 24791 30357 21302 33676
201 33676 4383 -33879 -23774 -34153 -30582 3143 14058 35594 35644 10712 13822 -8350 -34631
214 -34631 -27255 -26750 -8585 13868 23484 39506 17787 -3012 2226 -25746 -35191 -22731 -19055
227 -19055 17843 32305 18087 28704 14226 -9335 -16562 -32506 -26520 -15522 1229 34407
$$ packed form
135c6409M6612M5925j8200j329j1870l4120k1698j8612J8333Q481K638O1252P108
148D8111k8305J9219l4523m5487N636n480J7156K8056J2132K3564J420l376j9918
161A8205n1620J210L165j5177M3145J9103o472K6646n105k1199k7905l2624K1732
174b6896J1595m422L5297J4421M456N576k5599j8342l0473j5618L4587K454Q294
187d670L5214n596O108j649m2266r969q816r228K8588J9224J7851N566r055J2374
201C3676k9293l8262J0105j0379L571L3725J0915K1536N0k4932L110k2172k6281
214c4631P376N05J8165K2453R616J6022k1719k0799N238k7972r445J2460L676
227a9055L6898J4462j4218J0617j4478k3561p227j5944N986J0998J6751L3178
$$ plain form
239 34407 24301 15766 24201 -6505 -21067 -22404 -33638 -11715 1180 10721 37408 26791 12603
252 12603 2756 -21860 -20531 -24087 -26059 1825 10588 23557 36821 14154 4577 -11424 -31151
265 -31151 -16383 -19835 -15015 17153 19619 24774 27219 3073 -7684 -23513 -29404 -13153 -12968 5409
279 5409 24372 17800 28426 15964 -13981 -14848 -27176 -25519 -2681 -1292 14475 26857 19795
292 19795 19814 -3170 -21579 -19169 -27687 -11486 6037 5902 25930 25059 11178 9553 -17050 -26384
306 -26384 -17593 -21872 -478 14822 14032 25896 15830 3964 -3525 -26328 -21861 -14339 -11038 15583
320 15583 18963 16492 23489 2843 -5836 -11757 -30998 -18253 -5538 2350 22024 18903 17347 13659
334 13659 -8749 -10612 -18658 -27375 -6565 1629 13316 27449 12798 10647 3702 -18177 -16367
$$ packed form
239C4407j0106q535Q435l0706j4562j337j1234K1923J2895R541K6687j0617j4188
252A2603r847k4616J329l556j972K7884Q763J2969J3264k2667r577j6001j9727
265c1151J4768l452M820L2168K466N155K445k4146j0757j5829n891J6251J85J8377
279E409J8963o572J0626j2462k9945q67j2328J657K2838J389J5767J2382p062
292A9795J9k2984j8409K410q518J6201J7523j35K0028q71j3881j625k6603r334
306b6384Q791m279K1394J5300p90J1864j0066j1866p489k2803M467P522L301K6621
320A5583L380k471O997k0646q679n921j9241J2745J2715P888J9674l121j556l688
334A3659k2408j863q046q717K0810Q194J1687J4133j4651k151o945k1879J810
$$ plain form
347 -16367 -20219 -18105 3480 9611 22076 24694 6342 5096 -7682 -22027 -15113 -19001 -6204
360 -6204 13996 12445 22626 17602 -2600 -3041 -15463 -20920 -10324 -10624 6914 19508 14829 20233
374 20233 5539 -10136 -10208 -22236 -15429 -3232 -4059 16088 21870 12895 13069 -5536 -14922 -13470
388 -13470 -20170 -5870 3538 5577 22187 16732 8506 4010 -17332 -17840 -12932 -15300 2540 9462
402 9462 13284 23120 9699 2573 -5275 -22925 -15231 -10851 -7939 10975 12188 15678 18444 1110
416 1110 -3695 -12160 -21283 -8274 -5719 2950 17804 10946 13708 10238 -9023 -10624 -18115 -18430 -2038
431 -2038 738 11710 18666 8593 11737 1306 -13581 -10867 -17625 -9258 7631 6786 15914 15206
445 15206 3202 2835 -10538 -17068 -11790 -15759 -194 13416 11317 18799 10117 -1993 -2162 -15480
$$ packed form
347a6367l852K114K1585O131J2465K618j8352j246j2778j4345O914l888J2797
360f204K0200j551J0181n024k0202m41j2422n457J0596l00J7538J2594m679N404
374B0233j4694j5675p2j2028O807J2197q27K0147N782q975J74j8605r386J452
388a3470o700J4300R408K039J6610n455q226m496k1342n08M908k368J7840O922
402I462L822R836j3421p126p848j7650P694M380K912J8914J213L490K766j7334
416A110m805q465r123J3009K555Q669J4854o858K762l470j9261j601p491l15J6392
431b038K776J0972O956j0073L144j0431j4887K714o758Q367J6889q45R128p08
445A5206j2004l67j3373o530N278l969J5565J3610k099P482q682j2110j69j3318
$$ plain form
459 -15480 -15765 -8547 -8067 8409 13928 12453 16252 606 -6654 -6784 -19133 -11033 -1782 253 14808
474 14808 13581 9941 9526 -6313 -10547 -13021 -17149 -2466 1297 6424 19190 9174 5403 3160
488 3160 -12593 -10602 -10627 -11094 3988 7148 13101 16446 3028 778 -6985 -16527 -7606 -9935 -4871
503 -4871 11408 10035 13736 11663 -2813 -4608 -13314 -16192 -4816 -5109 4703 14606 9619 13692 5912
518 5912 -7242 -7016 -15083 -11507 513 415 10294 12726 6864 8816 -4932 -13159 -8957 -15115 -5587
533 -5587 5353 4974 14352 12154 4937 3109 -9553 -10636 -8600 -10785 3988 7671 5965 15083 4913
548 4913 -2695 -2719 -14212 -11702 -6108 -3369 9971 10926 9892 10020 -1862 -1927 -7419 -17640 -5732
563 -5732 -2119 992 15037 10269 6248 4869 -5756 -6622 -11013 -11747 -309 634 8769 15609 5256
$$ packed form
459a5480k85P218M80J6476N519j475L799j5646p260j30j2349Q100R251K035J4555
474A4808j227l640m15j5839m234k474m128J4683L763N127J2766j0016l771k243
488C160j5753J991k5m67J5082L160N953L345j3418k250p763r542Q921k329N064
503d871J6279j373L701k073j4476j795q706k878J1376k93R812R903m987M073p780
518E912j3154K26q067L576J2020r8R879K432n862J952j3748q227M202o158R528
533e587J0940l79R378k198p217j828j2662j083K036k185J4773L683j706R118j0170
548D913p608k4j1493K510N594K739J3340R55j034J28j1882o5n492j0221J1908
563e732L613L111J4045m768m021j379j0625q66m391p34J1438R43Q135O840j0353
$$ plain form
578 5256 5687 -694 -13320 -8468 -9524 -7071 3911 4319 10919 12159 2870 2573 -7260 -13608 -5947
593 -5947 -7423 478 9847 6165 10677 6968 -1672 -2019 -11706 -11419 -4359 -4781 7978 11647 4725 9187
609 9187 1198 -7199 -5336 -11331 -7209 -1385 993 12228 10272 6512 6156 -7676 -8117 -5050 -11343
624 -11343 -1894 3209 2985 12685 8548 2359 -1154 -10737 -8263 -7618 -6462 5360 4748 7247 13201
639 13201 2079 190 -2746 -13241 -7811 -4554 -1477 8533 6694 7752 6633 -2502 -1737 -8194
653 -8194 -12354 -2629 -2357 3748 12345 5906 6198 2487 -6612 -4516 -9683 -8726 786 756 8348 10883
669 10883 3272 4712 -3017 -9379 -5267 -8913 -3017 4827 3553 10389 7453 520 1913 -8285 -10162
684 -10162 -4090 -6374 1847 7220 5433 9769 3490 -1837 -2536 -10602 -6776 -2733 -3019 7622 7375
$$ packed form
578E256M31o381j2626M852j056K453J0982M08O600J240r289k97r833o348P661
593e947j476P901R369l682M512l709q640l47r687K87P060m22J2759L669o922M462
609I187p989q397J863n995M122N824K378J1235j956l760l56j3832m41L067o293
624a1343R449N103k24R700m137o189l513r583K474O45J156J1822o12K499N954
639A3201j1122j889k936j0495N430L257L077J0010j839J058j119r135P65o457
653h194m160R725K72O105Q597o439K92l711r099K096n167R57R512l0P592K535
669A0883p611J440p729o362M112l646N896P844j274O836k936o933J393j0198j877
684a0162O072k284Q221N373j787M336o279n327o99q066L826M043k86J0641k47
$$ plain form
699 7375 5095 8475 -1915 -5689 -4352 -10419 -4381 51 2175 9697 6316 5118 3699 -6355 -5179
714 -5179 -6669 -8987 1463 2156 4519 11075 3476 1718 -270 -8759 -5902 -6172 -4113 4460 3716 8094
730 8094 8826 -488 296 -4468 -9948 -3601 -4640 -158 7445 4266 7658 5113 -3584 -2316 -7623 -7902
746 -7902 -1302 -2405 4798 8744 3887 6279 216 -5641 -3717 -9052 -4682 1718 282 7964 7621
761 7621 2097 3671 -3924 -6913 -4185 -7588 -546 3472 3364 9200 4123 471 775 -8142 -6255 -3758
777 -3758 -5396 3772 5423 4374 8251 1397 -1468 -2778 -8763 -4249 -2680 -1338 6962 4791 4977
792 4977 5851 -3242 -2912 -4637 -8804 -1248 -353 2015 8299 3779 4002 1721 -5989 -3865 -5975 -5807
808 -5807 2194 1351 5403 8023 1762 2859 -2039 -7776 -3257 -5747 -2357 4454 2538 6450 5670 -653
$$ packed form
699G375k280L380j0390l774J337o067O038M432K124P522l381j198j419j0054J176
714e179j490k318J0450O93K363O556p599j758j988q489K857k70K059Q573p44M378
730H094P32r314P84m764n480O347j039M482P603l179L392k545q697J268n307k79
746g902O600j103P203L946m857K392o063n857J924n335M370O400j436P682l43
761G621n524J574p595k989K728l403P042M018j08N836n077l652L04q917J887K497
777c758j638R168J651j049L877o854k865j310n985M514J569J342Q300k171J86
792D977Q74r093L30j725m167P556Q95K368O284m520K23k281p710K124k110J68
808e807Q001q43M052K620o261J097m898n737M519k490L390O811j916L912p80o323
$$ plain form
824 -653 119 -5494 -7107 -2265 -4056 2195 6069 3420 7345 2432 -3162 -1215 -7080 -5634 -914 -1999
840 -1999 5100 5966 2959 5291 -1598 -4188 -2970 -7604 -1908 1201 742 7626 4480 1896 2683 -4825
856 -4825 -4890 -3815 -5881 1421 2244 3082 7826 2266 855 -249 -6891 -3911 -3616 -3066 4439 2738 4179
873 4179 6523 -1137 -1100 -2838 -7248 -2320 -2417 278 6302 3295 4764 3563 -3389 -1775 -5179 -6415
889 -6415 5 -979 2966 6909 1973 3706 362 -4826 -2365 -5889 -3261 2574 676 5318 5627 819
905 819 1980 -3351 -5592 -2541 -5332 -130 3895 1715 6682 3405 -601 411 -5648 -4680 -1385 -3282
921 -3282 2870 4283 2759 5523 -214 -1990 -1503 -6900 -2662 -398 -1195 5496 4114 2917 4068 -2673
937 -2673 -2856 -3089 -6222 -284 342 1318 6535 2370 2119 1400 -5246 -2795 -3223 -4403 2084 1850 3608
$$ packed form
824f53P72n613j613M842j791O251L874k649L925m913n594J947n865J446M720j085
840a999P099Q66l007K332o889k590J218m634N696L109m59O884l146k584P87p508
856d825o5J075k066P302Q23Q38M744n560j411j104o642K980K95N50P505j701J441
873D179K344p660L7j738m410M928r7K695O024l007J469j201o952J614l404j236
889f415O420r84L945L943m936J733l344n188K461l524K628N835j898M642L09m808
905H19J161n331k241L051k791N202M025k180M967l277m006J012o059R68L295j897
921c282O152J413j524K764n737j776M87n397M238K264p97O691j382j197J151o741
937b673j83k33l133N938O26R76N217m165k51p19o646K451m28j180O487k34J758
$$ plain form
954 3608 5881 595 950 -1577 -6068 -1835 -3466 -2215 4288 2179 4563 4372 -1667 -281 -3216 -5453
970 -5453 -1434 -2456 1825 4943 1522 4914 1818 -3583 -688 -4737 -4373 751 -367 3563 4357 1638
986 1638 3793 -1194 -4156 -2427 -5601 -950 1907 -64 5282 3505 348 2133 -3531 -3977 -2380
1001 -2380 -3733 1815 2198 1606 6016 876 -991 14 -5249 -3033 -2047 -2314 3564 2921 2679 4225
1017 4225 -1059 -853 -1691 -5723 -834 -1051 -547 5430 2341 2263 2453 -3144 -1930 -3310 -4023 836 -590
1034 -590 2194 5515 1135 2593 104 -5098 -1618 -3393 -2723 2408 852 3046 4204 318 1144 -2727
1050 -2727 -4228 -876 -4033 71 4081 832 4061 2586 -1505 336 -3774 -4083 -1051 -2169 2499
1065 2499 3650 1553 4196 -682 -2298 -298 -4948 -2650 642 -753 3733 3263 1750 2468 -2726
$$ packed form
954C608K273n286L55k527m491M233j631J251O503k109K384j91o039J386k935k237
970e453M019j022M281L118l421L392l096n401K895m049L64N124j118L930P94k719
986A638K155m987k962J729l174M651K857j971N346j777l157J785n664m46J597
1001b380j353N548L83n92M410n140j867J005n263K216R86k67N878o43k42J546
1017D225n284K06q38m032M889k17N04N977l089p8J90n597J214j380p13M859j426
1034e90K784L321m380J458k489n202L480j775O70N131j556K194J158l886Q26l871
1050b727j501L352l157M104M010l249L229j475m091J841m110l09L032j118M668
1065B499J151k097K643m878j616K000m650K298L292j395M486m70j513P18n194
$$ plain form
1080 -2726 -2486 -1373 -4503 135 1162 326 4932 2212 802 1043 -4076 -2772 -2031 -2522 1870 955
1096 955 2213 4860 -442 410 -325 -5555 -1851 -1379 -786 3507 1550 2665 2747 -1358 148 -2647 -4949
1113 -4949 -95 -1338 1019 5009 827 2199 1676 -2714 -1374 -3321 -2908 456 -717 3420 3770 -79
1129 -79 2445 -1182 -3880 -613 -3406 -1525 1952 274 3809 3059 -418 640 -3080 -2763 -914 -3287
1145 -3287 1483 2656 546 4326 1274 -1205 -221 -3782 -2290 -794 -1250 3145 2126 1386 3734 -1183
1161 -1183 -1348 -1014 -4788 -824 259 -8 4063 1784 1389 1666 -2855 -1027 -1914 -3885 1315 446 1000
1178 1000 4640 921 575 -228 -3387 -1038 -2285 -1869 2242 566 2737 3695 -983 720 -1576 -4342
1194 -4342 -212 -1512 -629 2953 1006 2751 1615 -1433 -70 -3307 -3055 510 -1478 1920 3158
$$ packed form
1080b726K40J113l130M638J027q36M606k720j410K41n119J304P41m91M392r15
1096I55J258K647n302Q52p35n230L704M72N93M293j957J115Q2m105J506k795k302
1113d949M854j243K357L990m182J372n23m390J340j947M13L364j173M137L50l849
1129g9K524l627k698L267k793J881L477j678L535p50l477J058l720L17J849k373
1145c287M770J173k110L780l052k479R84l561J492J496m56M395j019p40K348m917
1161a183j65L34l774L964J083k67M071k279l95K77m521J828q87j971N200q69N54
1178A000L640l719l46q03l159K349j247M16M111j676K171R58m678J703k296k766
1194d342M130j300Q83L582j947J745j136l048J363l237K52L565j988L398J238
$$ plain form
1209 3158 288 2933 331 -2585 -721 -3347 -1807 928 -232 3022 2073 428 2069 -1963 -2444
1224 -2444 -592 -3610 182 1457 572 3795 1127 -271 907 -3111 -1995 -1057 -2390 1797 1387 1086
1240 1086 3702 -416 -523 -383 -3661 -1029 -875 -1043 3135 1102 1568 2729 -1834 -948 -1450 -3408 141
1257 141 -463 449 3558 700 1517 934 -2698 -632 -2424 -2455 1624 -367 1914 3565 -194 1257 -533
1274 -533 -2879 -728 -2382 -740 2021 457 2944 2068 -891 862 -2208 -2770 -155 -1989 717 2553
1290 2553 503 2952 755 -1449 -41 -3080 -1584 169 -1306 2325 2154 688 2446 -956 -1521
1305 -1521 -620 -3288 -293 601 -312 3173 1371 437 1498 -2099 -1551 -1224 -2668 1140 908 650 3166
1322 3166 270 582 181 -3403 -875 -1123 -1590 2159 810 1390 2795 -598 92 -1124 -3100 -180
$$ packed form
1209C158k870K645k602k916J864k626J540K735j160L254r49j645J641m032m81
1224b444J852l018L792J275q85L223k668j398J178m018J116R38j333M187m10l01
1240A086K616m118j07J40l278K632J54j68M178k033M66J161m563Q86n02j958L549
1257A41o04R12L109k858Q17n83l632K066j792l1M079j991K281J651l759J451j790
1274e33k346K151j654J642K761j564K487q76k959J753l070n62K615j834K706J836
1290B553k050K449k197k204J408l039J496J753j475L631j71j466J758l402n65
1305a521R01k668K995Q94r13L485j802r34J061l597N48L27j444L808k32k58K516
1322C166k896L12m01l584K528k48m67L749j349N80J405l393O90j216j976K920
$$ plain form
1338 -180 -1151 -105 2743 432 2102 1393 -1993 -118 -1824 -2468 646 -705 1256 2764 331 1872
1354 1872 -108 -2406 -412 -2502 -1215 1216 -186 2429 1786 -269 1531 -1456 -2159 -156 -2393
1369 -2393 38 1597 163 2774 971 -681 612 -2462 -1493 -394 -1777 1708 1541 541 2719
1384 2719 -97 -981 -321 -2813 -682 -95 -886 2664 1270 873 1706 -1553 -830 -887 -2744 409 83
1401 83 275 2924 464 821 834 -2318 -716 -1273 -1904 1311 173 1146 2687 -257 561 -425 -2428 -335
1419 -335 -1640 -624 2166 300 1830 1674 -1139 364 -1560 -2383 119 -1039 558 2064 267 1970
1435 1970 557 -1625 174 -2113 -1528 565 -729 1487 1877 200 1704 -785 -1568 -475 -2329 -139
1451 -139 831 -310 2371 1135 -49 1107 -1663 -1353 -493 -2002 866 920 436 2606 -33 -260 318
$$ packed form
1338a80r71J046K848k311J670p09l386J875j706o44L114j351J961J508k433J541
1354A872j980k298J994k090J287K431j402K615o43k055J800k987p03K003k237
1369b393K431J559j434K611j803j652J293l074R69J099j383L485j67j000K178
1384B719k816q84O60k492K131N87p91L550j394l97Q33l259P23n7j857L153l26
1401H3J92K649k460L57J3l152J602n57o31L215j138R73J541k944Q18r86k003K093
1419c35j305J016K790j866J530j56k813J503j924q23K502j158J597J506j797J703
1435A970j413k182J799k287N85K093j294K216L90j677J504k489p83J093j854K190
1451a39R70j141K681j236j184J156k770L10Q60j509K868N4m84K170k639k27N78
$$ plain form
1468 318 -2703 -838 -410 -1384 1892 890 862 1748 -837 -217 -571 -2367 -12 -626 -313 2438 199
1485 199 952 1320 -1747 -566 -1121 -1695 531 -179 973 2119 97 1402 -124 -2403 -49 -1505
1501 -1505 -1138 1439 -275 1500 1719 -422 718 -1034 -1792 -186 -1660 280 1636 -191 1982 827
1517 827 -899 418 -1545 -1499 -163 -897 1215 1530 284 1884 -542 -855 231 -2374 -518 597
1533 597 -774 1778 1289 378 1265 -1105 -901 -665 -1912 492 214 -281 2476 399 133 781 -2051
1550 -2051 -514 -349 -1339 840 321 875 1801 -324 391 -397 -2423 -8 -608 -696 1793 610 867 1327
1568 1327 -772 138 -1056 -1900 296 -842 589 2044 -97 1173 526 -1398 49 -1224 -1225 605
1584 605 -242 1355 1615 -151 1165 -936 -1509 308 -1685 -377 1124 -204 1506 1157 -123 489
$$ packed form
1468C18l021J865M28r74L276j002k8Q86k585O20l54j796K355o14L13K751k239
1485A99P53L68l067J181n55n74K226p10J152J146k022J305j526k279K354j456
1501a505L67K577j714J775K19k141J140j752p58J606j474J940J356j827K173j155
1517H27j726J317j963M6J336p34K112L15j246J600k426l13J086k605J856J115
1533E97j371K552m89r11Q87k370K04K36j247K404k78m95K757k077k66O48k832
1550b051J537J65r90K179n19N54R26k125P15p88k026K415o00q8K489j183K57M60
1568A327k099R10j194q44K196j138J431J455k141J270o47j924J447j273jJ830
1584F05q47J597K60j766J316k101n73J817j993J308J501j328J710l49j280O12
$$ plain form
1600 489 -1713 -1001 -270 -1424 837 725 -289 2238 380 -718 209 -1874 -1007 87 -607 1166 624
1617 624 483 1478 -819 91 -369 -2308 -63 359 -462 1989 468 48 814 -1037 -361 -798 -1400 622
1635 622 -179 577 2253 -343 474 206 -1725 -55 -714 -821 892 -131 1127 1470 -713 419 -885
1652 -885 -1600 327 -703 -96 1389 16 1233 934 -778 -26 -1704 -833 513 -943 1024 1350 -439
1669 -439 1374 143 -1103 -71 -1533 -648 567 -137 1367 548 26 1019 -1064 -661 65 -1911 124
1686 124 974 -139 1512 508 -148 128 -1336 -409 -471 -1151 1109 471 435 1824 -589 -160 164 -1896
1704 -1896 -164 -219 -622 1200 408 905 933 -1007 -133 -698 -1486 532 -337 165 1712 -53 722 474
1722 474 -1292 -22 -1094 -1097 806 -243 963 1511 -528 701 -166 -1583 9 -1019 -282 954 -202
$$ packed form
1600D89k202P12P31j154K261j12j014K527j858j098R27k083Q67J094o94J773n42
1617F24j41R95k297R10m60j939K245M22q21K451j521m20P66j851O76m37o02K022
1635F22q01P56J676k596Q17k68j931J670o59j07J713j023J258L43k183J132j304
1652h85p15J927j030O07J485j373J217k99j712P52j678Q71J346j456J967L26j789
1669d39J813j231j246J032j462Q85J215p04J504q19n22R93k083M03P26j976K035
1686A24Q50j113J651j004o56K76j464R27o2o80K260o38l6J389k413M29L24k060
1704a896J732n5m03J822p92M97K8j940Q74n65p88K018q69N02J547j765P75k48
1722D74j766J270j072lJ903j049J206N48k039J229q67j417J592j028P37J236j156
$$ plain form
1739 -202 1285 857 -695 675 -1020 -1119 366 -1117 348 1143 43 1566 321 -791 11 -1398
1755 -1398 -313 142 -802 1314 566 -84 1579 -643 -819 77 -1336 8 487 -297 1437 267 166
1772 166 854 -1185 -368 -476 -1388 993 176 72 1667 -184 313 359 -1427 -137 -556 -747 1308 7
1790 7 652 1216 -608 258 -302 -1442 294 -724 -255 1295 -20 821 628 -905 290 -716 -1279 466
1808 466 -539 640 1250 -116 911 -29 -1029 232 -1271 -578 763 -390 1305 883 -544 643
1824 643 -719 -1000 141 -1215 25 706 -53 1435 215 -291 427 -1307 -431 162 -1123 631 598
1841 598 149 1281 -190 -369 117 -1311 -8 -179 -658 1180 360 363 940 -1018 -308 -229 -1303 531
1859 531 -200 -50 1371 -112 433 513 -1411 -152 -499 -749 829 -88 383 1201 -217 557 -268 -1471
$$ packed form
1739b02J487m28j552J370j695r9J485j483J465P95j100J523j245j112Q02j409
1755a398J085M55r44K116p48o50J663k222j76Q96j413J344M79p84J734j170j01
1772A66O88k039Q17j08r12K381q17j04J595j851M97M6j786J290m19j91K055j301
1790GO45N64j824Q66n60j140J736j018M69J550j315Q41j93j533J195j006n63J745
1808D66j005J179O10j366J027r40j000J261j503O93J341j153J695m22j427J187
1824F43j362k81J141j356J240O81p59J488j220n06P18j734Q76N93j285J754l3
1841E98m49J132j471j79M86j428J303j71m79J838q20LN77j958P10P9j074J834
1859E31p31J50J421j483N45Q0j924J259l47k50J578r17M71Q18j418P74q25j203
$$ plain form
1877 -1471 245 -510 -210 1112 -296 544 737 -571 507 -787 -1093 331 -651 415 1070 -516 1044
1894 1044 238 -755 444 -1129 -876 481 -474 1094 689 -238 1064 -252 -566 104 -1294 -70 464
1911 464 -194 1252 142 -214 785 -886 -496 -182 -1163 555 275 -81 1156 -318 -100 467 -1197 -127
1929 -127 -389 -874 1214 572 353 1046 -758 -5 85 -1127 174 -251 -182 1425 95 519 609 -990 100
1948 100 -297 -778 439 -415 368 1164 78 478 -245 -1240 306 -817 -483 818 -569 856 1121 -242
1966 -242 495 -771 -851 379 -683 14 641 -305 1145 462 -527 384 -966 -587 462 -589 487 532
1984 532 -123 1147 -94 -382 27 -1292 237 521 -460 815 312 25 1096 -619 -423 -256 -932 573
2002 573 193 -242 981 -161 224 980 -996 -372 -251 -727 764 103 -13 798 -625 561 244 -1153
$$ packed form
1877a471J716p55L00J322j408Q40J93j308J078j294l06J424r82J066O55j586J560
1894A044q06r93J199j573K53J357r55J568m05r27J302j316l14O70j398J224N34
1911D64o58J446j110l56R99j671L90L14r81J718k80l56J237j474K18N67j664J070
1929a27k62m85K088o42k19O93j804P53R0j212J301m25O9J607j330M24R0j599J090
1948A00l97m81J217q54P83P96j086M00p23r95J546j123L34J301j387J425K65j363
1966b42P37j266q0J230j062O97O27r46J450o83r89R11j350L79J049j051J076M5
1984E32o55J270j241k88M09j319J529K84r81J275n03k87J071j715J96J67o76J505
2002E73l80m35J223j142L85P56j976O24J21m76J491o61j16Q11j423J186l17j397
$$ plain form
2020 -1153 135 -629 -280 1384 -73 358 751 -617 390 -70 -894 19 -614 611 1295 -496 557
2037 557 204 -767 561 -531 -871 335 -534 756 913 -221 280 -574 -480 668 -1020 -211 524 -356
2055 -356 1075 537 -410 353 -702 -330 380 -784 371 281 -76 1361 -52 -338 381 -1090 -227 206
2073 206 -815 566 180 360 919 -749 -105 -45 -961 625 56 -620 1029 -3 281 642 -837 -183
2091 -183 -322 -413 637 -475 104 1088 -302 505 229 -1395 141 -323 -517 710 -335 267 609 -169
2109 -169 503 -459 -939 335 -450 301 940 -597 437 395 -230 478 -689 -820 180 -224 707 362 -631
2128 -631 826 125 -391 519 -1132 -458 588 -54 762 183 -349 491 -216 47 67 -1347 261 233 -105
2147 -105 1065 -194 -603 481 -529 2 -258 -930 498 43 458 1033 -766 -73 307 -761 410
$$ packed form
2020a153J288p64L49J664j457M31L93j368J007m60q24R13o33J225O84j791J053
2037E57l53r71J328j092l40J206q69J290J57j134N01q54R4J148j688Q09P35q80
2055c56J431n38r47P63j055L72P10j164J155r0l57J437j413k86P19j471Q63M33
2073B06j021J381l86J80N59j668O44O0r16J586n69o76J649j032K84L61j479O54
2091a83j39r1J050j112N79R84j390Q07k76j624J536m64j94J227j045O02L42p78
2109a69O72r62m80J274p85P51O39j537J034m2o25P08j167j31J000m04R31l45r93
2128f31J457p01n16R10j651O74J046o42Q16n79n32Q40p07K63K0j414J608k8l38
2147a05J170j259m09J084j010N31k60o72J428m55M15N75j799O93L80j068J171
$$ plain form
2164 410 -311 -738 621 155 459 549 -789 1 -232 -752 546 -683 -171 1101 -204 201 252 -874
2182 -874 101 -173 -326 326 -562 460 791 -351 486 -340 -824 446 -505 -197 525 -447 617 381 -308
2201 -308 337 -775 -521 539 -547 315 459 -474 1108 451 -443 106 -931 93 446 -288 636 -86
2219 -86 -297 940 -194 -345 -116 -1003 187 314 -39 556 -288 -48 788 -667 -227 -387 -1020 813 166
2238 166 -225 727 -507 164 601 -617 8 -370 -461 854 69 265 464 -801 360 133 -938 82
2256 82 -626 -90 1003 -17 475 80 -627 692 -142 -674 212 -601 311 881 -422 461 -237 -678 690
2275 690 -477 -295 266 -468 729 693 -401 488 -410 -290 470 -666 -54 170 -149 752 110 -418 152
2294 152 -747 -44 337 -899 271 165 41 943 -233 -290 137 -733 257 172 -463 597 15 158 951
$$ packed form
2164D10p21m27J359m66L04R0j338P90k33n20J298j229N12J272j305M05N1j126
2182h74R75k74j53O52q88J022L31j142Q37q26m84J270r51L08P22r72J064k36o89
2201c08O45j112K54J060j086Q62J44r33J582o57q94N49j037J024L53p34R24p22
2219h6k11J237j134j51K29q87J190J27l53N95q44K40Q36j455M40j60o33J833o47
2238A66l91R52j234O71M37j218O25l78r1J315p85J96J99j265J161k27j071J020
2256H2p08N36J093j020M92l95p07J319q34n32Q86q13R12N70j303Q83o98m41J368
2275F90j167J82N61p34J197l6j094Q89q98J20P60j136O12K24l19R01o42n28N70
2294A52q99P03L81j236J170j06j24R02j176n7M27q70R90q5o35J060n82J43P93
$$ plain form
2313 951 -565 -198 9 -706 696 20 -323 631 61 377 267 -889 -147 -339 -474 902 -237 70
2331 70 615 -297 624 31 -865 55 -498 -191 676 -285 140 347 -299 705 -261 -629 379 -504 455 681
2351 681 -517 439 -73 -327 480 -681 -486 354 -291 804 359 -505 450 -297 -124 378 -923 -55 161
2370 161 -177 871 71 -244 474 -515 -102 28 -916 458 241 -44 797 -232 -245 182 -558 340 -177
2389 -177 -644 626 234 21 728 -521 30 257 -538 367 -215 -513 623 -101 411 307 -878 250
2407 250 -113 -411 455 -459 6 795 -233 371 47 -781 273 -288 -118 429 -566 457 533 -437 446
2426 446 -466 -580 393 -513 53 168 -381 566 266 -293 313 -690 -327 468 -407 334 214 -323 566 -101
2446 -101 -108 202 -820 223 293 -282 639 -64 -166 746 -284 -168 -1 -632 423 174 -177 410 -356 -77
$$ packed form
2313I51j516L67K07p15J402o76l43R54n70L16j10j156P42j92j35J376j139L07
2331G0N45r12R21n93q96R20n53L07Q67r61M25K07o46J004r66l68J008q83R59K26
2351F81j198R56n12k54Q07j161J95Q40o45J095m45q64R55p47J73N02j301Q68K16
2370A61l38J048q00l15P18r89M13J30r44J374k17k85Q41j029j3M27p40Q98n17
2389a77m67J270l92k13P07j249N51K27p95R05n82k98J136p24N12j04j185J128
2407B50l63k98Q66r14M65P89j028O04l24q28J054n61J70N47r95J023P6r70Q83
2426D46r12j14R73r06N66J15n49R47l00n59O06j003L63P95q75P41j20n37Q89o67
2446a01pL10j022J043P0n75R21p03j02R12j030J16J67o31J055k49l51N87p66K79
$$ plain form
2466 -77 325 -447 53 -125 -624 588 112 23 571 -363 344 289 -685 99 -458 -222 626 -265 335 185 -489
2487 -489 180 5 -446 142 -365 64 599 -271 265 -119 -616 464 -397 -380 293 -495 298 475 -300 303
2507 303 -344 -451 580 -419 -82 67 -350 798 288 -248 307 -662 -82 478 -460 164 103 -213 889
2526 889 -67 -119 79 -739 199 272 -460 217 -58 -48 681 -351 -81 -111 -530 344 20 -319 579 -224 -40
2547 -40 436 -469 1 -141 -571 528 -90 -96 383 -466 337 217 -741 199 -356 -126 531 -267 147 342 -291
2568 -291 315 -332 -408 339 -460 82 516 -567 302 205 -263 404 -331 -569 364 -254 377 233 -437 411
2588 411 -140 -167 343 -336 -122 298 -219 499 264 -352 432 -199 50 132 -541 35 18 -222 842 -268
2608 -268 -398 348 -366 114 248 -540 388 -15 48 616 -481 34 219 -540 323 -52 -566 278 -18 30
$$ packed form
2466g7M02p72N00j78m99J212m76q9N48r34P07n5r74P84n57K36Q48q91O00j50o74
2487d89O69j75m51N88n07M29N35q70N36l84m97J080q61J7O73p88P93J77p75O03
2507C03o47j07J031r99L37J49m17J148n10n36N55r69N80N60r38O24o1l16J102
2526H89r56n2J98q18R38P3p32O77k75J0P29j032K70l0m19Q74l24l39Q98q03J84
2547d0M76r05M70j42m30J099o18oM79q49Q03j20r58R40n55K30O57p98M14J95o33
2568b91O06o47p6P47p99N42M34j083Q69r7m68O67p35k38R33o18O31j44o70Q48
2588D11n51k7N10o79K14M20n17P18k35o16P84o31K49Q2o73N76j7k40J064j110
2608b68j30P46p14M80J34p88R28m03O3N68j097N15J85p59Q63l75n14Q44k96M8
$$ plain form
2628 30 443 -440 165 -121 -363 491 -418 -134 444 -309 353 408 -571 133 -233 -148 433 -227 184 282 -185
2649 -185 535 -50 -450 330 -276 -86 358 -311 229 309 -153 274 -420 -346 322 -275 231 197 -336 414 -136
2670 -136 -329 434 -458 -236 236 -173 459 8 -187 629 -193 -55 43 -583 254 221 -347 588 13 -140 226
2691 226 -343 8 -154 -600 425 2 -97 506 -618 -89 464 -535 44 -235 -404 501 -78 134 270 -496
2711 -496 297 14 -289 391 -344 -342 600 -248 30 200 -458 251 -117 -162 187 -363 130 375 -315 246 205
2732 205 -358 197 -136 -198 147 -345 397 217 46 356 -310 -249 262 -423 133 -13 -331 298 -71 -204 369
2753 369 -380 9 5 -316 398 41 -131 665 -387 -120 241 -439 25 -82 -347 425 50 -34 422 -378 184
2774 184 209 -459 390 -183 -139 492 -162 261 72 -277 158 -222 -311 440 -206 209 481 -274 74 19 -411
$$ packed form
2628C0M13q83O05k86k42Q54r09K84N78p53O62N5r79P04l66Q5N81o60M11R8m67
2649a85P20n85m00P80o06J90M44o69N40Q0m62M27o94P4O68n97N06l4n33P50n50
2670a36j93P63q92K22M72m09O32m51j95Q16q22J38R8o26Q37l3n68R35n75j53L66
2691B26n69L51j62m46J025m23r9O03j124N29N53r99N79k79j69R05n79K12J36p66
2711d96P93k83l03O80p35KR42q48K78J70o58P09l68m5L49n50M93K45o90N61m1
2732B05n63N55l33o2L45m92P42j80j71L10o66O1N11o85N56j46l18O29l69j33N73
2753C69p49L89ml21P14l57j72P96j052K67L61o80M64j07k65P72l75q4M56q00N62
2774A84K5o68Q49n73M4O31o54M23j89l49M35l80q9P51o46M15K72p55L48n5m30
$$ plain form
2795 -411 306 -192 -141 309 -149 116 130 -243 359 -245 -246 304 -410 -59 367 -151 229 51 -255 63 -318
2816 -318 -252 117 -272 332 195 -417 557 -39 -130 237 -321 44 117 -385 443 -238 -126 425 -287 -46 73
2837 73 -439 167 22 -77 504 -240 29 262 -420 339 -23 -325 379 107 27 214 -211 -40 169 -345 327
2858 327 -50 -147 452 -318 256 240 -193 252 -77 -336 217 -206 18 419 -281 163 -35 -281 171 -169 -68
2879 -68 218 -231 220 312 -241 288 -126 -288 408 -379 75 224 -356 332 80 -230 319 -457 -96 157 -388
2900 -388 110 32 -318 348 -99 -126 234 -530 -37 25 -393 414 -127 -191 340 -293 31 116 -321 237 51 -117
2922 -117 330 -143 107 422 -342 92 -127 -341 310 -230 -120 356 -106 127 115 -422 142 -179 -136 406 -104
2943 -104 29 307 -206 292 -105 -395 326 -263 4 359 -306 271 11 -234 356 -289 -150 386 -235 57
$$ packed form
2795d11P17m98N1M50m58K65J4l73O02o04jN50p14L51M26n18L80j78l06L18l81
2816c18O6L69l89O04j37o12R74n96r1L67n58L65P3n02Q28o81J12N51p12K41J19
2837G3n12O06j45r9N81p44K69K33o82P59l62l02P04k72q0J87m25J71K09n14O72
2858C27l77r7N99p70N74j6m33M45l29k59N53m23K24M01p00M44j98k46M52l40J01
2879f8K86m49M51R2n53N29m14j62O96p87M54J49n80O88k52l10N49p76L61K53n45
2900c88M98p8l50O66m47k7L60p64M93O2m18Q07n41o4N31o33L24Q5m37N58j86j68
2922a17M47m73K50L15p64M34k19k14O51n40J10M76m62K33j2n37N64l21M3N42n10
2943a04J33K78n13M98l97k90P21n89K67L55o65N77k60k45N90o45J39N36o21K92
$$ plain form
2963 57 252 -205 287 -131 -198 209 -334 55 238 -99 440 54 -190 403 -187 -188 163 -248 274 44 -279
2984 -279 409 -179 -100 318 -436 189 64 -307 430 -84 -30 509 -106 -25 30 -410 236 -201 -193 232 -337 -98
3006 -98 432 -380 187 -200 -328 360 31 -86 419 -248 145 29 -532 325 -234 -168 316 -102 142 355 -322
3027 -322 210 -161 -217 320 -322 77 289 -353 278 83 -218 323 -166 -249 377 -102 66 126 -298 303 -17
3048 -17 -153 127 -407 -73 249 -410 359 70 -179 209 -318 17 228 -327 227 152 -206 418 9 -58 251
3069 251 -319 -22 207 -296 315 -89 78 291 -346 130 54 -294 311 -63 -264 399 -270 -14 418 -247
3089 -247 41 -72 -269 183 -108 -30 186 -267 63 210 -362 295 -156 -320 278 -328 120 218 -276 211 20
3110 20 -348 463 -155 -54 146 -321 135 174 -214 205 -191 -40 112 -218 -194 241 -220 626 -137 -190 538
$$ packed form
2963E7J95m57M92m18o7M07n43L89J83l37N39l86k44N93n90jL51m11N22k30l23
2984b79O88n88P9M18p54O25j25l71P37n14N4N39o15Q1N5m40O46m37QM25n69K39
3006i8N30q12N67l87j28O88l29j17N05o67L93j16n61Q57n59O6M84m18K44K13o77
3027c22N32l71n6N37o42L99K12o42O31j95l01N41m89q3O26m79J68O0m24O01l20
3048a7j36K80n34L34L22o59P69k89k49L88n27L35K11n55N54p5l58O24m09o7L09
3069B51n70K97K29n03O11m04J67K13o37M76p6l48O05l74k01O63o69K56M32o65
3089b47K88j13j97M52k91P8K16m53L30J47n72O57m51j64N98o06M48R8m94M87j91
3110B0l68Q11o18J01K00m67M56L9l88M19l96J51J52l30K4M35m61Q46p63n3P28
$$ plain form
3131 538 -294 -68 163 -184 194 94 -13 260 -277 -81 119 -317 293 103 -319 393 -156 -133 389 -70
3151 -70 -80 3 -477 284 -48 -24 394 -249 163 211 -198 190 48 -276 250 -140 2 150 -232 76 40 -322
3173 -322 358 -218 -218 298 -212 184 137 -381 145 -253 -132 237 -403 86 222 -302 535 -292 -291 376 -134 -132
3195 -132 185 -350 155 115 -194 399 -254 -159 186 -252 77 209 -293 411 -16 -300 361 -61 -89 38 -461
3216 -461 251 -14 -228 241 -336 14 249 -355 154 14 -184 261 -99 -122 178 -185 133 -9 -395 384
3236 384 -69 -230 331 -91 166 128 -436 174 36 -333 289 -180 -14 275 -430 152 -47 -471 254 -242
3256 -242 54 187 -186 245 204 -66 103 49 -185 258 -379 156 298 -404 257 65 -149 184 -215 -48 316
3277 316 -346 126 59 -393 145 -250 -81 311 -132 75 176 -127 219 4 -137 222 -283 63 53 -302 237
$$ packed form
3131E38q32K26K31l47L78j00j07K73n37J96K00m36O10j90m22P12n49K3N22m59
3151g0j0Q3m80P61l32K4M18o43M12M8m09L88j42l24N26l90J42J48l82L08l6l62
3173c22O80n76%N16n10L96m7n18N26l98J21L69o40M89J36n24Q37q27JO67n10K
3195a32L17n35N05m0l09N93o53R5L45m38L29J32n02P04m27k84O61m22k8J27m99
3216d61P12k65k14M69n77L50K35o04N09j40j98M45l60k3L00l63L18j42l86P79
3236C84m53j61N61m22K57l8n64O10j38l69O22m69J66K89p05N82j99m24P25m96
3256b42K96J33l73M31m1k70J69n4k34M43o37N35J42p02O61j92k14L33l99J67L64
3277C16o62M72o7m52N38l95J69L92m43K07J01l03L46k15j41L59n05L46j0l55N39
$$ plain form
3298 237 -27 -228 342 -151 -16 274 -207 96 170 -163 104 -156 -169 337 -196 85 114 -279 299 111 -150
3319 -150 263 -279 121 184 -348 232 -56 -355 302 -316 113 281 -289 112 0 -194 242 -249 -136 358
3339 358 -149 73 103 -317 126 12 -36 356 -327 136 113 -129 354 135 -121 276 -58 -162 194 -340 222
3360 222 135 -235 254 -108 -151 308 -397 343 103 -385 261 40 -387 329 -343 99 269 -242 247 84 -110
3381 -110 242 -174 111 337 -306 46 -106 -241 272 -99 -92 133 -280 96 105 -243 121 78 -35 319 -257 87
3403 87 338 -177 158 19 -154 190 -35 -200 246 -214 173 -38 -95 118 -130 -185 158 -279 294 152 -209
3424 -209 379 -59 -139 302 -378 -47 232 -197 199 113 -129 82 -280 20 187 -308 191 44 -201 275 11
3445 11 -92 287 -314 188 -1 -335 226 -44 -156 101 -118 92 102 -314 183 109 -129 375 -273 -44 224
$$ packed form
3298B37k64k01N70m93J35K90m81L03P4l33K67k60j3N06n33K81K9l93N78j88k61
3319a50M13n42M00O3n32N80k88k99O57o18M29J68n70M01j12j94M36m91J13M94
3339C58n07K22L0m20M43j14m8L92o83M63k3k42M83k19k56L97l34j04L56n34N62
3360B22q7l70M89l62m3M59p05P40k40m88O46k21m27P16o72M42J70n11M89j63j94
3381a10L52m16K85K26o43L52j52j35N13l71PK25m13L76Rl48L64m3j13L54n76L44
3403H7K51n15L35j39j73L44k25j65M46m60L87k11n7K13k48n5L43m37N73j42l61
3424b09N88m38q0M41o80L31K79m29L96q6k42K11l62L00J67m95M99j47k45M76k64
3445A1j03L79o01N02j89l34N61k70j12K57k19K10J0m16M97p4k38N04o48K29K68
$$ plain form
3466 224 -301 33 1 -273 347 1 -154 231 -14 222 109 -398 132 -114 -167 230 -361 -5 124 -53 402
3487 402 -188 -309 196 -267 61 169 -252 197 9 -234 295 -147 -95 360 -283 -55 73 -208 153 -121
3507 -121 65 267 -285 98 88 -259 274 101 -223 141 -210 -83 203 -304 123 -68 -274 338 -187 -72
3527 -72 153 -321 71 2 -238 267 -84 -42 171 -264 141 82 -245 183 -105 -241 244 -161 16 263 -258
3548 -258 151 46 -174 99 -101 68 202 -330 132 -40 -263 192 -219 -184 245 -61 88 60 -161 165 -43
3569 -43 -69 250 -133 18 105 -310 279 43 -224 239 49 82 191 -136 128 140 -107 488 -76 -107 221 -229
3591 -229 66 57 -281 210 -63 -185 274 -216 -59 43 -292 318 39 -300 172 -106 -71 278 -166 -10 -13 -136
3613 -136 205 24 -29 205 -221 167 220 -199 425 -67 -258 384 -59 51 167 -89 148 -55 -277 258 -186
$$ packed form
3466B24n25L34l2k74O20l46j55L85k45K36j13n07N30k46n3L97n91L56J29j77M55
3487D02n90j21N05m63L28J08m21M49j88k43N29m42N2M55o43K28J28k81L61k74
3507a21J86K02n52L83j0l47N33j73l24L64l51J27K86n07M27j91k06O12n25J15
3527g2K25m74L92o9k40N05l51M2K13m35M05n9l27M28k88j36M85m05J77K47n21
3548b58M09j05k20K73k00J69J34n32M62j72k23M55m11L5M29l06J49k8k21L26k08
3569d3k6L19l83J51Q7m15N89k36k67M63j90L3J09l27K64J2k47N95n64l1L28m50
3591b29K95rl38M91k73j22M59m90J57J02l35O10k79l39M72k78L5L49m44J56lj23
3613a36L41j81n3K34m26L88N3m19O24m92j91O42m43J10J16k56K37k03k22N35m44
$$ plain form
3634 -186 -77 112 -259 -110 92 -353 222 45 -69 192 -161 39 89 -77 366 4 -91 47 -253 -63 203
3655 203 -268 86 106 -348 69 -57 -106 184 -168 95 123 -121 333 -53 -6 260 -103 -66 101 -214 108 -110
3677 -110 49 229 -307 108 92 -215 278 145 -189 289 -108 -106 156 -162 141 74 -21 134 -73 14 275 -271
3699 -271 66 199 -339 94 -121 -115 103 -136 -34 150 -421 185 24 -129 259 -6 -195 365 -264 26 17
3720 17 -180 32 -55 -65 10 -272 114 261 -75 192 51 -160 287 -53 40 93 -300 113 65 -86 295 -65
3742 -65 -20 86 -276 -15 119 -302 17 30 50 179 -275 -43 -5 -246 189 -219 -202 339 -16 25 85 -354 -33
3765 -33 200 -205 192 -58 -67 259 -175 26 -64 -335 123 -209 -79 219 -118 84 126 -225 158 -160 -97 235
3787 235 -77 45 283 -279 198 -110 16 203 -11 -58 -92 16 90 -2 -134 184 -223 -228 91 -306 -92 129
$$ packed form
3634a86J09J89l71J49K02m45N75j77j14K61l53K00N0j66M43l62r5J38l00J90K66
3655B03m71L54K0m54M17j26m9K90l52K63K8k44M54l86M7K66l63L7J67l15L22k18
3677a10J59J80n36M15j6l07M93j33l34M78l97KK62l18L03o7r5J55k07Q7K61n46
3699b71L37J33n38M33k15OK18k39J02J84n71O06j61j53L88k65j89N60o29K90r
3720A7j97K12q7j0P5k82L86J47l36K67j41k11M47l40R3N3l93M13m8j51L81l60
3742f5M5J06l62K61J34m21L19J3K0J29m54K32L8k41M35m08J7N41l55M1O0m39L21
3765c3K33m05L97k50rL26m34K01r0k71M58l32J30K98l37K02M2l51L83l18O3L32
3787B35l12J22K38n62M77l08J26J87k14m7l4J08P4r2j32L18m07nL19l97K14K21
$$ plain form
3809 129 59 20 32 -187 22 -71 -49 138 -287 182 30 -29 194 -139 133 75 -205 48 35 -49 181 -67 65
3832 65 64 -145 44 -15 -276 198 -76 -252 195 -253 123 101 -176 2 104 -229 177 -174 -117 175 -124 189
3854 189 119 -92 88 -55 -69 67 -24 99 194 5 286 -101 -162 129 -215 200 172 -93 -76 -30 -167 182 -65
3877 -65 -45 174 -210 40 -54 -167 218 -125 -110 236 -177 -30 89 -129 89 116 -101 153 -171 -156 126 -179
3899 -179 96 86 -157 131 -143 -87 185 -95 68 3 -206 147 114 -39 265 -219 86 -2 -242 251 44 -147
3921 -147 280 -154 138 157 -254 5 14 -123 175 -149 31 141 -200 95 216 -88 204 -160 -48 242 -141
3942 -141 181 199 -92 154 -50 -102 150 -75 25 171 -77 191 148 -32 201 -124 -101 79 -237 55 21 -177
3964 -177 159 -156 -37 232 -211 39 107 -209 118 -7 -71 58 -217 -46 157 -323 188 -11 -45 145 -48
$$ packed form
3809A29p0l9J2k19K09r3K2J87m25M69j52n9K23l33K72n8k80K53j3q4K30k48J32
3832F5jk09J89n9k61M74k74j76M47m48L76k2k77J78J02l33M06l51N7K92k99L13
3854A89p0k11J80j43j4J36r1J23R5j89K81l87o1K91l44M15k8k65J7M6j37L49k47
3877f5K0K19l84K50r4j13L85l43J5L46m13J47J19k18K18K7k17K54l24J5K82l05
3899a79K75j0k43K88k74N6K72k80J63o5k09L53l3j53L04m84L05q8k40M93k07j91
3921a47M27m34K92J9m11K59Rj37K98l24J80J10l41K95J21l04K92l64J12K90l83
3942a41L22J8k91K46k04n2K52k25J00J46k48K68m3j80K33l25K3J80l16K92l4j98
3964a77L36l15J19K69m43K50O8l16L27j25o4J29k75J71K03m80N11j99l4J90j93
$$ plain form
3985 -48 27 72 -179 131 41 -38 143 -43 -28 239 -165 76 110 -248 98 77 -100 43 -365 -9 132 -211 303
4008 303 -77 -272 158 -62 -229 128 -82 -36 180 -206 171 -162 -181 74 -203 165 31 -35 14 44 -86 86
4030 86 -100 -28 81 -141 70 31 -234 62 -108 -181 127 -225 -85 70 -98 243 8 1 301 -87 19 -55
4052 -55 -123 107 -19 -78 427 -119 -128 108 -104 108 45 3 109 51 -11 110 -97 138 118 -162 -26 -4 91 20
4076 20 -216 86 117 -16 179 186 -11 288 -295 46 129 -244 -55 -13 -141 144 -5 -74 189 -231 167 110 -261
4099 -261 13 3 -162 114 13 130 -113 -63 111 -113 -95 166 -98 53 105 -240 93 8 -140 131 -84 -63
4121 -63 184 -136 112 37 -236 217 -96 -175 119 -182 -11 -25 -175 190 -97 -85 210 -116 40 81 -200 -10
4143 -10 -110 -186 267 -325 -24 81 -123 -100 1 -166 108 -44 37 160 -187 170 217 -107 252 85 -57 93
$$ packed form
3985d8P5M5k51L10r0p9J81j86J5K67m04K41L4l58L46k1j77J43m08L56J41l43N14
4008C03l80j95M30k20j67L57k10M6K16l86L77l33j9K55k77L68j34o6M9L0j30J72
4030H6j86P2J09k22K11l9k65K96j70p3L08l52J40J55j68L41k35pL00l88J06p4
4052e5o8K30j26n9N05n46rK36k12K12o3m2J06n8o2J21k07K35k0k80J36K2R5p1
4076B0k36L02L1j33J95Pj97K99n83L41Q3l73J89M2j28K85j49o9K63m20L98n7l71
4099b61K74j0j65K76j01J17k43N0J74k24J8K61k64J51N2l45L33q5j48K71k15K1
4121f3K47l20K48p5k73M53l13p9K94l01J71j4j50L65k87J2K95l26J56M1k81J90
4143a0j00p6M53n92L01J05k04K3J01j67K74j52Q1J23l47L57M7l24L59j67j42J50
$$ plain form
4165 93 6 -119 154 -87 203 220 -185 103 -175 129 46 -118 57 -58 -240 154 44 -78 184 -268 23
4186 23 157 -68 166 -115 -112 203 8 97 69 -11 18 122 -189 151 -300 39 218 -179 153 -10 3 99 -35
4209 -35 17 16 -277 -57 -31 -183 41 -132 -95 156 73 82 3 -168 160 46 10 31 -171 -64 198 -14 -3 211
4233 211 -30 397 -5 45 64 -154 45 89 -251 -44 88 -42 175 -63 -40 97 -164 98 12 -110 98 -79
4255 -79 -155 274 -104 7 -14 -243 112 -95 -9 173 -330 111 203 -172 228 -43 12 318 -2 -26 44 -53 97
4278 97 48 -133 181 -221 95 277 -191 -9 103 -80 277 -58 -44 105 -183 103 -8 -256 222 -17 -27
4299 -27 237 -354 -204 -19 -156 -13 -132 -111 76 -9 173 124 -47 -45 20 -291 160 -162 -175 -3 -173 120 124
4322 124 -266 97 -172 8 268 -250 63 -107 -44 170 45 -39 25 -50 -10 13 -250 -63 -92 -119 285 -134 -127
$$ packed form
4165I3q7j25K73k41K90J7m05K88k78L04q3j64J75j15j82L94j10j22K62m52K91
4186B3J34k25K34k81LL15j95Q9k8q0K9J04l11L40m51L39J79l97L32j63J3R6j34
4209c5N2jk93K20K6j52K24j73L7K51q3Rp9j71L28j14l6K1k02J07K62k12J1K14
4233B11k41M27m02N0J9k18J99M4l40K07J32j30K17k38K3J37k61K62q6j22K08j77
4255g9p6M29l78J11k1k29L55k07Q6J82n03M41R2l75M00k71N5L06l20k4P0r7J50
4278I7m9j81L14m02L16J82m68J82J12j83L57l35J4J49k88K86j11k48M78k39j0
4299b7K64n91J50J85j37J43j19K1J87q5J82m9j71KO5l11M51l22j3J72j70K93M
4322A24l90L63k69J80K60n18L13j70O3K14j25q4O4p5M0K3k63J87k9k7M04m19P
$$ plain form
4345 -127 120 -144 229 132 -234 90 -9 -10 213 -165 -151 44 -209 125 -16 -106 27 106 280 142 -168 48
4367 48 -34 83 238 106 -97 71 -196 98 114 -98 93 -259 -134 74 -147 121 102 -42 170 -11 -158
4388 -158 -59 -196 34 78 -69 127 97 -197 125 -112 -30 61 -41 -6 160 -215 138 49 -94 340 -114 22
4410 22 12 -46 -62 -21 -125 80 -180 69 79 -196 169 -83 -17 192 -167 14 222 -120 -9 -14 -145 50 12
4433 12 -67 9 -210 35 83 -120 46 -16 -24 201 -63 27 157 -186 91 155 -18 122 -157 -185 137 -29 113
4456 113 -166 -117 17 -103 -54 38 -33 24 136 -68 256 -13 -111 148 -114 -201 179 -168 67 0 -94 5 -125
4479 -125 9 258 -155 -90 124 -328 192 142 -166 18 -1 66 99 -175 89 -54 -97 91 -26 237 100 -197
4501 -197 -43 47 -85 206 -214 -158 -11 -164 135 -112 -2 209 -14 -39 147 -174 29 42 -85 96 -91
$$ packed form
4345a27K47k64L73r7l66L24r9jK23l78J4J95k53L34j41r0J33P9J74j38l10K16
4367D8q2J17J55j32k03J68k67K94J6k12J91l52J25K08k21K68j9j44K12j81j47
4388a58R9j37K30M4j47J96l0k94L22k37Q2R1j02L5J66l75L53q9j43M34m54J36
4410B2j0n8j6M1j04K05k60K49J0k75L65k52O6K09l59J81K08l42J11nj31J95l8
4433A2p9P6k19K45M8k03J66o2qK25k64R0J30l43K77O4j73J40k79k8L22j66J42
4456A13k79M9J34j20M9R2p1N7J12k04L24k69r8K59k62q7L80l47K35o7r4R9j30
4479a25J34K49m13O5K14m52N20n0l08J84j9O7L3k74K64j43m3J88j17K63j37k97
4501a97J54R0j32K91m20N6J47j53K99k47J10K11k23k5J86l21K03J3j27J81j87
$$ plain form
4522 -91 -42 257 -104 -57 -76 -87 140 62 -142 143 -135 31 162 -151 157 -45 -149 121 -19 -73 71 -187
4544 -187 -28 99 -200 32 -73 -167 148 -151 -67 -90 -73 65 161 -126 279 -101 -143 249 -54 -66 17 -55 -22
4567 -22 25 -284 -24 -97 -10 100 -271 8 -16 -68 174 -207 -38 34 -141 93 -43 -37 63 -221 -56 248 -154
4590 -154 71 69 -213 24 -89 -84 79 -88 74 116 -147 -142 -54 -104 58 -56 -77 160 -181 71 -71 -51 149 -58
4614 -58 74 87 -80 92 120 2 143 -120 -142 116 -44 -94 131 -1 90 3 -118 175 -99 -123 98 -140 -115
4637 -115 216 -157 115 4 95 163 75 -106 194 -26 272 19 -93 239 -91 -28 -68 -187 157 -94 -129 124
4659 124 -69 -29 -52 1 111 -84 -245 171 2 -5 228 -128 -48 113 -36 180 3 -95 -59 -257 93 55 -206
4682 -206 -15 -113 -16 94 -121 -96 12 22 117 19 -158 -4 -126 -178 173 -105 -38 133 -129 74 -17 -135 92
$$ packed form
4522i1M9K99l61M7j9j1K27p8k04K85k78J66J31l13L08k02j04K70j40n4J44k58
4544a87J59J27k99K32j05r4L15k99Q4k3J7J38R6k87M05l80m2L92l03j2Q3p2L3
4567b2M7l09K60p3Q7J10l71K79k4n2K42l81J69P2j75K34j36OJ00k84J65L04m02
4590a54K25kk82K37j13NJ63j67J62M2k63NQ8n0J62j14k1K37l41K52j42K0K00k07
4614e8J32J3j67J72K8j18J41k63k2K58j60n0K25j32R1q7j21K93k74k4K21k38K5
4637a15L31l73K72j11R1O8q8j81L00k20K98k53j12L32l30O3m0j19L44k51l5K53
4659A24j93M0k3N3J10j95j61M16j69pK33l56Q0J61j49K16j77r8L6j98L50l8k61
4682b06J91r8R7J10k15K5J08J0R5r8j77J54j22n2L51k78O7J71k62K03r1j18K27
$$ plain form
4705 92 -24 -24 5 -107 27 19 64 124 -279 118 192 -77 54 -54 -129 -16 -36 5 152 -160 -141 -21 -92 196 -54
4730 -54 -16 200 -3 -9 231 -39 162 -84 -49 203 -123 -2 -32 -194 -71 167 15 123 112 -33 178 -85
4752 -85 194 11 -138 104 91 -79 44 31 64 -55 -37 13 -24 -55 -25 -106 4 187 -261 -32 42 -81 40 -78
4776 -78 -57 -68 20 124 33 -196 37 73 -174 54 -19 82 154 -14 126 -28 -47 -31 -41 -85 176 -45 258 -320
4800 -320 -281 127 -98 24 179 -17 2 -26 -61 95 -106 -119 -54 -81 -18 73 -191 -43 -101 -2 -14 47 -20 98 -103
4825 -103 214 69 -172 75 -76 -153 -45 -2 -19 11 -99 168 -27 -236 242 -9 -38 -27 48 -21 -179 -7 74
4848 74 -151 -11 130 -30 8 -73 -155 171 -47 65 112 -116 130 19 -3 170 5 -113 55 -75 24 98 -83
4871 -83 63 -83 -19 217 -47 78 140 -30 -45 101 -203 144 -47 16 12 -185 114 111 -176 90 57 -90 22
$$ packed form
4705I2j16%K9j12J34qM5O0m03L97P4k69J31j08p5J13k0M1J47l12J9J20p1K88k50
4730e4L8K16k03oK40k70K01k46L5K52l26J21l0j62J23K38j52J08j1j45K11k63
4752h5K79j83j49K42j3j70J23j3L3j19J8N0l7l1L0q1J10J83m48K29P4j23J21j18
4776g8K1j1Q8J04r1k29K33L6k47K28p3J01P2j68J40j54j9J6j0m4K61k21L03n78
4800c20L9M08k25J22J55j96J9k8l5J56k01j3O5k7O3R1k64J48n8R9j2O1o7J18k01
4825a03L17j45k41K47j51p7J08M3j7L0j10K67j95k09M78k51k9J1P5o9j58J72Q1
4848G4k25J40J41j60L8q1q2L26k18J12M7k28K46j11k2J73j65j18J68j30R9P4j81
4871h3J46j46O4K36k64J25O2j70j5J46l04L47j91O3mj97K99lk87K66l3j47J12
$$ plain form
4894 22 -15 60 2 -187 112 -50 -120 123 -23 21 -28 -49 41 -73 -171 83 -223 -22 193 29 79 46 -71 123
4918 123 25 -77 134 -74 30 141 -146 112 -41 -247 203 24 -32 32 -52 29 -119 -257 213 39 -194 -86
4940 -86 -79 -63 -66 -167 -42 165 -126 58 -80 39 111 -121 87 13 -5 159 -11 72 132 -233 57 -24 -75 -9 -46
4965 -46 -17 248 -54 169 56 -26 185 52 56 101 -145 -21 230 18 114 144 -181 92 -153 -19 197 -139 34
4988 34 -88 -146 81 -25 -115 155 -100 151 21 15 66 77 -43 124 -103 -26 -23 -112 84 -50 -140 50 -101 -38
5012 -38 67 -16 100 -70 -132 108 -27 -138 153 -7 59 54 -66 -38 31 -281 8 56 88 82 -13 136 51 -115 144
5037 144 6 -43 99 -204 33 26 49 167 0 -79 80 -80 90 103 -110 25 60 19 -4 101 125 98 -120 11
5061 11 -242 -47 126 -59 -121 130 -38 -33 -33 -131 -22 -76 122 220 -149 164 -36 -109 59 221 25 -4 -193 82
$$ packed form
4894B2l7P5n8j89K99j62p0K43j46M4m9k1R0j14r8K54l06K01K15j64N0l3j17J94
4918A23r8j02K11k08J04J11k87K58j53k06M50j79n6O4q4Q1j48j38M70j74k33J08
4940h6PJ6lj01J25K07k91J84j38J19P2k32K08p4j8J64j70Q3O0l65K90q1n1O6l7
4965d6K9K65l02K23j13q2K11j33MM5k46J24K51k12R6L0l25K73k45J34K16l36J73
4988C4j22n8K27j06r0K70k55K51j30oN1J1j20J67k27P7Lq9J96j34r0J90j51O3
5012c8J05q3J16j70o2K40j35j11K91j60O6nj20K8O9l12K89M8L2or5J49q5j66K59
5037A44j38m9J42l03K37pK3J18j67p9J59j60J70J3k13J35L5m1k3J05K4k7k18J31
5061A1k53J95J73j85o2K51j68N%r8J09n4J98R8l69L13k00p3J68J62j96k9j89K75
$$ plain form
5085 82 17 -43 275 -19 -83 76 -75 136 80 -9 -97 -37 -207 50 -43 72 32 -69 47 -22 -92 53 -92 -129
5109 -129 -61 62 -56 62 -100 78 -59 -104 -30 69 -37 -37 -98 186 32 -183 144 -264 22 96 -66 120 63
5132 63 -77 -53 -166 -107 12 -69 -18 99 -54 81 -112 5 157 -48 45 9 -69 67 -78 -7 101 -85 29
5155 29 -61 -13 122 -57 112 155 -141 -69 27 -23 229 -91 11 193 -81 -141 55 -49 20 57 14 210 -42 -106
5179 -106 111 52 125 53 -77 132 15 -35 216 78 -98 142 -135 -67 266 -11 60 57 31 85 -129 -96 102 -209
5203 -209 -40 82 4 37 -69 -28 274 -9 -33 121 -148 230 -81 67 82 -59 -109 12 -148 106 -37 -131
5225 -131 154 -70 72 93 -125 73 116 -27 114 -151 -130 210 -123 146 72 -115 31 49 -67 27 41 -20 75
5248 75 -127 44 29 -202 136 -103 -60 -19 -62 178 -59 62 68 -102 -34 291 -48 -91 50 -232 113 -11 -182
$$ packed form
5085H2o5o0L18k94o4J59j51K11n6q9q8O0j70K57r3J15m0j01J16o9p0J45j45l7
5109a29O8J23j18J18j62J78j37m5P4R9j06%o1K84j54k15L27m08K86P4j62J86n7
5132F3j40K4j13N9J19q1N1J17j53J35j93J17J52k05R3l6p8J36j45P1J08j86J14
5155B9r0M8J35j79J69M3k96P2R6n0K52l20J02J82k74o0J96j04O9L7m3J96k52o4
5179a06K17n9P3p2j30K09j17n0K51j38j76K40k77O8L33k77P1lk6N4k14L3J98l11
5203b09J69J22p8L3j06M1L02k83k4J54k69L78l11J48J5j41n0J21j60K54j43r4
5225a31K85k24J42K1k18J98M3j43J41k65K1L40l33K69p4j87J46J8j16R4J4o1R5
5248G5k02J71j5k31L38k39M3M1m3K40k37J21Oj70O8L25l39m3J41k82L45j24j71
$$ plain form
5271 -182 75 -135 -133 50 98 165 -58 46 -92 -12 -82 6 -218 69 168 -31 96 -105 49 8 -61 20 -14 3
5295 3 -65 -88 93 96 -154 -105 32 -72 77 64 -137 15 -59 117 -37 -118 89 -37 -169 167 -83 58 77 -26
5319 -26 24 18 68 92 -44 66 45 -14 38 -10 -40 122 154 -81 41 -101 147 -47 -134 7 25 -62 174 -54 -41
5344 -41 -91 -25 64 -95 -145 30 -62 68 29 -9 88 85 -234 66 30 -81 199 -124 7 122 -159 106 -111 -77
5368 -77 13 43 54 149 -100 84 -82 -165 19 -43 -14 5 9 6 -179 -32 90 -102 -113 -1 133 -67 -178 -158 170
5393 170 2 56 70 -49 -98 266 -52 65 -17 -151 -77 -36 -6 82 -27 -50 -55 -70 53 24 -82 68 0 14 -1
5418 -1 -63 124 -65 0 -14 -56 -96 59 10 140 61 14 46 -51 53 81 -68 -59 256 -72 54 21 99 -10 -3 43 69
5445 69 -237 86 98 -92 72 -107 -7 172 12 97 -36 3 216 -116 91 78 -35 22 -24 -136 75 -118
$$ packed form
5271a82K57k10KJ83M8O7k23J04j38Q0p0Q8k24K87R9j99J27k01J54m1o9Q1l4J7
5295Co8k3J81Lk50M9J37j04J49j3k01J52p4J76j54q1K07j26j32L36k50J41J9j03
5319b6N0oN0K4j36J10k1n9N2m8l0J62L2k35J22j42K48j94q7J41J8q7K36k28J3
5344d1n0O6Q9j59n0J75r2J30l9l8R7ll19L00l6j11K80l23J31J15k81K65k17L4
5368g7R0L0J1R5k49J84j66q3J84o2K9J9Mlj85J47J22j92j1J12J34k00j11K0L28
5393A70j68N4J4j19m9L64l18J17q2j34P4M1L0Q8j09k3nj5J23k9j06J50o8J4j5
5418ao2J87j89O5j4m2m0J55m9J30p9m7L2r7J04K8j49RL15l28J26l3P8j09PM6K6
5445F9l06L23J2j90J64j79J00J79j60Q5j33L9K13l32K07j3j13N7m6j12K11j93
$$ plain form
5467 -118 -84 75 -229 -84 -62 -102 105 150 -3 -96 -94 -89 89 -94 42 33 -144 187 158 -37 98 -113 86 138
5491 138 -40 162 -41 44 86 7 -91 115 -118 94 -84 77 222 -47 -20 22 -244 -60 71 118 79 -37 -89
5514 -89 101 -65 19 -16 -99 123 62 -177 227 -196 -20 57 20 48 -6 -6 107 -219 43 36 -132 72 -68 -29 -28
$$ packed form
5467a18L4J59l04J45K2m0K07M5j53r3KNJ78j83J36rj77L31k9j95J35k11J99N2
5491A38j78K02k03Q5M2p9r8K06k33K12j78J61J45k69K7M2k66J84J31M7l9j16n2
5514h9J90j66Q4l5q3K22o1k39M04m23J76P7l7K8n4%J13l26K62pj68K04j40L9J
$$ [...]
8191e1
##END NTUPLES=NMR FID
##END=
