##TITLE=1H_Pr 53125
 CDCl3
 8 sc, 
 8.12.2021
##JCAMPDX= 6.0         $$ Bruker NMR JCAMP-DX V2.0
##DATA TYPE= NMR FID
##DATA CLASS= NTUPLES
##ORIGIN= UXNMR, Bruker Analytische Messtechnik GmbH
##OWNER= root
$$ XWIN-NMR		Version 3.5
$$ Wed Dec  8 13:58:28 2021 Russian Standard Time (UT+4h)  she@DPX200
##.OBSERVE FREQUENCY= 200.131346
##.OBSERVE NUCLEUS= ^1H
##.DELAY= (6, 6)
##.ACQUISITION MODE= SIMULTANEOUS
##.ACQUISITION SCHEME= undefined
##.AVERAGES= 8
##.DIGITISER RES= 18
##SPECTROMETER/DATA SYSTEM= spect
##.PULSE SEQUENCE= zg30
##.SOLVENT NAME= CDCl3
##.SHIFT REFERENCE= (INTERNAL, CDCl3, 0, 15.7039)
##AUDIT TRAIL= $$ (NUMBER, WHEN, WHO, WHERE, WHAT)
$$ ##TITLE= Audit trail, XWIN-NMR		Version 3.5
$$ ##JCAMPDX= 5.01
$$ ##ORIGIN= Bruker BioSpin GmbH
$$ ##OWNER= she
$$ F:/spectra/data/she/nmr/H-F/1/audita.txt
$$ ##AUDIT TRAIL=  $$ (NUMBER, WHEN, WHO, WHERE, WHAT)
(   1,<2021-12-08 13:56:51.46 +0400>,<she>,<DPX200>,
      <created by zg, POWCHK disabled, PULCHK disabled
       configuration hash MD5:
       00 E9 B6 7A A2 85 ED C7 34 08 36 98 17 FE 4E 26
       data hash MD5: 16K
       7D C9 67 79 C9 69 D1 59 71 AE EE 77 7E D8 79 FC>)
$$ ##END=
$$ 
$$ hash MD5
$$ E4 15 16 F0 4A 05 0C D8 34 FB B7 5E D9 2B 37 4C
##$RELAX= 
##$RELAX= 
##$RELAX= 
##$RELAX= 
##$RELAX= 
##$RELAX= 
$$ Bruker specific parameters
$$ --------------------------
##$DU= <F:/spectra>
##$EXPNO= 1
##$NAME= <H-F>
##$PROCNO= 1
##$TYPE= <nmr>
##$USER= <she>
##$AMP= (0..31)
100 100 100 100 100 100 100 100 100 100 100 100 100 100 100 100 100 100 
100 100 100 100 100 100 100 100 100 100 100 100 100 100 
##$AQSEQ= 0
##$AQ_mod= 1
##$AUNM= <au_zg>
##$AUTOPOS= <>
##$BF1= 200.13
##$BF2= 200.13
##$BF3= 200.13
##$BF4= 200.13
##$BF5= 200.13
##$BF6= 200.13
##$BF7= 200.13
##$BF8= 200.13
##$BYTORDA= 1
##$CFDGTYP= 0
##$CFRGTYP= 5
##$CHEMSTR= <none>
##$CNST= (0..31)
1 1 145 1 1 1 1 1 1 1 1 1 1 1 1 1 1 1 1 1 1 1 1 1 1 1 1 1 1 1 1 1 
##$CPDPRG= <>
##$CPDPRG1= <>
##$CPDPRG2= <>
##$CPDPRG3= <>
##$CPDPRG4= <mlev>
##$CPDPRG5= <mlev>
##$CPDPRG6= <mlev>
##$CPDPRG7= <mlev>
##$CPDPRG8= <mlev>
##$CPDPRGB= <>
##$CPDPRGT= <>
##$D= (0..31)
0 1.2 0 0 0 0 0 0 0 0.06 0 0.03 0 0 0 0 0.0002 0 0 0 0 0 0 0 0 0 0 0 0 
0 0 0 
##$DATE= 1638957410
##$DBL= (0..7)
120 120 120 120 120 120 120 120 
##$DBP= (0..7)
150 150 150 150 150 150 150 150 
##$DBP07= 0
##$DBPNAM0= <>
##$DBPNAM1= <>
##$DBPNAM2= <>
##$DBPNAM3= <>
##$DBPNAM4= <>
##$DBPNAM5= <>
##$DBPNAM6= <>
##$DBPNAM7= <>
##$DBPOAL= (0..7)
0.5 0.5 0.5 0.5 0.5 0.5 0.5 0.5 
##$DBPOFFS= (0..7)
0 0 0 0 0 0 0 0 
##$DE= 6
##$DECBNUC= <off>
##$DECIM= 32
##$DECNUC= <off>
##$DECSTAT= 4
##$DIGMOD= 1
##$DIGTYP= 9
##$DL= (0..7)
0 120 120 120 120 120 120 120 
##$DP= (0..7)
150 150 150 150 150 150 150 150 
##$DP07= 0
##$DPNAME0= <>
##$DPNAME1= <>
##$DPNAME2= <>
##$DPNAME3= <>
##$DPNAME4= <>
##$DPNAME5= <>
##$DPNAME6= <>
##$DPNAME7= <>
##$DPOAL= (0..7)
0.5 0.5 0.5 0.5 0.5 0.5 0.5 0.5 
##$DPOFFS= (0..7)
0 0 0 0 0 0 0 0 
##$DQDMODE= 0
##$DR= 18
##$DS= 0
##$DSLIST= <SSSSSSSSSSSSSSS>
$$ [...]
##$SUBNAM2= <"">
##$SUBNAM3= <"">
##$SUBNAM4= <"">
##$SUBNAM5= <"">
##$SUBNAM6= <"">
##$SUBNAM7= <"">
##$SUBNAM8= <"">
##$SUBNAM9= <"">
##$SW= 18.0517287032376
##$SWIBOX= (0..15)
0 0 2 0 0 0 0 0 0 0 0 0 0 0 0 0 
##$SW_h= 3612.71676300578
##$TD= 16384
##$TD0= 1
##$TE= 0
##$TE2= 300
##$TE3= 300
##$TEG= 300
##$TL= (0..7)
0 120 120 120 120 120 120 120 
##$TP= (0..7)
150 150 150 150 150 150 150 150 
##$TP07= 0
##$TPNAME0= <>
##$TPNAME1= <>
##$TPNAME2= <>
##$TPNAME3= <>
##$TPNAME4= <>
##$TPNAME5= <>
##$TPNAME6= <>
##$TPNAME7= <>
##$TPOAL= (0..7)
0.5 0.5 0.5 0.5 0.5 0.5 0.5 0.5 
##$TPOFFS= (0..7)
0 0 0 0 0 0 0 0 
##$TUNHIN= 0
##$TUNHOUT= 0
##$TUNXOUT= 0
##$USERA1= <user>
##$USERA2= <user>
##$USERA3= <user>
##$USERA4= <user>
##$USERA5= <user>
##$V9= 5
##$VALIST= <valist>
##$VCLIST= <CCCCCCCCCCCCCCC>
##$VD= 0
##$VDLIST= <DDDDDDDDDDDDDDD>
##$VPLIST= <PPPPPPPPPPPPPPP>
##$VTLIST= <TTTTTTTTTTTTTTT>
##$WBST= 1024
##$WBSW= 4
##$XGAIN= (0..3)
0 0 0 0 
##$XL= 0
##$YL= 0
##$YMAX_a= 213295
##$YMIN_a= -356350
##$ZGOPTNS= <>
##$ZL1= 120
##$ZL2= 120
##$ZL3= 120
##$ZL4= 120
##$ABSF1= 10
##$ABSF2= 0
##$ABSG= 5
##$ABSL= 3
##$ALPHA= 0
##$AQORDER= 0
##$ASSFAC= 0
##$ASSFACI= 0
##$ASSFACX= 0
##$ASSWID= 0
##$AUNMP= <proc_1d>
##$AZFE= 0.1
##$AZFW= 0.1
##$BCFW= 1
##$BC_mod= 2
##$BYTORDP= 1
##$COROFFS= 0
##$CY= 11.3945322036743
##$DATMOD= 1
##$DC= 2
##$DFILT= <>
##$DTYPP= 0
##$F1P= 2.36226072786647
##$F2P= -0.459571619588291
##$FCOR= 0.5
##$FTSIZE= 0
##$FT_mod= 4
##$GAMMA= 1
##$GB= 0.15
##$INTBC= 1
##$INTSCL= 1
##$ISEN= 128
##$LB= 0.24
##$LEV0= 0
##$LPBIN= 0
##$MAXI= 10000
##$MC2= 0
##$MEAN= 0
##$ME_mod= 0
##$MI= 1.114404
##$NCOEF= 0
##$NC_proc= 0
##$NLEV= 6
##$NOISF1= 3.799351
##$NOISF2= 2.8
##$NSP= 1
##$NTH_PI= 0
##$NZP= 0
##$OFFSET= 15.70392
##$PC= 1
##$PHC0= -15511.83
##$PHC1= 10.0008
##$PH_mod= 1
##$PKNL= yes
##$PPARMOD= 0
##$PSCAL= 0
##$PSIGN= 0
##$REVERSE= no
##$SF= 200.130013532006
##$SI= 16384
##$SIGF1= 3
##$SIGF2= 2
##$SINO= 400
##$SIOLD= 16384
##$SREGLST= <1H.CDCl3>
##$SSB= 0
##$STSI= 0
##$STSR= 0
##$SW_p= 3612.71676300578
##$SYMM= 0
##$S_DEV= 0
##$TDeff= 0
##$TDoff= 0
##$TI= <>
##$TILT= no
##$TM1= 0
##$TM2= 0
##$TOPLEV= 0
##$USERP1= <user>
##$USERP2= <user>
##$USERP3= <user>
##$USERP4= <user>
##$USERP5= <user>
##$WDW= 1
##$XDIM= 8192
##$YMAX_p= 0
##$YMIN_p= 0
$$ End of Bruker specific parameters
$$ ---------------------------------
##NTUPLES= NMR FID
##VAR_NAME=  TIME,          FID/REAL,        FID/IMAG
##SYMBOL=    X,             R,               I
##VAR_TYPE=  INDEPENDENT,   DEPENDENT,       DEPENDENT
##VAR_FORM=  AFFN,          ASDF,            ASDF
##VAR_DIM=   8192,          8192,            8192
##UNITS=     SECONDS,       ARBITRARY UNITS, ARBITRARY UNITS
##FACTOR=    0.0002768,     1,               1
##FIRST=     0,             0,               0
##LAST=      2.2672688,     0,               0
##MIN=       0,             -356350,         0
##MAX=       2.2672688,     213295,          0
$$ Real data points
##PAGE= N=1
##DATA TABLE= (X++(R..R)), XYDATA
$$ [...]
1481E28j82P5N9j79L36l78k2K42n32J60j21j17L7l07K3n6k07J88N0k34L73k9p5
1504c68L11j66M11j11NL11j91K33j9k76M21q6o5J43j25j58r5j20J17m12m1K68
1526a3m67N9K67l67J36p3n5K87j44J55K95m5k55K35K78L62n41J33L72l30L08j83
1548D14n8L8Jj47k09l68J17Q8j97J95m83L85j67l96O34j58l84N34j0J09oj97N64
1571B99k39J99J18L2J03j7o4R0l18K58k12j65J44n8k36P9k85MK12n18J29J62j82
1594d65J33j39Q8K76k36K87j28K8L62k0mJ94JJ36o7k96L90k00Pl1k84J83k21k58
1618b64J44j30j78R2r7L6m8NJ17N7J08K65n11N09n9L5J22m0J89K44k65j7Q5o4
1642C35J57l35j6J97m83L56p9m41K15N0j82m39J64K42j31k2N4mJ29J49o2L43j97
$$ plain form
1481 528 346 421 480 301 637 259 237 479 -53 107 -14 -131 -94 -401 -378 -434 -641 -453 -403 -637 -264 -293 -368
1504 -368 -57 -223 188 77 82 393 202 435 416 140 561 475 410 553 428 270 175 55 172 -240 -281 -13
1526 -13 -480 -421 -154 -521 -385 -458 -513 -226 -370 -215 80 35 -220 15 293 655 114 247 619 289 597 414
1548 414 356 394 395 248 39 -329 -212 -124 -321 -126 -609 -224 -391 -787 -153 -311 -695 -161 -171 -62 -68 -265 299
1571 299 60 259 377 409 512 495 431 521 203 461 249 84 228 170 -66 13 -272 -268 -56 -574 -445 -283 -465
1594 -465 -332 -471 -383 -107 -343 -56 -184 -156 206 186 182 376 377 513 446 150 540 340 347 316 32 215 -6 -264
1618 -264 -120 -250 -428 -336 -433 -397 -445 -440 -323 -266 -158 107 -404 105 46 81 203 163 352 596 331 314 399 335
1642 335 492 157 141 338 -145 211 132 -309 -94 -44 -226 -665 -501 -259 -390 -412 -358 -362 -233 -84 -146 197 0
1665@Q9K24Njr9p2K43k15K38N8l49J71J87k80l12J26j18l6m21K44j23j94L33l2
1689c34j6M3l4K56j31K9M02P2KP4q2L8QkM3Q4j49J6k11J59k39r8K57l38q8Q6l11
1716d64K02L0j43N8j13J04M10m81K84J34p3J42j28L52j2k63L98p0m6J61k00L8
1738C20o2k95J16N9j75qj86J22j87L9J30l33J08K31l37J42mj05K00J31K4K78m5
1761A63m9L55j18J13n2k07K31j85J49k94k01K23m75K40J12l08R3o4k31K65k6l4
1783c00M4OK76k13J07J79j61J11K27m7J2j0R2J48j48p5J02j38n7j02j26pj56J05
1807a31l4j81J27j82q6L44j49JK35l28J65J79j28K29k52L98R5l42K46K16q2J50
1829D90k48j1J20l28L33j83k53K23k49J02j13j14l1j79O0R8j36K29k3l1K44n2
$$ plain form
1665 0 89 313 318 317 218 146 389 174 412 470 121 292 479 199 -113 13 -105 -141 -562 -318 -441 -635 -302 -334
1689 -334 -350 -307 -341 -85 -216 -187 215 287 289 363 281 319 327 325 368 452 303 319 108 267 28 -70 187 -151 -239 -153 -464
1716 -464 -262 -232 -375 -317 -430 -326 84 -397 -113 21 -52 90 -38 314 302 39 437 367 321 482 282 320
1738 320 258 -37 79 138 -37 -45 -231 -109 -296 -257 -127 -460 -352 -121 -458 -316 -320 -425 -225 -94 -70 208 163
1761 163 114 469 351 464 412 205 436 251 400 106 -95 128 -347 -107 5 -303 -210 -274 -505 -240 -266 -300
1783 -300 -256 -250 26 -187 -80 99 -62 49 276 229 241 231 323 471 323 248 350 212 155 53 -73 -80 -236 -131
1807 -131 -165 -346 -219 -401 -487 -143 -292 -291 -56 -384 -219 -40 -168 61 -191 207 302 -40 206 422 340 490
1829 490 242 231 351 23 356 173 -80 143 -106 -4 -117 -231 -262 -441 -381 -283 -419 -190 -213 -244 0 -52
1851e2j21L67k07Q5J71KK09k88J97q1K1M4m2j15J78l11n3K56m24j0j04k00L10
1874a68j76j48L31k58K18M2J62K8j55J63J61k31L45j23q8J77L2o3J17l20L29k43
1896A32L1P7l22N5l2j16r4j7O7l3n8k14K73j57L81j23M6L64k48O0J57j69K59r1
1920B28l3K81k17NP8l21K18k08j46K02j21K8j43j27J81j69M8L3l11J70J08j35
1942c51K43l7q3K58j74M45n2j01J93m5r7J83j16j3m0p7K63k33k90J40k11R0j3
1965a18k19J82j43Nj4J4J01Rj60K65m6r9K69NM8J73q9J46l0J5N5k78Q6Q4j52N7
1991A66j76j1M4l00K93m3r7j00p2K25l9k71K59j12q4K31P8j13J78j47L05K5j12
2014A27K97j7j11n1l2O0j58n8O7r9l2j19n8Pnj13J56k66K96j5l91L76q6J98Pj31
$$ plain form
1851 -52 -173 194 -13 72 243 245 454 166 363 282 303 347 305 190 368 57 4 260 -164 -174 -278 -478 -168
1874 -168 -344 -492 -161 -419 -201 -159 3 31 -124 39 200 -31 314 191 103 280 312 249 366 46 375 132
1896 132 163 240 -82 -27 -59 -175 -269 -286 -219 -252 -310 -524 -251 -408 -27 -150 -104 260 12 72 229 60 319 228
1920 228 195 476 259 264 342 21 239 31 -115 87 -34 -6 -149 -276 -95 -264 -216 -183 -494 -324 -216 -351
1942 -351 -108 -145 -228 30 -144 301 249 148 341 296 199 382 266 253 213 136 399 166 -124 16 -195 -105 -118
1965 -118 -337 -155 -298 -293 -307 -293 -192 -183 -343 -78 -124 -223 46 51 99 272 183 329 299 314 369 91 177 261 109 166
1991 166 -10 -21 23 -277 16 -27 -124 -224 -296 -71 -110 -381 -122 -234 -318 -87 -9 -122 56 -91 214 239 127
2014 127 424 407 296 245 213 273 115 57 124 25 -7 -126 -184 -177 -182 -295 -139 -405 -109 -124 -515 -139 -225 -27 -20 -151
2040a51J73M6k9L50o4k91J77M2K3j5j96R2j61O3J62j32lj11k83J85j83j32K52
2063a86p5oQ8k64K65K9l6L40j10N1L1j7R6l0M5K21k63j84K28j29R3l5P5k22m6
2088d1j5J10l74L11k80m7N7K3O0j13M7k6K88o3m4J23K78j83K2K97l80O8K98j67
2112B49n5j33N4Q2k44M2o9K1L1j32K3J23l32M6K85j99K11j79l5K38j71J37p5j12
2136a94L87R0l5m3j23J17O9l9J91k85j46K31k94O7k0k13L50l27pPj03K05j61K9
2160b47Q7j58J62J14j14P9J80n1J54j04O3L09l10K21j15l5J0k4j20Qk55O7j46
2183b25k0L6j06O0J75k22J75O1k52J09K8J13P5j28K13M8K3O5j98K41J38j21k5
2206B63J0j65K37k87j29J57j31Mo7r4J14j01Rn0k4K91k3o4M1k86K26J68j56Q4
$$ plain form
2040 -151 22 68 39 389 325 34 211 253 276 261 65 157 -4 59 221 89 86 -25 -308 -123 -306 -438 -186
2063 -186 -261 -267 -179 -443 -178 -149 -185 155 45 96 127 110 206 176 221 442 179 -5 223 94 187 152 227 5 -41
2088 -41 -56 54 -320 -9 -289 -336 -279 -256 -196 -309 -262 -288 0 -63 -107 16 294 111 133 430 50 118 416 249
2112 249 194 61 115 197 -47 -5 -74 -53 -22 -154 -131 -8 -340 -294 -9 -208 3 -176 -211 27 -144 -7 -82 -194
2136 -194 193 283 248 205 82 199 268 229 420 135 -11 220 -74 -7 -27 -240 110 -217 -224 -217 -320 -115 -276 -247
2160 -247 -160 -318 -156 -42 -156 -77 103 52 206 102 165 474 164 385 270 235 245 221 101 109 -146 -79 -225
2183 -225 -245 -209 -315 -255 -80 -302 -127 -66 -318 -209 -181 -68 7 -121 92 140 163 228 30 271 409 288 263
2206 263 273 108 345 58 -71 86 -45 -41 -108 -202 -88 -189 -180 -230 -254 37 14 -50 -9 -295 -69 99 -57 27
2230B7K05l94K89M7J2r0J46P6m6j85J82l88NJ49j84J44k57k2K56l12o1K38j53
2253c16J22o1P3J10j63L81j37k8J62l8J11Q3k63K34K10n90L05m7l6Q9k05J09r1
2276A4j99K01l81J54k1j08K14n7j2J47j11j07K84j4O2j62K48R5k81K58J60k18
2298A66J72k83J35J86k26j80J35p1J64j52l25J12J6L4J78l19M2K0m5J47k30L51
2320B7j45J38L37j49j04J46R2l01J52r8J22o5k0m4Q5Pk97L6K04k12k91N04k22
2343i8q8M1j90K16o7p6P6M5M7J02k13L98k49K81j13n4J80L8k16K60k31j19K55
2366B25j89M6n2j14R7j61P7j13j07K23j93m6Q1r5J30J44k83J33L45j82L7K7J88
2389B18J01j07J7p5L5m6j25J97K5l36L20k87j04K83k81j62K69j54O5J53m50J83
$$ plain form
2230 27 232 -162 127 174 186 96 242 318 272 87 269 -119 -114 35 -149 -5 -262 -284 -28 -340 -401 -163 -316
2253 -316 -194 -255 -182 -72 -235 146 9 -19 143 105 216 299 36 270 480 -110 195 148 112 201 -4 105 14
2276 14 -185 16 -365 -211 -232 -340 -126 -183 -195 -48 -159 -266 18 4 66 -96 152 247 -34 224 384 166
2298 166 338 55 190 376 150 -30 105 34 198 46 -279 -167 -151 -117 61 -258 -216 -196 -241 -94 -324 27
2320 27 -118 20 357 208 104 250 342 41 193 95 217 152 132 88 173 180 -117 -81 123 -89 -380 124 -98
2343 -98 -186 -145 -335 -119 -186 -262 -186 -141 -94 8 -205 193 -56 225 112 58 238 276 60 320 89 -30 225
2366 225 36 82 30 -84 13 -148 -71 -184 -291 -68 -261 -307 -226 -321 -191 -47 -330 -197 148 -34 3 30 218
2389 218 319 212 229 154 189 143 18 215 240 -96 224 -63 -167 116 -165 -327 -58 -212 -147 6 -444 -261
2411b61K7L1Q4k4O5J07k4L03k22LM22l03j30J50L2Q6k66j3nL9j5r3Lj03r6L4L9
2438a30j29J23k02l0J31l9J28J25o7J45r0K16j1j86K28K8n5J87k68M8L2p1j4m4
2462E5k03J19L6j32m9j22L7N5j54R0j1J68j6J08Q5p9J15Q9n3j47J74j86K84o6
2486A97k6K02l21K5J01j52J38m0k81K13k03O3m0k29K25j36J49k1m8R4K1j91K91
2509C1j75K15N0J22K9N4j68Pj4J82l8k10Q4Rj29N8j57q8J51j37J9n2r0J02oj54
2535c05j9J09k1M67l79qJ84K5J64k78K55k1q4K88K3k58LK02l4j18k19N6p1j4n8
2560a11j39J62j82qJ30jQ6j24j22J88K47k32J12Pl6J23K7o4l3J85J5J00M1j36
2584B35l55L55r0k88J86r1o0P7j06k8%j79J80r5L1J45k13K76rj28M47l55L27m
$$ plain form
2411 -261 -234 -203 -119 -143 -78 29 5 308 86 89 511 208 78 228 260 346 80 67 62 101 86 -7 -4 -107 -203 -169 -130
2438 -130 -259 -136 -338 -368 -237 -276 -148 -23 -90 55 -35 181 170 -16 212 240 185 372 104 152 184 113 99 55
2462 55 -148 -29 7 -125 -174 -296 -259 -204 -358 -268 -279 -111 -127 -19 66 -13 102 191 138 -9 165 -21 263 197
2486 197 171 373 52 77 178 26 164 124 -157 56 -147 -84 -124 -353 -128 -264 -115 -136 -184 -90 -69 -260 31
2509 31 -144 71 121 243 272 326 158 165 151 333 295 85 169 178 49 107 -50 -138 13 -124 -105 -157 -247 -145 -151 -305
2535 -305 -324 -215 -236 231 -148 -156 28 53 217 -61 194 173 89 377 400 142 145 347 313 195 -24 32 -39 -53 -111
2560 -111 -250 -88 -270 -278 -148 -149 -63 -187 -309 -121 126 -106 6 13 -23 100 127 63 30 215 230 330 371 235
2584 235 -120 235 145 -143 43 -48 -108 -31 -137 -165 -165 -344 -164 -259 -228 -83 -296 -20 -29 -157 290 -65 262 258
2608B58j66Q6L9j30K71k16J86ql02RJr6L6j13j8J14l83K77k5j4N8j34n6K85jL5
2634gJ03q3O6j6J70J01k39K50j09l4J13l69K63j76N4L9p9k01J67j21L8k68R5O9
2658a74j63LK20O4J02j66p3J65k4J10Q9K3j20J28kM8p9j14K66q7o3j16MJ36k34
2683e7j8J57l04J63j79J2L8j3o4R2n7K13p7J03Q9j06K19j01O4K1M2j02J66j0j76
2708A15J91j53n6r7O7J67k92P9k3k92K59r5k75K74k0j62K60j25J3J54J08l2q9
2731b4J32j12P9Q3KJ49q8m8J61J8l66J8R3k36j1l9O7J27k81J96o4m6J74k22R9
2756a39Q5j22K96j23j02K54k29J66R3k1rJ40k0j56M7R5j58j31J35o1Jj37q1J75
2780bj70l3Q3N8k66L14j53J33j66J17P5j6O2K1k11K59p6K9L62m42J25K0J52k15
$$ plain form
2608 258 92 178 217 87 358 142 328 320 18 27 28 -68 -32 -145 -163 -49 -432 -155 -180 -194 -136 -270 -326 -41 -42 -7
2634 -7 96 13 79 63 233 334 95 345 236 202 315 -54 209 33 87 126 47 -154 13 -108 -70 -338 -243 -174
2658 -174 -337 -334 -114 -50 52 -114 -187 -22 -46 64 153 176 56 184 182 230 151 37 303 216 153 37 41 177 -57
2683 -57 -75 82 -222 -59 -238 -226 -188 -201 -265 -173 -230 -17 -94 9 98 -8 211 110 174 195 237 135 301 291 115
2708 115 306 153 97 0 67 234 -58 21 -2 -294 -35 -130 -405 -131 -151 -313 -53 -178 -165 -11 97 65 -24
2731 -24 108 -4 75 158 160 309 221 173 334 352 -14 4 97 -139 -150 -189 -122 5 -276 -80 -144 -190 -16 -238 -139
2756 -139 -54 -176 120 -3 -105 149 -80 86 179 158 149 289 269 113 160 255 97 -34 101 40 41 -96 -177 -2
2780 -2 -172 -205 -122 -64 -330 -16 -169 -36 -202 -85 -10 -26 36 57 -154 105 29 58 420 -22 103 123 275 60
2804F0J16nj14k5r0l9k36K29j03K5J20k47J66L3m1O8k4n7K00p1J45j63Q1R3k0
2829A01J10j11jJ27O5k05K25j29k61K53k93P3Q0j30L9j03o3J68m7pJ30k51J20
2852a10j90J46K74k83L3L95j35N8j0j0n7K2J03o2p7n6r4N9R0r6N7k82l1J90K4
2877d2j60R8j19q3L72k22Q4O4J6O0q1R8n1J31q0j17K26O7j84J79j17j2j15O6j60
2902h2q2j88L53k24Q2M6j96Q2j09J23J19O8k69K27k3K7j7J33Pq5K40rr3J70j5
2927B85j43J29j92o0J58l31M5J60j69J39j44M7j11P3j08P0n6J09M3n3J01l6J62
2950A18j24n5L19r3%r3p1L07l6j4j03k06J4J63k29J87k95M4J10j11n1J68j10J50
2974a1j3j60K20m2P6j92L2J35pl5J56k03K84J99m28K58l03Q5J71p6j46O3k73K76
$$ plain form
2804 60 176 171 57 32 -58 -97 -333 -104 -207 -182 -62 -309 -143 -110 -151 -83 -107 -164 36 -35 110 -53 28 121 101
2829 101 211 100 99 226 291 86 311 182 -79 174 -119 -46 34 -96 -57 -160 -223 -55 -102 -109 21 -230 -110
2852 -110 -300 -154 120 -163 -130 265 130 188 178 168 111 133 236 174 97 41 -53 6 96 0 57 -225 -256 -66 -42
2877 -42 -202 -104 -223 -306 66 -156 -72 -8 8 68 -13 85 34 165 85 -32 194 261 77 256 139 127 12 78 -82
2902 -82 -164 -352 1 -223 -141 -95 -291 -209 -318 -195 -76 -8 -277 -50 -73 -46 -63 70 77 -8 232 223 130 300 285
2927 285 142 271 79 19 177 -154 -109 51 -118 21 -123 -76 -187 -114 -222 -152 -208 -99 -56 -109 -8 -44 118
2950 118 -6 -61 258 165 165 72 1 308 272 258 155 -51 -37 126 -103 84 -211 -167 -57 -168 -219 -51 -161 -11
2974 -11 -24 -184 36 -6 70 -122 -90 45 38 3 159 -44 240 439 11 269 -34 51 222 146 0 63 -210 66
2998F6q8m8K3k55L02j20j34K52j29J6J77q1O5Q7j14M6J17J5K5k19j9R3R6l6R5
3023B32m2n7j54J32j52k4J14r3j91J26L1J20j15k93MO7K35P4k15L27n9o6q7O4
3047b2J23K1P3k7L8qL3rj34R0j61Op0k03K37r8L0r9o2K96j20l4J19o0k01J26J56
3074D0L4j03J0OJ35J7M8q4M3R0q4n7Ln6J1j71K34j42j67K15k2j62J45k58R3L0
3100a52J27K4j47P4O6oO4k7n9J25j03l2J78Q9J27k76J8K12j90M4r0j89J72j08
3124e9p8R7J49n8j83j3k3j02K48k3k0J80lk50J11J15J9M9j67Q7J44j04Kl3j9O1
3150A27jrk5q0L4j76K4J72l03l1K8LQ2q2K0K08k68K58L0j9K12k11K47j4o0J01
3176B67k6j58L38l24lR5k53K70m8k19R5r5rj65P7J70n1k97J59P7K4M1j8J76j53
$$ plain form
2998 66 -22 -70 -47 -302 0 -120 -254 -2 -131 -115 62 -19 46 133 19 65 182 197 222 3 -16 77 173 137 232
3023 232 190 133 -21 111 -41 -65 49 -44 -235 -109 -78 42 -73 -366 -362 -295 -60 14 -201 126 67 1 -86 -22
3047 -22 101 122 195 168 206 198 231 222 88 178 17 23 -47 -250 -13 -111 -81 -180 -242 54 -66 -100 19 -41 -242 -116 40
3074 40 74 -29 -19 -13 122 139 187 103 146 236 152 95 98 42 53 -118 116 -26 -193 22 0 -162 -17 -275 -182 -152
3100 -152 -25 -1 -148 -74 -8 -14 50 23 -36 89 -14 -46 132 221 348 72 90 302 112 156 66 -123 49 -59
3124 -59 -137 -40 109 51 -132 -145 -168 -270 -22 -45 -65 115 112 -138 -27 88 107 156 -11 76 220 116 118 85 66 127
3150 127 126 117 92 12 46 -130 -106 66 -237 -268 -240 -237 -155 -237 -217 -9 -277 -19 11 -8 204 -7 240 226 166 267
3176 267 241 83 421 97 94 189 -64 206 158 -61 34 -61 -70 -235 -158 12 -39 -336 -177 -100 -76 -35 -53 123 -30
3201c0J6J11o8J95j45J08Q8j15o9J01k00K77k07lJ13l13RK9p2R9j43J05J64j90
3225a40r6J71k13K43n2N0J06M7k07K88q5Q1R0k68K42j05K3j11K4M9j48n3R5j8
3249A3j72Q5j0L4k2j06P8K03m03J00J17k8L1j3J35l2K3J37j54K81j43JP6l4j98
3274aK08k78J55n1p7N4k38J85L8j66J73k15l8%L24j64rJN0J16l3R2k55K02m5L9
3300F7M3P4j68R7j99K64r2k03K81l30J07m3J23n6J08j89L8N6j13N9j35K40j56
3323a27J46k5J21j89J79j15J93j03j05J28nk06K54j6j0m3k72J64ql9J1n9l8J20
3347d4k41J92j19J58NK7K3nN2j06J16O3j31J28J28j59J03n9j55K10Lj77L9j19
3371f8k07M39m17J60m1k49K97N4j59J83k02R3j5M6J78n2j12K77k06l2J54n9J09
$$ plain form
3201 -30 -14 97 29 224 79 187 275 160 91 192 -8 269 62 59 172 -141 -132 -103 -175 -76 -219 -114 50 -140
3225 -140 -236 -65 -278 -35 -87 -37 69 116 -91 197 112 193 283 15 257 152 175 64 88 137 -11 -64 31 13
3249 13 -159 -74 -84 -50 -72 -178 -100 103 -300 -200 -83 -111 -80 -93 42 10 33 170 16 297 154 155 231 197 -1
3274 -1 207 -71 84 33 -44 10 -228 -43 -5 -171 2 -213 -251 -251 73 -91 -100 -99 -49 67 34 126 -129 73 28 67
3300 67 110 184 16 113 -86 178 86 -117 164 -166 -59 -102 21 -35 73 -116 -78 -22 -135 -76 -211 29 -127
3323 -127 19 -6 115 -74 105 -10 183 80 -25 103 98 -108 146 130 120 77 -195 -31 -39 -78 -67 -126 -164 -44
3347 -44 -285 -93 -212 -54 -49 -22 1 -4 48 -58 58 121 -10 118 246 87 190 131 -24 186 189 12 51 -68
3371 -68 -275 164 -253 -93 -134 -383 -86 -32 -191 -8 -210 -117 -132 -86 92 40 -72 205 -1 -33 121 62 171
3394A71l0J7J79j93J1k05J11J57l02J05P2k33M3L9q6K37p5k03M2p6K54j63q4K29
3418A7k61R3L02k73K59M3j66P2l8Q6MM2j22N8j02R3k21K8M0n2N0j12q9K36k57
3443b70J53M1l8Q1J2m9M3j33J78K51k51pR3J08k10J28R4p9j58J81j65J07M0j73
3467b3k5j96M3R0J40k34J91k04J50J0O3n8J43r4J3p1J76M1k20K45r6r5K43j06
3491A26j08J28j19O7m7Q1K4k39j70K25j0J28j87J01R5k72J77k5k91J46J5J90j49
3514a14J26n8K21m8Kj41K03%r7l1k4j53K56o6j8Q9l10J95j82m6J66j09P3Jj54
3539b19K2km3J27J46j33M1J34jQq0J88k02R3J63j87K01j41n9Q6j17m9L3j04K04
3564A09j05o3J02l42K15n6P3K4j21J78J33j70R5j9o6J57L7j24J84n7j65J83n4
$$ plain form
3394 171 141 158 337 144 155 -50 61 218 -84 21 93 -140 -97 -58 -144 93 18 -185 -143 -219 35 -128 -212 17
3418 17 -244 -151 151 -122 137 180 14 86 48 134 138 180 58 116 14 107 -114 -86 -46 -98 -48 -160 -249 -13 -270
3443 -270 -117 -76 -114 -33 -21 -70 -27 -160 18 269 18 11 104 212 2 130 224 145 -13 168 3 110 150 -23
3467 -23 -48 -244 -201 -111 29 -205 -14 -218 -68 -58 5 -53 90 -4 9 -62 114 155 -65 180 84 -11 232 126
3491 126 18 146 27 94 47 128 152 -87 -257 -32 -42 86 -101 0 95 -177 0 -25 -316 -170 -155 35 -114
3514 -114 12 -46 175 127 129 -12 191 191 94 63 39 -114 142 76 58 147 -163 32 -150 -196 -30 -139 -66 -65 -219
3539 -219 -197 -199 -242 -115 31 -102 -61 73 72 80 0 188 -14 79 242 55 256 115 56 142 25 -24 9 -95 109
3564 109 4 -59 43 -299 -84 -140 -67 -43 -164 14 147 -23 72 53 -13 144 181 57 241 184 19 202 148
3587A48n9n9n4J29j12L0n6k9o3J6P2q4L3j5J08j91J88O1j37M2l7K06j48o7M8L15
3613B85j99J31k38Q1J02p8R9q0j28J54j58k4ro2LK1p8R6q5o7R5j03R5k1J68oj61
3640a67J41J58r9K12k08lRk6J89j17NM8j37O2J5j53l8K21k72O1j4O2M1k44J86
3665f8p8J45j45L4PQ1p4Q3J05q5J55J9j41Q9p8O8o8%K11k90L8N5k79K41k12K27
3691D0j30n8R2j76Q7N2j50J24J34q6J03pj65J45J08l4J03j17Q9k43K04N8l0j28
3715A5J33j09K5Qk07J72k43K60j42j89K77j41n5J95jj38J58M8J3n2pM3KJ07Nj66
3741A1J11L6p5m9NQ5k2j82R3q0N5r6O5J14k73k3J26M5k67M32k64K31j45j71L74
3766A36j31j07J15J35k78L23L3M8l2m0j50j03J96j07m8J0r6O7J2o7J63j95o2J36
$$ plain form
3587 148 89 30 -24 105 -7 23 -33 -62 -125 -109 -37 -121 -88 -103 5 -186 2 63 -74 -32 -69 137 -11 -78 -30 285
3613 285 86 217 -21 60 162 84 183 103 -25 129 -29 -53 -62 -124 -121 -100 -178 -82 -167 -234 -139 -242 -147 -168 0 -6 -167
3640 -167 -26 132 33 245 37 34 43 17 206 89 94 142 5 67 82 -71 -109 112 -160 -99 -113 -51 -10 -254 -68
3665 -68 -146 -1 -146 -112 -105 -24 -98 -15 90 5 160 179 38 127 49 117 49 49 260 -30 8 63 -216 25 -187 40
3691 40 -90 -148 -56 -232 -145 -93 -243 -119 15 -71 32 25 -140 5 113 79 182 65 154 -89 115 173 143 15
3715 15 148 39 64 72 -135 37 -206 54 -88 -277 0 -141 -196 -1 -2 -140 18 66 79 27 20 63 65 172 177 11
3741 11 122 158 83 34 39 124 102 -80 13 -67 -12 -108 -43 71 -202 -225 -99 -54 -321 111 -153 78 -67 -238 136
3766 136 5 -102 13 148 -130 193 226 274 242 202 52 -51 145 38 -10 0 -96 -29 -17 -84 79 -116 -178 -42
3790d2p3J3k2P1M2j00J53J09j60Q3J09j71Q2L7k5O6p1p6L6O7j13J33k7j45k9j69
3816b22Q8O4j18J20r8L2Pm4N0j56N00l37J44J42j6r4P0j25K21j76o6J54j02K3
3840F1N2j17l6N2j05Q0k50K66J2M0k63L9Q0P2j75J78q7j02p9J16J93L0J40j46
3864E1k9J0J53m0j25R6o1nJ70k26m1M3p7J92l68N0J52j2mj3qq8R6n6J25k9J71
3891A27j43R7J8j7N2R0j91K11j59j66L25j34j1J85l30J32j18k7K6p6R7k42M1K12
3915aj41N6p6J7J07J11K9j44j51K21R5j40J36j17J7R7r6J13n8r3K35k02lp1ML8
3941a7o5j82K71j5j16j0j09K46p6K2J28j55J33P5j47L0L8lJ03j24j9J33j45J56
3965A52q7j0K2j92P0j3m1J16j34m0J53j65j05J30L4J68q1k1J39k30J75l3j18K51
$$ plain form
3790 -42 -115 -102 -124 -53 -11 -111 42 151 -9 74 183 12 94 131 106 172 101 25 61 128 15 148 121 -24 -53 -222
3816 -222 -134 -70 -188 -68 -166 -134 -127 -171 -121 -277 223 -114 30 172 156 62 132 7 228 52 -14 140 38 61
3840 61 113 -4 -40 12 -93 -13 -263 3 15 55 -208 -169 -89 -17 -192 -14 -101 -203 -282 -166 27 57 197 51
3864 51 22 32 185 145 20 116 55 50 220 -6 -47 -4 -81 111 -257 -207 -55 -67 -71 -84 -92 -180 -84 -140 -15 -44 127
3891 127 -16 81 99 82 134 224 33 244 85 -81 244 110 99 284 -46 86 -32 -59 -33 -109 -12 -254 -213 -1
3915 -1 -142 -86 -162 -145 -38 73 102 -42 -193 28 123 -17 119 2 19 116 20 133 75 -18 217 15 12 -59 -55 -17
3941 -17 -82 -264 7 -8 -124 -134 -243 3 -73 -51 77 -78 55 130 -17 13 51 48 151 27 8 141 -4 152
3965 152 65 55 77 -115 -45 -58 -99 17 -117 -157 -4 -169 -274 -144 -110 58 -23 -44 95 -135 40 7 -111 140
3989A40L6j46R4kj4J52l17J50j18Q6J5j75J44Q2r8j30Jp4M3n6J12J7r5J89j41
4014a05R1K26l37K4J36j03j4J16J44p5Rj3M2j27K08l52R1J48m49M29k18J02L0
4037Cr3o6L2K4n3K07j49o9K03q5J37MQ3o3j35Q5j3Q3j12N7n5l4QJ40j15J00j82
4064e8J15j5r4k18K01P6j25J53k56J05J30n6O3j21k5K05p4J1Q4R9j53j8MjJ89
4089B21k63J80q7n9l0M0K5q5M0n1l9RK6j9K3j3j08J85j15k5J79q3J77m0J7j0q3
4116A2K19k88K40M9j91P3o5N0j13m1Q6j61K6K18j87J4r3J65j16J11j55R2Q1o9
4140d3m1J85J8L0j93J38lM4J30j94J96k70J21j20k9N7m2J1N5j83Lk0M8Q2L1j42
4166a31m8J95j3k7m9m0J13j25J83qk25L19j80N8J08k5r2RQ4j35J56j39P1j39J6
$$ plain form
3989 140 176 30 124 122 108 260 -57 93 -25 61 76 -99 45 127 29 -101 -100 -174 -131 -187 -75 -58 -153 36 -105
4014 -105 -14 212 -125 -101 35 -68 -82 34 178 103 112 99 141 14 222 -130 -39 109 -340 89 -129 -27 3
4037 3 -90 -156 -124 -100 -153 54 -95 -164 39 -46 91 95 178 115 -20 65 52 135 23 80 25 -9 -1 139 24 124 -58
4064 -58 57 42 -52 -270 -69 7 -118 35 -221 -116 14 -42 21 -100 -125 80 6 17 101 200 47 29 33 32 221
4089 221 -42 138 51 -8 -38 2 27 -58 -18 -69 -108 -99 -73 -92 -69 -82 -190 -5 -120 -145 34 -49 128 88 105 95 12
4116 12 231 -57 183 232 41 114 49 99 -14 -55 31 -130 -104 114 -73 -59 -152 13 -103 8 -147 -55 26 -43
4140 -43 -84 101 119 149 -44 94 91 135 265 71 267 -3 118 -2 -31 26 -16 -5 50 -133 -130 -150 -102 -20 11 -131
4166 -131 -179 16 3 -24 -73 -113 0 -125 58 50 -175 144 -36 22 130 105 13 22 106 -29 127 -12 59 -80 -64
4191f4L5o2P6p6J65j11r0k2K43j11q6j7O5J1J59j6k17o4K94m0o2J01m4J66k86
4216e3o0J81m9m3pm9J47p6N7j77k7J95J4n5Q5j81M6P1k4q5J14k9J06k0q2O3j30
4243f8j2K81j23pJN3k72J79Qj1j26J5J22k16J89k84K43j0j43J00L1J30j02j94
4267b16J78m4o2L02j39P6Klj8m5J1J24j48r5N8J7m2P6k65L62m6j49j4K7O1j56
4293a48N9R8j81J56N2K06l93J82L9N5q7OO2n1Q6n7R1j15j44N2N7k4P3k2j12j5
4319g5J66j53O4k13J22K06j77J55l4mq7qJ92j30m9K78l17P3J97j54K9J8%o3p2
4344c6k9J55k00J21q0j08L9Q6J6j05J3J54l6k01J56J7J5J63j56P3l9J30K0j79
4368a1J22kQ0q6n1p0rK7R4j93n2J28j1r1J6QL8m7J94k23L7jK66j61j2J18j87J54
$$ plain form
4191 -64 -29 -91 -15 -91 74 -37 -127 -149 94 -17 -103 -120 -55 -44 115 99 -118 -182 112 72 10 111 67 233 -53
4216 -53 -113 68 19 -24 -31 -80 67 -9 48 -129 -156 39 53 -2 83 -98 -52 19 -5 -90 24 -5 101 81 -1 62 -68
4243 -68 -80 201 78 71 72 125 -147 32 40 29 -97 -82 40 -176 13 -271 -28 -38 -181 -81 -50 80 -22 -216
4267 -216 -38 -82 -144 158 19 95 97 94 76 31 42 166 18 -77 -19 -2 -44 32 -233 129 83 -66 -80 -53 8 -148
4293 -148 -89 9 -172 -16 36 242 -151 31 70 125 38 44 106 55 141 84 175 60 -84 -32 25 1 74 52 -60 -75
4319 -75 91 -62 2 -211 -89 117 -60 95 61 57 -30 -38 154 24 -25 253 -64 9 206 52 81 99 99 36 -36
4344 -36 -65 90 -110 11 -69 -177 -138 -52 -36 -141 -128 26 -10 -211 -55 -38 -23 140 -16 57 18 148 168 -11
4368 -11 111 109 189 103 52 -18 -27 0 94 -99 -151 -23 -34 -125 -109 -101 -63 -110 84 -139 -102 -103 163 2 -10 108 -79 75
4396G5n9K11j61r5J43M6k45J85o3nR1j88K38j26n1q5k9J29k84K74m4j4J48k68
4420a77R0K10j57P0m8r6J31k5j0J8J25l9P9r4j41J53j59J20l8J1Q6k16N1M3p2
4445h5p3J66j26J29M0j27P0o6P9p5l8J93j37J11q3OK24r2K8m1m0rJ12k87K62j08
4471C3J0o6o1R8o3l1O3j07K1J71p1j40R0K2N7n6j4k4J62p4K4L6J10j3k41J71j38
4498c1K8J10k07kJ25p3j12rJ81J7j94N1O7J10j81j38J86J00J0L3Kn6oP1m6M4j48
4525f8J41O1K3k55K68j72J40j87J95k06o3J72J52j39j3j8l0l4J6j41q0L24m2j88
4549a44J64J5j30J5J70K3j97P8nJ28J37j69k19PJ59P8j60O8j87K36j23M3j9M3
4573A1p7P0n5M5r1J30m8k3N9K7o6mK45k37J50j59R7j46J78j09q7m7J17kL7J05
$$ plain form
4396 75 16 227 66 -29 114 160 -85 100 37 32 123 -65 173 47 -4 -89 -118 11 -273 1 -43 -57 91 -177
4420 -177 -87 123 -34 36 -12 -108 23 -2 -12 6 131 92 171 77 -64 89 -70 50 12 23 109 -107 -56 -13 -85
4445 -85 -158 8 -118 11 51 -76 -6 -72 7 -68 -106 87 -50 61 -22 -16 208 116 144 103 63 54 166 -121 141 33
4471 33 43 -23 -84 14 -49 -80 -17 -124 -103 68 -3 -143 -53 -31 26 -30 -44 -68 94 20 44 80 190 177 -64 107 -31
4498 -31 -3 107 -100 -102 23 -50 -162 -171 10 27 -167 -116 -49 61 -120 -258 -72 28 38 71 73 17 11 82 36 80 -68
4525 -68 73 134 157 -98 170 -2 138 -49 146 -60 -123 49 201 62 49 31 1 -33 -17 -158 -238 86 44 -144
4549 -144 20 35 -95 -80 90 113 -84 -6 -11 117 254 85 -134 -127 32 110 -50 18 -169 67 -56 -13 -32 11
4573 11 -66 4 -51 -6 -97 33 -15 -38 21 48 -18 -22 223 -14 136 -23 74 -72 106 -3 -90 -137 -20 -22 15 120
4599A20j78J42k47K06r6r1J52nJ4O4l4l5j88K15l0L5P6m6O0n0k6M4n2L3m7Q9j33
4626hj30J33k2L8J0l1j49q2J39Q9j76KJ05r0J41K39j64J0P8j79q3P4K6qJ05l1
4652C6M9o2PR6m2J0N1k96J14O5j74K34j45j3k0K1J17n9j86J36k9Q9Mr5J40j91
4678a43J65k0L7q5J05j34N3K30k53P9J8p2j9m6N3n5o2M8oN3J07m7O1L8j39l6K0
4705e0J67n1Q6j95J24j2L6j73j7K43r7K8j8k61J85m7J46r1j92J06m7J28p8J00
4729B0n1kn4K0M9q5P1jK25p8j60P5l4n2J60okj16P2J02k05K55r8j03J7l7j58M9
4757a27K79k30O9q5j39J62p4P9N4q2N5M2k8o5J37p6l8J27J8m3l4Q7j10J39m2r7
4783b2J0K7Nk8n8J9np4J45n0o5J95j58P4m5o2J28l0J29k8j4Qm7m2O5m9N2J53k71
$$ plain form
4599 120 -58 84 -163 43 -53 -144 8 3 17 81 47 12 -176 39 9 44 120 74 134 84 58 102 50 83 36 125 -8
4626 -8 -138 -5 -27 11 21 -10 -159 -241 -102 -13 -189 -187 -82 -172 -31 208 44 54 132 -47 -130 -56 -30 -38 67 36
4652 36 85 23 30 126 84 94 145 -151 -37 28 -146 88 -57 -70 -90 -69 48 -11 -197 -61 -90 -1 3 -92 48 -143
4678 -143 22 2 39 -46 59 -75 -22 208 -45 34 52 -20 -39 -85 -32 -87 -149 -101 -107 -54 53 6 67 105 -34 -70 -50
4705 -50 117 66 152 -43 81 69 105 -68 -85 158 61 89 71 -190 -5 -52 94 3 -189 -83 -130 -2 -80 20
4729 20 -31 -33 -87 -67 -18 -103 -32 -33 192 114 -46 29 -5 -57 103 97 95 -21 51 153 -52 203 105 2 19 -18 -176 -127
4757 -127 152 -78 -9 -94 -233 -71 -145 -66 -12 -94 -39 3 -25 -90 47 -29 -67 60 78 35 1 88 -22 117 75 -22
4783 -22 -12 15 20 -8 -66 -47 -52 -126 19 -31 -96 99 -59 15 -30 -92 36 6 135 107 93 101 54 12 77 28 80 233 -38
4812c8J64j47R4l0M6k1j41k9m8R7k9Q0R4K1k64Q1j4P9L9P0O9l4k3j45J75j14J59
4839A91r4j5Rn7j34J14P2j17J44o2K6n4O7n8m8k9PJ18j43O7n7P3j3j07K23k55
4865a32J10J9M7m1Q4Q5k92J20p1P6M1K0j20Q4j21P9J8J03j82K27q9k56L27l5q5
4890A6j34K35j50p9N3L0j27K69j20N0J13r2P9j46J21N3j30m6J77j42p0J5q8J24
4914A1k2l8k7k0pJ9J50j93jQ0N0n5N9j81K99j83Q9PJ6j32K28J52k83m2n6J62j16
4941c4J07l0J3J5q7k3l7%k61L44L9M8j11M5k1p6K02k13Q7j3j22J88j05J10n8J45
4967A52pk00J78o2m3oj09R3o6l1J8J67n4j23P8m1Q6K6l22J88K64k51M2P1n5j10
4993a17J35l9K1N4Nn4j6q3K73j8k94K09q9p5j35P4K29j99Q8J6k6J8j39p0J91J85
$$ plain form
4812 -38 126 -21 73 43 89 68 -73 -102 -150 -53 -82 -2 92 113 -151 -70 -84 -5 34 104 173 139 116 -29 146 32 191
4839 191 97 82 91 34 -100 14 86 -31 113 51 77 23 90 32 -16 -45 -38 80 -63 4 -53 20 7 -100 123 -132
4865 -132 -22 -3 44 3 87 172 -120 0 -71 5 46 66 -54 30 -91 -12 6 109 -73 154 65 -191 136 101 16
4890 16 -118 117 -33 -112 -59 -29 -156 113 -7 43 156 64 143 -3 118 171 41 -5 172 30 -40 -25 -113 11
4914 11 -11 -49 -76 -96 -103 -84 66 -127 -128 -48 2 -53 6 -175 124 -59 30 37 53 -79 149 301 18 -24 -80 82 -34
4941 -34 73 43 56 71 -16 -39 -76 -76 -337 7 46 94 -17 28 7 -69 133 -80 7 -6 -128 60 -45 65 7 152
4967 152 145 -55 123 61 18 12 -97 -4 -70 -101 -83 84 30 -93 -15 -56 30 56 -266 -78 186 -65 -23 48 -7 -117
4993 -117 18 -21 0 54 59 5 -11 -94 179 161 -133 76 -13 -88 -223 -149 80 -119 -31 -15 -41 -23 -162 -232 -41 144
5019A44p5J3o8Om6J05j4N2n9J38k62j3J01M9j12J26j03j49K00p0N1J4m0j65J53
5044b4J4j7J58k31K35j29PP7j39J18J3J4j17j90L22J16k11l4R3j24j3J81k59K15
5068G5j59l7K09k82J01K6o8K06n2Npj38L11k16j10K44j00M5Q9p8j20J05R3j7j02
5093B3k8M0N7Q9o1r8M6k79M04j70n9P9j70j0Q9Oj02Q0J15p8p6L5K29j68P4O5n6
5120G6k4j39J43J5kN8n6OMj09L2K9L5n6p9L5j63N8K37kq7L8J9on2Oj80K54r2N4
5150E2L7L1Mk69J61J17l8k4Q7p4j01L5n0n0Q1p1P6n7o5Q2M3N4j37J20K9p5k6R3
5178F5n9j14J82L4j30K8P2j20O2r7J0L0J60k16R9k8Qj03J68r9k4O0o0J07pm1J16
5205A03m9O2j37J4J4m3K31j14pj2j16J09m7J5kL8j44J26j9P1j29LJ56l07N4N2
$$ plain form
5019 144 69 82 14 20 -26 79 65 117 58 196 -66 -79 22 71 -41 85 -18 -167 33 -37 14 28 -12 -177 -24
5044 -24 -10 -27 131 -100 135 6 13 90 -49 69 82 96 -21 -211 111 227 16 -18 75 -49 -62 119 -140 75
5068 75 -84 -121 88 -194 -93 -67 -135 71 19 24 17 -121 190 -26 -136 108 8 53 142 64 -56 49 142 125 23
5093 23 -5 35 92 181 120 22 68 -211 193 23 -36 43 -127 -137 -48 -42 -144 -64 51 -27 -103 -68 161 -7 67 132 76
5120 76 52 -87 56 71 69 127 71 77 81 -28 4 33 68 12 -67 -32 -195 -137 100 98 11 49 68 62 10 16 -164 90 -2 52
5150 52 89 120 124 -145 16 133 95 71 158 84 -17 18 -32 -82 -1 -72 4 -53 -118 -36 7 61 -76 44 73 -2 -28 65
5178 65 6 -108 74 108 -22 6 78 -42 20 -77 -67 -37 123 -93 6 -22 -14 -117 51 -48 -72 -12 -72 35 28 -13 103
5205 103 54 116 -21 -7 7 -36 195 81 74 62 -54 55 8 23 21 59 -85 41 22 93 -36 -33 123 -184 -130 -78
5231g8o6J78j00j05J85j21k4L28j84J10q0MJ25j66J40p7r4J90j25l8K0J07q8j0
5255C1P2o5m8p5j2J0R6O9j20K0j34L4J54p8Q4j8j9lj10Q2R6n0J55m8j07J24j31
5282Ij6l8MR2q0K3m9J69j03K9o4J09p5j23J48N7k9k50K36J2J26p4q3M5r1K7J47
5309A58r7K5o6j01J14L0p0J4j53K00m3j47J19m9k6J09j06M6j70L01k23J82m5m9
5333d7J42l1n0J2J11j63M7l6K8j32N2R5n2J0K1r9K56l08J5O4r4K41k17P8N6j17
5359a18M7k1Q9o0q5L45k10p5J33m1J24j54K6qRj7Q7j51k6J08N9k8l5n6j9J13j03
5386f7jJ12M4j08k0j19K39j5p5q0R3j11P7p0J72l2j9j5o2J21%k59K20n6J2pO7
5413D1Jj65K3L2J46j63m0J11l1n4R6j03j6J12R1r1l8J14Oj72J3K16o0r8ML1R5
$$ plain form
5231 -78 -144 34 -66 -171 14 -107 -131 197 13 123 43 47 172 6 146 69 -25 165 40 2 22 129 41 31
5255 31 103 38 -10 -85 -97 -87 9 78 -42 -22 -156 -122 32 -46 38 20 1 -2 -112 -30 66 16 171 123 16 140 9
5282 9 -7 -45 -41 51 -29 -6 -55 114 11 40 -24 85 10 -113 35 92 63 -187 49 61 187 113 30 75 -16 11 158
5309 158 61 86 20 -81 33 63 -7 7 -146 54 11 -136 -17 -66 -92 17 -89 -43 -213 88 -135 47 2 -47
5333 -47 95 64 14 26 137 -26 21 -15 13 -119 -67 28 -24 -14 7 -92 164 -144 -129 -65 -159 82 -135 -57 -1 -118
5359 -118 -71 -92 -3 -63 -148 197 -13 -88 45 4 128 -26 0 -8 1 -16 71 -80 -106 2 61 33 -2 -58 -77 36 -67
5386 -67 -68 44 88 -20 -40 -159 80 65 -10 -90 3 -108 -31 -101 71 39 20 5 -57 64 64 -195 25 -31 -19 -26 41
5413 41 42 -123 -100 -68 78 -85 -125 -14 -45 -99 -3 -106 -122 -10 81 -10 -48 66 72 -100 -87 129 69 -29 -25 6 101
5440A01j15JK10k06K3J17k22l3Q5J0l7K5L6k0n7J75r2l2K8o7J80q5L9o6Q9n2J1
5467D6j04K12j96J6j32M49l26N1n0K8q3L4l4j05J15Q5q0k1o1Q5K08j57l7K3J09
5492G5j66k9m0J1J35Q5L7j32O5mj0P7r3M1N0k0k04J47lj18J31K6q9J12k37O9j37
5519b21J55J09Ln7j02k5K23j34J18Qj73J6J18RQr4J09j73J52l3LK2M9k97J95j22
5545a34o8K80n5P4r9n5J51k44L9J08j15K50j50K7r1J28j7Mj0n5N4m4M7j13n8J69
5571B3j83R8j12M13j44j24O2L7k34mJ93j54J96q6n0q8K21n9J56j12M3K1Kj65J60
5596A10n5r9KJ14j43M5J29p6n3j12K39l7n1j08J4J28l6o5J05L2q9N0m2j07nQ2
5622b8l7O1%k3pj15M09k53j1l2k9K13k17M3k7J27o6J0L5j36J79m0j29O9J47j71
$$ plain form
5440 101 -14 -13 197 -9 14 131 -91 -124 -39 -29 -66 -41 -5 -25 -82 93 1 -31 -3 -70 110 25 64 -2 87 35 46
5467 46 -58 154 -42 -26 -158 291 -35 16 -34 -6 -89 -55 -89 -194 -79 6 -74 -95 -156 -71 137 -20 -57 -34 75
5492 75 -91 -120 -160 -149 -14 71 108 -24 41 37 27 104 11 52 102 82 -122 25 22 -96 35 61 -28 84 -153 -84 -221
5519 -221 -66 43 46 -11 -113 -138 85 -49 69 77 -96 -80 38 47 55 -39 70 -103 49 16 19 41 90 -207 -12 -134
5545 -134 -202 78 23 97 -2 -57 94 -150 -111 -3 -118 132 -18 9 -82 46 29 33 23 -32 22 -22 25 -88 -146 23
5571 23 -160 -62 -174 239 95 -29 33 70 -164 -168 25 -129 67 -19 -69 -157 64 5 161 49 92 113 115 -50 110
5596 110 55 -44 -42 72 -71 -26 103 27 -26 -138 101 64 13 -95 -81 47 11 -54 51 83 -6 44 2 -105 -110 -28
5622 -28 -65 -4 -4 -27 -34 -149 260 7 -4 -36 -65 148 -69 -26 -53 74 8 18 53 -83 96 56 -73 -4 143 -28
5648b8n0J08L6m4J37k87Q8pR7L9p8n2N6N0k39J34K9p9MJ05j09k7J98o3m4O9l7
5675Fjj01N7qP9R8j17O9n0k15J56j3J67r7J7l4Q2l2j28pQ1j6r0M4J7l2O5m0K7
5704a6j01J96j48R2j27L1k1M0J48r5P0o5J54n8k0j17J53j25J5K8R9n3j28Q9M3
5729H4O3j71k4j4JrP6K3Q8j71P8l7r9J36j33l0R3k0J08M0n0P2j01J26o8q2l7j33
5757a91J29M1J1K01k85J55J5k3k0p9l4J43j49lQ4j25K34j69J17j34j0K02R1j21
5781H0j56L2p0P5p3m1K00J4j20J06O0j78j55K48j3o5JK39p9j37K6r4LJ20j3J00
5807A10n0jk6M7j00j9J33j37nL5M3j31o4L13j91k6M1j75J33r3J41r6LJ19K3l8
5833a1j24P6O7l7j2Q9m9mJ50j91J37M9k15J26p5J9N1j47R2L01k57k2R3k19j47
$$ plain form
5648 -28 -78 30 66 22 159 -128 -40 -47 50 89 11 -41 15 65 -174 -40 -11 -90 -86 19 -90 -117 81 18 -26 43 6
5675 6 5 -96 -39 -47 32 130 13 82 32 -183 -27 -40 127 30 47 13 95 63 -65 -72 9 -7 -97 -53 -36 -68 -3 -43 -16
5704 -16 -117 79 -69 23 -104 -73 -94 -54 94 -1 69 4 158 100 80 -37 116 -9 6 34 133 80 -48 41 84
5729 84 147 -24 -48 -62 -61 -70 6 29 117 -54 24 -13 -112 24 -109 -139 -46 -66 42 82 32 104 3 129 61 -21 -58 -191
5757 -191 -62 -21 -10 191 -94 61 76 53 33 -46 -80 63 -86 -89 -5 -130 104 -65 52 -82 -92 110 201 80
5781 80 -76 -44 -114 -39 -112 -153 47 61 -59 47 107 -71 -226 22 9 -56 -55 184 105 -32 -6 -100 -97 23 10 110
5807 110 60 59 33 80 -20 -39 94 -43 -48 -13 30 -101 -165 148 -43 -69 -28 -203 -70 -163 -22 -118 -115 4 27 -11
5833 -11 -135 -59 8 -29 -41 48 -1 -5 145 -46 91 140 -75 51 -24 -5 46 -101 -9 292 35 13 106 -113 -260
5858b60K69M0l7L2J04k31qR5m2J01m1o4J07j35R0O0k41P8R7M2N0r0Q1j47k5J36
5884F1o7L4j58K80o1k7r6Q3R2p6l1mj31N3K03j27q6N6J41r0J02j71K28k69r7J38
5910b0J42o1l9J8Ok7j8P9j3k23K29k23J23O8j25qQ2j04R1j2nn7Q6L7j51K55r6
5937C4M6mK1L2o2j24J16j51k9K88k22R8l4o2J05j45J53On6q3l6M2J6R9r9J66k25
5964a10nL7O2O7q2O3j26P4k1nR3r9k3L7j27J80O4j11O4j34O3O4K4j43J32q2j6
5991f0j2P1j9j2j2j18N9K4P1p6k0O2n5J15m5j22J44J25n4l9L0n3j47K09M3j42
6017c3J25l1N7j77J01PN7o8p4K7N6j73O5K0L3J12p3m5p8M6J08j10j16J63j65J81
6043A5j02Ln2M0q6J91j43J21O9M4J00l17l9J56O0j08J80m0j5j35P1O7m8O1p7R3
$$ plain form
5858 -260 9 49 12 44 148 -83 -91 4 -38 63 22 -42 65 -70 20 80 -161 -83 14 56 106 16 97 -50 -75 61
5884 61 -6 28 -130 150 89 62 -34 49 141 65 34 30 -101 -48 155 28 -58 -2 139 49 151 -20 208 -61 -158 -20
5910 -20 122 61 22 40 46 19 1 80 67 -156 73 -150 -27 41 -84 -92 -10 -114 -23 -35 -40 -97 -11 26 -125 130 34
5937 34 80 76 97 129 67 -57 59 -92 -121 167 -55 43 9 -53 52 -93 60 66 10 -73 -109 -67 -51 48 -51 115 -110
5964 -110 -115 -78 -16 51 -31 32 -94 -20 -41 -46 47 -52 -75 -38 -165 15 79 -32 32 -102 -39 25 49 -94 38 -44 -60
5991 -60 -72 -1 -20 -32 -44 -162 -103 -79 -8 -84 -104 -42 -97 18 -27 -149 -5 120 66 27 57 4 -143 66 109 -33
6017 -33 92 61 118 -59 42 49 106 38 -36 -9 47 -126 -61 -41 -8 104 31 -14 -92 -46 62 -48 -164 -1 -166 15
6043 15 -87 -84 -136 -96 -182 9 -134 -13 56 100 200 -117 -156 0 60 -48 132 92 77 -58 13 80 32 93 16 109
6069A09J7j37k8L6o2j16M13l70J36j35q6L40j32p4M2J46j79N6M0j17J14J08j37
6092a6k4Q9P8Q7j01j56M6j4p1N5J72j17J9j28J5q1K46M0j58k3J73j96qn1%K05
6118H1k5K0K2j34j33J25K00l43J56l0k2P0O8O9p4l0J3k02J32O8j22n5L7N7j3m
6144f9k6K12p9J03j22M0o9R9j20J60r7LJ47k27J28j88O9J28l4Rj39J80l13R8L4
6169g3o0L5K6j8l9K33j34j7l1Q4r9R0J12j38R8j21J25j2oK65l62m6J94k02J37
6194D1L8j07Q6j97R7O0o4NJ12j35n7O7o9J41o8OM1J3j1r6J61m3j5r7J55l7p3K39
6222A93k78LJ98j96J74p0j4p4J15j61J12j28J22j91R9o2O4K27j26j03M5n7PJ38
6246C7l7R5J9j01j29J26Q7j32q3kJ87p7M0j81K32q0q6j6M5K2oM8J7Q1Pj02k16
$$ plain form
6069 109 126 -11 -39 -3 -65 -181 232 -138 -2 -137 -223 117 -15 -89 -47 99 -80 -24 16 -101 13 121 -16
6092 -16 -40 49 127 214 113 -43 3 -11 -82 -27 145 28 47 -81 -66 -147 99 139 -19 -42 131 -65 -73 -124 -124 81
6118 81 56 76 98 -36 -169 -44 156 -187 -31 -61 -83 -13 55 124 50 20 33 -169 -37 31 -91 -146 -109 -52 -65 -69
6144 -69 -95 117 38 141 19 59 -10 89 -31 129 32 35 182 -45 83 -105 -36 92 58 67 -72 108 -205 -107 -73
6169 -73 -133 -98 -72 -90 -129 104 -30 -47 -78 6 -93 -3 109 -29 69 -52 73 61 55 320 -42 -88 106 -96 41
6194 41 79 -28 58 -139 -42 18 -46 -41 71 -64 -121 -54 -123 18 -50 -44 -3 10 -1 -97 64 21 6 -91 64 27 -46 193
6222 193 -85 -82 116 -80 94 24 10 -64 51 -110 2 -126 -4 -195 -96 -158 -94 133 7 -96 -51 -108 -101 37
6246 37 0 95 114 13 -116 10 97 -35 -118 -120 67 -10 30 -151 81 1 -85 -101 -56 -34 -40 8 25 106 113 11 -205
6273b05J74j6j17J85j39J53J53j46o8J8n6n4J09m7m2K8O6j7N9M5j71m4J03J5k
6298a6J4j16J52j06N5m0J6J01o4P0j41J10j34J0K14n2r9J27j6l6O0j16J2p5K63
6323A93k93J50k30J7J93N2Ko6k4o0Q6m9J01m3Q8r9J44j75R9j78Q9j36J17L4J3
6348B5R1j56J20j16P9m8rl7R2o3l2m4M4O8J66k96J82j18L3M6m2J36m0j22J30L4
6374A23m4j1Q4j50k1k2K27j20j19J66j13%Nl7K8j09K46j28j2R1l25J53J04M4K4
6399H4m5p1L7K1p9J67j00Q8m9J01j67R4j69J18j10K4oJ93ll07J21K70k20L3j02
6424g7L8J20k87J43J5J21p2nM5p2o0J21K8M6m9q3P0O8m3r2Nj00J61j16K6J84k71
6451a36k8J27Q5q8m5J09k9m5R3R8K9j38L4j3Lj11L8p9J51m4k1J72j23N0n1p4k3
$$ plain form
6273 -205 -31 -47 -164 21 -118 35 188 42 -26 -8 -64 -118 -9 -56 -98 -70 -4 -21 38 83 -88 -132 -29 -14 -16
6298 -16 -2 -118 34 -72 -17 -57 -41 60 -4 66 -75 35 -99 -89 125 73 -26 101 85 49 109 -7 5 -70 193
6323 193 -100 50 -180 -163 30 82 84 18 -6 -66 20 -29 72 29 117 18 162 -13 86 -92 -3 -139 -22 12 25
6348 25 116 -40 80 -36 43 -5 -14 -51 41 -22 -54 -98 -54 14 180 -116 66 -52 -19 27 -15 121 81 -41 89 123
6374 123 79 68 152 2 -19 -41 186 66 -53 113 0 0 5 -32 -4 -113 133 5 -7 84 -241 -88 16 60 84
6399 84 39 -32 5 26 -53 114 14 102 53 154 -13 81 -88 30 -80 -56 -62 131 128 -179 -58 212 -8 25 -77
6424 -77 -39 81 -206 -63 -48 73 1 -4 41 -31 -91 30 58 104 55 -28 42 110 67 -25 -20 -120 41 -75 -49 135 -136
6451 -136 -164 -37 48 -40 -85 24 -5 -50 43 141 170 32 66 53 56 -55 -17 -96 55 11 -10 162 39 89 38 -36 -59
6478e9N1J14j53K3J5O2K9p4r7Q0m0R9k74K17J28j16P5j49j12J99p4J76j86Q0j0
6503DK46k51j9m4J43j43l1P7M2l4l9Q9n6R1n6N2q6QP3K9j22J46j36Q8j17j72N9
6530a59L48j7l9k33R1L6o2N6j82M5MJ3k2JJ52J5j13J38p5R7r9k7L5l5J5J3J04
6557A00j71J61p4j36J86L9k36J41N0p1Mn3K80j83j61K16q8l8J23o1o1q6K5l8N5
6582g7j37K67LP3j52nJ41o2o3m4q1J11J12j45KJ65j14K4L2k12K38k54R6M9J65
6607A32j14j56J92o%q5JJ69k34J38J3j6k4p3Q9mO5j70J44j55MK73j74j1l2o3J26
6634B9m2J6m6q0K6J12o8J75k91K29k19K85j01Qk4j1k8P1m0J23j56N9j18R0K0%
6660A9O6j04R4j12n6l0j8K21q9p0K14j77J23j85m8M8J57J3q4O4J42k17L1r3J22
$$ plain form
6478 -59 -8 106 -47 -24 -9 53 82 8 -89 -9 -49 50 -224 -7 121 5 80 -69 -181 18 -56 120 -66 14 4
6503 4 250 -1 -20 -64 79 -64 -95 -18 24 -10 -49 40 -16 75 19 71 -15 -7 66 95 -27 119 -17 71 -46 -218 -159
6530 -159 189 172 133 -100 -9 27 -35 21 -161 -116 -112 -99 -121 -120 32 47 -66 72 -3 94 -5 -32 3 -32 -17 -4 100
6557 100 -71 90 16 -120 66 105 -131 10 60 -11 -7 -60 220 37 -124 92 4 -34 89 28 -33 -119 -94 -132 -77
6582 -77 -214 53 56 129 -23 -28 113 51 -12 -56 -137 -26 86 -59 -57 108 -6 18 50 -162 76 -178 -82 -33 132
6607 132 18 -138 54 48 48 -37 -36 133 -101 37 50 34 10 -63 26 22 87 -83 61 -94 -90 183 9 -2 -34 -97 29
6634 29 -13 3 -43 -123 -97 15 -53 122 -169 60 -159 126 25 33 9 -2 -30 41 1 124 -32 27 -91 -1 19 19
6660 19 85 -19 75 -37 -93 -123 -141 80 -9 -79 135 -42 81 -104 -152 -104 53 66 -18 46 188 -29 2 -91 31
6685C1j58K78k29N8J23j52j1J8N4Oj9r1M3J9M0P7Kk5q5k1J2M9n0P2p8p3M2J76
6713A08m9l9k2L8J6J76j63q2o6R0m4J05l5j09J78j05M8M2j70J9k4N1M0k9J61k19
6739h4K19nj03J32p7Q2j43o8p1KL17j96P8J5j31ROmJ62np5p4J7L1r1P9kn6P1K5
6769F0n9n6J20j74J50J10r3l5o0J02l5jR6l12O5J43j58K68l1K1j21J16j29kP9
6794F4k9j46Q3J41k28J61J47k32R3j44Q4k9nmR7J9M5r1j17J7L5J34r6O0r1j3J87
6821A42Jj77K8j66M4R0J00M3K2k57J98j86J89n0J8p4l7J16n4l5j3J12j05K5O9
6846D3J60k10o5K14n2k41P2J7m0J00j03K48p9j20o1K8Q7J79k28o6R4j7J03n1N1
6871F3K2j83Q2J37o6J20l31J79q0J14q7J45k5j90R3Kp6J21l7q9O1l4J3j9k9J15
$$ plain form
6685 31 -127 151 -78 -20 103 -49 -60 -42 12 18 -1 -92 -49 -30 10 87 89 64 -21 -42 -30 19 -31 41 -37 -110 -68 108
6713 108 59 20 -2 36 52 228 65 -17 -83 7 -37 68 33 -76 102 -3 45 87 -83 -64 -88 -37 3 -26 135 -84
6739 -84 135 130 27 159 82 164 21 -47 -118 -116 201 5 83 98 -33 -24 -18 -22 140 135 60 -14 3 34 -57 22 20 -36 35 60
6769 60 1 -55 65 -109 41 151 58 23 -37 65 30 29 125 -187 -122 21 -137 131 100 121 0 116 -13 -15 64
6794 64 35 -111 -28 113 -115 46 193 -39 54 -90 -6 -35 -40 -44 53 72 117 26 -91 -74 -39 95 -1 59 -32 -45 142
6821 142 143 -34 -6 -172 -128 -38 62 105 127 -130 68 -118 71 21 39 -35 -72 44 -10 -45 -58 54 -51 -26 43
6846 43 203 -7 -72 142 90 -151 -79 -62 -102 -2 -105 143 64 -56 -117 -89 -2 177 -51 -117 -23 -40 63 12 63
6871 63 85 -98 -16 121 55 175 -156 23 -57 57 -30 115 90 -100 -7 -5 -81 40 3 -86 -25 -59 -46 -65 -94 21
6897B1k5O2r0R7j11Q9j03K80k07lK7J3J58k28L0R6l1j12J16q2p1J5J46Qp3k04
6923a82L09j17j41Q6k7j14J38R1j5J29l48N5L9J67j90J04J53k87J78n2j36O5J42
6946D7L5j52N7nQ8p3J6N9j1p9Q0j73Q5MJ9M3K0O0k58P9J0J4l0J03L6j84K26l8
6974G8j61J85j25n5J63p5QL4p5q0Q2P9o5j39l8J94l7R2l2M9o6r0J94k52K17j2
7000G3jq0J9R2j23Q4j00QJ1m5R8p1J84k11N2m2J44k41J28L1o8l3K63k24J44r8
7026fN9J4j33M8N6M0j29N8PR8j26N6j03J2J11l4p4J35k10O3l9O4n7O0j1R1o5n8
7054g3J7mr8K76o4j52k8L15k33q0K35k28K91j33K8j31N7m0Q8O7k86Q5M1J07k5
7079C2oj37O3Q3r5PP1k0R0k24K29q9P6j30J11o8p9M1L6N0j03J18o1l8o0Q4Q3m2
$$ plain form
6897 21 -4 58 -32 65 -46 43 -60 220 13 10 37 50 208 -20 10 106 75 -37 79 -3 -74 -59 87 95 22 -182
6923 -182 127 10 -131 -45 -72 -186 -48 43 28 157 -191 -136 -97 70 -120 -16 137 -150 28 -24 -160 -95 47
6946 47 82 -70 -13 -18 70 -3 13 72 61 -18 62 -111 -26 -22 -3 40 60 120 -138 -59 -49 -35 -65 38 74 -110 116 78
6974 78 -83 102 -23 -78 85 10 18 52 -23 -103 -21 58 -7 -146 -184 10 -27 65 33 82 16 -74 120 -132 85 73
7000 73 72 -8 11 103 -20 64 -36 -28 -17 -62 36 -35 149 -62 -10 -52 92 -149 -21 10 -58 -91 172 -52 92 -6
7026 -6 53 67 -66 -18 38 78 -51 7 14 112 -14 42 -61 -49 62 28 -46 89 -121 -58 -97 -33 -90 -30 -41 50 -15 -73
7054 -73 -56 -60 -158 118 54 -98 -126 189 -44 -124 111 -117 174 41 69 -62 -5 -45 43 110 -176 -91 -50 57 32
7079 32 26 -111 -48 35 -60 -53 18 -2 88 -136 93 4 80 -50 61 -7 -86 -45 -9 41 -62 56 -5 -43 -103 -19 64 22
7107B2M4P8j95K03q6q9N8k9J06qJ32k27q6J27j16K4L3J00j10P6j08M4J20p6N0
7132H7k82OJ65N6j30L6R7j56J54j0o7N5l4J14j56N8K9r8Q6j3j16l4J03J53j72
7157f9K1J10pM9j23Kk3j5J59j01J25k53K31j15j69J88M2j6n7nj15K79j57J3J19
7182A13k85R0j22L45j68N5n4k9oJ07O6l7j2K9j49K6J02km8N0k0K6o8k1N3m7N2
7209D6%r6P7k3r9k1L6J40q7l0pK0R6K9r0j54J70o6k2J9K49k23m5J39J5p2j3k5
7237c7J5n9J58p7J12j61n6J33O8j80J22Jr3J27j11L0j1J4K06k69N5J0l7n3J51
7262E8o1q1R0J20j0n8k04K00q0J05q6m5K2M4P2m2L22m35p5J96q2K4J2J17Q9k68
7288e6K83l38k1J90j79J39j77N5M9q3J28l7N6L3N7j37J0Q8j87L01k73L2O5%m4
$$ plain form
7107 22 66 144 -51 152 66 -23 35 6 112 104 236 9 -77 50 -66 -42 -9 91 -19 57 -51 -7 113 37 87
7132 87 -195 -189 -24 32 -98 -62 35 -121 33 23 -44 11 -23 91 -65 -7 22 -76 10 -3 -119 -153 -50 103 -69
7157 -69 -48 62 55 104 -19 -17 -40 -55 104 3 128 -125 106 -9 -178 10 52 36 -21 -26 -141 138 -19 -6 113
7182 113 -172 -82 -204 141 -27 28 -26 -55 -61 46 112 75 63 92 -57 -31 71 69 21 71 51 77 9 -12 41 -6 46
7209 46 46 -50 27 4 -95 -116 -80 60 -27 -57 -64 -44 52 81 -9 -163 7 -59 -81 -62 187 -36 -81 58 73 1 -12 -37
7237 -37 -22 -81 77 0 112 -49 -105 28 96 -84 38 39 -54 73 -38 -8 -19 -5 201 -68 -13 -3 -40 -93 58
7262 58 -3 -84 6 126 116 58 -146 54 -26 79 -7 -52 -30 14 86 44 366 -69 -144 52 -30 -6 6 123 212 -56
7288 -56 227 -111 -132 58 -121 18 -159 -104 -55 -138 -10 -47 9 42 99 -38 -28 60 -127 174 -99 -67 -2 -2 -46
7313d6j0j05J84j43K87j58L3j38K09j09Pj55L39k47J42q1q0N1o7J02m4K19k36
7336d6q0K51j29Mp3L7rRj2QO2l1j74K99k9j54L3p8J46R5l9k32K57j21j20J10R2
7363G6l3j25J04K4q6pKj7LJ83qn3M6j80m7J54p7m0M2J0O1J39j19r5J47j00o9K59
7391A94j95p3O0n1L4QQ6j50J85j47oP6Q8q6rlR9j36J17k6j71M1J52j31p7P3qJ39
7419H3o%J2j57M1K36k33M2l9j22PK78k07M7k8n0Q4J9J16l23L20J2o5p8K3J77k99
7446a10K2l7K0P7m9k6L5j7J27O3j63J46j50J69j42j98K60r2M4O2k1r3J34j34O5
7471hp2LJ13j22l8K61j72k4P0r5N4O9k7O1n6n2J12j24Jk4k4P7N8k3M9L0q9pJ60
7500A61j4j69R3r2O9J8k43K66n2l7l4J0nJ10j88J91p2J6J5j5j54J19m8J74o9j05
$$ plain form
7313 -46 -56 -161 23 -120 167 9 42 -96 113 4 11 -144 195 -52 90 9 -71 -20 -87 15 -29 190 -46
7336 -46 -126 125 -4 0 -73 -36 -45 -36 -48 -40 22 -9 -183 116 87 -67 -34 -112 34 129 90 -142 115 -6 -126 -16 76
7363 76 43 -82 22 46 -40 -47 -45 -62 -59 124 116 63 109 -71 -118 36 -41 -81 -39 -29 32 171 52 -43 104 4 -65 194
7391 194 -1 -74 -14 -65 -31 -23 63 -87 98 -49 -55 21 109 23 14 11 110 -26 91 65 -106 -65 87 -44 -121 -48 -56 83
7419 83 77 77 89 -68 -27 209 -24 18 -21 -143 -136 142 -65 -18 -46 -96 -12 7 123 -200 120 132 67 -11 12 189 -110
7446 -110 -88 -125 -105 -28 -77 -103 -68 -85 42 105 -58 88 -62 107 -35 -233 27 -65 -21 41 20 -73 61 -73 -8
7471 -8 -80 -77 36 -86 -124 137 -35 -59 11 -84 -30 39 12 73 17 -35 77 -47 -46 -70 -94 -17 41 18 67 97 8 1 161
7500 161 147 -22 71 -21 48 66 -177 89 37 0 -34 -24 -29 81 -107 84 12 28 43 28 -126 -7 -55 119 50 -55
7526e5M9q1p7J85L3p5J74j48K3p8J75j42r0J92m5j84K02m8n2j34K84p3N7Nj78
7551h1Q6m6J80k21j9J29p1k2O5L7k7L0j17O9j6Q1j33K42k34J52m9j8L7j01lK2
7577b8j10J75M7qo1J8J06j57q0JK18j20k7o1K30k3k52J22Rj36K12k3J6J13j34
7602D7j21N0k2rL2N8m0q4K52J6j79L1L0j91J25r5K01k38N7l4K21l7r9J2N2p6j42
7629a83L82k00R3m5m7M2p6K7K2q3K9j22J18J17j37n4J20RL6j74k6l9J13J98j70
7654e0j6J82q9M4m2P0k30J34%j1j8k05J56K06j29n2k7J22n2M8j9k8O%k9K9N9l7
7682B2N9q9Kkk0l6j9P6J18k57K46Mj30Qm2K3N4j52Q8J55j66l7J21J8L0Q4j11n1
7710dJ4M5R4o1k6r2RO5M7j83J01M9o9M1Rk7q4j29L06k68K17o1J3j29J8K3R3J53
$$ plain form
7526 -55 -6 -87 -164 21 54 -21 153 5 28 -50 125 -17 -107 85 40 -144 58 10 -42 -176 108 35 92 97 -81
7551 -81 5 -41 139 -82 -101 28 -43 -65 0 37 10 40 -77 -8 -24 57 -76 166 -68 84 35 17 54 -47 -50 -28
7577 -28 -138 37 84 76 15 33 139 -18 -98 -97 121 1 -26 -87 143 120 -132 -10 -1 -137 75 52 68 181 47
7602 47 -74 -24 -46 -55 -23 35 -5 -89 163 179 0 31 61 -130 -5 -100 101 -137 -80 -114 107 70 -29 -17 35 -41 -183
7629 -183 199 -1 92 47 0 42 -34 -7 15 -68 -39 -161 -43 74 -63 -117 3 12 48 -126 -152 -191 -78 120 -50
7654 -50 -66 116 27 71 29 99 -131 3 3 -8 -26 -231 -75 131 2 -50 -77 45 -7 41 22 -6 0 0 -29 0 59 22
7682 22 81 -8 -6 -8 -28 -64 -83 -7 111 -146 100 104 -26 -18 -60 -37 17 -135 -47 108 -58 -95 26 44 74 158 47 -4
7710 -4 10 55 149 88 62 -30 -21 44 91 -92 9 58 -11 30 39 12 -72 -201 105 -163 54 -7 6 -123 -105 -82 11 164
7738A64k52L2J17j36J61j28j31J95J32q9m1m7k3O4j9R7j30q1k8K86q7j49M1j0
7762f2N6o9K0pM7j91M9J54j76L04j77J31j73J09O6j21R1q5K06j05q1l0M6O3j8
7787D7j37K37j12%p3p7O2R0p1j2J47q1P0J50l04l9J62j92K53j11J4J39k83J31
7811A0j1O3O3k02J10j33K11k70J07OM3o8K0N8Lm6Q1j27J72j23q8J26n6K4Q0o1
7837hj37J84M5j68o0J63R3j34k8l9J46R1j27j67J75n8M8O0m4j87P1n8J0J12P2
7862E5j86P0R8m4J8M7j4MJ9j02k6N3O2p6o1Q2q9J63m8Lk1q2J8J95j34k5mn5o2
7891a42mK47j11j7o9J68j06O3r3J84j96K2K0lK03j95K16k41K7m0J11r9J45Kn2
7916D0Mj5P8o7K9j60O9j37J79l4j75J36P3R8j61L9l7l5J25o3q5R4j34K18qj10
$$ plain form
7738 164 -88 -56 61 -75 86 -42 -173 22 154 65 24 -23 -46 18 -1 96 -34 -115 -143 143 56 -93 -52 -62
7762 -62 -6 -75 -55 -62 -15 -206 -157 -3 -179 125 -52 79 -94 15 81 -40 51 -34 172 67 -14 -44 2 65 47
7787 47 -90 147 35 35 -38 -115 -53 37 -34 -46 101 20 90 240 -64 -103 59 -133 120 9 23 162 -121 10
7811 10 -1 62 125 -77 33 -100 111 -159 -52 -46 -3 -71 -51 7 10 -36 45 -82 90 -33 -121 5 -51 -27 53 -8
7837 -8 -145 39 84 -84 -144 19 112 -22 -50 -89 57 148 21 -146 29 -29 19 79 35 -152 -81 -139 -129 -17 55
7862 55 -131 -61 37 -7 11 58 44 48 67 -35 -61 -8 54 -22 -83 -1 -90 73 25 28 7 -75 -57 138 4 -21 -25 -80 -142
7891 -142 -146 101 -10 -27 -96 72 -34 29 -64 120 -76 -54 -34 -37 166 -29 187 -54 -27 -67 44 -55 90 92 40
7916 40 44 29 107 40 69 -91 -22 -159 20 -14 -189 -53 20 118 -43 -4 -41 -76 49 -14 -99 -5 -139 79 71 -39
7942c9J22mp8k57K25r9L04r2m3k10L76j93kM9j00Ll3M4J10N9j68j9J17J05j64
7967A3N2k7j50K26n4p8M1J5j94R8p0J33j76K31J23k24J29q5l7N1ko6Lj37J75P3
7993F3p9l4L1m4J04j93J22K13p8j70P5j48J72p9l0K00k66J99J0l5p6J57j66M4
8017hJ92j14l18K59J25k72J61j61K47k68K16K7r7j5J0N3J00k53J25j01J87j09
8039a4O6J06j42m6q0J78j08J11pQ5m1o6l1pj0JP2qj30ok5J42j19ML3L5r6J66j21
8068e8n2K13k7l3k44J52J94n1p4p8l4J7R8M2nj48J28j42K38k96J38j4N4Q0k47
8093a49K55o6J05o5j2o3j32M5M9o1K86J39l18j36O2J41j44M2q7K28r3R1p0J9n
8118F1q4o5K9J10p5J78p5P5k76J03K04j83J40j59o1K01k4R5l22R1k5K2K4M7j21
$$ plain form
7942 -39 83 79 1 -256 -31 -130 174 82 39 -171 205 12 10 59 -41 -38 -71 -27 83 142 -26 -45 72 177 13
7967 13 65 38 -112 114 60 -18 23 38 -156 -58 -128 5 -171 60 183 -41 88 3 -34 17 15 -51 -48 -185 -10 63
7993 63 -16 -50 -19 -63 41 -152 -30 183 105 -65 10 -138 34 -45 -75 125 -141 58 68 33 -43 114 -52 -8
8017 -8 184 70 -248 11 136 -136 25 -136 111 -157 59 86 -11 -26 -16 37 137 -116 9 -92 95 -14
8039 -14 52 158 16 -30 -110 68 -40 71 64 149 108 42 11 4 -6 -5 67 59 -71 -77 -102 40 -79 -75 -42 -7 -103 63 -58
8068 -58 -110 103 76 43 -201 -49 145 94 20 -58 -92 -75 23 65 60 -88 40 -102 136 -160 -22 -36 18 98 -149
8093 -149 106 40 145 80 68 5 -127 -82 -33 -94 192 331 13 -123 -61 80 -64 -22 -109 119 26 117 47 66 61
8118 61 -23 -88 -59 51 -24 154 79 154 -122 -19 185 2 142 -17 -78 123 99 194 -128 -37 -62 -40 -16 31 -90
8143i0K0J82l03K47o2l4R9j24r5K40j46J38p1l1N0J2J65k07K0N7j00k1J0q1J21
8168dm9J80j88NRj8J93p0J28k63L6Q5p2N7Po7P5M1j56J90j92m9K23
$$ plain form
8143 -90 -70 112 -191 56 -6 -40 59 -65 -160 80 -66 72 1 -30 20 32 197 -10 10 67 -33 -54 -44 -125 -4
8168 -4 -53 127 -61 -56 -47 -65 128 58 186 -77 -41 44 -28 29 36 -31 44 85 -71 119 -73 -122 101
8191A01
$$ Imaginary data points
##PAGE= N=2
##DATA TABLE= (X++(I..I)), XYDATA
0@%%%%%%%%%%%%Qj6J6j6J6k2L0l2M0m8N6o4P2q8J04j20J36j53J75k00K27k56K88
35A53l25L64m07M55n06N63o26O94p69Q50r37J033j139J253j379J520j676J848
53I69k039K255k499K777l098L474l920M458n125N972p090Q639j0925J4629k1596
68a3119L8902j54989k27144M63142J06503k52869M6250J05119j62728P491J51317
79A07875p0160r8305J08973R152j39638o353J32552L6024q4211n1572M1556K5848
91A1741r822j6950q578M0161J2437q9435j1473R6226l848m5184O5030j170j06914
104f7779L8439J01888m5365j6558L8266r0169l7937J21747K8007p4498r295M273
116h981j7257K8672K7115j4330O88j5708n0403K1447O5673o972m5981k0191J8264
$$ plain form
0 0 0 0 0 0 0 0 0 0 0 0 0 0 8 -8 8 -8 8 -14 16 -16 24 -24 32 -32 40 -48 56 -64 72 -81 94 -106 121 -135 153
35 153 -172 192 -215 240 -266 297 -329 365 -404 446 -491 542 -597 656 -723 797 -879 969
53 969 -1070 1185 -1314 1463 -1635 1839 -2081 2377 -2748 3224 -3866 4773 -6152 8477 -13119
68 -13119 25783 -129206 -356350 106792 213295 -39574 6676 111795 -50933 -43442 107875
79 107875 37715 -60590 48383 57535 -82103 -88456 44096 80120 -4091 -55663 -14107 11741
91 11741 1919 -15031 -23609 16552 28989 -60446 -71919 24307 20459 -24725 40305 39135 -67779
104 -67779 -29340 72548 27183 10625 48891 -41278 -79215 42532 70539 -3959 -13254 -8981
116 -8981 -26238 2434 29549 15219 15907 199 -50204 -28757 36916 29944 -16037 -36228 -17964
129a7964K9114j4488j5777K1001Q12p147N399k3543j12N9299M430n9058J3898
142d136M3705l4393j0073M7087j0665l2214m928j9904Q428L5347j3894k6004l599
155b5243p987J4819L5195p374j8231J7357j5432l0555N2683L9820n8396l5867
167c9211L1290K6705k496k0385k03K5288l376j7908M582j278k001K4451q369n6761
181c9672P849N6711j9580l8619K3615J7747r139r596n138K4213K0156k7610j7249
194a6312J4994k069j086K4662j0148l8403J6789K9241j7906k231K0033p929j5521
207e886q34J5939J3283k0210j5138J9282o12k3040J0852K1269j8586j5125J7531
220a275m83j0973J1455M579n168j899m313J0609N433j4833J0885J7080k3521j5334
$$ plain form
129 -17964 11150 -3338 -19115 1886 2698 -4449 950 -22593 -22705 36594 41024 -18034 -4136
142 -4136 39569 5176 -4897 42190 31525 -689 -5617 -25521 -17093 18254 4360 -21644 -25243
155 -25243 -33230 -18411 16784 9410 -8821 8536 -6896 -37451 15232 55052 -3344 -39211
167 -39211 -7921 18784 16288 -4097 -4300 20988 17612 -296 4286 3008 1007 25458 17089 -39672
181 -39672 -31823 24888 5308 -33311 -9696 8051 -1088 -10684 -15822 8391 28547 937 -16312
194 -16312 -1318 -3387 -4473 20189 10041 -28362 -11573 17668 -238 -2469 17564 9635 -5886
207 -5886 -6720 9219 22502 2292 -12846 6436 5824 -17216 -6364 14905 -3681 -18806 -1275
220 -1275 -1758 -12731 -1276 3303 -1865 -3764 -8077 2532 7965 -6868 4017 21097 -2424 -17758
234a7758K7177J0594k1962p9J0973j1589k861J0399Q71l54q923n667J2972m901
248a108r417J6560k58k2765M898J8165p544o845J2261j806r533P432L380m0L607
263F987q013J136Q659j1118j777J4671l155j0470J550K382j361M615J322q303
277b875j409L493j144L491m249n117J1627l078j4829J0065R206o753l87P33m543
292e769M933Q479n064m219P279k266l305O834m211j713P813q518o328Q373m64
307A854l770K194k538l505L289L185l316j11L598l771o28K090j273M071r24m867
323d422N435r88l454Q149J762p119Q61M421n80j969K251j014k877J767k806j030
339a613L851m731n41M125p768m59R285k322n988L162M020k468j545M732K34j725
$$ plain form
234 -17758 9419 20013 -1949 -2028 8945 -2644 -5505 4894 5765 5411 -3512 -9179 3793 -1108
248 -1108 -10525 6035 5777 -16988 -12090 6075 -1469 -8314 3947 2141 -7392 40 3420 3380 6987
263 6987 -1026 110 8769 -2349 -4126 10545 7390 -3080 -1530 852 -509 4106 5428 -2875
277 -2875 -4284 -791 -1935 1556 -2693 -7810 3817 739 -14090 -4025 5181 -1572 -1959 -1226 -5769
292 -5769 -836 7643 2579 -1640 5639 3373 68 6902 2691 978 8791 273 -6055 2318 1854
307 1854 -1916 278 -2260 -5765 -2476 709 -2607 -2718 880 -2891 -3519 -1429 -2702 1369 445 -4422
323 -4422 1013 25 -3429 4720 6482 -637 224 4645 4065 2096 4347 3333 456 2223 -583 -1613
339 -1613 2238 -2493 -3034 1091 -6677 -7136 2149 -173 -6161 -2999 1021 -1447 -2992 1740 1974 249
355B49J06j222K468N83k976M618n38o190M993L946l712r60J861N49l607j567K368
372I69j727k147j427o94J635k816J139N869l304k345N300J937j18o64L39J676
388C622k092n54J453j278l49qJ390l83l171L787K538m414n77N14j027J50k609
405c008l36O63k274l62R24J901J302m74K506o1j100N353Q01m146r1J110P88k324
423A172k053J820r94j039Q60j783J986J482k478J210O72q56N84j019o55m12R24
440e79K15m661O15N052j245j085p66O43M546m03j649J332K33N98q3j018J22o62
458A205M07q09k840J813Q38j25q02l060K825K893m424r4J619k515R32J225j762
475b674j194J555K488l65O88Q86m26L622N38k976L403j526m507L124k99l342n58
$$ plain form
355 249 355 -867 1601 2184 -792 3826 3288 -2902 2091 6037 2325 1365 3226 3775 168 -1399 969
372 969 -758 -2905 -4332 -5026 -3391 -6207 -5068 801 -2503 -4848 452 2389 2271 1607 1946 3622
388 3622 1530 976 2429 1151 802 794 2184 1801 -1370 2417 4955 541 -36 478 -549 -399 -3008
405 -3008 -3344 -2681 -4955 -5317 -4393 -2492 -1190 -1664 842 781 -319 5034 5835 1689 1598 2708 3496 1172
423 1172 -881 939 -55 -1094 -234 -2017 -31 1451 -1027 183 855 -1 583 -436 -1091 -1503 -579
440 -579 -364 -5025 -4410 642 -603 -1688 -2454 -1811 2735 2332 683 2015 2248 2846 2763 1745 1867 1205
458 1205 1612 803 -2037 -224 614 489 -313 -3373 -548 2345 -2079 -2173 -554 -3069 -2137 -912 -2674
475 -2674 -3868 -2313 175 -190 498 1384 958 4580 5118 2142 5545 4019 -488 2636 2337 -1005 -1563
492a563j666j121J680J351j446j015K467N57J063L294m389l25N384l188k406K374
508A051j238m2k2k332K016K686j768k113K732J848k194J814m28n240L937L383
524D090m991j232J29J021L421k731j811L063r42j158L046R2n054M47M276l913
540b247j113M108l182k21M026k831J785M475l577m76L590j346j258K277j990n163
556c143K755K839m462r35K18j824M552K23m468L319O61j708L879L00l153N40K006
573A599q41j13J540k621j214K932j247Q77K231n949N31O071k822j477J628k614
589a489L09L139j063k702J003Q08j544J557O9k578L338p66l425M665K72l401J932
606A24j174j595N029N5n181Q43L802n45L10J764m492j33O475k219l069J206k847
$$ plain form
492 -1563 -3229 -4350 -2670 -1319 -2765 -3780 -1313 -756 307 3601 -788 -1113 4271 1083 -1323 1051
508 1051 -187 -229 -251 -2583 -567 2119 351 -1762 970 2818 624 2438 2010 -3230 707 4090
524 4090 -901 -2133 -2004 -983 2438 -293 -2104 959 17 -1141 1905 1997 -3057 -2610 1666 -2247
540 -2247 -3360 748 -2434 -2655 1371 -1460 325 4800 1223 747 4337 2991 1733 4010 2020 -3143
556 -3143 -388 2451 -2011 -2946 -2728 -4552 0 223 -4245 -926 -265 -1973 1906 2206 -947 -407 1599
573 1599 758 645 2185 -436 -1650 1282 35 912 3143 -2806 -2275 3796 974 -503 1125 -1489
589 -1489 -1180 1959 896 -1806 -803 5 -1539 18 87 -2491 847 81 -3344 1321 1593 -1808 124
606 124 -1050 -2645 2384 2439 -2742 -1899 1903 1358 1668 3432 -1060 -1193 5282 3063 -6 1200 -1647
623a647J026K579m222j301K503j680m87K545k05j762K493P49k718L509K288l914
639b44R46N07j524M330j389m909K562K061j316K00J1j947K3K141j193j225R65
656ak599L67L251l108k76K988l744M85N028k004k698J746J653n55P20M21j909
673b35J055R87j447J799k88k883K961k49k815K836n09l061J139P99r83j8k90j390
691b592O82J938k271Q2K912k886k56N018k286j736L031q56MJ669p05j028O01M60
709A781n03J29k03k186J605L86k777J813p2k980K454R9k281J730J59j165J458
726e53N59j500N32K398j619j094L119j395p12L069k457q18L811j418j782J567
742A707m76l79L34r06j069M77L01j458l24L38j074J568J7k279K786R08k325J924
$$ plain form
623 -1647 -621 1958 -2264 -3565 -1062 -2742 -3229 -684 -889 -2651 -158 591 -2127 1382 3670 -244
639 -244 702 1209 -315 4015 2626 -2283 279 2340 1024 1224 1235 -712 -689 1452 259 -966 -1
656 -1 -2600 -2233 1018 -2090 -2366 622 -3122 -2637 2391 387 -2311 -565 1088 533 1253 1674 -235
673 -235 820 1807 360 2159 1871 -1012 1949 1700 -1115 1721 1212 -1849 -710 89 -894 -912 -1202 -2592
691 -2592 -1910 28 -2243 -2161 751 -2135 -2391 2627 341 -1395 1636 780 784 2453 1748 720 1321 1781
709 1781 1278 1407 1204 -982 623 1009 -1768 45 -27 -3007 -553 -454 -2735 -1005 -846 -2011 -553
726 -553 6 -1494 -962 1436 -183 -1277 1842 447 -265 2804 347 -471 3340 1922 140 1707
742 1707 1231 852 1186 280 -789 -312 -11 -1469 -1793 -1455 -2529 -961 -944 -3223 -437 471 -1854 70
760G0M96j467J628N61r76M62Q11l52l66J549j613n76K570j921j337K321j549j751
778a440J674j290p26O94m26p3J05K90K18M28J4r02J571R06k179J500J059j675
796b52J212L70r19J147k97p80J081j60j018o6N23j063n68J669j460j211K349j128
814e71j342J786q88m89Q94j153P98O84q96j14J423J153j114L53J195r43Q06P68
832B350j882N62M77j305M71n10p83R59l56r92P82O72r07j101J245k90j236J158
850f86o25q71J838n43l04J583n17Q09Q15m38M51J28k37m47L9L78j381j97Q52j135
870d88M42M44j285J277k47j145O52j04p88K8k9M3M0M54J0n85J504N78j114J204
890H91L54p14R47p83R5M81p19J64p8l98M49k65j59m32k1M44j130k20O85q92K27
$$ plain form
760 70 566 -901 727 1288 312 774 1585 1233 867 2416 803 227 2797 876 -461 1860 311 -1440
778 -1440 234 -1056 -1782 -1088 -1514 -1587 -1482 -1192 -974 -546 -532 -1434 137 1043 -1136 364 1423 -252
796 -252 960 1330 411 1558 1261 481 1562 1402 384 318 841 -222 -790 879 -581 -1792 557 -571
814 -571 -1913 -127 -1015 -1504 -610 -1763 -965 -281 -1177 -1291 132 1285 171 524 1719 776 1582 2350
832 2350 468 1030 1507 202 673 163 -620 339 -17 -1009 -227 445 -462 -1563 -318 -608 -1844 -686
850 -686 -1311 -2182 -344 -887 -1191 392 -125 684 1499 1061 1512 1640 1403 956 995 1373 -8 -205 647 -488
870 -488 -46 398 -887 390 143 -1002 -350 -454 -1242 -1214 -1243 -1200 -1160 -706 -696 -1281 223 801 -313 891
890 891 1245 531 1478 695 790 1271 552 716 638 240 689 424 265 -167 -188 256 -874 -1094 -409 -1301 -1074
911a074K97p93J222k28n46J142k27J1J91M20J98o28M84J080j125N81M34o15N30
930A354k54O8l72r89M93J99j370n5j33J40p9p84R48L10o60N95K23L29j97n27J123
951C62j61q32J504O2n78O34L19L36q63K32J037j537l85P57q19n22p62J31Q82j017
971a220l00M53Q1P03l92j22P70q93Q98O71j168K90P01j17j31J33R26j54q33R60
991A256j1m49J21o59L46k65q44O85p33k84M20o03K45J60k83O3k59R3R62p02j09
1012h50K17P12O98j028M75J201q69L87Q71j334K82O46p22j42j21J95r63l80P94
1031F9n08j2o26p58J701k44j650R12P18l95J58J74N38K42l6M84k93K26P00m06
1051I94l10n41P27J069k121j21J368r49j66J71k82nn49K58N9l44p5n49P78N68
$$ plain form
911 -1074 -777 -1570 -348 -576 -1122 20 -207 -196 -5 415 613 -15 469 1549 424 1005 1439 824 1354
930 1354 1100 1168 796 -193 300 499 -871 -926 -1059 -919 -998 -1782 -834 -524 -1184 -589 -366 -37 -234 -761 362
951 362 201 -631 873 935 357 991 1310 1646 783 1015 2052 515 130 887 68 -454 -1216 -1085 -203 -1220
971 -1220 -1520 -1067 -986 -283 -675 -797 -27 -920 -22 649 -519 -229 472 355 224 357 1283 1129 296 1256
991 1256 1245 796 917 258 604 339 -505 180 -553 -837 -417 -1020 -775 -615 -898 -835 -1094 -1001 -39 -741 -850
1012 -850 -633 79 777 -251 224 1425 556 943 1814 480 762 1408 686 544 423 618 -345 -725 69
1031 69 -439 -451 -1077 -1835 -134 -378 -2028 -1116 -398 -793 -635 -461 77 319 283 767 474 700 1400 994
1051 994 684 143 870 1939 -182 -303 1065 116 -50 121 -161 -166 -715 -457 -398 -742 -817 -1366 -588 -20
1071b0j029O06K46o26J336M24j404O46O03N24o28q54J433K52j130m51L85J045
1089A358j158l85O25r31O9Q86j453n15J072k83j63l52K23P98l81j18N04O56m5
1108D07j011J140Q30j235N17M04p24Q19k0p67L5oK67m63q26K78O22k87j101j1
1128a132J469r12j186J474l05j73P14n70M52J51k58O91k46%M80o6Mj26N06J99
1148A166j440P77R41j385j09N2k35Q30j203l84P70n13j17K02l01%J72R12q01m23
1168a089J697l85o00Q26J0L3K17o65Q78L41q86J86J44nn61NN17j015l5P09j243
1189i21L03N50o10j52j10K59Q40j114q5R83K14l72j95O24J12j08N88j55n51R06
1209A006l56j96M43p39L59Q6o95L39j2o22k02K06L57q81j00P46o76K22L81o51
$$ plain form
1071 -20 -1049 -443 -197 -823 513 937 -467 179 782 1306 678 -176 1257 1509 379 -72 313 1358
1089 1358 200 -185 440 -491 -422 464 -989 -1504 -432 -715 -878 -1230 -1007 -209 -590 -708 -204 452 407
1108 407 -604 536 1366 131 648 1052 328 1147 1127 360 395 389 656 193 -633 -355 267 -20 -1121 -1132
1128 -1132 337 -575 -1761 -287 -592 -765 -51 -621 -169 -18 -276 415 169 169 649 583 587 461 967 1166
1148 1166 -274 503 1444 59 -50 2 -233 597 -606 -990 -220 -733 -850 -648 -949 -949 -777 135 -666 -1089
1168 -1089 608 223 -377 449 459 492 709 44 922 1263 377 563 707 702 141 146 663 -352 -387 322 -921
1189 -921 -618 -68 -678 -830 -940 -681 159 -955 -1040 -57 157 -215 -410 214 326 218 806 651 100 1006
1209 1006 650 454 897 158 517 603 -92 247 235 -387 -589 -383 -26 -907 -1007 -261 -937 -715 -334 -985
1229i85P14J5n9O48k95k4P09j23l84K46N09q4o21M84J4o85M47l13n86O61o49r
1251c70K35p82L8N05k91o5R8K25j14M5N33l37j18P90j75K47L1l80Q79l20m96O85
1273H63k80k32k4J67k53m94K51J31n96K34j25m60O21n92L1O16p52J80N18l60P7
1294d79N30J43k13J25M70K0l25M59j27q4L21m77R1K6n59L89j85l17j8k28K04l87
1316f21L6K41m98J13L54j68L19k27r6Q31l97P8P86o72J80M15L0j16q8K69j49m32
1338A88N11k88m71K16m04K50r5o28L45K54p64M79j35n4L6o1L12Q4K33J21l01N47
1360C75j1k00O82o69m7R00l71l01L13k42p1k48J39j25n61P6k7k34L42j25l04L83
1382c26l57L86p2m44N61R7J0J79l0M20k6o6L00nk60K99m46N87l68k48K51l40o3
$$ plain form
1229 -985 -271 -256 -315 333 38 14 723 600 216 462 971 887 266 750 764 79 526 213 -373 288 -361 -370
1251 -370 -135 -917 -879 -374 -665 -730 -632 -407 -521 -476 57 -280 -398 392 217 464 495 115 994 674 178 863
1273 863 583 351 327 494 241 -253 -2 129 -467 -233 -358 -818 -197 -789 -758 -142 -894 -714 -196 -556 -479
1294 -479 51 194 -19 106 576 596 271 730 603 519 840 363 454 480 -79 310 125 -192 -210 -438 -234 -621
1316 -621 -585 -344 -842 -729 -375 -543 -224 -451 -547 284 -113 -35 751 79 259 674 704 588 500 769 620 188
1338 188 699 411 -60 156 -248 2 -93 -721 -376 -122 -886 -407 -542 -596 -560 -621 -309 -225 8 129 -172 375
1360 375 364 164 846 177 130 1030 659 358 671 429 358 110 249 124 -437 -361 -388 -622 -280 -405 -709 -326
1382 -326 -683 -297 -369 -813 -252 -155 -145 34 4 424 398 332 632 627 367 666 220 807 439 191 442 102 39
1405C9K05o77J67J8l26J99j94M0O7m8J23j1k2L62l14L97K19p4K92J66m98N14j16
1428E28k5K14l66J98k22j06j0l46K84k68j63K01m0m49O6J84l63L13l76M95j39
1449c90LN59m51L09J05n2M32j12j83O08m04O5O0k43N6j20k07L93n88lK64m61J58
1472b02j71j63J81l04J61R4k03L48K1n5L71j85J76J86j75O50l71j07L18o9j39
1493C62J60k81L61m68j63J38k56m7K2l05K20l42J70R6l33K29J18j07L35l73M78
1514A4J40l37N01R1j90R6Q1K68q2k47K34k26ML6l39o8J33l62K32l09j65J94n0
1537c51j32J05O1J33l78R5M95l70K41L72k58K81j46K02K65l57J54J45k84L78k83
1558C68k03Q9m12K56j17k27l7N2%j51k61K68J59m00K84l0m8L67j85L22Q5N2J76
$$ plain form
1405 39 244 -433 -266 -248 -574 -375 -569 -529 -462 -510 -387 -398 -420 -58 -372 25 244 170 462 628 130 644 528
1428 528 503 717 351 549 327 221 211 -135 149 -119 -282 -81 -121 -570 -504 -320 -683 -370 -746 -251 -390
1449 -390 -387 172 -279 30 135 83 515 403 220 828 424 489 549 306 362 242 35 428 -160 -163 101 -360 -202
1472 -202 -373 -536 -355 -659 -498 -404 -607 -259 -238 -293 78 -107 69 255 80 730 359 252 570 501 362
1493 362 522 241 602 134 -29 109 -147 -194 -172 -477 -257 -599 -429 -333 -666 -437 -319 -426 -91 -464 14
1514 14 154 -183 318 409 219 315 396 664 582 335 569 343 347 383 44 -24 109 -253 -21 -330 -495 -301 -351
1537 -351 -483 -378 -317 -184 -562 -467 28 -342 -101 271 13 294 148 350 615 258 412 557 273 651 368
1558 368 165 254 -158 98 -19 -246 -283 -231 -231 -382 -643 -375 -216 -616 -332 -362 -410 -43 -228 94 179 231 407
1581D07k53J52K78l60K95k24Q4J3o5k29J15l69Q0mo6m3l41J31J36l07K80J4m44
1604g20M20j2M13j80p8L92M5j86K62K3K2J88r4J45l0n16K80j73j67K79l17l5k04
1627b43k39K86k49J04M5k13J02K7R7L28k49m9M01k4O9Nk01L95o1K37ql39J61J20
1651E02q2k89k2J67k89j23J93n15p8K21j07K05j44l26M41P2q8J08J37Ll4M5L61
1674C58k98J69L19k53OK52k07P6lk77K29j24j57o6l36j7j28M0J23k72J67J35k76
1697e40M09p1J92j30Q3J54r9j67M81j67Q3J52j24K87k08j71K10k62R1j79k22K58
1719F0k44m3Q6k35j8K63k15J57j54M6J33j22L0K90k50L87k14J34K06k88L58L46
1741G13l15j94J43k85J95J44l01L5j42K77l49j35R9k70R8J52m18L03J1k78K54
$$ plain form
1581 407 154 306 584 224 519 295 379 392 327 98 213 -156 -76 -80 -146 -189 -530 -399 -263 -570 -290 -276 -720
1604 -720 -300 -312 101 -79 -157 235 280 94 356 379 401 589 495 640 610 94 374 201 34 313 -4 -39 -243
1627 -243 -482 -196 -445 -341 -296 -509 -407 -380 -283 45 -204 -253 148 124 193 198 -3 392 331 568 560 221 382 502
1651 502 420 131 109 276 -13 -136 57 -458 -536 -315 -422 -217 -361 -687 -246 -174 -262 -154 -17 -14 -48 -3 358
1674 358 60 229 548 295 301 553 346 422 419 142 371 247 90 24 -312 -329 -457 -417 -294 -566 -399 -264 -540
1697 -540 -131 -202 -10 -140 -57 97 -2 -169 312 145 228 380 256 543 335 164 374 112 203 24 -198 60
1719 60 -184 -227 -141 -376 -394 -131 -346 -189 -343 -297 -164 -286 -256 34 -216 171 -43 91 297 9 367 713
1741 713 398 204 347 62 257 401 100 135 -7 270 -79 -214 -115 -385 -287 -135 -553 -250 -239 -517 -263
1762b63M0J8Q5N1K89j15J74K69l87L14nl28K16m7j40J94k40Rj2l05j1J48J3q3
1786a16l64J98m1k18M34k66LO8K78n1J94j13L64L2k15K33j83L1Qj39K95k72m8
1809A12P9k02J78r8k53K67j91q9P9k04O4P6j46J41j93N4L41l48L79L1j66K24j03
1832C2J49K26j25Oj53J42J53j39j9j04r1p0j07p2J11k61Q5m5o3P6p9j32J87j16
1856d09K90L4l0L10k99O2K26P6O3k7k31K67j21L15j25m73L32J1k63k4k26O6J34
1879d2l23L0N0J9QJ61k65K75k53J68M4m9L13j41J1L83k19R7m4j3L35k79Q8o6j95
1904I3P2r0j78J03j39j00J29k11J36p5k07L74k57J15N9j74K94N0p3J99nO8K21
1927D04l01J97J03j85J35m1j58J92j49Mr1j10J23k85j17L6j17K9o5M0J23k4R7
$$ plain form
1762 -263 -223 -205 -120 -69 220 105 279 548 161 475 470 142 358 311 171 365 125 134 122 -183 -194 -46 -33 -116
1786 -116 -480 -282 -323 -541 -107 -373 -370 -302 -24 -75 119 6 370 402 187 420 237 268 276 137 432 160 112
1809 112 191 -11 167 69 -184 83 -108 -197 -118 -322 -258 -182 -328 -187 -380 -326 15 -333 46 77 -89 135 32
1832 32 181 407 282 288 135 277 430 291 272 168 77 7 -100 -172 -61 -322 -237 -282 -345 -269 -348 -480 -293 -409
1856 -409 -119 -85 -115 195 -104 -42 184 260 323 296 65 332 211 526 401 -72 260 271 8 -16 -242 -176 -42
1879 -42 -365 -335 -285 -266 -258 -97 -362 -87 -340 -172 -128 -177 136 -5 6 389 170 267 223 210 545 266 354 288 93
1904 93 165 75 -103 0 -139 -239 -110 -321 -185 -260 -467 -93 -350 -235 -176 -350 -56 -6 -79 120 115 183 404
1927 404 103 300 403 218 353 312 154 346 197 201 110 0 123 -162 -279 -243 -360 -331 -396 -356 -233 -257 -160
1950a60j6q5K62j85J8N89n49L72k1k36L75j19M6P7k00J83j22k40J57l42M2m3K1
1973a76J40k37k86L77P2j24O9nR2M6j14J56j37J99K27j65J44j69M6J67J07k33
1995A96J73k16K9j83j22J23k13M3K02k35P8j86q7K06j87J00J50j40K82j43O0J68
2017I8o6K9K26j02kJ90j48K21j87K9j76N4R7j75o1P6k04J69k0l66J06q9N3N3J29
2042f6j67O6p4K07J04Q3%l15M20L2nl9k87K59J14L1r9n5k66L24n0k77O3j00j07
2067b04o8L2J72j73l8R6o1J48J25l35L22Q0j09J25l2kN2J91q7k8J71M4m07K28
2091B42k6j64J30k7j87J37k93pJ4r9M3j32K35r4nJ50M0j16K66Kj12J65j74M06
2115C94j63k02K57n1o5J85l20K35k23j31K18oq2q9j83P3J1j28K35k03kK31k56
$$ plain form
1950 -160 -176 -261 1 -184 -166 423 -126 246 225 -11 364 245 291 368 168 351 229 -11 146 -196 -154 -197 -176
1973 -176 -36 -273 -559 -182 -110 -234 -165 -170 -78 -32 -146 10 -127 72 299 134 278 109 155 322 429 196
1995 196 369 153 182 -1 -123 0 -213 -170 32 -203 -125 -311 -398 -192 -379 -279 -129 -269 13 -130 -70 98
2017 98 32 61 287 185 183 373 225 446 259 288 112 166 263 88 27 103 -101 68 48 -318 -212 -301 -248 -195 -66
2042 -66 -233 -167 -241 -34 70 153 153 -162 258 290 285 246 -41 218 332 363 264 209 -57 267 217 -60 3 -97 -204
2067 -204 -272 -240 -68 -241 -279 -183 -244 -96 29 -306 16 96 -13 112 80 78 130 321 234 206 377 421 14 242
2091 242 216 52 182 155 -32 105 -188 -195 -181 -280 -237 -369 -134 -228 -233 -83 -43 -159 107 109 -3 162 -12 394
2115 394 231 29 286 235 170 355 35 270 47 -84 134 128 46 -43 -226 -153 -142 -270 -35 -238 -240 -9 -265
2138b65J19p4J17K36r7J90q9j91N04l14q4K10k61L09P6k36J77p8k47J06N8l08
2160a42J02j07P9l45J77j3j27L54j37l57N36r4M7J12j67K03M0m6K69k56O8R2j02
2183A86K53j27k89R0j78%J67k51K4j19J93O1k70L4K21l07L32l26R3K91m31M61
2205A08j5k67K42P4j88M57j63j11o7L7m6J60n0k3k75qR7j62Q9lj00pr1%L29k47
2231b30J25K8k16J93j8J30R5JR9j50J22R1k08L64o6l20M37k73k44R8j02L9%qj08
2256a21j18N6p8QJ71j27J04J20k37l8M65l38L30n9j76K19n9J31J62j39K8m0l8
2279B26K9k67J70q4k17K45l53o5K86j53j39J09p2O8J85j86J24j36M80r1k29L87
2301C17k51o9K27j14Q4J15j04j42P4r3J19j86jn2M2J8k58m9J53o3R8Nk06J40J3
$$ plain form
2138 -265 -146 -220 -103 133 36 226 137 -54 450 136 52 262 1 310 386 150 327 249 2 108 166 -142
2160 -142 -40 -147 -68 -413 -236 -249 -376 -22 -159 -516 20 -74 -27 85 -82 121 161 115 384 128 196 288 186
2183 186 439 312 23 113 -65 -65 102 -149 -125 -244 -51 10 -260 -226 -5 -312 20 -306 -213 78 -353 108
2205 108 93 -174 68 142 -46 411 248 137 70 107 61 221 171 148 -127 -135 -38 -200 -111 -114 -214 -221 -312 -312 17 -230
2231 -230 -105 -77 -293 -100 -118 12 107 108 207 57 179 270 62 426 360 40 477 204 -40 58 -44 -5 -5 -13 -121
2256 -121 -239 -183 -261 -253 -82 -209 -105 15 -222 -260 205 -133 197 138 -38 181 122 253 415 276 304 264 226
2279 226 255 -12 158 74 -143 102 -251 -316 -30 -183 -322 -213 -285 -217 -32 -218 -94 -230 250 159 -70 317
2301 317 66 -3 224 110 194 309 205 63 137 44 163 -23 -24 -76 -34 -16 -274 -323 -170 -233 -135 -130 -336 -196 -183
2326a83j32L40j69n4K80L9Q3l3l4O8LK16j22k80K95k82J30nk59J20N9k20J30k31
2350b41o1J61j27J07m1j23L93m06K74K12k97K54N3J3K9J3r2J33rJ05k46K7J2n8
2374H5J06l02O5M2l7k11K46k92O2J11L5j72oQ2q4J42R7j13O5J93QJ09rl16K77
2399A83K00k82P9K6k17L3J41k4m1j73K1J83k29j2n2M1j74lJ17k16K03K87k66Q1
2423i4J44m6K06j66k4J60m3J0J58o6o3j24N4L3j4j11K2l35K87k64OK02k23p8J63
2448b06P1O1k43J58K30j73N5K5j8K01lo8J12r8R6O6o2R7j76K7KK2rl02q9L11k81
2475a94P9q9o8j24N2OK21R5j76K83j22Q6P3j04o2K58j4l9k3Q9j32j06K55p9J8
2500A83j11r8L4l4q2M9j95O0O0l8Q1j11l5K20k90Q9L04k70L15m7L4Q9j43L07q2
$$ plain form
2326 -183 -315 25 -144 -198 82 121 204 171 137 205 208 424 302 22 317 35 165 160 -99 21 80 -140 -10 -241
2350 -241 -302 -141 -268 -161 -202 -325 68 -338 -64 148 -149 105 158 171 200 213 121 254 245 350 104 131 143 85
2374 85 191 -111 -46 -4 -41 -252 -6 -298 -236 -125 -90 -262 -268 -186 -270 -128 -31 -144 -79 114 122 231 222 -94 183
2399 183 383 101 180 206 -11 22 163 139 98 -75 -54 129 -100 -112 -164 -123 -297 -300 -183 -399 -196 91 -175 -94
2423 -94 50 4 210 44 20 180 137 147 305 239 176 52 106 139 125 14 36 -299 -12 -276 -270 -68 -291 -369 -206
2448 -206 -135 -74 -317 -159 71 -102 -47 -22 -40 161 158 90 202 104 200 266 204 301 125 152 154 176 167 -135 -224 87 -194
2475 -194 -115 -204 -272 -396 -344 -338 -117 -22 -198 85 -37 49 122 18 -44 214 200 161 138 227 95 -11 244 165 183
2500 183 72 -26 8 -26 -108 -59 -254 -194 -134 -172 -91 -202 -237 -17 -307 -218 86 -184 131 84 118 207 64 371 289
2525B89k48J84Qq2J7p7q2M3N3j32L3r2J15l12P3J02o5M4q8kJ23NN6p5J35Q9Ol2
2553H8J19N3J7j37K2J36j34J01j38o9n2J1o2r7n4r1K99l37l7J38J2O7k2p9J88
2578e8j62J42k1J85R6m0m9J86j62J89j80J03N8k01L6j36m6K8P7j84L7j20j18J69
2602a71k17J34j5J23K9j00l7J34qK18m9n0K17M7j76J77j7l2J75k80Q9l2j9Mj46
2627bJ21k22j41J3n9J00J08r8lj67J63O1j15K81o6j17J50pJ3K55K2L0Qj05j92
2652C1J26m4M1j07O8j77q3K82k70p2NK1p6O3M7N8l9p8J78Lo8P5J20r6n6O1L06
2679C19l45K35J45l61K38r6P4m4j88P6k7o7j3j37J09q7q0K7oj0R8j71K39j18J03
2704h7J07M7k4o1J28L7J90l39K83l6Qj62j65L48j86k02K17j23q4J06k11R2J52
$$ plain form
2525 289 41 225 233 151 168 91 9 52 105 -27 6 -86 29 -283 -210 -108 -173 -129 -217 -219 -96 -91 -35 -110 25 114 120 88
2553 88 207 260 277 140 162 298 164 265 127 58 6 17 -45 -142 -196 -287 12 -325 -362 -224 -212 -145 -167 -246 -58
2578 -58 -220 -78 -99 86 182 142 93 279 117 306 126 229 287 86 122 -14 -60 -32 45 -139 -102 -222 -340 -171
2602 -171 -388 -254 -269 -146 -117 -217 -254 -120 -128 90 41 -9 208 255 79 256 239 207 382 102 191 159 140 144 -2
2627 -2 119 -103 -244 -231 -290 -190 -82 -180 -183 -350 -187 -126 -241 40 -26 -143 7 0 13 268 290 320 328 223 31
2652 31 157 113 154 47 115 -62 -145 137 -133 -205 -200 -179 -255 -192 -145 -87 -126 -204 -26 -23 -91 -16 104 8 -48 13 319
2679 319 -26 209 354 -7 231 135 209 165 -23 53 26 -41 -54 -191 -82 -169 -249 -222 -228 -238 -140 -311 -72 -190 -87
2704 -87 20 67 43 -18 110 147 337 -2 281 245 253 91 -74 274 88 -114 103 -20 -104 2 -209 -117 35
2727C5k68J13K8j98K40l5k5R5n3J03R8q9K57j48R4N6j26Q5k09J69k9q2k14K77
2751A74j84J1q2N1J23l85J35L4N5Nj7j35K3rJ07P3L9j44M8J49Q2L3Q1j51JK08
2777C25l03K2J64j87J75l52O8j30K65j41q8j31L5J09j29K63j65n7J27J4J8mJ34
2800C2P8r9j3J84j94L26q4J6P6k64K64j36j08n1JpJ12k76j0k9M6r2M0J34k75P4
2826b55J40LM6qp5K44L1k12K94j00O7J77m0j79J81j41P2o1N4k70Q5K7M5k14L1
2851e8N6j84J52k57K10q7KJ79j27j34K46m3jj4j2J45n0K16l3J12K5j20k52J02
2875G3M8j75J63K9j41J14k58P3j2q9R4k98L07j10J42P0j37k8J23r6J89K02k42
2898D1K47j22j15Q4Q4l5K6o2jj16j12J01k3m7K0k20K63j92j97K09j4q3J32j49
$$ plain form
2727 35 -233 -120 -92 -290 -50 -85 -110 -15 -68 35 133 44 301 153 247 303 177 262 53 222 193 111 -103 174
2751 174 -10 1 -81 -30 93 -292 -157 -123 -68 -63 -80 -215 -192 -201 -94 -21 18 -126 -78 71 153 186 267 116 117 325
2777 325 22 44 208 21 196 -156 -88 -218 47 -94 -182 -313 -278 -169 -298 -35 -200 -257 -130 -116 -98 -102 32
2800 32 110 11 -2 182 -12 314 230 246 322 58 322 186 78 27 28 21 133 -143 -153 -182 -136 -228 -188 -54 -329 -255
2826 -255 -115 -112 -66 -74 -149 95 126 -86 208 108 175 352 312 133 314 173 245 184 238 -32 53 80 125 -89 -58
2851 -58 -2 -186 -34 -291 -81 -168 -166 13 -114 -248 -2 -45 -46 -60 -72 73 23 239 206 318 343 223 -29 73
2875 73 121 -54 109 138 -3 111 -147 -74 -86 -175 -81 -379 -72 -182 -40 30 -107 -135 -12 -108 81 283 41
2898 41 288 166 51 135 219 184 210 148 147 31 -81 20 -3 -50 -30 -250 13 -179 -376 -167 -181 -264 -132 -281
2922b81K52M3Pq8O1R1J6j4K25k08%J04l9L6K4k62K07j61j9O8j65J61k45J38k36
2947b85Q0LM4q8K5O2J13o3N9j5J7J49o0J09l1J80j63Q8o0K7J13r5k53L25j71N6
2973A66j41j20l7j07n7J59j7k5m9M0K0m0K44J15j04p8M20m41P0K28j73L13k20
2996A66r1k3L3r6N4J48j25k5K2o3k62K69j83m8Q7r5k9K37j36J80q2j55J87l6L2
3021c4lK1J35p9j64K18o4K75j26q5LL3o6J12k24P0l5k06K06O0l30j5J53k8J54
3046a9j17J58m5p0N9J10L3j34J3J02j8J09k0m8J33j65l0Q7r8L3m3j85J62O5k21
3071a49K00l17K11J6k28N1L2n9J81j11K34j38Q9J63m9j54J32N0k8j5M5J38j45
3094A49K9k0j64J0q8n2J9L6p6J97j42j80J13J4J69j39m7R8p8K16J6j79J64O1J55
$$ plain form
2922 -281 -29 14 21 -67 -6 85 101 87 312 104 104 208 169 205 229 -33 174 13 -6 62 -103 58 -187 -49 -285
2947 -285 -205 -202 -158 -246 -221 -159 -46 -109 -50 -65 -48 101 41 150 119 299 136 224 164 191 304 209 -44 281 110 166
2973 166 25 -95 -132 -239 -296 -137 -154 -179 -228 -188 -168 -208 36 151 47 -31 389 -52 18 246 73 386 166
2996 166 75 52 85 -11 43 191 66 41 63 0 -262 7 -176 -224 -137 -232 -261 -24 -160 20 -62 -217 -30 -66 -34
3021 -34 -37 -16 119 40 -124 94 30 305 179 94 97 130 64 176 -48 22 -13 -219 -13 47 -283 -298 -145 -173 -19
3046 -19 -136 22 -23 -93 -34 76 109 -25 -12 90 72 181 161 113 246 81 51 138 40 73 30 -155 7 72 -149
3071 -149 51 -266 -55 -39 -267 -216 -184 -243 -62 -173 61 -77 12 175 126 -28 104 154 126 111 156 294 149
3094 149 178 158 -6 4 -84 -136 -117 -81 -157 40 -102 -282 -169 -155 14 -125 -172 -74 -152 64 80 -99 65 126 281
3119B81j29k2L7j3j83K68j03m1J3j01J78k03P6Qk88K19j24l8J50j36J18q2o4P3
3143a06K3j24K28k9j2L18k44L2J42k62K83k0k36J18J3jj34L0j27J19r5n2jL6n7
3168a58l4J37jj48J09l8K0J83l58M38j27l7L13lj47p5J24J2j79L43j54j34nn9
3192B2j10J22j37l4Q7k84K20R8r2j83J82pJ13n8k3K05j57K17j58O3K13k82P2m7
3216D2J81n6M1j47M2q6K7j92K2O2j26N6J82k85M0J81l02K6J92j14L11L9k90Q0
3240g4rJ59j08J45k4K0Ll0l5J89j68q9J86l71J98n0K1k54J32M0R7l57K68r6Q6
3265a21k3k28L91q7J6Q7Pn2K42j07m4J09m1J2n2J06Pl48K88j59L0J5j56J1LL4
3291f0o7N0j11J06m6r5K10O2j36M5L8J48o5k6J11j40K08ok13J29m9k4J34r9l5
$$ plain form
3119 281 152 130 167 154 -29 239 136 95 108 7 185 -18 58 66 -222 -3 -127 -165 -15 -151 -33 -115 -179 -106
3143 -106 -83 -207 21 -8 -20 298 54 86 228 -34 249 229 -7 111 124 123 -11 19 -108 11 -84 -136 -137 -101 -158
3168 -158 -192 -55 -56 -204 -95 -133 -113 70 -288 150 23 -14 299 296 149 74 198 210 31 374 220 86 81 22
3192 22 -88 34 -103 -137 -50 -334 -114 -16 -108 -291 -109 -116 -3 -61 -84 121 -36 181 23 86 299 17 89 42
3216 42 223 167 208 61 103 17 44 -148 -126 -64 -190 -134 48 -237 -197 -16 -318 -292 -100 -214 97 136 -154 -74
3240 -74 -83 76 -32 113 89 109 112 82 47 236 68 -21 165 -206 -8 -58 -37 -291 -159 -119 -22 -379 -111 -207 -121
3265 -121 -144 -372 19 -68 -52 35 42 -10 232 125 81 190 149 161 109 215 222 -126 162 3 33 48 -108 -97 -94 -60
3291 -60 -127 -77 -188 -82 -128 -223 -13 49 -87 -42 -4 144 79 53 164 24 232 226 13 142 93 69 203 104 69
3316F9k1Jj09m5J15J8j84Nj32J9J30j1n5K21k16R9J06o6J48j81J73J81k83J27
3340A09J13j85K75j76r7Q3j35N5J71j40P2l10K8O8%j20K4j5L8r9J83q5J69N1l7
3365D0O7Q5q1m6J14N7n1r3J4j1M0o9l6j50K06j60P2p8j35J12J42k60J75N8r8M
3391h2r7Q4J61q5M8P0M9J04j99J25k2j51M7L7J15M6k28j7o4Pk5J62k54O8j37J63
3417g5n1l8O7l3p6J56r4J13J0r3J64j08J9K08o4lN4q4J54j0%j58O5n2j71p8J45
3444c3j36qO4qK17j03k23N8J9L1j42J48K59j23q9J84j55o8J35qJ75r9J4MN1q0
3470H4j09J03p8J3q4J02O3j49N6k11J63n9j58K21k55L8O4O2J03k7j4P7PJ30K1
3495A63m3O2j89K4O4Q3o0l2J9r9l9J11j06J10j09m1j82K67k73P9J56k78K43j4
$$ plain form
3316 69 48 49 -60 -105 10 28 -156 -151 -283 -264 -134 -145 -200 21 -195 -96 10 -56 92 -89 84 265 -18 109
3340 109 222 37 312 136 39 122 -13 42 213 73 145 -165 -137 -69 -69 -189 -165 -180 -142 -241 -58 -143 26 77 40
3365 40 107 192 111 65 179 236 185 92 106 95 135 66 30 -120 86 -74 -2 -80 -215 -103 39 -221 -46 12 -86 -82
3391 -82 -179 -95 66 -19 29 99 148 252 53 178 156 5 52 89 204 250 22 5 -59 -52 -77 85 -169 -101 -238 -75
3417 -75 -126 -164 -97 -130 -206 -50 -144 -31 -21 -114 50 -58 -39 169 105 102 156 72 226 216 216 58 123 71 -100 -178 -33
3444 -33 -169 -177 -113 -121 96 -7 -230 -172 -153 -122 -264 -116 143 20 -69 115 -40 -108 27 19 194 95 109 113 164 84
3470 84 -25 78 0 13 -71 31 94 -55 1 -210 -47 -106 -264 -43 -298 -260 -196 -134 -31 -58 -72 5 12 142 163
3495 163 120 182 -7 17 81 164 104 72 91 -8 -47 64 -42 68 -41 -82 -264 3 -270 -191 -35 -313 -70 -84
3519h4j50K70L2j37J2L9J15J62l37K33Lm9o4o4J78r3j46J30j51L9M1n5qq3m4M4
3545a67m8J38j73J30J01r2J00Q3n6L0K48l94J75p2M4O3N2Kj43QL2j46n8K18k07
3570a32J99n6q7K8j06QK0r4Q7N8q6O5J64j62M2J93j98J38J2n8Q8m8r8K00J1K2
3596B10j78J48p0j83L9l5j2r9Q8n3r4R5J47j77K47k29PJ84o5Q9j45N8Q3R0Rj17
3622C7L7J79n9j63K13k73o2N7j27J28k5J5Mj10P8K5J9r6k5j14J27J84k54K77j9
3647E3o2J88j31J6J68k13J23Q8J15m4k13j00Q4M7j24Ml3P3j10R6N9l60L34k62
3671b04R9M0j74J08J31L4j49Q8QO7jJ58j06M3K10l53O3P5k0j04J37j81J25j85
3695i1nl0J14Q1l01J27j05R9ljk4J28Jj2N4q1M4j56J95M7P0r1N6l1R7K6m4K9p0
$$ plain form
3519 -84 -234 36 68 -69 -57 -18 97 259 -78 155 158 109 45 -19 159 66 -80 50 -101 -62 -21 -76 -84 -167 -211 -167
3545 -167 -215 -77 -250 -120 -19 -111 -11 72 16 46 294 -100 75 3 47 110 162 164 21 29 61 -85 -143 75 -132
3570 -132 67 11 -76 -48 -154 -146 -126 -220 -133 -75 -161 -96 68 -94 -52 141 -57 81 93 35 123 75 -23 177 188 210
3596 210 32 180 110 -73 -34 -69 -81 -180 -92 -145 -239 -144 3 -174 73 -156 -149 35 -30 59 -86 -28 55 145 154 37
3622 37 74 253 194 31 244 -29 -91 -34 -161 -33 -58 -43 -39 -149 -71 -46 -27 -123 -148 -262 -135 49 -205 72 53
3647 53 -9 179 48 64 232 19 142 230 345 301 88 -12 72 119 -5 -1 -34 39 -71 25 84 -276 58 -204
3671 -204 -105 -65 -239 -131 0 34 -115 -27 -19 48 47 205 99 142 352 -1 62 137 117 13 150 -31 94 -91
3695 -91 -96 -126 -12 69 -232 -105 -210 -111 -114 -115 -139 -11 -10 -22 32 -49 -5 -161 34 81 151 60 116 85 182 208 164 193 123
3724A23L7j56j11M3N2j83J50j77J22J58q4k19K51n3m9j3K13j09j5J89l75K19N1
3747F4n2J8J51l02L43p2p7oj4o6j4K7l1J0Jp9K0j14J83r6O6j66J8J66K3j90K30
3774D1K7J55p8j06Q4Mq3J89j44J95j64o4j6r7N4K9j79J61j64MQ4j28N0L7P4P4
3800C9j37l2N5L1P2J05j34O6o0J30Q1j68K72k50R5k2j73k5J8J14J59l20k0l1j35
3825b70O3o4K34l7n6Lj6P6J78j25j73L19Q4k10nP3j7J1l1p0J48k3j13L25l35j62
3851a93Q9Q4l7m3K90k65k4Lk5J17j08k0J67l17K57j8J21N9n7J8m8q4J11K2j08
3876iJ20J7m5J40k14J9n1J63j66L1Oj52rm8J39j56J99o6o5J17l3R3o6k8K5K03
3902A64k08M5J12k8m5k8J72L3k19P6k40K79k77R5oj14J1P0pJ27j72j72Q4O7J9
$$ plain form
3724 123 160 4 -107 -64 -12 -195 -45 -222 -100 58 -26 -245 6 -47 -96 -109 104 -5 -20 169 -206 13 64
3747 64 12 30 181 -121 222 150 73 67 53 -13 -27 0 -31 -21 -20 -99 -79 -193 -10 -106 -40 -206 -188 -22 1 -189 41
3774 41 68 223 145 39 123 127 44 233 89 284 120 56 40 -57 -3 26 -153 8 -156 -152 -68 -196 -146 -109 -35 39
3800 39 -98 -130 -75 -44 28 133 -1 65 5 135 216 48 320 70 165 143 -30 -55 -37 77 236 -84 -104 -135 -270
3825 -270 -207 -271 -37 -74 -130 -127 -143 -67 111 -14 -187 132 216 6 1 74 57 68 37 -33 115 92 -21 304 -31 -193
3851 -193 -104 -20 -57 -100 190 -75 -99 -96 -121 -4 -112 -132 35 -282 -25 -43 78 137 80 98 50 -34 77 99 -9
3876 -9 111 128 83 223 9 28 -23 140 -26 5 11 -141 -150 -198 -59 -215 -16 -82 -147 -30 -63 30 -36 -64 -39 164
3902 164 -44 1 113 85 40 12 184 217 -2 74 -166 113 -164 -69 -75 -189 -178 -108 -115 12 -160 -332 -248 -181 -162
3927a62l0N4K27k9l5J24k05J26J26Qj57j31R0J16j46J21p3n4J43j78O7q4L4r8
3951a46M2K9O7o7n8J83n0r3M4j64L46j02O9m2N4L2M2j49K85m77K80j7j05J38j04
3976C7k2j18N5j9p1J27qk90K29O7j03J08r5P9O7j16J9K06mj38M8j4K47j30o6K5
4002A20j98P4n0J24m5n0J15q6p4p0L7n1K4J42j12oJ6j2J52j64R1l8J97Lk05j05
4028a71K53J17jk99L6O8J42n5Q3o9n8m7K9r0J42l8k25N2p0Q0K05j75O9N9k8kP3
4055H0r1L6J03k04K87q1O8j31j17J20j2l4j02P5j2k6K18l80L31k61P7k09J57J39
4079C1r1N3j60J55J41k37K20n9l1n1J29m7j01R2J1L6J05q7j28J86j55O2j60O8
4103a8l4m8J17j07j08J19N4j9lJ5p4L3N5MJ2j00J34%k6R2j10R7j08P6j90K50q0
$$ plain form
3927 -162 -192 -138 89 60 25 149 -56 70 196 204 47 -84 6 122 -24 97 24 -30 113 -65 2 -82 -48 -146
3951 -146 -104 -75 -8 -75 -133 50 0 -93 -49 -213 133 31 100 58 112 144 186 37 322 -155 125 108 3 141 37
3976 37 15 -103 -48 -67 -138 -11 -19 -309 -80 -13 -116 -8 -103 -24 43 -73 -54 152 148 10 58 44 291 161 95 120
4002 120 -78 -4 -54 70 25 -25 90 4 -70 -140 -103 -154 -130 12 -100 -106 -90 -102 50 -114 -23 -61 136 139 -66 -171
4028 -171 82 199 198 -101 -65 3 145 90 173 104 46 -1 28 -62 80 42 -183 -131 -201 -121 84 -91 -22 37 9 7 80
4055 80 -11 25 128 -76 211 130 198 67 -50 70 58 24 -78 -3 -15 -41 177 -203 128 -133 -56 -265 -108 31
4079 31 -60 -7 -167 -12 129 -108 112 53 22 -29 100 53 -48 44 55 91 196 109 -19 167 12 74 -86 -18
4103 -18 -52 -100 17 -90 -198 -79 -25 -44 -47 -32 -106 -73 -18 -14 -2 -102 32 32 6 98 -12 85 -23 53 -137 113 33
4130C3J01qr6p4m1K1p1o5O9K3n8J06rN8p9K7JN9J17k30K88l1j75Q2QK49j37p6
4158I2l6J9Q5o8q3o0j6M0P9j11Qo8o7M5Q8k16J59o2K45k96J57j2K4K7n3J00j06
4185h6K07j81K85k15R5J61l02J35Kj64J77O5k41J3J10j39%P7j47%J64l1k41J74
4209h2j5L8om6J21%l6K59j21j10Lj7J80m9J8r2M2j65J04K8j51K9L1k6Mm7R2j45
4237a59Q9N5k0O5j03p4K00n3lj12j18L01R8j77J91j83Q0o8o1l6qJ14j02J54K4
4262I4j28Qj79m4J69j34RO2J93j61K35j28j06O5J53J3k09J00K4R1q2Q8p5j2j50
4287a04K20j44P9j01n0n9N2O4j38K20k7j78Q5r6Q5j32J59J95k41L3K09k06J69
4310I4N7p5M3K9M5j88j2K64k78QR4j53J50l7j1j0j1j12jR0j42O4O0l1Kk2J00J7
$$ plain form
4130 33 134 126 30 -44 -85 -64 -135 -200 -131 -108 -166 -60 -69 -11 -90 -63 -62 -3 114 -116 172 141 -34 48 56 305 168 92
4158 92 56 75 160 92 9 -51 -67 -27 52 -59 -51 -119 -186 -141 -53 -269 -110 -172 73 -223 -66 -78 -54 -27 -80 20 -86
4185 -86 121 -60 225 10 105 266 -36 99 101 -63 114 179 -62 -49 61 -78 -78 -1 -148 -148 16 -15 -256 -82
4209 -82 -97 -59 -65 -111 10 10 -26 233 112 2 5 -12 168 119 137 45 87 -78 26 54 -97 -68 -37 -63 -59 -106 -14 -159
4237 -159 -70 -15 -35 30 -73 -147 53 0 -3 -115 -233 68 166 -11 180 -3 77 9 -52 -88 -96 18 -84 70 94
4262 94 -34 -26 -205 -249 -80 -214 -205 -143 50 -111 124 -4 -110 -45 108 121 -88 12 36 127 45 133 58 46 -104
4287 -104 116 -28 51 -50 -100 -159 -107 -43 -181 39 12 -166 -81 -177 -92 -224 -65 130 -111 -78 131 -75 94
4310 94 151 76 119 148 193 5 -7 257 -21 -13 81 -72 78 41 30 20 9 -103 -104 -14 -156 -92 -32 -63 -61 -83 17 34
4338C4K3j35K1J59J06j72k2r7J37R7j46J6Q0J12j18r4p3j03Q4J94o2J9k30MJ16
4363e0P4j37N7K4j07K80p6o6J36k37J05n8J12K06k95O7M2j37M8m0K3L8k33J74
4387e0k5J13q6J7o4J18m6j36Q8N5j32p1Q8K25P9k30J76j47jP7l2K9J40r3o4j69
4413a41K05j11R9N7j86m0Nl9M5m8P5N8o8K40j55n4N6o5LJ73j74N5J1J58n9m6m8
4440FJ65m2k7r5M1J02j28O8k41J51J4n6j10k2R3l0o1R6J39o9j27K76k43J36qm1
4466a3l1mK0K75j30r0K3J6N3k14K24j29J27j98Q3o1N0pk00K59j92K22j32p4L08
4491A85k66P0l5k3K35j31J1L2j5ok4L1M3r0N7R6j55N4R6j38r7k4q5K22Jj41k4
4518a21l0J45l1m6J13j18o7J59L6Q0m4n5jN5K2MQ1j25K4J5j25M2O7o9k8n8j54
$$ plain form
4338 34 57 -78 -57 102 208 36 14 -83 54 151 5 21 101 213 95 1 -72 -175 -91 103 41 60 -170 -166 -50
4363 -50 24 -113 -56 -32 -139 141 65 -1 135 -102 3 -55 57 263 -32 35 77 -60 -12 -52 -29 9 -224 -50
4387 -50 -75 38 -48 -31 -95 23 -23 -159 -71 -16 -148 -219 -131 94 173 -57 119 -28 -29 48 16 45 185 92 28 -141
4413 -141 64 -47 52 109 -77 -117 -112 -151 -106 -154 -79 -21 -89 151 -4 -58 -2 -67 -64 109 -65 -10 1 159 100 54 6
4440 6 171 129 102 7 48 150 22 90 -151 0 14 -42 -152 -174 -81 -111 -172 -76 63 -6 -133 143 -100 36 28 -13
4466 -13 -44 -48 -28 247 117 27 50 66 119 -95 129 0 127 -71 12 -49 1 -6 -206 53 -139 83 -49 -123 185
4491 185 -81 -11 -46 -69 166 35 46 78 63 57 33 64 107 17 74 170 15 69 165 27 -70 -94 -179 43 44 -97 -121
4518 -121 -151 -6 -37 -83 30 -88 -155 4 40 120 76 21 20 75 97 101 182 57 81 96 -29 13 80 11 -17 -75 -229
4545b29M9o0J20J01J04j18j18M9J09qL4J19r3r0o0J22r8K42p3Mm8l8k5J00M3j58
4571b0j5L5n1N3L9k17J78k4K2j9J04n5r0O2P2m7l9LJ9O4M8r6L6n6L1M5J20j78
4599B4nJ42q6l0q8O3j51K26j01q2J71j77qM8J13j36O9n0nl6m8K07m2J1J86k32
4625a7Q7nr0J91j41kR0j6k21K57n7o6j7j83K13j28Q7qrj6q7K5K81j79m6J02k5
4652B0p9J39j07N0m0r0J65J23N6k34NJ76p5l7j06k3J23j58M7l4mo0R7l1n3J16
4678a4j61J15N3Q5q3NM7j08J82k78L46k70k8J51P4o8kO1j15N0j22M1J81j51j11
4703a20J68o2J30j04m0L1O0j74P9k9J03oK9J8k00O2r7K83n8j24J42j8r7J9r2L
4729i4J76j53k4l5m5J27q8Q3q0O4j20J64j36N3K9J07j32J60m2J33lJ5j63k2J06
$$ plain form
4545 -229 -180 -240 -120 -19 85 -33 -151 -102 7 -1 33 152 59 -31 -91 31 -67 175 102 106 58 20 -5 95 138 -20
4571 -20 -35 0 -51 2 41 -176 2 -22 0 -19 85 30 -60 2 74 27 -12 -9 10 74 122 26 62 6 37 82 202 24
4599 24 19 161 75 45 -43 20 -131 95 -6 -88 83 -94 -102 -54 59 -77 -8 -58 -63 -99 -147 60 18 29 215 -17
4625 -17 70 65 -25 166 25 23 113 97 -124 133 76 10 -7 -190 23 -105 -18 -26 -35 -51 -138 -113 168 -11 -57 45 20
4652 20 -59 80 -27 23 -17 -107 58 181 237 3 8 184 109 72 -34 -57 66 -92 -45 -79 -83 -143 -46 -77 -130 -14
4678 -14 -175 -60 -7 78 -5 0 47 -61 121 -157 189 -81 -109 42 116 48 46 107 -8 42 -80 -39 142 -9 -120
4703 -120 48 -14 116 12 -28 3 63 -111 -32 -61 42 36 65 83 -117 -55 -152 131 73 -51 91 73 -24 -5 -97 -94
4729 -94 82 -71 -95 -130 -175 -48 -136 -53 -133 -69 -189 -25 -161 -108 -79 28 -104 56 14 147 144 159 -4 -26 80
4754H0k3p2J01j33K38j88L2J16k83M4R9j32P7n1K2q5M4R3k56J94J2N7l7J41O5
4779A55j55J14j29J35j13jK6k5J21j67Q5r3P8Q7j30J15k44Q1J6J07j43J02K4k3
4803B3O4l4q5q6J45Q9j5p8n7J50j31M4J39j23Ln7R6m0L7n0j23l6Q1nN5p9k1J02
4831Hr9J13j05m6O6J17K6P1k04l8Q5L8Q0L9n1Qj60K44l6j25J7j90n1J05P1l6J07
4858E4m3N6k1j58J61j93KJ06j6J7o4J22M0M0p5L0m8j1P6Q8j23q7L0O2j3Km5R6
4886H5o9n9j47J53M2j3k27K37M1j11l2nR1O2p9rQ2M8j23J47p4j07J71j21R3J4
4912I0k3j26K8J71m9J79l35L6N2n1o2Q7j20J21M0k03M5J8R7j71k1J50O9r5J18
4937D5%j32K93j55j09J53K6p2R9j38N5o6K5j02J82j73J81k9q3l9m4j36J09J68
$$ plain form
4754 80 57 -15 86 -47 191 3 35 151 -132 -88 11 -121 -44 -95 -73 -158 -114 -21 -277 -83 -71 -14 -51 90 155
4779 155 0 114 -15 120 7 6 32 7 128 -39 46 -47 31 118 -12 103 -141 -60 -44 63 -80 22 46 23
4803 23 87 53 -32 -118 27 116 101 23 -34 116 -15 29 168 45 48 -9 87 47 84 34 -89 -125 -44 -49 6 -73 -94 8
4831 8 -91 22 -83 -129 -63 54 80 151 -53 -91 -6 32 112 151 100 108 -52 192 156 31 48 -142 -193 -88 -17 -53 54
4858 54 11 67 46 -112 49 -144 -142 -36 -52 -35 -99 23 63 103 28 58 10 -1 75 163 40 -47 -17 45 32 34 -11 85
4886 85 16 -43 -190 -37 5 -8 -235 2 43 -68 -100 -105 -14 48 -31 -40 42 90 -33 114 40 -67 104 -17 76 90
4912 90 67 -59 -31 140 91 270 -65 -29 23 -28 -90 -3 -123 -2 38 -165 -120 -102 -5 -176 -197 -47 22 -73 45
4937 45 45 -87 206 51 -58 95 121 49 148 10 65 -1 24 -78 104 -69 112 83 0 -39 -83 -219 -110 58
4961E8K8j86k0J38p2N2o1J85l8j65KK07P6q0j57J60j63J17p9q8j30P0K11j86J75
4986E4j94O4J25k21J66j58PJ5J16J2n4J26K4J9j8Kn2O1j30K04j76Q5Ln4K5q7o6
5013a02J01r0K5K22j47j18k5N4J15r1l8J17j35K4K1J05n0M0j1J4M4L4o2L0L3o5
5039D5j7J02j60n7J97l9k36J84j50J22J2j14M1R5r3L9rp2P0NJ26o1J6j31J76j5
5065G6r5J13k14J10l9K05j37j52J83Q5k06J25p5n1J32j64MP7p8J82n7r3R7p9J44
5090I3p8j9K4j0Km4J14k89K02J43k19J97r7nM7JO1j33j89K85o7j17qr3J98k1O5
5117D3o3j07l5K27p3L8N5j04NR0o9N2j43P9J9N5k6m4Q1j33m2J9L1J05M4k65J02
5144e9m5J21n5Q0k04J29K05o6Kk99K27j56J36L7n9J16J00j40K16k12kkL3k4L3
$$ plain form
4961 58 86 -100 -120 18 -54 -2 -63 122 84 -81 -79 128 204 124 -33 127 -36 81 2 -86 -216 -146 65 -121 54
4986 54 -140 -76 49 -172 -6 -164 -157 -142 -26 -14 -68 58 82 101 83 85 33 94 -36 168 -8 77 80 26 51 -36 -102
5013 -102 -1 -91 -66 156 9 -109 -134 -80 35 -56 -94 23 -112 -88 -67 38 -12 28 17 31 75 109 47 77 110 45
5039 45 28 130 -30 -87 110 71 -165 19 -131 -9 3 -111 -70 25 -68 -29 -38 -110 -40 -35 91 30 46 -85 91 76
5065 76 -19 94 -120 -10 -49 156 19 -133 50 135 -71 54 -21 -72 60 -104 -100 -23 -101 81 24 -69 28 -51 93
5090 93 15 -4 20 10 12 -32 82 -207 -5 138 -81 116 19 14 61 62 123 -10 -199 86 19 -98 -106 -199 -1 -22 43
5117 43 -20 -127 -162 65 -8 30 85 -19 -14 76 7 59 -84 -5 14 69 43 -1 80 -53 -95 -76 -45 60 104 -161 -59
5144 -59 -104 17 -38 42 -162 -33 172 106 108 -191 36 -120 16 53 -6 110 210 70 286 74 72 70 103 79 112
5169A12o2o3N2j99J30J18m8JNP4j33Rj19M8q5J58LL4k4O9K7l16J51J02q2Q2K8
5196G2j48J9R1K65k20j35O8p1J06p8o1Q0K7L5Qj19J36j08R1j01J98l34Q5J53j37
5221g8J59j52J04L2n9M6J13j13j26K6M9l6j56J02J55j25nK39k10N9l7J22j36j08
5245a35J50J0n7P3O4k4j34J14m4M5j94J59L1j21L5j9K4J46k23oj29J86J40j76
5269h5J93j43J1R7j03M1pQ3L3l6n2M9j13J43p6L2%oJ45k11J32j09n3J00M3o0L3
5296H1j41o6l5j7%J02J1J38n8P7q5M7r6Q0J02k15N7Q7k0J23j87R1k01J72ll1q3
5323g0N0jM0j16R3p1J42p2N7j42k6M0o2J37P0q4N6J0r8Q1j51J28j01J08O2k8j68
5350a16M0J71j69Q0M2m4j9n7K6J8o1J20m6L1qk90K10J07q6J88j73M9j58J9J59
$$ plain form
5169 112 50 -13 39 -160 -30 88 40 41 46 120 -13 -4 -123 -75 -160 -2 1 35 11 80 107 -209 -58 44 -38 44 72
5196 72 -76 -57 34 299 79 -56 12 -59 47 -31 -92 -12 15 50 58 -61 75 -33 58 -43 155 -179 -94 59 -78
5221 -78 81 -71 33 65 6 52 165 52 -74 -48 1 -35 -191 -89 66 -59 -64 175 -35 24 -13 109 -27 -135
5245 -135 15 25 -32 41 105 81 -53 61 17 62 -132 27 58 -63 -28 -47 -23 123 -100 -106 -235 -49 91 -85
5269 -85 108 -35 -24 73 -30 11 4 87 120 84 32 81 -32 111 35 67 67 61 206 -5 127 18 -35 65 108 48 81
5296 81 -60 -126 -161 -178 -178 -76 -65 73 15 92 7 54 -42 38 140 -75 -18 69 49 172 -15 76 -125 47 44 13 -70
5323 -70 -20 -21 19 -97 -4 -75 67 -5 52 -90 -116 -76 -138 -1 69 -15 41 51 -47 34 -117 11 -90 18 80 52 -116
5350 -116 -76 95 -74 6 48 4 -15 -72 -46 -28 -89 31 -15 16 8 -282 -72 35 -51 137 -36 13 -145 -126 33
5375C3j61J79M9j13l3J33j61M9J5J31o6P9j52J46j28Or0O8o4K3J43k91O6K6M0
5400g3o9J78n3l4l7R8M4P9j60J34k68K65K7j65o0J47J7Lj50R1N2Pjp5J21l35L08
5427I1j13l2j9M5o8J43j86M9m3N0J9R0Jj12K37k69K29r6l1q6R8q0Q6O2o2n0j4
5454f1l6J62j31l8LK9J64j96R8n3N7M6j46%j05L15j6P7k38m0J77j7J43j56o8j
5480c1m6j9Q6J01j17O1p1m7M2P4p1l3K4J41j04k9J01j06J1O2q6M9J00j54J29J6
5506H3M5j05M8j04k9Nm9K03q9J31j12J0J3l2p4R0j14J8k5Q0j12P5p4J70m2q2R1
5533A9L8k11L01r0R2k82Q8M2j18L76l76J71j87K82k55J39j02l4K25o6k6oK25j48
5557I7o6k8j13J28rJ6O5kj29J30lJ0j15m6M9J08j38N5M7n4l4j01J30M3j61J06
$$ plain form
5375 33 -128 51 100 -13 -46 87 -74 -25 -10 121 55 134 -18 128 0 6 -84 -16 -80 -57 86 -205 -139 -113 -73
5400 -73 -142 36 -17 -51 -88 10 54 133 -27 107 -161 104 131 -34 -94 53 70 73 -77 14 66 73 72 -3 118 -217 91
5427 91 -22 -54 -73 -28 -96 47 -139 -90 -133 -83 -64 26 27 -85 152 -117 112 16 -15 -101 -3 -83 3 65 3 -47 -61
5454 -61 -97 65 -66 -104 -101 -72 92 -104 -6 -59 -2 44 -102 -102 -207 108 92 169 -69 -109 68 51 194 38 -30 -31
5480 -31 -77 -96 -10 91 -26 35 -36 -83 -41 33 -38 -71 -47 94 -10 -39 62 -44 -33 29 -57 -8 92 -62 67 83
5506 83 128 23 71 -33 -62 -57 -106 97 8 139 27 37 50 18 -56 34 -80 -62 -87 -7 -119 -44 -118 52 10 -72 19
5533 19 57 -154 147 57 149 -133 -45 -3 -121 255 -121 50 -137 145 -110 29 -73 -107 118 52 26 20 245 97
5557 97 31 3 -110 18 9 25 90 88 -41 89 86 96 -19 -65 -16 92 -46 9 56 2 -32 -133 -3 40 -121 -15
5583a5o2J85n3M2O2j93r0J42J2r2j7J02M0j25n4J53m8p8O8M2J27m8k35P7o5K15
5609I2l9j17K2K05l01K16j73K7N6j22J46r1O2P4o9j12K22m2O1o6j3L0o7j4P4m1
5635B0M3p4j38J32J9m7Q2j02Kk0mQ2L1j66K53k31J18j18K1R1j21P6j7J51K2k6
5661G9j21J33m9J30k22Q1K1oL5J6k46J66n5j13J65j10J2J13q3j25K18j65J29O8
5685G1n0j05J64N0p1j85J09j4J60j33p1J42m2L7j20J23q3L8J45r0j04j14Q4Q5
5709B6k22J78P3j18R5q3Q9J1j00N0O8J0O0k11J57j09J1Np5O6r6mJ26J08k88L4
5735a39K18j25Nj45K67l60K09Q7j02J13o8R1k4k2K3n4J85k49R6J20p4r2O5l5M6
5760C6J42k27J38k04J41j21O7j13J7K93k58N3J0j00J10r0J6N3J6O4l8J04k03M2
$$ plain form
5583 -15 -77 108 55 97 159 -34 -124 18 30 -62 -79 23 63 -62 -116 37 -11 -89 -21 21 148 100 -135 -58 -123 92
5609 92 53 -64 -42 163 -138 78 -95 -68 -12 -134 12 -79 -17 57 -12 -124 98 56 117 51 38 68 1 -13 61 20
5635 20 63 -11 -149 -17 2 -45 37 -65 -63 -83 -87 -5 26 -140 113 -118 0 -118 -97 -6 -127 -51 -68 83 105 79
5661 79 -42 91 42 172 -50 31 52 46 81 97 -149 17 -38 -151 14 -96 -84 29 -54 -179 39 -126 3 71
5685 71 21 -84 80 130 59 -126 -17 -31 129 -4 -75 67 25 62 -58 65 -18 20 165 75 -29 -143 -59 26
5709 26 -196 -18 55 -63 32 -51 38 49 -51 -1 67 77 137 -74 83 -26 -15 -10 -85 -19 -115 -119 7 115 -173 -139
5735 -139 79 -46 -41 -186 81 -279 -70 17 -85 28 -40 51 27 5 28 -26 159 -90 6 126 52 -40 25 -10 36
5760 36 178 -49 89 -115 26 -95 -28 -141 -124 169 -89 -36 -26 -126 -16 -106 -90 -37 -21 43 5 109 -94 -52
5784e2N4R4r7j6J32k00J70P0j34o5M4JP5j05K3P9j13J33o6j26J6N6J2j8J32m1
5810E8j65J76J28j21p1O8rr3N9j24l5J70oj90J3K50n5j15Q7L5m7k3q8K1J15M0
5836G8j87R3o7J63l5j44PO4j73K80j0N2j64J47k0j20N0q0K24j10M0K3j64m9m6
5861a48K05j76K54j84j0r0J50O1L8k13M9R3nj99J63j04J10J97j49J37k25l9M9
5884c6K6J17j80q3K8J02Q6j9J6j38Q9o7M6k5m1k4Q9m5J27j37o5J20L7K00k25o6
5910f8J66k61L61k50o6J60o4j85K92n1j74J12R4p5k%Q6j42J04m6M3m2k9J30j80
5935h7J39M0j79J39l8j8rJ00p1j10J3J10q4j6L0K0R6j55J69n6j37K44j48J2o8
5960f4J35j27J31N2j59J7J36l2j18J22j48N4P0Q9p6j88J96q4o2O5k6knJ1j25P2
$$ plain form
5784 -52 2 96 -1 -17 115 -85 85 155 21 -44 0 1 76 -29 -6 73 -40 93 27 -99 -83 -27 -15 -33 99 58
5810 58 -107 69 197 76 5 73 64 -29 30 -94 -129 41 35 -155 -142 108 53 -62 25 60 13 -10 -98 -77 38 78
5836 78 -109 -16 -83 80 45 -99 -92 -28 -201 79 69 121 -43 104 84 -36 14 -66 158 48 88 111 -53 -102 -148
5861 -148 57 -119 135 -49 -59 -149 1 62 100 -113 -64 29 24 -175 -12 -116 -6 191 42 179 -46 -85 -36
5884 -36 -10 107 -73 -156 -128 -26 60 41 57 -81 8 -59 -13 -38 -79 -103 -14 -59 68 -69 -134 -14 23 223 -2 -68
5910 -68 98 -163 198 -52 -118 42 -22 -207 85 34 -140 -28 66 -9 -11 -11 75 -67 37 -9 34 -8 -37 93 -87
5935 -87 52 92 -87 52 14 -4 -13 87 16 -94 -81 29 -55 -71 -41 -21 75 -80 89 33 -104 140 -8 4 -64
5960 -64 71 -56 75 127 -32 -15 121 89 -29 93 -55 -1 69 158 82 -106 90 6 -56 9 -17 -19 -24 -13 -138 -66
5986f6k2J51O7o3r1N9p9L5K2n7O4n2J31r5N2r4L2q6K23l1J3j48J08j63l6O3O5
6013BJ8J22j77K5Q2j7j73K22k27R8p6q0J95p6K6Q9L6p1qn8JJ13l57L70o5j11J24
6040B7o6Q6j48K50j99o9P6J38J9r7pM4k50K42k11J11J18o8m1J1kK9k5N8j04K7
6066e1J81o0j13j6J29n2j00K14j55m7J75l8k08R8N7j00J9N5j30J91j81J50p6R2
6090C4J3L5j02N7K5Q4j11q8M5O3O0l1r3J1Q9L5j44J47j50K3m3R8k34J02l6R3r1
6117a09J3J77l0Jq1N7l6O5o3K1L4l37L05J20q4J50k07j1q5pR7J68j37m7O0j63
6143a29K64k01l9M5k7J01o2K15j48q5J63k4q5m4J60o2M9N9K0j04k19J75o8J27
6167H1j05J30k9L0r5n0Q7O3m4J21l04J98k30J00J32j62J84j98J08n8m0P1j5p0
$$ plain form
5986 -66 -88 63 130 67 -24 35 -44 -9 13 -44 20 -32 99 4 56 -38 -6 -92 131 100 113 -35 73 -90 -126 -63 2
6013 2 20 142 -35 -10 72 55 -118 104 -123 -25 -101 -181 14 -62 -36 53 89 18 10 -48 -47 66 -291 79 14 -97 27
6040 27 -39 47 -101 149 -50 -119 -43 95 114 17 10 54 -196 46 -165 -54 64 -4 -45 -34 -36 -7 -32 26 -78 -51
6066 -51 130 70 -43 -59 70 18 -82 132 -23 -70 105 67 -141 -43 14 -86 -67 -12 -142 49 -132 18 -58 34
6090 34 47 82 -20 37 62 146 35 -53 -8 55 115 84 -9 2 91 126 -18 129 -21 2 -41 57 -177 -75 -111 -18 -109
6117 -109 -96 81 51 52 -29 28 -8 57 -6 15 49 -288 17 137 53 203 -4 -15 -100 -107 -10 158 21 -26 34 -129
6143 -129 135 -66 -105 -60 -87 14 -48 167 19 -66 97 73 -12 -56 104 42 91 150 170 66 -153 22 -46 81
6167 81 -24 106 77 107 12 -38 49 112 68 189 -115 83 -147 -47 85 -77 107 -91 17 -41 -81 -10 -25 -95
6191i5P3o8P3j05K21j84J16j7J01l3j02O4M7j21n8N7P3O1j62J24m4p5j1N6Ol7
6217d0nj2O6j07J91j96J09k6m9J38m9rN2j01pJ5j03O3p4J68%M3j38R1k5n9J04
6244D0n7J12mn8j10N4L1j1q7K22o7o8K5o0J74j09j03O3N5Q1q5p7M9J46k20j28
6270a92J78P5j78J48KM6j61l5l1K94j30r7O0r1J97j69pJ42r3Q8j51LJ20j72K1
6295a33L7J08l8J52k20L4L8K7K09j16k0j21R3j00m8J8PK64k37L0J95k0j59K4J42
6320A66l2q1J0j7j55K00mk52J43o6j10O3L9QJ53k0K6j37K7o4J66r4o3j3R9R2R1
6347A75j16n2o7O5j1j74K07Or6M8j51K86l0k16J15k3J66j84j7J02J06k34J37k14
6371a72J28j9OM9J4J57j56o0j16J54N4R3o5j78J72r6J89k03R7rn6Q3o1J27j22
$$ plain form
6191 -95 -22 -90 -17 -122 99 -85 31 14 115 82 -20 44 91 -30 -88 -31 42 103 -59 65 21 -54 -65 -9 -3 -40
6217 -40 -45 -57 9 -98 93 -103 6 -20 -69 69 20 11 63 -38 -45 -30 -133 -70 -144 24 24 67 -71 20 -5 -64 40
6244 40 -17 95 91 33 -77 -23 8 -3 -90 132 65 -3 22 -38 136 27 -76 -13 42 123 38 -39 10 156 -64 -192
6270 -192 -14 61 -117 31 33 79 -82 -117 -148 146 16 -81 -21 -112 85 -84 -91 51 -42 46 -105 -102 18 -154 -133
6295 -133 -96 12 -26 126 -94 -60 -22 5 214 98 78 -43 50 -50 -98 -80 -73 191 -46 -16 179 159 0 24 166
6320 166 134 53 63 46 -109 91 87 -165 -22 -88 -198 -135 -96 -88 65 45 71 -66 -39 -103 63 -31 -94 -107 -8 84 175
6347 175 59 7 -60 5 -6 -180 27 33 -63 -15 -166 120 90 -126 -11 -34 132 -52 -69 33 139 -95 42 -172
6371 -172 -44 -63 -57 -8 6 163 7 -53 -169 -15 39 132 67 -111 61 -35 154 -49 48 39 -17 66 5 132 10
$$ [...]
8191b7
##END NTUPLES=NMR FID
##END=
