##TITLE=1H_Pr 53-1
 CDCl3
 8 sc, 
 20.09.2022
##JCAMPDX= 6.0         $$ Bruker NMR JCAMP-DX V2.0
##DATA TYPE= NMR FID
##DATA CLASS= NTUPLES
##ORIGIN= UXNMR, Bruker Analytische Messtechnik GmbH
##OWNER= root
$$ XWIN-NMR		Version 3.5
$$ Tue Sep 20 14:13:55 2022 Russian Standard Time (UT+4h)  she@DPX200
##.OBSERVE FREQUENCY= 200.1313499994
##.OBSERVE NUCLEUS= ^1H
##.DELAY= (6, 6)
##.ACQUISITION MODE= SIMULTANEOUS
##.ACQUISITION SCHEME= undefined
##.AVERAGES= 8
##.DIGITISER RES= 18
##SPECTROMETER/DATA SYSTEM= spect
##.PULSE SEQUENCE= zg30
##.SOLVENT NAME= CDCl3
##.SHIFT REFERENCE= (INTERNAL, CDCl3, 0, 15.7039)
##AUDIT TRAIL= $$ (NUMBER, WHEN, WHO, WHERE, WHAT)
$$ ##TITLE= Audit trail, XWIN-NMR		Version 3.5
$$ ##JCAMPDX= 5.01
$$ ##ORIGIN= Bruker BioSpin GmbH
$$ ##OWNER= she
$$ F:/spectra/data/she/nmr/H-F/1/audita.txt
$$ ##AUDIT TRAIL=  $$ (NUMBER, WHEN, WHO, WHERE, WHAT)
(   1,<2022-09-20 14:12:53.14 +0400>,<she>,<DPX200>,
      <created by zg, POWCHK disabled, PULCHK disabled
       configuration hash MD5:
       00 E9 B6 7A A2 85 ED C7 34 08 36 98 17 FE 4E 26
       data hash MD5: 16K
       4D 00 6C 10 9A 35 C2 DD 50 BD EB 05 5F 9D 7D A7>)
$$ ##END=
$$ 
$$ hash MD5
$$ 18 1D D4 3E 8E 57 FB 43 CF 85 07 42 10 AB 17 81
##$RELAX= 
##$RELAX= 
##$RELAX= 
##$RELAX= 
##$RELAX= 
##$RELAX= 
$$ Bruker specific parameters
$$ --------------------------
##$DU= <F:/spectra>
##$EXPNO= 1
##$NAME= <H-F>
##$PROCNO= 1
##$TYPE= <nmr>
##$USER= <she>
##$AMP= (0..31)
100 100 100 100 100 100 100 100 100 100 100 100 100 100 100 100 100 100 
100 100 100 100 100 100 100 100 100 100 100 100 100 100 
##$AQSEQ= 0
##$AQ_mod= 1
##$AUNM= <au_zg>
##$AUTOPOS= <>
##$BF1= 200.13
##$BF2= 200.13
##$BF3= 200.13
##$BF4= 200.13
##$BF5= 200.13
##$BF6= 200.13
##$BF7= 200.13
##$BF8= 200.13
##$BYTORDA= 1
##$CFDGTYP= 0
##$CFRGTYP= 5
##$CHEMSTR= <none>
##$CNST= (0..31)
1 1 145 1 1 1 1 1 1 1 1 1 1 1 1 1 1 1 1 1 1 1 1 1 1 1 1 1 1 1 1 1 
##$CPDPRG= <>
##$CPDPRG1= <>
##$CPDPRG2= <>
##$CPDPRG3= <>
##$CPDPRG4= <mlev>
##$CPDPRG5= <mlev>
##$CPDPRG6= <mlev>
##$CPDPRG7= <mlev>
##$CPDPRG8= <mlev>
##$CPDPRGB= <>
##$CPDPRGT= <>
##$D= (0..31)
0 1.2 0 0 0 0 0 0 0 0.06 0 0.03 0 0 0 0 0.0002 0 0 0 0 0 0 0 0 0 0 0 0 
0 0 0 
##$DATE= 1663668772
##$DBL= (0..7)
120 120 120 120 120 120 120 120 
##$DBP= (0..7)
150 150 150 150 150 150 150 150 
##$DBP07= 0
##$DBPNAM0= <>
##$DBPNAM1= <>
##$DBPNAM2= <>
##$DBPNAM3= <>
##$DBPNAM4= <>
##$DBPNAM5= <>
##$DBPNAM6= <>
##$DBPNAM7= <>
##$DBPOAL= (0..7)
0.5 0.5 0.5 0.5 0.5 0.5 0.5 0.5 
##$DBPOFFS= (0..7)
0 0 0 0 0 0 0 0 
##$DE= 6
##$DECBNUC= <off>
##$DECIM= 32
##$DECNUC= <off>
##$DECSTAT= 4
##$DIGMOD= 1
##$DIGTYP= 9
##$DL= (0..7)
0 120 120 120 120 120 120 120 
##$DP= (0..7)
150 150 150 150 150 150 150 150 
##$DP07= 0
##$DPNAME0= <>
##$DPNAME1= <>
##$DPNAME2= <>
##$DPNAME3= <>
##$DPNAME4= <>
##$DPNAME5= <>
##$DPNAME6= <>
##$DPNAME7= <>
##$DPOAL= (0..7)
0.5 0.5 0.5 0.5 0.5 0.5 0.5 0.5 
##$DPOFFS= (0..7)
0 0 0 0 0 0 0 0 
##$DQDMODE= 0
##$DR= 18
##$DS= 0
##$DSLIST= <SSSSSSSSSSSSSSS>
$$ [...]
##$SUBNAM2= <"">
##$SUBNAM3= <"">
##$SUBNAM4= <"">
##$SUBNAM5= <"">
##$SUBNAM6= <"">
##$SUBNAM7= <"">
##$SUBNAM8= <"">
##$SUBNAM9= <"">
##$SW= 18.0517283424941
##$SWIBOX= (0..15)
0 0 2 0 0 0 0 0 0 0 0 0 0 0 0 0 
##$SW_h= 3612.71676300578
##$TD= 16384
##$TD0= 1
##$TE= 0
##$TE2= 300
##$TE3= 300
##$TEG= 300
##$TL= (0..7)
0 120 120 120 120 120 120 120 
##$TP= (0..7)
150 150 150 150 150 150 150 150 
##$TP07= 0
##$TPNAME0= <>
##$TPNAME1= <>
##$TPNAME2= <>
##$TPNAME3= <>
##$TPNAME4= <>
##$TPNAME5= <>
##$TPNAME6= <>
##$TPNAME7= <>
##$TPOAL= (0..7)
0.5 0.5 0.5 0.5 0.5 0.5 0.5 0.5 
##$TPOFFS= (0..7)
0 0 0 0 0 0 0 0 
##$TUNHIN= 0
##$TUNHOUT= 0
##$TUNXOUT= 0
##$USERA1= <user>
##$USERA2= <user>
##$USERA3= <user>
##$USERA4= <user>
##$USERA5= <user>
##$V9= 5
##$VALIST= <valist>
##$VCLIST= <CCCCCCCCCCCCCCC>
##$VD= 0
##$VDLIST= <DDDDDDDDDDDDDDD>
##$VPLIST= <PPPPPPPPPPPPPPP>
##$VTLIST= <TTTTTTTTTTTTTTT>
##$WBST= 1024
##$WBSW= 4
##$XGAIN= (0..3)
0 0 0 0 
##$XL= 0
##$YL= 0
##$YMAX_a= 110413
##$YMIN_a= -138376
##$ZGOPTNS= <>
##$ZL1= 120
##$ZL2= 120
##$ZL3= 120
##$ZL4= 120
##$ABSF1= 10
##$ABSF2= 0
##$ABSG= 5
##$ABSL= 3
##$ALPHA= 0
##$AQORDER= 0
##$ASSFAC= 0
##$ASSFACI= 0
##$ASSFACX= 0
##$ASSWID= 0
##$AUNMP= <proc_1d>
##$AZFE= 0.1
##$AZFW= 0.1
##$BCFW= 1
##$BC_mod= 2
##$BYTORDP= 1
##$COROFFS= 0
##$CY= 11.3945322036743
##$DATMOD= 1
##$DC= 2
##$DFILT= <>
##$DTYPP= 0
##$F1P= 2.36226072786647
##$F2P= -0.459571619588291
##$FCOR= 0.5
##$FTSIZE= 0
##$FT_mod= 4
##$GAMMA= 1
##$GB= 0.15
##$INTBC= 1
##$INTSCL= 1
##$ISEN= 128
##$LB= 0.24
##$LEV0= 0
##$LPBIN= 0
##$MAXI= 10000
##$MC2= 0
##$MEAN= 0
##$ME_mod= 0
##$MI= 1.114404
##$NCOEF= 0
##$NC_proc= 0
##$NLEV= 6
##$NOISF1= 3.799351
##$NOISF2= 2.8
##$NSP= 1
##$NTH_PI= 0
##$NZP= 0
##$OFFSET= 15.70392
##$PC= 1
##$PHC0= -18034.74
##$PHC1= 12.40069
##$PH_mod= 1
##$PKNL= yes
##$PPARMOD= 0
##$PSCAL= 0
##$PSIGN= 0
##$REVERSE= no
##$SF= 200.130013532006
##$SI= 16384
##$SIGF1= 3
##$SIGF2= 2
##$SINO= 400
##$SIOLD= 16384
##$SREGLST= <1H.CDCl3>
##$SSB= 0
##$STSI= 0
##$STSR= 0
##$SW_p= 3612.71676300578
##$SYMM= 0
##$S_DEV= 0
##$TDeff= 0
##$TDoff= 0
##$TI= <>
##$TILT= no
##$TM1= 0
##$TM2= 0
##$TOPLEV= 0
##$USERP1= <user>
##$USERP2= <user>
##$USERP3= <user>
##$USERP4= <user>
##$USERP5= <user>
##$WDW= 1
##$XDIM= 8192
##$YMAX_p= 0
##$YMIN_p= 0
$$ End of Bruker specific parameters
$$ ---------------------------------
##NTUPLES= NMR FID
##VAR_NAME=  TIME,          FID/REAL,        FID/IMAG
##SYMBOL=    X,             R,               I
##VAR_TYPE=  INDEPENDENT,   DEPENDENT,       DEPENDENT
##VAR_FORM=  AFFN,          ASDF,            ASDF
##VAR_DIM=   8192,          8192,            8192
##UNITS=     SECONDS,       ARBITRARY UNITS, ARBITRARY UNITS
##FACTOR=    0.0002768,     1,               1
##FIRST=     0,             0,               0
##LAST=      2.2672688,     0,               0
##MIN=       0,             -138376,         0
##MAX=       2.2672688,     110413,          0
$$ Real data points
##PAGE= N=1
##DATA TABLE= (X++(R..R)), XYDATA
$$ [...]
1780C54L3R9k04n7J6K42J55o52J59K54n4k00k55K85m03j17M55m97k5k09L26n2
1802c47n6K43k3K0J04J95j32K85k45M90j53l68M43K99l84k88L61n3m16j4K07O9
1824B37k84k42L91l03j51j27M02Jl78K36J84l55qM69J65n58J23L52q1k11J94M19
1846D75j66J02Q9l20m64L74L77l98o8M0J24k92l03J64L63m36R5L25m47k56L82
1867b40L3M7j58K95Q8l56L62J50M1m42L82J89m6n0J0J48l3l43L48j73j81o0K35
1890B46k75j2j49q1j36J2L20l29K94l25L92k56k5O4L65j26j66N28j88J46j53M16
1912E62m49QL6K73j04k21Q9J20k26k37J55J2l58k58N72K6k55k43J35L60l91j95
1934e89N42k9l43L84J93k16nK62M01l33J6J01j14n6J30m80M19k3m30J0K29p4k59
$$ plain form
1780 354 387 486 282 225 241 483 638 -14 145 399 345 145 -110 175 -228 -345 110 -387 -412 -621 -295 -347
1802 -347 -403 -160 -183 -163 -59 136 4 289 44 534 381 13 456 755 371 83 444 391 -25 -39 168 237
1824 237 -47 -289 102 -201 -352 -479 -77 -76 -454 -218 -34 -389 -397 72 237 -321 -198 154 73 -138 56 475
1846 475 309 411 500 180 -284 90 467 69 1 41 165 -127 -430 -266 97 -339 -244 81 -366 -622 -240
1867 -240 -207 -160 -318 -23 65 -291 71 221 262 -180 202 391 345 295 305 453 420 77 425 252 71 11 246
1890 246 -29 -41 -190 -271 -407 -395 -75 -404 -110 -435 -43 -299 -324 -260 105 -21 -187 341 153 299 146 562
1912 562 113 121 157 430 326 105 194 314 88 -149 6 18 -340 -598 -26 0 -255 -498 -363 -3 -394 -589
1934 -589 -47 -76 -419 -35 158 -58 -63 199 600 267 283 384 270 214 344 -136 283 260 -170 -160 69 -5 -264
1957b64m9K23J05m80n3M72j20m18K01M13J37k54j44N99l85j53N89j28j23j8N5
1978B05M43l43k72L22l3j16k70P0Q2k02j71K19L3k13m07O47J61l30l54L58Nj11
2000b77L6J77O9kj43M71M7m58J96K28L86m39l33N18N9n33k15L15K9k67j29N46
2022B81k86n79L97K16l12k45L78M1k68M26j80J50N7J06o3Q6K69k17l48K56P0k55
2044b0L0J38Q8n59L23K11n8l45lJ11j22k42J56M04m16J4Q7K91jn11L54J82J25
2067B37n08L63N24m49j8L17L14q16N1K24P9l93K70K94j88l58M3l4j11k85L81l27
2089c90l7K49k06L06o5j12N3J37J28r9o9M66j99Kk94N15j78k01L40k23M2o8j3
2112H4m4M27k04l20P2J58m45j88M71k21l51J62M85l7o39L73J49k56K9J31N41m40
$$ plain form
1957 -264 -313 -90 15 -465 -518 -46 -166 -584 -383 30 167 -87 -231 368 -17 -170 419 291 168 150 205
1978 205 648 305 33 355 322 206 -64 6 88 -114 -285 -66 -33 -246 -653 -6 155 -175 -529 -171 -166 -277
2000 -277 -241 -64 5 3 -140 331 378 -80 116 344 730 291 -42 476 535 2 -213 102 131 -136 -265 281
2022 281 -5 -584 -187 29 -283 -528 -150 -109 -377 49 -131 19 76 182 119 205 474 257 -91 165 235 -20
2044 -20 10 148 236 -323 0 211 153 -192 -195 -84 -206 -448 -292 112 -304 -290 -203 88 87 -424 -70 112 237
2067 237 -271 92 616 167 149 466 780 -36 15 239 318 -75 195 489 301 -57 -14 -48 -159 -444 -63 -390
2089 -390 -427 -178 -384 -78 -143 -255 -202 -65 63 -36 -105 361 162 164 -130 385 207 6 346 123 165 97 84
2112 84 40 467 263 -57 15 173 -272 -460 11 -210 -561 -399 86 49 -590 -217 -68 -324 -295 -164 377 -63
2134f3J73N59n70k85N08J03m04J27N94m65k0j81nm4k35J55k40K26k96m5M07l64
2156c65J11J87n1K01l41L49q4l00L81j9J50k07J44J85m24J19K85M23p53J22M03
2177E16k68l06K10J70o48k2M05j57l61K66k6J7k67L49J53l03J91j2m0J32r7J43
2199D5K11L4k00J61k41J68O2j22L8k83L22l0j84k75L70k53k52M41j1l49k28L73
2221b03K99m27P5J66k5m08K90N41l50l29M70L64l22j09N86m02n0K51l09pn6qO9
2244A06l41K67n5j44j28o7OJ75k89L01r0R7p7K70o2j98m8N09k43k6n2K52K7k24
2268c4K31Lo8J05L04k33k81M1J61k57j98L95j21p8l04J53K0K0l7J4N1k55N19j90
2292c9k66K20O9MJ40m8M55k45k52QL02k12r8J11J62n03K72J99k15l24R4L27m86
$$ plain form
2134 -63 110 669 99 -186 322 425 21 148 742 277 257 76 71 27 -208 -53 -293 -67 -363 -408 -1 -365
2156 -365 -254 -67 -118 83 -258 91 7 -293 88 69 219 12 156 341 -83 36 321 744 -9 113 516
2177 516 248 -58 152 322 -326 -348 57 -100 -461 -195 -221 -204 -471 -122 31 -272 -81 -93 -133 -1 -98 45
2199 45 256 290 90 251 10 178 240 118 156 -127 195 165 -19 -294 76 -177 -429 12 1 -348 -576 -203
2221 -203 96 -331 -256 -90 -115 -523 -233 308 -42 -371 99 463 141 32 618 216 166 417 108 101 45 37 106
2244 106 -235 32 -23 -167 -295 -362 -356 -181 -470 -169 -259 -162 -239 31 -31 -229 -277 232 -11 -37 -89 163 190 -34
2268 -34 197 200 132 237 541 308 27 68 229 -28 -226 169 48 -30 -334 -181 -161 -141 -178 -164 -113 -368 151 -39
2292 -39 -305 -85 -16 -12 128 80 535 290 38 46 348 136 38 149 311 -192 80 279 64 -260 -166 161 -325
2315c25J96n4K84k29l33L03j00K75l17K86J23k95K72L96m55K57j20P6J8K6r8R3
2337B79j4j18P4l07r2L53l55L96l23n7P3l64M03j11j26k2L3K46p9r8K56k74J01
2360a26o7N15j50l07L02J80Rl49NL15k63j25K29m3N0j79J36k12o8J7J0N7k47K33
2384g8pP7m13K95K68j5p4j53J14j0J47j79L65P3j25k3J53j47j40l41J17J53K2
2407G9j57M0r5j45J63K3l48J68j58K80L54k42j49R3J97j51k50L97o0L7j02L73
2429C47l04O6J77j0o2L4l06J77M9l54J44q7lj48R1J27m5k6o5K84q8l80O45J5m94
2454b16O5K05K59l71K3j0J19J69k89J20P0o5r5j04J61Q6j03n47M85j55L1q4N7
2477a89l8q2J00K63pj95J89J44j69k51L23J61l4k22J22K6K06n11L16J59k57l2
$$ plain form
2315 -325 -129 -183 101 -128 -461 -158 -258 17 -300 -14 109 -186 86 482 27 284 164 240 258 284 186 279
2337 279 265 147 221 -86 -178 175 -180 216 -107 -164 -91 -455 -52 -163 -289 -311 -278 -32 -111 -209 47 -227 -126
2360 -126 -193 322 172 -135 167 347 356 7 12 327 64 -61 168 125 175 -4 132 -80 -148 -131 -121 -64 -311 -78
2384 -78 -85 -8 -421 -126 142 127 53 -100 14 4 151 -28 337 410 285 262 415 268 128 -213 -96 57 79
2407 79 -78 -38 -133 -278 -115 -92 -440 -272 -430 -150 204 -38 -187 -94 103 -48 -298 99 39 76 -26 347
2429 347 43 109 286 276 214 248 -58 119 168 -186 -42 -129 -132 -280 -189 -62 -107 -133 -198 86 -2 -382 263 278 -216
2454 -216 -151 54 313 -58 -35 -45 74 243 -46 74 144 79 -16 -120 41 127 24 -523 -38 -193 -162 -246 -189
2477 -189 -227 -309 -209 54 47 -148 41 185 16 -235 88 249 215 -7 115 141 347 -164 152 311 54 22
2499B2r3K27q1l60K15L91l47j50n0M2J04k05N8K54L4l61LJ85J56m21L20L54l98
2522a01P0K06J26k77j44J36O5k8nJ66j17M5p7j47j14K8J67k26J35J94j05l26L09
2545b0k08j21M76k02l5J2K71n1k43J46K74k5k58L1M64l63K52m01rP4j15L07Nl75
2569a14m6j92M09O9k06j26J56J43m33N2K11p4j73N05k14N7j56J17Q5r7J87Q3j94
2592D9L0p7j1O3J52Rk47o4L12l90K89j04J5j11R0m2J16k73O0J78k87K30j51K21
2616E7l8jR0k21M2j9J34J99k34j18L28o2J4N7k45J28n9K06J37k85k33J86k77J7
2640a97j23K19J37m84L62J21l15K47K80l57O7J11J40j39J18r3K36r3L6Q0m79L18
2662A92Nj9kk97J99j0k2K3K0j6m12J75K47k42j2K5M71k74j47n4K38l93J30K65
$$ plain form
2499 22 -71 156 75 -285 -70 321 -26 -176 -226 -184 -80 -285 -227 27 61 -300 -297 -112 44 -377 -57 297 -101
2522 -101 -31 175 301 24 -120 16 81 53 48 214 97 142 65 -82 -196 -168 -1 -227 -92 102 -3 -329 -20
2545 -20 -228 -349 127 -75 -110 -98 173 122 -121 25 299 274 16 47 511 148 400 -1 -10 64 -51 256 261 -114
2569 -114 -160 -352 57 126 -80 -206 -50 93 -340 -288 -77 -151 -324 181 -33 24 -132 -15 70 -27 160 243 49
2592 49 79 2 -9 54 206 215 -32 -96 216 -174 115 11 26 -85 5 -37 79 -194 -134 44 -243 -13 -164 57
2616 57 19 18 108 -113 -71 -90 44 243 9 -109 219 157 171 228 -17 111 52 258 395 110 -123 63 -214 -197
2640 -197 -320 -101 36 -448 -86 35 -280 -33 247 -110 -43 68 208 69 187 94 330 237 273 353 -126 192
2662 192 197 178 176 -121 78 68 46 69 89 73 -339 -164 83 -159 -171 -146 325 51 -96 -150 88 -305 -175 90
2686I0p8R9M9K9j68L1K03Qj28p9J49k35j67K68K52m04J03J9j19k6j72P8M3l27
2710d82N93m77L18J36J93n12J98n1J51N05o67N1K81j37J0P6j69M2k3O1k6n7l78
2733c64L74j46J47k86K79l2m08J12M62n57K45L84l45m7L37K8j42r0M20j23j53
2754I5N5L9m0j24J82j12n7N0j06J57k37j36p9M16n2l18L35j72q1j16J56K0p2J5
2778a82J27K21l73K47n5j85K50J33J6j49K1L3o2j79K64L5k9j05j14m3j07L01q7
2801b2J06k47J19r5J14J37Oj48k46K29p9J99L22l81K0L74l50L6L26k37j89L79
2823C73m0j74m9j4Q4p5Rm2j61k7J12k3j15l8J88k47K0J12J24j33J77k5l51K89
2847b6k14M34j0o5k53L65j00p8J82k96k53K86J23k43M9J14q9r9K52l01L97k18
$$ plain form
2686 90 12 111 160 189 21 52 255 263 135 56 205 -30 -197 71 323 -81 22 41 -78 -104 -276 -198 -155 -482
2710 -482 111 -366 -48 88 281 -231 -33 -84 67 572 -95 -44 237 100 110 186 17 59 36 97 71 14 -364
2733 -364 10 -136 11 -275 4 -28 -436 -324 138 -419 -174 210 -135 -182 155 183 41 -49 371 248 95
2754 95 150 189 149 25 207 95 38 88 -18 139 -98 -234 -313 103 51 -267 68 -104 -185 -301 -145 -125 -197 -182
2778 -182 -55 166 -207 40 -15 -200 50 183 199 50 71 104 42 -137 127 162 133 28 -86 -129 -236 65 -22
2801 -22 84 -163 -44 -139 -25 112 118 -30 -276 -47 -126 73 395 14 34 408 58 94 420 183 -6 373
2823 373 333 159 110 96 180 105 114 72 -89 -116 -4 -27 -142 -180 8 -239 -219 -107 17 -116 61 36 -315 -26
2847 -26 -240 194 184 119 -134 231 131 53 235 -61 -314 -28 95 -148 -99 15 -74 -173 79 -222 175 -43
2869d3k70J78j12m9L64O1l10q0K60R2n2j5QL37m02M9l6J23jJ39l89J94ON8k42
2894a32J28q1l9K80l56l4K90n2k98J88J73r5o3ML26m75M28J55l17j9J32j15L22
2917C50P3k40r7j14K95l41L53k99kL3q1l4j26j50J80J96j16jJ52j15N7ol5p2N19
2942C79o19L42k98K31N46k37l3j23n9j73K24j03O7j06q3j08J9J52j49p0o4j9M8
2965b36m4j74L16k10K25Q3j82J82m3K13R9l71L8L78r5l0R8j14L8n0J61p7k04R7
2989I8j12j33K6J09q3J46MO6l02j01J52j55J83M7k8J53j38P1KM7J41k00J8oJ50
3014A55P1j80K6J63j09j32M8j25L29k82l8J50l40K50k5R7j15l4j67J81L4QM6J98
3038B09j93Q6j81J64J34p1o0K02j72j4o9J73J34j71k03k8K19k86j81J56K88m96
$$ plain form
2869 -43 -313 -135 -247 -296 68 129 -181 -261 -1 91 39 24 32 369 -33 16 -20 103 102 241 -148 46 52 110 -132
2894 -132 -4 -85 -124 156 -200 -234 56 4 -294 -106 67 -28 -91 -87 239 -236 192 347 30 11 143 28 350
2917 350 423 183 86 -28 267 -74 279 -20 -22 11 -70 -104 -230 -380 -200 -4 -120 -121 31 -84 -27 -33 -68 -140 379
2942 379 -240 102 -196 35 581 344 311 188 129 -44 180 77 144 38 -45 -153 -134 18 -131 -201 -265 -284 -236
2965 -236 -280 -454 -138 -348 -123 -40 -222 -40 -83 130 229 -142 -104 274 179 149 247 133 171 121 282 205 1 98
2989 98 -14 -147 -121 -12 -95 51 55 121 -181 -282 -130 -285 -102 -55 -83 70 -68 3 5 52 193 -7 11 5 155
3014 155 226 46 72 235 126 -6 42 -83 246 -36 -74 76 -264 -14 -39 58 -57 -91 -258 -77 -43 -35 11 209
3038 209 16 102 -79 85 219 148 88 290 118 104 35 208 342 171 -32 -60 159 -127 -308 -152 136 -360
3060c60K30QOj22J59L9Rq8J18j44PJ76M7M5k20J79j18k0L34k57j17L86k32j83
3084a18J11J79m8j59J43l47J09J20q3j36R1O5r2K13k28J02K8J93j44J19l61K62
3106A9q7j54J82J6P5P5nJ30o0m84M87k07J28j95J37q9j21J84j97J52j38m8r6K75
3130b1p4j87K43j03L1K68J7j45p3%L03k97j07J08K73k14k7K18q2l99L37j74P8
3153b7J56j02P7l17L35R4m12rK25J10m24J33L20n72L33K57M0l84J39k8j04K4K26
3176I0k06J67K17l72p7J27j15P6L3j06j4M9J86j78rK68m18J19J89L6p5j9m0Q7
3200A5J12k21K49n1j50O5J47q1J50J25l51l5J11q3J00K9n5p3n4j46K42l72M6J88
3224i3M7K17j70J89m12J13K78l39L73j99J5j91M30q0J5j21KJ0J82k20n7o4J51
$$ plain form
3060 -360 -130 -122 -116 -238 -79 -40 -31 -119 -1 -145 -138 38 85 130 -90 89 -29 -49 285 28 -89 297 65 -118
3084 -118 -7 172 124 -35 108 -239 -130 -10 -93 -229 -138 -73 -165 48 -180 -78 -50 143 -1 118 -243 19
3106 19 -68 -222 -40 -24 51 126 121 251 191 -293 194 -13 115 -80 57 -32 -153 31 -166 -14 -152 -200 -296 -21
3130 -21 -95 -282 -39 -142 -111 157 174 29 -44 -44 259 -38 -145 -37 236 22 -5 213 131 -268 69 -105 -27
3153 -27 129 27 104 -213 122 216 -196 -205 20 130 -294 -161 159 -413 -80 177 217 -167 -28 -56 -160 -136 90
3176 90 -116 51 268 -104 -181 -54 -169 -93 -60 -166 -180 -131 55 -123 -132 136 -282 -163 26 62 -13 -32 -72 15
3200 15 127 -94 155 104 -46 19 166 85 235 360 9 -26 85 2 102 131 76 3 -51 -197 45 -327 -281 -93
3224 -93 -46 171 1 190 -222 -109 169 -170 203 4 19 -172 258 178 193 72 74 84 266 46 -11 -75 76
3247G6J68j66j92j59J29j21k06M06r4r5M3J37j2p2K02k55K21q8J25j6Q4J02j54
3270F3J42k31l3J99J39l21J6R9k37J26J54j16j08M4j9j62j73M91j87J56j42j02
3292b02J65O4l32R5N6L6O3j59K18K05k51j06L30j70J19K4k15L6j58K24J67l79
3314a70J21j93J73n0R0J37l53K46J42m78L36OJ19o6m4l49K61K18j60K6K5K15l58
3337a06L51J20k86j35lR8j75K67j83l17J09K13M1k5k09k4K72l86Q4L37K2m73J84
3360b24K46K62l01P1p2Q6j69J97r5m2J21k02J80J72j68j41%K60n3l32K35j10J84
3383A05O3l30J32p3P5j61K48r4j61K31j67J42j77L32j16Q8j91J27q6n2K2p5L46
3406B28k12qK28Ol33J32M8J43l66oJ41j60k8n8N21j90k29J94K6K25k36%L9l0J14
$$ plain form
3247 76 244 78 -114 -273 -144 -265 -471 -65 -159 -254 -211 -74 -86 -158 44 -211 10 -78 47 31 115 217 63
3270 63 205 -26 -59 140 279 -42 -26 73 -164 -38 116 0 -108 -64 -83 -245 -418 73 -114 42 -100 -202
3292 -202 -37 27 -305 -210 -154 -118 -55 -214 4 209 -42 -148 182 12 131 155 -60 -24 -182 42 209 -170
3314 -170 -49 -242 -69 -119 -29 108 -245 1 143 -335 1 7 126 60 16 -333 -72 146 -14 12 37 252 -106
3337 -106 245 365 79 -56 -59 39 -136 131 -52 -369 -260 -47 -6 -31 -240 -264 8 -378 -294 43 65 -408 -224
3360 -224 22 284 -17 54 -18 68 -101 96 1 -41 80 -122 58 230 62 -79 -79 181 128 -204 31 -79 105
3383 105 168 -162 -30 -103 -28 -189 59 -35 -196 35 -132 10 -167 165 49 137 -54 73 -13 -65 -43 -118 228
3406 228 16 8 236 242 -91 41 89 232 -134 -140 1 -159 -187 -245 276 86 -143 51 77 302 66 66 105 75 189
3431A89k58Q0P1J22j63JJ90q2P0j16r3r4p5O8j42N72m14J12J11l60J8N4q1j64
3455c84M22j70K37k57K50j02j11L41m84L21q4L2RO2j4n8k54J70J61l6l9j15N9
3478d4j00j26K60N1k64J66O1j90J53J21j91N3q7K30m5j60K29K00l06L11m6N2k20
3501A08Pj62N2K76Nl38K33q1k9l94R5J4N5J81k77J20L3K32k41J78qP8m33K76J69
3526A49l00k0K78j36l8K28j7j96J22j58K96j41J0j52p5J14J38l92M5K12k28K77
3548A6k88J0l8R8L43j8k85J77j67P2J14K94j31k33L15k28Qk96L40k03L03k19j73
3571a89J21j19K13Q8k3q8N8K0j95J46k52K79k77J13J33j33l8L75m82L08k79J86
3593c5J63q8O6j23K26n0N3L5j95j41L40l38P4N1n3j4k4p2K30J10l91RJ95Q8j06
$$ plain form
3431 189 -69 11 82 204 41 42 232 150 220 104 11 -83 -158 -90 -232 340 -74 38 149 -211 -193 -139 -220 -384
3455 -384 38 -132 105 -152 98 -4 -115 226 -258 63 -21 11 20 82 68 10 -244 -74 87 51 12 -103 -44
3478 -44 -144 -270 -10 41 -223 -57 4 -186 -33 88 -103 -50 -137 93 48 -112 117 317 11 322 276 328 108
3501 108 115 -47 5 281 286 -52 181 100 71 -323 -228 -214 -159 22 -255 -135 -102 130 -111 67 59 137 -296 -20 149
3526 149 -151 -171 107 -29 -67 161 144 -52 70 -88 208 67 77 -75 -150 -36 102 -290 -245 -33 -261 16
3548 16 -272 -262 -300 -202 141 123 -162 15 -152 -80 34 328 197 -36 279 51 59 -237 103 -100 203 -16 -189
3571 -189 -68 -187 26 114 91 3 61 81 -114 32 -220 59 -218 -105 28 -105 -143 232 -250 58 -221 -35
3593 -35 128 40 106 -17 209 159 212 247 52 -89 251 -87 -13 38 -15 -29 -53 -125 105 215 -176 -167 28 116 10
3618A0P3j05o1K3L7P2j83R6j1k12L25j39J30J00p4k24QJ18m8K95m64K21L4N1m
3643F8%k14o9J40L28n15J46K0k11M20N9R4l09L58j40k42K84j12P8j70J00l32K72
3666E3J18r8k73K11jJ19l53J90k5j9K45l13J31k97L90l49K66q8j13K1p0L03L7
3689H5q4j97K13L16l27r7J96j78J76m2P5r0K6J8j32q7o9Q3K6l1N6j23Q7J87j09
3714b2N4O7j35p7K07O4j12j68M12l79j14J54L68k69j92J23J21j1N7k98K69m0J7
3737I6j71k58K97L2j79J35j23K19m0p8K14j12j55J67O0j41r4N2L8R4K12k81L3
3760A7j38J65r0K03M5j96N3o2j53K72j56N8j2j19L1j99K98j27J54j97J62R3k21
3783a19J20L9n2J70K0m1n5J94l67j50L21Q7k34O0L6kr6lK11m55K59r5J18K5K5
$$ plain form
3618 10 83 -22 -83 -60 -23 49 -134 -38 -49 -261 64 -75 55 155 81 -143 -135 -17 -65 230 -234 -13 21 72 68
3643 68 68 -146 -215 -75 253 -262 -116 -96 -307 113 172 266 -43 315 175 -67 217 105 183 13 113 -219 53
3666 53 171 73 -200 11 10 129 -224 -34 -59 -78 167 -146 -15 -312 78 -271 -5 -93 -206 -185 -255 48 85
3689 85 1 -196 17 333 6 -91 105 -73 103 61 136 46 72 90 -42 -129 -198 -115 -89 -120 -64 -187 -100 87 -22
3714 -22 32 99 -36 -113 94 158 46 -122 290 -89 -203 -49 319 50 -142 -19 102 91 148 -150 119 79 96
3737 96 -75 -333 -36 -4 -183 -48 -171 48 8 -70 144 32 -123 44 104 -37 -131 -79 -41 53 265 -16 17
3760 17 -121 44 -46 157 202 6 59 -3 -156 116 -40 18 6 -113 -82 -281 17 -110 44 -153 9 102 -119
3783 -119 1 40 -12 158 178 137 82 276 -91 -241 80 167 -67 -7 29 27 -69 -72 139 -316 -57 -152 -34 -9 16
3808A6J05m4k30R1o1J6P2j25M6K40j07Q6j15R1K78l42J06k41L08k65K00k46J51
3831C0j02R8q2m9j5J31QJ28k21r7J22jk12O2O2K74k5r0k73K77L1Q1k57L3L00k94
3857h1K40j10m6k06K59Jn2Q1O1j81P2p1N4k89K17P3n6j24K05Q0j95J0K99k44n0
3882e3RQ1oJ73K8j20j9j71L7L21l33J31j20k03L62jm0k29R1j5m9km6p8K86l0j66
3909a62K36l10L37l6j01M6r2L54j00r5j57P7k1j26J63j47K80j99K91k1l17K77
3931A77k24J03k02j0n7j0J19R6L7N0R1n13N67k03JK1nJ71j66n3K7K8J60j51R2
3956A46P2j73p7ml7j02J08M7K88j02m7j05p2K48j85q1j03L68m01J52l9J45j95
3979a49L42J34k23n4J45j42j75L08j6k29J65Jk99J52J84q6k42jm3J35J33m8n6
$$ plain form
3808 16 121 77 -153 -62 -123 -107 -35 -160 -114 126 19 105 -10 81 359 17 123 -118 190 -75 125 -121 30
3831 30 -72 26 -56 -105 -120 11 19 147 -74 -171 -49 -50 -262 -200 -138 136 111 21 -252 25 56 137 -120 -87 213 -81
3857 -81 159 49 3 -203 56 57 5 86 147 -34 38 -33 21 -268 -51 22 -34 -158 47 127 -68 -58 241 -3 -53
3882 -53 -44 37 31 204 232 112 93 -78 -41 280 -53 78 -42 -245 117 116 76 -153 -62 -77 -126 -128 -174 -252 34 4 -162
3909 -162 74 -236 101 65 -36 10 -82 272 172 77 -80 -3 -24 -150 13 -134 146 -53 238 217 -100 177
3931 177 -47 56 -146 -156 -213 -223 -104 -8 29 79 170 -343 224 21 22 43 38 209 43 -10 17 45 205 54 146
3956 146 218 45 -32 -36 -73 -175 -67 -20 268 166 119 14 -58 190 5 -76 -179 189 -212 -60 -99 46 -149
3979 -149 193 327 104 50 195 53 -122 186 170 -59 106 107 -192 -40 144 58 -184 -185 -228 -93 40 -8 -64
4002f4l50K71O0J14j4K0L6m6j55J85j25J67Q1r6o0Q2j33n9p5M61k89j70K30k46
4026a75J75l9q0K73k90Q6k7pj1J8k16O22k87R6M9j18%p2j09K43j8j06J93k80P0
4051a0J77j36K11p1k31K14j78Oq0J89j62j27K44J19l11Q5N8q1M5L82m31J73j32
4074d7J8r3j40K50j12J9K87j39N0J03m5m9j3j46J46j19r8K59j74R2j37L1K1O6
4098C0n1p7J1M8L7k79J40J88j22K91l92L13k17J43k11Q7j3M5J3J97m4k73J91j43
4122h8j50M95l26k02K15q1J49P0m03J17KK72p9J8q5L38k48p1r4K9M1K06K22m9
4146B98k19o7m2K7%J3R8m2j28K2J90j88j10n9M6J33j06q4K12P8J45l31J01j01
4170a14J64k8j5K73m02M6N9Q1k31K48j92K3j69K63P1j10J44J95k97k05K41q4q0
$$ plain form
4002 -64 -414 -143 -83 31 17 37 73 27 -128 57 -68 99 180 84 24 106 -27 -86 -161 300 11 -159 71 -175
4026 -175 0 -39 -119 154 -136 -50 -77 -84 -95 -77 -293 329 42 138 187 69 69 -3 -112 131 113 7 200 -80 -10
4051 -10 167 31 242 171 -60 154 -24 -18 -98 91 -71 -198 46 165 -146 -61 -3 -84 -39 343 -88 85 -47
4074 -47 -29 -122 -262 -12 -124 -105 182 43 93 196 151 102 89 -57 89 -30 -128 131 -43 49 -88 -57 -36 30
4098 30 -21 -98 -87 -39 -2 -281 -141 47 -75 216 -176 137 -80 63 -148 -61 -74 -29 -16 181 137 -136 55 -88
4122 -88 -238 257 -69 -271 -56 -137 12 82 -321 -204 -202 70 -9 9 -76 262 14 -57 -151 -122 -81 125 347 298
4146 298 79 12 -30 -3 -3 10 108 66 -62 -40 150 -38 -148 -207 -161 -28 -134 -218 -6 72 217 -114 -13 -114
4170 -114 50 22 7 280 -122 -76 -17 64 -167 81 -111 -88 -257 6 77 -33 111 306 9 -196 45 -39 -119
4193a19n2Q7o3K81j35l86M44j82l4O3j03K18P0k17J21o6m1J50j04J76n7K27k37
4216D1j89R8K31m5n7k72L25r9P3k96j10J61L92k42j09Q6r1L3J15k66P4K15p1J18
4240A15p3Q5l2J50j65j53J74k79K10l0k23J15R1j10J17j32K01J44j64k9k68M11
4262A55r4k22J04p0K31n3J62m14J31K20R8p6j24l9R8J83l45J93l4J38l3o9l30
4285a90K99j85Q2J52j38j90P6j2q9j1J10K12m03J11P7r9L56j33k60L28o2o3M31
4308C99l78Q5j51K09k19J77n8N3o9P4n8k11K18j89K06k19J56k1k08K44l0k02K97
4331A05j97J74r3m1j27P4k6M12j97j53J82n5q4P0%J48m5l01O0K43k73J87J6k04
4355a25p1L4K38r6rj82L03l51L10K00m82K86k23R0n3kK09K57l69QJ17o9O5j94
$$ plain form
4193 -119 -171 -84 -147 134 -1 -387 57 -125 -159 -96 -199 19 89 -128 -7 -73 -114 36 -68 108 51 278 41
4216 41 -148 -50 181 136 79 -193 132 33 106 -190 -300 -139 253 11 -98 -12 -103 -70 45 -221 -147 68 -3 115
4240 115 42 127 95 245 80 -73 101 -178 32 2 -221 -106 -15 -125 -8 -140 61 205 41 12 -256 155
4262 155 61 -161 -57 -127 104 51 213 -201 -70 150 248 172 48 9 107 290 -55 138 104 242 209 140 -190
4285 -190 109 -76 6 158 20 -170 -94 -106 -195 -206 -96 116 -287 -176 -99 -198 158 25 -235 93 31 -32 399
4308 399 21 106 -45 164 -55 122 64 117 48 122 64 -147 71 -118 88 -131 25 4 -204 40 10 -192 105
4331 105 -92 82 -11 -52 -179 -105 -131 281 84 -69 113 58 -26 44 44 192 147 -154 -94 149 -124 63 79 -125
4355 -125 -196 -162 76 -20 -29 -211 92 -259 51 251 -231 55 -168 -78 -131 -133 76 333 -36 -28 89 20 85 -109
4379a09K02N0p8P7l12P7K32l51qK23j10L07l06J81J18m5j45P4j70L90j21l3m7
4402I6j71O6N9Q3j78O1j1j29j59K46j0J73l31L86m43M50m95L27L3p0M2l55K50
4425h0K90q6O4r3k03K86l27M7K91r3l0J83k82r2L73j20J20m26L23J23l86M4K11
4448A37q9K07k15ml6j55j23J69J07k07K52k10K02j2Oj96p2K41j5jN0l8J20j02
4472A6K41l43J7P2M3R1j52j1J7J05o8j48k7J40j27M29m88J03j78K58k9j45l2L02
4496H6r6L06j43n2j90J79j22j63RL23j56J55L8j91N3k03J55R1k6k29M7Q6M9j21
4520a15m3J40n7L29j17q6NK00l26j4J65k12L8K24N4l20M46k95K3L61o88L33K5
4543G0J04k71n4K04o6J27q2j04P8l41P4j12J23K43k50M57p8l78K02L72l95l5n4
$$ plain form
4379 -109 93 143 65 142 -170 -93 139 -212 -220 3 -107 200 -106 75 193 148 3 77 -93 297 176 143 96
4402 96 -75 -9 50 133 -45 16 5 -124 -283 -37 -47 126 -205 181 -262 188 -307 20 53 -17 25 -330 -80
4425 -80 210 124 188 95 -108 178 -149 -102 189 96 66 249 -33 -125 248 128 248 -178 145 268 -118 -74 137
4448 137 48 255 40 36 0 -155 -278 -109 -2 -209 43 -167 35 23 29 -167 -239 2 -13 -14 36 -2 118 16
4472 16 257 -86 -69 3 46 137 -15 -26 -9 96 28 -120 -147 -7 -134 295 -193 -90 -268 -10 -39 -184 -216 86
4496 86 -10 296 153 101 -89 90 -32 -195 -186 137 -19 136 174 -17 36 -167 -12 79 53 -176 -129 -43 6 -115
4520 -115 -158 -18 -75 254 137 51 56 256 -70 -84 81 -131 -93 131 185 -135 311 16 39 400 -288 45 70
4543 70 174 -97 -151 53 -13 114 32 -72 6 -335 -261 -373 -250 -7 -257 200 122 -256 -54 318 -77 -112 -166
4566a66J02K4k06O71n75r6K60m0m8L61k60q8L1n8J9R7P8JN9j19q5k6R0J86l00
4591h8J40j68j77J32J61j7P6l48J97L47j58p7K16l63J95l89L85MJ13k30p1P1o9
4614a18j91L37r6j85J92k2n3J11oP3q4k8L75l13J78k89l1O1k5K00L4l35K63K1
4638F9J38l86K16K0m3N6KM9j61J9p1L6j66J47j14J79rq2l5K22j30J05k04L22J3
4663A92p9j28J5j71%K04j3P2Qm30K83p5N3J8j47m9J77P3k83L16P4r7j35K11n0
4688C9M12k44P9k55k61J83P0R1l25K86k25K45o4J59jm53L69j36J74j75K20j06
4710H2j38L1J1j43j02n5N18j33j88r6J4L87p1k5j96j16K58j44M8M78o33O9K72
4733A28J0k22J12N5j49K14j72L5K15m70M4j70K68N1o4J58m16M32l49J75K76l74
$$ plain form
4566 -166 -64 -40 -246 425 -150 -246 14 -26 -74 287 27 -61 -30 -88 -69 28 106 107 166 47 -38 -64 26 212 -88
4591 -88 52 -116 -293 -161 0 -17 59 -289 -92 255 97 20 236 -127 68 -321 64 68 181 -49 -120 -49 -118
4614 -118 -309 28 -68 -253 -61 -83 -136 -25 -31 42 -42 -70 305 -8 170 -119 -150 -89 -114 86 120 -215 48 69
4638 69 207 -179 37 57 14 70 72 121 -40 -21 -92 -56 -222 -75 -189 -10 -19 -101 -136 86 -44 61 -143 179 192
4663 192 113 -15 0 -171 -171 33 20 92 100 -330 -47 -122 -69 -51 -198 -247 -70 3 -280 36 110 13 -122 89 39
4688 39 451 207 286 31 -230 -47 23 114 -211 75 -150 95 31 190 189 -264 105 -31 143 -32 188 82
4710 82 -56 -25 -14 -157 -259 -314 204 71 -117 -213 -199 188 117 92 -104 -220 38 -106 -58 420 -213 -144 128
4733 128 138 -84 28 83 -66 148 -24 11 226 -244 -200 -370 -102 -51 -115 43 -373 59 -290 -115 161 -213
4755b13J82J06k44M67n03M35j34l8j26J10k9L6j03j28L36m16J27l8K62nk72K40
4777E2j06K65j26j79N9L12l37k9K64K3l24R0o9P5k16K30M8K60k43k40N26n41J20
4800h6J03k69L43j76m0o2K5L77m36K8K29k57K3QR0J97k29K15j31L85j57k21J30
4823H9Mk8r0j02J17J70K14m37J68j81j26L05l3m38M15J7k8k60J45pJ28o3J3k07
4847b15J62j11mK81k74K23j31J06J32k08j5K8L72l85m7K47k45LJ36O4j61j0qJ75
4871A15m66K05J40J47k96K85l16J54N4J52j98K37l24K67K6r1K4L8J6l65L0K42
4893G6lj97J89q4M0n6n0q2Q4J41j41l0L6j29L94j47n9j7o2Q4M2k90J04J13J04
4918F0K8J46j08L26l41l88l4M77j56J5n0k5K12k03J04j26j0P4lk27K29q2J90m34
$$ plain form
4755 -213 -31 75 -169 298 -205 230 96 58 -68 42 13 49 -54 -182 154 -262 -135 -173 89 84 -188 52
4777 52 -54 211 85 -94 -35 277 -60 -89 175 198 -126 -36 -105 -30 -246 -16 32 292 49 -191 335 -206 -86
4800 -86 17 -252 91 -85 -125 -187 -162 215 -221 -193 36 -221 -198 -190 -100 97 -132 83 -48 337 180 -41 89
4823 89 93 65 -25 -127 -10 160 374 -63 105 -76 -202 103 70 -368 47 64 36 -224 -79 -86 42 -21 -8 -215
4847 -215 -53 -164 -168 113 -161 62 -69 37 169 -39 -54 -26 346 -39 -86 161 -84 -81 55 119 -42 -52 -60 115
4871 115 -351 -146 -6 141 -155 130 -186 -32 22 174 -24 213 -111 156 182 91 115 153 169 -196 -166 76
4893 76 73 -124 65 -19 21 -35 -85 -167 -83 58 -83 -113 -77 -206 188 41 -18 -35 -97 -13 29 -261 -157 -44 60
4918 60 88 234 126 452 111 -277 -311 166 10 25 -25 -50 162 -41 63 -63 -73 1 -2 -229 0 -82 108 -326
4942c26K79J99k14K08j30j31O1o5K33r4j37J97o1Q2p1Mm7J73J8k40OJ90P0l04
4966a00J78k7k48K67j85O6J0j21J92k57L1K38j1J33k71QOK1K24k76N30n72J19
4989d5P2J62m40L94J2R8j73J78k39m5J56n1k0j29R3n4K8L7J73J9j36l13JJ45K49
5014A72k08O9J4J07k43k2J00j36J95M0K8r8J40k85r2K99k8n5J41j22l15K17J69
5037H7J80l40L10n08K52l2r0R5n9J56J25j82Q3O4qR1j75j32l6J29Q5J53j42R1
5061A97k92J14J23qj07ON6l5J43m17K55k65J35j1l7K9K45j41J71l75R0pM17r7
5085A89k8r9O5K27j03q8m8J49j63l1K7q0J43j60j4K60l75j32K65J56l43M6j7L69
5109B15k24pn2Q8o2L02k93k9J0K99j95p8m0j6J25qo9l0LJ49j4J0J48l99K12r0
$$ plain form
4942 -326 -47 152 -62 146 16 -115 -54 -119 114 20 -117 80 19 101 30 34 -13 160 178 -62 -56 134 204 -100
4966 -100 78 51 -197 70 -115 -49 -39 -160 32 -225 -194 44 33 166 -105 -97 -91 -70 154 -122 408 -164 -45
4989 -45 27 189 -251 143 155 253 80 258 19 -26 130 79 59 -70 23 -31 -3 34 207 226 90 -223 -222 -77 172
5014 172 -36 33 47 154 -89 -111 -11 -147 48 88 116 18 158 -127 -219 80 52 -3 138 16 -299 -82 87
5037 87 267 -73 237 -271 -19 -51 -141 -46 -105 51 176 -6 77 141 133 224 49 -83 -119 10 95 248 106 197
5061 197 -95 19 142 134 27 33 89 54 197 -220 35 -230 -95 -106 -143 -114 131 -10 161 -214 -124 -131 286 189
5085 189 161 62 127 354 251 163 115 264 101 70 97 17 160 0 -14 246 -129 -261 4 160 -183 -137 -154 215
5109 215 -9 -16 -68 20 -42 260 -33 -62 -52 247 52 -26 -66 -82 43 35 -34 -64 -61 88 74 84 232 -167 45 -45
5135d5N0l6K0J74j85o5J48R6j35J71l12R4j0n9L53l96K56j20k0K39pj34m4p1l3
5160g1N0kJ20J59l69Q8l6J29j31Q2M4R0K2m19O9M5J46j8M3J80l78K81o05M71K5
5185A5J97m5k63K96n08J89N2J59p5J2j87K02r0j81P3L19k32k02L71l00J60K21
5207A83k14L57l53j5J39k96J55n9J97q8l4M6J9Q0k10J19o5j53J72L27k13j73J39
5230F0pK9L9k45K5K87j64j45o4J44l4n4J32K96j53M5j66j86K08j64J78P8k13J53
5254G9m3r2L9J74O3j31Pk86jj0L59o1l12L96k68R9p0J4KK1j11L4J70M4L9j16J16
5281A55K4m1R1l27M19k70j63O2J07J3P5j18j26K79k07k38J18R3p5K52j35k2j33
5304a67J91l9JJ26NJ54k19j72p4L23j35k25J46J96j31J14j72MO1k81M02k51J58
$$ plain form
5135 -45 5 -31 -11 163 -22 -87 61 157 22 193 -119 -25 -35 -94 259 -137 119 -1 -21 218 211 77 33 -38 -71
5160 -71 -21 -23 97 256 -113 -25 -61 68 -63 19 63 153 175 -244 -175 -130 16 -2 41 221 -157 124 -481 -10 15
5185 15 212 167 -96 200 -308 -119 -67 92 17 29 -158 44 -46 -227 -154 165 -67 -269 102 -198 -38 183
5207 183 -31 326 -27 -42 97 -199 -44 -103 94 6 -28 18 37 117 -93 26 -39 -192 -20 307 94 -79 60
5230 60 53 82 121 -124 -99 188 24 -121 -185 -41 -75 -129 3 299 146 191 25 -161 47 -117 61 139 -74 79
5254 79 36 -56 -17 157 220 89 96 -190 -191 -201 158 97 -215 181 -87 12 -58 -44 -42 -21 -132 -98 72 116 155 39 155
5281 155 179 138 229 -98 321 51 -112 -50 57 70 145 27 -99 180 -27 -265 -147 -54 -129 123 -12 -34 -167
5304 -167 24 -15 -14 112 117 271 52 -120 -194 129 -6 -231 -85 111 -20 94 -78 -74 -13 -294 108 -143 15
5327A5j63R1J24j4J33j89j00m3m9lL12Lk23NJ80R8l19J41J3J12J6k48K19m1M7
5352A17r4j8J%Q8k36m7L02k19J00j57j4K43N7j43R5j16J58j57j42K66j07j13q2
5376b18L65k29p1K67k2K3k46J84p3J9L46m46L34k26J12l41J53J94j4l44J95J12
5398G4J63j89J48j62L5k28J35K2J24j93J30p9j10K50j59K87j90j89L94l62K31
5419A32j8J03j63j11J21J82k64j38O2J21j44L2P0K9Nk0p6o0J83j29K47r0J06l62
5443a82k2l2J46N3K64k56J88l69J17J67n9rJ2K53q4j65j95K05k2J5k25K41l5n6
5467e0P6j26J16L8j77O7j39r7M65L7Q7l65J7J02n8J54n5q5J83k27k8L35l89o7
5491a86O9J78r5k04K31l67K90J22k23L11p8J53k83K24j97j06O4P7j61R9J31r4
$$ plain form
5327 15 -148 -57 67 53 186 -3 -103 -146 -195 -198 114 117 -106 -101 79 177 -142 -1 12 124 140 -108 111 70 117
5352 117 23 5 6 6 94 -142 -189 113 -106 -6 -163 -177 66 123 -20 75 -41 117 -40 -182 84 -23 -136 -218
5376 -218 147 -82 -153 114 92 115 -131 53 -20 -1 345 -101 233 7 119 -222 -69 125 111 -233 -38 74
5398 74 237 48 196 34 69 -159 -24 -2 122 -71 59 -20 -130 120 -39 248 58 -131 263 -99 132
5419 132 114 217 54 -57 64 246 -18 -156 -94 27 -117 -85 -15 14 19 -1 -77 -137 46 -83 164 74 180 -182
5443 -182 -204 -236 -90 -37 227 -29 159 -210 -93 74 15 6 18 271 187 22 -173 32 10 25 -200 41 6 -50
5467 -50 26 -100 16 54 -123 -56 -195 -292 173 210 297 -68 -51 51 -7 147 92 7 190 -37 -65 270 -119 -186
5491 -186 -117 61 -34 -238 -7 -374 -84 38 -185 126 48 201 -82 142 -55 -161 -97 -20 -181 -82 49 -45
5513d5j36Q9r7O8J27M8N1j44L3J77m00J07J13l3L9r0K55k47KQ9R4n5O7n6l09M69
5539B16j21l44L61j00o3M0J16j23J45l02M4QJ77r5n2J34j08M5j86N4R2J61l2j69
5563a02K57k23K61k56J78L7j05j98K72K38o67M88p4n2N8k99O1J21K62k19J49k38
5585e1k65J91j4K75q2j21N5r5J35k52M4J1K02R7j32k41M1L21j30O8j3l1%K03j78
5610C8j0j48K48l4k61J62Q8l28K13n6L35l08q5P4J89k15J97k52N6O7M0p1J64j56
5634e3J99K21k80K16k02r2k54K87p0J60j58J25m0j38O1R0q4KJ60P7m01J53J70
5657A49j17j48L71o27J22L16J88r2lN8l31N4J91j4k58J24J53k11L43l05k4K32
5679A71j54J35nq7n1r6j25R7J89j02J6J8R6j60l1J71k95K47o8M3k79O8K44n2N4
$$ plain form
5513 -45 -181 -92 -189 -121 6 54 105 -39 -6 171 -229 -122 -9 -42 -3 -93 162 -85 -83 6 100 45 112 56 -253 216
5539 216 95 -249 112 12 -51 -11 105 -18 127 -175 -131 -123 54 -41 -93 41 -67 -22 -208 -154 -62 99 67 -102
5563 -102 155 -68 193 -63 115 152 47 -151 121 359 -308 180 106 54 112 -187 -126 -5 257 38 187 -51
5585 -51 -316 -125 -139 136 54 -67 -12 -107 28 -224 -180 -169 33 130 -2 -243 -202 119 -11 57 44 13 13 216 38
5610 38 28 -120 128 94 -167 -5 83 -245 -32 -88 247 -61 -146 -72 117 -98 99 -153 -97 -30 10 -61 103 -53
5634 -53 146 367 87 303 101 9 -245 42 -28 132 -26 99 59 -79 -18 72 -12 -10 150 227 -174 -21 149
5657 149 32 -116 255 -372 -250 66 254 162 159 217 -114 -60 131 117 -141 -17 136 -75 268 -37 -61 171
5679 171 17 152 147 60 9 -87 -212 -115 74 -28 -12 6 102 -58 -89 82 -213 34 -34 9 -270 -202 42 -10 44
5704D4K71j30q1n2J89r0k06K65j60om6N3l32K61M6J7N0J79j90j45k7J00o3J06
5728E3l40L2K87m5r2J25K06k25j25l5K37kr6M8r6M2n6L71l62K7l8k9K61r9l41
5753b92K32l4j07J70J50r9q5K9j71L79j51j13J97k29K57o9k71k14M95j17J04r8
5775c7L9l2K62l55J73Q8l9j01j19k2L22n29M67j19j81L9J33J48k43K12k7L3Q8
5798B00q9O3l69J64j31J42J92k41j00K02O2j13n1J47K02m42K71J23k30L05k66
5819D1m4N4N7n3o1r7p1J05Q8J88j43j9j08J61k02P6J27j80K26o24N61J78l62R0
5843a2N7PlJ4j19J82p3j65M0J0O2p2J86l42L23r9k15L73j59j59Q5N4n2J70l06
5868b13J25L0L76o9Oj63j39n5j04O3N4J04O4m4j47J21J38J06q2q6o4n2Q9j2j65
$$ plain form
5704 44 315 185 104 52 241 151 -55 210 50 44 -2 51 -281 -20 26 43 93 272 82 -63 -90 10 -53 53
5728 53 -287 -255 32 -13 -105 20 226 1 -124 -159 78 76 -20 28 -68 -26 -82 289 -73 -46 -84 -113 148 49 -292
5753 -292 -60 -94 -201 -31 119 20 -65 -36 -207 172 21 -92 105 -124 133 64 -207 -421 74 -43 61 -37
5775 -37 2 -30 232 -123 50 138 99 -2 -121 -143 179 -350 117 -2 -183 -144 -11 137 -106 106 79 112 200
5798 200 111 174 -195 -31 -162 -20 172 -69 -169 33 95 -18 -69 78 280 -162 109 232 2 307 41
5819 41 -3 51 108 55 -6 -103 -174 -69 19 207 64 45 -63 98 -104 -28 99 -81 145 -479 82 260 -102 -12
5843 -12 45 52 49 63 -56 126 53 -112 -72 -62 0 -72 114 -228 95 -4 -219 154 -5 -164 -79 -25 -77 93 -213
5868 -213 -88 -58 318 249 255 92 -47 -102 -206 -143 -89 15 79 35 -112 9 147 253 171 85 21 -31 58 46 -119
5893a19K68k25Q9J66p1j42j08J58N1l0k15R8j16J64K84k31K7l15J72J65j43K7
5915d6J39j67J7l2K05l54N14r4j00r3k4M6P6p6l15M70j12k94M38m04N6J79r4K98
5939B33q0k91M8q1j5J78k42J89J61P9lj83L8j45J9K04k45L40k20M5p1K55N5n7
5963B11l81L11k34J87j09k16K80k06J21k2J16j38N4R0l37K62j10L53k60j98J05
5984a21J08Q1j53r6K0K74Q9m13J50J44k9r6K75k02r9J79o8K4l45J41J82k2rO3
6008G7j03K04k71K62k39J78k43K61q8j75m8J71M8J9k03m01M51K59j48j21J2P4
6030b4L2J2j43L8r8K07n5k03J56j9j61J05J10J11k18J85o0J10j59J36l25O9M23
6053B29j57j80K69k26j05P9K26J14j79J27l42L62j47p7m4J06J4j98K32j13om0
$$ plain form
5893 -119 149 -76 13 179 108 -34 -142 16 67 37 -178 -80 -196 -32 252 21 48 -267 -95 70 -73 -46
5915 -46 93 -74 -57 -89 116 -238 276 182 82 -11 -35 11 87 11 -304 166 54 -240 198 -206 -150 29 -65 233
5939 233 153 -138 -90 -171 -186 -8 -250 -61 100 179 176 -7 31 -114 -95 109 -136 204 -16 29 -42 213 268 211
5963 211 -170 141 -93 94 -15 -231 49 -157 -36 -58 58 -80 -26 64 -273 -11 -121 232 -28 -226 -121
5984 -121 -13 68 -85 -181 -161 113 202 -211 -61 83 54 -42 233 31 -68 111 43 67 -278 -137 45 23 14 77
6008 77 -26 178 -93 169 -70 108 -135 126 38 -137 -185 -14 34 53 -150 -551 -100 159 11 -110 -98 -24
6030 -24 8 20 -123 -85 -183 24 -31 -234 -78 -97 -258 -153 -43 68 -150 35 -25 85 -74 62 -263 -194 229
6053 229 72 -108 161 -65 -170 -91 135 249 70 197 -145 217 70 -7 -51 55 69 -129 103 -10 -16 -56
6075e6l8M1o9N6K49j65j03J69j95k9L17J10k86j76O9o2K63o2mr1O5j12m8R1j47
6100b13L23j51k0L0j4j64NM02l62M4O5j6J52Rj89j26J75oJ89k84J71K63j06l65
6124a88j17M65r1j83K11k5k54J27k80M58j02O4l29o6K43p9J81l1j74Q8M7l2K0
6147d7R1p3n0K8k37K13K42l7k5k0L0J90l23P4L9j40J80o6m2K7k41Q8N4pn1J49
6173D6n9k1J00J03k06J6q9k00K53j2R4J3R4k33L29o2n0Q1l35J50l3K9K30l07N2
6198a7j70J18Rj57L45J27m14J14J02o0J44l29K61p5L9N5l06J63R1J16j59L0R0
6221A17k55L6K48q7q2K9K01k82J53q7l9O9K38k08p1O7k0j08L80m28RK66m0j24
6245a8o5L80m46J50J36k75K40k51R6J84j71N2K17k71J38j09L5J00j70j97L62m3
$$ plain form
6075 -56 -94 -53 -122 -66 183 18 -85 84 -111 -140 177 287 1 -175 -106 -168 95 33 29 -62 3 -109 -157 -66 -213
6100 -213 110 -41 -61 -31 -45 -209 -204 198 -164 -120 -55 -71 81 90 -99 -225 -50 -56 133 -151 20 283 177 -188
6124 -188 -305 160 69 -114 97 72 -182 -55 -335 123 21 85 -244 -310 -67 -146 35 4 -170 -82 -35 -67 -47
6147 -47 44 -29 -79 -51 -288 -75 167 130 105 85 115 305 -18 56 95 -45 135 69 27 54 -187 -99 -45 -52 -103 46
6173 46 -13 -34 66 169 -37 -21 -110 -310 -57 -69 25 38 132 -101 228 166 116 197 -138 12 -21 8 238 -69 -17
6198 -17 -187 -69 -60 -217 128 255 -159 -45 57 -3 141 -188 73 -2 37 92 -214 -51 40 156 -3 27 117
6221 117 -138 -102 146 59 -23 6 207 -75 78 -9 -48 21 259 51 -20 47 27 -81 299 -129 -120 146 106 -18
6245 -18 -83 297 -149 1 137 -138 102 -149 -53 131 -40 12 229 -42 96 -13 22 122 -48 -245 117 74
6267G4k31J96O7Ol23K49p1j75J67r2L42j72K4k18J51m3lK9J28r1J46r2M8q8m7
6292a9J2q4K52q4jo6Q3q3K44k51P0j08n5K17p2l72K22j0J74L6J0O6j63o0j57k8
6318b27K00J2l2L0j16o7J89r5O9M2j71J90m5L7J39n24J98L49k82j3N3j84L39J05
6342A96r1o0j64K9J15n4j41M55j8k13pj22Q3j8k0L09k23Q7R1n12M07O3l47K32
6366G7k01j47k4M02k0J01n84M04j05J51J02j41o7J4n1O2j15k6K55K0j2k90J93
6389bL52l56j01N7j73J87q4j75M23k02o6K08n0J57j21j77J92Kn6J5M0n28N16j4
6413D4M2Nj66L95m62J31j67M11l06nJ59j41l7J10K5nj12O3k7K60k72j81L05l19
6437b50J44J23j09n3R5J29p7j3n1J67pk65J07J38l94L88k2j37K14n1k53J50J02
$$ plain form
6267 74 -157 39 106 112 -211 38 -33 -208 -41 -133 209 37 61 -157 -6 -49 -52 -23 105 14 160 68 116 28 -19
6292 -19 -7 -91 161 77 76 10 93 10 254 3 73 -35 -90 127 55 -317 -95 -105 69 105 115 181 18 -42 -199 -227
6318 -227 -27 -15 -47 -17 -133 -200 -11 -106 -37 5 -166 24 -21 16 155 -369 -171 178 -104 -117 -64 -248 91 196
6342 196 105 45 -119 -90 25 -29 -170 285 267 54 47 -75 8 -10 -30 279 56 143 234 -278 129 192 -155 77
6366 77 -124 -271 -295 107 87 188 -396 8 -97 54 156 15 -52 -38 -89 -27 -142 -168 87 107 95 -195 -2
6389 -2 350 -6 -107 -50 -223 -36 -120 -295 128 -74 -140 68 18 175 54 -123 69 71 15 30 70 -458 58 44
6413 44 86 91 -75 320 -142 -11 -178 233 -73 -78 81 -60 -97 13 38 33 -79 -16 -43 217 -55 -236 69 -250
6437 -250 -106 17 -92 -145 -50 79 2 -11 -62 105 98 -167 -60 78 -316 72 50 -87 127 76 -177 -27 75
6460G5m2O6l2j1k06j55L04j59K81j25o5J61J0K0k49O3L74l14K2K01l10L50l03
6483d4r1K94l15M7J29J62j75l94L48O7j01L03l71lJ17k3n7L7J55l8q6K43j99k77
6507b72N15q3l19R6K80k67k26L73l67K44j09J04Q5k4k04K59k47R9Q9k53ppM47
6530B06j85N7r7%l8M5r6o9J13K2P3j34R7K22j19j81J89m1o2m2k4q3J72j28%L26
6556B23j48K28l04j09j37K32n8J39q7J03j90J95k06R2J74k17J68k22J60M5P9j97
6578c7nk3K9L52k02l3k3K32k07q8K4K88l93j10N4r9L18j74L16l39L59o9k40QP5
6603A3J3m0L7R4Q6j74p7J13K50l60M4J31j94J26O8j94J9m8m6R3p7J33N7OQ4j83
6629b6l10P63l42m0l44K07P3N2K82l87J79j45pK87j05r0r6K83k26q1j3nR2MM0
$$ plain form
6460 75 33 99 67 56 -150 -305 -1 -160 121 -4 -69 92 102 122 -127 -64 310 -4 18 219 -91 259 -44
6483 -44 -135 159 -156 -109 20 182 7 -387 -39 28 -73 230 -141 -144 -27 -50 -107 -70 85 47 -39 204 5 -272
6507 -272 243 160 -159 -63 217 -50 -276 97 -270 -26 -135 -31 54 30 -174 85 -162 -63 26 -227 -234 -241 206
6530 206 21 78 -19 -19 -57 -12 -108 -177 -64 -42 31 -103 -6 216 97 -84 105 64 2 -40 -64 -147 25 -103 -103 223
6556 223 75 303 -1 -110 -247 -15 -73 66 -21 82 -108 87 -119 -27 147 -70 98 -124 36 81 160 -37
6578 -37 -42 -65 -36 316 114 81 58 290 83 -5 19 307 -86 -196 -142 -241 77 -97 219 -120 239 170 -70 -62 13
6603 13 26 -14 23 117 203 29 -48 65 315 -45 -1 130 -64 62 130 -64 -45 -93 -139 -46 -123 10 67 73 157 -26
6629 -26 -336 427 85 45 -299 -92 -19 33 315 -72 107 -38 -45 242 137 47 -49 234 8 -73 -86 -91 1 5 45
6654D5l51M23k24m2M8k22M27j71J8k57M41J4j85L84j86j97J2j09j9L61j85l12
6676b87N38k77q3K99l44J89P7j88k7M1R2j16J41j09P4j45J30J36m22J46J13o8
6698i0N2J48j86N0K40m63L35R9l52Q7J97k08K6J11j84L7%n2K26k5R5l32J71j33
6722a51J75k75K98J22k43K97j58k3L34m07P0J95n8j37k5M9OR8j33p8OK72j01K
6746A35MMj88J7NJJ74l31K91r2j10j09K21r0n7M1L01l24K44j04k2N7k93M33p4
6771A34L5q7n9M0m3j26O9J20j75L7K3k9J21J03k13O7m1j34J66p2j77L78j34q7
6795h4m8N7M2O3J47o52Q32l03J0j06k3M2j26L23k61J48J21p0l26J43J5J33k17
6818a40L41k89m0n8L3J05R7P2O3m22K00m7O1r3J55p2L2p3N8Q8J0J19k24K25L3
$$ plain form
6654 45 -306 117 -107 -149 -101 -323 104 -67 -49 -306 135 149 -36 348 162 -35 -23 -132 -151 210 25 -287
6676 -287 251 -26 -109 190 -154 35 112 -76 -103 -62 30 -86 55 -54 20 -125 5 141 -281 -135 -22 -90
6698 -90 -38 110 -76 -26 214 -249 86 185 -167 -80 117 -91 -65 46 -138 -101 -101 -153 73 48 143 -189 -18 -151
6722 -151 24 -251 47 169 -74 223 65 42 376 -31 39 234 176 39 14 63 69 167 34 -44 -38 234 133 135
6746 135 139 143 -45 -28 -23 -22 152 -179 112 20 -90 -199 22 -68 -125 -84 217 -107 137 33 11 68 -225 208 134
6771 134 169 82 23 63 20 -106 -37 83 -92 -55 -32 -61 60 163 -50 17 -24 -158 8 -64 -241 137 3 -84
6795 -84 -132 -75 -33 30 177 -475 357 54 64 -42 -65 -23 -149 174 -87 61 182 112 -214 -71 -56 77 -140
6818 -140 201 -88 -128 -186 -153 -48 49 121 184 -238 -38 -85 -24 -117 38 -34 -2 -75 -17 71 81 200 -24 201 234
6843B34k71J81JJ7l03ll0J58k51J22l9QN4J46P2n8J26q2j8k96L97r6M5l5K4j28
6869b5K26k83O3K24k03O3k8J63l77j02L97l86L17Pj41o2m1L36j04Pl22J59R8N9
6893D5j61J03P4n9J81j81J27J44M4l56k8K02J03k64j30J59j6K59k96r6L62rl31
6916a24J32L4q5J65l63K62O2j13J89r7j96J66%n3j46K44Pj53q8K18j77l5J19J41
6940A09j18O6n1j34J42n1l6Q6m9l0K80k15r2J88N4r2j14p1J58j16K11j67J67k43
6964a18J55j10J02j42j26L70P4p0K9m43k4L84Q8J1k76J16j52J01J02j53OJ71N
6987A00j69P1J50r1K45K0m71L8O4K5O2l1j7K13k13j22k29L94o6J23M9j09J55l18
7011a27j45J35L57l3k69kJ80j62m2Q1J7j07O8J39o9M4j31k3n1R8QP8j04K0m7J89
$$ plain form
6843 234 -37 144 145 162 -141 -144 -174 -16 -267 -145 -184 -176 -122 24 96 38 164 82 64 -232 165 69 114 79 103 -25
6869 -25 201 -82 -19 205 2 65 37 200 -177 -279 118 -268 49 56 -85 -147 -188 148 44 51 -271 -112 -14 45
6893 45 -116 -13 61 2 183 2 129 273 317 -39 -67 135 238 -26 -156 3 -13 246 -50 -146 216 207 -124
6916 -124 8 42 -43 122 -241 21 83 -30 159 62 -134 32 32 -21 -167 77 84 -69 -157 61 -116 -151 -32 109
6940 109 -9 57 6 -128 14 -37 -73 13 -36 -66 214 -1 -93 95 149 57 -57 -128 30 -86 125 -42 125 -118
6964 -118 37 -73 29 -113 -239 131 205 135 164 -279 -303 81 169 180 -96 20 -132 -31 71 -82 -76 95 100
6987 100 -69 2 152 61 306 326 -145 -107 -43 -18 44 13 -4 209 -4 -126 -355 39 -27 96 145 36 191 -127
7011 -127 -272 -137 220 187 -82 -84 96 -66 -108 -27 -10 -117 -49 90 21 65 -66 -89 -140 -42 -34 44 -60 -40 -87 102
7037A02j13n8J90j57j42J82j26l8J52l9j3Q1K00j71J01l58K23o0J4R9k36J90l82
7060c59M05k26J01K72j86k88M55n3q4o8j22K65j14j82k9J21K97j09O4j65k24K72
7082D3p8Rk47K78j8K6J83l32O8J86P8k63K63p6k12J15P0J3k98M03j51j11j03J1
7106a43J82k62L51k10M2K92l16M2L0l36L98L7m7n3P3j90K24p7j62M03l56O3q0
7129i5J81j02qR7j26k62K99j78nM50l43p7L78j30oj53Q5m6k06J18j66J16Q5K5
7153f9J13j00J06q3N7j25J80j47L87l42Kk56K87J03j84J9L6k6j49K06L2k96L41
7176I2k26k9K20j98K28k29J16K90k61mn9M2K6J9m7k1J01K05k85O1R8J62j73j82
7200e4J6O3j25k01J41K95p8j06j06L2K6N03n25R7rk24K07RJ39j63J57j43k3o4
$$ plain form
7037 102 -11 -69 121 -36 -178 4 -122 -160 -8 -47 -60 21 221 50 151 -207 16 -44 -30 69 -167 23 -359
7060 -359 46 -180 -79 193 7 -281 174 121 37 -31 -153 112 -2 -184 -213 -92 205 96 160 -5 -229 43
7082 43 -35 -26 -273 5 -13 13 196 -136 -68 118 196 -67 196 120 -92 23 93 106 -192 211 60 -51 -154 -143
7106 -143 39 -223 128 -82 -40 252 -64 -22 8 -328 70 107 60 7 80 -110 114 37 -125 278 -78 -15 -95
7129 -95 86 -16 -24 73 -53 -315 -16 -194 -199 251 -92 -169 209 79 73 -80 5 -41 -247 -129 -295 -179 -94 -69
7153 -69 44 -56 50 -33 24 -101 79 -68 319 -23 -21 -277 10 113 -71 -52 -16 -42 -191 15 47 -249 92
7176 92 -134 -163 57 -141 87 -142 -26 264 3 -1 -60 -18 8 27 -20 -41 60 265 -20 41 139 301 128 -54
7200 -54 -38 25 -100 -301 -160 135 57 -49 -155 -123 -97 406 -119 -22 -31 -255 -48 -39 100 -63 94 -49 -72 -136
7224a36L9K88k93o2L34k82j09L02N9j66Q4L3o8p9j51J67N0l1J93l41Q6N5N8K35
7248B65l52L35j20j22%J21k18q4J78L55m87J17l4j05k1K40q7R0j46J94k62J1l
7271a35K93k54k05K39nK03k12q8K70l8q7J09k13J62j19Q6L8J19n2p0M9k9M1r3
7295IJ8k09L03l49J74M2L07l36M8k29J58L57k67j17j47L59j92N6J38J10k31k43
7317b41L27M1n8j82n0N8qJ98j1m29L40J36o7j89K56K0k71L63j49k35L61m45J78
7340e7J08l16K43n1K73k77K04K00m17R7q6K18R3r8j42O4l00L37j2n0O4j32M9N9
7364G1N2P5p1p4J03k30L0l1m5M7k2Q2L1Q3Pj6L6j43n5j22L75P7k77qJ51Nn31M08
7392Ho9j83J09J42k27K09j65K86k5O4j86K6j2j17J56r7K43j90N0j1o0K6J29n5
$$ plain form
7224 -136 -97 191 -102 -164 170 -112 -221 81 140 -26 58 91 23 -56 -207 -40 10 -21 172 -169 -83 -28 30 265
7248 265 -87 248 128 6 6 127 -91 -175 3 358 -129 -12 -46 -151 -172 68 -19 71 -75 119 -143 -132 -135
7271 -135 158 -96 -301 -62 -67 136 -76 -164 106 68 -19 90 -123 39 -80 6 44 163 111 41 90 61 102 9
7295 9 27 -182 121 -228 -54 -12 295 -41 7 -222 -64 293 26 -91 -238 121 -71 -15 123 233 2 -241
7317 -241 86 127 69 -113 -163 -105 -113 85 74 -355 -15 121 54 -135 121 141 -130 233 84 -151 210 -235 -57
7340 -57 51 -265 -22 -73 200 -77 127 327 -90 7 -79 139 232 134 -8 56 -244 93 81 31 95 -37 12 71
7364 71 123 198 127 53 156 -74 -44 -75 -120 -73 -95 -13 18 101 108 92 128 -15 -70 -192 183 260 -17 -25 126 131 -400 8
7392 8 -61 -244 -135 7 -220 -11 -176 110 85 149 -37 -11 -23 -140 16 -81 162 -28 22 11 -49 -23 106 51
7416E1j56j69J48K28j76q7J63J30l66J16R2J97r5p6J65o8P4k32K8m2P6J89m44
7439b54K96%k36K10k3j22J09K92j34k13J78j82j20L0L46n8q0J91l68J89k73J66
7461e6p9j35o9J49K11j91M06j80Q7j76k57L10J41j52P6N2j8K20k05k09K33M3k66
7484f5J11o2n0J6J29j53o4J10o7R2l2j29L8O6M9P5M0l04J87L8j70J75JM8n7J77
7510A99k14O3J50q0j23J29k8K6j23R3l05Q3J11J85j09m57K80J09j74J40J04j06
7532d7j97J89P5J75l05LJ97J34k36J61l75L09j63L0N3k9P6R2k14L3j4O8P1p6j60
7557a50L67j32kP2j49J3J01P3l71K59q4j47j28J96K14m5p4%j26Q6k1l6k1K16o9
7582D2J55k96J90j44J49j65J73p7PJ25k78KP5J0J69o2m2J36l90L84n5j33J39L7
$$ plain form
7416 51 -105 -274 -126 102 -74 -161 2 132 -234 -118 -26 171 76 0 165 97 171 -61 -33 -75 1 190 -254
7439 -254 42 42 -194 16 -7 -129 -20 272 138 -75 103 -79 -199 -169 177 119 39 230 -138 51 -222 -56
7461 -56 -135 -270 -339 -190 21 -170 236 56 143 -33 -290 20 161 9 85 137 119 339 134 -75 158 201 -65
7484 -65 46 -16 -66 -50 79 -74 -138 -28 -95 -3 -35 -164 -126 -60 -11 64 104 -200 -13 25 -145 30 31 79 22 199
7510 199 -15 48 198 118 -5 124 96 122 -1 92 -213 -130 -19 166 57 -400 -120 -11 -185 -45 59 -47
7532 -47 -244 -55 20 195 -110 -107 90 224 -12 149 -226 83 -80 -50 3 -26 50 142 -72 -39 -53 15 86 10 -150
7557 -150 217 85 83 155 6 19 120 193 -178 81 -3 -150 -278 -82 132 87 13 13 -113 -27 -48 -84 -105 111 42
7582 42 197 -99 91 -53 96 -69 104 27 34 159 -119 -117 -42 -32 137 75 33 169 -221 163 108 -25 114 151
7606A51j56m7J46j88J77j28RJ91j97J27KRk06J20K90n85J17j93K16J45J83j50
7628C3RJj39J7N3K9J5%j43K68j29J40k13jjl2K59j77k0p4J65L9k38j03j5L52k05
7655a10M8M9J38L6j39j56R8K26m50K91R3N0j8l0j76q6J62j63K74q1J69k97k32
7678c04L72N4J1j19r4K52j21J47q1k50R1J2L8r7J32j29P5R8J46l00K14p7l6j98
7702a64K33J37l19K46k07oR2J18k90J91j05J23j87P4J70k99R6Q2k09J06k06M85
7724A61k69j1L85q0k75m5K97k60MO4J00r0O9n1Q6n5j07L6K18k71J22J48m2k27
7748i3P0J49m09L29Qj25J46j51J34p9R2M0j22k0j60J85J06j7mk47L21k95J18m9
7772g3K05nk7Rp3J07k16M0m9l8l8P3j16J93n2o4J8Q5j91N8J44L0r0k09K35P6j53
$$ plain form
7606 151 -5 -52 94 -94 83 -45 -36 155 -42 85 87 96 -110 10 300 -285 -168 -361 -145 0 183 33
7628 33 42 43 -96 -79 -26 3 18 18 -125 143 14 154 -59 -60 -61 -93 166 -11 -31 -105 60 99 -139 -242 -257 95 -110
7655 -110 -62 -13 125 161 22 -134 -36 190 -260 31 124 174 156 126 -50 -136 26 -137 137 56 225 -72 -304
7678 -304 68 122 133 14 -80 172 51 198 117 -133 -42 -30 8 -89 43 -86 -11 87 233 -67 147 70 34 -164
7702 -164 69 206 -113 133 -74 -80 12 130 -160 31 -74 49 -138 -64 106 -193 -97 -15 -224 -118 -324 161
7724 161 -108 -119 266 186 -89 -134 163 -97 -93 -29 71 -19 50 -1 85 30 -77 -41 177 -94 28 176 134 -93
7748 -93 -23 126 -283 46 54 -71 75 -76 58 -21 71 111 -11 -31 -191 -6 100 83 79 -168 153 -142 -24 -73
7772 -73 132 127 100 109 36 143 -73 -33 -82 -120 -158 -85 -201 -8 -60 -124 -106 -21 -212 -154 -10 20 -70 -279 -44 32 -121
7799a21j4J90J89j74j14J19l2r1l1J27q2q1N0J91k0K50m89J60k09L51k52j53J19
7822a17M41m77J55Q1p9J46p4j48J07N7j16M6j01J89K7J58j12j44q4J34J09J6j90
7845B4ok12J84k7Q1P0k30J90j88J4K30k39R2L7j37K25p4q4Q6k00K74j77P9P9R9
7870A90r3j56N8J17j30K42l24K48m57L56R2j35J88k10K8k29K80j21K62l38O4J83
7892A15k63K8L48l21j27J68j0J43p8o9J24l8P7j35J92l94K30R0R0l46L66M2m12
7915a80J83j04J44l3P0r9J66j05P5j30N7M1m0m4j05J89l86K15J53Kl7O4p9k11
7939a94O1l7J78J36m7k5j93L8Q6l08L81M1k45K18k74K71m89M92J36k56M7J16k82
7962a49Q2n4K59Mj35O5j04M1j09J13k24Q6Q3Q0r5j2K07rJ09l14l17M75k06J08
$$ plain form
7799 -121 -135 55 244 70 -44 75 43 -48 -79 48 -34 -115 -65 126 106 356 -133 27 -182 169 -83 -236 -117
7822 -117 324 -153 2 83 4 150 76 -72 35 92 -24 22 -79 110 137 295 183 39 -45 89 198 214 24
7845 24 18 -194 -10 -37 44 114 -116 74 -114 -100 130 -109 -17 20 -117 108 34 -50 36 -164 110 -67 12 91 190
7870 190 97 -59 -1 116 -14 228 -96 152 -305 51 143 8 196 -14 14 -215 65 -56 206 -132 -68 115
7892 115 -148 -120 228 -93 -220 -52 -62 81 3 -66 58 20 97 -38 154 -240 -10 80 170 -176 190 232 -180
7915 -180 3 -101 43 10 80 -19 147 42 117 -13 44 85 45 1 -104 85 -301 -86 67 69 32 96 17 -194
7939 -194 -133 -170 8 144 97 72 -121 -83 3 -305 76 117 -128 90 -184 87 -402 90 226 -30 17 133 -149
7962 -149 -67 -121 138 142 7 72 -32 9 -100 13 -211 -125 -42 38 -57 -69 138 129 238 -76 -393 82 -124 -16
7986a6n5R1J82m05J49k9O0j98P0J04M03j89l08J82P0k2n7l8m2j38M83m52n2J43
8010f4n8J54l7L9R6p5k90L26P4j82k56L9O6K42j91K67P8p1k18L0J73k22K69j25
8034F4n6r7K41L4j25r9r5J61L8j43N5J9J10j67K10j57Q8k5k55J60K17j1l81L08
8058I4q2M6rL37o46K97L50k90J53n2m05QL67l23L27j06j33j33J9oo0M50k16J12
8082I9j87O1M4J10o2j83J15K78k83J54M4j67k17L03p8k95K84J34j51J82j73m3
8104c1j24J7K39R4l45l7L96l20O5k4N7m4J27M0k03K21j95J9J88k74K43k74J77
8127A2M3R8p9j10j0K29j59l8j11J2O7n5K70k31J07k03J22R1j55Q2%n6R4j54P2
8152f2j58K03j92L79N3r9N1r0j42J68j54K16k48J97J03k97m5J12J34j3j56R0q6
$$ plain form
7986 -16 -71 20 202 -203 -54 -83 -23 -221 -151 -47 356 167 -141 41 111 89 32 -6 -48 -186 297 -155 -207 -64
8010 -64 -122 32 -5 34 130 55 -235 91 165 -17 -273 -234 -168 74 -117 150 228 157 -61 -31 142 -80 189 64
8034 64 8 -89 152 186 61 -38 -133 28 66 -77 -22 -3 107 -60 150 -7 81 56 -199 -39 178 167 -214 94
8058 94 12 58 49 386 -260 37 387 97 250 198 -207 -199 168 -155 172 66 -67 -200 -181 -187 -247 203 -13 99
8082 99 -88 -27 17 127 65 -118 -3 275 -8 146 190 23 -194 109 31 -264 20 154 3 185 12 -31
8104 -31 -155 -138 101 195 -150 -187 209 -111 -46 -70 -13 -57 70 110 -93 128 -67 -48 140 -134 109 -165 12
8127 12 55 153 74 -36 -46 183 24 -14 -125 -113 -46 -101 169 -62 45 -158 -36 55 -100 -18 -18 -74 20 -134 -62
8152 -62 -220 -17 -209 170 223 124 175 85 -57 111 -43 173 -75 122 225 -72 -117 -5 129 116 -40 50 -36
8175c6LO5k39K12o8J16l5k7J1j91J80j81R4L18j58j25
$$ plain form
8175 -36 -33 32 -207 5 -63 53 18 -9 2 -189 -9 -190 -96 222 64 -61
8191f1
$$ Imaginary data points
##PAGE= N=2
##DATA TABLE= (X++(I..I)), XYDATA
0@%%%%%%%%%%%%%%%%%qJ6j6J6j6J6k4L2l2L7m5M8n6O6p4Q6r6J06j20J36j52J70
39I0j91K11k35K62k88L18l52L89m30M73n19N73o31O95p69Q50r41J044j163J304
59F90j470J670j918K232k644L214m053N413p966J4324n8679q9189J64852Q3937
73A10413j07457p7146O1678M9624q748j7868k1765k6481L5406O4141k5114r4607
85e7924N843J02194J5053r7888l2061P1705M0841m0005l7851N847K2208J7686
97A5648K57l1622k2385L7193M2254l3412m6522K7591L8056k0943j6257J8960p172
110A646j7715L0587K2015m7489k9976N3207L6651n2251l7715M5153K8710l9137
122f314j4394L0440r447k6111L3851K5144n2681k9452O2605L4092o2591l6950
$$ plain form
0 0 0 0 0 0 0 0 0 0 0 0 0 0 0 0 0 0 0 -8 8 -8 8 -8 8 -16 16 -16 21 -24 24 -32 34 -40 46 -50 56 -64 72 -80 90
39 90 -101 110 -125 137 -151 167 -185 204 -226 247 -272 301 -330 365 -404 446 -495 549 -614 690
59 690 -780 890 -1028 1204 -1440 1774 -2279 3134 -4832 9492 -49187 -138376 26476 110413
73 110413 2956 -74190 -12512 37112 28364 10496 -11269 -37750 -2344 61797 36683 -57924
85 -57924 -52081 50113 65166 -32722 -64783 6922 47763 7758 -30093 -24246 -2038 15648
97 15648 15905 -15717 -38102 -909 41345 7933 -38589 -10998 27058 6115 -10142 8818 1646
110 1646 -16069 14518 36533 -10956 -40932 12275 48926 -3325 -41040 4113 32823 -6314
122 -6314 -20708 9732 285 -25826 8025 33169 -19512 -48964 13641 47733 -14858 -51808
134e1808N6341L8732m2178l0405K7078J6963j2068J694K401j7202L341L0833l203
147B0519l9866j954M0470O802l7820j0142K9401P617k0542l422P862n292K932
160c435J3643j2446j7784J8815J8455k2239j5210K5045J2180k5135m674K7031
172A4246K9k7944N034K7661p591k3691R672J6973j1426r139J1060j263j4450R168
186a661J7985j6322k4323J9310K8445k0204l1170J7080K9755j1358k2878N619
198i722J3527J48j049j896r302K619J9753J789k5355o703K7371J1522k5405j3894
212a6597J9141J2627j2238q993L178J429K615O081q047j3851Q845J8962q995k1743
226a7586P988K0021n386j5686N300J0180m224k788N307j716n825O366Q186p955
$$ plain form
134 -51808 4533 43265 1087 -29318 -2240 14723 2655 4349 6750 -10452 -7111 23722 20519
147 20519 -19347 -21301 19169 25971 -11849 -21991 7410 15027 -5515 -8937 -1075 -6367 -3435
160 -3435 10208 -2238 -20022 -1207 17248 -4991 -20201 4844 17024 -8111 -12785 14246
172 14246 14275 -13669 -8635 19026 11435 -12256 -2584 14389 2963 -6176 4884 3621 -10829 -1661
186 -1661 16324 2 -24321 -5011 23434 3230 -27940 -10860 18895 7537 -15341 -9722
198 -9722 3805 3953 2904 1008 -8294 -5675 14078 15867 -9488 -16191 11180 22702 -2703 -16597
212 -16597 2544 15171 2933 -6060 -2882 -1453 1162 7243 -804 -14655 -5810 13152 4157 -17586
226 -17586 -9598 10423 5037 -10649 -5349 4831 607 -2181 3126 1410 -4415 1951 10137 2182
240B182q656Q346Q546p934p740P101M905p662k451P359k547q469M630Q284p693
255a799q040Q090O973p924n003P173K340m897J737L883m194j705P715J840q773
270b584j506J0299K283j0281k275R087J885p523j678M246m10k501K039j082n049
285e050K889O253n036p789N397Q376n099p947N035O504k824m089K388K518q09
300G17Q53J178k892l69M646J272o198j913O828K186p292k583N883J458n745p61
316b732K878q98j766J866l43l312J597M232k535l914K955M354k274l202K422L676
332C004j782j581K024J264j694k50J905r88j763J648J384k570k074K705N64l356
348a560j036K948o80k977P91K241j729j010J920Q31j726J37K109j84p37N94J497
$$ plain form
240 2182 -6474 1872 10418 2484 -5256 1845 6750 -912 -3363 3996 1449 -7020 -2390 5894 -1799
255 -1799 -9839 -1749 5224 -2700 -7703 -530 1810 -3087 -1350 2533 -1661 -3366 4349 6189 -2584
270 -2584 -4090 6209 8492 -1789 -4064 5023 6908 -615 -2293 1953 1543 -958 1081 -1 -5050
285 -5050 -2161 4092 -944 -8733 -3336 5040 -59 -8006 -2971 3533 709 -3380 -992 1526 717
300 717 1570 2748 -144 -513 4133 5405 -793 -2706 4122 6308 -984 -3567 2316 3774 -1971 -2732
316 -2732 146 -752 -2518 -652 -995 -4307 -2710 1522 -1013 -4927 -1972 2382 108 -3094 -672 3004
332 3004 1222 -359 1665 2929 1235 985 2890 1902 139 1787 3171 601 -1473 1232 1796 -1560
348 -1560 -2596 352 -328 -3305 -2514 -273 -2002 -3012 -1092 -261 -1987 -1850 259 75 -662 -68 1429
365A429m8p17O56R74o52o47J449J8k273K64J943q29k724J44J798p05j587k66N47
384a226m3J22k46q89R4J624N12j307n01J357K051n05j737L46K270R63j134j672
402G9P00J422Q22j366k448P94K501p60l693J06K242j31j994p8K26n51O86Q56j112
421a699j546K198K443j414k242R27L211K48k407l30K595J007j940r30J931L3j790
438B95N52J335j379j893J336J338j850k472J238K186j140k502P46K109n71k143
454b815O74K217o34j067J324K160j148j841J128L145j036l196J633L918j864m213
470a615J510L916k482l848L180K643l953k764L308J680l958j967M055K110l439
485a624k830L498K395k560k347L430L082l338j835M510J294n044j88O140N3o174
$$ plain form
365 1429 1381 664 1320 2294 1642 995 2444 2462 189 453 2396 1567 -1157 -1013 785 80 -1507 -1773 -1226
384 -1226 -1269 -1147 -1393 -2282 -2188 -564 -52 -1359 -1860 -503 1548 1043 -694 -348 1922 2885 1751 79
402 79 779 2201 3023 1657 -791 3 2504 1744 -1949 -1843 399 268 -1726 -1804 -1578 -2129 -1443 -587 -1699
421 -1699 -3245 -1047 1396 -18 -2260 -1333 1878 2126 -281 -611 1984 2991 1051 121 2052 2085 295
438 295 847 2182 803 -1090 246 1584 -266 -2738 -1500 686 -454 -2956 -2210 -101 -672 -2815
454 -2815 -2141 76 -558 -1625 -301 1859 711 -1130 -2 3143 2107 -1089 544 4462 2598 -1615
470 -1615 -105 3811 1329 -2519 661 3304 -649 -3413 -105 1575 -2383 -4350 -295 1815 -1624
485 -1624 -4454 -956 1439 -1121 -3468 -38 3044 -294 -2129 2381 3675 -1369 -1557 4583 4636 -1538
501a538l30N937M35n650j978L785K255k763k671J282K157j806j798J512M99k613
517c285Q24N058j079o752J043Q484j89q916M06R528J611q152k770O813K642m662
533F04j898K826J037k705J185J454l590l392M549N054n200p356N117P985m970
548G00q730L531Q588k189o269K077M688k229k217K604J438k741J025L410j58l722
564a94j663L175L076k973m287K311N351k529o051J205M301k056l063K729K122
579A454l909j053M301P76n272j071O134K953m912m047M712N293l586n411L126
594e12N199j884l375K112N92l401Q19M332k639n562L339O120l572p564J902O721
610B627p97n082p68L563J753j889j628N3J741J124O8j01p28n0J055K136j938k894
$$ plain form
501 -1538 -1868 4069 4504 -1146 -3124 661 2916 153 -2518 -1236 921 -885 -2683 -1171 -672 -3285
517 -3285 -2461 2597 1518 -5234 -4191 4293 4104 -4812 -4406 5122 6733 -1419 -4189 2624 5266 604
533 604 -1294 1532 2569 -136 1049 2503 -1087 -4479 70 5124 -76 -7432 -2315 5670 700
548 700 -8030 -4499 4089 1900 -4369 -2292 2396 167 -2050 554 1992 -749 276 3686 3528 -194
564 -194 -1857 1318 4394 1421 -2866 -555 4796 2267 -3784 -2579 1722 -334 -3397 -668 1454
579 1454 -2455 -3508 793 1569 -3703 -4774 1360 4313 -599 -4646 66 5359 1773 -3638 -512
594 -512 4687 2803 -572 1540 2132 -1269 -450 3882 1243 -4319 -980 5140 1568 -5996 -4094 2627
610 2627 1830 -3252 -4020 -457 1296 -593 -2221 -2168 -427 697 765 664 -64 -114 941 3077 1139 -1755
628a755K064L993q93m301m62K793J016k684r65Q82O44J33q94r97o15k37J638J463
646H23k002k623K065M393j744m960J473N578k7l894l53K766N30j8q70j361l16
663e40L116J258l440l010K787K589j763l368m44L167J382j832l705J082L090N33
679I02k617r75J721K074k35j731p90J360K196o6j886J25J482P10q87j457J10J388
697A424O52j333j600O86J461p24j884k8J050m9p22R1k04j26M07J73k29j20J146
716G1J3k57k8P13J49k6L55J69j49k10N92l30k11p7J40n88O2q5p78J71Pl07n92
739a196K80J81k56lj29M3K45N03m67K00O69O42q72K70P82J73k96K40k16M54Q4
760A331m00o28J60N28m18q06n34P25p6k15j036J11N38K54p27n33Q29O44J66p00
$$ plain form
628 -1755 309 4302 3409 -892 -1354 1439 2455 -229 -1194 -312 332 465 -429 -1426 -2041 -2278 -640 823
646 823 -1179 -3802 -1737 2656 912 -4048 -2575 3003 2976 -918 -1271 1495 2025 2007 1137 -224 -540
663 -540 2576 3834 394 -2616 171 2760 997 -2371 -2815 352 1734 -98 -3803 -2721 369 902
679 902 -1715 -2690 -969 1105 870 -861 -1651 -291 1905 1839 -47 78 1560 2270 1383 -74 36 1424
697 1424 2076 743 -857 -171 1290 566 -1318 -1346 -296 -345 -1067 -976 -1180 -1306 -899 -726 -955 -1075 71
716 71 84 -173 -201 512 661 635 990 1159 1010 800 1392 1062 851 774 914 326 388 303 -475 -304 -297 -604 -1196
739 -1196 -916 -735 -991 -994 -1123 -1080 -835 -332 -799 -599 70 712 -160 110 892 1065 769 1009 793 1247 1331
760 1331 931 303 463 991 573 -233 -767 -42 -118 -333 -1369 -1258 -720 -466 -1193 -1726 -897 -253 -87 -787
780g87n6N48J031k77n99K23J022L32o14k38L19N06k81q12k85M12K62n98p08RO0
801e31L71q36m75N28N16k11o13K18N26K65k99J50M8L41N29K0k34K19M88L47p51
822F16K92N72n34j57m72L55l18j59l66p2l63P3J00k61k44o0L47j46m54N50L22
843c79j84j25L17O08p1K18Q09m46m94Q55M33n32m92J51l2J70k11o68J38K8K86
864C79k62j118j29P42K87j131l46N90P40j38n94J64M38L16L85k36o20L82J552
883A401j15j339K55J010O83j362n29O83K18l65Km70q15L06R81n48j741k3J971
902B03J12j844m14J464N83n12j51J8K62J041K09q85l31Q56O56n0m88n13N49P84
922A549j93j455n74J310J076j299j865K55J652n6j806n36J528K48p66R8K65q90
$$ plain form
780 -787 -843 -295 736 459 -140 83 1105 1437 823 585 904 1410 1129 317 32 444 706 108 -600 -591 -531
801 -531 -160 -996 -1471 -943 -427 -638 -1251 -1033 -507 -242 -541 -391 -343 -2 527 547 313 532 1020 1367 616
822 616 908 1480 946 789 317 672 354 195 -171 -243 -606 -533 -433 -694 -938 -998 -651 -797 -1251 -701 -379
843 -379 -563 -688 -371 237 166 384 1193 747 253 1108 1541 1009 517 668 636 806 595 -73 65 93 379
864 379 117 -1001 -1130 -388 -101 -1232 -1578 -988 -248 -386 -980 -816 -378 -62 323 87 -533 -151 1401
883 1401 1286 -53 202 1212 1895 533 4 687 905 540 542 72 -743 -437 544 -4 -1745 -1768 203
902 203 315 -1529 -1943 -479 104 -408 -559 -541 -279 762 971 86 -245 611 1267 1217 729 216 765 1549
922 1549 1356 -99 -673 637 1713 414 -1451 -1196 456 400 -1406 -1942 -414 -166 -932 -834 -569 -1459
940a459M58J914k32k209L23L286J89l427o36L709J012l116m13K180O0j832O65
957D72Q44j953l92J957N03k621j017K059J031k076j501J670J606k02j943J40J529
974A06N79o79n01P63L19J10J58J53r23k31J124J100j433j664R91K049m49l602
992b030J17L104L49l471l76L277p48k848J557K093k134j696L643J317m082r70
1008b898M937O00l982o53L973R94k871j023J978O26j629p7J360o73j335Q49J121
1025A297j222k031R53K467j343k170O54J778n51j431J78J084M38k05n14J51Q25
1042C58J28q79M64R65m36p30J550L73k548o90L281P25l673p30L498L11m017K21
1060a829K721n75k256R84J885j853j729K403J307k239j106K647J624k178j390
$$ plain form
940 -1459 -1001 913 681 -1528 -1205 2081 2270 -1157 -1793 1916 2928 -188 -601 1579 1639 -193 472
957 472 1316 -637 -1029 928 1431 -1190 -2207 -148 883 -1193 -2694 -1024 582 380 -1563 -1423 106
974 106 685 6 -495 268 587 697 855 1008 85 -146 978 2078 645 -1019 -28 2021 1572 -2030
992 -2030 -1913 1191 1540 -1931 -2307 970 222 -2626 -1069 1024 -1110 -2806 837 2154 -1928 -2898
1008 -2898 2039 2639 -1343 -1996 1977 2971 100 -923 1055 1681 52 -25 1335 662 -673 176 1297
1025 1297 75 -1956 -1003 1464 121 -2049 -1395 383 -168 -1599 -1421 -337 101 -104 -618 -467 358
1042 358 486 -393 71 1036 600 -130 1420 1793 -755 -1445 1836 2561 -1112 -1842 1656 1967 -2050 -1829
1060 -1829 892 317 -1939 -955 930 -923 -2652 -249 1058 -1181 -2287 360 1984 -194 -1584
1075a584K249J424k280l19J306Q77j448m2J270p71j514J154Q95j419q43J600j9
1092E36j444J42J42j44j89R28l78r38J158P48j650l65J885O09j425M40J531p33
1110H53j308J022J348j652q77J776J012k351q79J843j4j755j93J655j10j634K05
1127a059J370r91j280J161J272o90j088J239P77j592n70K073N84j927R73J257
1143A509p95j182J574K88j322l08J854n22j764M92J167j302r06J132M26j362Q0
1160i41J232q93r75J037O76p09n96J516K35q23k51Q79L96q21L41O46J2r68M21
1179D14R23q65j154J189P08j435n52J615n36j298K09J290r53j029J276N76j519
1196a141r5J477J22j406J89J893o65r17Q55P75j135k61J317P7r92J30R90m08j278
$$ plain form
1075 -1584 665 2089 -191 -510 796 1673 225 183 1453 682 -832 322 1217 -202 -1045 555 536
1092 536 -908 -766 -624 -768 -957 -29 -407 -1345 -187 561 -1089 -1454 431 1040 -385 55 1586 853
1110 853 -455 567 1915 263 -614 1162 2174 -177 -1056 787 773 -982 -1175 480 370 -1264 -1059
1127 -1059 311 -680 -1960 -799 473 -217 -1305 -66 711 -881 -1451 622 1206 -721 252 1509
1143 1509 714 -468 1106 1394 72 -236 1618 1096 -668 -176 991 -311 -1217 -85 341 -1021 -941
1160 -941 291 -602 -1577 -540 136 -573 -1169 347 582 -241 -492 387 783 -38 303 949 961 -7 414
1179 414 1337 472 -682 507 1215 -220 -772 843 307 -991 -782 508 -445 -1474 -198 378 -1141
1196 -1141 -1236 241 363 -1043 -854 1039 374 -543 312 1087 -48 -309 1008 1085 93 223 1213 805 -473
1215d73K34J152p40r44O40L80q12m14Q22l32p08L51R72n84o18N03J071o50m00
1234e50O04P92r75j97J408m41p05P54M71p50n79J198n2j118N5Q92m23j392O93
1253c15Q77j228o55J146K16j104nJ034Q9j322P21R79n22o12O48R24n97j39P16
1272H51K61p95Q6N67l29m89J69P05n71p73M32L46p89l33O01l1r74M64M17m57l18
1293i60M52M80n78P0O59K8l00J02N98k75m42P19M80o10l64O45no37K52K97k33
1314C78p46M16L56q63k21Q73m48m92M5L57oo16L60O39j26l75M46N06l92q8L71
1335C74K54m98J54L21k7k57OM50k99l60J30J41k80k51P2j9l83k22L02M1m88M21
1357d18%Q6j08K63K0j79M32P8J02j43K80K60M6k91O6pm19M41K0J56n52j34K2Q6
$$ plain form
1215 -473 -239 913 173 -771 -131 249 -563 -977 -155 -487 -1195 -844 128 -456 -1074 -571 500 -150 -550
1234 -550 54 846 -129 -326 1082 641 -64 690 1161 411 -168 1030 978 -140 -85 807 384 -1008 -315
1253 -315 562 -666 -1321 -175 41 -1063 -1068 -34 55 -1267 -546 433 -89 -701 -53 871 274 135 851
1272 851 1112 317 403 970 641 152 321 1026 455 -318 114 460 -329 -662 -61 -92 -1066 -602 -185 -642 -960
1293 -960 -508 -28 -606 -536 123 151 -149 -47 551 276 -166 553 1033 423 59 704 699 62 314 611 378
1314 378 -368 48 404 -459 -680 193 -255 -747 -702 -345 -351 -967 -607 32 -94 -469 -23 483 91 3 374
1335 374 628 130 284 605 578 321 327 777 478 118 248 389 109 -142 -70 -89 -472 -694 -392 -351 -839 -418
1357 -418 -418 -332 -440 -177 -157 -336 96 174 276 133 413 673 719 428 494 487 68 509 529 685 133 -1 21 107
1381A07n24J11J19l04o7k14M06j50o3j43L58oL4L14R9p6j0j86N44L40k00k25K72
1404E36J85r8m42L48K05o18j51J11P5k45l59L03l28qk1M1K61k69q2R9N98k31m17
1427e07N79K85m35k4N61K48n38k32N83K27n91l0O88k37p44j30O49P3o61l12N09
1448c9k5r00K74N22O5p67K72P46l52n22K78Q55K4q74O94O43m95o42N29M80l42
1469D24m59L84J29J23m92r2L09%p98J10N26q4q51K27O98o06o24M37R63q11n69
1490a056Q55M92k73k15K0M92J63m08K44N58k11p99L87N24j17j266R11P52j130
1509g7p65Q52M38j086n24J510j58j068j22Q72j48m49L75O38l50rpJ87J51o5j49
1530D6N37K85p79J34M83L26j207K5M16L89o80q9L94j45n49j7K52k10j54k56P98
$$ plain form
1381 107 -417 -306 -187 -491 -558 -772 -366 -516 -579 -722 -364 -370 -336 -22 77 1 -9 -195 349 689 489 264 536
1404 536 721 623 181 529 734 116 -35 76 151 -94 -453 -150 -478 -486 -507 -466 -205 -474 -556 -457 141 -90 -507
1427 -507 72 357 -78 -102 459 707 169 -63 520 747 156 126 814 577 -167 -297 352 425 -236 -548 -39
1448 -39 -64 -964 -690 -168 -103 -870 -598 148 -204 -726 -448 407 431 -443 251 894 399 -243 286 766 424
1469 424 -35 349 478 601 109 17 326 326 -472 -362 164 80 -771 -544 154 -452 -1076 -639 324 -487 -1056
1490 -1056 -201 291 18 -197 -177 315 478 70 314 872 661 -138 249 773 656 -610 301 1053 -77
1509 -77 -842 10 448 -638 -1162 348 190 -878 -1000 -128 -276 -725 -350 288 -62 -71 -78 109 260 195 46
1530 46 583 868 89 223 706 1032 -175 -150 266 655 -25 -114 280 135 -414 -431 -179 -389 -543 -799 -1
1551aj51l73k22M78L80n20k55J372j30p88J71J043m02r48M57R47p35k52O56j10
1571F17o48k38L64mm16j54M34k01l83rK15K2j36K33K30q8j62N7L96j57N3K72L16
1594F13k21k50J06K9j78K66R9k29J34j87j98k93K94J72m60j60Q12m79p94M41L72
1615a11l06j91K19O84o32J00N89K09j148O51N57j14l15L11L07o01j44M65j59l17
1635E4M5K13L6n30k0k3K37m43L4K72k54l65M03K54k99k55M10M48m87M46O5j72
1657F9l28P34R4n65N50L99m89m30K84L08r38L80M74l24o50L46K26n19j92J53M67
1678D9l64m32L28K30k93O3M30J01k02K64L85j92m48J7L57M3j53J66M25o9q48J61
1700A8L43n61J25N66l58p85M92J77n20j50L79j1l80M45K11k23l18K65K79Mk03
$$ plain form
1551 -1 -152 -525 -747 -269 111 -409 -664 708 578 -210 -39 1004 602 -346 111 1058 323 71 727 617
1571 617 -31 -269 95 91 -325 -479 -45 -246 -629 -638 -423 -401 -537 -304 -74 -162 -324 -267 129 -28 25 297 613
1594 613 392 142 248 277 99 365 464 235 369 182 -16 -309 -15 157 -303 -463 349 -130 -924 -483 -111
1615 -111 -417 -608 -389 295 -337 -237 352 561 -587 64 621 507 192 503 810 209 65 530 371 54
1635 54 99 312 348 -182 -202 -225 12 -431 -397 -125 -379 -744 -341 -87 -386 -641 -231 217 -270 176 241 69
1657 69 -259 475 569 4 554 953 464 34 318 626 -312 68 542 218 -432 -86 140 -379 -571 -418 49
1678 49 -315 -747 -419 -189 -482 -419 11 112 -90 174 559 367 -81 -64 293 336 183 349 774 705 -143 18
1700 18 361 -200 -75 491 133 -652 -160 17 -503 -653 -274 -285 -665 -220 -9 -232 -550 -285 -6 -2 -205
1721b05L57L04k13j67L77j64M9j2K33k49k17L10m60J06k19L31j04l84J68n2m58
1742f69K63M9P5N9k55N70k71J27N0L57k1n05P87j63m20M4N81J95p73J63L85k32
1764C96p65N31M9k68m49N17j20k54k27L41kl06M31p1n8l45N59J98j86j25K21J85
1786B52k66K24%K29j18pR8k55K29O6k96j48L5J72k89j90K31o9j60k50L91n4j63
1809c38pK68j68k08M02J62k34k55M52K24l25k39P18J14p52L50M33n87l1M49j52
1830B76m35Ko3L58l61n3J37r8j35m3K84j41j02Q8J19j3j44N67L8o0N1l0L7j48
1854A31L27om27L02J34j30j41j16K31k44k85O6P4l13j7L27j39m7k50K91p1k17
1876e20N7P09k18l37M09M1q5o2M01m2K08m14K95Lk10K31k17j12l13J91J28m08
$$ plain form
1721 -205 152 456 243 76 453 289 338 326 559 310 93 403 -57 49 -170 161 57 -327 -159 -211 -669
1742 -669 -406 -357 -282 -223 -478 92 -179 -52 -2 355 334 -171 616 453 33 77 658 853 80 243 628 396
1764 396 -369 162 211 -57 -506 11 -109 -363 -590 -249 -251 -557 -126 -197 -255 -600 -41 157 -29 -154 67 252
1786 252 -14 210 210 439 321 314 412 157 386 452 156 8 43 215 -74 -264 -33 -102 -262 -512 -121 -175 -338
1809 -338 -345 -77 -245 -453 -51 111 -123 -378 74 298 -27 -266 452 566 -186 164 597 10 -21 428 276
1830 276 -159 -157 -220 138 -223 -276 -139 -237 -372 -415 -131 -272 -374 -286 -167 -180 -324 243 281 221 272 242 279 131
1854 131 458 452 25 327 461 331 190 74 305 61 -224 -158 -84 -397 -414 -87 -226 -273 -523 -232 -303 -520
1876 -520 -463 246 28 -309 100 141 56 -6 395 353 561 147 442 445 235 466 249 137 -176 15 143 -265
1898b65J29P4j47r8L3l6j62K75%j00k25K81K59k24j84N47K72m82j19L03L61l73
1920A19k34O20o3m28jK27J95n40K26J94l25l86K04L40l75k98L05n0K69m20KN35
1942A16l05q5J67L06j10j66N89k0k45J14l1j92M80o86K91J82j63k43r5L32j55
1963H1m99J10M53k34l82p6M82m46K6K53K56j6k02J47N4K22j93j30M65K7j69j7
1985B12L79m35j68O4M07l46k14L30n6k50q6L04k38j27k94L89j19J86l59K08OJ94
2007a3k52K12L15l49j28M23K33n88K34M66j04m76J12K58p0l94K10L28l84j44K27
2028A16j71m52M93o3l15L51j43j78K40j35j4k49M92J35o1r2K36p4j95L28L88k76
2050C61l39L52J08p0m87M33k59M5l10j2J71J97k51j57M63l51l96K67J9J33m90
$$ plain form
1898 -265 -136 -62 -209 -307 -274 -310 -472 -197 -197 -297 -522 -241 18 -206 -390 157 429 -53 -172 131 492 119
1920 119 -115 505 442 14 13 240 435 -105 121 315 -10 -396 -192 148 -227 -525 -220 -270 -1 -421 -419 116
1942 116 -189 -274 -107 199 89 -77 512 492 247 361 330 138 618 -68 223 405 242 -1 -96 236 81
1963 81 -418 -308 145 -89 -471 -547 -65 -511 -485 -232 24 8 -194 -47 7 229 36 -94 371 398 229 212
1985 212 591 156 -12 52 459 113 -101 229 173 -77 -163 141 -97 -224 -518 -129 -248 -62 -421 -213 -207 -13
2007 -13 -265 -53 262 -87 -215 208 441 -147 87 553 449 -27 85 343 273 -121 89 417 33 -111 116
2028 116 -55 -507 -14 -77 -392 -41 -184 -362 -122 -257 -271 -520 -28 107 46 -46 190 116 -79 249 637 361
2050 361 22 374 482 412 -75 358 99 144 -166 -178 -7 190 -61 -218 245 -106 -502 -235 -216 -83 -573
2071e73N66J37m84n5O26L2n87L89M07l67m00P20j81k88J75K38lk38P9j68k85Q2
2093a78Q4j53L50K65n24k23J56R3j45j41n5O03k41RK99r0j23j32L10M83j28k83
2115B36j28J46j2k85K36P2o02K44O74o91k82r3O89l82m41M32L83o13P9J9J13K8
2137a78J14JL5J16J47j51o9J76O4k9L05j96j47l60J75L4K87k78%l0j47J08m61
2160d84L50L9m12J90J75j48j08N07j48k34Q5L11m4l11P3O24j73k04L68l0l17K
2182A11J25J14m57J61J25k18k40J17M29m15q3L81j35j63j42J35J30k74k75N63
2202a1k16l0o0N11J60j73Lo3j2K42j52nl57M40N3r8m29M35k19m21K47K50j98k83
2226c86L56J41l90l75L54K38k84K0N90k59j86K54K65k14qL51j05j74p2J6K37l37
$$ plain form
2071 -573 -7 130 -354 -409 217 249 -338 51 458 91 -309 411 230 -58 117 355 352 114 193 25 -260 -178
2093 -178 -94 -247 103 368 -156 -379 -223 -130 -275 -416 -471 132 -109 -100 199 109 -14 -146 164 647 519 236
2115 236 108 254 242 -43 193 265 -337 -93 581 -110 -392 -485 204 -178 -619 -187 196 -417 -338 -319 -206 -178
2137 -178 -64 -63 -28 88 235 84 15 191 255 226 531 335 188 -172 3 37 324 46 46 16 -131 -23 -484
2160 -484 -134 -95 -507 -317 -142 -290 -398 109 -39 -273 -188 123 79 -232 -159 465 292 88 456 426 109 111
2182 111 236 350 -107 54 179 -39 -279 -162 267 -148 -231 150 15 -148 -290 -155 -25 -299 -574 -11
2202 -11 -227 -257 -317 194 354 181 184 121 109 351 199 194 -163 277 330 232 -197 238 19 -402 -155 95 -103 -386
2226 -386 -30 111 -279 -654 -300 -62 -346 -326 264 5 -181 73 338 124 116 467 362 188 116 132 369 32
2248C2R0K04m33L96k39n7j49k74L53J99l94N7K44o2l34J60J10k36N0K78K37l24
2270i2O1O07m17k55M54q4m8%j34K40k81K9J33j41Jq9K39q8l78L0j03j14QJ62J52
2295a08o3j13p0K06M2Q4L29j18l09M74l42Q2P9J15j39nj41J77K88n33J68r3l35
2318c25J18J49K74m85k6J03L04l25j55M43l90K59j63J61J6M3K46q3j74M1K66k45
2340E2J70J90m80J24J22J41j05k04m5j24o9k5K45k0q1n2k01N01p61N36nk13J11
2363a93P5R7j49J18N8l7j64M87kk10J62mQO1l85j8J80J20l74l9L53r3n67K08L54
2388D6k13j69J93j65J93J37k97o9M27j09P9L21j74J73l32k2Q4L8k74L19pk53L03
2411B29o0L07o03J30J49j98n4j93L50O2n25l8M26J01o27N65l3K0r3l37M76Q9k
$$ plain form
2248 32 122 326 -107 289 50 -7 -156 -430 -77 122 -272 -215 29 -33 -367 -207 -97 -333 -283 -5 232 -92
2270 -92 -31 576 159 -96 358 274 226 226 92 332 51 80 213 72 73 -16 223 135 -243 -213 -316 -430 -422 -260 -108
2295 -108 -171 -284 -354 -148 -106 -22 307 189 -120 354 12 94 173 288 149 144 3 180 468 -65 103 10 -325
2318 -325 -207 -58 216 -269 -295 -192 112 -213 -368 75 -315 -56 -219 -58 -42 1 247 164 -10 31 297 52
2340 52 222 412 -68 56 178 319 214 10 -35 -159 -228 -253 -8 -28 -109 -161 -362 139 -622 -86 -91 -304 -193
2363 -193 -118 -21 -170 -52 6 -31 -195 292 290 80 242 238 246 307 -78 -96 84 204 -170 -209 144 51 -516 -308 46
2388 46 -167 -336 -143 -308 -115 22 -275 -344 83 -26 53 374 200 373 41 19 103 141 -133 186 179 -74 229
2411 229 169 476 -127 3 152 -46 -100 -293 57 119 -406 -444 -18 83 -544 21 -12 8 -85 -422 54 143 141
2434A41o3k6N7m3p0J11M08l18l36M70k68J6j83J19r8n8J22l4q3j48m7J20J32l21
2458d00L94K9Oj28n7L68j04k54K22L05r6k87J88K93j13l06O8K57l33k6J2k0j64
2481a46LK16j34q6K12j58K0l5p0J4K19j07m30J79M34j37j86L07L25m65J15K21
2503C11J52k70n8K56j76k13M1j31K46k29n3J73j41J88l58J63P3k74J22J8K44k71
2525a87K2J20j88J50K32J39l13RJ85o3j5J62N5l8P0j53p3J16m69J8K10LJ73l10
2549a45m32M50j9j46L4J76j05j43N78k68J03j88L2J00J18j7j41M4L50k38k00K08
2571A51K4j56l0J71k41L2KO8l16J46L26m30O9L9J5j28K24R7m3l93L86O4j90L42
2595B29m27O26l23J73M0l08O9K14M1m02R8L77l70N6Mr5j23j82J31K39j41j14K01
$$ plain form
2434 141 78 52 109 66 -4 107 515 197 -139 331 63 79 -104 15 -83 -141 -19 -53 -136 -284 -331 -211 -79 -400
2458 -400 -6 23 29 -99 -156 212 108 -146 76 381 285 -2 186 479 366 60 128 385 52 26 38 18 -146
2481 -146 -143 73 -61 -147 65 -93 -73 -108 -178 -164 55 -52 -482 -303 131 -6 -192 115 440 -25 90 311
2503 311 463 193 135 391 215 2 43 -88 158 -71 -124 49 -92 96 -262 -99 -26 -300 -178 -160 84 -187
2525 -187 -165 -45 -233 -83 149 288 -25 -16 169 106 91 253 308 270 340 187 114 230 -239 -221 -11 -8 165 -145
2549 -145 -577 -127 -146 -292 -258 -82 -187 -330 248 -20 83 -105 -73 27 145 128 -13 31 381 143 -57 151
2571 151 175 19 -11 160 -81 -49 -47 21 -295 -149 177 -253 -184 -145 -130 -258 -34 63 20 -373 13 77 -113 229
2595 229 -198 428 105 278 318 10 79 293 334 -68 30 407 37 93 97 2 -121 -303 -172 67 -74 -188 13
2618A3r0J01k89J40J93j14J22n4J63o3l3R6j81k1P1M18l84J1j03Jq7M43l1j71
2642A51j76k07J40N7p8K00m79J28L30J23k16j3L1K7j25K9J25l8J42r0o5P0Q4J3
2666A63L6q9J08n8j31kP8m29J40P1lM04l74k56K78K48j23k18L91j16j47k55M49
2689A65j72k95O10m27R4K06Jo2j32L5J71q1o2K3l7k36L08O3l8o8j63K55l70n8
2713b70J92K1j96J68m5M0J4J19M6J41n27j07N71M7l42J95J51k00K23K1j35J3k41
2736a01j17L30o3k52J98k53K39j15j00O0J18n2p0j53J55O0J91j51J21J21o9J4
2758A11L9Q3Q6j84J02j59q8K46k80K8OK75k41k31K2J44j61m2J89J6k57J96M3k20
2782b77j6N4K37k11K03J74j43j17qL26l7k20Q0O0Pj59K85j06Nm42K67M7K8j03
$$ plain form
2618 13 -77 24 -265 -125 68 -46 76 22 185 122 89 185 4 -17 54 472 88 99 -4 -3 -90 353 322 151
2642 151 -25 -232 -92 -35 -113 87 -392 -264 66 189 -27 -40 -9 18 -107 -78 47 9 151 61 -4 66 150 163
2666 163 199 110 218 160 29 27 105 -324 -184 -113 -116 288 -86 -342 -64 184 61 -157 234 118 -29 -284 165
2689 165 -7 -302 308 -119 -25 181 182 120 -12 23 194 113 51 74 37 -199 109 172 134 66 -97 158 -212 -270
2713 -270 -78 -57 -253 -85 -130 -90 -76 43 89 230 -297 -404 167 214 -128 67 218 18 241 262 127 140 -101
2736 -101 -218 112 49 -203 -5 -258 -19 -134 -234 -174 -56 -108 -178 -331 -176 -116 75 -76 45 166 97 111
2758 111 150 233 319 135 237 78 -10 236 -44 -16 -10 265 24 -207 -185 -41 -202 -244 -55 -39 -296 -100 -57 -277
2782 -277 -293 -239 -2 -213 -10 164 21 -96 -104 222 185 -35 45 105 112 -47 238 132 137 -305 -38 9 37 -66
2806f6K89k58K0k56J79L4j69L17J41j78j66J44K74k89O3K09j95L9n6J57J2j62
2828H3n1P5j40l3K65r1k9J70l07j8o2O8%j84K27K2l17K3L9K19k6k3j1J3j34L8
2854a84J97K12l57N3M06k01j47j2K54j46J26k06J88j13j70K34r7K6K9l2k9j29
2876i8j26J72j32J02j29M0L72k95J08K8l37K92p8J49J02q2J02L4o1N9p6j82K73
2899B37l32Q4nj19L35l24j39M33l69l15L89oL1Q2k17J92j32R2J40j27J70k16R2
2922b4K95l17j4N05k21m42L70j65R9J49l08K75k9k94J71l09Q1Q1J61n27L78K8
2944e7k56M82l35M40n17L49j76o4J86j31J99O9k45R7j04J46l69M4J30lR5J31j64
2967e3K0J46j27p6K12m72L94k07J12k29J14J65k18L90k75K17N1l95K78j62K75
$$ plain form
2806 -66 223 -35 -15 -271 -92 -58 -227 90 231 53 -113 31 305 16 79 288 93 132 76 233 245 83
2828 83 32 107 -33 -66 199 108 79 249 -58 -76 -138 -70 -70 -254 -27 -5 -322 -299 -260 -41 -67 -90 -101 -88 -222 -184
2854 -184 13 225 -132 -79 327 126 -21 -33 221 75 201 -5 183 70 -100 134 37 63 92 60 31 -98
2876 -98 -224 -52 -184 -82 -211 -171 201 -94 14 42 -295 -3 -81 68 170 88 190 224 163 222 146 -36 237
2899 237 -95 -11 -16 -135 200 -124 -263 170 -199 -514 -125 -131 -100 -18 -235 -43 -175 -83 57 -70 100 -116 -24
2922 -24 271 -46 -60 445 224 -218 152 -13 86 235 -73 202 173 -121 50 -259 -178 -97 64 -463 -85 -57
2944 -57 -313 169 -166 274 -243 106 -70 -134 52 -79 120 189 -56 41 -63 83 -286 -242 -112 -115 -20 111 -53
2967 -53 -33 113 -14 -90 122 -350 44 -163 -51 -280 -166 -1 -219 171 -104 113 164 -231 47 -115 160
2988A60J46j11k45K25j87o7J31o0M4K29k11j55L4J5r9j82L41m39M14j01j11K88
3010E9l85K24JM2j30J41Q3J05j53K00J21j70Q8k40L12j99L5m3J8O6k05nJ60j97
3034g2p9J70m8n2N6k60K9J60J83n7k22P0j50L33M5j69L36m59L07r5q1J31J57j91
3058D2j2j3N1K2r9J55n3k4O9j29k83K06M6k76L10q1j52J16K84j21l07N7J6L32
3082A56j25O4Q1k25J92k32N4K59m2p5N4J30k65J7q3K35n21O5K31J12l03J38k43
3105c26K09m9K28p6k05N6J77N1l94K35n9L03j38R3K74k81J58j98q1L4J88k83N1
3128c3J07J18n28L07J42j34j54K11k30K57J89k13j67r6P1K67k40P5J3l0M73l03
3150A02K19k01L63k24m01K31J79j73j17oj09K3j30M42k00p3O2J30m1k68j5J58
$$ plain form
2988 160 306 195 -50 175 -12 -79 52 -8 36 265 54 -101 -67 -52 -151 -333 8 -431 -17 -118 -229 59
3010 59 -326 -102 -101 -59 -189 -48 35 140 -13 187 308 138 226 -14 298 99 134 91 109 175 -30 -35 125 -72
3034 -72 -151 19 -29 -81 -25 -285 -256 -96 87 30 -192 -122 -272 61 106 -63 273 -186 121 26 -55 76 233 42
3058 42 30 17 68 90 -9 146 93 69 138 9 -274 -68 -22 -298 12 -69 -221 -105 179 58 -249 -192 -176 156
3082 156 31 95 176 -49 143 -89 -35 224 182 107 161 291 26 43 -40 195 -326 -261 -30 82 -221 -83 -326
3105 -326 -117 -166 62 -14 -219 -163 14 65 -329 -94 -153 150 12 105 379 98 256 58 -23 11 199 -84 -33
3128 -33 74 192 -336 -29 113 -21 -175 36 -194 63 252 39 -128 -224 -153 114 -126 -51 -38 -68 405 102
3150 102 321 120 483 259 -142 89 268 95 -22 -28 -137 -114 -244 198 -2 -75 -13 117 76 -192 -207 -49
3172d9O5j01J00k56L68j07j54Q4P2J33k38J63Q1J2kr4P6j76k6O5m9N7k2j15L7
3197g6q9qJ11j8O6l02K71J87p7k77l4N81j50l22K50q7k10L21N3N2j99J40jk01
3221a9J21L8l4r4j35J43m1K5j29Q9m4o0j86K31J46k82KJ62J0M7k0p0K35k14J44
3246F5K22j72%l7n1P3j73L46k72j01k03M85j79j10k2P0P8k6N6k08J37m1j07n3
3270b23J66K7l80K68L63k18N0J03p6K50k97J09l9k05J98j99P2m6k1j05J92q8k10
3293c09K74L4j98L8J98j8j85j14J65Q5k33K34J04p9q7P9J24m5J36j85k8J68n2
3316A06Pj37L9L8l3M3P4q6N2j78m7J58n6p7J33j89J91l31M68k42J67l23K19J8
3340A4r8M07j47m0k15l9R1J10qj14J1J44l20K40k43k1K90j99J80j07%k27L51k05
$$ plain form
3172 -49 16 -85 15 -241 127 20 -134 -50 22 155 -83 80 161 173 171 77 153 -23 -49 16 -33 24 2 -113 -76
3197 -76 -165 -173 -62 -80 -14 -316 -45 142 65 -212 -246 335 185 -137 113 26 -184 137 190 242 43 183 182 -19
3221 -19 102 140 106 12 -123 20 -21 4 -125 -36 -80 -140 -326 -95 51 -231 -229 -67 -57 -10 -30 -100 135 -79 65
3246 65 287 115 115 78 27 100 -73 273 1 -100 -303 182 3 -107 -129 -59 19 -7 49 -159 -22 -63 -170 -223
3270 -223 -57 -30 -410 -142 221 3 53 156 80 330 33 142 103 -102 96 -103 -31 -77 -98 -203 -11 -99 -309
3293 -309 -35 -1 -199 -161 37 19 -166 -280 -115 -30 -263 -29 75 -4 -91 -12 112 67 203 18 -10 158 106
3316 106 113 -24 15 53 20 63 137 51 103 -75 -122 36 -20 -97 36 -153 38 -293 175 -67 100 -223 -4 14
3340 14 -84 323 176 136 -79 -118 -27 83 75 -39 -28 116 -204 36 -207 -228 62 -137 43 -64 -64 -291 60 -145
3364a45O5L1N9J19j34J58j0l5k28J73J54J23m45J11m3L11j80J5%M9j79Q1l2p8
3388f0J55k34J55j42J21l12L90j61r6J01j27J76J15k9M3Q9r8j14J07j74N0R3N
3411E3O1L09m18L86l03n8k0k1J99l15mj40j7J42K78j61j77M1J00k68K25r5q0K35
3435d8j34K40o6J2K30J73n79N3L12J07o0j61j97K94L5j57QO4k35k26L50n6Qqn7
3460i8L14k13k41K37j43p7J46J50J84l08J06l90M86Q1l25R9J55Q5m57K7pJ65k0
3483d4R1p3j30QP9N3k1J54j43j3j14P8j18r8J94k3J48L7p7Q6Mk7J98j51K3o4j01
3510d4J91l25M8J68K0P8j82K5j03J26m9K9j49L09k68K49j95j46J05r6J17J78J21
3533B07k73K31j41L78l53J19k23j47k0K67J75q8K6J1k08J38P1k4n16L95J45l90
$$ plain form
3364 -145 -80 -49 10 129 -5 153 143 108 -120 53 207 330 -115 -4 -47 264 84 99 99 148 -31 50 18 -60
3388 -60 95 -139 16 -126 -5 -317 73 -88 -184 -83 -210 -34 81 52 95 184 86 -28 79 -95 -45 48 53
3411 53 114 423 5 391 88 30 10 -11 188 -127 -131 -271 -288 -146 132 -29 -206 -165 -65 -333 -108 -203 -283 -48
3435 -48 -182 58 -8 4 234 407 -172 -119 193 300 240 79 -118 176 211 54 62 126 -109 -335 15 -41 -33 -41 -98
3460 -98 216 3 -238 -1 -144 -221 -75 75 259 -49 57 -333 153 234 -91 8 163 248 -209 -182 -189 -24 -44
3483 -44 47 -26 -156 -148 -69 -16 -37 117 -26 -39 -153 -75 -193 -291 -97 -120 28 65 -12 74 78 51 249 98 121 57 -44
3510 -44 147 -178 -130 38 58 136 -46 -21 -124 2 -47 -18 -167 142 -126 123 -72 -218 -113 -209 -92 86 207
3533 207 -66 165 24 402 49 168 -55 -202 -222 45 220 132 158 169 -39 99 170 146 -370 25 170 -220
3555b20M1Q2j20L25o1j37k6J16K2o4L5J49r7j8J24l42M23l37J51j88r8K42J36
3578A38P3r2J13n01K16Q2j91m7lK23p6r4M9P2j82J15Q2j35R8M5j22K14j11J45
3602A11P2m7j77M5Q9n6K40j51j0k06J74k36L32l00k8n0N2K51m30L90j35j80J62
3625h8j40k8J31p8J75M6J70J0l60J60J84j40P1l2K77m58M18j9r9k12R0K11k39
3648E0K15l80o2K28J6j64o3M27m58j61M61n8o5j50K88l2o4q7J1L2OK04o6k0p8
3673C0O5Nl64M57l88K33k2ml3m2l1O3k47J28K18k53K68j84N3J22j32O7j05J11
3697A5j0r6K03L4j28J05K4k75K18o3J06k48J25j7L4L4n1l92N17q5r4R7j47M0j3
3722f7K11k81J3K24l6j80l1K42j80n6J39K33j48O7k52k2J18k75K04K12RJ00k04
$$ plain form
3555 -220 -179 -97 -217 108 47 -90 -116 0 22 -42 -7 142 45 27 151 -191 232 -105 46 -142 -240 2 138
3578 138 211 119 232 -269 -53 29 -162 -209 -212 11 -65 -159 -110 -38 -220 -105 -23 -158 -60 -15 -137 77 -34 111
3602 111 183 136 -41 4 93 37 277 126 116 -90 84 -152 180 -120 -148 -198 -146 105 -325 65 -70 -250 -88
3625 -88 -228 -256 -125 -203 -28 18 188 198 -162 -2 182 42 113 81 358 -100 318 299 200 -12 78 289 50
3648 50 265 -115 -177 51 67 -97 -160 267 -191 -352 109 51 -14 -164 124 92 28 -59 -48 -16 -10 194 128 108 30
3673 30 95 100 -264 193 -195 38 16 12 -21 -63 -94 -31 -278 -150 68 -185 83 -101 -48 74 -58 9 -96 15
3697 15 5 -91 112 146 18 123 147 -128 90 27 133 -115 10 -7 27 61 10 -382 135 50 -44 53 -94 -54 -67
3722 -67 144 -137 -124 100 64 -116 -147 95 -85 -141 -2 231 83 150 -102 -124 -6 -281 -77 135 144 244 40
3745D0j86J52j10j31J53J8o2K12k48K15k70J43J78j16j69M35j65J57m7l16L91
3766B74l47J90j53j02J20j20L48P2o20M07l53L67k13O1r7L4Pj18J33J4l6P4p2
3789a30J42p9K20m9q0K25J0l2k97J2R8R1r8R0r5L9J63k02J63p5j94J79N1j03j42
3814i3k4L2n2j36J92j61J2J52k29M18j38M2O7j13M10m17K24r9j24j1J36J24o4
3837A48lr6r5k48L05J26l00K52k43M04n56K13j2R9L9m9mQ2p5J21P3k53J77j10
3861ej03L09m0k61K80j4k1j90K83k75oK67j36mJ91j27m24L99j20n5L5K0o7K5Q2
3886D3j32J81J38m39N3J22K28l09J06k7K49l63L05j34n2JK22k67K9j84K11Ok2
3909c5o0J03K15k10k68K85K8J97j17j89K82m81L31j36J02J10M0k34K32k73M3J1
$$ plain form
3745 40 -146 6 -104 -235 -82 -64 -126 86 -162 53 -217 -74 104 -12 -181 254 89 246 199 -117 274
3766 274 -73 117 -36 -138 -18 -138 210 282 -338 69 -284 83 -130 -69 -166 -132 -125 -243 -110 -96 -132 -58 -130
3789 -130 12 -67 153 104 24 249 259 227 -70 -58 40 131 33 123 28 67 230 28 191 116 -78 101 152 49 -93
3814 -93 -117 -85 -137 -273 -81 -242 -230 -78 -307 111 -27 15 82 -31 379 -38 186 87 -37 -48 88 212 148
3837 148 145 49 -46 -294 11 137 -163 89 -154 250 -306 -93 -105 -6 33 -16 -20 62 -13 108 181 -72 105 -5
3861 -5 -108 201 161 -100 180 166 145 -45 238 -37 -43 224 88 84 275 148 -276 123 3 -52 -17 3 -64 -39 43
3886 43 -89 92 230 -209 -156 -34 194 -115 -9 -36 213 -150 155 21 -31 -30 192 -75 -46 -230 -19 -13 -35
3909 -35 -95 8 223 13 -255 30 58 255 138 -51 231 -250 81 -55 47 157 197 -37 195 -78 -35 -24
3931b4R3j24L7q9K72j83J1j13k92L81J12k04O3J90k77M5J15j63J13K21l11J31
3953DK37m12L39j39j03n6K59j90K22o4J36K4pn79L42k0j06J32M9k03J00L16l39
3976e8j73K5J01m6r5K14J23j05JL5R7r4j79J29J05m9J78j52J18O2n2k30K32r9
4000H8J08rj11k51K88o4J81l61R1k16R0R1j01J78j54O5L6P5q8J35l34M41O2l74
4024a34K46j32Q0j34j02J75K16j57k80K43j75J81P1m3J53n97M82Rj16j36R5j12
4046a67L82l43L8q0J13K50l06n9K18j03J18N7k59L5K65K9j49L9K86k62j45j00
4068a43J0QK23q6j83j52K48J34r6n6j87K21K18n31N88j70q9J23l21K0K92j28M4
4091a3L17l35K3P6P8o1j42O8m0l2k4K09j38N2R3k63K9l04K11J31Q8J17M9L3k07
$$ plain form
3931 -24 69 -55 -18 -107 165 -18 -7 -120 -412 -31 81 -123 -60 130 -147 -102 13 -150 -37 184 -127 4
3953 4 241 -171 168 29 -74 -130 129 -61 161 97 233 257 250 -329 13 -7 -113 19 68 -135 -35 281 -58
3976 -58 -231 -206 -105 -151 -246 -32 91 -14 -13 22 119 25 -154 -25 80 31 209 57 175 237 185 -45 187 88
4000 88 196 187 76 -175 113 49 230 -131 -40 -256 -166 -75 -176 2 -152 -87 -51 24 -64 71 -263 178 240 -134
4024 -134 112 -20 60 -74 -176 -1 215 58 -222 21 -154 27 98 55 208 -389 93 102 -14 -150 -55 -167
4046 -167 215 -128 -90 -170 -57 193 -113 -172 46 -57 61 118 -141 -106 159 188 39 78 364 102 -43 -143
4068 -143 -133 -125 98 12 -171 -323 -75 59 -37 -93 -280 -59 159 -372 216 46 -43 80 -241 -221 71 -57 -13
4091 -13 304 -31 -8 68 146 85 -57 11 -29 -61 -85 124 -14 38 131 -132 -103 -407 -196 -65 23 140 189 222 15
4116A5q7K41l35J28L0M2M9p9OR5N7k33l4J55o6m2K12m0j69o0K87k7j14k62J95
4141c6J73k50J94m3q1k14J44L0k50M26n9O6o3K4J50j19M9J48n01N4K30J51j59
4164F4k09J61m9K67n36L71q5j87K01j51R5K45k12J50j44j00J36J11j61L1K0K66
4186B84l53j96O07m8k08j24J42L0j8k05L9J27j04J15q2J26k89R7k17J99P5K06
4208B03k09j58M13n26L32Q2j66k39K78Q1k7j23K94k51n2J38j09P0N0j68J25q8
4230e0K27m11l3J54K9M2R6j71J8L0O3L2m4j97M62l07k0o8KK29J4j42L0K86j66
4255A05k18J2J7K46m39L44k54J92n4J90j83K99l84J70k11M4K0j0m6J96J50l96
4277b10J33K43j03k47L33o6J05j89J36j32m7J37k29Q8j40R6k9Q2r1P1J14k65K97
$$ plain form
4116 15 -72 169 -166 -38 -8 34 83 4 10 105 162 -71 -105 50 -16 -58 154 114 -55 -115 172 145 31 -231 -36
4141 -36 137 -113 81 38 -43 -257 -113 -83 -333 93 34 100 37 61 211 92 141 289 -212 -158 72 223 64
4164 64 -145 16 -33 234 -302 69 -16 -203 -2 -153 -58 187 -25 125 -19 -119 17 128 -33 -2 18 284
4186 284 -69 -265 342 294 86 -38 104 134 116 -89 -50 77 -27 88 6 132 -157 -60 -277 -78 -3 203
4208 203 -6 -164 249 -277 55 137 -29 -268 10 91 64 -59 235 -16 -68 70 -39 31 81 -87 38 -50
4230 -50 177 -234 -267 -113 -84 -42 54 -117 -99 -69 -6 26 -18 -215 247 -60 -80 -148 -146 83 97 -45 -15 271 105
4255 105 -113 -101 -84 162 -277 67 -187 5 -49 141 -42 257 -127 43 -168 -124 -104 -114 -160 36 186 -210
4277 -210 -77 166 63 -184 149 83 188 -1 135 3 -44 93 -136 -48 -188 -92 -121 -39 -130 -59 55 -210 87
4300H7j3l17n3L78n8Ok31L5j84M75%j85K25j60J87k59O9k3K01J4k91p8J61j2k08
4325b34J75L8p0q7K84j05j27k2J81J03k17J25r3J33m90N20j21rmk80N0J78Q9J29
4349A46j09J78j09r2j67P7L01j65L4K8j90J45l76K75R5k04L8m6J70lm16M11k62
4372b41O3J07K32L1KK16m59q0J22j56N48l04j07J51j10q2P5j73J82k46L29j67
4394f7J7J98q0j06O3j22M4k58L29k28k5M27k37M3J06j72km6J19j35K34k67K25
4417F0j09k8j73J97L83m83j4M8J56J13m06J76j50K11l8k7N0K26l27J22J45n8k36
4440a62K09Rr4Q4J8r2k6J26N9L5P8q8j8l21K86J0q4J0N1l49M14k15j28L71k93
4465a10J86k52o0J64m1K30M5m3j87j0j18M18k41q0K45j51m8J7j6pN8N2J19r8K24
$$ plain form
4300 87 74 -243 -296 82 24 30 -201 -166 -350 125 125 -60 165 5 192 -67 2 -21 180 194 -97 -175 -14 -26 -234
4325 -234 -59 -21 -91 -178 106 1 -126 -148 33 136 -81 44 -49 84 -406 114 -7 -16 -20 -300 -250 -72 17 146
4349 146 37 215 106 14 -153 -76 225 60 94 122 -68 77 -299 -24 71 -133 -95 -141 29 26 -390 21 -241
4372 -241 -178 -71 161 192 194 410 -49 -129 -7 -163 385 81 -26 125 15 -67 8 -165 17 -229 100 -67
4394 -67 -50 148 68 -38 25 -97 -53 -311 18 -210 -235 192 -45 -2 104 -68 -70 -116 3 -132 102 -165 60
4417 60 -49 -77 -250 -53 330 -153 -167 -119 37 150 -256 -80 -230 -19 -57 -84 -34 192 -135 -13 132 74 -162
4440 -162 47 56 -38 46 64 -28 -54 72 131 166 244 156 138 -183 103 113 29 39 90 -259 155 -60 -188 183 -110
4465 -110 76 -176 -236 -72 -113 117 162 119 -68 -78 -196 222 -19 -99 146 -5 -53 -36 -52 -59 -1 51 170 72 296
4490B96m31P6K19j5l00L0J76Q4j84P0Q6k54J8L18l87K50J4J4N6j82P3k49K42R3
4514A13q4k7K8L9j80K29Rl5J00k75P0k31K22j19K69l5k00L5n5j61K36K95m63K94
4538G4N2j26K48k06n2J18j39R0O7q7K13l79K00k04j1L08k64J46k35K76k01J49
4560C7j10o4J59J5J43k83K33J82n14M7N9M2K36q4jj06J73j64M7j22nP3J50k88
4584a45j21K53oj8M7j41P2Q0n5J45L3k36RK19l47K66j50OJ32P6J50k88o4k8j7
4609a28L0J08n0L08k13j72O0r6jn7J83j54M5K66r7j07J57Oj34L73l23L0k07J50
4633b3n0P7p9k2J50j6r8NK8R2j26P8J35k43J33J78j59j21j0K8k01K47L97l31j54
4658h5J02M2P1k86K44j42J3j58M2Q7J65j37r4K75j81q5K24k07J84P6j17k6l69
$$ plain form
4490 296 -135 -59 160 145 -155 -125 51 135 -49 21 107 -147 -129 189 -198 52 66 80 136 -46 27 -222 20 113
4514 113 29 2 30 69 -111 118 127 92 192 -83 -13 -244 -22 -141 128 93 -107 -72 -127 -288 -52 243 -220 74
4538 74 126 0 248 42 -10 108 -31 59 126 39 252 -127 73 -131 -142 166 -98 48 -187 89 -112 37
4560 37 -73 -137 22 37 180 -103 130 312 -202 -155 -96 -54 182 98 97 -9 164 0 47 -75 -80 -7 143 -145
4584 -145 -266 -13 -19 -37 10 -131 -59 21 -34 111 144 -92 -83 136 -211 55 -95 -89 43 119 269 -19 -83 -111 -128
4609 -128 -98 10 -40 268 55 -117 -57 -153 -154 -211 -28 -182 -137 129 32 -75 82 88 -46 327 4 34 -173 -23
4633 -23 -73 4 -75 -97 53 37 -61 -56 -28 64 -62 16 151 -92 41 219 60 -61 -71 -43 -244 3 400 69 -85
4658 -85 17 59 130 -156 88 -54 -41 -199 -157 -70 95 -42 -136 139 -42 -127 97 -110 74 150 33 7 -362
4681c62O52m06J94l2l51M05j18%j50J81J63l8q9p2J43k3j98LM6J5rL2K07j49R2
4706A36k68O7J49K28l72J54k03J65r7j02R1Q0NO0p0j66k9K92l50K16R9k1o8j02
4730a06R7J11q9jR5j87J78j31K64R0k53k36K97r8J32kL2k02Q8k24j72K70j6K97
4754B34l42L8n7K18l06L06r2j52P1J20j12j64K78k95L42K65n02J64R3l4j30K70
4776B13O1l78N54m37o2L95n54J49jj40J92Jk16L18J1j05k47J92N1j78P5K13p5
4799C2J26o5j09j04L24j63k09L97m26K65p6r0M0p5m2J99j6j94P8J32l12J81L99
4822B92l52J34M2k10PJ24J10q8K31n14L11j22J07N1P5j47j33o0J81j37o8K29k06
4845a43J87j45j21K02J2k1m9J9L0P1j08J68j84J37j54K18j65K81m67K72j9J19
$$ plain form
4681 -362 290 -116 78 46 -305 100 -18 -18 -168 13 176 138 49 -23 120 97 -101 -98 -52 -37 -46 -14 193 44 136
4706 136 -132 -65 84 312 -60 94 -109 56 -41 -143 -52 28 33 93 23 -143 -172 120 -230 -14 85 64 -4 -106
4730 -106 -9 102 13 12 107 -80 98 -33 231 321 68 -168 129 31 163 161 193 -9 79 -145 -317 -47 -63 234
4754 234 -108 -70 -127 91 -215 91 -1 -153 -82 38 -74 -238 40 -255 87 352 -150 14 107 73 -57 213
4776 213 274 -104 450 13 -49 346 -208 -59 -60 -200 -8 -7 -223 95 106 1 -246 -54 -3 -181 -106 107 32
4799 32 158 93 -16 -120 204 41 -168 229 -197 68 -8 -98 -58 -133 -175 24 8 -186 -108 24 -288 -107 292
4822 292 -60 74 116 -94 -87 37 147 59 290 -224 87 -35 72 123 198 51 -82 -142 39 -98 -166 63 -143
4845 -143 44 -101 -222 -20 -8 -29 -78 -59 -29 42 -66 102 -82 55 -99 119 -46 235 -232 40 21 140
4867A40j12O8j11J77M9k89L33o1o7L7j06k20J99j87q2K29j5P9j48j8L8k6L3q2
4891a42J0J64j13R7J39j20q4L89k19k19J21mR1K0j00O1k93J11J91R9k19J87j74
4914gJ12Kj34j25J42j8J72L3o3j2k7L9m14L95k52J30J22p3K12j19Q5l07L2lR0
4939A2P2k27J42L0j04Q1p3m0J67q7j21K20o3j3L89j83k04J06j83R8J34j71k1j61
4963b00J99K20k22OP2k05K07j6j51J67J3K0k82K96j68o6J20j64J34l14J79K23
4985F8j62j3J45P6k64L31j84k76j6M64j09k50L40k40j30n2K81M1K3k0R0Qk34j91
5009b74L36k72K41R1k95J62n5K01j48n2l60M20k77K80k26N01m9k11Qn1J40k09
5031i9N2K83k83L63m44K75j46n8R7j72L35l4k05k4J76j54J32J92k84j32J52J16
$$ plain form
4867 140 28 96 -15 162 211 -78 255 194 127 164 58 -162 37 -150 -232 -3 -18 61 -87 -105 -67 -93 -60 -142
4891 -142 -132 32 -81 16 155 35 -49 340 121 -98 23 19 110 130 30 91 -202 -91 100 199 -20 167 -7
4914 -7 105 107 -27 -152 -10 -28 144 177 114 102 75 114 -300 95 -157 -27 95 22 234 115 200 -107 -75 -78 12
4939 12 84 -143 -1 29 -75 6 -67 -107 60 -27 -148 72 9 -4 385 202 -2 104 -79 19 153 -18 -39 -200
4963 -200 -1 219 -3 3 75 -130 77 61 -90 77 90 110 -172 124 -44 -110 10 -154 -20 -334 -155 68
4985 68 -94 -107 38 114 -150 181 -3 -279 -295 169 60 -190 150 -90 -220 -272 9 50 73 53 143 151 -83 -274
5009 -274 62 -210 31 122 -173 -11 -66 135 -13 -65 -425 -5 -282 -2 -228 273 224 13 21 -30 110 -99
5031 -99 -47 236 -47 316 -128 147 1 -57 40 -132 203 169 -36 -60 116 -38 94 286 2 -130 22 138
5053A38P7m12N08j57m3k46P8p5K62k56O1j55M40k69J69kj5J13j93m27M34j77o5
5076b12K19j8j13J61p5m7j3K26j68o9K71k25O1m4m1kj2J33N5p6jK66m37R8Q6j46
5102a23j15j8L02q3j30O3K18l16n3L37j82J68k13j69K84K28j84P5p4r1O0J92K6
5125B02m8j31j11K00p0m5J15J07l19K51J5k37J56l69L42Rj23j15K6M05m74K68
5147E4o6J7Kl6K29j77j45Q3n2L41l29r0K47j94K33k10J04J75k81m6j21M12j82
5170c2j28qK6K44l7k22N2P4o6K75n8q1N2k32K80m09M9J49J44Q0k5%k14j29K43
5195B7P3J4j5k12J19r2J05r3J73k33o4J12L2J31j01pk18J36p1K88k48K82o4l08
5219b34K70j28J7M6N5OJ67k89J40K10l32l34L34L84k94L0J26q3j59K08l33J63
$$ plain form
5053 138 215 -197 311 154 111 -135 -57 -132 130 -126 -65 -220 220 -49 120 118 103 216 23 -404 30 -147 -212
5076 -212 7 -11 -124 37 -38 -85 -98 128 -40 -109 162 -63 -2 -46 -87 -89 -101 32 87 11 10 276 -161 -63 23 -123
5102 -123 -238 -256 46 -37 -167 -104 114 -202 -255 82 -100 68 -145 -314 -30 198 14 89 15 -76 -16 176 202
5125 202 154 23 -88 112 42 -3 112 219 -100 151 166 -71 85 -284 58 67 -56 -171 -145 260 -214 54
5147 54 -12 5 7 -29 200 23 -122 -39 -91 250 -79 -169 78 -116 117 -93 11 186 -95 -141 -262 150 -32
5170 -32 -160 -168 -142 102 65 -157 -105 -31 -97 178 120 39 91 -141 139 -270 -221 -72 72 152 127 127 -87 -216 27
5195 27 100 114 99 -113 6 -86 19 -74 99 -134 -198 -86 -54 77 -24 -31 -249 -113 -184 104 -144 138 74 -234
5219 -234 36 -92 -75 -29 26 32 199 -90 50 260 -72 -406 -72 312 18 48 174 91 -68 140 -193 -30
5241c0J31j72J15j71j1K05K02l59K19r5K6Q8j2j23M5O6n1J53j25j14J16rj94K95
5265A95l99J98r4N4J0Q8j33K33q1P2J13l15M0p5J51q0j87K53K30j91P1q6J12j3
5289A66k02j1mN3R7n8j25N6M1J38j21k07J4N0L16j52j4Q4n3j85K5J16m6k97L08
5314a1q9J58j79R1J42n8j16k9R2Q7k35QJ73j7j54K4K17J78k58j50R2J33j01r7
5338i9J32l12K40J00o1j27rK07k28Q3q2n2K02k1N4K43l88J66J22l8J77J46m89
5361c4Q6J57j73p4k28J26K35O3M1m97K41k42K32q4J19q0K12J97m48k8K66n4J2
5384D5J61j76k54K3N19k45OR1l16J32n2Nj24J44p4L6J80k42K9n8j8P1J43q7j54
5409b15K78o3J95l44R2J50j20M0l5j47Q2J41j36j03L35k34J8M2k1R0r1J32p6J77
$$ plain form
5241 -30 101 -71 44 -127 -138 67 269 -90 129 34 60 148 136 13 58 124 73 226 101 -13 103 94 -100 195
5265 195 -204 -6 -100 -46 -36 52 -81 152 71 143 256 -59 -19 -94 57 -23 -210 43 273 82 153 67 179 166
5289 166 -36 -47 -51 2 99 41 -84 -28 13 151 30 -177 -163 -113 203 51 37 121 68 -117 -92 24 -22 -319 -11
5314 -11 -100 58 -121 -30 112 54 -62 -91 1 88 -147 -139 34 17 -137 -113 104 282 24 -126 -34 99 -2 -99
5338 -99 33 -279 -39 61 0 -127 -136 71 -157 -74 -156 -208 -6 -27 27 270 -118 48 170 132 309 455 -34
5361 -34 52 209 36 -38 -266 -140 95 158 199 -298 -57 -299 -67 -151 -32 -112 100 297 -151 -179 87 33 45
5384 45 206 30 -224 -201 318 73 79 170 -146 -14 -66 -61 -185 -41 -115 -79 101 -141 -112 -170 -188 -117 26 -61 -215
5409 -215 63 0 195 -149 -57 93 -27 13 -22 -169 -87 54 -82 -185 150 -84 -66 -24 -45 45 -46 86 10 187
5433A87j38p2l6J96j91N7L9K82j78k02R1l2J00NO9J2J69k83rj1k21J37R2j93K05
5458G5k26J33J11R2r1k64o3L09m2n8Q1m26L32Q6J25m34K86K0j24K50l93J01K47
5481A27l07J63L49m05J46j9k0O1j64N2M9K37k56J27j77j23J29N1M5k84M61k57
5503a5N8O6j56N4N2P0l2k0k69M6K61J28k89l4j60K96j96J31M9P8k19p9J82r4m3
5528a35QJ62J35m76j12L23M6n0J1Q1n7O6J41L0k31J49l56K13j6o1J54p7L8J74
5552A60j37n2n4K39k88J69R6Lq9n4j94J75O6j19k7J64J10j88R6j08j5J73j42J29
5576A13k30j8L19L6k48j66J68q4l3P9j20K96j73R2P4k68M3J99k35Q0M93p59K02
5599a40P4J09l17P3K47p9J13j97J26O0p6j31L18k89K40j18o3J12M1K9k13J07j29
$$ plain form
5433 187 49 -23 -59 137 -54 3 42 324 146 -56 35 3 103 108 177 189 358 75 66 55 -166 -29 63 -130 75
5458 75 -151 -18 93 185 94 -170 -233 76 34 -24 57 -369 -37 49 174 -260 26 46 -78 172 -221 -120 127
5481 127 -180 -17 332 -73 73 54 34 95 -69 -17 32 269 13 140 -37 -160 -31 20 65 -219 242 -15
5503 -15 43 109 -47 7 59 129 97 77 -192 -146 115 243 -46 -80 -240 56 -140 -9 40 118 -101 -180 2 -92 -135
5528 -135 -127 35 170 -306 -418 -95 -49 -99 -88 -7 -64 2 143 173 -58 91 -265 -52 -68 -129 25 -52 -14 160
5552 160 23 -29 -83 156 -132 37 133 136 47 -7 -201 -26 40 -79 -106 58 168 -20 76 -32 -47 126 -16 113
5576 113 -117 -135 184 220 -28 -194 -26 -110 -143 -64 -184 112 -61 31 105 -163 -120 79 -156 -76 417 -342 -140
5599 -140 -66 43 -274 -201 46 -33 80 -117 9 69 -7 -138 180 -109 131 13 -50 62 103 132 -81 26 -103
5622a03j66K3K44P3j39j50L00r4m5J2Q1Jj36J43j93J55J05l5j44nJ42o9%J36J4
5647A50m0J28k44J22r0j41P1Q2q1k29M65j16lj01J28j40r9J86j51k74M96p8j42
5670a01L13j35p0p1J19k25O16k37j96J92j60J58j71J48l20K14J32n31M09m5k65
5691b26N6J47RL3q5P7J74k98N6L3K01m9q3J8m01K55J04j51j76K97O2M6k37J80
5715D2k97J77J68O2l73K3J37j01J47K00k1j76Jq0m8K09p4q3j21K68J01j28m1J67
5739A59m3Q9l55J53j92K38j65KK5K13l5n6M9m2p6J4m5j97L41m4K17k55k31n7K50
5764d3j51M59m50J15J1L55l43Q2pJ77l48K34j16r6J66J36j14j70k7K57q4N3j41
5787d5j14K23j10q5K18q9n9K20m95K15P1j00O7J3J76k53L6K81l02J80R6m1L0j6
$$ plain form
5622 -103 -269 -246 -2 71 -68 -218 82 -12 -57 -45 36 37 -99 44 -149 6 111 76 -68 -73 69 0 0 136 150
5647 150 110 238 -6 116 26 -115 -44 38 -43 -272 193 77 74 -27 101 -39 -138 48 -103 -377 119 41 -101
5670 -101 212 77 7 -64 55 -170 446 209 13 205 45 203 32 180 -140 74 206 -325 84 39 -226
5691 -226 -170 -23 -14 19 -66 11 185 -113 -57 -24 177 128 45 63 -338 -83 21 -130 -306 -9 53 99 -138 42
5715 42 -255 -78 90 152 -221 -198 -61 -162 -15 185 164 -12 -11 -91 -139 70 -4 -87 -208 60 161 33 -8 159
5739 159 116 205 -150 3 -189 49 -116 -114 -89 124 89 33 82 40 -36 -22 -67 -264 77 33 250 -5 -236 -293 -43
5764 -43 -194 265 -185 -70 -59 296 -47 35 28 205 -143 91 -25 -121 45 181 67 -103 -130 127 43 96 -45
5787 -45 -159 64 -46 -131 87 -2 -61 159 -336 -121 -50 -150 -83 -70 106 -147 -111 170 -132 48 144 103 133 117
5811A17j30j30m6J05j31L31j59J44k18K74j09j44Q5k7m1j18j63J77l4J83l4o0
5833a28J16L4O8j88l9k5K92k66K27p5J00k63j8N7m2R3j21Q9J1K99j27j49k9J30
5857D6J83j04k84j63L60j6l06L84j10j30J20m5K57j85Q4J38p9k97J92j75O8L08
5879B46om37K54O0k43k2K64j73K12j56m6J78j76J29N4k03m0J73M2l5j79K25k54
5902a33K02j19j2R5m1J19K25k33j27q2J41J53k9j24j85Q9j99K38J43j34p2J9Q3
5925A7k18l8L31R7j80K6K43m79K14j49oM4K60l72K18O2k5J8j20n0J26j16R1j24
5949a30J13n0J59k19p5K59J35o5k86J01k07R7K55o6J35k24J20O5J2l0k0l1J14
5972A62j99o1L9J40k0k16J34l0o5j11n7K62K9K95j3l19l04M38j16kJ41j81J03
$$ plain form
5811 117 -13 -143 -189 -84 -215 116 -43 101 -117 157 48 -96 -11 -38 -79 -197 -360 -183 -217 -34 -68 -128
5833 -128 -12 22 90 -98 -137 -162 130 -136 91 16 116 -147 -165 -108 -150 -57 -178 -89 -78 221 94 -55 -84 46
5857 46 229 125 -159 -322 38 22 -284 100 -10 -140 -20 -65 192 7 91 229 150 -147 45 -130 -62 246
5879 246 240 -197 57 117 -126 -148 116 -57 155 -1 -47 131 -45 84 138 -65 -105 68 110 75 -104 121 -133
5902 -133 69 -50 -62 33 -8 111 336 103 -24 -106 35 188 159 35 -150 -61 -260 -22 121 -13 -85 -66 17
5925 17 -201 -239 92 189 9 35 278 -201 13 -136 -142 -98 162 -210 8 70 45 63 -57 -107 19 -97 -6 -130
5949 -130 -17 -67 92 -127 -202 57 192 127 -159 -58 -265 -168 87 21 156 -68 52 117 129 99 79 48 162
5972 162 -37 -98 -59 81 61 -155 -21 -51 -116 -227 -284 -22 7 302 289 -30 -334 104 -12 -14 127 -54 49
5995D9j16j11RK1N24j43j99l5J03J08l31J66q0N1j10O5j2k36K44k5J4J56k83O8
6019a03J82l12M01j58NJ3mL4qP0k21P7j24J00J18K4j66J57j71K76m82M70j08l27
6043b57J54o0Q2M0r3L56m61K90NMj49P8J14k08K70j52j20k3J02r3J62n4J16k5
6067G8o9MJ05n3j1MN1p0o8M2j85L1L94l27J60k22J11N2K03j59k27K34j04J67k16
$$ plain form
5995 49 -67 -178 -169 -148 376 233 34 -1 102 210 -121 45 -35 16 -94 -29 -41 -277 -33 -58 -44 112 -171 -103
6019 -103 79 -233 168 10 15 28 24 58 50 120 -101 -24 -148 -48 70 94 -72 85 -86 190 -292 178 70 -257
6043 -257 -103 -163 -81 -41 -134 222 -239 51 56 60 -89 -11 103 -105 165 13 -107 -130 -28 -121 41 -13 103 78
6067 78 9 13 118 65 54 58 109 39 -29 13 -172 -141 253 -74 86 -136 -25 27 230 71 -156 78 -26 141 -75
$$ [...]
8191H6
##END NTUPLES=NMR FID
##END=
