##TITLE=1H_Pr 53+
 200.13MHz,CDCl3,
 8 sc
 
 1.7.2025
##JCAMPDX= 6.0         $$ Bruker NMR JCAMP-DX V2.0
##DATA TYPE= NMR FID
##DATA CLASS= NTUPLES
##ORIGIN= UXNMR, Bruker Analytische Messtechnik GmbH
##OWNER= pz
$$ XWIN-NMR		Version 3.5
$$ Tue Jul  1 16:00:52 2025 Russian Standard Time (UT+4h)  she@DPX200
##.OBSERVE FREQUENCY= 200.1313
##.OBSERVE NUCLEUS= ^1H
##.DELAY= (6, 6)
##.ACQUISITION MODE= SIMULTANEOUS
##.ACQUISITION SCHEME= undefined
##.AVERAGES= 8
##.DIGITISER RES= 18
##SPECTROMETER/DATA SYSTEM= spect
##.PULSE SEQUENCE= zg30
##.SOLVENT NAME= CDCl3
##.SHIFT REFERENCE= (INTERNAL, CDCl3, 0, 14.3821)
##AUDIT TRAIL= $$ (NUMBER, WHEN, WHO, WHERE, WHAT)
$$ ##TITLE= Audit trail, XWIN-NMR		Version 3.5
$$ ##JCAMPDX= 5.01
$$ ##ORIGIN= Bruker BioSpin GmbH
$$ ##OWNER= she
$$ F:/spectra/data/she/nmr/H-C/1/audita.txt
$$ ##AUDIT TRAIL=  $$ (NUMBER, WHEN, WHO, WHERE, WHAT)
(   1,<2025-07-01 15:59:33.75 +0400>,<she>,<DPX200>,
      <created by zg, POWCHK disabled, PULCHK disabled
       configuration hash MD5:
       00 E9 B6 7A A2 85 ED C7 34 08 36 98 17 FE 4E 26
       data hash MD5: 16K
       BE E6 BB 7A 9A BF 4B 7D 1D A3 38 EF D3 A3 C8 A2>)
$$ ##END=
$$ 
$$ hash MD5
$$ 31 E0 50 3E E0 31 0E 59 30 97 51 F8 C3 1E C9 F3
##$RELAX= 
##$RELAX= 
##$RELAX= 
##$RELAX= 
##$RELAX= 
##$RELAX= 
$$ Bruker specific parameters
$$ --------------------------
##$DU= <F:/spectra>
##$EXPNO= 1
##$NAME= <H-C>
##$PROCNO= 1
##$TYPE= <nmr>
##$USER= <she>
##$AMP= (0..31)
100 100 100 100 100 100 100 100 100 100 100 100 100 100 100 100 100 100 
100 100 100 100 100 100 100 100 100 100 100 100 100 100 
##$AQSEQ= 0
##$AQ_mod= 1
##$AUNM= <au_zg>
##$AUTOPOS= <>
##$BF1= 200.13
##$BF2= 200.13
##$BF3= 200.13
##$BF4= 200.13
##$BF5= 200.13
##$BF6= 200.13
##$BF7= 200.13
##$BF8= 200.13
##$BYTORDA= 1
##$CFDGTYP= 0
##$CFRGTYP= 5
##$CHEMSTR= <none>
##$CNST= (0..31)
1 1 145 1 1 1 1 1 1 1 1 1 1 1 1 1 1 1 1 1 1 1 1 1 1 1 1 1 1 1 1 1 
##$CPDPRG= <>
##$CPDPRG1= <>
##$CPDPRG2= <>
##$CPDPRG3= <>
##$CPDPRG4= <mlev>
##$CPDPRG5= <mlev>
##$CPDPRG6= <mlev>
##$CPDPRG7= <mlev>
##$CPDPRG8= <mlev>
##$CPDPRGB= <>
##$CPDPRGT= <>
##$D= (0..31)
0 0.7 0 0 0 0 0 0 0 0 0 0.03 0 0 0 0 0 0 0 0 0 0 0 0 0 0 0 0 0 0 0 0 
##$DATE= 1751371173
##$DBL= (0..7)
120 120 120 120 120 120 120 120 
##$DBP= (0..7)
150 150 150 150 150 150 150 150 
##$DBP07= 0
##$DBPNAM0= <>
##$DBPNAM1= <>
##$DBPNAM2= <>
##$DBPNAM3= <>
##$DBPNAM4= <>
##$DBPNAM5= <>
##$DBPNAM6= <>
##$DBPNAM7= <>
##$DBPOAL= (0..7)
0.5 0.5 0.5 0.5 0.5 0.5 0.5 0.5 
##$DBPOFFS= (0..7)
0 0 0 0 0 0 0 0 
##$DE= 6
##$DECBNUC= <off>
##$DECIM= 32
##$DECNUC= <off>
##$DECSTAT= 4
##$DIGMOD= 1
##$DIGTYP= 9
##$DL= (0..7)
0 120 120 120 120 120 120 120 
##$DP= (0..7)
150 150 150 150 150 150 150 150 
##$DP07= 0
##$DPNAME0= <>
##$DPNAME1= <>
##$DPNAME2= <>
##$DPNAME3= <>
##$DPNAME4= <>
##$DPNAME5= <>
##$DPNAME6= <>
##$DPNAME7= <>
##$DPOAL= (0..7)
0.5 0.5 0.5 0.5 0.5 0.5 0.5 0.5 
##$DPOFFS= (0..7)
0 0 0 0 0 0 0 0 
##$DQDMODE= 0
##$DR= 18
##$DS= 0
##$DSLIST= <SSSSSSSSSSSSSSS>
$$ [...]
##$SUBNAM0= <"">
##$SUBNAM1= <"">
##$SUBNAM2= <"">
##$SUBNAM3= <"">
##$SUBNAM4= <"">
##$SUBNAM5= <"">
##$SUBNAM6= <"">
##$SUBNAM7= <"">
##$SUBNAM8= <"">
##$SUBNAM9= <"">
##$SW= 18.0517328524113
##$SWIBOX= (0..15)
0 0 2 0 0 0 0 0 0 0 0 0 0 0 0 0 
##$SW_h= 3612.71676300578
##$TD= 16384
##$TD0= 1
##$TE= 0
##$TE2= 300
##$TE3= 300
##$TEG= 300
##$TL= (0..7)
0 120 120 120 120 120 120 120 
##$TP= (0..7)
150 150 150 150 150 150 150 150 
##$TP07= 0
##$TPNAME0= <>
##$TPNAME1= <>
##$TPNAME2= <>
##$TPNAME3= <>
##$TPNAME4= <>
##$TPNAME5= <>
##$TPNAME6= <>
##$TPNAME7= <>
##$TPOAL= (0..7)
0.5 0.5 0.5 0.5 0.5 0.5 0.5 0.5 
##$TPOFFS= (0..7)
0 0 0 0 0 0 0 0 
##$TUNHIN= 0
##$TUNHOUT= 0
##$TUNXOUT= 0
##$USERA1= <user>
##$USERA2= <user>
##$USERA3= <user>
##$USERA4= <user>
##$USERA5= <user>
##$V9= 5
##$VALIST= <valist>
##$VCLIST= <CCCCCCCCCCCCCCC>
##$VD= 0
##$VDLIST= <DDDDDDDDDDDDDDD>
##$VPLIST= <PPPPPPPPPPPPPPP>
##$VTLIST= <TTTTTTTTTTTTTTT>
##$WBST= 1024
##$WBSW= 4
##$XGAIN= (0..3)
0 0 0 0 
##$XL= 0
##$YL= 0
##$YMAX_a= 526496
##$YMIN_a= -573016
##$ZGOPTNS= <>
##$ZL1= 120
##$ZL2= 120
##$ZL3= 120
##$ZL4= 120
##$ABSF1= 10
##$ABSF2= 0
##$ABSG= 5
##$ABSL= 3
##$ALPHA= 0
##$AQORDER= 0
##$ASSFAC= 0
##$ASSFACI= 0
##$ASSFACX= 0
##$ASSWID= 0
##$AUNMP= <proc_1d>
##$AZFE= 0.1
##$AZFW= 0.1
##$BCFW= 1
##$BC_mod= 2
##$BYTORDP= 1
##$COROFFS= 0
##$CY= -3
##$DATMOD= 1
##$DC= 2
##$DFILT= <>
##$DTYPP= 0
##$F1P= 0
##$F2P= 0
##$FCOR= 0.5
##$FTSIZE= 0
##$FT_mod= 4
##$GAMMA= 1
##$GB= 0.15
##$INTBC= 1
##$INTSCL= 1
##$ISEN= 128
##$LB= 0.25
##$LEV0= 0
##$LPBIN= 0
##$MAXI= 10000
##$MC2= 0
##$MEAN= 0
##$ME_mod= 0
##$MI= 1.114404
##$NCOEF= 0
##$NC_proc= 0
##$NLEV= 6
##$NOISF1= 3.799351
##$NOISF2= 2.8
##$NSP= 1
##$NTH_PI= 0
##$NZP= 0
##$OFFSET= 14.38212
##$PC= 1
##$PHC0= -1206.412
##$PHC1= 20.1922
##$PH_mod= 1
##$PKNL= yes
##$PPARMOD= 0
##$PSCAL= 0
##$PSIGN= 0
##$REVERSE= no
##$SF= 200.129724274929
##$SI= 16384
##$SIGF1= 3
##$SIGF2= 2
##$SINO= 400
##$SIOLD= 16384
##$SREGLST= <1H.CDCl3>
##$SSB= 0
##$STSI= 0
##$STSR= 0
##$SW_p= 3205.1282051282
##$SYMM= 0
##$S_DEV= 0
##$TDeff= 0
##$TDoff= 0
##$TI= <>
##$TILT= no
##$TM1= 0
##$TM2= 0
##$TOPLEV= 0
##$USERP1= <user>
##$USERP2= <user>
##$USERP3= <user>
##$USERP4= <user>
##$USERP5= <user>
##$WDW= 1
##$XDIM= 8192
##$YMAX_p= 0
##$YMIN_p= 0
$$ End of Bruker specific parameters
$$ ---------------------------------
##NTUPLES= NMR FID
##VAR_NAME=  TIME,          FID/REAL,        FID/IMAG
##SYMBOL=    X,             R,               I
##VAR_TYPE=  INDEPENDENT,   DEPENDENT,       DEPENDENT
##VAR_FORM=  AFFN,          ASDF,            ASDF
##VAR_DIM=   8192,          8192,            8192
##UNITS=     SECONDS,       ARBITRARY UNITS, ARBITRARY UNITS
##FACTOR=    0.0002768,     1,               1
##FIRST=     0,             0,               0
##LAST=      2.2672688,     0,               0
##MIN=       0,             -573016,         0
##MAX=       2.2672688,     526496,          0
$$ Real data points
##PAGE= N=1
##DATA TABLE= (X++(R..R)), XYDATA
0 0 0 0 0 0 0 0 0 0 0 0 0 0 8 -8 8 -8 16 -16 16 -24 24 -32 40 -45 51 -60 71 -80 92 -107 119 -135 155 -173
34 -173 195 -219 247 -274 306 -341 379 -420 466 -515 569 -628 693 -763 840 -924 1019 -1123
52 -1123 1239 -1368 1514 -1681 1872 -2093 2353 -2665 3046 -3521 4136 -4965 6144 -7939 10990
67 10990 -17138 34251 -181996 -573016 25735 416685 112326 -280540 -202010 108656 154912
78 154912 32661 43109 -85816 -173980 91383 260263 8123 -282648 -188863 223488 257515
89 257515 -155732 -237303 40925 145689 82499 -31141 -94275 -39271 29074 108389 69343
100 69343 -165772 -137860 141066 130629 -65557 -94775 9749 77553 -44 -26734 56149
111 56149 -42554 -120094 65886 119267 -51805 -124578 -18617 128102 62473 -109136 -16180
122 -16180 94643 -24432 -46644 58275 42888 -77442 -112953 73436 165371 -86975 -180693
133 -180693 62492 148909 4994 -98834 -46360 75145 35427 -47509 13868 -3683 -67073
144 -67073 26918 77186 2608 -58910 -45724 68112 82847 -60235 -63834 26175 16089 2914
156 2914 -9541 -27542 -4587 -10309 22142 58635 -40284 -54513 62013 42669 -34169 -27041
168 -27041 8146 30851 -22329 -44091 48356 27324 -63475 -10575 45179 23899 -12356 -46146
180 -46146 5807 42275 -23830 -12241 19579 -33461 -14014 43313 32506 -11656 -62466 1531
192 1531 104026 8853 -92745 -19805 40832 32347 -12727 -53503 -6767 21425 6076 34747
204 34747 -7661 -62953 13685 61025 17398 -32623 -60428 14089 75770 -8189 -50765 -9847
216 -9847 8947 37169 19508 -33265 -20484 -4940 20842 45031 -37795 -68525 26728 48986
228 48986 2447 -31041 -31345 33954 41437 -19811 -5827 2223 -15525 21429 13070 -23105 -12568
241 -12568 -12740 15063 31445 -30351 -25112 26308 10931 793 -9278 -16300 19848 2922 -18740
254 -18740 19103 -3553 -21871 22275 11914 -7597 -1922 -8477 17407 9238 -31541 3516 14522
267 14522 -19023 -121 1695 -6212 11994 -9268 -2623 25917 -8693 -9300 16020 -3829 1221
280 1221 532 -13950 12694 -347 -17835 18373 262 -19803 13497 5703 -5452 -1608 -13737
293 -13737 12234 12824 -25662 921 14942 -7445 9186 1234 -8795 16021 -1433 -4853 13430
306 13430 -15566 -8495 15909 -7506 -5898 -4080 -10587 19798 3459 -22458 12361 8067 -7278
319 -7278 10668 -5554 -6071 9317 -6167 6311 5936 -20825 8586 16312 -12507 452 -1853
332 -1853 -4932 14840 -9455 -14732 11994 -4372 -3502 8310 -9675 4907 9216 -7428 11313
345 11313 1141 -13929 15789 4147 -15609 3952 -2148 -668 6275 -14485 993 11310 -11295
358 -11295 4965 5445 -13542 7874 4796 -7286 7756 -6285 -4786 16352 -3794 -5477 7090
371 7090 -5714 7394 5905 -15327 4327 1777 -11730 9953 -1571 -14416 6342 1275 2478
384 2478 7596 -13024 2116 14703 -5418 3584 1214 -13454 9934 6770 -9050 2273 -7243
397 -7243 -3514 15804 -3925 -8703 751 -7111 10152 9315 -17367 -2799 5025 224 14478 -4729
411 -4729 -16373 10602 9668 2961 1070 -16728 811 14753 -5949 -1437 -4218 -14956 11133
424 11133 11583 -8208 -2812 -8839 2623 23213 -3818 -15554 101 2305 15819 5039 -22260
437 -22260 -748 11413 457 8282 -6856 -16766 6871 6492 3611 206 -22190 -3314 21467
450 21467 3107 -4759 -10817 -9503 23650 15106 -16521 -7004 79 7622 14643 -10228 -12591 2671
464 2671 -3087 9906 8261 -19035 -7790 7140 6447 12984 -12118 -21959 13049 17140 1112 -7369
478 -7369 -16399 8517 20746 -7172 -4951 472 -9263 8206 9033 -5936 -4004 -13988 -1659 24641
492 24641 -543 -20916 -6580 5699 22627 6046 -27248 -3443 16860 5038 4586 -8826
504 -8826 -13821 8005 6267 4990 2755 -22248 -7410 21280 8165 -4839 -17921 -15364 24843
517 24843 19830 -17802 -15639 -1935 15473 21074 -12824 -16852 6163 5097 10759 3874 -19126
530 -19126 -5439 6083 4734 12182 -11892 -24422 9600 19221 5654 -11376 -23079 10399 27916
543 27916 -6670 -13279 -1775 -291 13101 4210 -8815 148 -7879 -1632 20330 -433 -18343
556 -18343 -8817 2332 21838 4785 -29911 -6234 18545 8790 2583 -13105 -10570 14693 8565
569 8565 760 -925 -16108 -763 17787 2020 -4537 -12394 -12473 18912 16192 -14239 -14844 -5228
583 -5228 15012 21005 -15091 -20325 7607 11524 9825 -3803 -18159 4418 12239 71 4208
596 4208 -8175 -13621 8271 10492 1548 -8796 -19389 8537 23162 -8226 -13988 -981 4695
609 4695 14008 -1361 -12833 4272 1947 164 9015 -5356 -7971 2021 -296 8340 1965 -17123
623 -17123 69 9880 -745 1037 -7224 -6496 10660 2369 -3208 2535 -6592 2720 9943 -4159
637 -4159 636 535 -8435 6323 6809 -6015 -3481 -6093 1906 13218 -6593 -10634 3845 1967
651 1967 6267 1654 -11523 2364 7017 -2243 5257 -1777 -8260 5331 3793 1277 242 -11825
665 -11825 1012 12278 -4669 -5539 -1548 -4167 8025 3215 -8362 1400 206 1247 9730 -5001
679 -5001 -5397 5777 -693 3572 3133 -10103 680 5745 -3065 2543 -3551 -6840 6889 608 -2968
694 -2968 2683 -6258 1318 8368 -4999 -132 3764 -4953 5333 4185 -5369 1943 -1705 -1370 7230
709 7230 -5230 -5624 4608 -3081 1066 3189 -8313 1437 4667 -3307 4292 -724 -5326 7166
723 7166 1116 -2246 3705 -5136 934 7518 -5905 -1199 2688 -5195 4119 1585 -7261 1999 -513
738 -513 -1082 5796 -5931 -3099 8066 -2388 189 3473 -6164 3793 5098 -5467 2008 -388 -3356
753 -3356 6103 -3340 -5699 4095 -3209 -147 3979 -7267 1269 5548 -4924 2778 1152 -4094 6173
768 6173 172 -3285 4601 -3275 -146 6833 -6373 -2311 4364 -4099 1927 589 -6994 4218 1110
783 1110 -4419 3984 -2799 -1692 7394 -3271 -1307 5092 -3871 2916 3735 -6742 2256 2385 -4185
798 -4185 3600 -2610 -4269 5902 -3514 -2500 4536 -5251 1056 4921 -5304 2032 3053 -3797 4807
813 4807 380 -4130 5353 -1505 -1685 5158 -5034 -1385 4859 -4974 129 1858 -5459 3473 1398
828 1398 -4700 4047 -665 -2203 6480 -3005 -1640 5429 -3334 1324 4245 -6039 1529 2808 -4452
843 -4452 2975 -1063 -4500 4397 -2075 -2449 4251 -5186 -452 6229 -3807 64 2507 -3547 5381
858 5381 2024 -5265 3318 -354 -2017 5244 -3939 -3411 3846 -3329 1124 2322 -7372 1547 4053
873 4053 -3026 2307 -1617 -3269 6593 -91 -2183 3774 -4373 854 7169 -4084 -2139 1065 -2661
888 -2661 4371 -129 -6760 2826 -316 -2100 5244 -3368 -3785 4303 -920 3194 2363 -7656 2615
903 2615 6744 -2631 339 -2110 -1988 6110 -1968 -3718 3379 -4774 -1073 6570 -3042 -2321 12 -2287
919 -2287 7123 1783 -7597 2262 2640 704 4584 -4979 -3403 6005 -815 505 1379 -7358 1735 4422
935 4422 -3371 729 -2746 -4103 6243 1094 -2283 1195 -4885 2386 9801 -4535 -5199 2347 1219
950 1219 5492 -2410 -7731 4650 1356 -3501 3601 -2697 -4374 2053 -1147 3951 1564 -10573 1348
965 1348 9997 -1270 -2623 -3694 1219 9702 -2649 -6188 4532 -1220 -1020 4434 -3369 -1668 -697
980 -697 -3618 6605 1664 -9056 402 2858 1654 4031 -6565 -3228 8278 522 -589 -107 -5306
995 -5306 4339 5175 -5175 366 -811 -3681 4130 -731 -2146 1906 -6806 908 9960 -3798 -6204
1010 -6204 1246 3103 7032 -3425 -8896 6733 4250 -4270 1214 -1290 -822 1639 -3856 3496 3228
1025 3228 -10479 -850 8031 34 -3058 -5489 838 10911 -2350 -7213 4732 675 49 3237
1039 3237 -3459 260 1211 -3850 5171 1274 -7629 861 1462 53 3153 -5982 -3173 6504 -16
1054 -16 -11 211 -5033 4861 5229 -4794 -128 106 -713 4354 -2965 -2290 3925 -4723 -1543 6394 -2478
1071 -2478 -4094 -946 253 6720 -2284 -8395 5805 4805 -2676 694 -1373 1110 3235 -4339 1736
1086 1736 3793 -6725 -542 5099 -1075 -1554 -4419 -843 7572 -2956 -5828 4252 276 -328 2823
1101 2823 -2595 568 1490 -1941 4508 474 -5927 2711 2093 -1997 1455 -3126 -1028 3532 -2892
1116 -2892 30 2184 -4789 2002 4345 -2588 137 -564 42 5198 -2729 -2973 5158 -1353 -2325 2853
1132 2853 -1326 -753 -5 -2503 4163 -377 -6496 3306 2398 -2725 991 -1414 968 3315 -3473 915
1148 915 4105 -4090 -68 3606 -1352 357 -1777 -990 4509 -2827 -4299 4312 -987 -2629 2049
1163 2049 -1422 895 671 -2816 4286 1484 -4946 2791 2011 -2002 1270 -1702 -346 2924 -3838
1178 -3838 -385 3428 -3935 -598 2417 -2073 783 -1018 -1511 4653 -1391 -2811 4625 -502 -1809
1193 -1809 2832 -1113 681 661 -3022 2992 900 -4940 2285 1484 -3185 796 -994 -56 2891 -3327
1209 -3327 175 4584 -3100 -304 3063 -1250 1157 -671 -1558 4744 -1624 -3639 4302 -739 -2717
1224 -2717 1345 -1585 796 637 -3951 2904 1548 -4168 2509 1492 -1918 2276 -1179 -59 3219
1239 3219 -3220 -248 3747 -3007 -481 1583 -2185 1141 -1013 -2552 3741 -1585 -3272 3760 -780
1254 -780 -1747 2288 -1084 1096 1139 -2874 2993 1767 -3965 2226 1068 -1929 1393 -1600 -680 2624
1270 2624 -3395 -552 3144 -2744 -175 1749 -1614 1987 -281 -1907 4125 -786 -2614 3502 -461
1285 -461 -1237 1772 -1584 1133 632 -3927 2066 1368 -3767 1500 769 -1708 1933 -1554 -272 3444
1301 3444 -2246 73 3181 -1852 326 1203 -1139 1975 -233 -2483 2988 -993 -2791 2333 -1271
1316 -1271 -1008 1673 -2005 412 1383 -2554 2218 1277 -2747 2047 841 -1295 2052 -1229 -882 2657
1332 2657 -2285 -487 2072 -2518 211 1066 -2009 1176 -661 -1813 3292 -453 -2188 2549 -370
1347 -370 -34 1966 -1692 996 1478 -2257 1765 761 -3145 1200 117 -1538 1487 -1744 -1301 2487
1363 2487 -1904 -663 1619 -1834 1060 1711 -1780 1783 236 -1683 2786 -392 -1879 1853 -923
1378 -923 -610 1680 -2075 -202 1054 -2246 1322 713 -2641 1600 565 -1309 1907 -1002 -667 3258
1394 3258 -868 -350 1504 -1689 867 1245 -2382 702 -145 -2119 1904 -433 -2193 1391 -760 260
1410 260 2275 -2080 -218 2165 -1023 1462 404 -1908 2370 760 -1777 1825 -841 -1165 1795
1425 1795 -1647 -449 1155 -2494 688 1905 -2000 655 357 -1012 2811 -610 -2026 2256 -143
1440 -143 -401 1690 -1883 237 1503 -2096 813 721 -2709 1198 134 -1236 1802 -1664 -1244 3081
1456 3081 -444 -885 975 -1022 2108 1392 -2825 1181 1238 -1638 1218 -394 -1170 1275 -2213 -128
1472 -128 2565 -2568 -1242 1813 -278 1495 -439 -2268 3331 1071 -1986 1212 59 -229 1673
1487 1673 -1674 19 1367 -2465 622 1338 -2215 254 -685 -1231 2980 -724 -2184 2140 205 146
1503 146 1132 -2015 881 2104 -1984 652 881 -1556 1228 -529 -1476 2030 -1657 -1702 2389 -549
1519 -549 -685 142 -1500 2321 1444 -2808 1345 1711 -885 1146 -890 -441 2176 -1890 -440 2096
1535 2096 -1842 -757 842 -846 1372 -1019 -2697 2730 748 -1938 817 -157 13 1952 -1320
1550 -1320 471 1613 -1681 729 1334 -1796 787 -369 -1279 1533 -712 -1622 1366 -680 -161 1207
1566 1207 -1990 648 1854 -1326 743 363 -1053 2140 -282 -1431 1804 -816 -1411 1674 -768
1581 -768 -257 405 -2230 1399 963 -2567 918 1077 -758 893 -571 -196 2082 -1131 -426 2318 -1526
1598 -1526 -418 1123 -701 936 -569 -1923 2035 176 -2141 882 -174 -356 1064 -1013 238
1613 238 1391 -1734 1324 1448 -1385 728 766 -832 1419 -660 -1276 1544 -1141 -525 1165 -1461
1629 -1461 -180 1126 -1272 591 177 -1064 1707 199 -1344 1328 -59 -791 1276 -650 70 740
1645 740 -1587 1009 1092 -2177 299 534 -891 526 -993 -370 1814 -1207 -680 1982 -1062 -329 935
1662 935 -754 1170 -136 -1715 1875 -100 -1975 1089 20 -810 1039 -1283 282 1063 -1829 782
1678 782 1370 -1602 731 691 -754 1279 -521 -621 1789 -1046 -381 1678 -1708 -298 830 -1516
1694 -1516 564 175 -1682 1636 -88 -1720 1374 -140 -753 1115 -773 632 1339 -1805 751 1212
1710 1212 -1790 315 226 -1080 933 -1079 -959 1646 -1464 -1055 1732 -795 -37 863 -810 1357
1726 1357 239 -1394 1986 327 -1388 1272 -16 -348 868 -1436 367 1151 -1952 344 997 -1864
1742 -1864 547 198 -1019 1232 -730 -505 1891 -700 -300 1600 -970 87 730 -911 803 -33
1758 -33 -1544 1439 -211 -1509 1088 -420 -530 927 -1134 380 1332 -1546 926 1476 -1320 824
1774 824 232 -516 975 -720 -528 1561 -1303 -805 1516 -1227 -121 414 -855 1090 -59 -1661
1790 -1661 1783 403 -1268 1276 165 12 936 -1211 771 1224 -1607 448 842 -1440 278 -114
1806 -114 -901 905 -808 -1000 1455 -497 -380 1318 -871 348 594 -964 914 350 -1507 1121
1822 1121 133 -1127 866 -434 -403 879 -1320 57 1054 -1816 648 764 -1190 654 75 -402 917
1839 917 -541 -560 1886 -1099 -357 1123 -607 -19 317 -1109 738 -356 -1636 1279 271 -1443
1855 -1443 643 -273 -44 1000 -1003 396 1475 -1254 352 855 -1073 367 -126 -726 1244 -988
1871 -988 -949 1253 -612 -407 857 -922 125 649 -905 961 263 -1121 1333 404 -1038 998 -85
1888 -85 -77 564 -1070 10 926 -1691 287 839 -1515 469 33 -601 1080 -1026 -562 2052 -461 -158
1906 -158 951 -743 297 575 -1155 849 575 -1381 1061 69 -1081 757 -716 -328 1083 -915
1922 -915 -88 960 -582 747 245 -1176 860 616 -691 1164 -386 -286 1081 -1094 -138 942
1938 942 -1263 129 687 -1028 267 -78 -1343 1054 365 -1210 943 -163 -67 1234 -1127 2
1954 2 1106 -1192 302 414 -1229 713 -85 -847 1189 -672 -987 1197 -317 -199 860 -964 857
1971 857 1117 -1060 578 556 -613 838 9 -560 1165 -1039 -672 1160 -876 -46 276 -1004 965
1988 965 235 -1613 766 727 -937 679 -300 -491 1451 -1059 92 1142 -1277 119 648 -872 448
2005 448 68 -961 946 -146 -1244 544 -296 -193 1190 -1071 87 1024 -1012 444 524 -806 789
2022 789 116 -1023 1031 -368 -888 1095 -616 -285 266 -1375 272 723 -1254 236 615 -715 1064
2039 1064 -100 -381 1365 -817 -493 1399 -293 -366 275 -950 892 318 -1431 1158 227 -913 329
2056 329 -544 -267 920 -1131 56 1003 -562 378 696 -479 685 86 -963 1018 -8 -1051 852
2073 852 -560 -333 700 -797 -277 982 -767 515 369 -942 1107 -20 -796 1026 48 -552 860
2090 860 -568 381 686 -1326 140 803 -1250 -13 -68 -510 760 -420 -548 1325 -599 -236 709
2107 709 -290 275 635 -778 814 -11 -1309 474 324 -839 353 -292 -531 806 -1190 -242 858
2124 858 -1069 177 838 -735 707 122 -536 874 -180 -569 930 -639 -397 939 -829 -289 255
2141 255 -831 451 -28 -1100 461 11 -894 789 41 -603 596 -780 469 867 -1123 230 1002
2158 1002 -1064 105 -74 -689 755 -808 -758 1122 -400 -704 824 -377 -68 321 -739 888 381
2175 381 -801 578 333 -588 413 -335 -396 643 -914 -9 534 -1114 282 413 -1193 377 79
2192 79 -643 1120 -323 -388 1202 -172 -436 1098 -396 -15 331 -750 784 -60 -1289 1056 246
2209 246 -869 691 -202 -394 549 -868 74 1299 -925 190 1046 -342 628 124 -442 1123 -395
2226 -395 -587 1031 -855 -457 911 -535 -199 291 -1224 691 234 -1241 689 311 -632 635 -147
2243 -147 -172 850 -736 206 611 -1081 -43 364 -896 203 -325 -570 553 -575 -474 735 -420
2260 -420 -264 758 -382 398 473 -708 558 285 -943 905 169 -776 446 -535 -66 349 -895 -98
2278 -98 604 -957 -24 372 -611 611 -134 -411 706 -147 -230 727 -448 -330 583 -405 -80 57 -849
2297 -849 522 -60 -994 481 297 -529 473 -33 -281 416 -730 57 593 -984 363 713 -413 105
2315 105 -144 -288 684 -434 -524 707 -484 -3 306 -585 302 204 -679 593 666 -711 942 22 -619
2334 -619 723 -226 -27 707 -598 -62 583 -955 105 207 -754 149 252 -663 519 -126 -181 947
2352 947 -91 -183 680 -385 295 252 -748 644 322 -789 666 97 -749 532 -369 -279 403 -632
2370 -632 -208 811 -675 299 410 -585 598 386 -170 730 -239 -428 941 -664 -138 520 -624 -229
2388 -229 426 -426 210 114 -803 379 250 -331 556 -119 52 964 -435 109 670 -821 166 247 -703 45
2408 45 99 -496 690 -301 -539 894 -173 -189 594 -628 326 598 -535 202 532 -633 511 -155 -528
2427 -528 285 -487 -406 493 -667 -27 428 -691 557 373 -814 440 371 -356 605 -234 -324 1040 -191
2446 -191 -148 827 -550 -118 515 -433 222 -134 -730 583 82 -475 485 -563 -107 705 -726 140 557
2465 557 -777 -29 351 -282 534 -105 -469 479 -527 -330 533 -645 -21 425 -784 183 527 -891
2483 -891 205 436 -536 588 -3 -345 610 -189 -371 717 -551 170 295 -749 170 220 -958 108
2501 108 5 -245 539 -418 -101 814 -520 63 588 -296 307 311 -370 198 200 -698 326 25 -489 392 -753
2522 -753 -289 709 -738 -78 670 -361 482 308 -518 744 221 -94 463 45 -50 498 -437 -175 539
2541 539 -852 250 448 -479 318 -121 -355 433 -290 -675 421 -188 -152 473 -100 320 186 -658 523
2560 523 429 -893 78 16 -442 342 -278 -158 473 -457 -215 753 -619 299 395 -379 437 245 -526 458
2580 458 -186 -358 563 -472 -253 679 -581 -243 90 -395 269 -125 -830 567 343 -428 432 -24 140
2599 140 379 -606 188 851 -543 -85 336 -511 -4 -50 -271 398 -202 -674 500 -51 97 467 -292 134
2619 134 625 -746 376 249 -407 538 47 -451 128 -194 -371 386 -691 -328 327 -405 -206 315 -340
2638 -340 344 38 -226 741 -44 -418 827 -98 -255 227 -198 51 201 -695 617 17 -797 199 -132
2657 -132 -560 356 -191 -335 450 -809 122 820 -495 -53 351 -403 442 -35 -656 681 -154 -639 622
2676 622 -297 -295 382 -671 -22 176 -442 222 551 -622 383 340 -359 383 -210 -52 300 -442 157 782
2696 782 -554 -262 304 -556 73 -21 -525 429 -118 -542 567 -205 -254 473 -403 448 143 -695 493 429
2716 429 -572 172 2 -315 187 -116 -35 788 -806 -134 711 -225 -259 356 -300 677 105 -360 759 -13
2736 -13 -182 391 -213 -184 299 -573 208 221 -701 460 170 -766 186 73 -272 520 -178 -26 1013 -567
2756 -567 179 666 -291 -28 520 -195 74 -158 -457 367 -140 -272 180 -116 -329 450 -483 183 116 -611
2776 -611 614 309 -842 282 229 -125 567 -292 -330 276 -741 -151 667 -535 -110 113 -358 199 -164
2795 -164 -437 806 -190 -448 388 -91 -196 225 -173 337 303 -560 370 310 -481 315 144 -496 445 -380
2815 -380 -223 424 -354 -180 577 -389 210 474 -266 551 172 -486 645 -83 -542 267 -217 -175 352 -573
2835 -573 -27 215 -477 499 340 -291 139 425 179 641 -362 -57 650 -557 53 519 -313 -357 14 -361
2855 -361 203 -231 -397 501 -77 -345 300 -176 -290 644 -465 133 483 -465 287 416 -271 196 -18 -325
2875 -325 259 -454 -617 674 -465 -306 649 -818 120 248 -157 530 193 -311 663 101 -94 566 106
2894 106 -69 355 -388 -50 135 -631 163 22 -689 228 498 -16 514 -403 -214 659 -270 0 661 -305
2914 -305 151 344 -165 441 -231 -956 665 83 -529 309 -281 -148 199 -894 18 647 -391 86 201
2933 201 -226 329 63 -299 520 -102 -233 528 -231 -243 482 -658 -153 342 -434 114 12 -332 448 -58
2953 -58 -469 333 -60 -114 510 -396 138 406 -584 279 151 -939 220 -124 104 391 -451 -379 532 -451
2973 -451 -386 407 -478 300 428 -86 306 313 -285 381 -261 -390 500 -145 -107 705 -486 -142 561 -558 317
2994 317 25 -382 579 -35 -450 597 -130 -190 469 -335 -232 591 -238 110 160 -399 370 -3 -550 406
3014 406 -40 -528 569 -212 6 633 -448 262 453 -436 134 377 -474 150 -50 -121 743 -242 -506 147
3034 147 -217 -63 249 -441 38 177 -385 374 298 -354 178 -109 -109 187 -389 90 409 -349 -29 207 -577
3055 -577 429 70 -435 -58 -121 -433 226 -323 -37 368 -358 -154 311 -91 181 -41 -346 293 204 -539
3075 -539 462 41 -430 327 -193 -132 174 -661 147 327 -382 298 291 -299 397 54 -730 722 -95 -637
3095 -637 412 -327 122 275 -524 278 285 -387 173 -149 -264 378 -334 101 604 -115 -16 155 -157 134 221
3116 221 -462 157 204 -708 65 35 -320 366 -354 -259 590 -347 -255 242 -214 452 25 -272 443 83 -353
3137 -353 652 -53 -245 597 -282 -41 298 -452 50 354 -506 476 19 -404 182 286 -402 624 66
3156 66 -356 232 -315 20 420 -390 389 296 -378 238 11 -189 266 -151 -338 256 -149 -236 490 -274 -176
3177 -176 79 -624 328 285 -252 319 8 -176 194 183 -378 218 -133 104 314 -361 -126 474 -472 243 204
3198 204 -161 151 -253 61 497 -116 -322 434 -343 -47 316 -516 21 -66 -550 294 84 -742 134 84 -96
3219 -96 358 -292 215 255 -464 -55 160 -37 355 -284 -213 311 -207 -553 -3 -244 14 246 -409 -62 217
3240 217 -72 267 282 -56 245 -128 101 146 -371 -275 80 -127 55 -90 -232 146 305 -522 14 -24 -472
3261 -472 278 -356 -128 566 104 26 573 -288 5 271 24 379 -1 -358 437 135 -226 426 -311 -73
3281 -73 356 -518 -193 309 -557 -199 304 -98 316 204 -195 416 -44 -60 429 -303 -105 230 -401 56 -162
3302 -162 -391 337 61 -469 364 105 -328 508 119 -332 235 -233 139 368 -354 4 343 -286 213 -34
3322 -34 -328 304 -128 -283 170 96 -159 322 -61 -176 343 -268 136 22 -176 441 321 -370 203 -322 -203
3343 -203 231 -303 -183 272 -364 197 285 -494 86 90 -442 182 -194 -330 354 -375 -408 339 79 -101 155
3364 155 -192 138 260 -532 -5 0 -421 303 14 -10 236 -320 -136 256 -546 -17 403 -368 -33 62 -396
3385 -396 359 -14 -120 158 -418 -230 141 -291 -186 166 -413 240 94 -135 575 -48 -64 11 -333 133 364
3406 364 -232 -189 179 -169 233 94 -327 150 -254 -85 454 -162 -376 310 -265 -237 80 -525 59 259 -261
3427 -261 311 129 -230 586 -30 -185 292 -417 -406 447 -542 -10 162 -511 130 267 -246 30 4 -175 375
3448 375 -85 135 181 -143 132 119 -221 33 106 -604 95 -95 -455 380 -145 -160 240 -350 -212 387 -400
3469 -400 292 338 19 400 221 -58 307 72 -129 174 54 -24 233 -133 20 83 -316 394 327 -264 181
3490 181 99 -406 242 -25 -260 22 -237 9 186 -282 -30 248 -530 217 -153 -538 263 -104 -351 96
3510 96 -51 -141 145 -311 -195 279 -145 144 112 -463 297 6 -61 258 224 -229 71 -117 -86 225 -403 -31
3532 -31 240 -266 136 121 -172 185 -51 -211 175 -91 -190 137 -55 -123 12 -172 28 219 -269 71 118 -132
3554 -132 244 58 -209 429 -49 85 278 -357 114 367 -169 212 -102 -588 408 100 -400 228 -54 -211
3574 -211 293 -93 -79 207 -250 -295 27 -40 153 232 -222 179 124 -282 548 -179 111 210 -255 -21 207 -175
3596 -175 92 113 -320 -139 -2 -363 319 119 -26 249 -277 21 337 -90 -174 139 -153 43 -165 -110 88
3617 88 -168 -252 239 -213 -138 308 -277 85 456 -146 185 371 -362 405 -58 -41 342 -319 -88 313 -347
3638 -347 150 -40 -362 149 299 -401 21 -37 -357 574 -1 -137 429 -2 -209 356 -433 -49 134 -516
3658 -516 456 139 -274 239 58 -350 18 -79 65 28 -186 52 531 -181 -75 491 -457 -119 150 -13 259
3679 259 -129 -49 328 -187 -156 136 -468 31 129 -552 -12 199 -55 474 16 -95 135 28 -127 8 -115
3700 -115 85 21 -109 126 292 -97 20 -64 -359 192 -176 -95 170 0 -164 309 -119 301 325 -261 272
3721 272 229 -296 84 27 -184 332 -134 -112 246 -340 177 168 -329 41 392 -149 166 207 -465 431 229 -423
3743 -423 217 -189 -286 74 -67 -72 208 -32 166 74 -478 370 68 159 -92 14 179 67 202 -87 230 -96
3765 -96 182 253 -240 54 -233 -377 223 -57 -159 358 -57 -32 192 -240 -16 117 -266 279 299 -283 -23
3786 -23 98 -153 -85 4 -170 316 -135 -15 104 -194 137 136 -164 46 173 -216 301 4 -327 329 229 -238
3808 -238 226 -173 198 230 -427 48 16 -316 69 71 -222 188 -239 -192 384 -296 73 1 -293 -67 97 -212
3830 -212 -30 300 -10 64 -40 -247 269 -5 -33 124 43 -20 116 -276 -19 199 -264 136 -20 18 233 5
3852 5 -210 248 -295 29 271 -382 152 94 -215 128 147 49 13 -60 -104 348 -97 5 92 -117 232 -25 -318
3875 -318 204 -109 -250 10 34 -28 286 -312 -170 144 -58 -168 159 -4 -10 355 -366 -101 -25 264 6 -24
3897 -24 -35 435 -60 -46 318 -110 101 -92 -250 89 158 -90 135 114 -38 74 36 -62 222 -257 -35 173
3919 173 -122 86 174 -62 141 -63 -66 57 -95 -438 0 -149 224 24 -201 -164 203 -4 -6 248 -154 360
3941 360 152 -74 138 -157 -101 162 -299 -247 159 -509 64 194 -16 36 146 109 174 174 -1 174 -76 46
3963 46 127 122 181 200 -18 140 -153 1 217 22 -98 -180 -265 -210 -60 -36 -67 316 -395 92 -181 -170 109 210
3987 210 -191 264 161 -188 82 79 -79 169 -182 25 -145 -85 316 293 17 -38 99 -126 98 -124 -163 45
4009 45 -193 110 203 -334 26 16 -276 237 65 -153 218 -205 -290 56 -161 64 146 93 100 128 -115 207 110
4032 110 -30 -74 69 -3 167 17 -138 270 -272 -224 -64 -11 226 140 89 237 -77 -209 213 -212 19 263
4054 263 -200 -126 45 -218 -34 351 -289 96 -276 -407 165 -85 -80 327 -43 -428 -48 98 25 87 12 152
4076 152 279 -28 -19 24 -190 -34 -193 -307 276 -187 28 -7 -162 268 219 -260 152 289 -215 146 47 -79
4098 -79 159 -13 -166 194 -103 -84 205 -363 -152 -74 -296 190 -157 -149 -107 103 -230 125 58 -16 265 -42 449
4121 449 -52 42 140 200 -233 136 108 -261 98 -213 131 154 -383 -259 379 -118 375 37 -25 80 30 -227
4143 -227 398 59 173 272 133 14 202 -180 -106 171 -169 -149 91 -331 200 -62 -213 260 71 105 166 -20
4165 -20 109 137 -186 444 190 -327 -51 -166 -1 410 -151 -18 333 269 -310 148 -192 -53 110 -34 258
4186 258 211 -393 -66 -96 -102 349 -210 138 159 -215 -74 5 -194 -60 165 182 239 11 86 232 96 -167 139
4209 139 -198 22 259 -81 182 288 -317 218 194 -70 158 52 8 4 33 57 -9 -100 116 129 1 -39 109
4232 109 -88 28 -216 -35 -89 164 -72 -1 -308 -91 41 -93 -171 -37 -245 49 291 55 220 170 -38
4253 -38 207 97 216 253 -108 109 125 -335 -116 140 -181 -82 -74 -152 270 69 -275 217 -99 8 124 -168
4275 -168 -504 141 -83 367 -50 -133 34 -119 -117 205 -103 -200 140 -258 32 172 125 -6 -132 24 55 117
4297 117 -111 75 52 -221 108 -108 -196 229 -6 215 32 -350 232 -125 -285 119 219 -198 84 -34 -20
4318 -20 264 -105 54 225 78 8 -212 -64 -169 -262 -148 -87 41 -112 178 -119 66 154 -280 221 -89 -73
4340 -73 -60 81 -131 143 348 -287 -81 -27 106 136 -34 9 73 -88 -148 191 -63 118 121 49 -22 47 -69 24
4364 24 -235 -71 -109 -319 -110 166 33 75 122 -387 40 145 -445 45 114 -94 56 -83 -56 98 -106 168
4386 168 114 -48 -21 102 11 195 -228 -279 -7 -132 43 58 -243 156 52 93 -35 -188 -19 -9 32 22 59
4409 59 144 -34 115 194 51 279 -122 -136 286 -232 78 108 -33 -124 -339 78 205 -100 -260 212 -86 332
4431 332 37 -190 49 -33 -126 112 119 18 -70 -56 16 11 -350 8 -1 -26 61 73 -215 -120 -3 -332 144 -108 -59
4456 -59 -58 44 -154 -85 6 -80 -66 34 101 48 -276 241 -167 -25 39 -35 -129 135 -210 -15 6 -79 -14 124 13
4481 13 -83 -17 -178 112 -45 0 246 33 -27 108 160 -4 157 -304 263 43 -157 42 -126 92 -65 -137
4503 -137 165 117 5 -79 83 -271 -183 37 -53 -135 3 -41 87 109 -76 159 157 44 124 -49 -2 55 -142 248
4527 248 222 -207 -214 145 -34 66 -120 -71 265 -340 55 -166 -134 121 362 -385 135 133 22 -64 -163 -38 354
4550 354 -193 -74 81 -235 144 -230 114 51 47 -4 118 28 9 122 33 -7 213 -94 -56 283 -23 80 133
4573 133 46 -56 165 -99 155 -115 -45 116 -159 -265 187 199 61 348 -132 -106 106 -20 354 70 -65
4594 -65 109 -125 -188 -102 -390 538 64 -186 -19 71 -139 108 -328 64 237 -12 22 -90 -35 -157 402 -93
4616 -93 -32 -47 -341 -123 9 -191 121 25 -94 67 -71 49 339 18 -307 -65 -111 162 -158 17 117 -130
4638 -130 137 106 -147 -119 143 195 -192 -228 -79 33 -152 -47 198 123 -69 118 -79 -17 -18 -196 -152 176 -307
4661 -307 87 -49 -136 288 -83 -101 97 120 -186 300 -66 67 84 3 77 69 -105 -127 -137 -74 -66 -40 60 34 -69
4686 -69 240 -186 -239 -162 92 71 6 75 81 301 31 183 280 164 -57 248 -92 -23 366 -192 -161 35 -153 170
4710 170 152 -192 -104 -89 -190 -5 -95 -74 -1 83 200 190 -262 179 247 -106 161 -158 53 122 80 -283 208 65
4734 65 -68 159 61 119 94 -52 64 67 -140 225 93 122 87 -145 70 337 -87 -233 201 -63 177 -10 -40
4757 -40 -22 -181 100 189 -131 28 263 13 66 1 52 -191 22 -143 -22 -191 -257 -61 -170 -65 167 112 -139
4780 -139 172 -296 390 92 -47 47 146 -190 -23 48 121 256 162 22 33 -276 9 34 2 17 65 -397 38
4803 38 50 -240 -188 -31 197 178 232 119 313 49 168 228 132 206 66 43 136 281 -52 31 14 -185 150 -70
4827 -70 -69 95 -222 119 202 -189 124 139 -58 -97 49 -12 247 138 -134 254 -80 -106 61 -93 -74 -167 -568
4850 -568 -2 -65 -37 90 -39 -144 186 -128 136 158 -121 -51 82 -47 -104 127 138 -161 60 -285 240 36
4872 36 -116 117 -62 -62 23 58 -37 -81 -249 65 50 -99 59 -124 -272 -6 -183 -3 131 -225 108 77 -65
4895 -65 -71 -32 -14 3 109 -138 144 -111 -76 64 -32 -153 173 -74 216 -119 227 112 95 -108 73 -1 -342
4918 -342 -34 -150 77 101 -238 132 -221 -198 296 9 -119 -24 233 -41 -38 -59 -251 31 -155 72 79 -78 131
4941 131 166 -1 83 142 67 49 47 114 -2 -20 235 279 -26 112 -114 144 22 -17 -202 214 6 -112 73 2
4965 2 66 9 161 162 319 -26 249 115 100 -187 98 27 11 61 -33 44 -493 -236 75 62 24 -7 -203 129 -202
4990 -202 -168 297 -57 -52 230 -44 -17 244 -378 -313 164 -85 -79 127 -42 8 190 -23 364 -144 -86 117 -94
5013 -94 -122 70 -59 41 93 -3 29 -61 -53 139 116 -46 290 -147 -42 -20 147 112 -33 22 58 91 -86 90 135
5038 135 -147 154 -220 -57 86 260 -262 219 -182 -167 -35 -334 117 -111 -72 248 -1 -278 235 -104 124
5059 124 165 101 97 104 -239 57 -160 -75 112 30 -99 144 -45 -143 228 -217 133 299 -164 17 237 106 -18
5082 -18 59 -10 113 136 114 164 -41 -53 5 -60 -190 -87 -35 135 -9 -145 191 18 -200 -119 -365 31 235 -151
5106 -151 -227 -4 -324 -86 -150 -160 40 -159 -170 -23 -29 -188 15 -151 54 121 -28 262 93 -218 270 -13
5128 -13 220 7 105 -77 4 -114 4 59 -145 -111 63 -98 -213 85 -89 -16 145 -99 8 114 153 213 -136
5151 -136 -209 167 82 68 211 -72 -42 80 -238 155 -182 -260 237 -275 168 -75 -129 -51 310 -43 -220 0
5173 0 -248 -311 121 -135 -40 101 -204 214 -370 -115 164 78 -48 372 -52 347 440 -77 177 -120 -37 176
5195 176 18 58 -46 -88 -249 182 130 -89 -43 -304 -10 -23 -69 34 42 182 -64 -182 124 72 41 -165 -50
5218 -50 69 159 2 19 -145 -90 -204 -125 214 -34 78 226 -364 140 54 -57 96 -26 60 -100 -47 152 306
5241 306 -452 -24 -172 -21 -226 298 -60 343 -56 35 -7 107 200 -85 57 472 21 -1 153 44 52 117
5263 117 67 53 132 -417 -114 -24 66 119 -219 63 -34 -118 -136 176 -196 -193 17 114 -4 70 50 293 -42 58 251
5288 251 -311 -318 -94 -334 23 -114 274 -81 180 -326 -12 232 -214 -62 23 -68 114 85 -50 45 -247 -89
5310 -89 -56 121 -158 29 -21 23 -128 -4 168 120 -294 -129 -344 204 162 -166 33 186 -224 118 -188 -159
5332 -159 -58 -162 147 246 -171 6 242 30 122 302 23 129 207 -110 277 -226 52 154 117 38 80 189
5354 189 -43 -117 -243 -34 -65 -308 -87 -261 -99 4 -171 -326 -31 -90 -44 70 -480 -57 151 260 -121
5375 -121 30 -217 86 -88 64 183 180 -109 -285 176 30 41 -126 337 243 -180 -157 -22 -252 -94 10 40
5397 40 41 -311 219 363 -1 261 113 -211 4 -68 -209 289 -9 142 117 -231 13 9 -79 -124 305 -274 -169
5420 -169 4 -294 -24 176 -61 125 181 -234 90 -70 -49 -15 -48 116 21 -64 137 159 331 71 123 63 132
5443 132 0 -141 -26 112 349 198 49 79 -205 -47 -30 41 135 61 -137 -135 -182 43 -97 -12 112 -193 -127
5466 -127 -61 116 -56 -189 -113 208 32 88 -23 -175 178 93 -46 0 121 -142 -238 26 113 233 40 152
5488 152 212 51 365 -183 -52 99 -197 157 167 -193 -223 420 87 -53 76 -117 -21 -130 6 137 264
5509 264 -144 158 -234 -107 -108 -6 -30 -103 -54 -73 -123 123 217 104 -90 95 10 113 -3 -130 -232 -135 -293
5532 -293 -77 -109 -28 255 218 -12 169 -62 -270 -115 -96 -86 113 -419 208 -9 7 179 -102 45 158 -164
5554 -164 -31 206 -117 122 9 -174 -145 -66 -190 -10 -88 -84 175 -36 177 388 -96 120 67 -225 51 0
5576 0 147 111 95 4 114 29 5 83 76 -70 344 141 -177 156 168 217 308 50 59 -43 -59 213 -109 -221 5
5601 5 140 59 250 -163 -199 267 -188 -6 88 59 97 5 139 64 -118 174 23 -458 138 69 -105 239 4
5624 4 223 217 61 57 -154 -421 183 -272 -220 142 -166 45 94 -34 -177 93 33 116 193 357 -46 164 -329 -25
5648 -25 140 -186 -170 127 -67 29 -83 219 372 -177 164 128 -172 138 9 7 250 -46 -171 -124 -75 -26 -44
5671 -44 233 6 -61 -132 -324 66 -185 4 123 87 211 22 37 30 80 -210 123 -99 -49 -72 -109 -273 57 -41
5695 -41 53 260 -356 279 174 -265 300 -167 192 276 154 -73 153 -26 93 -62 -143 91 28 -204 164 -101
5717 -101 -126 -112 -15 95 21 -92 -128 235 -192 -324 -110 76 128 122 32 147 81 -15 113 -17 288 -123 -15 -204
5741 -204 -207 2 272 48 -80 30 82 -39 -111 -130 -25 141 77 101 65 -31 -363 -153 0 153 209 -255 239
5764 239 6 60 61 287 -164 70 -111 170 126 57 -95 -51 -38 70 232 -184 15 47 -150 -7 -160 -130 -116
5787 -116 -105 -101 158 0 -87 73 4 35 -69 -221 86 -58 4 9 -239 168 237 -204 -114 -28 156 -62 225 -367
5811 -367 -16 52 -287 104 -132 27 26 -28 284 182 -283 -167 -131 -296 304 79 -212 119 153 -349 33 59
5833 59 18 73 -37 -24 257 131 -44 52 217 -75 32 -109 164 21 -27 0 -35 38 -103 -246 81 133 -63
5856 -63 146 138 -157 90 84 -102 383 -55 155 81 -367 31 178 -281 -18 -68 36 321 -66 183 -94 -185 36
5879 36 -121 -39 -249 51 -11 295 40 -149 -20 -30 36 103 -110 -184 -26 -122 245 -88 34 71 194 60 -31
5902 -31 169 -48 113 -58 -91 -132 -55 100 -44 -184 156 139 103 260 47 -52 -102 249 50 98 -101 -138 23
5925 23 -139 -118 -28 -56 270 173 -118 -147 177 -67 161 141 -198 -50 -197 -132 78 107 3 -9 -305 197 112 -57
5949 -57 211 5 -107 75 64 -314 86 -125 -145 103 -3 87 75 -9 -181 176 113 -302 -78 -134 177 -94 -60
5972 -60 111 -79 -23 -16 -99 -81 -56 -75 -67 63 -13 90 236 -115 -57 -39 -197 62 -68 -20 -131 100 96 79 -175 88
5998 88 -84 -192 108 -142 -268 317 -99 -181 305 -145 14 269 51 -68 -84 -151 100 -280 184 40 88 315
6020 315 175 -218 -84 72 153 40 -25 15 186 36 -40 -102 -130 9 244 79 -217 333 -254 192 65 -108
6042 -108 86 115 135 -234 -188 37 -131 -159 124 -147 -239 248 -106 5 -79 461 -185 -32 117 -54 265 26
6064 26 -5 -108 22 -134 108 -64 -39 144 -4 372 -32 -61 111 -70 -51 -67 -75 51 143 36 -214 -276 8
6087 8 62 -154 -357 18 -99 -189 97 22 -193 83 -213 325 -80 -87 118 7 -52 281 173 -208 294 155 -172
6110 -172 -63 -252 127 -22 -147 90 116 166 44 -73 139 117 -111 21 16 113 -82 -90 147 -216 4 -192 10
6133 10 -79 137 -19 29 68 23 -94 -221 258 174 -74 83 -75 115 241 -82 136 13 129 -161 116 9
6155 9 164 -13 -96 241 -105 -36 16 -220 -21 212 -72 -50 -5 157 -239 -14 50 -12 -30 -34 392 203 45 101
6179 101 198 168 160 20 60 -35 36 71 81 -50 385 -220 123 -212 -204 -275 40 -75 40 -151 -78 84 -57 127
6203 127 159 -108 -76 68 -280 -3 244 80 0 -125 -56 91 35 -33 -51 -141 -311 7 109 88 200 -254 -52
6226 -52 145 -121 -30 44 2 60 66 -33 -62 -146 132 353 66 26 -254 189 138 -70 -131 -187 46 -214 84 -19 -18
6251 -18 36 24 -3 -198 -204 -33 72 -232 -179 265 221 177 46 86 70 -288 -156 -225 -50 -6 151 -191 -49 277
6275 277 -179 -185 -58 -160 32 -217 45 -326 -107 53 -91 176 77 159 68 58 10 -53 111 -111 27 11 -80
6298 -80 -57 40 -12 -37 -39 27 -77 -380 142 -287 4 -10 -50 -184 209 -16 -171 68 154 -69 -203 184 147 -221
6322 -221 29 75 -55 94 -144 161 122 171 176 68 -75 150 -74 -223 -130 111 -41 29 -59 124 -44 -158 -122
6345 -122 10 73 59 140 -109 86 -187 -38 -14 -285 11 119 16 200 44 -68 72 92 134 -164 -31 137
6367 137 83 -199 -127 7 -32 16 -64 77 -45 -79 -47 -14 124 93 323 88 -145 -55 -224 63 181 322 -410
6390 -410 -205 20 -234 167 -49 -304 -99 143 -155 121 209 -298 -139 29 -171 77 144 -193 -179 119 -110
6411 -110 -14 119 148 115 -241 22 -91 -222 -130 201 -169 -130 139 -3 65 -141 -150 102 109 -261 233 115 66 27
6435 27 161 1 189 -295 22 293 34 -61 62 -89 103 120 -24 135 -25 -108 -118 -191 3 -119 17 -20
6457 -20 180 93 -46 218 -36 118 245 -107 103 -49 17 55 -205 -117 -178 -103 -21 15 -153 141 103 153 79 -125
6481 -125 171 221 -20 136 -2 -24 97 122 119 60 -50 -201 -298 -42 164 260 -13 -93 135 156 -227 13 30 -141
6505 -141 -19 -60 250 159 -118 -85 -242 69 210 43 55 -103 -99 -82 -57 -61 -271 -74 12 -10 -2 -133 13 63 177
6530 177 20 182 -103 194 -72 -132 -86 -211 -144 327 -14 -143 10 -15 1 -101 164 160 26 -44 274 -127 -9
6553 -9 -309 -111 -13 13 -120 -71 72 -26 254 187 -65 111 -44 78 -301 -67 -50 -223 44 212 -206 -34 -15
6576 -15 13 -151 91 119 -201 -76 142 -100 55 115 -5 154 -57 -49 102 68 -266 162 42 -78 29 142
6598 142 68 -118 92 -20 -59 -176 51 -173 209 -180 -178 -98 11 311 -293 5 214 -86 -15 -171 -162 -19 -1
6621 -1 -126 103 116 78 -178 11 -270 -204 128 -9 3 62 62 190 -27 50 408 30 6 -85 172 17 -102 69
6645 69 316 0 188 46 -210 157 294 -25 44 -70 94 -125 115 -168 -7 291 -113 50 2 105 22
6666 22 141 -57 24 -95 -8 75 -145 139 -14 -200 -29 -54 38 -71 -124 -325 245 30 21 25 115 -124 -91 -217
6690 -217 -76 296 -162 23 -36 -42 -75 59 207 -99 6 -125 103 319 185 84 -208 -21 64 96 40 -90
6712 -90 13 116 182 75 -98 138 38 80 71 169 119 20 19 141 -133 -125 86 -85 8 94 -303 121 20 -62 138
6737 138 -81 34 23 133 -139 27 -169 231 8 138 -37 191 35 117 -224 -82 -228 -51 -180 78 279
6758 279 -29 177 -211 -53 -60 -156 10 -203 -40 140 47 -99 -196 -134 -85 119 73 262 34 92 -69 131 -11
6781 -11 -49 75 -362 264 158 -27 2 105 106 -115 -97 13 -49 218 199 6 -17 -124 167 -38 290 -349 70
6804 70 58 39 -180 -131 -160 -71 -161 1 -88 27 115 -83 -109 223 -244 -243 -47 -74 5 56 -38 -27 230 -96 84 68
6830 68 -88 80 -100 99 245 -69 11 61 -97 -70 -15 69 193 33 -64 -94 -100 7 73 -22 -110 319 99 -19
6854 -19 -44 61 77 98 -187 3 -191 -140 -20 -11 -48 95 -85 -271 -84 -62 81 -25 43 70 30 241 199 4
6878 4 55 115 172 -287 21 122 -118 147 -117 -55 9 -120 -44 -36 -245 177 -2 22 141 69 118 74 12 155 87
6903 87 -144 -221 148 293 168 -32 -181 -12 -105 -256 -29 -96 -56 126 -126 -70 111 -214 -83 -84 -17 -216 -99
6926 -99 89 -44 -116 132 19 -21 -70 244 91 76 162 95 172 389 -131 -91 -44 288 57 -152 -56 -13 -227 7
6950 7 -145 58 13 3 87 288 81 -137 -17 -201 -223 150 -202 32 82 -105 343 251 91 -286 136 -57 43
6973 43 -172 -305 86 -24 -251 -43 127 25 26 59 24 190 -157 221 -131 -171 82 167 -108 137 225 28 319
6996 319 54 -106 -1 -61 -4 166 172 -32 -165 -106 -98 40 108 -310 151 222 -93 -82 252 -295 15 217 -46
7019 -46 -102 -184 -26 -65 -133 125 133 47 52 -38 -59 150 -103 -9 225 170 17 215 -110 221 70 -3 73 -66 24 -46
7045 -46 197 19 21 -115 37 233 -84 5 152 17 -30 -95 49 -23 189 35 220 33 -229 -94 -114 14 158
7068 158 -238 -193 52 94 45 130 -173 74 119 -121 -161 -362 -111 175 -44 -157 56 117 -71 44 -73 -92 143
7091 143 -150 -201 -23 20 -28 11 195 167 -102 -233 35 -84 -14 135 175 91 -160 184 -50 -140 84 -94 -333
7114 -333 -225 -12 -54 -290 22 -118 15 -100 140 78 -107 -132 48 60 -178 -104 189 -30 126 241 -103 -155
7136 -155 -147 71 -41 -168 -177 102 -143 -33 103 80 -254 86 -72 -122 26 -28 10 -124 -58 59 -146 154 55
7159 55 -10 -292 0 -78 42 -14 -157 373 -117 -32 -287 110 67 -175 -136 -120 33 87 -74 263 -76 -85 66 87
7183 87 137 103 -200 230 8 -58 -114 -25 -192 -160 46 117 7 29 85 370 256 74 6 33 -9 321 -52 -131 79
7208 79 -157 80 212 11 251 -215 -144 181 -47 12 -23 187 -73 -181 -160 -125 279 95 -3 -32 3 -38 78
7231 78 -139 103 162 46 146 20 102 122 169 -82 -175 -99 36 -29 28 332 -61 134 253 -224 46 -75 90
7254 90 38 83 80 93 22 -116 134 35 115 -96 -131 -115 -3 -87 -125 94 -184 -96 314 -28 -50 64 -188 86 -6
7279 -6 -104 -25 30 -176 59 -151 143 31 38 8 -39 145 -167 -168 -121 99 -167 -116 130 23 23 -17 67 -12 -32 82
7305 82 -134 -60 -14 -106 -11 -70 -16 -158 148 163 -117 343 -146 -2 158 145 -36 42 110 210 2 165 76 -31
7329 -31 54 25 -55 125 3 -63 113 164 28 82 34 -95 -57 -31 -196 -198 315 128 84 28 41 129 191 -34 20 182
7355 182 214 101 -125 -70 151 104 -74 -105 86 58 51 -35 161 51 25 -16 -82 300 190 -51 201 13 -17 92
7379 92 -6 -137 12 0 -259 23 -54 26 -20 -65 129 -161 -74 -10 78 -123 -220 -234 -227 -25 -171 -6 103 58 36
7404 36 210 3 236 -283 232 232 -42 17 -184 -5 93 -116 -196 -46 123 -42 107 72 -167 98 -61 -126 237
7427 237 -39 50 167 136 -125 -22 -5 6 -227 17 257 -94 -63 98 63 -70 -47 65 -94 134 211 85 -111
7450 -111 -4 17 -26 45 -253 -20 -176 -45 27 158 -18 -168 109 43 -27 -35 68 82 -27 18 -93 194 191 -115
7474 -115 -40 -75 -54 195 -192 -200 -163 -31 -165 283 -137 -139 282 -30 -80 249 -215 171 -253 220 55 -19 -227
7497 -227 -190 53 -11 -215 -190 101 -204 248 -124 283 122 4 -26 -262 -65 -339 52 -39 158 -104 -225 -79
7519 -79 139 -220 47 98 -5 132 155 -163 -52 -138 -23 12 -68 71 156 148 -60 -112 88 140 -106 121 44 -87
7543 -87 8 218 53 -232 -204 54 43 -58 -72 -27 191 39 52 -168 6 -76 -103 -190 38 -8 -58 -160 -219 -86
7567 -86 32 80 271 -505 11 23 -185 -65 290 192 -212 -43 -63 394 68 -21 91 -152 -15 109 -123 -58
7589 -58 -5 -73 67 2 109 -54 170 100 111 -406 -8 -27 -57 10 -210 165 44 15 -201 -32 188 159 -11 22
7613 22 100 -165 185 145 -122 62 59 28 -222 -116 -11 208 -169 -155 -29 -130 -239 -58 -11 94 34 -261 -172
7636 -172 -33 -270 118 181 44 -173 -132 -47 65 100 198 107 14 -139 -79 4 -73 57 52 13 1 97 107 203 -117 135
7662 135 64 33 -9 -133 173 141 -275 -77 -42 33 92 110 -79 -232 77 -149 174 -50 90 97 267 267 -48 -42 176
7687 176 -75 -86 -215 -78 120 -10 25 -103 -131 -435 -65 -78 -53 -112 -128 -119 -54 32 -78 -161 234 116 -94 191
7711 191 74 233 -156 178 67 82 17 -46 -35 -145 96 -65 115 -134 273 245 -86 -40 189 -229 -170 -187 -302
7734 -302 -54 37 192 -26 123 176 -120 -2 26 104 -46 -128 67 204 -125 272 77 -80 155 -168 139 77
7756 77 231 168 -92 -170 13 80 248 395 -142 146 96 11 -160 -174 -12 281 50 30 152 366 264 -262 -26
7779 -26 -124 8 -29 226 -136 -218 67 -164 -53 -199 -138 -255 -123 -118 -382 -59 -57 93 -43 -174 -196 -170 30 222
7803 222 26 40 1 228 110 -164 -145 -114 51 14 -174 13 -44 -169 87 -386 72 -15 129 -161 -97 111 -35
7826 -35 -35 54 55 213 -31 -107 35 -85 142 -21 218 11 -53 -46 18 -8 -72 42 -106 -113 43 32 105 -295 8 31
7852 31 -2 -84 -198 152 -319 115 -96 46 38 175 -81 127 7 -50 -198 -226 167 23 -195 158 68 24 -107
7875 -107 -60 43 -91 -133 -87 40 124 29 -155 277 89 -224 -151 -35 184 105 -203 -81 -16 171 -74 54 247
7898 247 206 2 -133 28 177 -26 36 78 -181 3 19 -187 153 127 114 108 -119 169 127 -3 -11 -81 100 -17
7922 -17 20 97 -48 -215 6 -30 -3 -45 78 324 358 70 34 -87 -65 -26 -24 -178 32 143 19 88 -45 -94 79
7947 79 206 -1 40 34 113 -115 -152 -269 46 0 195 -84 69 -81 61 75 -65 -71 -273 -176 251 4 -41 -185
7971 -185 -103 -102 84 91 -153 103 104 -176 -86 -123 -104 -142 23 97 -59 160 -207 115 16 -89 55 -71 -243 25
7995 25 98 -185 -88 347 -213 122 -250 -58 255 7 80 -28 270 -48 -17 337 -222 44 -34 -5 -163 -143 197
8018 197 114 99 -146 64 155 -135 -134 -107 192 32 128 -116 -117 111 -50 -1 112 -93 167 -92 30 -22 75 -35
8042 -35 0 65 -5 -63 44 37 -63 -47 67 37 -134 -165 -66 6 -131 -51 275 20 -69 15 -23 1 -76 66 -216 -53
8068 -53 -30 -223 -185 -32 -117 180 -168 -67 -25 -11 43 -62 -53 19 187 -261 -151 144 152 47 313 10 -107 -15
8092 -15 168 -181 -9 -116 120 253 -199 -56 117 -327 -97 62 -144 125 145 193 15 -93 112 37 9 23
8114 23 358 -60 -61 105 93 -22 211 -141 229 216 -94 136 16 56 -69 -107 283 -33 47 59 -54 -196 41
8137 41 -10 87 227 66 11 171 89 -107 32 53 -168 -130 92 135 14 -244 -101 21 -196 -218 9 -63 209
8160 209 15 -20 24 235 90 -150 -41 -52 85 -316 169 101 -285 -15 -79 67 -13 -165 314 111 101 -345
8182 -345 -81 -203 -189 20 -85 220 89 97 -85
8191h5
$$ Imaginary data points
##PAGE= N=2
##DATA TABLE= (X++(I..I)), XYDATA
0 0 0 0 0 0 0 0 0 0 0 0 8 -8 8 -16 16 -24 32 -35 40 -56 64 -73 88 -105 127 -144 168 -197 225 -261 297 -340
32 -340 385 -437 493 -556 622 -702 782 -872 972 -1081 1197 -1328 1468 -1622 1789 -1974
48 -1974 2175 -2396 2639 -2909 3205 -3536 3907 -4323 4798 -5342 5975 -6717 7607 -8695
62 -8695 10061 -11836 14246 -17716 23181 -33078 56712 -236618 15958 526496 19328 -325956
74 -325956 -176163 213748 194181 -21842 -68874 -59029 -119790 108753 224045 -48546 -283769
85 -283769 -99412 252729 241248 -193842 -253153 104713 200139 23488 -90391 -112599 -14105
96 -14105 62996 71707 19535 -140167 -109932 166731 143647 -100681 -106494 38736 92012 8072
108 8072 -55837 20220 -14747 -98684 55826 121344 -67703 -120515 18491 126347 47580
119 47580 -121662 -46695 105182 -5446 -68752 45330 36400 -69593 -72017 77747 147958
130 147958 -76364 -175329 83935 168892 -33723 -127367 -36981 79529 43699 -67603 -16411
141 -16411 20849 -45012 21602 79947 -13693 -62547 -18462 66411 71251 -66805 -80714 44721
153 44721 37629 -11649 -9506 -20838 2252 12348 10225 35621 -32590 -63815 53327 47924 -53657
166 -53657 -34420 17215 27536 -7909 -35375 40071 44235 -55404 -14252 59218 13605 -28968
178 -28968 -38440 1787 44812 -18815 -34939 20473 -14984 -16454 44925 21543 -26756 -43156
190 -43156 5579 87528 5478 -104191 -12194 69619 26753 -22064 -45324 469 43292 6355
202 6355 5692 -7478 -55734 10306 62881 -5938 -50355 -41576 21128 74632 -8524 -63903 5038
215 5038 32826 27884 11367 -38557 -20912 17354 17923 24321 -32497 -64557 33431 59500 -15489
228 -15489 -38472 -18936 30984 41090 -29455 -25517 12872 -7318 12551 18654 -24896 -9889
240 -9889 8726 14113 27308 -22415 -31059 31094 15419 -16780 -10857 -15458 11074 9984 -23684
253 -23684 8862 9805 -22253 17695 20242 -15515 -1860 802 9587 12528 -27001 -4282 25088
266 25088 -14810 -7298 11840 -6936 6129 -1580 -11838 18326 -4731 -21382 14140 1081
278 1081 -8485 5756 -8812 8212 12244 -15353 12849 12833 -20547 9296 12662 -13928 -3197
291 -3197 -7597 2505 14163 -23199 -8385 22345 -6827 -2192 6879 -10751 10388 6486 -12177
304 -12177 10345 -4833 -12253 19150 285 -11217 5070 -4186 11753 8285 -25770 3349 14967
317 14967 -14527 1077 -556 -11947 9575 -216 -1954 10688 -13060 3280 23956 -10967 -6771
330 -6771 7610 -5149 9222 -2432 -19078 11271 3587 -10865 7322 -5720 -3750 11446 -7907
343 -7907 749 6495 -14862 8698 11314 -16965 3067 8505 -2500 8097 -6901 -3301 15359
356 15359 -8124 -4653 8838 -13412 -492 8798 -12142 1258 818 -8350 14297 1406 -11146
369 -11146 9428 385 916 9344 -12477 -401 10850 -10214 4249 5668 -15458 4526 7648
382 7648 -4445 3488 -9766 -5344 15169 -5830 -7005 5262 -9621 5966 13475 -9810 254
395 254 3490 -3258 14774 451 -14403 3510 -985 2578 8359 -18024 -8179 11949 -457 4815
409 4815 -1883 -17280 10078 15014 -4187 -1939 -9531 -81 19121 -3029 -8512 2402 -8025
422 -8025 8502 14997 -12544 -8154 -762 304 16386 -5099 -22782 2584 8395 7797 3772 -20007
436 -20007 -1790 20790 1446 614 -2038 -14154 8774 12599 -3798 -3278 -14772 -4021 23095
449 23095 879 -15657 -6900 -4458 17580 13839 -22368 -10766 10056 7235 10011 -7919 -14662
462 -14662 9338 6301 4361 7859 -16408 -8857 14276 5080 1717 -10402 -20924 12925 19992
475 19992 -8259 -11796 -9477 8016 22113 -7251 -12892 6307 -2032 5704 11720 -8672 -6379
488 -6379 -3025 110 20817 -486 -25953 -2803 12174 13688 930 -28007 -6001 24097 3628
501 3628 -5739 -5927 -10291 11063 12940 -1627 80 -13722 -5549 24618 6897 -14744 -13574 -7704
515 -7704 21250 17958 -24785 -19066 7979 14526 13462 -14219 -20770 11550 12149 2966 1628 -15956
529 -15956 -4360 15434 5144 3326 -8212 -20740 11383 22299 -4479 -16006 -16351 9054 27104
542 27104 -9832 -22497 3347 5778 9088 5140 -12174 -777 2782 -210 17003 924 -21442
555 -21442 -3183 10191 14412 1816 -29024 -7208 25250 5995 -8639 -11348 -8926 15316 10930
568 10930 -7938 -3498 -8162 512 20453 1933 -11377 -5448 -4370 16764 15347 -19472 -16191
581 -16191 4299 12964 13418 -17119 -23587 12338 15863 865 -6585 -15283 4993 18196 -1968
594 -1968 -2956 -2913 -9671 10533 13241 -5106 -8826 -11266 7678 22399 -10323 -20657 3527 7668
608 7668 7372 -2740 -15482 2919 8576 -2740 5470 -2047 -8594 6309 4685 3417 2920 -13824
622 -13824 -1508 14694 -1813 -5030 -4053 -6141 9414 4006 -9051 196 -2486 -33 10000 -3558
636 -3558 -4915 4282 -4175 3927 9886 -7000 -4234 597 1823 10568 -4988 -14406 5578 5572 -408
651 -408 164 -10899 -700 10448 -3556 -630 1314 -7448 5416 7810 -2388 -36 -5861 350
665 350 14182 -3345 -9920 2277 -1064 4338 3788 -10943 -1751 4269 -1275 5411 -3551 -8880 6698
680 6698 2782 -1002 3812 -6742 -462 9946 -2085 -1137 691 -5669 5715 3512 -6865 908
694 908 -2795 -2396 7705 -4456 -5322 5062 -3488 1570 6214 -5663 229 3634 -1844 6073 -1185
709 -1185 -7271 6144 1175 -2805 3902 -6265 -2046 7111 -4448 -778 1312 -6695 4375 3744
723 3744 -5762 2499 -1186 -1352 8439 -2919 -4230 6053 -2038 1128 4636 -7170 396 3507 -3332
738 -3332 3012 -3011 -6552 7205 -638 -4991 3857 -3685 601 7576 -5039 -577 4162 -2997 4728
753 4728 1357 -6433 5150 1229 -3316 4272 -4925 -2395 6781 -4641 -2507 3107 -4954 2729 2816
768 2816 -5785 3327 1185 -2470 7043 -2298 -4482 7228 -1405 -887 3440 -5698 1840 4126 -6244
783 -6244 1268 182 -4803 5506 -1219 -5405 5287 -1828 -1310 5822 -4994 236 6172 -3506 1939
798 1939 2152 -4556 4973 584 -5497 4412 -2567 -3332 5218 -4706 -2316 4704 -4288 926 3051 -5567
814 -5567 3637 2358 -3943 5118 -740 -3165 6523 -2110 -2743 4532 -3714 309 3363 -5835 1071
829 1071 2224 -4813 3401 -649 -5195 5244 -1208 -2293 5112 -3889 -985 6599 -3032 894 2758
844 2758 -4315 3698 1611 -4835 3203 -2335 -3649 6202 -3041 -4192 3265 -2819 1546 3315 -5842
859 -5842 1773 3335 -3049 4111 -329 -4683 5299 208 -1506 3523 -5290 -947 6147 -3779 -1515
874 -1515 281 -4600 4299 1322 -5450 2860 -1134 -1578 7489 -2416 -4409 4440 -264 2113 2676 -6485
890 -6485 1633 3806 -3510 2730 -1295 -6301 3857 639 -1492 2325 -6267 -17 8640 -3223 -2742
905 -2742 1332 -1344 5525 1060 -5192 3425 -626 -2646 6436 -1673 -5669 1836 -1580 2899 2116
920 2116 -8974 93 5597 -1608 2132 -2248 -4350 7062 1672 -2575 2743 -3949 354 7074 -3319
935 -3319 -2204 554 -3913 4301 2643 -6081 219 -2063 -356 7996 -4196 -7873 4627 3011 2437
950 2437 -260 -7007 4413 5882 -4280 1914 582 -4683 3223 1132 -136 1358 -8624 -1137 10629
965 10629 -2505 -6675 -1513 846 7814 -1027 -8692 4693 3299 -2583 4366 -1252 -3410 2675
979 2675 -1432 3153 3094 -9214 -989 5999 -971 228 -4757 -4747 8397 1776 -4953 644 -2416 2611
995 2611 6749 -4725 -1396 3204 -2370 3426 1649 -4375 1502 -2560 -1432 8448 -3346 -9175 2779
1010 2779 3549 3029 -2320 -8995 5705 7596 -5594 -171 1998 -1154 3169 -827 399 4344 -7413
1025 -7413 -2263 9887 -1195 -6377 -2915 542 8283 -1714 -10367 4019 3900 -2728 2822 -1837
1039 -1837 -1068 3963 -1908 2467 3464 -6920 545 5149 -1478 1205 -3704 -4632 6399 735 -4201
1054 -4201 553 -3362 2293 6330 -5396 -2504 3556 -236 3149 -79 -3606 4464 -616 -3139 6394
1069 6394 -1090 -5664 1126 1085 3315 -1638 -8845 3755 6679 -5148 -1831 1003 227 3404 -2180
1084 -2180 -597 5462 -4203 -1978 7047 -779 -3097 -1442 -502 6076 -1428 -7622 3412 2391 -3272
1099 -3272 1462 -1933 -1701 2802 -1831 1810 2247 -5445 2130 4762 -2703 763 -365 -1626 3971
1114 3971 -1461 -2521 2639 -3469 -796 4513 -3402 -2366 1386 -770 3320 -1013 -4396 4956 1298
1129 1298 -3794 3412 691 -1685 1696 -979 2203 1573 -6187 1719 4312 -4254 -831 492 -1289
1144 -1289 2463 -2778 -1587 4638 -2646 -1843 5017 -474 -1141 1078 -844 3727 -297 -4853 4012
1159 4012 1396 -4273 1646 -311 -1648 1167 -2716 1576 2229 -5564 951 4490 -2772 100 1088
1174 1088 -830 3209 -1660 -1684 4302 -1797 -2313 3587 -1300 -1211 639 -2053 2222 -225 -4637 3342
1190 3342 1165 -3815 2348 333 -1240 2184 -1969 1283 2936 -4467 1145 3890 -3035 10 469
1205 469 -1657 2332 -2442 -2208 4100 -2346 -2590 3547 -1303 -516 917 -1899 3345 611 -3941 3672
1221 3672 2056 -3509 1946 176 -461 1586 -3212 764 2930 -4611 11 2852 -2818 605 388
1236 388 -1488 2898 -1349 -1957 4693 -1275 -1921 3215 -870 203 1227 -2431 2217 514 -4127 2743
1252 2743 684 -3601 1682 -96 -1111 1540 -2533 1007 3218 -3314 986 2976 -2484 1093 931
1267 931 -1102 2823 -1215 -2128 3717 -1845 -2442 2265 -1348 -218 717 -2649 2519 894 -3672 3044
1283 3044 1433 -2297 2075 289 -417 2207 -2443 950 3048 -3438 33 2181 -2297 558 -4
1298 -4 -2188 2497 -1548 -2286 3135 -1348 -1460 2795 -1221 363 1409 -2059 2259 1138 -3321 2118
1314 2118 537 -2284 1895 -1134 -1249 1939 -2097 24 1928 -3064 622 2285 -2154 1287 284
1329 284 -1574 2875 -367 -1400 2718 -1137 -1082 2495 -1585 -237 1036 -2511 1871 269 -3468 1651
1345 1651 368 -2034 1452 -651 -778 2271 -1693 503 2457 -2345 574 2128 -1591 1007 -164
1360 -164 -1748 2423 -635 -2211 1570 -1250 -824 1928 -2031 19 1672 -1741 1599 1051 -2522 1843
1376 1843 914 -1254 1917 -666 -1281 2186 -1179 -400 1202 -2707 527 1537 -2165 699 78 -1914
1392 -1914 2647 -66 -1783 2332 -447 -61 2176 -1793 98 1459 -1807 1301 689 -2716 1067
1407 1067 166 -1260 1458 -1263 -1677 2459 -791 -605 1178 -1990 1341 2093 -2150 1132 848 -1780
1423 -1780 2166 -93 -1315 1799 -1334 -545 2293 -2229 -992 1342 -1583 1123 324 -2911 1843
1438 1843 1273 -1477 1386 -458 -344 2386 -1167 -311 1947 -1799 170 1503 -1524 971 -382 -2019
1454 -2019 2433 174 -2832 1064 -411 628 1810 -2544 219 2942 -1496 570 1289 -1221 1563
1469 1563 -139 -1309 2496 -1550 -2407 2127 -119 -621 -53 -2368 1616 1991 -2961 305 1388 -1087
1485 -1087 1639 -313 -901 2417 -1232 -443 2487 -1438 -612 1074 -1315 1533 -23 -3194 1499 1035
1501 1035 -1863 792 -1579 -440 2872 -1404 -539 2080 -1042 880 1159 -1493 1709 -167 -2297
1516 -2297 2107 359 -1869 447 -861 636 1711 -3291 -84 2495 -1559 77 449 -783 1875
1531 1875 -268 -1288 2835 -738 -1697 1807 -373 390 227 -2711 1476 1778 -2831 283 616 -1377
1547 -1377 1158 -980 -926 2166 -1085 -296 2384 -1527 6 1454 -1135 1190 299 -2199 1071 339
1563 339 -1540 1010 -1331 -1098 2036 -1300 -841 1176 -1128 1070 627 -1835 1743 652 -1354 1827
1579 1827 428 -730 886 -1329 749 1633 -2412 -398 1621 -1319 -52 -127 -1025 1543 -543 -1136
1595 -1136 2512 -367 -892 1927 -103 106 723 -1535 1355 1352 -2576 672 793 -1561 522 -718 -560
1612 -560 1076 -1467 -367 1688 -1649 20 1443 -957 667 377 -1381 1504 31 -1320 1790
1627 1790 -580 -931 1382 -947 -405 838 -1926 575 601 -1902 1016 746 -1359 1055 275 -576 1382
1644 1382 -957 318 1972 -1902 -261 1588 -1062 207 76 -988 1249 -431 -1815 1715 -539
1659 -539 -1430 1292 -341 159 1002 -1493 1242 1549 -2010 893 908 -1117 965 -500 -858 1490 -1521
1676 -1521 -560 1787 -1570 -501 1289 -1204 108 214 -1144 1770 304 -1048 1861 -102 -811 1335
1692 1335 -238 -151 750 -1577 634 690 -1918 732 481 -1682 817 -542 -611 1381 -1203 -281 1856
1709 1856 -1569 106 1893 -918 458 278 -1094 1535 -379 -1502 1506 -456 -1182 897 -950
1724 -950 -301 882 -1703 891 1160 -1875 827 861 -768 1216 -232 -261 1701 -1357 -422 1776 -1502
1741 -1502 -433 832 -1225 474 -115 -1387 1248 -92 -1421 1674 -129 -951 1329 -749 517
1756 517 1121 -1535 1193 1000 -1597 552 487 -1337 569 -547 -718 1137 -1482 -406 1596 -1319
1772 -1319 -205 1043 -778 1079 177 -876 1618 -233 -1183 1624 -110 -923 839 -999 141 631
1788 631 -1661 819 751 -2045 832 808 -1053 695 -364 -112 1419 -1073 -27 1615 -987 -193 988
1805 988 -941 677 -201 -1400 1405 -111 -1449 949 -393 -733 743 -779 369 978 -1146 845
1821 845 831 -1336 955 349 -903 1202 -615 -585 1046 -942 -202 1101 -1451 -334 622 -1082 330
1838 330 -233 -880 1458 -150 -1218 1427 35 -567 1034 -559 482 829 -1321 708 855 -1831
1854 -1831 93 347 -854 696 -924 -763 1265 -909 -527 1399 -849 -79 662 -881 829 35
1870 35 -713 1390 45 -1095 1146 -528 -592 784 -910 -183 810 -1511 685 616 -1361 637 573 -719
1888 -719 1008 -49 -694 1293 -671 -286 1214 -1163 -628 855 -838 326 -176 -1267 1290 247
1904 247 -1404 912 -268 -133 1233 -855 381 1455 -1312 641 987 -1111 665 175 -755 1019
1920 1019 -556 -1250 797 -916 -606 699 -1555 156 989 -941 351 435 -767 1139 37 -1091
1936 -1091 1303 -411 -725 1253 -844 -192 570 -1373 589 520 -1639 249 286 -841 724 -415 -478
1953 -478 1376 -520 -508 1280 -641 272 933 -605 939 188 -1729 1013 -30 -1151 583 -627
1969 -627 6 1314 -1291 -99 1273 -1026 44 902 -919 948 232 -1083 1262 -7 -938 958
1985 958 -547 -67 614 -1610 175 660 -1695 183 283 -789 1059 -423 -649 1141 -487 -399 1269
2002 1269 -658 -5 641 -1012 848 664 -1528 699 41 -746 821 -597 -673 1027 -826 -439 815
2019 815 -747 365 743 -693 949 458 -1177 1194 225 -602 751 -1196 -70 1160 -1233 -880
2035 -880 1014 -729 212 -157 -838 1052 124 -1090 1307 171 -523 817 -159 541 775 -1414 468
2052 468 992 -1250 -233 119 -694 806 -691 -679 1131 -977 -442 953 -518 -31 587 -620 840
2069 840 715 -1061 731 188 -974 762 -406 -473 922 -850 -272 897 -964 514 567 -914 713
2086 713 463 -737 525 92 -444 926 -842 -99 1381 -778 -215 881 -542 120 -146 -936 900
2103 900 -265 -1213 860 -73 -901 453 -451 494 677 -1176 531 1077 -897 448 435 -437 485 -760
2121 -760 -241 753 -570 -572 878 -431 -313 647 -720 341 236 -751 1203 -111 -671 1066 -60 -731
2139 -731 927 -522 -79 348 -1218 481 846 -1137 72 312 -873 178 -693 -185 897 -928 -298
2156 -298 1318 -425 -117 524 -494 379 204 -884 1071 41 -1180 842 -199 -493 402 -744 243
2173 243 603 -1263 -26 971 -758 361 370 -467 481 -358 -518 893 -745 -506 872 -730 -476 362
2191 362 -913 288 268 -709 861 -210 -833 1201 -20 -350 781 -565 269 642 -1207 567 766
2208 766 -1027 169 66 -729 287 -617 -535 1060 -701 -387 928 -175 -270 536 -366 345 324 -929
2226 -929 750 181 -821 883 -365 -368 783 -896 263 501 -1050 -102 718 -835 289 184 -525
2243 -525 724 -352 -439 918 -575 -250 1274 -305 173 596 -457 357 -205 -714 741 -214 -1031 570
2261 570 -272 -463 483 -704 237 732 -755 453 871 -826 381 337 -603 669 -828 -473 1025 -730
2279 -730 -302 830 -486 -258 550 -675 654 -2 -789 824 231 -795 895 -27 -589 641 -310
2296 -310 320 645 -833 83 497 -960 86 155 -304 364 -482 -259 860 -591 -223 910 -430 125
2314 125 785 -609 481 284 -727 786 248 -685 485 -108 -563 399 -660 -227 310 -794 476
2331 476 510 -619 278 371 -388 757 -244 -90 749 -536 -99 770 -483 -335 108 -691 254 -115 -903
2350 -903 595 -234 -969 429 25 -492 507 -45 161 626 -685 -122 436 -673 312 -10 -313 687
2368 687 -218 -513 645 -544 -439 753 -855 30 429 -413 275 354 -604 768 9 -689 622 -351
2386 -351 -333 595 -521 -269 206 -992 249 414 -908 13 280 -237 567 -142 -369 925 -149 -489
2404 -489 1116 -278 144 317 -787 478 35 -496 699 179 -1011 473 -248 -225 746 -627 -201 508
2422 508 -525 219 608 -514 568 204 -297 876 -380 -595 488 -383 -251 261 -828 116 338 -908
2440 -908 -119 -136 -680 676 -193 -546 641 -284 -172 740 -297 54 600 -896 317 319 -826 410 -166
2459 -166 -447 850 -483 -406 896 -476 -253 529 -577 268 317 -458 569 352 -860 776 205 -651
2477 -651 361 -453 -267 776 -460 -267 475 -450 -130 192 -454 433 140 -571 698 80 -53 723 -506
2496 -506 212 439 -819 11 385 -519 204 -77 -477 452 -109 -697 434 -384 -90 639 -289 -67 598
2515 598 -416 399 448 -566 444 64 -265 669 -435 -464 492 -236 -98 39 -496 142 405 -570 444
2534 444 540 -575 499 224 -173 641 -343 -121 703 -485 -175 105 -688 214 129 -919 265 132 -720
2553 -720 354 29 -133 369 -401 155 778 -520 111 520 -692 88 209 -488 399 34 -466 429 -534
2572 -534 -276 359 -321 52 442 -329 364 302 -209 731 74 -374 582 73 -343 478 -320 51 242 -667
2592 -667 -115 377 -616 48 49 -423 297 -261 -374 666 -8 -294 609 -172 -6 488 -125 323 243 -728 352
2613 352 100 -690 323 -132 -275 242 -590 -34 628 -370 -308 460 -493 251 215 -361 831 -167 -360 424
2633 424 -296 -89 551 -376 316 35 -535 44 228 -855 500 309 -773 422 125 -437 361 -274 358
2652 358 576 -785 30 435 -530 3 257 -274 307 -550 -633 448 -369 -42 681 -24 145 189 -245 423
2672 423 551 -609 474 376 -347 417 -292 -469 656 -652 -13 518 -890 -341 97 -560 194 100 -357
2691 -357 754 -328 -278 855 -139 -132 732 -81 -154 524 -393 314 -226 -540 243 98 -709 506 -65 79
2711 79 348 -473 210 477 -546 101 478 -234 114 59 -228 528 -294 -654 630 -375 -704 343 -380
2730 -380 -224 -150 -541 512 240 -493 450 92 -569 502 60 -120 581 -307 52 288 -741 -13 503
2749 503 -433 410 80 -361 365 -386 -308 579 -146 -220 448 -278 280 243 -470 526 -137 -422 412 176 -533
2770 -533 -107 54 -130 -27 -668 -132 576 -671 -150 270 -336 301 86 -86 717 -126 -93 726 -105 -373
2790 -373 411 -316 -111 163 -673 222 598 -946 386 212 -234 218 97 -110 249 -232 95 731 -564
2809 -564 -2 520 -26 59 -45 -356 670 -17 -610 564 -55 -75 61 -361 -128 350 -455 519 605 -554
2829 -554 328 26 -141 287 -74 10 508 -496 11 226 -692 -169 672 -531 -178 283 -185 853 -202
2848 -202 -385 725 -107 -238 183 -149 90 475 -404 138 156 -611 250 -123 -633 135 -146 77 327 -245
2868 -245 -255 522 -373 -94 642 -351 224 183 -441 676 -143 -540 425 -103 -179 377 -403 -166 238 -487 275
2889 275 36 -462 491 355 -365 165 -29 184 590 -310 -59 541 -343 18 85 -311 -32 -136 -616 816
2909 816 -308 -416 358 50 -152 534 -207 -102 463 -559 435 315 -757 306 185 -419 -169 -270 -495
2928 -495 609 -576 -363 357 -549 12 297 -316 573 41 -299 572 -223 -228 711 -341 -204 335 -683
2947 -683 -120 234 -849 25 298 -628 330 122 -372 560 -13 -75 630 -247 -248 756 -536 122 373 -162
2967 -162 221 105 -487 595 -429 -742 234 -448 -61 552 -322 -41 425 -543 350 431 -31 340 -13 -458
2987 -458 614 -249 -252 331 -240 10 281 -445 -132 301 -544 -54 222 -456 490 13 -313 472 -97 -127 363
3008 363 -394 151 265 -522 490 97 -489 -202 246 -429 170 -299 -236 388 -405 105 498 -307 15 153
3028 153 -291 474 207 -457 501 -257 -455 -19 -276 -119 137 -334 -138 146 -465 86 182 -281 435 127
3048 127 -169 469 202 47 733 -204 -140 334 -458 -104 -71 -571 307 36 -394 407 -275 -319 483 -84 192
3069 192 312 -272 24 60 -598 297 470 -335 260 25 -381 62 -143 -347 429 -298 -466 164 -365 -3
3089 -3 551 -638 464 370 -489 293 385 -121 416 -415 -62 290 -406 -16 106 -501 124 103 -708 556 -57
3110 -57 -615 468 91 37 389 -286 42 673 -352 123 438 -601 192 141 -385 432 -294 -415 605 -277
3130 -277 -513 321 -604 88 172 -363 58 295 -246 422 112 -303 281 -67 -299 426 -202 -187 391 -754
3150 -754 99 79 -446 109 427 -467 438 -131 -279 624 -348 -229 815 -523 -111 353 -212 345 -85 -449
3170 -449 307 11 -295 328 -162 4 360 -288 100 242 -477 212 455 -383 498 14 -212 773 -81 14
3190 14 594 -240 -281 438 -262 -265 75 -357 -21 108 -297 217 -331 -354 294 -71 -53 396 100 143 322 -428
3212 -428 334 243 -354 46 400 -346 19 -424 33 368 -161 -248 362 -156 -78 485 -16 245 80 -273 92
3233 92 -112 -306 111 -13 5 155 -393 -6 72 -336 105 171 -473 202 104 -278 379 14 -315 289 -123 56
3255 56 399 -159 -109 139 -402 -48 -60 -368 347 -114 -419 175 -444 -380 19 -63 153 395 -288 97 211 -268
3277 -268 162 112 -262 366 140 -254 232 -307 -32 433 -552 8 157 -340 219 17 -387 506 232 -151
3297 -151 347 219 -225 439 -293 15 59 -414 18 72 -242 28 279 -158 397 -341 -165 174 -48 -40 417
3318 417 -475 154 628 -111 201 -78 -311 93 37 -79 257 -146 -457 286 -260 105 68 -571 305 309 -394
3339 -394 231 287 -213 355 93 -331 184 10 -85 412 -379 -184 14 -393 71 -15 -114 335 39 -61 308
3360 308 -145 -162 578 -209 -127 66 -234 136 28 -286 207 71 -146 -199 -212 -144 143 -62 -243 9 -420 42
3382 42 234 -198 67 304 -356 403 -66 -438 -160 -56 -194 45 -34 139 -147 -223 39 234 -336 179 80
3403 80 -219 303 -239 -243 330 -104 96 321 -209 38 -92 -399 191 93 -427 247 -294 -353 187 -314 -219 212
3425 212 -477 -170 179 -313 310 484 -397 164 -11 6 321 59 -300 338 -21 -201 327 -186 -234 96 -401
3446 -401 279 -130 -334 139 27 -102 303 -136 67 444 -438 -36 217 -308 81 243 -250 103 62 -15 157
3467 157 -13 -175 649 -214 -181 398 -58 -82 -8 -177 320 146 144 349 15 -201 337 -115 -193 274 -277 -45
3489 -45 239 -387 -198 -93 -551 61 -54 -133 338 78 -125 226 -121 -99 287 -129 -18 -142 -338 289 -7
3510 -7 -309 298 -179 -436 275 -342 -10 325 3 -15 54 -402 392 334 -174 175 144 -240 117 -107 -87 15
3532 15 -242 -117 195 -338 253 161 -182 157 189 -295 199 -77 -311 360 75 9 325 -363 -106 -103 -408 247
3554 247 -223 -216 4 205 -256 217 -244 18 200 -125 38 575 -226 81 173 -380 25 182 -463 145 -17
3575 -17 -297 87 -262 -314 623 -320 -35 432 -238 302 205 -111 510 40 -206 425 51 -207 181 24 -96
3596 -96 134 -171 97 429 -244 -126 338 -324 46 -129 30 293 -114 37 338 -432 113 447 -167 314
3616 314 104 -431 253 -302 -86 167 -148 -190 55 36 -373 190 -328 88 305 -285 280 212 -31 292 -65
3637 -65 -160 395 -160 -28 131 -358 -221 178 -414 130 57 -470 272 11 -292 108 70 -214 128 -205 -394
3658 -394 140 -260 56 296 -396 279 70 -181 25 -163 -41 140 -316 210 325 -401 300 97 -108 171
3678 171 139 -450 112 83 -141 132 -306 -174 220 -511 -343 347 -378 2 253 -256 422 -59 -286 279 90
3699 90 -39 391 48 -87 423 -250 -17 120 -401 -179 131 -88 50 24 -192 303 -186 -174 -3 -326 84
3720 84 371 -338 -2 303 -58 501 91 -272 154 30 -375 514 105 -139 87 -175 245 300 -135 156 168
3741 168 125 123 274 21 161 -41 -196 168 -105 -187 41 -254 -125 179 -107 114 -63 -281 330 210 -79
3762 -79 263 -26 -218 305 77 147 2 -179 277 70 -210 104 173 -230 253 -317 3 1 -133 -90 358 -387
3784 -387 147 300 -220 160 -7 81 314 -71 134 301 -130 -194 132 -185 18 53 -260 -123 245 -283 125
3805 125 175 112 246 -113 -285 152 78 -51 437 -170 -112 329 -145 -27 45 -98 141 -37 -127 137 -227 -1
3827 -1 166 -257 -56 72 -88 119 -90 -339 213 69 -61 496 84 62 270 -461 -7 0 -383 84 236 -245
3849 -245 -262 64 19 262 50 -214 416 -44 -97 424 -101 -92 199 -186 314 194 -166 52 -174 -419 239 113
3871 113 95 313 -362 48 277 -245 -57 255 105 251 82 -184 190 51 -197 481 -179 -213 59 -221 -167
3892 -167 298 -129 227 85 -95 213 175 -58 -72 238 -324 128 -165 157 239 -13 22 57 -179 79 -26 -482
3914 -482 195 -106 -104 250 -256 -251 142 -78 123 329 -106 -6 -71 -297 148 177 -297 -55 -135 106 177 -566 -86
3937 -86 72 -245 -267 266 -171 338 154 -159 107 57 -18 294 -63 108 156 -11 58 48 -312 261 189 -33 63
3960 63 -43 -245 306 -143 -147 475 42 71 522 -132 -119 310 -309 168 138 79 331 -208 -56 73 -242 -338 -4
3983 -4 -401 -114 83 -183 250 265 -95 -206 104 -17 45 128 -77 3 -41 -342 103 -44 -166 62 11 0 -11
4006 -11 19 33 -70 -8 86 -121 98 262 -132 11 61 -350 338 -73 -161 -45 -75 -149 154 -30 -64 299 15
4029 15 -132 302 -184 199 300 -362 92 116 -207 132 -125 58 166 -265 -25 62 -260 -92 347 -434 20
4050 20 80 -13 180 1 -86 133 -25 57 197 -149 -155 -116 -18 -1 365 -213 279 87 -10 135 -102 -174 294 78
4074 78 -141 92 -255 229 330 -185 -268 49 -126 102 75 -384 210 40 -18 162 -92 -215 95 -153 -149 135
4096 135 -294 66 40 -284 32 -45 32 59 -58 213 21 -167 163 82 -137 -64 257 -189 -83 -159 26 56 84
4119 84 -36 87 -40 255 161 -153 13 -20 -30 -86 157 -45 -40 120 -187 102 -221 -174 487 -233 -474 311 178
4142 178 277 106 149 172 194 -184 225 -47 175 185 -63 48 20 -68 -106 -43 122 80 153 -185 300 -184 -117 160
4166 160 -142 -67 179 147 357 228 -172 70 177 -219 364 -32 4 40 -84 -340 239 -367 -76 521 -101
4187 -101 267 131 -212 26 -106 -105 96 -147 224 160 -283 -155 -360 -410 -91 -76 -221 104 -21 -120 211 33
4209 33 129 41 -211 -102 115 -158 -61 192 -52 -61 149 -214 131 15 -94 186 -97 32 110 145 -41 64 -42
4232 -42 141 -75 -70 95 34 134 152 -151 -40 57 -198 -99 -66 -66 -20 58 -265 93 171 -137 223 116 -134 71
4256 71 -199 144 99 -28 91 503 29 224 230 -105 -52 190 -113 24 151 -130 82 -25 -69 -61 -167 -120 -183
4279 -183 -104 10 250 85 131 56 -137 168 -72 -284 318 49 -266 -41 93 -35 208 -194 -147 -64 -84 92
4301 92 -201 -233 159 227 -88 104 83 -108 77 -205 -19 6 -260 -106 -151 63 -16 40 -153 -35 58 -22 79
4324 79 -176 97 8 151 270 -146 -126 10 -221 -168 159 -9 -104 -4 -236 -254 -14 -251 -233 -67 -35 76 130
4347 130 -172 -65 -62 -70 153 1 54 69 -226 -215 156 -157 -44 19 -152 180 -81 18 255 -269 -161 43 -229
4370 -229 105 226 -469 305 22 -87 -120 14 -241 178 -110 -149 266 -178 -209 30 53 10 261 30 279 -215
4392 -215 -120 328 -261 -202 29 -481 -226 39 -164 -15 159 -336 91 -121 -99 117 -148 91 -79 130 11
4413 11 -12 -118 -66 82 -23 14 -8 12 111 -146 -430 -384 -130 94 45 -202 -7 -47 -156 295 152 -393 54
4436 54 98 -217 66 158 19 56 112 -129 62 -9 -258 83 -330 -80 43 -239 141 101 32 62 47 103 -137 -109
4460 -109 6 -49 -137 5 -6 105 -13 -388 -149 -35 268 -245 73 -59 58 64 -224 -102 78 75 -27 303
4482 303 -271 -41 -228 -78 405 297 -34 294 -94 -155 -10 -144 193 -95 57 131 114 -376 -25 32 -161
4503 -161 42 -36 60 86 -132 -40 90 -82 36 39 -141 215 -129 -22 -116 111 -157 30 -69 -218 241 -32 27
4526 27 74 -355 -275 14 -154 -83 -68 -240 126 -16 -150 502 -176 -40 294 -228 296 25 36 182 -165 -76
4548 -76 314 11 15 325 24 -126 89 44 294 -149 -33 -225 47 43 -109 204 -73 -58 28 -119 -50 -201 -44
4571 -44 85 -90 223 254 -206 201 75 -72 59 -24 -106 111 -285 -104 39 -325 177 3 -9 151 134 -88
4593 -88 -141 161 -144 52 -441 16 238 -110 31 74 -169 -206 48 -62 -55 -339 -390 -54 -53 168 153 -148 33
4616 33 209 -151 -110 10 -99 -79 35 -97 -39 -125 116 127 -120 -39 -43 58 58 145 -202 121 79 74 50 179 -25
4641 -25 -79 -202 95 79 2 -62 168 -197 115 -245 -89 208 -89 -257 -15 -104 -312 137 178 72 -42 -50 116
4664 116 94 -86 -197 67 -110 135 32 -135 60 -165 -180 -11 -8 9 -72 -149 3 144 82 44 168 224 120
4687 120 46 -236 261 193 -20 100 47 155 26 -440 206 76 -165 38 -224 1 41 -18 7 64 -296 -48
4709 -48 75 38 132 -53 -164 118 40 -140 44 32 -123 151 -69 -75 84 -94 -294 232 -177 -132 99 -63 200
4732 200 297 -46 154 33 -80 -16 -192 29 88 -30 166 93 -17 290 -29 -176 100 199 -122 221 -273 -24
4754 -24 42 -127 -95 192 -327 -47 13 266 -61 144 165 49 -11 -29 35 -22 -117 273 -2 37 372 99 -150 217
4778 217 -66 -21 -221 -143 174 62 -295 40 -279 126 151 -35 -122 100 -20 158 40 -138 19 -79 142 12
4800 12 60 -8 -50 60 135 277 -151 107 132 183 4 -111 -150 -123 92 10 258 -260 115 105 1 260 124 -31
4824 -31 126 -165 -245 26 -66 -71 170 -225 49 -128 54 -104 -48 -181 239 88 -380 13 -45 -171 51 -79
4846 -79 -60 256 -119 33 30 45 312 137 -10 -103 20 133 262 101 -36 240 4 139 149 -21 91 -27
4868 -27 -99 208 36 -184 176 255 -142 83 -209 -50 45 -20 294 273 -146 -32 156 -325 46 154 -102 53
4890 53 -172 108 -111 -156 -186 128 193 265 -7 -64 -10 -148 -26 204 -268 88 283 212 -116 100 -211 -12 22
4913 22 -146 59 -75 -20 -22 -332 -339 -149 69 98 -38 -149 -186 -26 -34 350 -84 -120 189 63 55 -38 160 -163 -111
4938 -111 -249 -190 90 6 -33 -57 134 -67 25 115 -96 33 185 6 80 262 167 152 -108 21 -251 -80 -69
4961 -69 -92 -81 -157 116 157 0 50 299 -12 -37 260 24 129 133 -133 37 67 -171 -233 -29 -181 -89 78 32
4985 32 88 -180 -207 248 -142 -60 193 -118 -18 155 -10 -27 -59 69 -8 87 -174 42 20 -110 -165 -125 150 16
5009 16 -186 15 -54 -306 5 -25 -206 116 -48 20 -59 -219 -74 -131 94 -111 -221 -254 192 -38 -88 333 121
5032 121 -107 -65 -109 -10 -118 22 -57 -54 -160 139 -8 9 308 -55 6 -50 10 105 -20 -77 72 8 -123 139
5056 139 -348 31 -16 -40 -106 125 -68 33 -28 51 267 203 -22 -159 147 -119 163 -276 161 -144 9 35
5078 35 58 -114 -174 9 -203 -34 264 21 10 -74 -14 134 -5 231 149 179 -83 54 -160 131 -32 -212 309
5101 309 132 -215 193 -43 -294 -49 -69 -312 261 -58 -179 -54 -111 -4 177 -107 11 44 -209 -1 -252
5122 -252 -286 -26 1 41 331 -213 -253 234 -213 110 -2 -34 8 35 -204 92 79 330 -140 -39 -120 171 -316
5145 -316 40 -144 -79 108 -53 235 141 -78 -92 345 -5 84 139 104 -63 -16 -342 -282 -113 24 162 -2 127
5168 127 79 42 -85 82 -228 -32 34 -217 90 -87 -89 152 144 -32 61 -108 -101 134 -117 45 231 -1 297
5191 297 39 -215 84 -7 -176 82 -72 14 -67 -160 -93 -46 -245 156 91 -336 409 -19 -293 -30 103 -219
5213 -219 110 234 -239 121 25 -115 -16 -110 63 -29 -314 226 272 343 245 -125 -181 172 61 -173 -84 -67 144
5236 144 352 -96 104 -36 -11 46 -75 160 269 56 -240 -69 29 -190 -17 -141 134 58 -221 166 -25
5257 -25 -54 131 -75 2 256 72 8 54 -167 -68 136 -303 -61 108 -113 43 34 -134 82 221 126 215 -70
5280 -70 476 -211 -20 -149 -173 -15 94 -27 -268 196 -17 -100 139 43 85 130 -28 -446 120 -235 132 23
5302 23 -44 95 -324 39 236 203 31 129 -180 -157 100 64 85 -305 -181 -177 -67 -44 1 -145 23 -265 -355 35
5326 35 121 -78 110 209 -265 -29 53 137 106 393 162 -48 -54 -47 -293 132 -142 74 70 106 261 -94 114 135 -6
5351 -6 24 -76 -313 143 -235 -108 -155 -157 84 128 62 67 209 -231 -104 -188 -472 -85 9 60 -66 -189 -55 -96 248
5376 248 -214 -41 71 -49 -27 -195 278 180 -79 -130 -581 -219 -215 329 -118 63 -76 126 180 69 -32 50
5398 50 7 193 -65 -73 126 120 -165 161 -143 -76 -57 220 -23 -80 -150 36 152 -57 -79 -543 197 43 209 31
5422 31 374 -53 47 17 -247 82 -285 -154 178 -15 64 -22 24 41 187 104 98 75 -106 202 70 8 237 -84
5446 -84 31 255 -149 -78 326 -313 -111 -39 -156 138 92 -103 121 95 78 156 -1 -87 -32 -230 -125 -123 13 -158
5470 -158 -44 -85 -62 117 -243 11 -273 -259 347 70 -277 -88 129 -166 45 5 346 16 22 -132 -75 -83 -197
5493 -197 -143 -241 152 2 -61 -8 90 -24 -69 205 158 316 -255 43 -68 97 176 143 -124 35 79 152 6 -175
5517 -175 206 118 -233 237 -59 217 -68 312 96 -66 -273 -32 121 -306 130 116 -117 98 36 -18 220
5538 220 219 -176 -62 48 102 238 -102 -213 -14 -100 44 -64 250 -27 -100 47 132 -259 212 255 -115 -30 172
5561 172 -179 97 -246 -133 189 -148 -95 271 109 -65 -169 214 208 196 -85 135 132 -47 70 173 -52 -27
5583 -27 -202 -251 -78 -86 107 110 29 -292 -51 -16 15 26 -78 12 63 -38 64 18 275 -11 -248 252 -192 -75
5607 -75 85 -84 -249 -72 -2 -3 -127 183 -268 222 -243 -77 67 -300 127 61 -26 175 -28 -318 -28 96
5629 96 -463 170 -101 -112 65 80 -75 101 -9 152 -101 -19 52 49 -76 74 273 -118 83 94 -156 123 111
5652 111 -71 187 -16 -118 27 -16 63 -129 97 -162 201 75 -111 -193 -23 65 98 145 -32 20 88 4 -88
5675 -88 134 161 -118 204 43 -78 25 -259 29 -88 29 -23 -93 15 344 182 -32 100 46 66 116 -70
5697 -70 10 -82 -45 -42 85 32 61 -14 33 -54 95 62 -191 -74 -163 70 23 107 499 186 64 136 124 -323 251 -317
5723 -317 -76 -204 -131 154 -278 -11 88 3 225 200 -171 292 216 -26 -117 42 -49 -48 2 -337 228 43 36 90
5747 90 -15 288 -449 -70 -196 -58 -93 -56 -164 -190 94 -44 155 206 38 -165 -21 -163 -171 162 -336 -5
5769 -5 -93 -77 173 -10 346 -115 -229 151 298 -12 25 213 -58 23 75 -15 178 -60 25 -75 -166 -167 5 71
5793 71 -33 145 -6 2 99 -83 -29 -122 -63 133 171 -65 -10 -22 118 145 -168 161 -172 -168 -66 -180 19 -50 -115
5818 -115 -72 297 240 -69 67 -206 -29 253 -188 -83 22 -167 211 -250 -192 -102 -109 -73 -69 -35 -85 55 -126 -143
5842 -143 -227 15 -106 -111 -215 239 -50 -46 126 -107 -22 -27 50 -236 82 -47 174 -125 43 184 220 70 210
5865 210 -147 -175 160 44 -82 32 27 -99 235 -25 -102 239 -125 111 -171 -114 -70 306 202 -85 -109 -124 -33
5888 -33 -258 111 5 -120 -23 14 -13 -368 -17 153 -56 -154 178 185 -392 3 -127 -180 64 31 38 258 94 -46
5912 -46 254 84 -23 -298 57 -6 57 -97 145 208 -313 -66 -63 -33 124 -246 -71 91 141 97 221 78 -179
5935 -179 -9 105 9 -59 74 23 -170 -197 -129 -61 3 -94 154 198 -44 -158 229 -86 -111 94 117 -242 52 164
5959 164 -203 -187 -27 -400 663 196 -171 -81 -305 -118 -129 -24 -140 152 -201 92 -242 37 13 -4 -166
5980 -166 64 -111 399 -188 75 275 -189 -227 175 -261 -127 206 42 254 -90 187 116 -116 -231 99 35
6001 35 -66 -2 -157 -211 239 -72 154 71 -265 -63 292 -204 36 -44 1 49 -136 13 -61 -134 74 99 -96
6024 -96 -196 -66 -254 299 106 -41 129 121 -165 172 -18 -162 74 -321 35 -87 18 30 -26 -31 257 197 -32
6047 -32 244 93 -19 -77 35 39 181 -85 -361 98 141 42 35 -63 -70 -141 239 1 179 253 2 -91 -136 144 -54
6072 -54 -82 61 10 -44 -191 -101 359 174 115 123 23 189 -64 176 118 143 32 -100 40 65 -70 -1 193 -82
6096 -82 140 44 -144 -273 199 58 -12 -110 151 -160 260 3 -35 106 151 16 229 342 91 -74 -127 -1
6118 -1 275 -170 -290 142 169 -176 164 -67 151 301 -148 -130 -105 66 -78 104 -183 -75 -153 101 -36 -207
6140 -207 -220 72 -55 -121 -47 -65 54 -12 107 -48 73 -255 202 62 25 115 158 177 -395 144 -51 -163 -41
6163 -41 -156 218 -144 -65 -142 300 -100 -195 -28 -151 225 57 -11 -219 196 80 166 -89 48 -163 152 -182
6185 -182 32 -91 -329 188 56 196 90 -161 -113 109 -133 215 -52 -24 309 -70 80 299 -81 43 -44
6206 -44 -123 146 210 -32 -117 214 118 110 44 -228 -83 53 -103 137 71 -139 123 314 129 -129 -135 46 104 -267
6230 -267 -163 44 -113 -34 -11 -151 51 -14 54 47 19 -160 233 -18 153 -40 -117 71 -125 -193 19 0 7 -29
6254 -29 64 -59 -140 -48 305 -10 -51 27 -175 -117 -137 -76 -193 227 -151 180 30 14 63 79 -41 129 18 -83
6278 -83 76 73 15 281 -22 194 130 -12 -5 11 223 255 -228 48 61 -35 -13 -69 157 -144 182 -100 -59 -42 -30
6303 -30 -68 104 120 -45 -134 -53 -296 -1 -80 177 137 -82 156 -13 -13 388 46 79 -20 -68 91 -112 -95 -43 -233
6328 -233 76 248 -123 -63 -142 72 56 -176 -183 89 -56 58 32 -33 43 -233 280 -26 -80 -102 12 4 -3 -39 16
6353 16 -185 -155 321 -90 34 -31 -89 -221 -15 -139 -80 129 254 129 -142 -8 128 73 111 198 -122 177 169
6376 169 -169 18 206 4 -13 196 64 -45 -184 -11 26 38 -229 -150 -156 -47 90 -103 -267 -70 -74 163 -94
6399 -94 -170 188 -165 199 71 -66 129 256 -238 -50 142 -53 -18 -107 -178 92 -95 -81 18 -30 -73 254 -38
6422 -38 332 73 159 -230 -45 90 129 80 27 154 110 131 35 56 15 1 -271 129 7 -109 241 27 -67 127
6446 127 -43 80 88 -98 79 346 88 23 -105 6 110 -78 -71 138 -64 83 117 -238 24 6 -105 68
6468 68 -193 -175 245 -116 -228 -37 -76 -132 194 -238 30 21 -19 -268 -156 88 173 108 -8 -34 84 -83 -6 -95
6492 -95 160 -167 11 83 94 -313 -91 -40 -68 146 -65 -148 -74 103 -210 75 83 -98 -72 -34 277 -115 124 153
6516 153 88 5 252 78 256 40 -161 104 8 -86 -136 247 129 -39 41 -419 -28 244 58 -271 43 37 -5
6539 -5 41 -83 -52 67 -284 -25 179 23 -421 -8 172 -59 176 -368 61 23 -245 -20 59 -23 101 -35
6561 -35 153 146 144 -28 -213 13 133 -159 245 119 -272 -167 -141 -67 -74 72 145 14 52 287 -82 -12 142 29
6585 29 81 -131 54 145 -159 -123 59 -165 -50 125 -148 90 -58 -320 -99 71 -43 274 70 52 70 100
6607 100 93 -66 -82 -205 25 -61 111 -35 -460 -34 56 126 -388 51 -142 293 -169 -83 -59 -76 224 -16 126
6630 126 144 16 -51 -289 193 -7 37 -71 47 167 -192 51 240 -62 -102 16 20 158 28 -80 115 345
6652 345 236 -79 99 -56 -110 49 -10 86 256 203 -93 95 163 133 -88 52 76 177 219 -153 29 -6 -209
6675 -209 87 164 -4 79 1 -197 -14 148 -29 111 72 9 170 -22 69 303 104 -179 -90 96 236 243 -10
6698 -10 -68 104 -23 394 -232 -8 68 -112 -190 57 -185 -64 -250 -148 -127 176 -23 -60 -31 -206 -52 148
6720 148 -79 -69 126 103 147 -120 -134 -25 120 39 104 157 -115 -180 -75 150 124 -79 -62 49 -154 -50 -100 13
6744 13 51 -42 -236 -99 -295 103 -14 54 12 85 149 -183 -179 100 5 -34 131 115 10 74 -322 -60 66 -41
6768 -41 24 -34 -249 -43 59 40 201 70 -127 -120 205 77 267 22 -14 152 191 47 91 164 -22 -107 -144 176
6792 176 -55 -253 217 50 -277 -30 153 209 -108 -46 206 9 37 -13 25 46 -102 -121 200 262 -201 -83 138
6815 138 -49 119 -82 78 -238 -142 106 -107 39 -131 -50 45 76 74 15 -81 -69 -205 -246 57 100 -85 161 -174
6839 -174 -65 -72 3 71 -28 125 -33 138 107 235 67 -114 -84 -110 -210 -21 -152 -90 71 -3 -135 -208 -29 12
6863 12 -146 -84 233 146 271 -162 79 -134 -41 107 25 -44 161 78 -188 -432 95 27 -84 -156 -91 84 230
6886 230 -35 -42 -31 -8 -164 49 -182 -322 190 -76 178 -51 34 -354 155 -187 118 344 30 -67 -12 81 44
6909 44 -230 -91 88 12 -313 -317 -75 -66 -163 449 31 -37 -65 84 -80 149 -149 9 -129 -199 106 72 92 5
6933 5 -23 -83 60 227 -5 -221 230 176 -28 -28 59 30 197 40 167 -249 97 -260 16 -90 10 176 94
6956 94 52 -75 82 -278 -56 -158 -16 -10 -50 10 153 75 -240 19 -85 106 -54 -61 -49 -40 -150 188 -95 30
6980 30 -106 -124 187 173 -35 123 -169 -66 -98 95 -106 116 128 -50 -114 60 -83 -300 -5 66 8 -90 -54
7003 -54 -83 -8 136 334 30 -127 203 14 30 -134 213 27 173 -104 -87 -269 -90 -12 -27 -119 -91 -388 -128
7026 -128 122 -70 -25 -80 178 -106 177 -55 -135 84 20 151 -76 -348 67 8 60 -241 39 11 -117 -167 -20
7049 -20 -6 29 233 -10 -14 112 124 -45 262 220 -99 50 -213 76 -156 68 163 -137 -25 -99 -167 161 98 74
7073 74 89 -4 67 -98 137 -192 -73 56 -238 -6 -38 84 -114 -156 12 -23 -99 578 -113 -28 99 -208 82
7096 82 202 -105 -114 33 -76 69 25 -10 298 9 -167 80 89 329 80 -52 -132 -118 43 314 -30 5 -97
7119 -97 -191 127 -297 -138 -234 205 65 -202 -79 34 -191 58 -141 -118 28 -190 141 135 74 -137 -28 94
7141 94 42 -24 294 6 49 57 107 68 -145 -367 13 -23 163 79 -78 -67 -43 -221 31 69 -66 -124 -75 76 -60
7166 -60 26 -83 -71 200 -200 -156 40 -143 107 141 -159 -81 -92 64 -204 -153 -392 112 -28 34 144 -82 -65
7189 -65 -94 138 -29 49 30 23 142 -43 -198 -153 72 -21 -31 78 -106 -38 38 -237 -109 17 -39 235 -267 -141
7213 -141 216 65 138 50 -146 91 -129 -16 158 -148 -147 191 121 -138 2 -14 142 -5 245 193 93 169 24
7236 24 84 255 135 114 -47 123 -31 -291 282 3 -4 -72 30 -111 55 65 -144 39 -132 -40 274 233 -27
7259 -27 -123 -71 154 -76 -137 -119 77 -84 213 176 -90 -138 70 114 -70 49 74 197 2 144 -6 199 74
7282 74 168 215 -132 55 48 -28 275 -191 -32 197 66 21 -142 211 16 -10 -83 -4 -69 104 -220 117 -133 333
7306 333 53 74 49 -379 -81 -246 152 111 -23 -7 12 -12 36 -25 74 -334 113 -44 130 26 -55 186 -187
7329 -187 -73 364 192 -60 72 -23 16 -330 -229 -77 115 -234 228 157 89 -19 -190 -84 137 243 21
7350 21 86 -185 233 -69 -71 156 66 16 104 17 -48 150 242 -71 278 -110 -15 79 116 -135 169 -55 -245 -12
7374 -12 106 349 -207 66 -39 109 -91 -24 147 54 64 41 -163 -157 12 -135 146 -116 55 65 -93 299 109
7397 109 -5 106 -60 -74 46 -103 -94 105 -113 -49 90 207 163 44 238 37 -2 5 56 12 -31 45 84 6 -94
7422 -94 -34 316 75 179 -122 -28 268 264 -296 -22 -100 128 -40 165 103 -105 -19 -95 138 -202 107 -19 179
7445 179 196 -40 -169 168 92 -46 -142 -166 79 -111 -153 101 104 -134 275 -91 -98 -116 -214 137 1 -21 48 132 -40
7470 -40 -84 -75 -1 143 -100 201 -138 -188 56 -63 -162 -533 6 102 -206 40 -212 131 16 134 84 -252 -64
7493 -64 313 50 -259 -6 -14 -125 -42 -67 138 -128 23 -12 186 -8 -170 -201 -29 -16 -61 -104 -30 -29 91 -17
7517 -17 58 179 -2 1 144 190 -181 61 94 -19 118 -116 82 72 -42 23 302 -26 39 -92 -208 104 -226
7540 -226 118 -43 -110 -161 37 318 -13 133 -163 -162 -71 67 -151 -203 -108 63 -64 -63 143 193 144 93 24 27 79
7565 79 -112 -207 -14 104 -336 121 -155 -206 103 -86 22 17 191 -154 -42 -116 -119 50 -87 -75 -65 -277 50
7588 50 16 -20 -4 98 -22 74 -184 209 -107 209 -176 32 21 -191 -33 -8 -459 1 154 191 3 49 71
7611 71 -328 43 18 -57 71 176 -133 80 14 -143 38 -208 56 -52 -57 -221 -136 37 -93 -215 53 223
7633 223 -42 126 13 -145 -243 133 -88 235 129 44 50 -19 -24 55 267 159 -284 -49 -217 8 80 -70 -31
7656 -31 -141 52 128 -87 -176 37 -73 -131 64 -57 46 -134 115 117 -167 106 -59 -13 -215 332 48 57 -172
7679 -172 68 -87 13 39 -55 48 -82 -284 -222 184 -114 72 -126 131 -100 139 -103 -26 -89 63 121 -70
7701 -70 -70 -199 -103 -147 143 -73 -348 -113 -13 362 100 247 168 -7 -181 -110 168 -370 -120 50 70 -128 49
7724 49 -129 -110 194 -158 -87 -104 57 -74 33 144 77 45 -77 -147 -100 -36 -149 -31 203 -9 241 -16 -355
7747 -355 -25 116 -122 152 -1 -12 -9 133 -132 24 -1 -136 82 -142 152 -106 124 -118 -77 -234 23 99
7769 99 -121 -12 -30 161 59 10 56 138 14 -130 -110 -22 -52 -105 -329 -71 -114 135 -194 213 34 -4 -312 -246
7793 -246 33 58 -135 -269 117 -43 33 79 29 -108 -43 141 -21 -44 109 110 65 -136 -34 64 -137 -175 -152 -283
7817 -283 -416 160 69 -72 41 234 -112 82 60 -306 85 27 -86 -185 -72 49 -50 -255 -59 -368 155 -81
7839 -81 39 0 -89 -38 -29 241 94 -123 89 -77 296 52 -213 43 -14 -156 -53 -280 158 30 27 77 -19 -68
7863 -68 111 16 -95 152 -154 64 193 84 -33 345 65 -9 -92 -20 53 77 -17 34 -35 50 -194 -148 30 -107
7887 -107 191 196 33 -88 -57 -63 -31 -113 -123 58 114 -274 110 216 206 -34 -107 -63 16 65 -23 331 -55 -258 113
7912 113 -115 165 75 44 184 283 -57 5 -185 46 26 24 130 149 -264 -92 113 57 210 45 162 -51 -44 -137
7936 -137 -28 -120 -31 -53 -83 17 80 101 110 165 -108 -15 -123 -69 3 49 54 -139 187 -187 -230 178 267 -59 -118 -1
7962 -1 73 148 9 -171 -118 -149 68 76 -90 13 -200 28 199 -133 -124 -102 260 -25 -50 -24 70 -311 -169 -15 -102
7987 -102 110 -66 114 55 -190 123 -29 181 -198 29 -17 -75 87 -88 52 -127 -99 -138 51 -81 -120 -284
8009 -284 182 -41 48 158 -79 -245 136 63 -91 48 135 248 -177 -204 -151 -88 -13 143 -217 136 -58 -115 -296
8032 -296 -14 193 -129 -154 117 33 -171 -116 -112 43 -33 325 137 -78 -40 -43 -194 181 -47 -172 232 18 -60
8055 -60 -146 -165 139 104 308 -67 10 -142 307 101 -73 -173 3 34 -459 -191 0 72 70 -214 -32 -174 155
8078 155 1 74 35 331 -170 -152 -50 495 95 116 21 -10 -6 -1 210 180 -211 122 -124 -9 -220 -92 70 226
8102 226 25 -23 17 -148 182 189 93 -23 36 190 132 -346 -222 74 138 -141 -74 -57 32 -84 -105 -73 -131 -231 212
8127 212 -48 -331 -197 -10 215 -182 -154 264 97 0 -12 -145 -246 -307 17 125 -40 -118 -35 81 173 -22
8149 -22 80 -64 1 -76 -203 257 -141 191 -85 10 -120 374 -58 132 -26 20 -46 -42 -115 233 -88 -77 63
8172 63 -245 165 70 178 4 -81 136 -10 115 210 -209 -182 67 -174 -178 130 -184 324 8
8191H
##END NTUPLES=NMR FID
##END=
