##TITLE=1H_Pr 5296
 200.13MHz, CDCl3,
 8 sc
 
 26.3.2025
##JCAMPDX= 6.0         $$ Bruker NMR JCAMP-DX V2.0
##DATA TYPE= NMR FID
##DATA CLASS= NTUPLES
##ORIGIN= UXNMR, Bruker Analytische Messtechnik GmbH
##OWNER= pz
$$ XWIN-NMR		Version 3.5
$$ Wed Mar 26 15:04:51 2025 Russian Standard Time (UT+4h)  she@DPX200
##.OBSERVE FREQUENCY= 200.1313
##.OBSERVE NUCLEUS= ^1H
##.DELAY= (6, 6)
##.ACQUISITION MODE= SIMULTANEOUS
##.ACQUISITION SCHEME= undefined
##.AVERAGES= 8
##.DIGITISER RES= 18
##SPECTROMETER/DATA SYSTEM= spect
##.PULSE SEQUENCE= zg30
##.SOLVENT NAME= CDCl3
##.SHIFT REFERENCE= (INTERNAL, CDCl3, 0, 14.3821)
##AUDIT TRAIL= $$ (NUMBER, WHEN, WHO, WHERE, WHAT)
$$ ##TITLE= Audit trail, XWIN-NMR		Version 3.5
$$ ##JCAMPDX= 5.01
$$ ##ORIGIN= Bruker BioSpin GmbH
$$ ##OWNER= she
$$ F:/spectra/data/she/nmr/H-C/1/audita.txt
$$ ##AUDIT TRAIL=  $$ (NUMBER, WHEN, WHO, WHERE, WHAT)
(   1,<2025-03-26 15:02:54.92 +0400>,<she>,<DPX200>,
      <created by zg, POWCHK disabled, PULCHK disabled
       configuration hash MD5:
       00 E9 B6 7A A2 85 ED C7 34 08 36 98 17 FE 4E 26
       data hash MD5: 16K
       59 EA 15 E1 68 1B EB 95 35 1B 07 3C 90 C1 FF 1D>)
$$ ##END=
$$ 
$$ hash MD5
$$ 7A CF BE 2C B1 0C ED 43 B5 4B 2C A9 E5 A9 BF 12
##$RELAX= 
##$RELAX= 
##$RELAX= 
##$RELAX= 
##$RELAX= 
##$RELAX= 
$$ Bruker specific parameters
$$ --------------------------
##$DU= <F:/spectra>
##$EXPNO= 1
##$NAME= <H-C>
##$PROCNO= 1
##$TYPE= <nmr>
##$USER= <she>
##$AMP= (0..31)
100 100 100 100 100 100 100 100 100 100 100 100 100 100 100 100 100 100 
100 100 100 100 100 100 100 100 100 100 100 100 100 100 
##$AQSEQ= 0
##$AQ_mod= 1
##$AUNM= <au_zg>
##$AUTOPOS= <>
##$BF1= 200.13
##$BF2= 200.13
##$BF3= 200.13
##$BF4= 200.13
##$BF5= 200.13
##$BF6= 200.13
##$BF7= 200.13
##$BF8= 200.13
##$BYTORDA= 1
##$CFDGTYP= 0
##$CFRGTYP= 5
##$CHEMSTR= <none>
##$CNST= (0..31)
1 1 145 1 1 1 1 1 1 1 1 1 1 1 1 1 1 1 1 1 1 1 1 1 1 1 1 1 1 1 1 1 
##$CPDPRG= <>
##$CPDPRG1= <>
##$CPDPRG2= <>
##$CPDPRG3= <>
##$CPDPRG4= <mlev>
##$CPDPRG5= <mlev>
##$CPDPRG6= <mlev>
##$CPDPRG7= <mlev>
##$CPDPRG8= <mlev>
##$CPDPRGB= <>
##$CPDPRGT= <>
##$D= (0..31)
0 0.7 0 0 0 0 0 0 0 0 0 0.03 0 0 0 0 0 0 0 0 0 0 0 0 0 0 0 0 0 0 0 0 
##$DATE= 1742986974
##$DBL= (0..7)
120 120 120 120 120 120 120 120 
##$DBP= (0..7)
150 150 150 150 150 150 150 150 
##$DBP07= 0
##$DBPNAM0= <>
##$DBPNAM1= <>
##$DBPNAM2= <>
##$DBPNAM3= <>
##$DBPNAM4= <>
##$DBPNAM5= <>
##$DBPNAM6= <>
##$DBPNAM7= <>
##$DBPOAL= (0..7)
0.5 0.5 0.5 0.5 0.5 0.5 0.5 0.5 
##$DBPOFFS= (0..7)
0 0 0 0 0 0 0 0 
##$DE= 6
##$DECBNUC= <off>
##$DECIM= 32
##$DECNUC= <off>
##$DECSTAT= 4
##$DIGMOD= 1
##$DIGTYP= 9
##$DL= (0..7)
0 120 120 120 120 120 120 120 
##$DP= (0..7)
150 150 150 150 150 150 150 150 
##$DP07= 0
##$DPNAME0= <>
##$DPNAME1= <>
##$DPNAME2= <>
##$DPNAME3= <>
##$DPNAME4= <>
##$DPNAME5= <>
##$DPNAME6= <>
##$DPNAME7= <>
##$DPOAL= (0..7)
0.5 0.5 0.5 0.5 0.5 0.5 0.5 0.5 
##$DPOFFS= (0..7)
0 0 0 0 0 0 0 0 
##$DQDMODE= 0
##$DR= 18
##$DS= 0
##$DSLIST= <SSSSSSSSSSSSSSS>
$$ [...]
##$SUBNAM0= <"">
##$SUBNAM1= <"">
##$SUBNAM2= <"">
##$SUBNAM3= <"">
##$SUBNAM4= <"">
##$SUBNAM5= <"">
##$SUBNAM6= <"">
##$SUBNAM7= <"">
##$SUBNAM8= <"">
##$SUBNAM9= <"">
##$SW= 18.0517328524113
##$SWIBOX= (0..15)
0 0 2 0 0 0 0 0 0 0 0 0 0 0 0 0 
##$SW_h= 3612.71676300578
##$TD= 16384
##$TD0= 1
##$TE= 0
##$TE2= 300
##$TE3= 300
##$TEG= 300
##$TL= (0..7)
0 120 120 120 120 120 120 120 
##$TP= (0..7)
150 150 150 150 150 150 150 150 
##$TP07= 0
##$TPNAME0= <>
##$TPNAME1= <>
##$TPNAME2= <>
##$TPNAME3= <>
##$TPNAME4= <>
##$TPNAME5= <>
##$TPNAME6= <>
##$TPNAME7= <>
##$TPOAL= (0..7)
0.5 0.5 0.5 0.5 0.5 0.5 0.5 0.5 
##$TPOFFS= (0..7)
0 0 0 0 0 0 0 0 
##$TUNHIN= 0
##$TUNHOUT= 0
##$TUNXOUT= 0
##$USERA1= <user>
##$USERA2= <user>
##$USERA3= <user>
##$USERA4= <user>
##$USERA5= <user>
##$V9= 5
##$VALIST= <valist>
##$VCLIST= <CCCCCCCCCCCCCCC>
##$VD= 0
##$VDLIST= <DDDDDDDDDDDDDDD>
##$VPLIST= <PPPPPPPPPPPPPPP>
##$VTLIST= <TTTTTTTTTTTTTTT>
##$WBST= 1024
##$WBSW= 4
##$XGAIN= (0..3)
0 0 0 0 
##$XL= 0
##$YL= 0
##$YMAX_a= 288175
##$YMIN_a= -383510
##$ZGOPTNS= <>
##$ZL1= 120
##$ZL2= 120
##$ZL3= 120
##$ZL4= 120
##$ABSF1= 10
##$ABSF2= 0
##$ABSG= 5
##$ABSL= 3
##$ALPHA= 0
##$AQORDER= 0
##$ASSFAC= 0
##$ASSFACI= 0
##$ASSFACX= 0
##$ASSWID= 0
##$AUNMP= <proc_1d>
##$AZFE= 0.1
##$AZFW= 0.1
##$BCFW= 1
##$BC_mod= 2
##$BYTORDP= 1
##$COROFFS= 0
##$CY= -3
##$DATMOD= 1
##$DC= 2
##$DFILT= <>
##$DTYPP= 0
##$F1P= 0
##$F2P= 0
##$FCOR= 0.5
##$FTSIZE= 0
##$FT_mod= 4
##$GAMMA= 1
##$GB= 0.15
##$INTBC= 1
##$INTSCL= 1
##$ISEN= 128
##$LB= 0.25
##$LEV0= 0
##$LPBIN= 0
##$MAXI= 10000
##$MC2= 0
##$MEAN= 0
##$ME_mod= 0
##$MI= 1.114404
##$NCOEF= 0
##$NC_proc= 0
##$NLEV= 6
##$NOISF1= 3.799351
##$NOISF2= 2.8
##$NSP= 1
##$NTH_PI= 0
##$NZP= 0
##$OFFSET= 14.38212
##$PC= 1
##$PHC0= -467.1934
##$PHC1= 11.39221
##$PH_mod= 1
##$PKNL= yes
##$PPARMOD= 0
##$PSCAL= 0
##$PSIGN= 0
##$REVERSE= no
##$SF= 200.129724274929
##$SI= 16384
##$SIGF1= 3
##$SIGF2= 2
##$SINO= 400
##$SIOLD= 16384
##$SREGLST= <1H.CDCl3>
##$SSB= 0
##$STSI= 0
##$STSR= 0
##$SW_p= 3205.1282051282
##$SYMM= 0
##$S_DEV= 0
##$TDeff= 0
##$TDoff= 0
##$TI= <>
##$TILT= no
##$TM1= 0
##$TM2= 0
##$TOPLEV= 0
##$USERP1= <user>
##$USERP2= <user>
##$USERP3= <user>
##$USERP4= <user>
##$USERP5= <user>
##$WDW= 1
##$XDIM= 8192
##$YMAX_p= 0
##$YMIN_p= 0
$$ End of Bruker specific parameters
$$ ---------------------------------
##NTUPLES= NMR FID
##VAR_NAME=  TIME,          FID/REAL,        FID/IMAG
##SYMBOL=    X,             R,               I
##VAR_TYPE=  INDEPENDENT,   DEPENDENT,       DEPENDENT
##VAR_FORM=  AFFN,          ASDF,            ASDF
##VAR_DIM=   8192,          8192,            8192
##UNITS=     SECONDS,       ARBITRARY UNITS, ARBITRARY UNITS
##FACTOR=    0.0002768,     1,               1
##FIRST=     0,             0,               0
##LAST=      2.2672688,     0,               0
##MIN=       0,             -383510,         0
##MAX=       2.2672688,     288175,          0
$$ Real data points
##PAGE= N=1
##DATA TABLE= (X++(R..R)), XYDATA
$$ plain form
0 0 0 0 0 0 0 0 0 0 0 0 0 0 0 0 0 -6 8 -8 8 -8 9 -16 16 -16 21 -24 28 -32 36 -43 46 -53 60 -68 76 -86 96 -105
38 -105 119 -131 147 -161 178 -197 218 -240 264 -291 320 -353 389 -429 472 -523 580 -646 718 -808
58 -808 913 -1041 1197 -1396 1660 -2025 2550 -3384 4852 -7943 17006 -97345 -383510 -13629
72 -13629 235183 32427 45468 271043 168013 -60961 -60645 -27635 -33969 81984 77560 -104001
84 -104001 -71338 20523 -187736 -239278 91217 163135 -97982 -62791 149135 24380 -135996
95 -135996 30778 120531 5834 67182 128738 -77604 -137575 54875 49058 -77975 17568
106 17568 98817 -31205 -68417 21736 -30322 -51883 98740 58481 -124902 -26359 92740
117 92740 -90630 -141492 88656 86430 -128580 -63074 127426 48516 -54449 37818 59904
$$ packed form
0@%%%%%%%%%%%%%%%oJ4j6J6j6J7k5L2l2L7m5N2o0O8p9Q9r9J13j28J44j62J82k01
38a05K24k50K78l08L39l75M15m58N04n55O11o73P42q18R01r95J103j226J364j526
58h08J721j954K238k593L056l685M575n934Q236j2795K4949j14351k86165L69881
72a3629K48812k02756J3041K25575j03030k28974L16L3010o334J15953m424j81561
84a04001L2663R1861k08259n1542L30495P1918k61117L5191K11926j24755j60376
95a35996J66774Q9753j14697O1348O1556k06342n9971J92450n817j27033R5543
106A7568Q1249j30022l7212R0153n2058k1561J50623m0259j83383R8543J19099
117I2740j83370n0862K30148k226k15010O5506J90500p8910j02965R2267K2086
$$ plain form
128 59904 16201 80102 48770 -67793 26312 115972 -74827 -176249 17641 71677 -109314
139 -109314 -104690 38270 -19311 -87758 13976 33757 -6183 84224 96451 -30666 8185
150 8185 131908 27743 -92756 43153 117112 -57922 -115307 3123 -11426 -74899 -23492
161 -23492 -18571 -45864 34847 45552 -79011 -47956 119291 73855 -72150 13556 114034
172 114034 -8376 -69300 26641 26540 -23956 12340 543 -57009 1917 53245 -45582 -65923
184 -65923 72213 61479 -82488 -37208 74503 6966 -56482 -350 8625 -18437 14417 5724
196 5724 -50132 5082 79652 -9978 -69207 55563 90296 -35084 -37604 55098 25590 -37712
208 -37712 -15797 -3974 -22878 169 -3606 -61966 -27408 52545 -11103 -75115 29502 85317
$$ packed form
128E9904m3703O3901l1332j16563R4105Q9660j90799j01422J93890N4036j80991
139a09314M624J42960n7581o8447J01734J9781l9940R0407J2227j27117L8851
150H185J23723j04165j20499J35909P3959j75034n7385J18430j4549o3473N1407
161b3492M921k7293Q0711J0705j24563L1055J67247m5436j46005Q5706J00478
172A14034j22410o0924R5941j01n0496L6296j1797n7552N8926N1328r8827k0341
184f5923J38136j0734j43967M5280J11711o7537o3448N6132Q975k7062L2854q693
196E724n5856N5214P4570q9630n9229J24770L4733j25380k520R2702k9508o3302
208c7712K1915J1823j8904K3047l775n8360L4558P9953o3648o4012J04617N5815
$$ plain form
220 85317 -11141 -34097 44888 44203 -8898 2126 19397 -1298 10865 10455 -51816 -41461 36399
233 36399 634 -67726 -5514 49015 -15636 -47869 12612 33127 317 9616 21317 -4462
245 -4462 9352 26189 -24805 -28067 41151 26652 -44413 -24264 29302 -206 -38931 -3665
257 -3665 24558 3377 -1190 -2822 -19752 6413 29333 -14105 -24621 31064 28658 -35399 -32149
270 -32149 27660 22702 -21801 -8799 17730 3971 -4206 -6489 -11899 13021 26433 -11712 -27618
283 -27618 12671 25188 -19319 -28016 19317 22886 -17056 -16617 5191 6552 4415 -3893 -11340 7208
297 7208 19872 -4696 -22765 5275 29063 -2932 -26858 3904 20551 -3336 -15615 -5198
309 -5198 9486 9895 -10071 -17711 3975 20111 2301 -20142 -1557 25252 4639 -21361 -3066
$$ packed form
220H5317r6458k2956P8985o85n3101J1024J7271k0695J2163m10o2271J0355P7860
233C6399l5765o8360O2212N4529o4651l2233O0481K0515l2810R299J1701k5779
245d462J3814J6837n0994l262O9218j4499p1065K0149N3566k9508l8725L5266
257c665K8223k1181m567j632j6930K6165K2920m3438j0516N5685k406o4057L250
270c2149N9809m958m4503J3002K6529j3759q177k283n410K4920J3412l8145j5906
283b7618M0289J2517m4507q697M7333L569l9942M39K1808J361k137q308p447J8548
297G208J2664k4568j8069K8040K3788l1995k3926L0762J6647k3887j2279J0417
309e198J4684M09j9966p640K1686J6136j7810k2443J8585K6809k0613k6000J8295
$$ plain form
322 -3066 20496 10883 -13946 -16919 5844 12215 -10218 -18637 328 15526 2043 -19945 -7943
335 -7943 19457 15321 -6595 -6922 14833 22115 -4817 -19765 6341 19579 -4124 -21769 -10691
348 -10691 5885 -1465 -20364 -15933 5798 14485 -1413 -17081 3895 31058 10035 -14730 8787
361 8787 30523 9056 -16374 -7938 10027 3162 -14138 -18490 -9022 5584 -1803 -28060 -14366
374 -14366 23729 11634 -19596 -2891 27716 15485 -10126 -905 16952 10774 1028 -6524 -10655
387 -10655 6353 10346 -20135 -20866 15837 14355 -20938 -17317 15993 10944 -13405 -5036 7920
400 7920 1736 2634 -2336 -16096 2229 20769 -5919 -21031 12674 26525 -8179 -15574 18696
413 18696 19497 -5672 -1367 4248 -5021 1924 -1658 -24464 -13304 13439 -6927 -34767 -5518
$$ packed form
322c066K3562r613k4829k973K2763O371k2433q419J8965J5198j3483k1988J2002
335g943K7400m136k1916l27K1755P282k6932j4948K6106J3238k3703j7645J1078
348a0691J6576p350j8899M431K1731Q687j5898j5668K0976K7163k1023k4765K3517
361H787K1736k1467k5430Q436J7965o865j7300m352R468J4606p387k6257J3694
374a4366L8095j2095l1230J6705L0607j2231k5611R221J7857o178r746p552m131
387a0655J7008L993l0481p31L6703j482l5293L621L3310n049k4349Q369J2956
400G920o184Q98m970j3760J8325J8540k6688j5112L3705J3851l4704p395L4270
413A8696Q01k5169M305N615r269O945l582k2806J1160K6743k0366k7840K9249
$$ plain form
426 -5518 23954 -4801 -18971 16552 24585 3578 8784 13869 5201 14798 15481 -12514 -14084 14774
440 14774 1781 -38218 -20257 14898 -10711 -32396 -1910 9293 -5939 1840 9661 1966 13616
453 13616 25949 1306 -9469 24078 22666 -22829 -14455 22549 -443 -29353 -6425 5570
465 5570 -10835 -7423 740 -10307 -1521 18931 -2389 -21682 15335 27259 -17080 -16868 22720
478 22720 10523 -17819 -958 12301 -3234 -884 10117 -4852 -4647 19962 3867 -24312 5815
491 5815 23766 -17446 -26383 10839 7203 -22553 -12048 6474 -5056 -3601 10838 -3926 -5072
504 -5072 27191 17839 -16119 7012 33822 9 -19909 9173 11551 -19027 -14109 2337 -14079
517 -14079 -16193 2635 -10459 -17847 14402 13773 -18371 655 34627 9559 -15979 12972 25448
$$ packed form
426e518K9472k8755j4170L5523Q033k1007N206N085q668R597O83k7995j570K8858
440A4774j2993l9999J7961L5155k5609k1685L0486J1203j5232P779P821p695J1650
453A3616J2333k4643j0775L3547j412m5495Q374L7004k2992k8910K2928J1995
465E570j6405L412Q163j1047Q786K0452k1320j9293L7017J1924m4339K12L9588
478B2720j2197k8342J6861J3259j5535K350J1001j4969K05K4609j6095k8179L0127
491E815J7951m1212q937L7222l636k9756J0505J8522j1530J455J4439j4764j146
504e072L2263r352l3958K3131K6810l3813j9918K9082K378l0578M918J6446j6416
517a4079k114J8828j3094p388L2249o29l2144J9026L3972k5068k5538K8951J2476
$$ plain form
530 25448 -4332 -6596 8449 -7000 -9671 8621 -9188 -25720 4512 13641 -19938 -16059 19567
543 19567 8348 -17687 4330 19587 -5438 -5404 13290 -821 -6533 11240 -267 -17856 6787
556 6787 19436 -14371 -18397 19855 15083 -18619 -4611 15538 -2612 -6137 6405 -7266 -12255
569 -12255 9886 3473 -22110 -4347 19619 -5613 -18345 14452 16855 -11498 841 19938
581 19938 1784 -4341 9557 469 -9132 8305 4397 -23706 -10550 17709 -6398 -28171 3004
594 3004 15765 -9004 -7254 10225 2712 794 14014 4475 -8797 10451 15839 -13170 -10732
607 -10732 16973 872 -22473 -262 12092 -11084 -12651 6442 2402 -5478 5442 2010 -10110
620 -10110 7901 16870 -11495 -12513 18143 9385 -17431 -4314 13058 -1615 -7357 5469 550
$$ packed form
530B5448k9780k264J5045j5449k671J8292j7809j6532L0232R129l3579L879L5626
543A9567j1219k6035K2017J5257k5025L4J8694j4111n712J7773j1507j7589K4643
556F787J2649l3807m026L8252m772l3702J4008K0149j8150l525J2542j3671m989
569a2255K2141o413k5583J7763K3966k5232j2732L2797K403k8353J2339J9097
581A9938j8154o125J3898r088r601J7437l908k8103J3156K8259k4107k1773L1175
594C004J2761k4769J750J7479p513j918J3220r539j3272J9248N388k9009K438
607a0732K7705j6101k3345K2211J2354k3176j567J9093m040p880J0920l432j2120
620a0110J8011Q969k8365j018L0656q758k6816J3117J7372j4673n742J2826m919
$$ plain form
633 550 -7119 7729 5809 -12719 841 15770 -7292 -15038 10591 8257 -15608 -6893 11611
646 11611 -146 -10185 2941 2749 -4422 8067 6820 -10562 1789 18592 -1706 -14751 7317
659 7317 13047 -9417 -9732 6486 -884 -9522 1464 111 -8903 3262 6719 -8915 -3201 14445
673 14445 2844 -11134 5307 14798 -4237 -7867 7945 3368 -6260 1627 -478 -8490 2342
686 2342 6434 -9486 -8416 10488 5084 -12320 -1679 12065 -956 -6663 5439 3348 -3459
699 -3459 3361 2164 -6360 1905 8026 -5359 -9239 7931 6635 -11234 -4515 9872 461 -7277
713 -7277 1695 2226 -2267 2400 1735 -5831 378 8860 -2611 -9809 5588 9079 -7101 -5405 7269
728 7269 2183 -4826 375 1550 -1752 1691 2115 -5608 -1729 8095 -425 -9823 2989 8808 -4488
$$ packed form
633E50p669J4848j920j8528J3560J4929k3062p746K5629k334k3865Q715J8504
646A1611j1757j0039J3126j92p171J2489j247j7382J2351J6803k0298j3045K2068
659G317N730k2464l15J6218p370q638J0986j353r014J2165L457j5634N714J7646
673A4445j1601j3978J6441R491j9035l630J5812m577r628P887k105q012J0832
686B342M092j5920J070J8904n404j7404J0641J3744j3021n707J2102k091o807
699c459O820j197q524Q265O121j3385l880J7170j296j7869O719J4387r411p738
713g277Q972N31m493M667o65p566O209Q482j1471p198J5397L491j6180J696J2674
728G269n086p009N201J175l302L443M24p723L879R824q520r398J2812N819j3296
$$ plain form
743 -4488 -6051 4566 3329 -2616 -613 969 -1182 1753 2679 -5075 -3057 7681 1470 -8722 61
758 61 7611 -1782 -6256 1787 3827 -1231 -1422 554 -920 2100 3451 -3795 -2908 6868 2957 -6959
774 -6959 -1650 6115 501 -5686 -676 2905 -1134 -1878 -766 -1977 1158 3677 -2993 -3092 5237 4515
790 4515 -3479 -1881 5573 3365 -3374 -1558 2149 149 -1146 -1806 -3532 -129 2083 -3741 -4720 2362
806 2362 4131 -2082 -2783 3965 4913 -842 -593 2620 2309 1317 -812 -2488 767 2012 -2573 -4938
822 -4938 -362 2570 -2153 -4596 378 3048 -301 -1313 489 2011 2794 340 -1465 1298 2867
837 2867 382 -2967 -721 2899 517 -3392 -1439 1829 911 -1659 -2335 795 2323 -948 -2669 -362
853 -362 2200 987 -2527 -1703 2538 2007 -1710 -1674 2009 3500 121 -2205 1650 3485 -114 -2289
$$ packed form
743d488j563J0617j237n945K003J582k151K935R26p754K018J0738o211j0192Q783
758F1P550r393m474Q043K040n058j91J976j474L020J351p246Q87R776l911r916
774f959N309P765n614o187N010L581m039p44J112j211L135K519o670r9Q329p22
790D515p994J598P454k208o739J816L707k000j295o60j726L403K212n824r79P082
806B362J769o213p01O748R48n755K49L213l11r92k129j676L255J245m585k365
822d938M576K932m723k443M974K670l349j012J802J522P83k454j805K763J569
837B867k485l349K246L620k382l909J953L268r18k570o76L130J528l271j721K307
853c62K562j213l514Q24M241n31l717L6L683J491l379k326L855J835l599k175
$$ plain form
869 -2289 -473 1419 230 -3149 -3097 -366 512 -1626 -3564 -416 3363 386 -2648 1305 4542 1964
885 1964 -506 934 2944 1759 -951 -1495 -858 559 -569 -4513 -3023 1714 -376 -4289 -1506 2745
901 2745 1349 -1163 385 2540 2128 1101 631 -167 2163 2476 -2573 -3068 2063 1236 -3726 -2538 1824
918 1824 615 -2638 -1002 921 440 866 170 -1813 1136 3198 -1639 -3334 1738 2800 -2079 -2717
934 -2717 2147 2023 -1569 -7 1169 5 1308 810 -2267 -406 2932 -1118 -4434 -99 2604 -2421
950 -2421 -3894 996 1576 -1532 211 1373 282 2111 2573 -912 -245 3912 1523 -3602 -641 3413
966 3413 -1394 -4417 92 608 -2235 -869 49 -1643 774 2409 -834 -1442 3514 3265 -2701 -948
982 -948 4195 620 -3159 463 1115 -1608 -552 193 -1998 -481 2517 -732 -3300 2105 3723 -2918
$$ packed form
869b289J816J892j189l379N2K731Q78k138j938L148L779k977l034L953L237k578
885A964k470J440K010j185k710n44O37J417j128l944J490M737k090l913K783M251
901B745j396k512J548K155m12j027m70p98K330L13n049m95N131q27m962J188M362
918A824j209l253J636J923m81M26o96j983K949K062m837j695N072J062m879o38
934b717M864j24l592J562J176j164J303m98l077J861L338m050l316M335K703n025
950b421j473M890N80l108J743J162j091J829M62l485O67M157k389n125K961M054
966C413m807l023M509N16k843J366R18j692K417J635l243o08M956k49n966J753
982i48N143l575l779L622O52k723J056P45k191J517K998l249k568N405J618o641
$$ plain form
998 -2918 -2287 3460 1077 -2574 33 1101 -996 -251 980 -1518 -1147 2875 467 -3378 1562 4307
1014 4307 -1557 -2669 2780 1702 -2558 -859 970 -1250 -976 741 -1574 -1886 2657 1110 -3655
1029 -3655 557 4455 -184 -2367 2414 2477 -1259 -458 1725 -1030 -1121 1365 -1681 -2882 1851 935
1045 935 -3958 -1074 3535 -27 -3133 1168 3011 -768 -500 1822 -391 -436 2210 -560 -2843 1797
1061 1797 2133 -2929 -2078 2820 474 -3203 74 2313 -900 -1016 1796 -257 -969 2011 138 -2420
1077 -2420 1350 2743 -2112 -2394 2621 1685 -2791 -495 2170 -664 -760 1370 -662 -1590 2116 770
1093 770 -2731 -358 2818 -667 -2903 1423 1761 -2090 -448 2155 -506 -901 1525 245 -1243 1727
1109 1727 1431 -2510 -958 2873 -253 -3190 734 2344 -1552 -1138 1236 -198 -630 1446 35 -1710
$$ packed form
998b918O31N747k383l651K607J068k097P45J231k498L71M022k408l845M940K745
1014D307n864j112N449j078m260J699J829k220K74J717k315l12M543j547m765
1029c655M212L898m639k183M781O3l736Q01K183k755r1K486l046j201M733r16
1045I35m893K884M609l562l106M301J843l779K68K322k213m5K646k770k283M640
1061A797L36n062Q51M898k346l677L277K239l213j16K812k053p12K980j873k558
1077b420L770J393m855k82N015r36m476K296K665k834r6K130k032r28L706j346
1093G70l501K373L176l485k236M326L38l851J642K603k661l95K426j280j488K970
1109A727k96l941J552L831l126k937L924J610l896M14K374j434m32K076j411j745
$$ plain form
1125 -1710 1065 2042 -1623 -1491 2602 604 -2561 183 1912 -1123 -1231 967 -117 -1056 755 178
1141 178 -1922 427 2198 -1420 -2159 2230 1494 -2000 -331 1676 -144 -894 711 -107 -1378 741
1157 741 487 -2203 -470 2172 -842 -2096 1354 1702 -1688 -557 1914 474 -953 666 551 -797
1173 -797 689 875 -1741 -642 2094 -393 -2658 472 1701 -1180 -1204 841 444 -716 640 838
1189 838 -927 812 1506 -1188 -784 1856 466 -1914 -218 1261 -702 -1413 655 480 -818 321
1205 321 349 -978 412 1303 -899 -1045 1449 964 -1218 -521 1528 -2 -1031 680 300 -836 368
1222 368 392 -1009 -266 1280 -315 -1233 512 842 -1365 -992 1091 52 -1009 108 402 -479 312
1239 312 650 -421 105 1147 367 -1083 167 1197 -768 -1074 325 101 -896 -320 -39 -732 -50 417
$$ packed form
1125a710K775R77l665J32M093j998l165K744J729l035j08K198j084r39J811n77
1141A78k100K349J771l618p39M389p36l494J669K007j820p50J605q18j271K119
1157G41k54k690J733K642l014j254L450L48l390J131K471j440j427J619j15j348
1173g97J486J86k616J099K736k487k265L130J229k881k4K045l97j160J356J98
1189H38j765J739O94k694M04K640j390k380J696J479j963p11K068j75j298J139
1205C21K8j327J390Q91k202j46K494m85k182O97K049j530j029J711l80j136J204
1222C68K4j401P43J546j595r18J745L30k207L73K083j039j061J117K94q81P91
1239C12L38j071N26J042p80j450J250J030j965l06J399k24r97N76K81o93O82M67
$$ plain form
1257 417 -564 -206 1248 722 -1137 254 1477 -52 -405 431 294 -600 -304 -238 -580 -316 81 -613 -841
1276 -841 583 739 -768 54 1222 456 -328 332 775 138 106 252 -184 -131 440 -564 -942 475 641
1295 641 -808 -613 710 256 -235 -49 562 73 -232 -112 -225 -183 289 -18 -589 342 838 -130 -430 330
1315 330 579 -163 -197 439 33 -82 47 -369 -106 269 -107 -817 -263 299 -137 -451 134 691 -2 287
1335 287 433 139 180 477 -187 -168 348 -144 -560 -503 252 -37 -794 -262 262 148 -12 119 0 385 257
1356 257 152 80 445 150 -90 -317 8 81 -421 -166 23 164 -242 -203 226 259 141 -275 -329 125 193 -58
1378 -58 -258 -101 206 -73 -333 -221 171 264 -242 -229 537 332 -65 -55 51 44 -104 -438 -275 111 -26 -423
1400 -423 -442 222 387 -171 -386 516 304 99 95 134 399 209 4 -271 -81 222 -250 -627 -122 356 -198
$$ packed form
1257D17r81L58J454n26j859J391J223j529l53Q36j37q94K96O6l42K64L97o94k28
1276h41J424J56j507Q22J168p66p84O60M43o37l2J46m36N3N71j004l78J417J66
1295F41j449J95J323m54m91J86O11m89l05J20j13M2M72l07n71R31M96r68l00P60
1315C30K49p42l4O36m06j15J29m16K63L75l76p10N54N62m36l14N85N57o93K89
1335B87J46k94M1K97o64J9N16m92m16N7P55k89p57N32N24j14j60J31j19L85j28
1356B57j05p2L65k95k40k27L25P3n02K55J89J41m06L9M29L3j18m16n4M54O8k51
1378e8k00J57L07k79k60J12L92R3n06J3P66k05l97J0J06pj48l34J63L86j37l97
1400d23j9O64J65n58k15R02k12k05mL9K65j90k05k75J90L03m72l77N05M78n54
$$ plain form
1421 -198 -450 -185 401 21 107 3 234 145 93 -219 -202 568 275 -461 -271 238 -23 -408 -232 192 18
1442 18 -300 -48 119 -83 117 -10 -295 151 157 -523 -276 612 269 -319 85 296 195 -124 17 -28 117
1463 117 254 -141 -402 91 408 -134 -639 291 187 -397 -204 209 364 -151 21 -27 188 371 273 -367 -139
1484 -139 730 68 -423 -36 486 -365 -432 54 -73 -260 150 85 -125 374 250 -503 -171 806 201 -639 11
1505 11 721 -205 -421 109 -119 -227 194 -132 -223 170 382 -378 -521 595 459 -321 -134 531 -40 -118 263
1526 263 140 -106 101 341 -337 -216 658 -358 -803 194 679 -582 -363 447 172 -307 24 59 -21 390
1546 390 410 -325 -163 556 79 -734 -72 401 -454 -640 328 256 -268 -175 192 -141 17 474 -269 -366 407
1567 407 272 -725 -54 802 -61 -777 99 376 -135 -6 150 -462 -6 435 -62 -538 465 474 -455 -341
$$ packed form
1421a98k52K65N86l80Q6j04K31q9n2l12J7P70k93p36J90N09k61l85J76M24j74
1442A8l18K52J67k02K00j27k85M46Oo80K47Q88l43n88M04K11j01l19J41m5J45
1463A17J37l95k61M93L17n42n05R30j04n84J93M13J55n15J72m8K15J83r8o40K28
1484a39Q69o62m91L87N22q51o7M86j27j87M10o5k10M99j24p53L32R77o05q40O50
1505A1P10r26k16N30k28j08M21l26r1L93K12p60j43J116j36p80J87O65n71p8L81
1526B63j23k46K07K40o78J21Q74j016m45R97M85j261K19Q10k75m79L31L5q0M11
1546C90K0p35J62P19m77q13O62M73q55j86R68p2n24R3L67l33J58M57p43r7P73
1567D07j35r97O71Q56q63p16Q76K77n11J29J56o12M56M41m97m76J003Rr29J14
$$ plain form
1587 -341 668 151 -541 -20 365 -111 39 489 -340 -80 401 2 -723 116 413 -545 -527 462 386 -573
1607 -573 -155 346 -129 -39 389 -67 -324 716 766 -527 -43 787 -152 -529 204 486 -568 8 245 -367
1627 -367 -466 213 -284 -389 603 440 -513 -94 921 242 -649 184 758 -201 -443 178 -498 -311 250 -129
1647 -129 -643 194 546 -527 -418 832 97 -448 195 543 -137 -82 335 -80 -383 391 5 -619 97 705
1667 705 -353 -685 651 378 -698 -203 404 25 -303 461 -200 -523 494 242 -910 -140 681 -251
1685 -251 -544 310 727 -306 -210 429 -3 -251 199 -304 -732 84 280 -796 -584 848 -100 -737 280
1704 280 749 -182 -231 557 255 96 619 206 -342 294 528 -798 -625 841 147 -864 -225 535 -228
1723 -228 -527 129 234 -273 522 247 -243 403 653 -386 -641 485 468 -715 -566 609 4 -324 154
$$ packed form
1587c41J009n17o92N21L85m76J50M50q29K60M81l99p25Q39K97r58J8R89p6r59
1607e73M18N01m75R0M28m56k57J040N0j293M84Q30r39l77P33K82j054N76K37o12
1627c67r9O79m97j05R92j63r53M19J015o79q91Q33N74r59k42O21o76J87N61l79
1647a29n14Q37L52j073J09J250p35n45O43L48o80N5M17m15l03P74l86o24P16O08
1667G05j058l32J336k73j076M95O07l79l28P64o61l23J017k52j152P70Q21r32
1685b51k93Q54M17j033R6O39m32k48M50n03m28Q16J96j076K12J432r48o37J017
1704B80M69r31m9P88l02j59N23m13n48O36K34j326J73J466o94j011O39P60p63
1723b28k99O56J05n07P95k75m90O46K50j039k55J126j7j183J49J175o05l28M78
$$ plain form
1742 154 235 -323 286 205 -454 -23 778 -151 -549 241 553 -570 -407 308 -17 -353 61 209 -19 351
1762 351 352 -437 146 624 124 -565 -155 468 -580 -769 405 -48 -514 -75 -33 -264 85 411 -225 -222 658
1783 658 421 -447 55 753 -57 -511 114 69 -211 -70 6 -400 -18 84 -132 -612 508 617 -434 -433 766
1804 766 209 -160 93 268 -39 -210 43 -210 -20 387 -217 -615 250 535 -382 -150 390 237 -106 -64
1824 -64 167 110 331 68 -396 45 499 -145 -311 311 529 -16 -326 268 422 -91 -24 -235 -38 -140 -167
1845 -167 -445 -373 302 167 -573 68 341 114 -246 46 533 236 39 199 228 186 120 -261 -42 506 -122
1866 -122 -606 -126 65 -158 -342 20 367 361 35 189 72 357 238 -118 -83 267 5 -351 -246 102 324
1887 324 -507 -215 134 225 -2 68 -221 311 70 -353 92 375 483 -74 -381 314 198 -96 -263 -186 160
$$ packed form
1742A54Q1n58O09q1o59M31Q01r29l98P90L12j123J63P15l25l36M14J48k28L70
1762C51Jp89N83M78n00o89M10O23j048j89J174m53m66M39M2k31L49L26o36LQ80
1783F58k37q68N02O98q10m54O25m5k80J41P6m06L82J02k16m80J120J09j051JJ199
1804G66n57l69K53J75l07j71K53k53J90M07o04l98Q65K85r17K32N40j53l43M2
1824f4K31n7K21k63m64M41M54o44j66O22K18n45l10N94J54n13O7k11J97j02k7
1845a67k78P2O75j35p40O41K73k27l60K92M87k97j97J60K9m2o6l81K19N48o28
1866a22m84M80J91k23j84L62L47ol26J54j17K85j19l56L5L50k62l56J05L48K22
1887C24q31K92L49R1k27P0k89N32k41m23M45K83J08n57l07O95j16k94j67P7L46
$$ plain form
1908 160 179 -146 -198 61 121 -202 -349 -67 268 15 -87 -5 138 102 -161 -324 279 153 -185 -261 351 321
1930 321 -296 -36 0 320 51 -103 -369 62 273 -114 -591 -2 347 -170 -256 20 241 100 42 218 -35
1951 -35 195 115 -221 -149 433 -186 -298 -22 333 -36 -166 91 320 16 -248 133 13 331 94 -265 -58
1972 -58 466 182 -534 -59 549 -4 -604 -212 69 -317 -77 124 -308 24 263 -276 -167 303 259 -429 -52
1993 -52 777 175 -248 -265 229 -238 -270 -113 -301 31 259 -321 -413 263 459 -107 -236 409 375 -343 96 197
2015 197 -36 -13 -43 -192 -91 404 -141 -769 123 483 -411 -529 310 277 -468 94 255 -43 43 42 12 88 278
2038 278 232 -354 -78 498 79 -385 214 279 -369 -103 274 -101 43 204 -329 -397 175 233 -570 -62 441
2059 441 61 -672 -4 305 -97 17 420 -15 -63 251 39 -495 249 252 -565 -399 422 -97 -472 -77 297
$$ packed form
1908A60J9l25n2K59O0l23j47K82L35k53j02Q2J43l6k63j63O03j26l38p6O12l0
1930C21o17K60L6L20k69j54k66M31K11l87m77N89L49n17q6K76K21j41n8J76k53
1951c5K30q0l36P2N82o19j12K76L55l69j30K57K29l04k64L81j20L18k37l59K07
1972e8N24k84p16M75O08n53o00L92K81l86K40K01m32L32K39n39J09M70m4o88L77
1993e2Q29o02m23j7M94m67l2J57j88L32K28n80r2O76J96n66j29O45l4p18M39J01
2015A97k33K3l0j49J01M95n45o28Q92L60q94j18Q39l3p45N62J61k98Q6jl0P6J90
2038B78m6n86K76N76m19m64N99O5o48K66L77l75J44J61n33o8N72N8q03N08N03
2059D41l80p33O68L09m02J14M03m35m8L14k12n34P44Lq17J66Q21n19l75L95L74
$$ plain form
2080 297 -205 -91 160 -81 -85 539 187 -452 167 455 -373 -543 641 224 -339 -143 349 -216 -159 -14 75
2101 75 -255 331 36 -760 -32 615 57 -355 310 315 -173 -162 342 -53 -109 92 -139 -208 280 131 -546 -220
2123 -220 518 26 -514 487 543 -330 -172 80 -197 -260 288 -287 -281 511 257 -496 -189 545 60 -342 245
2144 245 427 -301 -249 295 -296 -285 212 134 -401 257 434 -219 -340 526 265 -305 -49 496 -25 -456 338
2165 338 -31 -197 -7 -178 -492 0 430 -220 -93 217 395 -384 -198 564 45 -139 110 31 -237 81
2185 81 72 -537 -224 534 -361 -533 243 228 -308 -80 311 165 -187 227 99 -47 46 272 -273 -332 240 167
2207 167 -514 -36 484 -187 -194 201 189 37 257 4 -239 -66 405 -75 -395 308 131 -628 -114 219 -192
2228 -192 -457 52 94 -117 186 283 -304 60 278 -309 -256 410 256 -334 -127 419 -137 -177 219 -1 -28 71
$$ packed form
2080B97n02J14K51k41mO24l52o39O19K88q28j70J184m17n63J96M92n65N7J45Q9
2101G5l30N86k95p96P28O47n58m12O65Nm88J1N04l95n6K01k31o9M88j49o77L26
2123b20P38m92n40J001N6q73J58K52k77o3N48n75OP92k54p53L07P34m85m02N87
2144B45J82p28N2N44n91J1M97p8n35O58J77o53j21Q66k61n70K56N45n21m31P94
2165C38l69j66J90j71l14M92M30o50J27L10J78p79J86P62n19j84K49p9k68L18
2185H1ro09L13P58q95j72P76j5n36K28L91j46l52M14j28j46R3K26n45n9N72p3
2207A67o81M78N20o71pL95j2j52K20k53k43J73M71m80l20P03j77p59N14L33m11
2228a92k65N09M2k11L03R7n87L64K18n87N3O66j54n90K07N46n56m0L96k20k7R9
$$ plain form
2250 71 119 -214 -62 379 -112 -286 193 281 -239 -500 99 135 -199 -78 -8 -16 101 120 -286 25 361 88 -428
2273 -428 34 581 -37 -449 182 185 -259 30 32 13 89 271 -98 -146 350 317 -260 -12 373 19 -231 -59 158
2296 158 -131 -91 8 91 145 244 77 140 253 82 -207 112 347 -194 -459 212 -172 -143 101 -3 26 71 29
2319 29 -318 -192 126 332 -177 47 256 253 -67 96 59 -58 34 34 -113 -165 173 -58 -377 261 344 -217 -184
2342 -184 24 39 -1 -173 71 84 116 -5 -205 -9 106 153 -210 86 276 -63 -250 48 12 195 -31 -159
2364 -159 171 -6 -26 -135 43 130 201 -269 -99 248 66 -171 -22 32 118 -126 -183 -16 -165 -34 -138 -215
2386 -215 72 82 -120 17 146 100 -74 18 41 25 -212 -71 4 132 -61 -301 42 22 95 -54 -194 77 -63
2409 -63 58 -61 118 -26 -105 -13 -56 277 114 -109 26 131 11 14 -151 -26 203 -104 -45 -105 93 -52 -51
$$ packed form
2250G1M8l33J52M41m91j74M79Q8n20k61N99L6l34J21P0qJ17J9m06L11L36k73n16
2273d28M62N47o18m12O31Lm44K89Kj9P6J82l69m8M96l3n77K48L85l54k50J72K17
2296A58k89M0R9Q3N4R9j67O3J13j71k89L19K35n41k65O71l84K9K44j04K9M5m2
2319B9l47J26L18K06n09K24K09ll20J63l7j17R2%j47n2L38k31l19O38Q3n61L3
2342a84K08J5m0j72K44J3L2j21k00J96J15M7l63K96J90l39j87K98l6J83k26j28
2364a59L30j77k0j09J78Q7P1m70J70L47j82k37J49N4Q6k44n7J67j49J31j04p7
2386b15K87J0k02J37J29m6j74R2K3j6k37J41P5J28j93k40L43k0P3j49j40K71j40
2409f3J21j19J79j44p9R2m3L33j63k23J35J05j20Lj65J25K29l07N9o0J98j45J
$$ plain form
2432 -51 -47 119 245 16 262 -106 168 -41 -142 -80 -77 -42 -48 -225 195 214 -228 148 84 105 92 6 -37 3 162
2457 162 61 43 50 -100 -48 -106 -55 -57 -135 -61 111 31 58 -161 -51 131 5 25 102 -18 -55 -168 -324 -265 196
2482 196 48 -48 199 77 -58 -92 -209 -140 -97 9 -64 -73 99 181 -169 8 252 0 -47 134 98 116 -132 136
2506 136 144 -54 331 -81 -222 122 238 161 -114 34 -6 -20 -101 28 0 64 -106 -173 106 -24 13 -399 175
2529 175 131 -238 -382 308 73 -191 -146 -3 2 -19 -71 -118 -25 -96 96 -227 -29 298 -248 -163 24 147 -173
2552 -173 78 68 124 95 223 -146 53 42 -326 -17 56 248 -126 -437 10 62 -366 -50 16 158 -132 93
2574 93 -160 -151 264 5 -305 -92 213 -120 -207 122 -53 -203 88 161 114 -76 295 -174 -132 145 226 -206 -176
2597 -176 409 122 -13 0 66 -122 -90 20 -37 66 -4 127 -119 -101 185 31 -32 118 192 -191 -30 247 -108
$$ packed form
2432e1MJ66J26k29K46l68K74k09j01O2LL5oj77M20J9m42L76o4K1j3q6m3M0J59
2457A62j01j8Pj50N2n8N1kp8P4J72q0K7k19J10J82j26K0P7j20l7j13j56N9M61
2482A96j48r6K47j22j35l4j17O9M3J06p3rJ72Q2l50J77K44k52m7J81l6J8k48K68
2506A36Qj98L85m12j41L44J16p7k75J48m0j4q1J29k8O4j70o7K79j30L7m12N74
2529A75m4l69j44O90k35k64M5J43Nk1n2m7R3p1J92l23J98L27n46Q5J87J23l20
2552a73K51j0N6k9J28l69J99j1l68L09P3J92l74l11M47N2m28L16O6J42k90K25
2574I3k53RM15k59l10K13L05l33q7L29j75j50K91P3m7j90L71m69M2K77Q1m32L0
2597a76N85k87j35J3O6j88L2J10n7J03p0J31k46J8K86j54o3J50P4l83J61K77l55
$$ plain form
2620 -108 -35 39 -63 73 10 70 -150 88 159 -263 -121 251 -69 115 -67 125 16 -28 128 -35 -343 113
2642 113 310 -220 -60 34 24 -284 205 -51 -190 -31 -47 -51 -15 30 -216 -222 67 240 -56 -99 439 98 -1 -98
2666 -98 76 31 -50 66 -63 7 167 15 -26 117 -74 -177 -141 334 299 -335 75 159 62 -25 133 -30 -11 25
2690 25 -105 -43 -13 157 -222 -154 -143 18 -214 -224 109 67 -118 123 87 -43 21 134 -169 -152 131 3 -105
2713 -105 -94 -7 -245 -54 149 -94 64 87 -245 -40 75 -31 46 -43 -61 78 -339 144 118 -239 -68 183
2735 183 -26 50 -98 -187 -17 -54 22 -235 -225 95 187 -323 -10 143 8 -202 32 -30 -49 127 -3 -32 -10
2758 -10 264 -51 -237 -59 195 -128 -133 50 -14 -31 -161 -21 -175 -52 13 -304 -122 169 -85 -161 96 200
2780 200 -33 110 -91 102 -25 -107 -76 -93 199 21 -6 -34 177 -124 110 -79 195 -5 -2 245 56 -89
$$ packed form
2620a08P3P4j02J36o3O0k20K38P1m22J42L72l20J84j82J92j09m4J56j63l08M56
2642A13J97n30J60R4j0l08M89k56j39J59j6mL6M5k46oK89J73k96m3N38l41r9r7
2666i8J74m5q1J16j29P0J60j52m1J43j91j03L6M75l5o34M10Q4r7q7J58j63J9L6
2690B5j30O2L0J70l79O8J1J61k32j0L33m2j85K41l6j30O4J13l03J7K83j28j08
2713a05J1Q7k38J91K03k43J58K3l32K05J15j06P7q9j8J39m17M83k6l57J71K51
2735A83k09P6j48q9J70l7P6k57J0L20R2n10L13J53j35k10K34o2j9J76j30k9K2
2758a0K74l15j86J78K54l23nJ83o4j7j30J40j54J23O5l17J82K91k54p6K57J04
2780B00k33J43k01J93j27q2L1j7K92j78k7k8K11l01K34j89K74k00LK47j89j45
$$ plain form
2802 -89 -59 -94 108 197 -22 -153 -89 83 -219 -131 87 -7 -124 70 100 121 -111 -124 -30 205 -359 156 -336 -38
2826 -38 285 4 -77 -213 267 -76 -152 -124 30 105 55 83 51 -227 -84 30 -48 157 67 -11 -41 164 -106 -56
2850 -56 101 -32 -49 -3 -93 39 44 91 -63 -37 56 150 -262 16 -101 -32 46 -29 -170 -49 -72 114 167 9 120
2875 120 -164 27 -4 170 -60 -88 95 60 -10 -228 -67 -58 278 163 -3 -36 -51 -7 -62 204 202 23 10 -75 154
2900 154 -116 -17 -71 134 83 -100 -121 -145 137 61 -33 -155 167 -16 -38 -76 -94 -45 -94 159 21 49 -168 -64
2924 -64 213 236 57 -235 -71 -188 154 -134 -121 -65 -81 152 -118 -24 10 110 -230 23 17 25 -84 -62 -120 -15
2948 -15 23 120 -111 -25 99 33 -171 121 215 55 -79 -195 -11 -88 -3 -150 126 -84 88 -24 -15 -11 118 162
2972 162 -83 -65 -121 78 -60 -25 -206 -28 -197 -95 40 60 -155 51 -128 -260 -123 238 62 114 -321 -11
$$ packed form
2802h9L0l5K02Q9k19j31O4J72l02Q8K18r4j17J94L0K1k32j3R4K35n64N15m92K98
2826c8L23k81q1j36M80l43p6K8J54P5n0K8l2k78J43J14p8K05r0p8l0K05k70N0
2850e6J57j33j7M6r0J32NM7j54K6R3R4m12K78j17O9P8p5j41J21k3J86N3j58J11
2875A20k84J91l1J74k30k8J83l5p0k18J61RL36j15j66l3j5M4n5K66kj79j3q5K29
2900A54k70R9n4K05n1j83k1k4K82p6r4j22L22j83k2l8j8M9m9K53j38K8k17J04
2924f4K77K3j79k92J64j17L42k88J3N6j6K33k70R4L4J00l40K53oQj09K2n8J05
2948a5L8R7k31Q6J24o6k04K92R4j60j34j16J84p7Q5j47K76k10J72j12RMJ29M4
2972A62k45J8n6J99j38L5j81J78j69J02J35K0k15K06j79j32J37L61j76N2m35L10
$$ plain form
2994 -11 -84 -31 -25 -65 85 -7 191 19 75 -156 61 125 92 170 136 28 -9 128 88 191 156 92 105 39 -239 -22
3020 -22 121 -164 11 95 66 -24 -27 -74 -12 -173 16 77 108 -100 -145 -203 57 8 74 -186 20 88 56 -102 57
3045 57 -120 -50 55 162 145 119 117 -18 -13 -8 64 -8 123 117 -52 170 56 53 193 -39 -145 52 5 10 8 16 -198 95
3073 95 -122 -75 -31 48 221 90 48 -83 15 249 -156 -135 -38 65 -167 143 117 44 -103 -144 -181 -72 20 -18 49
3098 49 101 89 -92 86 40 132 95 -30 -75 -128 81 74 -322 118 -128 -209 277 -173 28 -135 -269 -127 69 47
3122 47 -10 -1 -60 30 -52 -80 -168 218 45 -112 -181 128 -126 198 92 -323 -105 78 -238 54 -6 -30 15 34 37
3147 37 162 -266 -29 -13 -127 -28 140 -85 -197 307 21 62 -1 -87 -3 102 -114 20 -90 -61 76 79 -18 209
3171 209 48 81 323 427 -117 -109 111 96 -72 90 125 -178 -79 -8 -10 -185 1 64 -49 -74 22 148 75 187
$$ packed form
2994a1p3N3Om0J50r2J98j72N6k31K17O4l3P8l4j08l7J37m0J03l5o4J3o6k78K17
3020b2J43k85J75Q4k9r0lm7O2j61J89O1L1k08m5n8K60m9O6k60K06O8l2j58J59
3045E7j77P0J05J07j7k6kj35NNP2p2J31oj69K22j14lJ40k32j06J97m7NkQk14K93
3073I5k17M7M4P9J73j31m2j31R8K34m05K1R7J03k32L10k6p3j47m1l7J09R2l8O7
3098D9N2j2j81J78m6R2l7j25m5n3K09pl96M40k46q1M86m50K01j63j34J42J96k2
3122D7n7Rn9R0q2k8q8L86j73j57o9L09k54L24j06m15K18J83l16K92o0k4M5J9L
3147C7J25m28K37J6j14R9J68k25j12N04k86M1o3q6Q4J05k16J34j10K9J37Lr7K27
3171B09j61L3K42J04n44QK20j5j68J62L5l03R9P1kj75J86O3j13k5R6J26p3J12
$$ plain form
3195 187 142 12 -71 198 51 -137 137 -75 154 -23 78 64 26 5 131 -216 -3 1 148 -53 -47 74 -87
3218 -87 -105 -146 -16 0 49 180 -131 58 -152 40 -39 -87 -85 116 89 -109 -82 188 80 81 65 -62 218 -112 82
3243 82 -55 14 71 136 52 45 -2 36 11 2 -56 -76 -221 -83 274 -23 -147 96 78 -39 -1 53 -17 198 29 79
3269 79 187 -40 90 -134 -37 55 45 78 14 22 -27 -43 53 72 5 9 -70 -192 2 17 -65 -57 19 -54 103 -65 146
3296 146 -79 -16 8 30 145 19 204 79 76 95 61 127 34 -73 145 -88 -152 -259 -205 54 82 44 -66 -132 -39
3321 -39 177 32 -155 52 -189 -66 -7 1 2 83 43 -176 142 21 -203 112 2 220 -69 18 129 166 106 -132
3345 -132 -82 54 36 19 129 47 -131 128 35 55 54 -36 -104 109 -183 44 -24 -115 92 -131 31 -111 -362 36
3369 36 49 137 139 -101 -93 31 75 76 -17 -200 -5 48 80 -54 139 43 107 -70 188 -83 -114 2 -3 -17 53 -13 68
$$ packed form
3195A87m5j30q3K69j47j88K74k12K29j77J01j4l8k1J26l47K13MJ47k01OJ21j61
3218h7j8m1J30J6M9J31l11J89k10J92p9m8KK01k7j98K7K70j08Jj6j27K80l30J94
3243H2j37O9N7O5q4pm7L8k5rn8k0j45J38L57k97j24K43j8j17L8N4p0K15j69N0
3269G9J08k27J30k24R7R2j0L3o4Qm9j6R6J9o7Mp9j22J94J5q2QP6p3J57j68K11
3296A46k25O3K4K2J15j26J85j25lJ9l4O6r3j07K18k33o4j07N4K59K8l8j10o6R3
3321c9K16j45j87K07k41J23N9QJQ1m0k19L18j21k24L15j10K18k89Q7J11L7o0k38
3345a32N0J36j8j7J10q2j78K59r3K0jr0o8K13k92K27o8r1K07k23J62j42k51L98
3369C6J3Q8Kk40QJ24M4Jr3j83J95N3L2j34J93r6O4j77K58k71l1J16nj4P0o6Q1
$$ plain form
3396 68 -126 -90 -82 113 -127 -101 -89 -35 236 104 -66 -115 -66 -268 75 -142 -122 -92 73 -7 71 -117 -82 -63 -96
3421 -96 0 -113 -200 -30 -49 -195 -121 48 25 -135 146 -127 76 91 113 18 -56 -62 -109 -62 32 27 -98 -138 129 -192
3447 -192 -138 -175 -14 24 -67 -25 246 -68 -23 20 -279 -73 49 -193 -87 136 -128 -138 114 -87 223 230 -21
3470 -21 169 -216 -91 -168 63 -1 36 -26 -124 -97 -64 27 2 107 12 43 95 -12 -180 80 -188 -83 -102 48 80
3495 80 -56 12 109 16 -39 -61 -23 -119 -67 -32 -8 -169 -36 15 -23 265 7 88 -49 -40 -9 -35 -163 -29 -2 174
3521 174 15 48 -147 62 -115 -115 98 -37 153 101 176 -88 112 -41 -218 218 -96 120 38 -24 -37 40 -33
3544 -33 -196 -77 29 12 44 -2 -269 48 -24 36 45 195 220 101 -211 -146 94 60 32 2 207 136 119 -167 191
3569 191 -87 58 147 -95 -59 8 -56 -105 -38 77 -85 -144 -106 -129 -97 -46 -66 -109 145 127 -81 213 235 -177 80
$$ packed form
3396F8j94L6QJ95k40K6J2N4K71j32j70m9M9k02L43k17K0L0J65q0P8j88L5J9l3
3421i6R6j13q7J70j9j46P4J69k3j60K81k73K03J5K2r5p4om7M7R4nj25m0K67l21
3447a92N4l7J61L8r1M2K71l14M5M3k99K06J22k42J06K23k64j0K52k01L10Pk51
3470b1J90l85J25p7K31o4L7o2r8K7L3R1k5J05r5L1N2j07j68K60k68J05j9J50L2
3495H0j36O8R7r3n5k2L8r6N2L5K4j61J33N1l8K88k58Q1j37RL1k6j28J34K7J76
3521A74j59L3j95K09j77%K13j35J90n2P5k64K00j53j77M36l14K16q2o2j3P7p3
3544c3j63J19J06j7L2m6k67L17p2O0RJ50K5j19l12O5K40l4k8l0K05p1j7k86L58
3569A91k78J45Q9k42L6O7o4m9O7J15j62n9L8k3L2N1k0m3K54j8k08K94K2m12K57
$$ plain form
3594 80 229 69 -129 111 -116 13 -47 -52 -233 120 62 41 7 -34 157 20 147 108 156 98 -211 -32 -4 -140
3618 -140 -159 -104 41 -204 -60 127 -132 -135 37 -82 96 -86 -145 -88 -150 -58 3 27 35 255 -65 -28 105 16 -12
3643 -12 -41 95 -109 -197 5 59 -8 56 112 -18 8 157 48 28 38 -57 63 136 24 61 43 -49 -88 70 97 102
3669 102 -177 -5 -12 -36 273 -16 -167 106 -12 -105 -42 -81 81 -120 -161 70 -62 133 219 -61 39 -146 150
3692 150 228 -51 117 -121 13 -17 77 -289 43 -29 86 3 26 15 26 123 -50 196 -43 207 5 -39 -7 -1
3716 -1 -87 68 22 57 244 -122 71 64 67 -34 140 -205 -277 -28 28 149 -71 -76 75 -248 68 -78 -80 69 -16
3741 -16 102 91 -42 -65 92 102 32 74 29 -41 -20 -103 208 86 -38 -2 9 110 -22 -63 -14 163 -12 -161 156
3766 156 -111 46 244 70 129 -39 -32 -142 17 -191 60 -227 175 56 -287 214 -116 -107 -118 -6 -20 111
$$ packed form
3594H0J49j60j98K40k27J29o0nj81L53n8k1l4m1J91j37J27l9M8n8l09J79K8j36
3618a40j9N5J45k45J44J87k59lJ72j19J78j82n9N7o2R2O1K4QK20l20L7J33q9k8
3643a2k9J36k04q8K02N4o7O4N6j30K6J49j09k0J0r5J20P3j12L7j8r2l9J58K7N
3669A02k79J72pk4L09k89j51K73j18r3O3l9J62k01m1K31j32J95Q6k80J00j85K96
3692A50P8k79J68k38J34l0R4l66L32p2J15q3K3j1J1R7j73K46k39K50k02m4L2O
3716aq6J55m6L5J87l66J93pLj01J74l45p2K49N6J21k20nJ51l23L16j46kJ49q5
3741a6J18j1j33k3J57J0p0M2m5p0K1q3L11j22j24L6J1J01j32m1M9J77j75j49L17
3766A56k67J57J98j74N9j68Pj10J59k08K51k87M02j19l43N01l30Rj1J12j4J31
$$ plain form
3788 111 -53 -148 9 -92 -104 -127 -37 -39 -8 174 -32 -69 -11 -56 97 -110 199 139 169 -58 173 -2 -34 56 67
3813 67 -8 25 52 77 18 -52 -137 64 47 -44 37 -37 215 75 -24 -36 -116 -33 -57 -7 245 46 -152 105 -259 -110
3839 -110 -213 -96 41 -85 63 -72 -112 -154 -54 -111 196 -261 117 -90 -29 159 172 193 72 2 99 18 117
3862 117 11 18 92 -9 129 69 51 84 -48 167 -9 -20 -164 63 32 -125 67 63 19 87 -199 -5 30 26 140
3887 140 -53 -120 59 147 77 48 -89 168 124 -92 131 -230 24 -135 -66 -8 -53 114 -6 -182 17 139 1
3910 1 2 -64 -25 -34 -111 -76 112 78 -2 -98 -116 -133 -235 72 -121 99 68 199 144 -72 -100 0 76 -154 136 -23
3936 -23 141 29 22 -30 -100 -209 144 133 32 127 -106 73 -4 -161 -59 150 -65 151 89 -135 -154 131 93 6
3960 6 -98 -138 -67 -86 56 -117 105 108 -17 -45 60 62 46 -201 -143 -11 -54 65 -118 48 -43 -49 84 -84 100
$$ packed form
3788A11j64r5J57j01j2k3R0kL1J82k06l7N8m5J53k07L09o0L0k27K31j75l2R0J1
3813F7p5L3K7K5n9p0q5K01j7r1Q1p4K52j40r9j2q0Q3k4N0K52j99j98K57l64J49
3839a10j03J17J37j26J48j35m0m2J00n7L07m57L78k07O1J88J3K1j21p0R7q1R9
3862A17j06PP4j01J38o0j8L3j32K15j76j1j44K27l1j57J92mm4O8k86J94L5mJ14
3887A40j93o7J79Q8p0k9j37K57m4k16K23l61K54j59O9N8m5J67j20j76J99J22j38
3910AJo6L9rp7L5J88l4q0r6j8j7j02L07j93K20l1J31n5k16k8J00P6k30K90j59
3936b3J64j12pn2p0j09L53j1j01R5k33J79p7j57J02K09k15K16o2k24j9K85l8q7
3960Fj04m0P1j9J42j73K22Lj25k8J05Kj6k47N8J32m3J19j83J66r1oJ33j68J84
$$ plain form
3985 100 58 -110 -57 48 91 97 83 16 -61 -34 40 216 87 70 -14 3 35 -43 246 -26 275 -33 94 -80 -76 83
4011 83 -47 -16 147 169 206 -41 71 -110 -42 29 38 37 213 -17 163 -9 11 283 117 -294 87 -122 117 -60
4035 -60 -100 153 -79 -81 -21 59 31 -126 -177 86 137 -92 66 22 131 177 -8 -56 -171 25 -33 -126 -52 -111 -141 100
4061 100 78 39 35 98 -48 129 82 19 -215 230 -49 -71 -322 106 -33 17 -64 12 136 40 27 12 1 -107 -242
4086 -242 -77 -86 -36 89 -15 -15 -149 -47 141 129 -170 34 -234 -40 -68 15 -49 -118 -42 133 -149 -104 1 112
4110 112 122 -202 202 104 -63 -28 -13 -151 90 10 113 233 -50 2 64 49 29 169 194 2 188 252 107 111
4134 111 46 -116 250 112 122 152 140 -118 157 -37 99 129 110 18 -49 44 -44 38 -86 -305 27 204 74 -94
4158 -94 -138 195 -18 -42 -9 14 -115 138 -3 188 40 61 -60 -44 -101 48 69 -121 99 229 -124 -31 -207
$$ packed form
3985A00m2j68N3J05M3Oj4o7p7K7P4J76j29j7q4J7L2p8K89k72L01l08J27j74MJ59
4011H3j30L1J63K2L7k47J12j81O8P1RjJ76k30J80j72K0K72j66m11L81k09K39j77
4035f0m0K53k32kO0Q0k8j57n1K63N1k29J58m4J09M6j85m8j15J96n8r3P4n9l0K41
4061A00k2l9mO3j46J77m7o3k34M45k79k2k51M28j39N0q1P6J24r6j3j5j1j08j35
4086b42J65rN0J25j04%j34J02J88j2k99K04k68J94k8Q3o4o9P6J75k82M5J05J11
4110A12J0l24M04r8j67L5J5j38K41q0J03J20k83N2O2j5k0J40K5j92J86O4j45M
4134A11o5j62L66j38J0L0j2k58K75j94J36L0j9r2o7R3q8Q2j24k19L32J77j30j68
4158i4m4L33k13k4L3K3j29K53j41J91j48K1j21J6n7J49K1j90K20J30l53R3j76
$$ plain form
4181 -207 -191 0 -126 170 -45 -132 -26 21 25 -6 71 116 -35 -189 -111 -3 23 4 -38 37 252 -101 82 44 -51
4206 -51 49 -181 49 102 -58 -129 -116 -81 31 19 -37 176 -19 11 -98 -52 104 -109 -142 -272 119 39 -87 153
4230 153 97 -55 152 110 14 -104 -94 162 -52 58 -92 119 -35 173 144 19 -254 71 73 -3 64 -9 217
4253 217 218 -117 -59 107 91 67 -80 136 50 -269 173 135 97 -37 156 -87 -29 167 109 55 -66 -100 -45 159
4277 159 25 111 175 -83 -179 128 -12 118 -71 58 -86 34 -40 27 -7 -36 -33 -15 -94 49 -91 -20 100 -100
4301 -100 32 -19 -122 -3 159 276 157 -27 -10 -31 26 145 -52 73 -10 -45 -84 -21 339 37 -17 -57 284
4324 284 57 -49 37 35 -149 75 -74 -225 -34 -8 -113 351 -99 -17 144 129 19 -1 237 -141 -24 -114 21
4347 21 -90 204 -43 170 20 -23 135 -173 88 -157 55 133 113 -155 101 39 188 3 17 172 174 -51 -159
$$ packed form
4181b07J6J91j26K96k15q7J06M7Ml1P7M5j51j54P8J08K6j9m2P5K15l53J83l8r5
4206e1J00k30K30N3j60p1J3L5J12j2n6K13j95L0j09M6J56k13l3j30L91q0j26K40
4230A53n6j52K07m2r6j18J0K56k14J10j50K11j54K08k9j25k73L25Kp6O7p3K26
4253B17Jl35N8J66j6k4j47K16q6l19M42l8l8j34J93k43N8J96n8n4j21l4N5K04
4277A59j34Q6O4k58r6L07j40J30j89J29j44J20p4O7l4k9LJ8p9J43j40P1J20k00
4301a00J32n1j03J19J62J17j19j84J7k1N7J19j97J25q3l5l9O3L60l02n4m0L41
4324B84k27j06Q6kj84K24j49j51J91K6j05M64m50Q2J61j5j10k0K38l78J17r0J35
4347B1j11K94k47K13j50m3J58l08K61k45K12P8k0k68K56o2J49j85J4J55Kk25j08
$$ plain form
4370 -159 -159 -160 -179 42 146 13 -3 188 -15 -102 -26 24 411 -36 100 30 -90 -192 -37 114 53 -82 109 -139
4394 -139 152 -4 -40 87 -21 -132 128 83 114 -217 -71 178 204 141 -5 -16 15 -1 114 -45 -13 -47 50 -302
4418 -302 -22 35 -9 0 -2 -8 -177 -108 192 95 94 -31 97 -64 -187 -193 13 139 -32 57 -174 67 -35 21 99 -169
4444 -169 10 35 221 40 -95 53 25 4 -264 -187 184 59 -59 137 -43 -84 -18 -153 125 144 -133 -63 -189
4467 -189 -83 88 -3 -23 110 41 -23 -53 207 -19 131 -108 23 49 -33 144 -141 116 9 79 70 51 77 20
4491 20 -39 -44 91 -39 112 -5 -8 -246 -91 61 -147 26 -145 -25 -156 -182 -77 25 -6 -88 -45 -138 -35 15
4515 15 135 140 -165 12 206 -78 9 -200 -123 -73 -23 207 -9 196 -52 -144 79 -17 -14 -31 -52 -234 11 -50 46
4540 46 -70 -91 1 -47 70 244 -89 14 103 -25 184 96 -63 -134 -148 -13 25 -124 -21 156 -26 -261 -113
$$ packed form
4370a59%jj9K21J04j33j6J91k03q7P6N0L87m47J36p0j20j02J55J51o1j35J91k48
4394a39K91j56l6J27j08j11K60m5L1l31J46K49K6o3j46j1L1j6J15j59L2l4R7l52
4418c02K80N7m4Rkoj69O9L00r7jj25J28j61j23oK06J26j71Q9k31K41j02N6P8k68
4444a69J79K5J86j81j35J48k8k1k68P7L71j25j18J96j80m1O6j35K78J9k77P0j26
4467a89J06J71r1k0J33o9o4l0K60k26J50k39J31K6q2J77k85K57j07P0rj9K6n7
4491B0n9nJ35j30J51j17lk38J55J52k08J73j71J20j31k6J05J02l1q2M3r3J03N0
4515A5J20Nl05J77J94k84Q7k09P7N0N0K30k16K05k48r2K23r6Lj7k1j82K45o1R6
4540D6j16k1R2m8J17J74l33J03Q9j28K09q8j59p1j4J35L8j49J03J77j82k35J48
$$ plain form
4563 -113 146 -16 13 104 129 -113 135 63 -101 -201 -122 -75 -15 -12 50 96 207 142 33 -86 -45 25 -38 0 -185
4588 -185 125 -115 -24 85 -210 -187 95 -40 52 -61 7 113 84 219 -22 -19 47 39 53 133 -315 235 105 -69
4612 -69 -224 106 71 140 95 42 -62 -14 -22 -48 65 23 34 6 51 128 -106 54 -24 -20 166 -130 192 -236 101 136
4638 136 23 277 29 30 -108 -10 0 160 -6 -151 67 -4 -96 1 -134 -71 91 181 -52 57 82 260 -34
4661 -34 -150 166 -203 -41 48 247 226 73 141 -186 -6 21 -257 113 63 -121 -48 -212 -79 165 -30 -9 -204
4684 -204 -91 -53 29 85 127 31 305 123 -29 -85 -79 -14 224 -183 56 -94 16 277 -59 15 -20 -44 -24 35 178
4709 178 81 -90 -16 195 -55 144 97 -66 108 -134 -44 -21 -151 -102 -146 -149 23 175 -57 -89 -82 176 25 69
4733 69 2 25 202 208 -56 -104 212 66 -201 -109 105 46 87 117 -84 -38 1 52 -78 170 133 132 -119 -81 52 24
$$ packed form
4563a13K59j62K9R1K5k42K48p2j64j00P9M7O0LO2M6J11o5j09j19M1P0o3L8j85
4588a85L10k40R1J09k95K3K82j35R2j13O8J06k9J35k41LO6qJ4Q0m48N50j30j74
4612f9j55L30l5O9m5n3j04M8qk6J13m2J1k8M5P7k34J60p8MJ86k96L22m28L37L5
4638A36j13K54k48Jj38R8J0J60j66j45K18p1r2R7j35O3J62R0k33J09K5J78k94
4661c4j16L16l69J62Q9J99k1j53O8l27J80K7k78L70n0j84P3j64J33K44j95K1j95
4684b04J13L8Q2N6M2r6K74j82j52n6OO5K38m07K39j50J10K61l36P4l5k4K0N9J43
4709A78r7j71P4K11k50J99m7j63J74k42R0K3j30M9m4lJ72J52k32l2PK58j51M4
4733F9o7K3J77Ok64m8L16j46k67R2K14n9M1L0k01M6L9N1j30K48l7jk51L8J33k8
$$ plain form
4759 24 -109 -6 48 163 131 55 -133 171 -43 83 198 113 121 -27 -218 -84 21 -78 36 42 148 -149 -24
4782 -24 207 -124 -129 -22 -262 -77 118 118 243 -32 21 -59 28 38 85 -17 -154 -126 -2 294 75 118 -99 133
4806 133 -189 -142 -47 71 -5 85 -40 -342 73 84 74 69 -223 -53 1 161 6 -25 118 104 30 9 -20 6 90
4831 90 -90 -152 52 110 -61 -8 -51 -41 77 5 132 39 42 -61 -193 244 68 104 -67 -64 -207 -107 -2 -90 -61
4856 -61 -163 -77 -82 241 122 -140 29 -336 -158 9 -50 150 77 -39 -85 -53 -90 14 -72 -50 -119 -16 -45 -75 75
4881 75 -39 -62 25 124 40 -196 -59 -96 -64 -69 -7 6 -3 204 -151 112 125 -69 165 -108 132 -60 -191 -19 -11
4906 -11 -99 54 223 106 -120 -111 67 97 -117 -117 -43 -100 116 -9 108 -18 120 -179 81 100 82 -72 -100 232
4930 232 -244 -189 -140 -203 -84 -53 93 26 101 70 -14 23 22 -3 -118 -119 126 -40 -220 -57 -19 -10 62 -32 -37 29 51 -125
$$ packed form
4759B4j33J03N4J15l2p6j88L04k14J26J15q5Qj48j91J34J05r9J14OJ06k97J25
4782b4K31l31nJ07k40J85J95%J25k75N3q0Q7J0M7j02j37K8J24K96k19M3k17K32
4806A33l22M7R5J18p6R0j25l02M15J1j0nk92J70N4J60j55l1J43j4p4k1k9K6Q4
4831I0j80o2K04N8j71N3m3J0J18p2J27r3Lj03j32M37j76L6j71Lj43J00J05q8K9
4856f1j02Q6nL23j19k62J69l65J78J67n9K00p3j16m6L2l7J04q6K2o9J03k9l0J50
4881G5j14k3Q7R9q4k36J37l7L2nO2J3rK07l55K63J3j94K34k73K40j92j31J72Q
4906a1q8J53J69j17k26RJ78L0k14%P4n7K16j25J17j26J38k99K60J9j8j54k8L32
4930B32m76N5M9o3J19L1J46o7P5l1q4L7jk5j15jK45j66j80J63L8RP2r4nO6K2j76
$$ plain form
4958 -125 7 132 51 -111 -63 -189 65 -90 -173 198 -107 47 -119 -17 -120 -10 -219 -121 197 122 -57 -22
4980 -22 13 -198 125 127 127 224 23 -48 110 -231 -29 112 91 20 -34 18 -99 53 -95 194 -112 39 -104 -131
5004 -131 -69 -5 124 -132 -61 51 -6 -31 -43 51 46 229 -4 18 -17 32 -92 78 -89 -14 81 -114 177 -33 190
5029 190 -62 149 19 176 257 158 -59 -87 94 80 -67 143 67 -50 -70 80 -143 -76 143 -49 69 54 -189
5052 -189 -96 3 113 23 29 122 -57 55 -235 115 106 -1 -28 -172 146 196 287 67 31 95 -47 -31 -21 97 42
5077 42 -99 255 -110 -31 151 53 -24 -340 100 -45 -62 21 -39 -216 -19 -63 256 -147 12 -179 -122 -84 118
5100 118 -15 35 -7 -19 68 -206 65 -126 79 152 -52 156 39 3 -25 83 233 167 -64 149 171 -69 82
5123 82 -175 -180 16 250 139 -43 -107 103 -7 -281 48 78 -62 -182 -137 -100 -7 62 -39 -112 -93 77 160 -21
$$ packed form
4958a25J32J25q1j62M8j26K54j55q3L71l05J54j66J02j03J10k09R8L18p5j79L5
4980b2L5k11L23K%R7k01p1J58l41K02J41k1p1n4N2j17J52j48K89l06J51j43k7
5004a31O2O4J29k56P1J12n7k5j2R4nJ83k33K2l5M9j24J70j67P5R5j95K91k10K23
5029A90k52K11j30J57Q1r9k17k8J81j4j47K10p6j17k0J50k23O7K19j92J18j5k43
5052a89R3R9J10r0OR3j79J12k90L50rj07k7j44L18N0R1k20l6O4j42J6J0J18n5
5077D2j41L54l65P9J82r8p7l16M40j45j7Q3o0j77J97m4L19m03J59j91N7L8K02
5100A18j33N0m2j2Q7k74K71j91K05P3k04K08j17l6k8J08J50o6k31K13K2k40J51
5123H2k57nJ96K34j11j82o4K10j10k74L29L0j40j20M5L7R3O9j01p3J9J70Q3j81
$$ plain form
5147 -21 25 -138 43 169 -58 -90 -127 -57 -10 86 61 -37 -138 -116 -116 -84 -123 210 -315 -194 198 115 -93 84 148
5172 148 -129 155 64 -41 -35 -276 91 -68 154 -15 -141 -270 -51 34 -22 148 173 -95 17 -107 204 -177
5194 -177 -16 -10 138 72 -130 -31 8 294 122 -122 -18 127 14 -56 129 -45 237 0 -21 -57 240 33 -172
5217 -172 24 20 161 -9 -208 5 157 2 -63 19 -36 -160 11 95 50 21 -50 -82 16 -145 -147 182 68 136 111
5242 111 -151 22 -1 -51 -2 77 189 -96 -129 164 -58 61 121 -41 -132 10 9 -121 -42 -4 -26 12 -87 -42 -41 23
5268 23 152 -44 -160 87 26 -101 -12 -167 243 -148 -91 175 -182 -196 -81 -200 3 -23 -220 -34 -88 -122 97
5291 97 -96 75 81 -155 184 -110 -15 66 -124 -205 -48 -29 26 34 -51 99 -129 68 79 116 -79 202 16 -41 -55
5316 -55 75 2 104 -72 -5 145 -77 71 80 -23 -172 121 94 -64 89 -162 156 -97 24 -31 103 -24
$$ packed form
5147b1M6j63J81J26k27l2l7P0M7R6k5r8j01K2%L2l9L33n25J21L92q3k08J77O4
5172A48k77K84r1j05Ok41L67j59K22j69j26j29K19Q5n6J70K5k68J12j24L11l81
5194a77J61OJ48o6k02R9L9K86j72k44J04J45j13p0J85j74K82k37k1l6K97k07k05
5217a72J96mJ41j70j99K13J52j55o5Q2n5j24J71Q4m5k9p1l2R8j61kL29j14O8k5
5242A11k62J73k3n0M9P9J12k85l3K93k22J19O0j62r1J42jj30P9L8k2L8r9M5JO4
5268B3J29j96j16K47o1j27Q9j55M10l91N7K66l57j4J15j19K03k6j97J86n4l4K19
5291I7j93J71Ok36L39k94R5Q1j90q1J57J9N5Qq5J50k28J97J1L7j95K81j86n7j4
5316e5J30p3J02j76O7J50k22J48Rj03j49K93k7j58J53k51L18k53J21n5J34j27
$$ plain form
5338 -24 42 -81 15 -188 -42 10 -117 -11 1 28 -142 164 -193 -70 -131 -16 -191 -159 -176 -39 -69 -226 101
5361 101 16 206 -87 44 20 -342 7 4 30 23 11 31 83 -113 103 -17 -22 65 -1 120 223 -84 -100 -71 174
5386 174 -299 -145 7 -59 -30 -166 81 -109 -119 130 -2 -45 117 207 67 2 78 -232 103 -36 1 219 148
5409 148 99 -180 -212 5 -109 13 4 93 -219 -23 -142 116 -87 -95 72 0 112 -162 109 126 18 -10 5 28
5433 28 58 30 -176 137 -60 218 67 5 13 -148 89 -19 114 -53 -75 -16 -152 -28 17 -28 -58 33 -27 172
5457 172 -98 102 126 -76 112 21 32 -32 -52 -51 55 -53 20 73 74 111 -128 196 55 -50 -90 103 -187 114
5481 114 6 37 32 -77 146 -14 -159 -16 -112 -52 259 -9 -131 -8 -143 64 37 -76 -4 -135 -68 112 57
5504 57 153 -3 -125 110 172 48 -236 171 -30 45 -60 92 165 93 161 -221 -58 -206 -27 -3 -26 -86 -77 -22
$$ packed form
5338b4O6j23R6k03J46N2j27J06J2K7j70L06l57J23o1J15j75L2j7J37l0j57L27
5361A01q5J90k93J31k4l62L49lK6pj2K0N2j96K16j20nQ7o6J21J03l07j6K9K45
5386A74m73J54J52o6K9j36K47j90j0K49j32m3J62R0j40o5P6l10L35j39L7K18p1
5409A48m9k79l2K17j14J22rQ9l12J96j19K58k03qJ67p2J12k74K71J7j08k8J5K3
5433B8L0k8k06L13j97K78j51o2Qj61K37j08J33j67k2N9j36J24M5m5l0R1o0J99
5457A72k70K00K4k02J88r1J1o4k0JJ06j08P3N3JL7k39L24j41j05m0J93k90L01
5481A14j08L1nj09K23j60j45J43r6O0L11k68j22J23j35K07k7j13P2j31O7J80n5
5504E7R6j56j22K35O2j24k84M07k01P5j05J52P3p2O8l82J63j48J79K4k3o0RN5
$$ plain form
5528 -22 -55 -17 93 95 -110 84 -88 -97 18 236 124 -84 129 -112 -183 -65 -117 70 309 -160 -34 -4 11 -78
5552 -78 -15 -114 -36 58 26 -170 5 -57 -167 -51 -1 -86 -149 -177 93 64 73 -10 132 -85 -98 45 -153 -136 -142 143
5578 143 54 125 133 283 -28 -82 -43 -39 46 14 31 -27 -64 128 -2 -21 257 -173 57 -41 -12 18 21 -84 -197 -80
5604 -80 46 41 -78 -71 -14 -198 65 7 -15 33 134 20 -156 -176 39 109 107 -6 37 211 -139 -192 -211 101 -102
5629 -102 -4 -270 80 106 69 98 -54 48 68 -91 -114 267 25 84 -229 -187 -145 70 -34 41 38 -45 -77 -137 44
5654 44 -32 56 -89 -140 -157 -18 168 95 -22 -148 73 -165 278 -167 -19 36 -118 41 43 -97 -86 -58 -37 20
5678 20 177 18 -148 98 32 59 111 66 42 22 -137 -33 16 -72 1 -114 161 -61 150 132 -126 -9 -59 200
5702 200 121 -93 3 7 -71 -41 24 -66 79 65 138 -77 321 -128 232 -9 34 21 -124 -2 134 -125 102 -90
$$ packed form
5528b2l3L8J10Kk05J94j72rJ15K18j12k08K13k41p1J18n2J87K39m69J26L0J5q9
5552g8O3r9P8R4l2j96J75o2j10J16N0q5o3k8K70k9Rq3J42k17j3J43j98J7oK85
5578A43q9P1QJ50l11n4L9MQ5l2J7n8l7J92j30j9K78m30K30r8K9L0Lj05j13J17
5604h0J26nj19PN7j84K63n8k2M8J01j14j76k0K15P0kj13M3J74l50n3j9L12k03
5629a02R8k66L50K6l7K9j52J02K0j59k3L81k42N9l13M2M2K15j04P5lq3l2o0J81
5654D4p6Q8j45n1j7J39J86p3j17j26K21k38M43m45J48N5j54J59Kj40J1K8K1N7
5678B0J57j59j66K46o6K7N2m5k4k0j59J04M9q8P3j15K75k22K11j8k58J17n0K59
5702B00p9k14R6Mp8L0O5r0J45j4P3k15L98m49L60k41M3j3j45J22J36k59K27j92
$$ plain form
5726 -90 38 -36 131 -15 214 93 -44 70 -46 61 -47 21 10 -77 87 23 79 -92 -72 66 -170 76 -116
5749 -116 -106 -73 -196 42 236 -81 -4 -167 66 12 21 -82 74 -154 284 31 -196 139 154 60 -62 -29 -83
5772 -83 28 -233 -1 170 244 80 12 -216 -57 8 -251 172 -47 130 -82 -69 206 -53 157 -104 113 44
5794 44 258 73 78 36 -27 -54 -227 31 -2 53 -13 142 116 71 -88 217 -79 -78 126 -155 -172 -68 66 174 36
5819 36 4 125 100 51 46 -78 5 43 73 131 -24 -60 -103 3 104 -79 15 -68 -124 10 84 -125 -43 -3 101 187
5845 187 0 7 -170 -139 -29 46 65 -11 -48 74 -143 -227 -84 -130 142 -43 -238 55 13 182 132 -4 -2 41 59
5870 59 -26 -83 -150 -56 -16 61 86 -222 -17 67 17 39 170 126 -35 109 -85 -49 113 -150 -184 68 -60 56 -74
5895 -74 -50 -18 106 -117 -60 -15 48 55 -117 -32 22 -64 -31 75 -54 170 70 271 42 155 171 -93 83 -77
$$ packed form
5726i0J28p4J67j46K29j21j37J14j16J07j08O8j1q7J64o4N6j71K0J38k36K46j92
5749a16J0L3j23K38J94l17P7j63K33n4Rj03J56k28M38k53k27L35J5r4j22L3n4
5772h3J11k61K32J71P4j64o8k28J59O5k59M23k19J77k12J3K75k59K10k61K17o9
5794D4K14j85Nm2o3k7j73K58l3N5o6J55k6m5j59L05k96JK04k81j7J04J34J08j38
5819C6l2J21k5m9nj24Q3L8L0N8j55l6m3J06J01j83R4q3n6J34P4k09Q2M0J04Q6
5845A87j87Pj77L1J10P5J9p6l7J22k17q4J43m6K72j85j95K93m2J69n0j36KM3J8
5870E9q5n7o7R4M0P7K5l08K05Q4n0K2J31m4j61J44j94L6J62k63l4K52j28J16j30
5895g4K4L2J24k23N7M5O3Pj72Q5N4q6L3J06j29K24j00K01k29J13J6k64J76j60
$$ plain form
5919 -77 68 101 86 -109 165 -99 170 -25 -32 204 111 -47 130 96 -17 -63 166 -113 25 46 242 25 102
5942 102 76 172 60 -27 -4 4 64 162 246 -105 -30 -35 107 -57 -34 83 -221 -92 -32 140 104 -112 109 144 -39
5967 -39 103 14 -2 261 -56 69 15 -16 93 31 180 -38 100 173 139 78 -127 134 -109 166 -193 13 174
5990 174 184 135 -45 -68 -61 -27 -73 31 -100 -20 -50 217 49 -60 -276 -146 -62 4 -205 37 -27 136 -181 -40
6014 -40 -142 57 -130 -181 145 -88 151 -26 -108 -125 256 -70 -60 21 43 126 23 -28 -134 10 103 419 -66
6037 -66 -44 10 -170 -82 -184 40 27 261 183 -233 -19 26 -244 215 25 2 15 -81 152 -62 60 30 -66 31
6061 31 61 31 -151 -73 -3 154 -78 134 -11 36 -15 -43 -31 -51 -143 104 -22 -17 2 112 123 -74 -41 74 24 2
6087 2 -22 112 46 38 -213 101 -52 187 -124 5 -156 66 -144 88 -85 -61 -44 -65 -142 16 49 -173 -91 144
$$ packed form
5919g7J45L3j5j95K74k64K69j95pK36r3j58J77l4j13m6K29k79J38K1J96k17P7
5942A02k6R6j12q7K3QO0R8Q4l51P5nJ42j64K3J17l04J29O0J72l6k16K21L5j83
5967c9J42q9j6K63l17J25n4l1J09o2J49k18J38P3l4o1k05K61k43K75l59K06J61
5990A74J0m9j80k3PL4m6J04j31Q0l0K67j68j09k16J30Q4O6k09K42o4J63l17J41
6014d0j02J99j87n1L26k33K39j77q2j7L81l26J0Q1K2Q3j03n1j06J44R3L16m85
6037f6K2N4j80Q8j02K24j3K34p8m16K14M5k70M59j90k3J3r6K33k14J22l0r6R7
6061C1L0l0j82P8P0J57k32K12j45M7n1k8J2k0r2K47j26NJ9J10J1j97L3J15n0k2
6087Bk4J34o6qk51L14j53K39l11J29j61K22k10K32j73K4J7k1p7J58L3k22Q2K35
$$ plain form
6111 144 125 -180 220 64 -56 80 -6 -111 70 152 -24 148 -38 -4 59 2 -107 87 -21 -122 55 40
6133 40 38 99 252 -306 -27 26 -149 -223 -53 -111 -13 -16 59 -34 -358 -173 94 -46 75 -191 119 107 -139 -157 186
6158 186 34 -131 92 117 -37 170 121 75 -11 -78 89 -178 39 17 68 -63 -83 34 -256 -180 36 -45 -2 -12
6182 -12 17 110 -174 -178 66 -192 -39 80 242 -115 77 184 -4 -87 185 -118 116 63 26 -116 -12 -117 188
6205 188 -46 -3 -81 95 6 -44 -65 -49 207 -92 89 -385 -70 54 8 127 11 -57 37 9 -99 164 -104
6228 -104 -89 -91 33 28 -157 -72 -214 -92 82 53 -44 110 -17 126 242 97 -170 -33 15 130 -26 -134 33
6251 33 -101 174 -109 -84 137 -14 54 -40 -46 14 105 -108 38 16 102 28 -149 -100 -146 85 -49 66 -74 -18 158
6276 158 -165 -72 7 -133 -182 -22 -93 3 -169 -51 126 -166 -85 20 74 100 23 -7 -133 55 35 46 152 -14
$$ packed form
6111A44j9l05M00j56j20J36q6j05J81Q2j76J72j86L4O3n7j09J94j08j01J77j5
6133D0kO1J53n58K79N3j75p4J70n8R8lP5r3l24J85K67j40J21k66L10j2k46j8L43
6158A86j52j65K23K5j54K07m9m6q6o7J67k67K17k2N1j31k0J17k90P6K16q1M3j0
6182a2K9R3k84mK44k58J53J19J62l57J92J07j88q3K72l03K34n3l7j42J04j05L05
6205A88k34M3p8J76q9n0k1J6K56k99J81m74L15J24m6J19j16o8R4k8j08K63k68
6228a04J5kJ24nj85Q5j42J22J74k9r7J54j27J43J16j45k67J37M8J15j56j08J67
6251C3j34K75k83K5K21j51O8r4oO0R1k13J46k2Q6p4j77M9m6K31j34J15j40N6J76
6276A58l23R3P9j40m9J60p1R6j72J18J77k92Q1J05N4K6p7l0j26J88k0J1J06j66
$$ plain form
6300 -14 94 -52 222 5 38 -16 140 34 -188 93 73 63 -93 75 -110 31 -64 29 -71 -15 -211 -167 161
6323 161 10 55 -69 25 -45 303 -195 -30 162 -125 -128 -40 0 34 -152 102 -47 -88 157 22 57 -165 -78 -53
6347 -53 -113 -86 8 -45 -149 33 -61 -147 118 1 -204 166 -118 -5 -116 159 -41 225 80 162 281 33 -54
6370 -54 143 -5 7 -40 80 234 41 -124 162 -129 -39 109 -135 -20 161 148 101 -140 -185 -87 -215 -123 39
6393 39 -163 -147 122 -188 -13 -118 64 93 101 -75 -17 -9 -123 230 120 -290 215 19 233 93 -267 -48 -9
6416 -9 5 -71 -51 14 -96 101 170 -88 125 -11 -27 -58 -112 -1 202 -93 1 334 -9 16 115 15 -54 -34 -37 53
6442 53 -23 -9 168 65 71 78 177 -7 194 3 -29 51 21 -13 159 -149 9 63 205 -192 -63 -73 134 96 223
6467 223 66 68 156 -63 -108 -89 31 196 27 32 -16 181 89 146 92 98 -34 -181 -32 -87 43 145 -3 31 7
$$ packed form
6300a4J08j46K74k17L3n4J56j06k22K81k0j0j56J68j85J41r5R3j00N6j96M4L28
6323A61j51M5j24R4p0L48m98J65J92k87lQ8M0L4j86K54j49m1K45j35L5k22Q7K5
6347e3o0K7R4n3j04J82r4q6K65j17k05L70k84J13j11K75k00K66j45Q2J19k48q7
6370e4J97j48J2m7J20J54j93j65K86k91R0J48k44J15J81j3m7k41m5R8j28R2J62
6393C9k02J6K69l10J75j05J82K9Qj76N8Qj14L53j10m10N05j96K14j40l60K19L9
6416iJ4p6K0O5j10J97O9k58K13j36j6l1n4J11K03k95R4L33l43K5R9j00o9K0lR0
6442E3p6J4J77j03OPR9j84K01j91l2Q0l0l4J72l08J58N4J42l97J29j0K07l8J27
6467B23j57KQ8k19m5J9J20J65j69Nm8J97r2N7n4Oj32j47J49n5J30J02j48L4k4
$$ plain form
6492 7 -125 114 -21 123 -8 16 -50 -33 50 83 72 -79 67 19 17 99 163 -25 249 161 110 -1 -238 69 -127
6517 -127 94 11 97 54 137 -218 41 -109 16 20 -120 -17 -165 66 -14 -66 29 116 -15 144 -31 -184 -131 36
6541 36 131 -76 47 127 -119 41 219 -52 59 42 98 137 111 -47 -203 24 89 -130 135 132 33 -51 148 13
6565 13 -99 -88 -210 30 3 131 -18 266 0 -188 -80 -101 -149 39 135 141 76 -6 -154 -37 188 11 -45 57
6589 57 44 -10 -204 -11 -144 -3 23 -111 -31 28 202 69 -35 97 198 4 29 -57 288 97 20 -59 -127 -25
6613 -25 -98 -311 62 -146 -4 -51 48 39 -37 85 16 48 17 172 -30 149 144 -10 8 -26 -12 -91 -81 15 26 -129
6639 -129 28 6 59 -31 15 40 -1 -235 -176 136 -160 -7 -28 229 3 -76 67 -73 -123 50 5 155 24 90
6663 90 18 -216 -131 -29 -93 122 -97 7 110 19 258 -86 -210 -149 123 243 -46 78 296 15 -165 56
$$ packed form
6492Gj32K39j35J44j31K4o6J7Q3L3j1j51J46m8kQ2O4j88K74q8n1j11k37L07j96
6517a27K21q3Q6m3Q3l55K59j50J25Mj40J03j48K31q0n2R5Q7j31J59j75j53N3J67
6541C6R5k07J23Q0k46J60J78k71J11j7N6L9k6j58j56K27O5k19K65lr9q4J99j35
6565A3j12J1j22K40k7J28j49K84k66j88J08k1m8J88R6Oo5q2j48J17K25j77n6J02
6589E7j3n4j94J93j33J41K6j34Q0N9J74j33j04J32J01j94K5q6L45j91p7p9o8J02
6613b5p3k13L73k08J42m7R9rp6J22o9L2l1J55k02J79nj54J8l4J4p9J0R6J1j55
6639a29J57k2N3r0M6K5m1k34N9L12k96J53k1K57k26p9J43j40n0J73m5J50j31O6
6663I0p2k34Q5J02o4K15k19J04J03r1K39l44j24O1K72J20k89J24K18k81j80K21
$$ plain form
6685 56 45 98 -256 -78 -61 -145 36 -234 292 -96 41 -13 -108 -143 74 -58 -115 -46 -208 110 82 18 218 167
6709 167 109 50 204 -41 37 -14 -79 4 52 31 68 39 67 -21 71 -100 178 -143 -192 -159 -3 -15 -129 10 -12 -113
6735 -113 10 -60 116 38 -147 -186 -270 137 29 -116 136 -162 -138 154 79 32 -70 236 -45 -58 -6 -35 195
6758 195 187 -127 45 39 -191 -84 4 -205 -156 71 43 -73 52 28 -16 -255 -115 182 65 -112 29 -254 28
6781 28 154 -67 34 -64 60 -236 -121 -50 69 14 -45 63 16 172 33 83 -78 -20 49 35 -212 136 -73
6804 -73 115 -55 35 24 -137 34 67 107 -147 126 -82 144 16 173 16 -82 -80 -64 -99 -9 99 65 175 84
6828 84 -88 109 -38 -173 8 -196 16 107 -138 -11 17 -32 -115 -41 60 156 111 -227 35 -310 -3 36 -63
6851 -63 -88 -126 17 40 30 164 130 -89 30 46 -266 204 -93 64 89 -227 -69 -42 -28 -87 39 -104 -156 -26
$$ packed form
6685E6j1N3l54J78J7q4J81k70N26l88J37n4r5l5K17j32n7O9j62L18k8o4K00n1
6709A67n8n9J54k45P8n1o5Q3M8k1L7k9K8q8R2j71K78l21m9L3J56j2j14J39k2j01
6735a13J23p0J76p8j85l9q4M07j08j45K52k98K4K92p5m7j02L06k81j3N2k9K30
6758A95ql14J72ok30J07Q8k09M9K27k8j16J25k4m4k39J40K97j17j77J41k83K82
6781B8J26k21J01r8J24k96J15P1J19n5n9J08m7J56j39N0j61N8O9j4k47L48k09
6804g3J88j70R0j1j61J71L3M0k54K73k08K26j28J57j57r8KJ6l5R0J08l4J10r1
6828H4j72J97j47j35J81k04K12R1k45J27K8m9q3P4J01R6m5l38K62l45L07L9r9
6851f3k5l8J43K3j0J34l4k19J19J6l12M70k97J57K5l16J58K7J4n9J26j43n2J30
$$ plain form
6875 -26 70 -10 17 -39 -34 83 73 74 61 15 16 -46 -129 -21 60 -102 31 28 -102 -268 160 -19 47 103 16 -27 175 160
6903 160 -27 -116 257 -109 -28 -171 -76 132 -14 172 243 -87 1 -124 -41 3 -174 -77 -33 154 -87 77 132
6926 132 -26 -83 -79 56 127 -19 160 -42 34 -1 -130 164 45 -117 33 -62 148 -100 66 -48 -73 69 -309
6949 -309 41 -18 13 91 64 -36 146 180 216 82 63 247 -59 56 201 113 59 -89 -205 -56 96 11 22 -86
6973 -86 -252 -196 52 19 -57 -88 133 -40 -58 62 5 172 -236 124 155 -103 -183 112 -150 -38 -32 -116 -161 27
6997 27 -28 -240 -135 -12 -55 -103 -105 -48 -144 -48 35 343 -101 -220 161 27 149 -154 32 -19 -64 25 -264 306
7021 306 -17 -44 -77 39 -105 0 -46 171 72 -46 183 -179 -200 -60 -39 78 233 -76 117 -163 -108 113
7043 113 34 38 121 -70 -24 -42 128 21 19 -86 103 -141 178 133 -70 318 29 136 114 4 -20 10 26 54 90
$$ packed form
6875b6R6q0K7n6NJ17j0Jj3m6Jo2q3J08Q1j62J33lj30j66M28j79O6N6q7m3K02j5
6903A60j87q9L73l66Q1j43R5K08j46J86P1l30Q8j25Q3M4j77R7M4J87k41J64N5
6926A32j58n7MJ35P1j46J79k02P6l5j29K94j19j62J50r5K10k48J66j14k5J42l78
6949c09L50n9L1P8k7j00J82L4L6j34j9J84l06J15J45q8n4j48j16J49J52q5J1j08
6973h6j66N6K48l3p6l1K21j73j8J20n7J67m08L60L1k58q0K95k62J12Oq4m5J88
6997B7n5k12J05J23m3m8kN7r6R6Q3L08m44j19L81j34J22l03J86n1m5Q9k89N70
7021C06l23k7l3J16j44J05m6K17r9j18K29l62k1J40K1J17J55l09J93k80N5K21
7043A13p9MQ3j91M6j8J70j07kj05J89k44L19m5k03L88k89J07k2j10k4L0J6K8L6
$$ plain form
7068 90 71 60 -49 203 34 13 111 -103 238 55 198 -200 53 -63 -126 -140 -117 -35 127 -118 170 29 -276
7091 -276 218 32 127 -16 10 -92 -131 59 -30 60 -72 115 -61 163 -61 -120 -118 96 -187 -178 121 -10 -125
7114 -125 -94 -37 77 -215 -103 116 44 41 -37 24 102 9 -117 15 -97 -54 61 -108 -27 -119 -145 -58 -93 126 -199
7139 -199 9 92 -25 22 -51 8 20 42 -23 51 -121 -111 -74 203 42 -135 -27 77 71 59 213 62 -46 -168
7163 -168 86 -155 -75 104 -43 -88 28 -61 48 -47 -368 30 118 84 -147 -44 -113 -26 -13 46 -62 -63 113 -41
7187 -41 166 -86 -59 -93 82 -245 162 27 -213 101 -3 115 39 96 8 17 144 164 73 182 121 76 -109 167
7211 167 -64 -106 -87 52 -43 -52 115 39 -30 -22 -31 -22 -26 185 176 3 144 -199 -76 17 -39 -109 48 68 -186 -70 -135
7238 -135 -68 46 86 -47 238 69 104 -239 -196 -201 -42 1 31 -132 23 -162 59 153 -59 -99 115 -26 -45 86
$$ packed form
7068I0j9j1j09K52j69k1R8k14L41j83J43l98K53j16o3j4K3Q2J62k45K88j41l05
7091b76M94j86R5j43K6j02l9J90q9R0j32J87j76K24k24n9KK14k83RK99j31j15
7114a25L1N7J14k92J12K19p2lp8O1P8r3j26J32j12M3J15j69Q1r2k6Q7l5K19l25
7139a99K08Q3j17M7p3N9J2K2o5P4j72J0L7K77j61j77J08J04oj2J54j51j08j22
7163a68K54k41Q0J79j47m5J16q9J09r5l21L98Q8l4k31J03o9Q7J3N9j08jJ76j54
7187d1K07k52K7l4J75l27M07j35k40L14j04J18p6N7q8RJ27K0r1J09o1m5j85K76
7211A67k31m2J9J39r5rJ67p6o9QrRmK11rj73J41l43J23R3n6p0J57K0k54J16o5
7238a35O7J14M0j33K85j69L5l43M3nJ59M3L0j63J55j85K21R4k12m0K14j41j9J31
$$ plain form
7262 86 -21 2 96 33 195 -201 264 48 67 -26 108 199 152 -111 173 -77 61 124 -141 24 61 27 46 233
7286 233 -129 -160 13 -66 -61 64 5 -43 141 -12 -124 -58 306 166 111 -72 -7 54 185 -74 20 33 69 -127
7310 -127 83 -15 -149 111 -26 51 -94 -18 104 90 85 158 137 327 152 19 -39 53 86 182 -19 115 101 -144
7334 -144 -97 -132 75 74 99 -35 -86 -74 -1 50 120 -92 170 75 265 178 -34 -97 6 74 124 106 -93 -90 330 38
7360 38 -306 1 -65 -246 -47 -78 -138 34 74 -58 6 53 -347 -52 -33 204 72 14 107 -2 -13 102 17 116
7384 116 100 -151 -2 85 103 31 -132 -119 145 34 -105 91 290 -79 -100 7 -84 -124 -176 145 -104 25 163
7407 163 -32 17 44 -53 62 -89 -83 111 147 -210 -137 -94 68 -78 -53 85 -91 105 167 -171 24 -24 -50 -165
7431 -165 -141 69 -22 -32 -58 155 -46 -45 89 -171 172 145 112 48 -12 -53 41 126 15 48 -51 -119 -132 -169 -115 22
$$ packed form
7262H6j07K3R4o3J62l96M65k16J9r3J34R1m7k63K84k50J38O3k65J65L7l4J9J87
7286B33l62l1J73p9NJ25n9m8J84j53j12O6L64j40n5j83O5O1J31k59R4J3L6j96
7310a27K10r8j34K60j37P7j45P6J22j4nP3k1J90j75j33n8R2L3R6k01J34j4k45
7334a44M7l5K07jK5j34n1J2P3N1P0k12K62r5J90q7k12o3J03O8N0j8j99LM20k92
7360C8l44L07o6j81J99l1o0J72M0j32O4M7m00K95J9K37j32n8R3j09j1J15q5R9
7384A16j6k51J49Q7J8p2j63J3K64j11j39J96J99l69k1J07r1m0n2L21k49J29J38
7407A63j95M9K7r7J15j51OJ94L6l57P3M3J62j46K5J38j76J96O2l38J95m8k6j15
7431a65K4K10r1j0k6K13k01JJ34k60L43k7l3o4o0m1R4Q5j11L3r9o8j3l7N4J37
$$ plain form
7457 22 -27 -20 83 50 39 61 71 252 85 -22 67 -123 177 -154 46 78 -60 23 146 -76 -85 147 -97 95
7481 95 -166 -62 -20 103 211 25 3 -128 -72 -99 67 101 122 -17 -236 106 61 20 24 -110 268 100 -146 103
7505 103 109 128 75 182 147 -39 22 113 -27 -65 11 18 23 -44 97 -106 62 19 237 -44 -102 -98 -135 12 -70 44 17
7532 17 -167 -84 18 -64 29 -170 80 -34 87 75 -162 -7 109 85 160 14 -48 158 111 174 -2 139 106 57
7556 57 52 -87 -30 -56 -27 -78 -376 -67 -22 5 -159 -127 140 -139 -88 33 76 -77 -62 45 -87 -119 -40 -90 110
7581 110 145 -71 172 -143 5 138 -70 -32 146 166 -28 -107 -85 90 55 34 -76 -17 -42 82 -98 -43 -58 -75
7605 -75 17 -60 197 35 174 -32 -8 -167 -127 -61 88 -84 -94 80 -52 87 62 94 -51 188 -18 49 -40 119
7629 119 132 -87 447 -226 100 -51 -66 141 138 -81 -61 -96 -29 55 -48 -105 73 -31 57 134 -13 84 -307 256
$$ packed form
7457B2m9PJ03l3j1K2J0J81j67j07Q9j90L00l31K00L2j38Q3J23k22rK32k44J92
7481I5k61J04M2J23J08j86k2j31N6k7J66L4K1j39k19L42m5m1Mj34L78j68k46K49
7505A03OJ9n3J07l5j86O1R1j40l8P6PNo7J41k03J68m3K18k81n8Ml7J47q2J14k7
7532A7j84Q3J02q2R3j99K50j14J21j2k37J55J16k4P5j46o2K06m7O3j76J41l3m9
7556E7nj39N7k6K9n1k98L09M5K7j64L2K67k79N1J21M3j53J5J07j32l2P9n0K00
7581A10L5k16K43l15J48J33k08L8J78K0j94p9K2J75l5k1j10N9k5J24j80N5j5j7
7605g5R2p7K57j62J39k06K4j59M0O6J49j72j0J74j32J39k5L2j45K39k06O7q9J59
7629A19J3k19N34o73L26j51j5K07lk19K0l5O7Q4j03n7J78j04Q8P7j47R7l91N63
$$ plain form
7653 256 40 -128 118 -188 76 52 124 31 -88 23 -80 -207 -7 17 -239 -90 -105 141 39 -2 -302 53
7675 53 33 44 61 112 -28 203 115 18 195 -89 -23 -2 -74 1 -16 0 367 7 -59 -39 -341 -86 -146 -55 22 73
7701 73 34 128 150 -158 -100 -101 150 -44 -131 -23 37 93 -118 -86 -143 53 203 146 49 -53 -31 -21 23 92 156 -74
7727 -74 -60 -35 -61 214 -56 -89 -47 -74 -49 -70 -91 117 168 -77 13 219 -224 -33 206 62 -69 91 -57 -64 23
7752 23 -113 138 -126 141 -18 183 74 86 0 -39 169 5 -7 -16 -21 3 -4 102 62 -9 -110 -150 -45 -122 -50 -2
7778 -2 150 115 102 -84 -68 -66 127 -22 170 -12 -126 -165 -268 -47 -189 -195 205 136 34 100 -130 -69 -36 -113 -1
7803 -1 102 8 137 -43 2 24 -3 -118 38 185 -98 -46 -79 13 4 -208 -10 -49 -28 -91 0 -194 180 0 32
7828 32 71 -7 -105 31 178 77 -29 -265 108 89 0 -80 -72 4 -88 -21 156 29 32 -26 84 -136 -44 -77 -50 135
$$ packed form
7653B56k16j68K46l06K64k4P2r3j19J11j03j27K00K4k56J49j5K46j02m1l00L55
7675E3k0J1J7N1j40K31q8r7J77k84O6K1p2P5j7J6L67l60o6K0l02K55o0R1P7N1
7701G3l9R4K2l08N8jK51j94q7J08O0N6k11L2n7J96J50n7r7j02K2J0M4O9O4k30
7727g4J4K5k6K75k70l3M2k7K5k1k1K08N1k45R0K06m43J91K39j44j31J60j48pQ7
7752B3j36K51k64K67j59K01j09J2q6l9K08j64j2rnK4pJ06m0p1j01m0J05p7P2M8
7778bJ52l5j3j86J6KJ93j49J92j82j14l9j03K21j42oM00o9j02O6k30O1L3p7J12
7803aJ03r4J29j80M5K2k7j15J56J47k83N2l3R2rk12J98l9K1o3R1j94L74j80L2
7828C2L9p8r8J36J47j01j06k36L73j9q9q0QP6r2O7J77j27Ln8J10k20R2l3K7J85
$$ plain form
7854 135 -13 38 70 198 -133 -143 43 3 182 24 -172 -109 88 -94 161 3 -86 163 -51 -48 -134 47 36
7877 36 -62 12 -42 97 77 39 -271 -117 166 40 85 -100 137 -127 8 117 -56 48 -48 255 -86 -60 -230
7900 -230 77 10 -30 124 59 130 -48 -40 -146 -6 67 -155 225 -8 152 -87 -67 -66 -49 167 -3 47 64 157 -210
7925 -210 -18 33 16 6 -8 174 -46 216 -52 177 -93 -9 73 216 28 112 -54 -107 -189 126 144 110 125 5
7949 5 5 -116 152 -89 -133 -58 162 61 -72 -86 140 57 -60 -3 -153 70 31 -4 -20 -68 148 181 49 -73 31
7974 31 -189 103 -1 55 7 73 81 44 -60 -60 -67 -57 65 -38 -148 -92 255 35 166 59 25 -40 42 67 -164 148
8000 148 135 -8 27 276 129 -23 100 -92 101 -119 91 87 -30 192 14 59 58 146 -54 57 -1 -43 -74 172
8024 172 -2 -67 -44 -111 -96 189 -8 -46 -130 -47 35 0 178 -62 189 -31 219 57 98 -78 165 -334 11
$$ packed form
7854A35j48N1L2J28l31j0J86m0J79j58j96O3J97j82K55j58q9K49k14Lq6J81j1
7877C6r8P4n4J39k0l8l10J54K83j26M5j85K37k64J35J09j73J04r6L03l41K6j70
7900b30L07o7m0J54o5P1j78Qj06J40P3k22L80k33J60k39K0JJ7K16j70N0J7R3l67
7925b10J92N1j7j0j4J82k20K62k68K29k70Q4Q2J43j88Q4j66n3q2L15J8l4J5j20
7949E%j21K68k41m4P5K20j01j33j4K26q3j17N7j50K23l9l5j6m8K16L3j32j22J04
7974C1k20K92j04N6m8O6Ql7j04%pJ0J22j03j10N6L47k20J31j07l4o5Q2K5k31L12
8000A48j3j43L5K49j47j52J23j92J93k20K10mj17K22j78M5jQ8k00J11n8m2l1K46
8024A72j74o5K3o7J5K85j97l8q4Q3Q2l5J78k40K51k20K50j62M1j76K43m99L45
$$ plain form
8047 11 232 -47 58 18 103 -91 -92 7 31 85 33 -89 -99 62 -5 80 -26 224 85 -125 -20 -39 -88 -39 57
8072 57 49 92 169 74 -8 -58 64 -60 -24 250 6 158 93 -15 89 -166 -47 110 -171 -87 -68 -73 -95 -20 -27 86
8098 86 158 87 59 72 -78 122 96 137 -93 -201 0 -101 -34 -211 -22 -51 -3 61 211 30 -18 62 29 -53 95
8123 95 -43 291 -151 76 190 -43 19 -33 74 99 -41 -41 -59 -26 -130 11 56 -148 -54 -23 -88 -61 73 -11 -153
8148 -153 -3 119 -39 -20 -144 115 -130 110 102 169 201 91 -1 -97 12 0 13 -87 -85 -59 3 58 -31 9 -19 -111
8174 -111 -126 118 169 140 103 -37 -67 -39 97 244 -5 -52 -61 119 -22 163 -88
$$ packed form
8047A1K21k79J05m0Q5j94jR9K4N4n2j22j0J61o7Q5j06K50j39k10J05j9m9M9R6
8072E7qM3P7r5q2n0J22j24L6K74k44J52o5j08J04k55J19J57k81Q4J9nk2P5pJ13
8098H6P2p1k8J3j50K00k6M1k30j08K01j01O7j77J89k9M8O4J50j81m8Q0l3q2J48
8123I5j38L34m42K27J14k33O2n2J07K5j40%j8L3j04J41M5k04R4L1o5K7J34q4j42
8148a53J50J22j58J9j24K59k45K40qO7L2j10r2r6J09j2J3j00KK6O2N5q9M0k8r2
8174a11j5K44N1k9l7j40l0K8J36J47k49m7rJ80j41J85k51
8191h8
$$ Imaginary data points
##PAGE= N=2
##DATA TABLE= (X++(I..I)), XYDATA
$$ plain form
0 0 0 0 0 0 0 0 0 0 0 -8 8 -8 8 -16 16 -24 24 -32 40 -48 58 -72 88 -102 119 -136 160 -184 214 -242 280 -319
32 -319 362 -410 462 -522 586 -655 731 -816 909 -1009 1120 -1240 1372 -1515 1675 -1845 2033
49 2033 -2239 2467 -2719 2997 -3307 3655 -4046 4492 -5000 5595 -6298 7138 -8168 9466
63 9466 -11159 13471 -16829 22169 -32012 56224 -247547 -180912 288175 -34575 -136438 63592
75 63592 88518 -126205 -69040 53271 124651 206914 185857 -56118 -57341 97229 -34358
86 -34358 -172467 86599 172997 -114566 -183355 21944 -34209 -162164 85 112903 -22898
97 -22898 10219 111362 -65386 -150865 91546 150384 -34067 -25011 78572 -12701 -74710
108 -74710 7928 -1739 -21894 109914 78375 -126017 -43205 142621 -12708 -137044 64620
$$ packed form
0@%%%%%%%%%qJ6j6J6k4L2m0M8n6P2q8J06j30J60j90K21k55K96l44L98m56N22n99
32c19O81p72Q72r84J108j241J386j547J725j918K129k360K612k887L190l520L878
49B033m272M706n186N716o304O962p701Q538r492J0595j1893J3436j5306J7634
63I466k0625K4630l0300L8998n4181Q8236l03771O6635M69087l22750j01863K00030
75F3592K4926k14723N7165J22311P1380Q2263k1057k41975j223J54570j31587
86c4358j38109K59066Q6398k87563o8789K05299n6153j27955J62249J12818j35801
97b2898L3117J01143j76748q5479K42411N8838j84451R056J03583r1273o2009
108g4710Q2638r667k0155J31808l1539k04392Q2812J85826j55329j24336K01664
$$ plain form
119 64620 108444 -118655 -119002 64152 10101 -112585 -27960 20681 -30311 39363 65877 -45188
131 -45188 18103 155097 26376 -93501 74543 155139 -29265 -82640 36545 -16399 -112233
142 -112233 -24240 -2368 -89468 -26704 31613 -78954 -70052 84154 54078 -53034 56324
153 56324 150332 6567 -55315 70712 61530 -35186 8465 24195 -52878 -24677 10350 -87300
165 -87300 -89365 57383 43775 -92059 -26882 89244 -7977 -65721 53728 65455 -19289
176 -19289 12431 36444 -31700 -14072 48208 -16713 -58291 46293 52180 -75197 -37960 81505
188 81505 13922 -63262 13378 39004 -22216 -9416 11440 -37025 -22290 39571 -19625 -77393
200 -77393 26692 70217 -45898 -45262 69130 43975 -32777 8981 49445 12197 4481 14820
$$ packed form
119F4620M3824k27099l47J83154n4051j22686Q4625M8641n0992O9674K6514j11065
131d5188O3291J36994j28721j19877J68044Q0596j84404n3375J19185n2944r5834
142a12233Q7993K1872q7100O2764N8317j10567Q902J54206l0076j07112J09358
153E6324R4008j43765o1882J26027r182r6716M3651J5730p7073K8201L5027r7650
165h7300k065J46748j3608j35834O5177J16126r7221n7744J19449J1727q4744
176a9289L1720K4013o8144J7628O2280o4921m1578J04584N887j27377L7237J19465
188H1505o7583p7184P6640K5626o1220J2800K0856m8465J4735O1861n9196n7768
200g7393J04085M3525j16115O36J14392k5155p6752M1758M0464l7248p716J0339
$$ plain form
212 14820 -25112 -21127 32368 -18390 -83437 3419 54413 -50424 -74042 29058 38573 -28915
224 -28915 -9358 41804 24837 11397 20717 -10186 -6584 53031 18953 -55688 -3122 48699
236 48699 -29294 -71186 3590 33207 -20147 -25463 9488 -1450 -4028 16032 -9979 -11241 49228
249 49228 32845 -42445 -18653 44728 10042 -41637 -3691 35923 727 -23815 -10547 -9367
261 -9367 6570 22742 -14342 -24686 29973 27387 -39295 -32220 37338 31978 -28750 -20598 21672
274 21672 8625 -14270 -10466 -3763 15859 23302 -15648 -29076 16890 31869 -16829 -29818 22157
287 22157 30939 -19489 -26025 8869 13399 507 -9409 -13006 6229 18285 -7994 -25606 5341
300 5341 31153 -1248 -30525 3113 28615 471 -18443 -2838 13605 11285 -10766 -19080 4530
$$ packed form
212A4820l9932L985N3495n0758o5047Q6856N0994j04837k3618J03100R515o7488
224b8915J9557N1162j6967j3440R320l0903L602N9615l4078p4641N2566N1821
236D8699p7993m1892P4776K9617n3354n316L4951j0938k578K0060k6011j262O0469
249D9228j6383p5290K3792O3381l4686n1679L7946L9614l5196k4542J3268J180
261i367J5937J6172l7084j0344N4659k586o6682P075O9558n360o0728Q152M2270
274B1672j3047k2895L804O703J9622P443l8950j3428M5966J4979m8698j2989N1975
287B2157Q782n0428o536L4894M530j2892r916l597J9235J2056k6279j7612L0947
300E341K5812l2401k9277L3638K5502k8144j8914J5605J6443k320k2051q314K3610
$$ plain form
313 4530 20200 -978 -24778 -6887 23339 5945 -24014 -4809 23786 13018 -12598 -13828
325 -13828 11128 19998 -4138 -16678 1476 14594 -407 -23125 -14218 13569 9303 -15811 -15249
338 -15249 7671 17388 -3148 -15794 10909 28742 6177 -11992 680 16157 7880 -12878
350 -12878 -13159 3986 5803 -12322 -27234 -10882 15086 -525 -25039 -1392 25541 8608 -11674
363 -11674 2426 23546 17843 293 -2188 4897 11172 2433 -21721 -16442 14424 2433 -31091
376 -31091 -17247 13734 3483 -19742 -6319 16558 10574 271 1368 1298 11237 16735 -7851
389 -7851 -13387 17186 15407 -20167 -18214 14418 9985 -16668 -7610 10970 1329 -3254 -94 -9433
403 -9433 -314 16259 -6056 -23927 4554 18388 -14138 -22388 13820 18972 -9118 -2954 14783
$$ packed form
313D530J5670k1178k3800J7891L0226j7394k9959J9205K8595j0768k5616j230
325a3828K4956Q870k4136j2540J8154J3118j5001k2718Q907K7787m266k5114N62
338a5249K2920R717k0536j2646K6703J7833k2565j8169J2672J5477q277k0758
350a2878k81J7145J817j8125j4912J6352K5968j5611k4514K3647K6933j6933k0282
363a1674J4100K1120n703j7550k481P085O275q739k4154N279L0866j1991l3524
376c1091J3844L0981j0251k3225J3423K2877n984j0303J097p0R939N498k4586
389g851n536L0573j779l5574J953L2632m433k6653R058J8580r641m583L160r339
403i433R119J6573k2315j7871K8481J3834l2526q250L6208N152k8090O164J7737
$$ plain form
416 14783 6863 7652 12393 -3837 -286 20700 1610 -28912 -7910 16948 -14342 -36162 -2024
429 -2024 9647 -18020 -13502 5966 2614 8098 17696 2346 2391 29640 22441 -14567 -2354 30429
443 30429 2046 -31357 -4912 8033 -18979 -20150 -6103 -11843 -7463 6383 -6701 -13546 18760
456 18760 26156 -12262 -6049 35874 16910 -19525 2651 20524 -3982 -10772 517 -7346 -8141
469 -8141 7663 -6242 -24958 6419 23678 -17413 -22339 22400 15110 -20782 -5538 15850 -1560
482 -1560 -8137 5500 -2026 -6840 14314 7298 -18327 6923 31173 -6161 -20473 19534 20222
495 20222 -17232 -12904 9805 -3386 -14621 -2634 -11067 -18404 8388 6548 -24915 -3979 31481
508 31481 4668 -16687 17227 29667 -1720 -2871 18523 4361 -9571 4926 -4377 -21195
$$ packed form
416A4783p920P89M741j6230L551K0986j9090l0522K1002K4858l1290k1820L4138
429b024J1671k7667M518J9468l352N484R598j5350M5K7249p199l7008J2213L2783
443C0429k8383l3403K6445J2945k7012j171J4047n740M380J3846j3084o845L2306
456A8760P396l8418O213M1923j8964l6435K2176J7873k4506o790J1289p863p95
469h141J5804j3905j8716L1377J7259m1091m926M4739p290l5892J5244K1388j7410
482a560o577J3637p526m814K1154p016k5625K5250K4250l7334j4312M0007O88
495B0222l7454M328K2709j3191j1235J1987q433p337K6792j840l1463K0936L5460
508C1481k6813k1355L3914J2440l1387j151K1394j4162j3932J4497r303j6818
$$ plain form
520 -21195 1185 3495 -29801 -18074 18985 -544 -27627 3271 26520 -943 -7094 16915
532 16915 9859 104 16109 5069 -15972 7050 17840 -17314 -21656 13734 6591 -24883 -6946
545 -6946 15936 -6595 -12663 11015 4135 -8007 9099 5595 -13915 4341 19439 -10772 -20618
558 -20618 16275 16794 -19616 -9332 19080 3208 -7951 8499 2027 -7514 10983 8744 -17588
571 -17588 -7063 17356 -5236 -25510 3913 12387 -17875 -10860 15056 991 -9408 9509
583 9509 8834 -2784 11542 14101 -10256 -3828 23460 2279 -25848 403 16576 -13410 -18968
596 -18968 2929 -1295 -9379 3584 1502 -10455 5922 17439 -6197 -8174 21256 11242 -16462
609 -16462 2157 18364 -6607 -14094 6737 4286 -10079 -1797 1203 -10314 1150 13372 -9442
$$ packed form
520b1195K2380K310l3296J1727L7059j9529k7083L0898K3249k7463o151K4009
532A6915p056r755J6005j1040k1041K3022J0790l5154m342L5390p143l1474J7937
545f946K2882k2531o068K3678o880j2142J7106l504j9510J8256J5098l0211r846
558b0618L6893N19l6410J0284K8412j5872j1159J6450o472r541J8497k239k6332
571a7588J0525K4419k2592k0274K9423Q474l0262P015K5916j4065j0399J8917
583I509o75j1618J4326K559k4357O428K7288k1181k8127K6251J6173k9986n558
596a8968K1897m224q084J2963k082j1957J6377J1517k3636j977K9430j0014k7704
609a6462J8619J6207k4971p487K0831k451j4365Q282L000j1517J1464J2222k2814
$$ plain form
622 -9442 -14292 16569 12458 -16960 -5535 16342 1546 -10250 3557 3627 -7362 3202 7075
635 7075 -10106 -2095 15720 -2535 -14006 10521 12905 -12436 -7445 13652 1683 -13310 -462
648 -462 4050 -6660 -279 3852 -10959 -3492 15298 -484 -14782 7490 17383 -5286 -8249 11119
662 11119 6519 -7391 1201 4284 -7312 -1193 5082 -9639 -8238 9320 782 -14539 872
675 872 13803 -3542 -9777 9023 8660 -4787 1498 5109 -3801 1966 7953 -6686 -8768 8952
689 8952 5099 -13462 -5358 11276 -757 -10699 3100 5152 -4636 778 4001 -4151 779 8001
703 8001 -2972 -7975 7447 8475 -9664 -5806 10827 2041 -9405 620 4435 -2494 -172 1737
717 1737 -4370 -809 7183 -1553 -9522 4061 9746 -6540 -7134 7786 3859 -6214 -392 3549
$$ packed form
622i442m850L0861m111k9418J1425K1877j4796j1796J3807P0j0989J0564L873
635G075j7181Q011J7815j8255j1471K4527K384k5341M991K1097j1969j4993J2848
648d62M512j0710O381M131j4811P467J8790j5782j4298K2272R893k2669k963J9368
662A1119m600j3910Q592L083j1596O119O275j4721J401J7558q538j5321J5411
675H72J2931j7345o235J8800l63j3447O285L611q910N767N987j4639k082J7720
689H952l853j8561Q104J6634j2033r942J3799K052r788N414L223q152M930P222
703H001j0973n003J5422J028j8139L858J6633q786j1446J0025L815o929K322J909
717A737o107L561P992q736p969J3583N685j6286n94J4920l927j0073N822L941
$$ plain form
731 3549 -448 251 2476 -3600 -1989 6853 484 -9524 1636 9420 -4186 -7929 4403 4563 -3792
746 -3792 -2015 2064 -23 548 2279 -3237 -2738 6633 2776 -8395 -407 8654 -1039 -7315 1619
761 1619 5055 -1671 -3183 426 -260 214 2201 -2651 -3450 5551 3379 -6720 -1347 7691 1652 -5185
777 -5185 -41 4717 36 -2604 -389 -912 -123 1888 -3221 -4839 2886 3234 -4785 -3046 4774 3613
793 3613 -3138 -1087 4624 2383 -145 571 -282 1219 2712 -2443 -4593 1208 2604 -4225 -5246 1510
809 1510 2806 -3291 -2828 2464 2492 1032 381 25 2695 3869 34 -2477 1582 3430 -1511 -4807
825 -4807 -217 2169 -2018 -3624 -955 754 554 -1187 -1883 1278 3099 457 -1778 272 3768 1392
841 1392 -2999 -646 2810 927 -1907 -1894 878 2200 -1016 -2715 267 2152 244 -2623 -1926 1743
$$ packed form
731C549l997O99K225o076J611Q842o369j0008J1160P784j3606l743J2332J60q355
746c792J777M079k087N71J731n516M99R371l857j1171P988R061r693o276Q934
761A619L436o726j512L609o86M74J987m852p99R001k172j0099N373R038o039o837
777e185N144M758m681k640K215n23P89K011n109j618P725L48q019J739P820j161
793C613o751K051N711k241k528P16q53J501J493n155k150N801J396o829j021O756
809A510J296o097M63N292K8j460o51l56K670J174l835k511M059J848m941l296
825d807M590K386m187j606K669J709k00j741o96L161J821k642k235K050L496k376
841A392m391K353L456j883k834J3K772J322l216j699K982J885j908k867O97L669
$$ plain form
857 1743 958 -2805 -2363 1147 2239 -973 -2859 1006 3769 351 -1792 1347 3359 2084 -1079 -952
873 -952 1903 1575 -1436 -3336 -1308 1417 -1769 -5236 -1324 2430 -491 -2573 256 2863 2193 234
889 234 909 2215 3315 1954 -1282 -1010 2851 513 -4450 -2053 1437 -940 -4045 -2292 574 124
905 124 -805 -489 191 2056 2960 -571 -1365 3853 3118 -2489 -1728 2489 1201 -2736 -1820 1053 -39
922 -39 -611 -285 -1248 424 2709 -1362 -3099 1893 3172 -2223 -3084 1874 2240 -2249 -1534 1542 47
939 47 142 982 -1143 92 3601 674 -2588 1180 3919 -958 -3858 747 1630 -2772 -2277 21 -1230
956 -1230 -648 806 -1473 -963 3252 2224 -2147 478 4899 1224 -2618 1408 2675 -1593 -1245 30
972 30 -1903 -1168 576 -1968 -3256 1570 2177 -3074 -1863 4345 1676 -3000 1026 2889 -469 -104
$$ packed form
857A743p85l763M42L510J092l212j886L865K763l418k143L139K012j275l163J27
873i52K855l28l011j900K028K725l186l467L912L754k921k082K829K607o70j959
889B34O75J306J100j361l236K72L861k338m963K397L490k377l105J753K866m50
905A24r29L16O80J865R04l531p94N218p35n607P61M217j288l937R16K873j092
922c9n72L26r63J672K285m071j737M992J279n395q61M958L66m489P15L076j495
939D7R5Q40k125J235L509k927l262L768K739m877k900M605Q83m402M95K298j251
956a230N82J454k279N10M215j028m371K625M421l675l842M026J267m268L48J275
972C0j933P35J744k544j288M826O07n251J211O208k669m676M026J863l358L65
$$ plain form
988 -104 1093 -837 -538 1989 -804 -3696 958 3385 -2740 -3163 3398 1976 -3023 -417 2307 -549
1004 -549 -941 903 -710 -1217 1734 440 -3528 341 3992 -1684 -3067 3054 2859 -2019 -629 2352
1020 2352 369 -557 840 -649 -1902 1785 538 -4385 -1393 3534 -1016 -4058 1416 2728 -1543
1035 -1543 -834 2591 702 -500 2024 617 -1494 1886 2034 -3287 -1627 3181 -279 -4092 -4
1050 -4 2361 -1385 -2138 1302 394 -702 1929 427 -1867 1648 2849 -2203 -2090 2984 1188 -3127
1066 -3127 -568 2599 -807 -2162 1369 340 -1475 1211 509 -2005 315 2560 -1439 -2511 2348
1081 2348 2203 -2850 -1141 2786 44 -1631 1133 129 -1286 1570 1176 -2031 -554 2748 -383
1096 -383 -3021 1147 2202 -2237 -1562 1991 -505 -1841 891 501 -1164 994 1467 -1970 -590 3034
$$ packed form
988a04J197j930K99K527k793k892M654K427o125m23O561j422m999K606K724k856
1004e49l92J844j613n07K951j294l968L869L651n676j383O121j95m878J390K981
1020B352j983r26J397j489j253L687j247m923K992M927m550l042N474J312m271
1035a543P09L425j889j202K524j407k111L380J48n321J660M808l460l813M088
1050dK365l746p53L440r08j096K631j502k294L515J201n052J13N074j796m315
1066c127K559L167l406j355L531j029j815K686p02k514K320K245l999j072M859
1081B348j45n053J709L927k742j675K764j004j415K856l94l207J477L302l131
1096c83k638M168J055m439O75L553k496j336K732l90j665K158M73l437J380L624
$$ plain form
1112 3034 562 -3037 616 2698 -1126 -1771 1142 40 -1213 674 167 -1650 267 1803 -1222
1127 -1222 -1916 2417 1296 -2495 -46 2542 -783 -1484 1410 624 -1100 335 333 -1549 -111 1882
1143 1882 -1138 -2313 1996 1820 -2326 -990 2055 257 -1275 477 657 -873 779 1103 -1478 -502
1159 -502 1920 -396 -2480 920 1494 -2027 -1516 1650 332 -1453 83 1056 -310 333 1183 -737
1175 -737 -449 2249 194 -2367 625 1919 -903 -2056 666 393 -1372 -78 467 -1070 -144 1284
1191 1284 -819 -873 1707 861 -1446 180 1897 -218 -1418 724 913 -882 -122 513 -837 -136 712
1208 712 -972 -1617 1039 991 -1395 -768 1622 428 -1263 332 675 -556 82 589 -613 -226 1198
1225 1198 -87 -998 534 1371 -1174 -1254 1167 448 -1268 -323 418 -556 -286 -2 -679 -422 1051 282
$$ packed form
1112C034k472l599L653K082l824o45K913j102j253J887n07j817J917J536l025
1127a222o94M333j121l791K449K588l325p01K894p86j724J435kj882J438J993
1143A882l020j175M309j76m146J336L045j798j532J752J80j530J652L24k581R76
1159e02K422k316k084L400N74l521N11L166j318j785J536R73j366O43Q50j920
1175g37K88K698k055k561K992J294k822j153K722k73j765J294N45j537R26J428
1191A284k103n4K580q46k307J626J717k115j200K142J89j795P60O35j350P01Q48
1208G12j684o45K656m8k386O27K390j194j691J595L43j231O38N07j202L87J424
1225A198j285r11J532Q37k545q0K421p19j716R45P41r74K70K84o77K57J473p69
$$ plain form
1243 282 -793 352 1762 -68 -846 972 791 -510 -296 286 -371 -330 -214 -851 -1255 282 103 -1112
1261 -1112 -373 1435 68 -768 614 949 377 124 541 293 129 299 -562 -894 248 553 -1231 -687
1279 -687 771 -62 -1134 -205 774 109 -153 291 373 288 518 -37 -781 363 567 -435 -881 584 515
1298 515 -539 -417 204 198 -237 -194 -101 -58 337 -258 -652 51 597 -555 -753 263 448 -349 -293 278 356
1319 356 195 253 -67 191 464 234 -689 -164 369 -284 -723 -442 175 -119 -388 -6 367 -97 101 202
1339 202 239 645 366 -10 146 457 -48 -456 -422 328 -142 -552 -447 63 94 40 -18 56 231 362 -12 -178
1361 -178 440 178 7 -306 -122 69 -171 -93 -24 244 122 -186 -356 220 274 -200 -202 268 156 67 -338 -278
1383 -278 28 141 -410 -346 487 127 -53 -30 265 411 444 4 -4 471 157 -144 -238 9 325 -290 -391 -110
$$ packed form
1243B82j075J145J410j830p78J818j81j301K14N82o57M1J16o37m04J537j79j215
1261a112P39J808j367q36J382L35n72k53M17k48j64J70q61l32J142L05j784N44
1279f87J458q33j072R29R79o65k62M44Q2q5K30n55p44J144K04j002m46J465o9
1298E15j054J22O21om35M3R3M3L95n95l94P03N46j152j98J016J85p97N6N71P8
1319C56j61N8l20K58K73k30r23N25N33o53m39K81O17k94k69L82L73m64J98J01
1339B02L7M06k79l76J56L11n05m08L4P50m70m10J05N10L1n4n8P4J75J31l74j66
1361a78O18k62j71l13J84J91k40P8O9K68j22l08j70N76N4m74kM70j12q9m05O0
1383b78L06J13n51O4Q33l60j80K3K95J46L3m40qM75l14l01r4K47L16o15j01K81
$$ plain form
1405 -110 261 -328 -415 98 314 267 20 231 304 462 242 -421 111 411 -58 -622 118 117 -141 -422 -82 95
1427 95 12 114 65 140 326 383 -261 -116 643 344 -202 -10 335 -109 -240 -116 -90 -39 63 -56 -232 267
1449 267 371 -455 -340 491 243 -241 -242 474 82 -98 -136 119 48 272 131 -248 87 821 -205 -418 323
1470 323 339 -366 -530 339 250 -574 68 -108 -166 139 222 -383 -25 617 -44 -480 275 633 38 -153 200
1491 200 109 -267 139 -108 -415 130 229 -493 -377 333 152 -475 153 744 97 -335 426 302 -152 201 93
1512 93 -98 -47 185 -175 -636 162 442 -362 -366 504 -65 -336 261 264 35 298 98 -205 -60 400 -36 -544
1534 -544 55 382 -608 -755 327 380 -390 -33 135 -207 12 239 -38 -348 770 152 -706 166 780 -190
1554 -190 -655 488 323 -145 -397 -44 -148 -250 390 -240 -452 556 524 -508 -134 846 -19 -697 140
$$ packed form
1405a10L71n89q7N13K16m7k47K11P3J58k20o63N32L00m69n64P40jk58k81L40J77
1427I5q3J02m9P5J86N7o44J45P59k99n46J92L45m44j31J24K6N1J02j19j76M99
1449B67J04q26J15Q31k48m84jP16l92j80l8K55p1K24j41l79L35P34j026k13P41
1470C23J6p05j64Q69q9q24O42j76n8L05Q3o05L58O42o61m36P55L58n95j91L53
1491B00r1l76M06k47l07N45R9p22J16P10j81o27O28N91o47m32P61j24m54L53j08
1512I3j91N1K32l60m61P98K80q04mQ70n69k71N97Lk29K63k00l03J45M60m36n08
1534e44N99L27r90j47J082N3p70L57J68l42K19K27k77l10J118o18q58Q72O14r70
1554a90m65J143j65m68k52L53j04j02O40o30k12J008l2j032L74R80q65o78Q37
$$ plain form
1573 140 541 -56 -143 254 -72 -117 375 -149 -592 204 552 -771 -438 557 299 -616 -144 406 -44 -284
1593 -284 324 -199 -199 517 -69 -407 508 675 -421 -560 561 481 -373 -324 311 -249 -581 203 -161 -331 199
1614 199 96 -606 54 891 265 -486 410 739 -43 -252 380 -164 -394 131 -31 -453 174 162 -791 -362
1634 -362 675 163 -726 194 867 -40 -102 420 169 -96 513 125 -524 342 516 -457 -859 496 184 -970
1654 -970 -118 508 -123 -314 279 191 -290 337 243 -501 -204 684 -283 -742 598 620 -505 -289 355 0
1674 0 -358 197 140 -295 202 266 -660 -359 959 77 -1051 294 577 -422 -425 277 354 -361 406 334 -10 350
1696 350 315 -689 -589 658 136 -1030 -111 575 -432 -911 28 136 -197 5 214 -225 304 691 -417
1715 -417 -229 776 413 -749 -85 471 21 -769 187 276 -400 -258 36 -419 122 655 82 -462 515 648
$$ packed form
1573A40M01n97q7L97l26m5M92n24m43P96L48j323L33R95k58r15M72N50m50k40
1593b84O08n23%P16n86l38R15J67j096j39J121q0q54M9O35n60l32P84l64j70N30
1614A99j03p02O60Q37o26p51Q96L29p82k09O32n44k30N25j62m22O27j2r53M29
1634c62J037n12q89R20O73r07o2N22k51k65O09l88o49Q66J74r73m02J355l12j154
1654i70Q52O26o31j91N93q8m81O27r4p44K97Q88r67m59J340K2j125K16O44l55
1674@l58N55n7m35M97O4r26L01J318q82j128J345K83r99lP02P7p15P67p2l44L60
1696C50l5j004J00J247n22j166R19O86j007m79R39J08l33K02K09m39N29L87j108
1715d17J88J005l63j162O64N56m50p90R56Q9o76J42K94m55N41N33n73n44R77J33
$$ plain form
1735 648 -436 -241 597 390 -507 -10 208 -251 134 423 -345 92 651 -142 -654 297 678 -421 -601
1754 -601 547 216 -631 99 116 -370 7 170 -251 -42 476 256 -494 47 811 -190 -446 376 245 -243
1774 -243 81 59 -188 -125 19 -409 -524 303 320 -535 -96 1001 226 -425 592 387 61 55 31 -125 -18
1795 -18 99 -394 -440 189 376 -689 -266 454 201 -200 -199 373 30 16 170 -41 221 500 30 -455 144
1816 144 652 -228 -294 298 111 -232 -198 122 268 66 52 -311 -176 289 -16 -666 26 384 -184 -349 482
1837 482 600 -16 -262 274 381 178 294 -293 29 425 31 -638 -232 378 -284 -634 -97 229 13 -237
1857 -237 93 130 420 121 112 190 540 170 -307 -67 321 72 -519 -139 187 -32 -421 -232 15 159 17
1878 17 -166 138 425 445 -96 38 96 434 -233 -234 225 -153 -79 -161 203 215 -62 -270 -135 200 440 -230 -419
$$ packed form
1735F48j084J95Q38k07q97M97K18m59L85K89p68M37N59p93n12R51L81j099j80
1754f01J148l31q47P30J7m86L77J63m21K09N18k20p50N41P64j001k56Q22j31m88
1774b43L24k2k47O3J44m28j15Q27J7q55M39J097p75o51J017k05l26ok4j56J07
1795a8J17m93m6O29J87j065M23P20k53m01JN72l43j4J54k11K62K79m70m85N99
1816A44N08q80o6N92j87l43L4L20J46k02j4l63J35M65l05o50O92L58n68j65Q31
1837D82J18o16k46N36J07k03J16n87L22L96l94o69M06O10o62l50N37L26k16k50
1857b37L30L7K90k99rP8L50l70m77K40L88k49n91L80L26k19l89J89K47J44j42
1878A7j83L04K87K0n41J34N8L38o67jM59l78P4q2L64J2k77k08J35L35K40o70j89
$$ plain form
1901 -419 22 265 -155 -396 104 171 139 -185 1 82 128 -274 -150 349 65 -227 -136 -62 172 -68 -243 -224
1923 -224 38 391 -331 -333 122 346 -176 -2 147 99 123 -46 -211 93 254 -41 -314 141 102 -381 -494 145
1945 145 244 -119 51 56 182 42 -7 -184 84 576 282 -462 18 518 -121 -340 99 -45 -161 -183 -244 116
1967 116 154 -80 -227 -70 419 352 -219 -16 813 6 -129 365 164 -221 -271 -93 9 -84 112 -54 -481
1988 -481 233 156 -340 -115 228 32 -496 -121 436 266 -50 283 -260 13 303 -77 -465 256 300 -368 -463
2009 -463 163 271 -545 -222 299 63 -52 166 -103 -132 384 -102 -400 -76 469 -215 -455 281 264 -282 -68
2030 -68 602 -68 -57 135 -241 -278 165 87 -509 -120 423 27 -536 500 523 -279 -156 417 -303 -55 174
2051 174 -93 -363 -42 145 -452 -165 600 53 -678 87 529 -219 -311 214 90 144 325 81 -200 265 434
$$ packed form
1901d19M41K43m20k41N00O7l2l24J86Q1M6m02J24M99k84k92R1P4K34k40j75J9
1923b24K62L53p22kM55K24n22J74J49m8K4j69j65L04J61k95k73M55l9m83j13O39
1945A45R9l63J70NJ26j40m9j77K68M92k94p44M80N00o39k19M39j44j16k2o1L60
1967A16L8k34j47J57M89o7n71K03Q29q07j35M94k01l85n0J78J02r3J96j66m27
1988d81P14p7m96K25L43j96n28L75N57j70l16L33n43K73K90l80l88P21M4o68r5
2009d63O26J08q16L23N21k36j15K18k69k9N16m86k98L24N45o84k40P36j7n46K14
2030f8O70o70J1J92l76l7M43p8n96L89N43l96n63J036K3q02J23N73p20K48K29
2051A74k67k70L21J87n97K87P65n47p31P65M42p48r2N25j24N4J81k44k81M65J69
$$ plain form
2072 434 -239 -413 604 -68 -632 -43 391 -208 -403 194 -139 -177 138 363 -428 442 646 -239 -401 428
2092 428 180 -483 -217 210 47 -457 -60 -82 -253 250 319 -612 16 541 -111 -537 171 353 -453 -246 268
2113 268 -32 -244 79 -109 -411 149 2 -400 -158 565 -177 -489 348 662 -84 -462 276 280 -208 93 31
2134 31 -259 72 395 -325 -311 498 21 -330 -62 661 211 -199 292 119 -276 176 -4 -226 -10 241 -209
2155 -209 -600 253 172 -624 -215 487 -20 -435 354 134 -253 45 161 -329 114 373 -119 -658 122 401
2175 401 -412 -93 568 210 -184 263 88 -98 -111 388 -128 -192 483 78 -701 54 276 -425 -266 435 10
2196 10 -223 53 -93 -155 175 326 -195 -272 78 156 -511 -5 325 -60 -210 354 119 -259 48 215 -40
2217 -40 197 235 42 -290 435 430 -459 -160 235 -51 -112 5 113 -61 -134 343 -263 -214 643 56 -475 371
$$ packed form
2072D34o73j74J017o72n64N89M34n99j95N97l33l8L15K25p91Q70K04q85j62Q29
2092D28k48o63K66M27j63n04L97k2j71N03O9r31O28N25o52m26P08J82q06K07N14
2113B68l00k12L23j88l02N60j47m02K42P23p42l12Q37L14p46l78P38Mm88L01o2
2134C1k90L31L23p20J4Q09m77l51K68P23m50m10M91j73l95M52j80k22K16K51m50
2155b09l91Q53q1p96M09P02n07m15P89k20l87K98J16m90M43K59m92n39P80K79
2175D01q13L19O61l58l94M47j75j86j3M99n16o4O75m05p79P55K22p01J59P01m25
2196A0k33K76j46o2L30J51n21p7L50P8o67N06L30l85j50N64k35l78L07J67k55
2217d0K37L8j93l32P25nq89K99L95k86o1J17J08j74p3M77o06M9Q57n87n31Q46
$$ plain form
2239 371 408 -401 -188 316 187 -265 -189 191 -193 -241 -33 -99 -202 415 -118 -291 58 392 -42 -227 81
2260 81 391 -133 -24 280 -94 -40 228 -224 -153 248 26 -412 -106 497 -261 -378 371 310 11 -159 75
2281 75 -16 110 54 -224 -268 352 21 -348 -117 303 -249 -684 104 331 -32 157 -150 -201 -197 211 -293 -287 -21
2304 -21 219 -193 -46 367 280 -322 63 371 -34 -30 -142 124 31 253 -129 -306 290 295 -402 -228 -108 133
2326 133 -251 65 121 -132 0 -27 -153 31 67 -171 -335 -6 136 -376 23 69 101 -340 -295 -68 67 99
2348 99 146 51 -9 247 -58 -213 46 78 71 -130 -37 -23 191 -177 7 49 285 -195 53 -158 45 139 -206 -2
2372 -2 70 -78 -174 71 92 -10 -160 12 -24 119 -81 -404 -57 274 324 -330 -80 51 55 -157 -150 456 34 113
2396 113 -134 -36 270 130 -241 99 187 -119 -98 -129 224 362 -216 -330 -121 245 19 58 -212 13 -142 -496
$$ packed form
2239C71L7q09K13N04j29m52P6L80l84m8K08o6j03O17n33j73L49L34m34j85L08
2260H1L10n24J09L04l74N4K68m52P1M01k22m38L06O03p58j17P49o1k99j70K34
2281G5r1J26n6k78m4O20l31l69K31M20n52m35P88K27l63J89l07n1MM08n04OK66
2304b1K40m12J47M13q7o02L85L08m05Mj12K66r3K22l82j77N96No97J74J20K41
2326A33l84L16N6k53J32k7j26J84L6k38j64L29J42n12L99M6L2m41M5K27J35L2
2348I9M7r5o0K56l05j55K59L2pk01R3J4K14l68J84M2K36m80K48k11K03R4l45K04
2372bP2j48r6K45K1j02j50J72l6J43k00l23L47L31N0o54K50J31Mk12PO06m22P9
2396A13k47R8L06j40l71L40Q8l06K1l1L53J38n78j14K09L66k26L9k70K25j55l54
$$ plain form
2418 -496 50 35 99 -13 -36 -32 42 7 -100 -40 40 -9 -134 -63 38 -234 -83 -13 -202 99 -54 -31 -39 148 155 -118
2444 -118 -185 262 207 -51 33 146 23 -21 -93 -38 7 42 -215 -131 -13 79 -307 -24 3 145 185 24 236 308
2468 308 116 185 56 112 -32 141 91 -65 43 28 -342 -164 182 123 -70 -157 -29 -126 65 -112 -80 166 0
2491 0 58 -47 318 149 -274 -152 56 60 -279 -155 130 59 -221 -99 -78 45 239 141 -201 116 146 -24 99
2514 99 270 201 -249 184 80 -67 -109 182 -215 196 206 -216 -327 12 166 -244 -112 178 -99 -196 -64 246
2536 246 334 104 -40 -22 -120 95 42 -103 -60 202 -23 -79 -261 252 -168 -221 189 -112 91 -27 -2 141 199
2559 199 -26 -187 147 159 145 -145 34 131 -70 -124 13 -46 -36 103 99 -36 162 259 -218 187 402 80 -134
2582 -134 -29 44 32 -111 -36 18 -138 124 -239 -185 117 210 -67 -132 178 64 -103 129 324 -35 56 185 70
$$ packed form
2418d96N46j5O4j12k3MP4l5j07O0Q0m9j25P1J01k72J51P0j89L01j53K3qJ87Pk73
2444a18o7M47n5k58Q4J13j23m4p2N5M5L5k57Q4J18R2l86K83K7J42M0j61K12P2
2468C08j92O9j29N6j44J73n0j56J08j5l70J78L46n9j93q7J28r7J91j77L2K46j66
2491@N8j05L65j69m23J22K08Ml39J24K85p1k80J22K1J23J94r8l42L17L0j70J23
2514I9J71o9m50M33j04j47m2K91l97M11J0m22j11L39J54m10J32K90k77r7J32L10
2536B46Q8k30j44J8r8K15n3j45M3K62k25n6j82N13m20n3M10l01K03j18K5J43N8
2559A99k25j61L34J2j4k90J79R7k01n4J37n9J0J39mj35J98R7m77M05K15l22k14
2582a34J05P3j2j43P5N4j56K62l63N4L02R3k77o5L10j14j67K32J95l59R1J29j15
$$ plain form
2605 70 9 102 34 -174 341 120 -25 -353 102 33 -306 -22 173 76 -156 -82 -57 -173 -79 54 -274 -274 207 -232
2629 -232 -259 173 -50 -26 -157 -3 -7 -59 75 -102 136 104 125 -310 153 323 51 59 55 247 64 59 274 26
2653 26 148 39 -56 -52 153 -3 -80 -77 15 8 -351 131 124 -34 -122 -136 107 -71 18 163 -238 46 168 -258 -94
2678 -94 190 36 -283 -217 107 -146 -147 21 198 63 58 54 -146 226 148 231 -20 51 51 -183 -64 161 139 -206 64
2703 64 -253 -13 24 188 -150 169 215 37 -16 175 193 -96 -184 114 164 -321 138 -37 -122 -129 0 98 -128 121
2727 121 235 -116 -28 361 -191 -175 222 39 51 42 196 -42 -25 16 -122 -255 279 203 -78 -151 113 95 -154
2750 -154 27 70 -62 51 121 139 4 195 -145 -394 -92 46 -2 34 76 -148 -142 -20 30 -71 66 15 -235
2773 -235 23 60 8 -123 253 403 15 98 194 -4 -172 -104 194 -27 9 3 -165 -94 -139 -135 -51 -42 44 -12 -126 146
$$ packed form
2605G0o1R3o8k08N15k21j45l28M55o9l39K84J95r7k32P4K5j16R4J33l28%M81m39
2629b32k7M32k23K4j31J54mn2J34j77K38l2K1m35M63J70k72QmJ92j83nK15k48
2653B6J22j09r5MK05j56p7LR2pl59M82pj58q8j4K43j78Q9J45m01K84J22m26J64
2678i4K84j54l19O6L24k53jJ68J77j35nmk00L72p8Q3k51P1%k34J19K25k2l45K70
2703F4l17K40L7J64l38L19M6j78n3J91J8k89q8K98N0m85M59j75q5pJ29R8k26K49
2727A21J14l51Q8L89n52J6L97j83J2rJ54k38J7M1j38j33N34p6k81p3K64j8k49
2750a54J81M3j32J13P0J8j35J91l40k49L02J38m8L6M2k24OJ22N0j01J37n1k50
2773b35K58L7n2j31L76J50l88Q3R6j98j68O8K98k21L6oj68P1m5MQ4RQ6n6j14K72
$$ plain form
2799 146 196 -37 -119 195 -76 135 85 13 26 159 69 -121 3 93 -136 -108 -68 168 97 87 -250 103 -7 75
2823 75 -87 1 150 93 -73 -76 315 129 -94 -98 136 -73 -133 -113 -45 216 -68 -111 -310 93 116 -37 -38 191 13
2848 13 45 -21 2 220 103 -19 -141 111 151 85 -71 47 152 173 -47 49 -19 -302 -117 126 166 -109 63
2871 63 -131 77 -9 116 120 10 44 -80 35 -13 -11 -10 301 -18 -11 59 31 -186 83 47 -164 -333 -42 -28 133
2896 133 -75 148 47 -69 52 -21 3 -76 84 -271 -136 78 -71 9 2 -70 -54 132 -78 -129 -29 23 187
2919 187 -22 21 197 -33 -206 -33 47 149 27 -83 -120 117 -231 -57 -77 211 3 3 -32 208 -13 -21 163
2942 163 -162 24 85 -90 -32 13 -121 -13 -64 15 -36 -171 79 74 -81 -31 -10 -13 -121 -37 -37 168 -211 119 -69
2967 -69 16 54 34 -93 -70 -94 135 -49 -47 -54 178 26 -10 13 -91 -151 -115 17 179 73 0 -101 117 -30 71
$$ packed form
2799A46N0k33q2L14k71K11n0p2J3J33r0j90J24R0k29K8M0K36p1j0l37L53j10Q2
2823G5j62Q8J49n7j66lL91j86k23mK34k09o0K0O8K61k84m3j99M03K3j53jK29j78
2848A3L2o6K3K18j17j22j22K52M0o6j56J18J05K1k20R6o8k83J85K43M0k75J72
2871F3j94K08q6J25Mj10L4j24J15m8KJL11l19PP0k8k17K69l6k11j69K91J4J61
2896A33k08K23j01j16J21p3K4p9J60l55J35K14j49Q0pp2J6J86k10n1J00N2J64
2919A87k09M3J76k30j73J73Q0J02j22j10l7K37l48J74k0K88k08%l5K40k21qJ84
2942A63l25J86O1j75N8M5j34J08n1P9n1j35K50nj55N0K1lj08Q4%K05l79L30j88
2967f9Q5L8k0j27K3k4K29j84KpK32j52l6K3j04o0L6J32J62j06p3j01K18j47J01
$$ plain form
2992 71 9 29 -9 279 28 8 99 36 -191 -161 -56 -197 -55 -100 -98 28 -170 -91 -108 -184 -135 132 -20 -58 75
3017 75 35 -32 140 -99 94 154 133 192 119 -101 162 -40 -13 -168 29 97 -64 8 192 -40 -210 141 -97
3040 -97 17 -228 -171 62 -63 68 45 -158 -23 -157 51 -320 135 -30 5 -160 -154 -15 -47 -156 51 -83
3062 -83 21 73 -12 174 132 6 21 148 50 205 -153 -32 -39 32 -223 228 2 -49 249 223 -124 -40 -18 -62 -35
3087 -35 -47 -12 -69 44 -193 72 -80 -168 -21 -22 -129 -23 -6 -22 -267 198 89 -42 106 67 2 158 -146 -34
3111 -34 -140 35 -169 -23 179 -95 88 43 111 -71 -20 -19 -202 -158 -6 -29 91 -138 13 13 -120 149 -99
3134 -99 -93 157 9 -1 133 131 6 -31 13 87 -69 -65 176 -114 -133 253 8 -111 -68 18 5 0 -6 108 91 208 -125
3161 -125 66 104 136 -128 -43 -34 279 59 7 -59 -142 23 -17 95 -92 -106 -266 181 255 192 -95 129 43 42 -8
$$ packed form
2992G1o2K0l8K88k51k0R1o3k27L0J05j41J42m5KJ26j98P9j7p6M9K67j52l8J33
3017G5m0o7J72k39J93O0k1N9p3k20K63k02K7j55J97O8j61P2J84k32j70L51k38
3040i7J14k45N7K33j25J31k3k03J35j34K08l71M55j65L5j65OJ39l2j09K07j34
3062h3J04N2q5J86m2j26J5J27r8J55l58J21pP1k55M51k26n1K98k6l47Q4K2m4K7
3087c5j2L5n7J13k37K65j52q8J47jj07J06J7j6k45M65j09j31J48l9o5J56l04J12
3111c4j06J75k04J46K02k74J83m5O8j82N1Jj83M4J52k3J20k29J51%j33K69k48
3134i9OK50j48j0J34kj25l7M4P4j56MK41k90j9L86k45j19M3Q6j3noJ14j7J17l33
3161a25J91L8L2k64Q5RL13k20n2o6q3J65m0J12j87j4j60M47P4o3k87K24q6jn0
$$ plain form
3186 -8 -13 -89 -109 13 93 13 -15 101 -141 14 42 29 -70 -190 -149 -5 -228 -15 40 -213 36 129 9 -246 -101
3211 -101 107 -143 -127 294 -228 87 69 -141 61 -190 153 -48 -160 41 101 -1 -88 125 -23 -68 146 76
3233 76 -97 39 131 -9 220 53 97 -59 157 67 -12 -130 222 -17 -223 84 -162 -118 -72 61 -166 -69 161
3256 161 126 63 113 71 -30 110 -55 201 -177 259 174 119 107 127 29 160 68 -172 -44 -9 -120 -65 -28 18 36
3281 36 51 141 182 -13 -69 -160 -63 105 -149 151 9 220 -68 -134 -191 -19 -33 -110 13 89 38 89 -62 110 171
3306 171 -21 101 -85 51 125 53 58 -67 157 -6 4 -11 39 147 63 -133 61 -79 -226 -71 -38 -68 -108 -73
3330 -73 43 143 -39 22 -63 71 30 -87 166 31 -143 116 -61 -22 -143 -32 -99 -199 157 -10 200 26
3352 26 -31 127 -48 8 74 -6 101 -202 197 -26 -68 2 22 -129 37 -48 126 63 107 21 16 -263 -9 58 -102
$$ packed form
3186hnp6k0J22Q0q0k8J16k42J55K8j3r9j20M1J44k23K13N5k53K49R3j20k55J45
3211a01K08k50J6M21n22L15j8k10K02k51L43k01j12K01O0j02q7K13j48m5K14p0
3233G6j73J36R2j40K29j67M4j56K16r0p9j18L52k39k06L07k46M4M6J33k27R7K30
3256A61l5o3N0m2j01J40j65K56l78M36q5n5j2K0r8J31r2k40J28L5j11N5L7M6J8
3281C6J5R0M1j95n6r1R7J68k54L00j42K11k88o6n7J72j4p7J23P6n1N1j51J72O1
3306A71j92J22j86J36P4p2Nj25K24j63J0j5N0J08q4j96J94j40j47J55L3l0m0L5
3330g3J16J00j82O1q5J34m1j17K53j35j74K59j77L9j21J11o7j00L56j67K10j74
3352B6n7J58j75N6O6q0J07l03L99k23m2P0K0j51J66q5J74o3M4q6nk79K54O7j60
$$ plain form
3377 -102 -70 -23 128 -132 -15 -42 -30 31 14 -91 -42 -36 -65 -191 37 111 19 -23 62 -319 -126 -29 24 2 43 -240
3403 -240 42 108 -123 104 205 -125 76 -8 56 -67 183 2 109 -56 -2 197 -136 -56 -100 96 47 -46 -21
3426 -21 -8 -36 -92 -137 63 -81 13 -179 119 164 -97 -66 -115 -45 50 -52 -15 -145 -81 -99 80 -134 12 82 143
3451 143 -41 -90 82 25 138 -54 123 -198 33 108 -95 -35 -94 257 7 127 79 -67 -127 17 118 93 -87
$$ packed form
3377a02L2M7J51k60J17k7J2O1j7j05M9Ok9j26K28P4r2m2Q5l81J93R7N3k2M1k83
3403b40K82O6k31K27J01l30K01q4O4j23K50j81J07j65N4J99l33Q0m4J96m9r3K5
3426b1J3k8n6m5K00j44R4j92K98M5k61L1m9P0R5j02L7j30O4j8J79k14J46P0O1
3451A43j84m9J72n7J13j92J77l21K31P5k03O0n9L51k50J20m8j46o0J44J01k5j80
$$ [...]
8191c1
##END NTUPLES=NMR FID
##END=
