##TITLE=1H_Pr 5296-Py
 200.13MHz,CDCl3,
 8 sc
 
 1.4.2025
##JCAMPDX= 6.0         $$ Bruker NMR JCAMP-DX V2.0
##DATA TYPE= NMR FID
##DATA CLASS= NTUPLES
##ORIGIN= UXNMR, Bruker Analytische Messtechnik GmbH
##OWNER= pz
$$ XWIN-NMR		Version 3.5
$$ Tue Apr  1 13:55:23 2025 Russian Standard Time (UT+4h)  she@DPX200
##.OBSERVE FREQUENCY= 200.1313
##.OBSERVE NUCLEUS= ^1H
##.DELAY= (6, 6)
##.ACQUISITION MODE= SIMULTANEOUS
##.ACQUISITION SCHEME= undefined
##.AVERAGES= 8
##.DIGITISER RES= 18
##SPECTROMETER/DATA SYSTEM= spect
##.PULSE SEQUENCE= zg30
##.SOLVENT NAME= CDCl3
##.SHIFT REFERENCE= (INTERNAL, CDCl3, 0, 14.3821)
##AUDIT TRAIL= $$ (NUMBER, WHEN, WHO, WHERE, WHAT)
$$ ##TITLE= Audit trail, XWIN-NMR		Version 3.5
$$ ##JCAMPDX= 5.01
$$ ##ORIGIN= Bruker BioSpin GmbH
$$ ##OWNER= she
$$ F:/spectra/data/she/nmr/H-C/1/audita.txt
$$ ##AUDIT TRAIL=  $$ (NUMBER, WHEN, WHO, WHERE, WHAT)
(   1,<2025-04-01 13:54:09.21 +0400>,<she>,<DPX200>,
      <created by zg, POWCHK disabled, PULCHK disabled
       configuration hash MD5:
       00 E9 B6 7A A2 85 ED C7 34 08 36 98 17 FE 4E 26
       data hash MD5: 16K
       4A 19 85 C9 04 57 69 1F C3 81 C7 FF 87 0F 35 ED>)
$$ ##END=
$$ 
$$ hash MD5
$$ 5D D8 E4 BA 3B 04 CC 54 93 4B 59 A6 CC F0 7A 9A
##$RELAX= 
##$RELAX= 
##$RELAX= 
##$RELAX= 
##$RELAX= 
##$RELAX= 
$$ Bruker specific parameters
$$ --------------------------
##$DU= <F:/spectra>
##$EXPNO= 1
##$NAME= <H-C>
##$PROCNO= 1
##$TYPE= <nmr>
##$USER= <she>
##$AMP= (0..31)
100 100 100 100 100 100 100 100 100 100 100 100 100 100 100 100 100 100 
100 100 100 100 100 100 100 100 100 100 100 100 100 100 
##$AQSEQ= 0
##$AQ_mod= 1
##$AUNM= <au_zg>
##$AUTOPOS= <>
##$BF1= 200.13
##$BF2= 200.13
##$BF3= 200.13
##$BF4= 200.13
##$BF5= 200.13
##$BF6= 200.13
##$BF7= 200.13
##$BF8= 200.13
##$BYTORDA= 1
##$CFDGTYP= 0
##$CFRGTYP= 5
##$CHEMSTR= <none>
##$CNST= (0..31)
1 1 145 1 1 1 1 1 1 1 1 1 1 1 1 1 1 1 1 1 1 1 1 1 1 1 1 1 1 1 1 1 
##$CPDPRG= <>
##$CPDPRG1= <>
##$CPDPRG2= <>
##$CPDPRG3= <>
##$CPDPRG4= <mlev>
##$CPDPRG5= <mlev>
##$CPDPRG6= <mlev>
##$CPDPRG7= <mlev>
##$CPDPRG8= <mlev>
##$CPDPRGB= <>
##$CPDPRGT= <>
##$D= (0..31)
0 0.7 0 0 0 0 0 0 0 0 0 0.03 0 0 0 0 0 0 0 0 0 0 0 0 0 0 0 0 0 0 0 0 
##$DATE= 1743501248
##$DBL= (0..7)
120 120 120 120 120 120 120 120 
##$DBP= (0..7)
150 150 150 150 150 150 150 150 
##$DBP07= 0
##$DBPNAM0= <>
##$DBPNAM1= <>
##$DBPNAM2= <>
##$DBPNAM3= <>
##$DBPNAM4= <>
##$DBPNAM5= <>
##$DBPNAM6= <>
##$DBPNAM7= <>
##$DBPOAL= (0..7)
0.5 0.5 0.5 0.5 0.5 0.5 0.5 0.5 
##$DBPOFFS= (0..7)
0 0 0 0 0 0 0 0 
##$DE= 6
##$DECBNUC= <off>
##$DECIM= 32
##$DECNUC= <off>
##$DECSTAT= 4
##$DIGMOD= 1
##$DIGTYP= 9
##$DL= (0..7)
0 120 120 120 120 120 120 120 
##$DP= (0..7)
150 150 150 150 150 150 150 150 
##$DP07= 0
##$DPNAME0= <>
##$DPNAME1= <>
##$DPNAME2= <>
##$DPNAME3= <>
##$DPNAME4= <>
##$DPNAME5= <>
##$DPNAME6= <>
##$DPNAME7= <>
##$DPOAL= (0..7)
0.5 0.5 0.5 0.5 0.5 0.5 0.5 0.5 
##$DPOFFS= (0..7)
0 0 0 0 0 0 0 0 
##$DQDMODE= 0
##$DR= 18
##$DS= 0
##$DSLIST= <SSSSSSSSSSSSSSS>
$$ [...]
##$SUBNAM0= <"">
##$SUBNAM1= <"">
##$SUBNAM2= <"">
##$SUBNAM3= <"">
##$SUBNAM4= <"">
##$SUBNAM5= <"">
##$SUBNAM6= <"">
##$SUBNAM7= <"">
##$SUBNAM8= <"">
##$SUBNAM9= <"">
##$SW= 18.0517328524113
##$SWIBOX= (0..15)
0 0 2 0 0 0 0 0 0 0 0 0 0 0 0 0 
##$SW_h= 3612.71676300578
##$TD= 16384
##$TD0= 1
##$TE= 0
##$TE2= 300
##$TE3= 300
##$TEG= 300
##$TL= (0..7)
0 120 120 120 120 120 120 120 
##$TP= (0..7)
150 150 150 150 150 150 150 150 
##$TP07= 0
##$TPNAME0= <>
##$TPNAME1= <>
##$TPNAME2= <>
##$TPNAME3= <>
##$TPNAME4= <>
##$TPNAME5= <>
##$TPNAME6= <>
##$TPNAME7= <>
##$TPOAL= (0..7)
0.5 0.5 0.5 0.5 0.5 0.5 0.5 0.5 
##$TPOFFS= (0..7)
0 0 0 0 0 0 0 0 
##$TUNHIN= 0
##$TUNHOUT= 0
##$TUNXOUT= 0
##$USERA1= <user>
##$USERA2= <user>
##$USERA3= <user>
##$USERA4= <user>
##$USERA5= <user>
##$V9= 5
##$VALIST= <valist>
##$VCLIST= <CCCCCCCCCCCCCCC>
##$VD= 0
##$VDLIST= <DDDDDDDDDDDDDDD>
##$VPLIST= <PPPPPPPPPPPPPPP>
##$VTLIST= <TTTTTTTTTTTTTTT>
##$WBST= 1024
##$WBSW= 4
##$XGAIN= (0..3)
0 0 0 0 
##$XL= 0
##$YL= 0
##$YMAX_a= 351322
##$YMIN_a= -324006
##$ZGOPTNS= <>
##$ZL1= 120
##$ZL2= 120
##$ZL3= 120
##$ZL4= 120
##$ABSF1= 10
##$ABSF2= 0
##$ABSG= 5
##$ABSL= 3
##$ALPHA= 0
##$AQORDER= 0
##$ASSFAC= 0
##$ASSFACI= 0
##$ASSFACX= 0
##$ASSWID= 0
##$AUNMP= <proc_1d>
##$AZFE= 0.1
##$AZFW= 0.1
##$BCFW= 1
##$BC_mod= 2
##$BYTORDP= 1
##$COROFFS= 0
##$CY= -3
##$DATMOD= 1
##$DC= 2
##$DFILT= <>
##$DTYPP= 0
##$F1P= 0
##$F2P= 0
##$FCOR= 0.5
##$FTSIZE= 0
##$FT_mod= 4
##$GAMMA= 1
##$GB= 0.15
##$INTBC= 1
##$INTSCL= 1
##$ISEN= 128
##$LB= 0.25
##$LEV0= 0
##$LPBIN= 0
##$MAXI= 10000
##$MC2= 0
##$MEAN= 0
##$ME_mod= 0
##$MI= 1.114404
##$NCOEF= 0
##$NC_proc= 0
##$NLEV= 6
##$NOISF1= 3.799351
##$NOISF2= 2.8
##$NSP= 1
##$NTH_PI= 0
##$NZP= 0
##$OFFSET= 14.38212
##$PC= 1
##$PHC0= -469.4426
##$PHC1= 11.19221
##$PH_mod= 1
##$PKNL= yes
##$PPARMOD= 0
##$PSCAL= 0
##$PSIGN= 0
##$REVERSE= no
##$SF= 200.129724274929
##$SI= 16384
##$SIGF1= 3
##$SIGF2= 2
##$SINO= 400
##$SIOLD= 16384
##$SREGLST= <1H.CDCl3>
##$SSB= 0
##$STSI= 0
##$STSR= 0
##$SW_p= 3205.1282051282
##$SYMM= 0
##$S_DEV= 0
##$TDeff= 0
##$TDoff= 0
##$TI= <>
##$TILT= no
##$TM1= 0
##$TM2= 0
##$TOPLEV= 0
##$USERP1= <user>
##$USERP2= <user>
##$USERP3= <user>
##$USERP4= <user>
##$USERP5= <user>
##$WDW= 1
##$XDIM= 8192
##$YMAX_p= 0
##$YMIN_p= 0
$$ End of Bruker specific parameters
$$ ---------------------------------
##NTUPLES= NMR FID
##VAR_NAME=  TIME,          FID/REAL,        FID/IMAG
##SYMBOL=    X,             R,               I
##VAR_TYPE=  INDEPENDENT,   DEPENDENT,       DEPENDENT
##VAR_FORM=  AFFN,          ASDF,            ASDF
##VAR_DIM=   8192,          8192,            8192
##UNITS=     SECONDS,       ARBITRARY UNITS, ARBITRARY UNITS
##FACTOR=    0.0002768,     1,               1
##FIRST=     0,             0,               0
##LAST=      2.2672688,     0,               0
##MIN=       0,             -324006,         0
##MAX=       2.2672688,     351322,          0
$$ Real data points
##PAGE= N=1
##DATA TABLE= (X++(R..R)), XYDATA
$$ plain form
0 0 0 0 0 0 0 0 0 0 0 0 0 0 0 0 4 -8 8 -8 8 -8 16 -16 17 -23 24 -32 33 -40 45 -52 60 -68 76 -84 94 -108 122
37 122 -133 149 -168 186 -207 227 -252 278 -308 339 -372 410 -451 497 -548 605 -669 741 -822
56 -822 915 -1024 1154 -1309 1497 -1735 2042 -2460 3056 -3973 5542 -8736 17697 -94641 -283065
71 -283065 121444 351322 149963 118007 281735 183341 12172 24825 39395 32017 122160
82 122160 46635 -188290 -190626 -111849 -256651 -227988 93664 141505 -85347 -67452 37278
93 37278 -95919 -121548 114873 172830 83307 186378 194389 -65219 -106666 94329 71844
104 71844 -52562 28602 73294 -59492 -110905 -103654 -189398 -141051 41598 827 -86881 95444
116 95444 170493 -48955 -73939 121727 81776 -52969 63603 157503 12574 -60006 -19767
$$ packed form
0@%%%%%%%%%%%%%%Mj2J6j6J6j6K4l2L3m0M7n6O5p3Q5r7J12j28J44j60J78k02K30
37A22k55K82l17L54l93M34m79N30n86O47p11P82q61R48j045J153j274J410j563
56h22J737j939K178k463K806l232L777m502N516p029R515j4278K6433j12338j88424
71b83065M04509K29878k01359l1956J63728r8394j71169J2653J4570p378R0143
82A22160p5525k34925k336P8777j44802K8663L21652M7841k26852J7895J04730
93C7278j33197k5629K36421N7957q9523J03071Q011k59608m1447K00995k2485
104G1844j24406Q1164M4692j32786n1413P251q5744M8347J82649m0771q7708J82325
116I5444P5049k19448k4984J95666l9951j34745J16572R3900j44929p2580M0239
$$ plain form
127 -19767 -88691 -92570 45010 16480 -71860 66079 132504 -71760 -137107 36651 51331
138 51331 -70363 -19235 56340 -11839 -13246 29507 -55656 -57601 80322 44970 -64570 56039
150 56039 159626 -2396 -96410 25468 17615 -115337 -55927 61825 23820 6687 29270
161 29270 -55689 -82201 27808 26767 -50288 48963 149383 10391 -106131 -21045 350
172 350 -65576 2570 73345 15972 16145 48540 -52329 -103738 20424 56159 -46825 -8740
184 -8740 103043 21244 -86326 -21021 20173 -23446 9619 50193 18373 36075 56894 -46237
196 -46237 -104167 1754 29587 -78934 -47231 81677 32401 -70378 -28017 14241 -11481
207 -11481 18085 60053 42267 54105 74588 -12254 -84377 -6726 32378 -52384 -41431 51627
$$ packed form
127a9767o8924l879J37580k8530q8340J37939O6425k04264o5347J73758J4680
138E1331j21694N1128P5575o8179j407M2753q5163j945J37923l5352j09540J20609
150E6039J03587j62022r4014J21878p853j32952N9410J17752l8005j7133K2583
161B9270q4959k6512J10009j041p7055R9251J00420j38992j16522Q5086K1395
172C50o5926O8146P0775n7373J73L2395j00869n1409J24162L5735j02984L8085
184h740J11783q1799j07570O5305M1194m3619L3065M0574l1820J7702K0819j03131
196d6237n7930J05921K7833j08521L1703J28908m9276j02779M2361M2258k5722
207a1481K9566M1968j7786J1838K0483q6842p2123P7651L9104q4762J0953R3058
$$ plain form
219 51627 12757 -72094 -51506 -24284 -35981 725 38889 12692 21811 69982 15704 -57536
231 -57536 10390 70757 4109 -17132 45705 38471 -20653 -31029 -30161 -41489 -17181 -4399 -41880
244 -41880 -21718 49128 9518 -67944 -15980 48787 3728 -16758 48119 73909 30315 -338
256 -338 -11391 -22955 -4593 8003 -22245 -8169 43013 893 -77146 -49647 8561 -6276
268 -6276 -20585 21387 45204 18750 -2907 -12750 -17266 15051 36013 424 -3288 41202 23104
281 23104 -42084 -41254 4572 4751 -22620 -11146 14410 13055 -30 -21619 -29483 5432 25175
294 25175 -5639 -5079 41018 40377 -15181 -33568 1126 13509 -8043 -7491 12055 17314 2900
307 2900 -27955 -38791 -5360 15350 -4662 -10700 19482 31315 -3909 -28647 -3709 21105
$$ packed form
219E1627l8870q4851K0588K7222j1697L6706L8164k6197R119M8171n4278p3240
231e7536O7926O0367o6648k1241O2837p234n9124j0376Q68j1328K4308J2782l7481
244d1880K0162P0846l9610p7462N1964O4767m5059k0486O4877K5790m3594l0653
256c38j1053j1564J8362J2596l0248J4076N1182m2120p8039K7499N8208j4837
268f276j4309M1972K3817k6454k1657r843m516L2317K0962l5589l712M4490j8098
281B3104o5188Q30M5826J79k7371J1474K5556j355j3085k1589p864L4915J9743
294B5175l0814N60M6097o41n5558j8387L4694J2383k1552N52J9546N259j4414
307B900l0855j0836L3431K0710k0012o038L0182J1833l5224k4738K4938K4814
$$ plain form
319 21105 11443 -2501 2844 19998 17555 -15425 -30526 -5608 10752 -4958 -20347 -2183 22049
332 22049 5597 -26169 -18881 11332 15528 -5503 -6486 23696 29962 -3722 -21187 -4902 10261
345 10261 3131 -13285 -6606 18209 14310 -19257 -29284 768 18033 -6650 -14458 19388 28337
358 28337 -2025 -18613 -9718 2492 4899 -6534 -10526 7574 18309 -8367 -33039 -4537 26103
371 26103 3956 -10897 17577 26823 4068 -9585 -7637 463 10376 3350 -16919 -11668 13968
384 13968 -2317 -39187 -16875 21395 1116 -21684 1115 17281 7553 1466 1773 4607 20007
397 20007 23366 -5659 -8607 30226 21265 -29881 -20793 15544 -5897 -35931 -18807 -1444 -8364
410 -8364 -10472 -9737 -13001 9151 29511 1274 -7330 40745 42315 -11480 -10394 27174 10847 -22670
$$ packed form
319B1105r662j3944N345J7154k443l2980j5101K4918J6360j5710j5389J8164K4232
332B2049j6452l1766P288L0213M196k1031r83L0182O266l3684j7465J6285J5163
345A0261p130j6416O679K4815l899l3567j0027L0052J7265k4683p808L3846Q949
358B8337l0362j6588Q895J2210K407j1433l992J8100J0735k6676k4672K8502L0640
371B6103k2147j4853K8474R246k2755j3653J948Q100R913p026k0269N251K5636
384A3968j6285l6870K2312L8270k0279k2800K2799J6166r728o087L07K834J5400
397B0007L359k9025k948L8833q961n1146R088L6337k1441l0034J7124J7363o920
410h364k108P35l264K2152K0360k8237q604M8075J570n3795J086L7568j6327l3517
$$ plain form
424 -22670 -12680 -268 -11652 -10266 -10418 -26867 -7688 23139 -6081 -26517 19703 33440 -13679
437 -13679 -17662 21661 15792 -12067 -1522 7874 -5151 5885 10103 -18123 -5051 31265 1476
450 1476 -34229 3546 28463 -13449 -25877 12683 13183 -12130 -1936 2042 -11992 8918 17411
463 17411 -20629 -15914 26772 3487 -40542 -7920 28601 -4393 -19054 19526 22090 -191
475 -191 14022 14803 -5274 15137 24910 -20018 -26836 16308 -559 -52744 -29301 13999 -12435
488 -12435 -28799 7241 13148 691 20203 17438 -6513 19013 41972 22 -17367 26615
500 26615 22030 -33066 -22093 16780 -8754 -26179 2262 344 -17303 -732 -3490 -29590 -4601
513 -4601 28321 -7056 -26476 26921 36700 -16483 -9881 32864 16765 -1323 17281 7873 -10406
$$ packed form
424b2670R990J2412j1384J386j52j6449J9179L0827k9220k0436M6220J3737m7119
437a3679l983L9323n869k7859J0545R396j3025J1036M218k8226J3072L6316k9789
450A476l5705L7775K4917m1912j2428L8560N00k5313J0194L978j4034K0910Q493
463A7411l8040M715M2686k3285m4029L2622L6521l2994j4661L8580K564k2281
475a91J4213P81k0077K0411R773m4928o818M3144j6867n2185K3443M3300k6434
488a2435j6364L6040N907j2457J9512k765k3951K5526K2959m1950j7389M3982
500B6615m585n5096J0973L8873k5534j7425K8441j918j7647J6571k758k6100K4989
513d601L2922l5377j9420N3397R779n3183O602M2745j6099j8088J8604r408j8279
$$ plain form
526 -10406 8750 2925 -38195 -23292 19271 -8891 -38720 7275 23790 -21935 -17783 19129
538 19129 5016 -8510 14889 11825 -6271 12571 13507 -25443 -10929 37752 11534 -26166 14609
551 14609 35870 -10006 -20948 4747 -5199 -15585 2575 -7884 -30931 -3690 11763 -28998
563 -28998 -25132 28049 18084 -14232 18973 40644 4152 -4784 19355 7072 -8379 10596 3652
576 3652 -21752 1561 12345 -36592 -38688 15580 8841 -30529 -6475 23090 -916 -12008 7136
589 7136 720 -2343 28687 23036 -9946 11911 33307 -9622 -25268 14072 9814 -26440 -11932
602 -11932 10257 -15796 -26666 -4530 -10053 -15442 15562 15620 -10602 15174 41331 477 -22286
615 -22286 16666 25212 -10237 -8196 11614 -6231 -15846 -3209 -19052 -25198 11432 14729 -17840
$$ packed form
526a0406J9156n825m1120J4903M2563k8162k9829M5995J6515m5725M152L6912
538A9129j4113j3526K3399l064j8096J8842R36l8950J4514M8681k6218l7700M0775
551A4609K1261m5876j0942K5695r946j0386J8160j0459k3047K7241J5453m0761
563b8998L866N3181r965l2316L3205K1671l6492q936K4139j2283j5451J8975o944
576C652k5404K3313J0784m8937k096N4268o739l9370K4054K9565k4006j1092J9144
589G136o416l063L1030n651l2982K1857K1396m2929j5646L9340m258l6254J4508
602a1932K2189k6053j0870K2136n523n389L1004N8k6222K5776K6157m0854k2763
615b2286L8952Q546l5449K041J9810j7845r615J2637j5843o146L6630L297l2569
$$ plain form
628 -17840 -2112 28151 22 -22917 11203 23476 -5672 -521 20759 2358 -8494 4747
640 4747 -9189 -19269 9407 10508 -23101 -11615 21881 -697 -30261 -2785 16264 -3283
652 -3283 1329 18097 4494 2739 17022 -2062 -19057 9150 19031 -13597 -14090 15448 -1473
665 -1473 -31128 -10684 7011 -8462 -3597 12033 1914 514 13413 -998 -14953 12174 25660
678 25660 -6336 -10536 20168 9595 -20368 -8962 4456 -7437 -3760 5671 -6631 -7727 9005
691 9005 -2546 -22744 -348 20327 -3141 -8805 18860 13868 -10153 -2688 7084 -1248 2431
704 2431 10168 -2522 -6103 9338 -1902 -26250 -7393 15918 -4276 -14626 8427 10410 -7710
717 -7710 -5930 2181 -1103 5054 13098 365 -3794 13553 6345 -19333 -6758 15110 -127 -12334
$$ packed form
628a7840J5728L0263k8129k2939L4120J2273k9148N151K1280j8401j0852J3241
640D747j3936j0080K8676J101l3609J1486L3496k2578k9564K7476J9049j9547
652c283M612J6768j3603j755J4283j9084j6995K8207R881l2628m93K9538j6921
665a473k9655K0444J7695j5473M865J5630j0119j400J2899j4411j3955K7127J3486
678B5660l1996m200L0704j0573k9963J1406J3418j1893L677R431j2302j096J6732
691I005j1551k0198K2396K0675k3468n664K7665m992k4021P465R772q332L679
704B431P737j2690l581J5441j1240k4348J8857K3311k0194j0350K3053J983j8120
717g710J780Q111l284O157Q044j2733m159J7347p208k5678J2575K1868j5237j2207
$$ plain form
731 -12334 3853 7620 -6753 -7973 -2901 -6089 404 9985 -1441 -5906 12700 9147 -14493 -7116
745 -7116 13414 5378 -6559 3136 8085 -2048 -4940 -3845 -8815 -1230 10205 -2105 -9423 8479
759 8479 9058 -12355 -10272 9120 7642 -3742 890 7080 1129 -1150 -2116 -8183 -362 9794 -2077
774 -2077 -9310 5670 9328 -7922 -11386 3780 6074 -3117 -846 4800 2639 2550 -921 -8846 -1847
789 -1847 9196 1418 -6941 4064 10080 -3580 -12161 -1250 4871 -296 -263 1739 1356 2893 -2236
804 -2236 -10227 -3157 8365 3471 -5936 628 8993 -569 -9594 -1599 5577 3223 1077 -176 1502
819 1502 4524 3 -7354 -3853 5389 3288 -5980 -3435 5293 1054 -6974 -5211 936 3578 1794
834 1794 -1823 1306 6231 3362 -3941 -4087 4120 6190 -2318 -3834 3775 4663 -3019 -7479 -3147 3426
$$ packed form
731a2334J6187L767j4373j220N072l188O493R581j1426m465J8606l553k3640P377
745g116K0530q036j1937R695M949j0133k892J095m970P585J1435j2310p318J7902
759H479N79k1413K083J9392j478j1384M632O190n951k279r66o067P821J0156j1871
774b077p233J4980L658j7250l464J5166K294r191K271N646k161q9l471p925O999
789a847J1043p778q359J1005O016j3660q581J0911O121n167L3K002l83J537n129
804b236p991P070J1522m894r407O564Q365r562r025P995P176k354k146j253J678
819A502L022m521p357L501R242k101r268K545Q728m239q028J763O147K642j784
834A794l617L129M925k869p303j46Q207K070q508j516P609Q88p682m460M332O573
$$ plain form
850 3426 1057 -4283 -921 5094 3352 -4668 -7198 772 5036 -250 -3400 2441 6961 878 -7415
865 -7415 -3539 6249 3974 -2189 212 5225 3705 -3528 -6391 -762 3939 1332 -4134 -3062 3519
880 3519 569 -9565 -6428 3879 2739 -3442 -1548 3607 4458 1162 -448 1549 5881 7584 717
895 717 -2668 5495 5479 -6434 -7856 -434 -1019 -7327 -7224 -2805 -1271 -1533 -2548 -4515 1133 8931
911 8931 3548 -1036 9293 13505 2039 -3137 3829 5360 -1997 -3575 -1375 -2630 -2873 -5063 -11790
926 -11790 -7584 3038 -1776 -8956 1646 9930 1196 -4206 4668 9145 4126 4127 5691 2528 3851
941 3851 2872 -7318 -6799 3882 -553 -11802 -5702 3671 -3175 -9707 -911 3434 -446 2028 3694
956 3694 686 5567 8574 -1887 -3935 7254 5642 -7394 -4297 6793 621 -7991 -2238 392
$$ packed form
850C426k369n340L362O015j742q020k530P970M264n286l150N841M520o083q293
865g415L876R788k275o163K401N013j520p233k863N629M701k607n466J072O581
880C519k950j0134L137J0307j140o181J894N155Q51l296j610J997M332J703o867
895G17l385Q163j6j1913j422P422n85o308J03M419J534k62j015j967N648P798
911H931n383m584J0329M212j1466n176O966J531p357j578K200j255k43k190o727
926a1790M206J0622m814p180J0602Q284q734n402Q874M477n019JJ564l163J323
941C851r79j0190N19J0681m435j1249O100R373o846o532Q796M345l880K474J666
956C694l008M881L007j0461k048J1189j612j3036L097J1090o172q612N753K630
$$ plain form
970 392 -3349 149 737 -4153 2057 7508 -2904 -8095 4762 7767 -5780 -4336 7972 3078 -5676
985 -5676 -304 974 -2554 2254 2622 -4725 418 8385 -1266 -9261 3259 8588 -5287 -5926 6184
1000 6184 2491 -5041 -503 -372 -4450 1288 2845 -5955 -2515 8943 2166 -8961 2059 9878
1014 9878 -2624 -4148 6770 3452 -2832 1296 189 -5213 277 3714 -6427 -5618 8010 2012
1028 2012 -11271 -1045 8474 -1808 -4605 4560 3803 -1039 2496 911 -5360 1696 7458 -4293
1042 -4293 -6661 7894 4244 -9628 -2595 6897 -2085 -5323 3021 1862 -3324 1926 1798 -5915 235
1057 235 7890 -3772 -7249 7660 6485 -7739 -3447 6324 383 -4343 1963 1298 -2926 3404 3151
1072 3151 -7987 -1919 9044 -1760 -8521 4450 6336 -5982 -4131 4967 156 -4379 2757 1636
$$ packed form
970C92l741L498N88m890O210N451j0412n191J2857L005j3547J444J2308m894q754
985e676N372J278l528M808L68p347N143P967r651p995J2520N329j3875o39J2110
1000F184l693p532M538J31m078N738J557q800L440J1458o777j1127J1020P819
1014I878j2502j524J0918l318o284M128j107n402N490L437j0141Q09J3628n998
1028B012j3283J0226R519j0282k797R165p57m842L535j585o271P056N762j1751
1042d293k368J4555l650j3872P033R492q982l238Q344j159n186N250j28p713O150
1057B35P655j1662l477J4909j175j4224M292R771n941m726O306o65m224O330k53
1072C151j1138O068J0963j0804o761J2971J886j2318J851R098m811m535P136j121
$$ plain form
1086 1636 -3363 3669 3991 -6630 -1124 9286 -992 -9209 3488 7731 -4243 -5307 3368 -63
1100 -63 -3738 2801 116 -4924 4404 5908 -6456 -4222 7927 2008 -7294 1756 7371 -3082 -4752
1115 -4752 3478 -481 -3754 2775 770 -4607 3170 4980 -6484 -4847 7922 3345 -7735 -153
1129 -153 7589 -1404 -3655 2938 -469 -2548 4107 789 -6137 1294 6532 -4347 -6830 4560 3337
1144 3337 -6679 -528 5734 -1533 -2672 3193 -236 -2294 4562 2293 -5268 1172 7100 -3461
1158 -3461 -7732 4474 4829 -5710 -2522 3704 -1109 -2091 2120 -1441 -2979 4092 2876 -5763 -759
1173 -759 7411 -731 -6141 3568 4435 -4011 -1126 3707 -617 -1652 2182 -1729 -4354 2561 2621 -6157
1189 -6157 -2084 6965 -211 -6848 1346 4731 -1618 -748 2680 -219 -583 2741 -1348 -4889 2944
$$ packed form
1086A636m999P032L22j0621N506J0410j0278q217J2697M243j1974j064Q675l431
1100f3l675O539k685n040R328J504j2364K234J2149n919r302R050N615j0453j670
1115d752Q230l959l273O529k005n377P777J810j1464J637J2769m577j1080P582
1129a53P742q993k251O593l407k079O655l318o926P431N238j0879k483J1390j223
1144C337j0016O151O262p267j139N865l429k058O856k269p561O440N928j0561
1158c461m271J2206L55j0539L188O226m813r82M211l561j538P071j216q639N004
1173g59Q170q142n410R709Q67q446K885M833m324j035L834l911k625O915O0q778
1189f157M073R049p176o637Q194L385o349Q70L428k899l64L324m089l541P833
$$ plain form
1204 2944 4249 -5077 -3518 5407 316 -5941 297 3870 -1014 -913 2345 -491 -734 3088 -610
1219 -610 -4491 2687 4862 -4396 -3943 4487 1242 -4973 -1276 2668 -461 -649 1752 -938 -859 4204
1235 4204 555 -3987 2408 5530 -2120 -3782 2828 1725 -4357 -2425 1122 -1447 -1263 879 -2122
1250 -2122 -1991 3562 1073 -3553 1983 6242 12 -2326 2909 3486 -1649 -1364 845 -1163 -888 575
1266 575 -3165 -3207 1654 -153 -4878 -748 4158 569 -2733 1720 3529 -555 -93 1480 75 1401
1282 1401 2380 -1661 -2306 1999 819 -4313 -2230 2694 550 -3347 -347 1563 -606 -178 322 -462
1298 -462 1752 2859 -685 -2099 1892 2034 -3251 -2364 2587 1406 -1965 -556 868 -24 306 -168
1314 -168 -320 1783 2849 -604 -2666 895 1633 -2780 -3402 867 893 -1850 -1632 -482 183 744 115
$$ packed form
1204B944J305r326J559Q925n091o257O238L573m884J01L258k836k43L822l698
1219f10l881P178K175r258M53Q430l245o215L697L944l129j88K401k690P9N063
1235D204l649m542O395L122p650j662O610j103o082J932L547k569J84K142l001
1250b122J31N553k489m626N536M259o230k338N235N77n135K85K209k008K75J463
1266E75l740m2M861j807m725M130M906l589l302M453J809m084M62J573j405J326
1282A401R79m041o45M305j180n132K083M924k144l897L000J910k169M28N00p84
1298d62K214J107l544j414L991J42n285Q87M951j181l371J409J424q92L30m74
1314a68j52K103J066l453k062L561P38m413o22M269K6k743K18J150O65N61o29
$$ plain form
1331 115 -134 1855 3675 1066 -1386 1327 2756 -830 -2252 344 1136 -921 -2348 -2256 -1116 -806
1347 -806 -1692 -2221 -21 1910 673 -1315 670 3007 1326 126 1584 2961 2109 199 -581 -20
1363 -20 301 -1497 -2685 -1789 412 -612 -2950 -1735 540 306 -865 -344 2005 2776 902 -234 687
1380 687 1617 666 -1210 -285 1202 784 -1239 -1858 -443 536 -559 -1778 463 1701 15 -1955 -1072
1397 -1072 682 284 -1050 -406 1110 1509 690 -666 -219 1905 966 -1216 -239 2116 545 -1743 -1267
1414 -1267 224 -65 -1290 -727 -3 1020 585 -1552 -1630 1261 589 -1842 -675 1766 1554 -1149 -318
1431 -318 1250 1060 475 406 273 1209 1340 -1509 -2562 75 69 -2389 -2518 843 935 -1324 -802 902 949
1450 949 1308 1034 -68 1281 2264 -259 -2157 -255 1308 -1329 -2279 877 1238 -1406 -511 200 -464
$$ packed form
1331A15k49J989J820k609k452K713J429l586j422K596P92k057j427R2J140L10
1347h06q86n29K200J931j237j988J985K337j681j200J458J377q52j910p80N61
1363b0L21j798j188Q96K201j024k338J215K275k34j171N21K349P71j874j136R21
1380F87R30r51j876R25J487m18k023o19J415R79j095j219K241J238j686j970Q83
1397a072J754l98j334O44J516L99q19j356M47K124r39k182R77K355j571k288M76
1414a267J491k89j225N63P24J023m35k137p8K891o72k431J167K441k12k703Q31
1431c18J568j90n85o9j33R36J31k849j053K637ok458j29L361R2k259N22J704M7
1450I49L59k74j102J349R83k523j898J902J563k637r50L156L61k644Q95P11o64
$$ plain form
1467 -464 501 479 -1081 -129 1730 123 -2510 -186 2473 -222 -1430 1740 1908 -387 -285 39 -1075
1484 -1075 14 721 -1508 -1645 1271 673 -2589 -775 2507 437 -1306 1156 1670 -190 -161 -208 -1427
1501 -1427 -325 1046 -970 -1896 1468 1636 -2110 -634 2991 986 -976 628 1018 -856 -358 -506
1517 -506 -1906 -714 1584 -694 -2317 1445 2220 -1631 -1151 2428 1023 -983 505 597 -919 49
1533 49 225 -1800 -756 2156 30 -2467 1315 2588 -1502 -1482 1304 866 -1036 -58 480 -1230 209
1550 209 1165 -1439 -573 3011 958 -2052 647 2405 -1131 -2107 526 234 -1509 -388 260 -1517
1566 -1517 25 1334 -1037 -596 2969 1705 -1476 483 2558 -530 -1817 793 642 -833 341
1581 341 353 -1672 -73 1222 -1516 -1845 1681 1390 -2097 -786 1755 -163 -1319 1192 1240 -338 1495
$$ packed form
1467d64R65k2j560R52J859j607k633K324K659k695j208L170J68k295J02L24j114
1484a075J089P07k229j37K916n98l262J814L282k070j743K462N14j860K9m7j219
1501a427J102J371k016r26L364J68l746J476L625k005j962J604L90j874M98j48
1517e06j400J192K298k278j623L762P75l851M80L579j405k006J488R2j516R68
1533D9J76k025J044K912k126k497L782J273m090K0K786m38j902R78N38j710J439
1550B09R56k604Q66L584k053l010K699J758l536r76K633k92j743J121O48j777
1566a517J542J309k371M41L565j264l181J959K075l088j287K610j51j475J174
1581C41J2k025J599J295k738l29L526k91l487J311K541j918j156K511M8j578J833
$$ plain form
1598 1495 1264 -1043 84 1947 -1062 -2289 1135 1315 -2352 -1773 889 -586 -1816 529 724 -262
1614 -262 1622 1228 -1045 194 2411 147 -1756 1277 2102 -1606 -1361 746 -725 -1708 122 82 -907
1631 -907 669 925 -1675 -619 1772 224 -2079 980 2606 -419 -943 1038 69 -1034 415 -9
1647 -9 -1079 802 918 -1573 -1762 1256 292 -1841 490 2295 -39 -733 910 -35 -666 420 179
1664 179 -859 475 1083 -1839 -2077 1262 361 -1874 88 1974 271 -571 771 50 -330 617 440
1681 440 -867 594 1745 -1273 -2439 462 163 -1785 -260 1257 61 -545 544 -46 -582 925
1697 925 1101 -734 881 2083 -393 -1766 347 436 -1579 -912 801 197 -506 212 -704 -1241 522
1714 522 774 -951 349 2225 20 -1474 295 815 -631 -232 927 542 -426 136 -747 -1549 355
$$ packed form
1598A495k31k307J127J863l009j227L424J80l667N79K662j475j230K345J95r86
1614b62J884l94k273J239K217k264j903L033Q25l708K45K107j471r83J830m0r89
1631i07J576K56k600J056K391j548k303L059J626l025n24J981r69j103J449m24
1647ij070J881J16k491j89L018r64k133K331J805k334o94J643r45o31J086k41
1664A79j038J334O08k922k38L339r01k235J962J886j703q42J342p21l80R47j77
1681D40j307J461J151l018j166K901k99j948J525J517j196o06J089n90n36J507
1697I25J76j835J615J202k476j373K113Q9k015O67J713o04p03P18r16n37J763
1714E22K52j725J300J876k205j494J769N20j446L99J159l85r68N62q83q02J904
$$ plain form
1731 355 695 -1082 4 1688 243 -1448 -239 674 -399 -333 948 216 56 516 -549 -1314 189
1748 189 695 -593 -386 1493 613 -867 -472 403 -250 129 730 321 117 376 -652 -1612 -423 518
1766 518 -609 -715 1246 950 -798 -510 482 -129 132 757 421 356 858 -179 -1272 -230 767 -414
1784 -414 -636 876 654 -673 -661 10 -428 -93 597 118 404 651 -131 -1073 -324 799 160 -500 895
1803 895 925 -80 -368 -434 -394 168 217 260 11 738 159 -1471 -889 144 -176 -625 273 497 86 -180 -371
1824 -371 -244 437 880 400 663 1081 391 -869 -914 307 27 -371 101 584 -30 -582 -1033 -878 -212 40
1844 40 42 167 758 1022 -243 -288 805 832 819 676 839 507 -268 -975 -1195 -731 -512 -919 -793 12 117
1865 117 -606 -817 -29 657 744 951 1069 1116 515 -115 -555 -159 152 -58 -359 297 190 -584 -1215 -928 -334
$$ packed form
1731C55L40j777J086J684j445j691J209R13j073O6J281p32j60M60j065p65J503
1748A89N06j288K07J879q80j480L95Q75o53L79O01m09k04K59j028r60J189R41
1766E18j127j06J961k96j748K88R92o11K61O25l36o5N02j037j093J042R97j181
1784d14k22J512k22j327J2O71m38L35O90m79K86K47p82r42P49J123o39o60J395
1803H95L0j005k88o6M0N62M9M3k49P27n79j630N82J033l20m49Q98K24m11k66j91
1824c71J27O81M43m80K63M18o90j260m5J221k80l98M72M83o14n52m51J55O66K52
1844D0KJ25N91K64j265m5J093K7j3j43J63l32p75p07k20M64K19m07J26Q05J05
1865A17p23k11P88O86Q7K07J18M7o01o30m40L96L11k10l01O56j07p74o31K87N94
$$ plain form
1886 -334 -307 -218 1 636 471 -265 -474 144 824 804 726 986 903 134 -615 -907 -342 -282 -668 -736 -231 -378
1908 -378 -579 -947 -273 417 648 860 997 1090 826 -15 -812 -144 267 -158 -209 94 -18 -440 -781 -165 -129
1929 -129 293 115 94 85 257 -369 -866 -453 479 698 198 807 1122 347 -222 -82 -104 118 -109 -599 -558 -316
1951 -316 -526 -1217 -911 202 808 208 664 1403 464 197 -103 3 215 364 -255 -449 -178 -91 -822 -990
1971 -990 72 416 -219 400 171 182 -292 -517 -547 -47 477 682 223 458 665 -136 -345 554 588 220 -47
1992 -47 56 -475 -505 -691 -991 -595 570 408 -290 517 775 170 -333 392 668 118 33 244 -31 -478 -397
2013 -397 -613 -538 456 443 -290 -134 575 -71 -501 -308 204 -99 147 299 87 -49 -76 -40 -455 604 768
2034 768 84 -80 324 -159 -663 -569 18 -103 -142 179 -40 -144 221 -5 -353 650 497 208 -44 365
$$ packed form
1886c34K7Q9K19O35j65p36k09O18O80k0p8K60q3p69p49k92N65O0l86o8N05j47
1908c78k01l68O74O90K31K12J37R3k64q41p97O68M11m25n1L03j12m22l41O16L6
1929a29M22j78k1rJ72o26m97M13R32K19n00O09L15p75n69J40k2K22k27m90M1K42
1951c16k10o91L06J113O06o00M56P39r39k67l00J06K12J49o19j94K71Q7p31j68
1971i90J062L44o35O19k29J1m74k25l0N00N24K05m59K35K07q01k09Q99L4l68k67
1992d7J03n31l0j86l00L96J165j62o98Q07K58o05n03P25K76n50q5K11k75m47Q1
2013c97k16P5R94j3p33J56P09o46m30J93N12l03K46J52k12j36k7L6m15J059J64
2034G68o84j64M04m83n04R4N87j21l9L21k19j04L65k26l48J003j53k89k52M09
$$ plain form
2054 365 365 -720 -400 -63 -109 -17 165 -89 -280 246 -237 -731 74 353 -20 -111 351 128 -378 62 180
2075 180 17 279 500 -54 -124 326 -129 -751 -105 272 -273 -551 186 197 -341 -183 331 120 64 493 20
2096 20 -116 230 185 -812 -143 357 -98 -384 86 308 -338 -132 -6 -77 210 764 30 -187 381 416 -188
2117 -188 -321 541 175 -376 202 146 -162 24 13 -154 113 251 44 -450 37 394 -289 -372 336 138 -211
2138 -211 142 235 32 85 31 -225 -50 348 283 -633 -159 276 -258 -219 174 -126 -74 -257 63 -236 -50 7
2160 7 -43 -69 301 32 -441 -54 85 -136 -132 141 27 -52 137 130 -91 55 -72 -250 -99 -27 8 -529 -118 106
2184 106 -137 -341 171 32 -80 57 115 45 -9 365 -180 -309 111 21 -354 46 229 -134 -157 62 77 -51
2206 -51 193 56 -164 125 151 -172 -232 4 236 -246 -164 179 171 -45 259 -177 -368 92 -17 -153 -145 423 -75
$$ packed form
2054C65%j085L20L37m6R2J82k54j91N26m83m94Q05K79l73r1M62k23n06M40J18
2075A80j63K62K21n54p0M50m55o22O46L77n45k78P37J1n38J58N14k11n6M29m73
2096B0j36L46m5r97O69N00m55k86M70K22o46K06J26p1K87N54p34k17N68L5o04
2117a88j33Q62l66n51N78n6l08J86j1j67K67J38k07m94M87L57o83q3P08j98l49
2138b11L53R3k03N3n4k56J75L98o5r16M74M35n34L9L93l00N2j83L20k99J86N7
2160Gn0k6L70k69m73L87J39k21MK73j14p9J89pk21J46j27j78J51P2L5n37M11K24
2184A06k43k04N12j39j12J37N8p0n4L74n45j29M20r0l75M00J83l63k3K19J5j28
2206e1K44j37k20K89K6l23o0K36K32m82Q2L43qk16L04m36j91M60j09j36QN68m98
$$ plain form
2229 -75 -138 213 344 83 -113 317 57 -36 98 -114 -6 -5 212 -206 -238 141 -111 -150 151 102 3 -261 173
2252 173 56 -76 -60 204 -135 142 105 -9 131 12 173 -283 32 149 -93 -98 128 80 -18 32 -21 -163 13
2275 13 100 -11 -165 119 378 -170 -60 -32 -44 -205 -10 250 175 -64 -37 105 -5 34 191 -154 126 117 -80
2298 -80 -21 -47 29 -274 -333 104 -86 -16 59 -268 -237 18 -115 -35 117 148 -45 4 139 -144 -168 59 -148 -150 -123
2323 -123 -59 -205 -185 121 -53 -72 184 -29 193 87 -203 -200 -84 -138 220 26 -56 352 -172 -144 22 255 -145
2346 -145 -10 180 -64 -207 7 -222 -224 -7 -101 -52 21 240 152 0 164 84 212 -31 -30 243 -219 -202 -222 -80
2370 -80 81 -88 -104 100 21 -148 -249 -212 54 143 36 161 139 88 207 107 105 219 -134 -33 266 3 -268
2393 -268 -243 27 -139 -79 -2 34 37 184 108 -100 115 193 99 131 197 263 -204 -20 -410 -333 -121 -200 -117 -70 12 149
$$ packed form
2229g5o3L51J31k61j96M30k60r3J34k12J08JK17m18l2L79k52l9L01m9r9k64M34
2252A73j17j32J6K64l39K77l7j14J40j19J61m56L15J17k42nK26m8r8N0n3j42J76
2275A3Q7j11j54K84K59n48J10K8j2j61J95K60p5k39K7J42j10L9J57l45K80rj97
2298h0N9k6P6l03n9M37j90P0P5l27L1K55j33Q0J52L1j93M9J35k83k4K27k07kK7
2323a23O4j46K0L06j74j9K56k13K22j06k90LJ16n4L58j94q2M08n24K8J66K33m00
2346a45J35J90k44j43K14k29kK17r4M9P3K19q8j52J64q0J28k43JK73m62J7k0J42
2370h0J61j69j6K04p9j69j01L7K66Q9j07J25k2n1J19j00kJ14l53J01K99k63k71
2393b68K5K70j66O0P7L6LJ47p6k08K15P8r4L2O6O6m67J84l90P7K12p9Q3M7Q2J37
$$ plain form
2419 149 -239 -98 137 -74 147 -105 51 179 31 -130 30 -46 83 -75 -33 -79 4 -108 -233 30 -57 -81
2441 -81 81 97 32 84 145 103 176 113 165 11 -6 172 -142 -150 -108 -150 105 -51 -90 -208 -58 146 15 23 86 123
2467 123 153 215 -141 27 -20 -84 -32 210 -126 -233 -53 -111 -191 -111 -133 83 117 42 -6 -22 -42 38 110 103 102 183 33
2494 33 123 -52 -154 -261 -89 -66 -141 -162 -98 -25 -53 8 30 3 123 207 -7 155 39 308 -98 -172 -16 65 -225
2519 -225 -131 -78 109 -182 -127 -171 112 221 193 -32 19 -61 -90 -50 14 360 191 156 15 -205 -23 -59 -89 147
2543 147 81 26 -212 124 56 -79 -68 -142 106 48 15 322 25 -40 39 -30 -34 113 292 -168 -9 29 -29 -103 42
2568 42 251 -9 186 91 2 130 38 87 -99 339 383 137 -96 100 -5 -153 -117 198 149 -77 -119 -218 -152 46
2592 46 28 -50 0 407 48 46 -35 -28 -113 -157 28 -42 264 -125 -216 -283 49 43 -70 128 53 -112 -272 9 0 -86 -3
$$ packed form
2419A49l88J41K35k11K21k52J56J28j48j61J60p6J29j58M2m6Q3j12j25K63q7k4
2441h1J62J6o5N2O1m2P3o3N2j54j7J78l14qM2m2K55j56l9j18J50K04j31QO3L7
2467A23L0O2l56J68m7o4N2K42l36j07J80n8q0Q0k2K16L4p5m8j6k0Q0P2pjQ1j50
2494C3R0j75j02j07J72K3p5k1O4P3k8O1K2k7J20Q4k14J62j16K69m06p4J56Q1k90
2519b25R4N3J87k91N5m4K83J09k8k25N1q0k9M0O4L46j69l5j41k20J82l6l0K36
2543A47o6n5k38L36o8j35J1p4K48n8l3L07k97o5P9o9mJ47J79m60J59L8n8p4J45
2568D2K09k60J95r5q9J28r2M9j86M38M4k46k33J96j05j48L6L15m9k26m2r9O6J98
2592D6j8p8N0M07l59kq1Pq5m4J85p0L06l89r1o7L32oj13J98p5j65j60K81rq6Q3
$$ plain form
2619 -3 127 3 65 116 13 -166 -120 6 -132 66 205 17 -233 -143 -74 -112 -154 193 212 119 179 93 -247 124
2643 124 228 215 -201 206 -105 -162 -92 116 -147 -238 136 119 -99 69 172 -245 145 36 -96 -121 328 30
2665 30 -239 -67 -90 -30 -244 77 -96 -110 -6 36 -309 -162 103 -139 -102 254 179 83 -76 66 -206 153 355
2688 355 -148 -105 -12 40 -19 -215 227 -164 -57 195 201 -124 137 338 -168 201 205 -91 -178 158 234 -318 -266 51
2712 51 -237 -126 -302 72 -12 -137 208 -24 -63 -1 94 -135 49 31 -46 -150 104 -141 -82 -140 110 18 -220
2735 -220 -121 -390 -109 288 103 -17 95 471 -54 119 337 49 -103 -118 100 -63 -17 -23 -313 -230 -82 -29
2757 -29 -120 -168 43 -194 -116 144 20 -12 51 99 -125 106 209 -71 -28 148 85 -191 -247 -114 -113 -152 -149 22 -159
2782 -159 -118 112 -25 173 368 86 -172 206 211 12 -58 134 -178 -250 -193 -26 -48 8 -87 -216 12 167 25
$$ packed form
2619cJ30j24O2N1j03j79M6J26j38J98J39j88k50R0O9l8m2L47J9r3O0q6l40L71
2643A24J04j3m16M07l11n7P0K08k63r1L74j7k18J68J03m17L90j09j32k5M49k98
2665C0k69J72k3O0k14L21j73j4J04M2l45J47K65k42L7L56p5r6j59J42k72L59K02
2688C55n03M3R3N2n9j96M42l91J07K52Ol25K61K01n06L69Mk96q7L36P6n52N2L17
2712E1k88J11j76L74q4j25L45k32l9O2R5k29J84j8p7j04K54k45N9n8K50r2k38
2735b20R9k69K81L97j85j20J12L76n25J73K18k88j52j5K18j63M6ok90Q3J48N3
2757b9r1m8K11k37P8K60j24l2O3M8k24K31J03k80M3J76o3k76n6J33Jl9LJ71j81
2782a59M1K30j37J98J95k82k58L78Nj99p0J92l12p2N7J67k2N6r5j29K28J55j42
$$ plain form
2805 25 -97 265 355 34 -82 62 121 -41 53 14 -78 167 233 -86 -30 -43 -55 -265 231 -86 -157 -282 27 18
2829 18 -13 137 164 57 95 252 -101 -82 237 -152 -283 -34 -202 -489 -197 -42 -182 -170 44 118 43 17 286
2852 286 34 176 270 -93 -134 -34 411 -146 -22 135 1 -28 -108 -127 -54 18 72 -234 -110 100 81 -168 -278
2875 -278 228 52 301 60 33 108 38 -326 -318 -42 33 -228 -311 -149 124 -128 -121 172 -73 -23 -12 89 117 248
2899 248 -35 -149 -91 -120 -73 -207 -101 167 69 -53 -54 33 116 -54 -86 -184 73 -291 -58 105 111 46 -168 -35
2923 -35 262 163 80 151 87 162 -81 -86 -192 -169 24 -20 39 129 29 -32 -76 -243 -12 -23 -161 150 232 -21 -162
2948 -162 286 152 280 9 36 -9 118 174 -118 47 -165 -314 -104 -230 60 36 -79 -95 207 45 17 135
2970 135 160 119 8 -192 -145 131 -66 -365 29 -103 106 56 -179 63 23 30 125 112 2 85 -96 -11 114 42
$$ packed form
2805B5j22L62R0l21j16J44N9j62R4l9r2K45O6l19N6j3j2k10M96l17p1j25L09r
2829A8l1J50K7j07L8J57l53J9L19l89j31K49j68k87K92J55j40J2K14P4p5k6K69
2852B86k52J42R4l63m1J00M45n57J24J57j34k9q0j9P3P2N4l06J24K10j9k49j10
2875b78N06j76K49k41k7P5p0l64QK76P5k61q3J62K73k52PK93k45N0J1J01K8J31
2899B48k83j14N8k9M7j34J06K68r8j22jQ7Q3j70l2r8K57l64K33J63Oo5k14J33
2923c5K97r9q3P1o4P5k43nj06K3J93m4N9R0j00o1m4j67K31j1j38L11Q2k53j41
2948a62M48j34J28k71K7m5J27N6k92J65k12j49K10j26K90k4j15j6L02j62k8J18
2970A35K5m1j11k00M7K76j97k99L94j32K09n0k35K42m0PR5j3j10Q3j81Q5J25p2
$$ plain form
2994 42 -176 41 186 -88 -155 48 -188 150 117 -99 -70 -203 -128 -338 -263 -89 213 -298 52 110 191 46 -23
3017 -23 99 -313 -126 139 -280 -111 -74 -32 -143 118 290 44 -78 61 24 -126 -245 -216 -150 231 82 -64
3039 -64 208 300 -27 78 369 289 -137 -145 -140 -130 -166 -26 -2 -111 -57 191 -257 -243 198 -7 -57 15 323 114 -219
3064 -219 113 309 -125 146 -111 -191 155 59 -261 -159 197 -24 -283 -225 237 67 -247 40 99 286 246 179
3086 179 0 285 212 168 -137 -37 52 -427 -434 99 -199 -170 -44 -4 -42 141 118 -99 113 273 -36 -108 164
3109 164 238 -35 15 210 -159 -146 4 112 -176 23 68 -156 14 273 -66 -310 48 374 10 145 200 71
3131 71 105 -90 228 27 325 124 -110 33 53 49 -342 25 93 -299 -110 223 49 56 148 150 -152 89 187 -365
3155 -365 -298 272 -191 -158 -44 216 14 -128 20 -35 -48 -53 -171 -355 98 157 -24 -252 336 55 -114 -160 282
$$ packed form
2994D2k18K17J45k74o7K03k36L38l3k16K9j33P5k10P5J74L02n11L50N8Q1j45o9
3017b3J22m12J87K65m19J69L7M2j11K61J72k46j22J39l7j50j19K9O6L81j49j46
3039f4K72R2l27J05K91q0m26qNJ0l6J40K4j09N4K48m48J4M41k05n0P2L08k09l33
3064b19L32J96m34K71k57q0L46r6l20J02L56k21k59N8M62j70l14K87N9J87m0o7
3086A79j79K85p3m4l05J00Q9m79pN33k98K9J26M0l8J83k3k17K12J60l09p2K72
3109A64P4k73N0J95l69J3J50J08k88J99M5k24J70K59l39k44L58L26l64J35N5j29
3131G1L4j95L18k01K98k01k34J43K0ml91L67O8l92J89L33j74PR2Kl02K41R8n52
3155c65O7N70m63L3J14K60k02j42J48n5j3nj18j84M53N9j81k28N88k81j69m6M42
$$ plain form
3178 282 74 -113 27 -97 58 -162 -200 -432 -65 258 -78 -156 270 380 -17 403 355 20 178 253 -141
3199 -141 -219 -12 -245 -265 -101 236 -68 -177 179 256 -259 -145 316 151 70 168 -160 -212 112 18 -227 -158 281
3222 281 -57 -179 2 78 -294 -179 177 -192 -79 163 -87 -34 157 193 102 -12 503 273 -249 287 68
3243 68 -163 -98 -159 77 -76 -130 42 -211 -24 196 -218 -96 207 150 -220 8 167 -63 58 30 -49 9 301
3266 301 77 -348 -109 242 -75 -396 229 35 -221 -63 -72 136 -104 99 189 269 316 265 -65 135 268 -462
3288 -462 -234 49 -125 -392 -244 -105 -120 -246 54 -96 -174 442 405 24 188 286 -186 -32 75 58 17 19 -94
3311 -94 -119 -132 -80 -534 -177 76 103 -11 -40 -26 -133 103 192 253 233 156 265 85 -74 200 -185 -4 80 -38
3335 -38 -541 -339 -186 -229 -123 -85 140 216 258 253 4 44 186 116 -145 214 249 -141 -381 -5 18 -407 -327 -156
$$ packed form
3178B82k08j87J40j24J55k20l8k32L67L23l36p8M26J10l97M20m8l35J58P5l94
3199a41p8K07k33k0J64L37l04j09L56P7n15J14M61j65q1R8l28n2L24r4k45O9M39
3222B81l38j22J81P6l72J15L56l69J13K42k50N3J91L6r1j14N15k30n22N36k19
3243F8k31O5o1K36j53n4J72k53J87K20m14J22L03n7l70K28J59k30J21k8p9N8K92
3266C01k24m25K39L51l17l21O25j94k56J58rK08k40K03R0Q0M7n1l30K00J33p30
3288d62K28K83j74k67J48J39j5j26L00j50p8O16l7l81J64R8m72J54J07j7m1Kj13
3311i4k5j3N2m54L57K53K7j14k9J4j07K36Q9O1k0p7J09j80j59K74l85J81Q4j18
3335c8n03K02J53m3J06L8K25P6M2nk49M0J42p0k61L59L5l90k40L76K3m25Q0J71
$$ plain form
3359 -156 -8 -58 -63 -168 -28 27 -29 133 305 219 299 -188 42 208 95 14 -67 195 -197 -125 -367 -314 -35 -248
3383 -248 -273 -84 229 39 -182 -204 12 24 66 22 182 84 -151 -64 -26 -208 -48 -58 -247 112 2 -66 67
3406 67 -183 -48 -83 -40 89 110 36 -144 264 321 -2 -41 186 94 171 -97 -246 -170 -76 -142 -243 -41 -44 210 50
3431 50 -92 104 420 56 72 130 366 59 -6 -120 99 -89 -306 -106 30 -15 -162 -39 -144 -163 22 -125
3453 -125 -67 17 -96 -86 -87 265 -32 175 170 7 94 -97 -188 12 -18 -97 34 -24 32 -12 -3 -34 141 -179 -57 188
3479 188 300 231 83 -5 -62 245 -33 -128 -44 -23 -19 -242 22 -70 72 -145 -32 -133 9 -98 -32 -261 198
3502 198 385 1 73 48 263 -148 -140 7 -226 -317 81 -29 -63 -13 -264 -261 5 220 -148 94 109 190 121 -111
3526 -111 73 155 -57 -63 -46 113 -54 -135 -51 -242 70 -66 -175 -113 212 99 -151 -110 242 80 239 97 222
$$ packed form
3359a56J48n0nj05J40N5n6J62J72q6Q0m87K30J66j13q1q1K62l92P2k42N3K79k13
3383b48k5J89L13j90k21k2K16J2M2m4J60r8k35Q7L8j82J60j0j89L59j10o8J33
3406F7k50J35l5M3J29K1p4j80M08N7l23l9K27r2P7k68j49P6R4o6j01K02lK54j60
3431E0j42J96L16l64J6N8K36l07o5j14K19j88k17K00J36m5j47J23j05j9J85j47
3453a25N8Q4j13J0jL52k97K07nj63Q7j91r1K00l0p9J31n8N6m4Rl1J75l20J22K45
3479A88J12o9j48q8n7L07k78r5Q4K1Mk23K64r2J42k17J13j01J42j07O6k29M59
3502A98J87l84P2k5K15m11QJ47k33r1L98j10l4N0k51LK66K15l68K42J5Q1o9k32
3526a11J84Q2k12oJ7J59j67q1Q4j91L12j36j09O2L25j13k50M1L52j62J59j42J25
$$ plain form
3549 222 148 158 -350 12 250 235 -157 -105 85 -25 -54 -46 3 57 176 -183 -179 61 -82 -260 -364 319 250 110
3573 110 -155 101 -167 9 -159 -73 -38 61 120 -37 -248 6 -108 -291 142 32 -172 -46 51 -93 -21 -1
3595 -1 -198 86 -39 58 8 -59 91 -48 -137 -14 135 -119 182 119 0 148 -104 188 -89 -25 123 -12 127
3618 127 209 82 -124 37 295 79 -35 161 67 -149 -403 -112 -83 188 43 56 -37 153 -99 -95 -51 264 126
3641 126 -47 10 -14 -55 21 -226 -121 -70 253 -23 -222 205 28 -209 -158 124 -69 -28 83 93 -63 243 -43
3664 -43 29 -59 499 27 -254 38 52 -475 -153 -91 -42 -119 0 -18 -193 -33 0 -88 134 280 121 5 163
3687 163 143 -171 -145 288 12 132 38 75 59 66 -90 -155 -140 198 120 22 36 147 153 -276 291 133 -41 201 13
3712 13 113 232 -67 -155 -219 48 -1 -30 -127 -101 -247 -188 235 63 -43 307 37 -119 108 -123 -156 -51 32
$$ packed form
3549B22p4J0n08L62K38j5l92N2J90j10k9QM9N4J19l59MK40j43j78j04O83o9j40
3573A10k65K56k68J76j68Q6L5R9N9j57k11K54j14j83M33j10k04J26R7j44P2K0
3595aj97K84j25R7n0o7J50j39q9J23J49k54L01o3j19J48k52K92k77O4J48j35J39
3618A27Q2j27k06J61K58k16j14J96r4k16k54K91K9K71j45J3r3J90k52MM4L15j38
3641A26j73N7k4m1P6k47J05N1L23k76j99M27j77k37N1K82j93M1J11J0j56L06k86
3664d3P2q8N58m72k81K92J4n27L22O2M9p7J19j8j75J60L3q8K22J46j59j16J58
3687A63k0l14K6M33k76J20r4L7j6Pj56o5J5L38p8r8J4J11Om29N67j58j74K42j88
3712A3J00J19k99q8o4K67m9k9r7K6j46N9M23j72j06L50k70j56K27k31l3J05Q3
$$ plain form
3735 32 198 -242 154 -4 -107 -271 -268 -99 -101 214 -8 18 71 193 -273 -129 182 107 -65 -100 -31 -213 -149 60
3759 60 -62 35 -35 143 -298 129 127 -327 -305 233 83 -170 119 47 144 -108 281 62 -108 234 34 -260 -46
3782 -46 -104 -60 -267 100 60 -218 14 217 -98 153 242 67 63 24 -50 -29 -107 97 115 -204 -133 340 14 280
3806 280 45 62 -175 180 -127 -162 260 88 -73 -116 158 -134 -161 188 14 105 171 27 56 -159 181 -110
3828 -110 -198 -39 20 -165 -14 16 52 -180 0 389 176 172 14 -127 -162 21 -129 -91 -131 76 67 20 133 89
3852 89 -264 -18 100 15 -40 4 -281 185 95 -221 -146 -96 249 272 137 143 50 95 -56 -15 43 98 -181 -244 -129
3877 -129 208 -153 62 -84 270 186 92 -3 33 78 67 -10 -136 134 -109 4 43 13 230 -232 146 -29 -83
3900 -83 16 62 -88 64 90 -5 -98 34 -48 -176 -89 88 85 -18 -213 200 263 186 -47 71 67 109 -66 -25 -29 -20 128
$$ packed form
3735C2J66m40L96j58j03j64LJ69kL15k22K6N3J22m66J44L11p5j72l5O9j82O4K09
3759F0j22R7p0J78m41M27km54K2N38j50k53K89p2R7k52L89k19j70L42k00k94K14
3782d6n8M4k07L67m0k78K32K03l15K51Q9j75ml9p4K1p8K04J8l19P1M73l26K66
3806B80k35J7k37L55l07l5M22j72j61m3K74k92k7L49j74R1O6j44K9k15L40k91
3828a10q8J59N9j85J51L0L6k32J80L89k13mj58j41l5J83j50L8m0K07rm7J13m4
3852H9l53K46J18q5n5M4k85M66r0l16P5N0L45K3j35Or3M5j51M1N8N5k79o3J15
3877a29L37l61K15j46L54q4r4r5L6M5j1p7j26K70k43J13L9l0K17m62L78j75n4
3900h3R9M6j50J52K6r5r3J32q2j28Q7J77lj03j95M13O3p7k33J18mM2j75M1mRJ48
$$ plain form
3927 128 -235 -165 176 -82 10 177 -209 103 -42 -57 69 256 -87 -109 97 222 13 -6 -33 345 117 -161
3949 -161 54 5 15 -54 89 22 -165 104 -57 -22 23 64 56 -142 -112 -1 -74 44 -133 -121 -128 -75 -117 102 91 80
3975 80 102 56 11 16 12 38 175 152 29 102 -24 69 -3 -78 9 114 51 31 -36 59 54 -80 120 87 35 -16 -93 -134 154
4004 154 -34 -15 127 74 -38 22 99 -98 -41 -135 9 91 -59 -99 47 98 108 -76 167 142 131 117 -58 -118 -50
4029 -50 300 68 -183 -313 -121 -116 65 -63 69 64 57 139 4 82 -264 -286 -22 11 -204 -93 42 101 14 -32 -136
4054 -136 16 -75 41 -6 -105 -2 91 -184 -106 -69 -81 -97 451 395 155 134 172 -57 110 -98 -100 -157 -5 -198 -117
4079 -117 -274 -168 237 -322 161 439 268 -55 -2 -124 -7 -100 20 35 -98 -101 16 -40 285 160 -267 -11
4101 -11 288 -12 0 -359 -140 -23 78 51 46 130 441 -26 -284 239 -87 -135 78 184 77 -51 -217 1
$$ packed form
3927A28l63P0L41k58R2J67l86L12j45j5J26J87l43k2K06J25k09j9k7L78k28k78
3949a61K15m9J0o9J43o7j87K69j61L5M5M1qj98L0J11p3J18j77J2pN3m2K19j1j1
3975H0K2m6m5NmK6J37k3j23P3j26R3p2p5Q7J05o3k0o7R5nj34K00l3n2n1p7m1K88
4004A54j88J9J42n3j12O0P7j97N7r4J44Q2j50m0J46N1J0j84K43k5j1j4j75o0O8
4029e0L50k32k51j30J92NJ81j28J32npQ2j35P8l46k2K64L3k15J11J35N9q7m6j04
4054a36J52r1J16m7r9J03R3k75P8L7j2j6N48n6k40k1L8k29J67k08kn7J52j93Q1
4079a17j57J06M05n59M83K78j71l23N3j22J17r3J20J5j33lJ17n6L25j25m27K56
4101a1K99l00J2l59K19J17J01k7nQ4L11m67k58N23l26m8K13J06j07j28j66K18
$$ plain form
4123 1 72 -65 119 -48 326 213 -238 -46 15 -67 223 -16 86 255 14 -115 -234 -290 -128 156 -105 203
4145 203 143 -45 -286 -50 140 -139 -192 142 111 -165 12 -154 -126 36 170 -17 52 259 -176 -311 -121 -11
4167 -11 -53 -223 138 80 -141 -31 -84 78 16 30 -191 136 160 -52 -379 -45 -115 -1 -85 58 85 -29 -62 -150
4191 -150 -217 48 134 -37 -71 262 273 -79 20 243 -129 31 -9 -23 69 -14 -136 -252 -179 49 -30 -41 110 -4
4215 -4 -147 62 272 70 -65 176 -73 -138 70 -146 -177 -206 -80 -42 -201 34 98 -207 -56 -191 -40 -32 216
4238 216 -4 -48 92 168 171 163 136 -116 -258 -59 8 -124 -123 -117 77 0 129 32 213 275 347 -112 -379 154 33
4263 33 -87 277 52 -36 -21 -89 -204 -106 203 -31 -96 -140 -13 -248 -357 51 -109 -116 205 234 -23 150 61 82
4287 82 12 321 86 -159 11 46 -351 -167 -150 -343 -216 -21 369 -28 65 -38 -105 52 162 137 73 224 142
$$ packed form
4123AP1j37J84j67L74j13m51J92O1q2K90k39J02J69k41j29j19n6J62K84k61L08
4145B03o0j88k41K36J90k79n3L34l1k76J77j66K8J62J34j87O9K07m35j35J90J10
4167a1m2j70L61n8k21J10n3J62o2J4k21L27K4k12l27L34p0J14q4J43K7j14l3q8
4191a50o7K65Q6j71l4L33J1l52R9K23l72J60m0j4R2q3j22j16P3K28p9j1J51j14
4215dj43K09K10k02j35K41k49o5K08k16l1k9J26L8j59K35O4l05J51j35J51QK48
4238B16k20m4J40P6Lqk7k52j42J99O7j32JOJ94p7J29r7J81O2P2m59k67N33j21
4263C3j20L64k25q8J5o8j15R8L09k34o5m4J27k35j09M08j60pL21K9k57J73q9K1
4287H2p0L09k35k45J70L5l97J84J7j93J27J95L90l97R3j03o7J57J10k5o4J51q2
$$ plain form
4310 142 -181 106 35 193 -72 -33 16 -193 9 -35 -210 -329 76 -74 -278 98 8 172 -157 153 6 106
4332 106 114 387 136 -3 -29 -251 -243 -99 -202 -144 -51 203 131 -190 -19 41 17 -71 20 168 296 18 -205 -3
4356 -3 -48 69 -7 101 232 -123 -257 -96 56 -57 64 24 51 160 119 -47 37 101 106 141 -28 121 -2 70
4380 70 -50 -233 -134 -16 -16 34 -157 52 -140 -207 -162 122 142 -126 168 39 -166 -253 30 32 187 174 -171 87
4404 87 128 -225 -112 11 63 -161 -78 -76 13 138 16 -103 -43 -166 92 25 24 323 -122 -65 50 93 -8 -67 188
4429 188 29 -27 -33 -25 -56 -100 -104 63 82 46 31 -70 -85 62 -100 49 -109 164 145 3 32 231 -15 -49 201
4454 201 -51 108 11 -119 -91 110 -186 13 77 -49 67 -42 81 -125 -4 -100 -41 247 -6 -3 146 1
4476 1 -62 -190 -6 65 154 -54 -229 19 -113 87 -55 -23 49 132 168 -42 -60 26 61 272 120 92 -218 22
$$ packed form
4310A42l23K87p1J58k65L9M9k09K02m4j75j19M05j50k04L76r0J64l29L10j47J00
4332A06QK73k51j39k6k22QJ44j03N8R3K54p2l21J71O0k4q8R1J48J28k78k23K02
4356cm5J17p6J08J31l55j34J61J52j13J21m0K7J09m1j66Q4O4NL5j69J49j23P2
4380G0j20j83R9J18%N0j91K09j92o7M5K84K0k68K94j29k05q7K83KJ55j3l45K58
4404H7M1l53J13J23N2k24Q3KQ9J25j22j19O0j23K58o7jK99m45N7J15M3j01n9K55
4429A88j59n6oQl1m4mJ67J9l6j5j01j5J47j62J49j58K73j9j42K9J99k46l4K50
4454B01k52J59r7j30K8K01k96J99O4j26J16j09J23k06J21r6N9K88k53LJ49j45
4476Ao3j28J84P1Q9k08j75K48j32K00j42L2P2Q3L6k10j8Q6L5K11j52k8l10K40
$$ plain form
4500 22 -105 -184 96 -153 107 -31 -50 23 95 -79 124 141 208 293 20 115 127 93 21 65 -193 -40 -6 2 -19 33
4526 33 -105 -216 -15 106 -70 -52 -134 202 155 -137 142 -41 123 -149 -149 146 -65 -43 -17 20 -188 -50 -160
4549 -160 340 107 -6 2 2 255 242 71 126 173 -5 -94 28 -297 10 151 -12 79 -126 -48 -252 -65 -15 -96
4573 -96 203 -59 -159 -41 64 -103 51 -43 63 101 41 117 81 -284 -193 12 27 -24 61 -352 22 26 112 22 99
4598 99 252 -107 -31 -59 188 102 45 93 58 222 32 -115 27 -71 -68 49 118 277 2 119 -61 -147 -103 -46 -70
4623 -70 32 150 125 257 -11 -104 103 -359 -137 160 -124 43 -163 -188 90 -163 66 104 -6 42 -84 276
4645 276 46 191 124 -64 253 23 46 237 164 102 -120 71 -38 217 -128 28 37 -110 -113 -72 -110 -53 105 63
4669 63 88 154 12 41 -124 193 73 145 112 -34 -18 -141 -245 40 -187 -80 222 -41 -37 151 -118 3 -5 66
$$ packed form
4500B2j27p9K80k49K60j38j9P3P2j74K03J7O7Q5k73R5J2l4p2M4k58J53L4Qk1N2
4526C3j38j11K01J21j76J8q2L36m7k92K79j83J64k72%K95k11K2K6L7k08J38j10
4549a60N00k33j13Q%K53j3j71N5M7j78q9J22l25L07J41j63R1k05P8k04J87N0q1
4573i6K99k62j00J18J05j67J54r4J06L8o0P6l6l65R1K05J5n1Q5m13L74MQ6r0P7
4598I9J53l59P6k8K47q6n7M8l5J64j90j47J42r8LJ17O9J59k75J17j80q6M4N7k4
4623g0J02J18k5J32k68r3K07m62K22K97k84J67k06k5K78k53K29L8j10M8j26L60
4645B76k30J45o7j88L17k30K3J91p3o2k22J91j09K55l45J56Rj47lM1l8N7J58m2
4669F3K5O6j42K9j65L17j20P2l3j46J6j23j04K85k27J07L02k63MJ88k69J21qP1
$$ plain form
4693 66 -1 79 141 -39 221 43 33 -17 251 28 -96 -86 -2 -25 81 -62 39 -29 -47 -50 -223 -140 105 -6 -218
4718 -218 87 -43 62 -131 -84 -133 -148 -129 -160 3 -226 -119 -45 -16 -176 3 8 70 244 192 10 -8 -26 -65 -215
4743 -215 -169 89 -145 -230 -53 11 -102 49 -57 31 -160 -135 -18 -98 -125 -82 90 -8 -14 116 72 6 -91 -12 17
4768 17 20 -171 63 -163 -136 -185 -57 -90 32 169 169 -291 100 224 28 107 126 30 -121 217 15 -152 -182 -75
4792 -75 66 119 91 -194 149 121 -199 162 135 -8 245 -95 138 97 -101 -168 -60 -91 -107 75 -13 -26 -86 131
4816 131 -149 -108 81 119 -158 67 122 110 -52 133 43 -24 248 111 185 -136 23 46 -271 4 14 -214 166
4839 166 64 40 -191 65 17 251 -104 6 -85 79 54 -240 34 82 -149 93 -213 -173 189 30 74 9 -23
4862 -23 65 -204 100 129 112 55 54 -84 135 -63 -62 -125 -94 -70 -92 72 -133 -346 -5 -56 24 -12 -67 57 100 177
$$ packed form
4693F6o7Q0O2j80K60j78j0n0K68k23j24J0Q4k3J06j43J01o8j8lj73Q3K45j11k12
4718b18L05j30J05j93M7m9j5J9l1J63k29J07P4K9j60J79NO2J74n2j82j8j8l9j50
4743b15M6K58k34q5J77O4j13J51j06Q8j91K5J17q0k7M3J72r8oJ30m4o6r7P9K9
4768A7Lj91K34k26K7m9J28l3J22J37%m60L91J24j96P9J9r6j51L38k02j67l0J07
4792g5J41N3k8k85L43k8l20L61k7j43K53l40K33m1j98o7J08l1j6J82q8j3o0K17
4816A31k80M1J89L8k77K25N5j2j62J85r0o7K72j37P4l21J59K3l17K75J0k28L80
4839A66j02k4k31K56m8K34l55J10r1J64k5k94K74M8k31K42l06M0L62j59M4o5l2
4862b3Q8k69L04K9j7n7jj38K19j98Jo3L1K4k2J64k05k13L41n1Q0l6n5J24M3P7
$$ plain form
4888 177 59 68 41 178 62 26 -11 -121 -41 72 -55 71 15 89 26 144 240 60 -274 6 107 185 140 -27
4912 -27 -50 -49 -165 253 46 -13 107 -43 -123 -55 -100 -71 -53 72 136 -6 74 39 17 70 22 -3 42 90 -89 -204
4938 -204 -76 -38 -89 -281 4 -201 -74 145 -172 -161 69 128 -92 -179 97 -5 171 -49 134 289 -214 -20
4960 -20 -133 308 25 -110 48 -178 -91 99 118 7 49 -81 65 89 -31 74 79 -20 -71 120 -125 -2 137
4983 137 115 42 -36 -130 -48 -8 57 114 -75 148 -48 -87 -59 11 -27 -121 48 -142 186 83 16 -56 9 179 66
5008 66 -6 -171 -131 -53 -141 -64 -60 11 -148 186 68 75 207 166 -8 -61 124 -160 9 137 11 -47 -6 -2 113 31
5034 31 124 -6 -154 -38 41 -51 -220 275 81 -101 -20 132 228 54 41 23 -140 176 31 -222 -154 -14 -22 213
5058 213 -330 28 15 -39 133 -54 -105 48 -104 32 -5 -117 -128 75 -100 -147 -72 -119 -84 298 9 -312 -113
$$ packed form
4888A77j18Rk7J37j16l6l7j10Q0J13j27J26n6P4o3J18R6j80l34K80J01P8m5j67
4912b7k3Jj16M18k07n9J20j50q0O8m5K9J8J25O4j42Q0l5k2N3m8k5M5M8j79j15
4938b04J28L8n1j92K85k05J27K19l17J1K30N9k20q7K76j02J76k20J83J55n03J94
4960b0j13M41k83j35J58k26Q7J90J9j11M2j30J46K4j20J05Nr9n1J91k45J23J39
4983A37k2p3p8r4Q2M0O5N7j89K23j96l9K8P0l8r4J69j90L28j03o7p2O5J70j13
5008F6p2j65M0P8q8P7MP1j59L34j18PJ32m1j74n3J85k84J69J28j26n8M1MJ15q2
5034C1R3j30j48J16P9r2j69M95j94j82Q1J52R6j74j3j8j63L16j45k53O8J40qK35
5058B13n43L58j3n4J72j87n1J53j52J36l7j12j1K03j75m7P5m7L5L82k89l21J99
$$ plain form
5081 -113 50 88 197 46 -64 -35 -81 6 -115 171 -141 27 -31 70 69 30 -43 9 123 37 25 52 202 18
5105 18 -6 -94 229 109 -27 67 15 -2 -325 -45 -2 28 -53 -125 185 -33 -36 -3 -67 27 238 139 -87 127 -72
5130 -72 -2 -125 -148 1 4 26 61 148 -44 -12 -64 -15 -101 -79 -111 87 94 -139 226 146 -110 -13 59 22 -70 39 -142
5157 -142 25 51 -32 -34 -236 -12 -192 -3 44 26 52 100 -24 -83 101 -223 -80 -83 109 -239 36 -173 -100 -107 -109
5182 -109 -164 -36 -89 63 12 -21 -11 -117 -225 -67 -17 -45 214 -88 194 -41 235 -227 -64 264 23 273
5204 273 -228 41 -62 -88 30 93 140 143 6 14 68 -12 -44 38 -109 180 -93 -138 -4 -68 -139 -34 123 -254 -105
5229 -105 167 131 5 -64 51 18 -4 32 -52 -32 81 4 11 -98 15 -49 -35 -71 66 168 36 -148 -34 38 79
5254 79 -60 116 61 21 -204 -44 30 -228 -20 -49 -126 -121 -275 148 -112 -177 3 225 -159 -102 40 -3 -28 34
$$ packed form
5081a13J63L8J09j51j10K9m6Q7j21K86l12J68n8J01jl9p3N2J14q6j2K7J50j84
5105A8k4q8L23j20j36R4n2j7l23K80M3L0q1p2L10k18lL3o4R4K11r9k26K14j99
5130g2P0j23k3J49LK2L5Q7j92L2n2M9q6K2l2J98Pk33L65q0k56R7P2l7r2J09j81
5157a42J67K6q3kk02K24j80J89M7j8K6M8j24n9J84l24J43lJ92l48K75k09P3pk
5182a09n5J28n3J52n1l3J0j06j08J58N0k8K59l02K82k35K76m62J63L28k41K50
5204B73n01K69j03k6J18O3M7Lj37QN4q0l2Q2j47K89k73m5J34o4p1J05J57l77J49
5229a05K72l6j26o9J15l3k2L6q4K0J13p7Pj09J13o4J4l6J37J02j32j84J14P2M1
5254G9j39J76n5m0k25J60P4k58K08k9p7Nj54M23k60o5J80K22l84N7J42m3k5O2
$$ plain form
5278 34 -13 35 4 83 67 -133 -77 38 93 87 -63 -135 -12 108 126 -74 -94 -128 155 249 83 75 99 118 -69 -47 56
5305 56 69 -9 -166 -155 -24 -219 -90 -88 -79 -79 -213 18 -46 188 256 -68 -2 -158 0 -74 -14 -21 24 -170 -137 58
5331 58 -232 29 -178 -13 -125 -32 41 -37 -18 -24 36 -106 21 -65 155 -11 80 41 -100 300 -54 -55 107 -142
5355 -142 -77 -209 -130 -139 82 -163 -32 64 -12 -90 236 160 -79 -113 -266 62 -19 -122 -37 126 9 36 -105 -139
5379 -139 58 -37 62 204 -161 150 121 87 50 -116 11 -139 2 -56 -118 -132 47 111 -44 -128 71 -22 182 -85
5403 -85 118 29 211 -12 -27 15 -92 -62 152 69 -174 20 -63 170 -17 -118 -217 -176 -59 48 -42 -81 232 25
5427 25 81 41 -243 -152 -10 -73 -150 -10 -77 -47 -110 -38 168 26 -148 -155 -43 34 -50 -8 13 -57 -7 -181 93 29
5453 29 24 254 -132 25 -120 -174 -37 -73 -36 -131 21 -64 -52 -47 97 100 -160 -18 -14 -172 -264 -90 18 51 23 121
$$ packed form
5278C4m7M8l1P9j6k00N6J15N5oj50p2J23J20J8k00k0l4K83R4j66qK4J9j87K2J03
5305E6J3p8j57J1J31j95J29KR%j34K31o4K34O8l24O6j56J58p4O0pM5j94L3J95
5331E8k90K61k07J65j12R3P3p8J9oO0j42J27q6K20j66R1l9j41M00l54jJ62k49
5355a42O5j32P9rK21k45J31R6p6p8L26p6k39l4j53L28q1j03Q5J63j17K7j41l4
5379a39J97r5R9J42l65L11k9l4l7j66J27j50J41n8o2j4J79O4j55q4J99r3K04k67
5403h5K03q9J82k23j5M2j07L0K14q3k43J94q3K33j87j01r9M1J17J07r0l9L13k07
5427B5N6m0k84R1J42o3p7J40o7L0o3P2K06j42j74pJ12P7q4M2K1p0N0j74K74o4
5453B9nK30l86J57j45n4J37l6L7r5J52q5J2NJ44Lk60J42Mj58r2J74J08L3k8R8
$$ plain form
5479 121 142 329 -99 -111 59 65 89 -41 72 -52 108 206 107 55 53 27 115 16 -203 166 -39 -43 -58 -21 -31 147
5505 147 171 -44 36 -99 3 9 73 -5 -35 -353 -130 104 6 -83 -8 -115 17 17 -239 -15 115 -145 22 4
5529 4 -36 25 -160 33 -116 -7 70 -224 -242 4 40 -57 -257 -57 -170 180 -6 -43 182 -35 -84 112 -99
5552 -99 -9 -58 15 -115 -21 64 -86 -140 -196 -109 -73 -86 55 42 -105 -12 36 -23 -56 6 41 37 125 -85 43 98 59 45
5580 45 -70 -144 -84 16 -87 33 -205 -117 144 -60 -202 170 -66 104 103 -168 111 -126 157 68 10 -164 -156
5603 -156 -58 69 -25 -185 -91 -50 183 39 -76 -128 134 -11 35 -73 -58 238 -55 104 67 -158 97 -203 -106
5626 -106 -32 -281 -63 -38 -190 -58 8 -59 -144 54 78 -237 159 -15 -69 17 -224 -17 -140 -20 -83 -4 101
5649 101 -57 -87 -124 118 32 356 107 20 -30 -1 -44 42 -308 64 -35 13 -63 82 45 -34 -125 -248 65 -224 -46
$$ packed form
5479A21K1J87m28j2J70OK4j30J13j24J60R8r9n2kk6Q8r9k19L69k05mj5L7j0J78
5505A47K4k15Q0j35J02OO4p8l0l18K23K34r8q9P5j07J32%k56K24J30k60J67j8
5529Dm0O1j85J93j49J09P7k94j8K46L6r7k00K00j13L50j86l7K25k17m9J96k11
5552i9R0m9P3j30R4Q5j50n4n6Q7L6j3J41j3j47R3M8n9l3O2L5mQ8k10J28N5l9j4
5580D5j15p4O0J00j03J20k38Q8K61k04j42L72k36J70jk71K79k37K83q9n8j74Q
5603a56R8J27r4j60R4M1K33j44j15n2K62j45M6j08J5K96k93J59l7k25K55l00R7
5626a06P4k49K18K5j52J32O6o7q5J98K4l15L96j74n4Q6k41K07j23J20o3P9J05
5649A01j58l0l7K42q6L24k49q7n0K9m3Q6l50L72r9M8p6J45l7p9r1j23L13k89J78
$$ plain form
5674 -46 20 -15 -120 -78 -148 80 -101 4 222 -26 196 116 -28 -25 -191 29 55 -37 81 203 -5 59 -95 -197
5698 -197 11 -145 -45 -107 -38 -95 45 -96 177 10 -131 -93 50 -37 -49 54 5 15 -250 -18 13 143 -134
5721 -134 -27 164 -10 42 -124 -44 -86 -107 -85 -79 -19 -80 126 -21 109 6 -154 -58 -52 92 65 -11 -21 13 126
5746 126 86 9 -62 -56 120 -59 10 -78 74 95 133 -94 -136 21 -53 11 45 -104 -67 -103 245 28 -27 -140 -17
5771 -17 140 -12 53 211 45 -144 6 114 -49 35 29 -16 17 -105 -13 -72 48 -19 -77 77 -6 11 91 -67 -7
5796 -7 83 -117 130 79 -9 125 87 -240 55 148 -64 89 61 -139 -88 -179 -65 182 24 76 17 -44 44 -30 -43
5821 -43 121 74 -25 -107 -70 -5 -46 45 -245 98 -8 82 6 174 -162 -14 174 -150 -152 -133 -44 -21 -32 -240 -177 56
5847 56 -15 13 24 -60 -158 -107 194 56 -70 6 -52 23 -55 65 66 3 133 104 110 -207 69 -146 130 -167 4 -89
$$ packed form
5674d6O6l5j05M2p0K28j81J05K18k48K22q0j44Lj66K20K6r2J18J22k08O4j54j02
5698a97K08j56J00o2O9n7J40j41K73j67j41L8J43q7j2J03m9J0k65K32L1J30k77
5721a34J07J91j74N2j66Q0m2k1K2OO0o1K06j47J30j03j60R6OJ44k7p6j0L4J13
5746A26m0p7p1OJ76j79O9q8J52K1L8k27m2J57p4O4L4j49L7l6L48k17n5j13J23
5771a7J57j52O5J58j66j89J50J08j63Q4om5L3j22R2n9J20o7n8J54q3J7Q0j58O0
5796gR0k00K47n1q8J34l8l27K95R3k12J53k8k00N1r1J14K47j58N2n9o1Q8p4j3
5821d3J64m7r9q2L7O5m1R1k90L43j06R0p6J68l36J48J88l24kJ9Q9K3j1k08O3K33
5847E6p1K8J1q4r8N1L01j38j26P6n8P5p8J20Jo3J30k9Ol17K76k15K76k97J71r3
$$ plain form
5873 -89 -107 -39 16 18 87 -181 71 -75 0 69 130 88 7 79 -56 116 48 51 118 104 213 98 104 27 -18 2 121 10
5901 10 61 177 28 66 74 -57 26 -21 -145 -45 -20 12 58 -2 -44 60 -19 -58 182 -58 -38 -66 4 91 -102 -102 -105
5928 -105 -37 -166 -50 19 105 -52 -65 -10 -2 143 67 -134 -160 -29 -49 105 -34 -25 125 -12 243 137 -50 0
5952 0 -67 -169 191 -19 184 81 126 -52 51 -60 -25 -131 -110 -47 -63 -168 135 79 109 -108 -119 -27 -153 117
5976 117 -149 138 -153 -35 -145 -116 -28 -105 -250 -199 -90 -79 -259 68 160 199 17 -150 6 111 37 -107 4
5999 4 2 -33 -44 -108 68 -2 0 -173 75 66 190 2 -16 -183 -27 -6 122 45 75 28 -34 -103 199 95 -89 136
6025 136 91 37 -46 -191 75 42 73 45 -56 -65 -18 -156 235 -57 -47 -131 77 -114 -92 12 -34 -15 27 -84 169
6050 169 -192 -134 172 -212 -13 -164 -62 -145 -75 -91 32 2 -24 240 85 -133 95 -191 -157 -72 -96 -161 -166 61
$$ packed form
5873h9j8O8N5KO9k68K52j46P5O9O1m2q1P2j35J72o8LO7j4J09j15Op7m5K0J19j11
5901A0N1J16j49L8Qj31Q3m7j24J00K5L2M6o0m2J04p9l9K40k40K0k8P0Q7j93%l
5928a05O8j29J16O9Q6j57j3N5QJ45p6k01k6J31k0J54j39RJ50j37K55j06j87N0
5952@o7j02L60k10K03j03M5j78J03j11L5j06K1O3j6j05L03n6L0k17j1R2j26K70
5976A17k66K87k91J18j10K9Q8p7j45N1J09J1j80L27R2L9j82j67J56J05p4j44J11
5999Dkl5j1o4J76p0Kj73K48rJ24j88j8j67J56K1J28p7L0m7o2o9L02j04j84K25
6025A36m5n4q3j45K66l3L1k8j01rM7j38L91k92J0q4K08j91K2J04m6J9M2j11K53
6050A69l61N8L06l84J99j51J02q3P0j6J23l0k6K64j55k18K28k86L4Q5k4o5nK27
$$ plain form
6074 61 -113 -15 201 -244 21 -18 2 -128 -56 -39 56 160 -49 -15 47 -45 100 84 -196 -29 -84 35 -35 -81 -26
6099 -26 38 -5 -96 -97 -52 -30 -53 64 -170 -119 21 107 302 105 74 7 -66 62 -76 46 -47 -148 -67 -78 -73 168
6125 168 -27 -162 -70 10 -61 -1 8 -206 -38 -160 107 -42 65 -46 -67 -312 -123 103 13 197 175 -35 129
6148 129 -45 -249 -101 -143 -86 16 -108 -75 6 -178 -27 -2 135 -292 -54 -180 12 -61 81 135 -68 -132 8
6171 8 75 -15 -9 -33 34 -73 116 14 31 183 -85 -20 124 -121 -53 77 -16 44 -63 17 33 42 155 -3 -202 65
6197 65 53 115 44 47 -141 10 -108 69 -147 -311 252 -117 -11 33 37 118 26 -144 18 64 9 -58 2 -5 -23 99
6223 99 98 -74 25 -13 125 -33 150 146 -97 -120 122 8 -75 52 -74 -3 114 290 41 57 -1 138 9 2 -127
6248 -127 85 121 -94 87 51 -23 -122 -153 140 124 -132 -13 133 -75 132 86 -63 90 21 -122 -308 -28 46
$$ packed form
6074F1j74R8K16m45K65l9K0j30P2J7R5J04k09L4O2r2J45j6k80J67n5J19p0m6N5
6099b6O4m3r1jM5K2k3J17k34N1J40Q6J95j97l1o7p3J28j38J22r3j01Q1j1NK41
6125A68j95j35R2Q0p1O0Rk14J68j22K67j49J07j11k1k45J89K26r0J84k2k10J64
6148A29j74k04J48m2N7J02j24L3Q1j84J51K5J37m27K38j26J92p3J42N4k03o4J40
6171HO7r0Ok4O7j07J89j02J7J52k68O5J44k45O8J30r3O0j07Q0J6RJ13j58j99K67
6197F5j2O2p1Lj88J51j18J77k16j64N63l69J06M4MQ1r2j70J62M6n5o7O0pj8J22
6223I9jj72R9l8J38j58J83mk43k3K42j14q3J27j26P1J17J76k49J6n8J39j29pj29
6248a27K12L6k15J81l6p4r9l1K93j6k56J19J46k08K07m6j49J53o9j43j86K80P4
$$ plain form
6271 46 -12 110 -57 108 -143 88 -39 -123 -31 -102 291 -59 0 138 -154 54 100 35 63 26 221 33 68 -172
6295 -172 143 41 -111 -50 13 -31 123 -67 127 -139 -30 17 85 -8 33 -34 -23 -148 130 97 -109 -189 47 -104
6319 -104 19 12 14 -37 -52 6 -297 -12 176 -183 129 -98 60 -6 6 89 -118 206 29 53 70 -116 63 136
6343 136 5 -106 -19 -208 232 34 -35 19 60 62 -136 40 -88 123 -50 -70 -144 100 291 -66 -125 -61 86
6366 86 -244 29 -183 -70 -8 190 -82 -112 -1 -208 -116 -19 70 304 -58 -97 46 22 -13 20 -118 -97 -164 -140
6390 -140 48 21 67 97 64 246 -149 82 -160 38 -23 -110 -98 21 -79 -261 11 -131 71 74 -20 25 200 123
6414 123 105 -8 -5 183 -47 -14 -1 27 -8 42 145 139 225 45 -66 78 113 -33 -44 -75 97 10 128 64 -51
6439 -51 -207 43 135 -68 -62 -25 -93 -105 8 -118 -66 157 -13 19 130 6 170 -20 -26 -34 -176 157 -52 -22 55
$$ packed form
6271D6n8J22j67J65k51K31j27q4R2p1L93l50N9J38k92K08M6o5K8l7J95j88L5k40
6295a72L15j02j52O1O3m4J54j90J94k66J09M7O8r3M1o7J1j25K78l3k06q0K36j51
6319a04J23pKn1j5N8l03K85J88l59L12k27J58o6J2Q3k07L24j77K4J7j86J79P3
6343A36j31j11Q7j89M40j98o9N4M1Kj98J76j28K11j73k0p4K44J91l57n9O4J47
6366H6l30K73k12J13O2J98k72l0J11k07R2R7Q9K34l62l9J43k4l5L3j38K1o7K4
6390a40J88k7M6L0l3J82l95K31k42J98o1q7J2J19j00j82K72j42K02Lr4M5J75p7
6414A23j8j13LJ88k30L3J3K8l5N0J03oQ6j80j11J44L5j46j1l1J72q7J18o4j15
6439e1j56K50R2k03OL7o8j2J13j26N2K23j70L2J11j24J64j90oqj42L33k09L0P7
$$ plain form
6464 55 42 175 51 -32 -2 52 -142 118 112 117 -64 -123 -111 -111 33 146 136 -119 -16 64 137 -123 -211 124 28 -37
6490 -37 -72 110 -62 169 110 88 108 32 67 30 -111 284 2 -39 100 -150 63 236 -127 12 148 -75 -149
6513 -149 -124 -50 147 176 155 -170 136 50 117 -143 54 52 31 234 -55 96 40 39 -1 150 22 130 -98 -74 6
6538 6 182 54 92 52 -38 204 198 -58 70 -14 10 143 61 191 46 86 62 228 -140 62 -33 -231 -95 -14 127
6563 127 65 -37 -150 -69 71 357 49 82 -102 -63 87 -30 -51 -8 13 -19 126 127 117 237 -87 49 152 67
6587 67 -22 -118 87 85 -158 105 -1 22 -17 -60 82 13 -179 -75 42 85 198 -228 46 -77 38 -69 6 41
6611 41 -18 130 56 -9 -61 40 -12 11 17 94 -32 54 -228 357 36 -48 92 -3 37 55 -179 123 211 -50 -171
6636 -171 19 -28 110 198 60 -106 45 158 29 131 -2 -106 -18 -1 161 80 205 -146 51 -74 -41 209
$$ packed form
6464E5j3J33j24q3L0N4j94K60oNj81n9J2%J44J13j0k55J03Q0P3k60q8L35r6o5
6490c7l5J82j72K31n9k2K0p6L5l7j41L95k82m1J39k50K13J73l63J39J36k23p4
6513a49K5P4J97K9k1l25L06q6O7k60J97kk1K03k89J51n6jm0J51j28J08k28K4Q0
6538FJ76j28L8m0r0K42ok56J28q4K4J33q2J30j45M0k4J66l68K02r5j98J36Q1J41
6563A27o2j02j13Q1J40K86l08L3j84L9J50j17k1M3K1l2J45Jj0J20l24J36J03q5
6587F7q9r6K05kk43K63j06K3l9m3J42o9j92J04J17M3J13m26K74j23J15j07P5L5
6611D1n9J48p4o5n2J01n2K3OP7j26Q6k82N85l21q4J40r5M0J8k34L02Q8k61j21
6636a71J90m7J38Q8j38j66J51J13j29J02j33j04Q8J7J62q1J25l51J97j25L3K50
$$ plain form
6658 209 -40 -15 -13 53 106 77 0 41 132 -83 -308 229 -13 131 115 -46 83 119 97 50 -106 238 -42 226
6682 226 94 5 193 120 258 66 153 24 22 -59 8 251 36 142 -116 -5 -91 -34 -98 13 -13 63 108 133 90
6707 90 -64 -145 -55 159 51 251 -103 -62 -95 -147 10 73 -37 136 88 128 -117 -134 -99 7 10 -139 -4 -12 33
6732 33 82 -67 109 -41 -4 206 78 36 14 145 55 66 104 -42 31 18 -71 146 -32 -32 99 -19 3 -29 -27 -118
6758 -118 156 136 249 63 -112 92 102 89 -163 132 119 261 26 136 9 -84 7 -136 -68 223 -14 -45 12
6781 12 80 -42 25 -112 228 136 50 124 62 91 127 68 107 24 64 -63 110 -77 50 43 -59 -161 -156 16 162 -170
6807 -170 90 159 -32 -72 -173 60 251 73 109 32 90 38 111 62 112 227 84 -227 24 184 -169 67 -89
6830 -89 -47 35 -134 -92 -87 144 -1 -61 80 132 -69 31 207 29 -117 139 -155 46 44 190 -292 48 88 -182
$$ packed form
6658B09k49K5KO6N3k9p7M1R1k15k25N37k42J44j6j61J29L6k2m7j56L44k80K68
6682B26j32q9J88p3J38j92Q7j29kq1O7K43k15J06k58J11q6N7o4J11k6P6M5K5m3
6707I0j54q1R0K14j08K00l54M1l3n2J57O3j10J73m8M0k45j7L5J06Lj49J35qM5
6732C3M9j49J76j50L7K10j28m2k2J31r0J1L8j46P3j3q9K17j78%J31j18K2l2Kr1
6758a18K74k0J13j86j75K04J0j3k52K95j3J42k35J10j27r3R1j43O8K91k37l1N7
6781A2O8j22O7j37L40r2q6P4o2K9L6n9L9q3M0j27J73j87J27pj02j02NJ72J46l32
6807a70K60O9j91m0j01K33J91j78L6p7N8n2P3m9N0J15j43l11K51J60l53K36j56
6830h9M2Q2j69M2NK31j45o0J41N2k01J00J76j78j46K56k94K01kJ46m82L40M0k70
$$ plain form
6854 -182 -81 1 62 191 84 74 -162 -382 47 -53 204 -95 110 -24 58 -64 -10 45 -57 124 177 -136
6876 -136 137 98 -102 39 183 -119 -205 209 77 -11 66 74 129 -25 71 114 -71 -127 83 60 -106 116 -203 -9
6900 -9 -72 81 27 141 199 86 75 34 95 -109 -68 -116 -135 -25 -82 136 -55 -53 249 -89 -159 71 -114 -106 73 36
6926 36 -5 -22 28 -270 3 -78 -148 -55 -49 139 -166 -108 140 127 102 -76 111 98 192 -88 -139 -206 42 71 55 14
6952 14 76 103 187 -30 52 -38 88 176 144 -73 138 -6 -12 93 84 -29 44 82 -71 26 -30 -305 -143 37 37 23
6978 23 144 -38 -177 20 139 -89 -91 -235 -86 140 56 9 -69 57 7 35 -119 -8 -204 -203 110 18 -32 -76
7002 -76 -175 20 -38 65 179 -47 106 212 -98 -190 -73 57 -98 -99 187 -57 160 36 -10 -126 -143 28 -248
7025 -248 -107 -3 -5 -75 24 103 -57 100 45 46 34 -126 8 -169 -212 -11 -184 49 -2 28 -7 -128 -104 -19 -13 61
$$ packed form
6854a82J01Q2O1J29j07j0k36k20M29j00K57k99K05j34Q2j22N4N5j02J81N3l13
6876a36K73l9k00J41J44l02q6M14j32q8P7QN5j54R6M3j85n6K10k3j66K22l19J94
6900io3J53n4J14N8j13j1m1O1k04M1m8j9J10n7K18j91KL02l38p0K30j85QJ79l7
6926C6m1j7N0k98K73q1p0R3OJ88l05N8K48j3k5j78J87j3R4k80n1o7K48K9j6m1
6952A4O2K7Q4k17Q2r0J26Q8l2k17K11j44oJ05rj13P3L8j53R7n6k75J62J80%j4
6978B3J21j82j39J97J19k28kj44J49K26q4m7p8J26n0K8j54J11j96JL13r2n0m4
7002g6r9J95n8J03J14k26J53J06l10r2J17J30j55jK86k44K17j24m6j16j7J71k76
7025b48J41J04kp0R9P9j60J57n5Jj2j60J34j77m3K01j73K33n1L0l5j21K4Q5OP4
$$ plain form
7051 61 -48 -250 41 -89 -246 4 94 13 -49 -83 -369 -114 -24 -127 9 -73 -119 -43 178 164 -223 -77 279
7074 279 146 -138 -138 -148 83 -28 72 -30 -63 -31 -58 96 128 -135 61 50 295 -139 260 -31 -245 73 111
7097 111 249 4 -160 -57 11 270 -19 187 -30 25 -92 15 150 193 215 59 -76 97 155 0 -56 -25
7119 -25 -167 -88 153 2 2 25 23 -328 36 -70 97 -140 299 -242 -33 -152 -262 31 41 99 10 73 -57 -35
7143 -35 31 -8 -117 276 -153 -160 -43 -34 85 129 27 68 87 111 120 106 -119 -55 -55 -164 33 -29 -193 -228 120 35 -190
7170 -190 211 -30 -87 132 125 -171 195 -132 205 224 39 -102 11 3 -82 126 15 39 -51 -194 1 -63 57
7193 57 -18 77 52 -343 16 -100 190 -43 40 -6 81 87 94 -35 48 -97 189 -94 -39 15 103 -166 12 21 -123 99
7219 99 -118 -46 -82 48 26 -80 -171 -18 66 38 -321 -20 -1 34 -178 46 24 -82 221 -22 -96 165 -32 26
$$ packed form
7051F1j09k02K91j30j57K50R0q1o2l4k86K55R0j03J36q2m6P6K21j4l87J46L56
7074B79j33k84%j0K31j11J00j02l3L2k7J54L2k63J96j1K45m34L99k91k14L18L8
7097A11J38k45j64J03O8K59k89K06k17N5j17J07J35M3K2j56j35J73N8j55n6L1
7119b5j42P9K41j51%K3kl51L64j06J67k37M39n41K09j19j10K93J0N8q9O3j30K2
7143c5O6l9j09L93m29pJ17RJ19M4j02M1J9K4Rj4k25O4%j09J97o2j64l5L48q5k25
7170a90M01k41n7K19pk96L66l27L37J9j85j41J13qq5K08j11K4r0j43J95o4J20
7193E7p5R5k5l95L59j16K90k33Q3m6Q7OPj29Q3j45K86k83N5N4Q8k69J78Rj44K22
7219I9k17P2l6J30k2j06r1J53Q4k8l59L01J9L5k12K24k2j06L03k43p4K61j97N8
$$ plain form
7243 26 -55 -56 -38 -43 -41 178 101 -44 17 -92 20 -186 14 -30 -84 93 -38 -68 -192 22 20 68 -83 13 172 -152
7269 -152 64 28 81 -55 -115 2 161 143 -17 -73 36 -58 -59 41 -203 113 41 -176 264 75 59 -91 3 -46
7293 -46 55 82 32 91 75 -114 171 173 150 220 -287 -36 167 161 -30 96 46 -92 -119 76 -113 155 93 -282 23
7318 23 135 -75 17 -64 -104 -46 -130 -210 -76 -172 -67 258 -8 -21 -190 56 27 47 -59 40 49 -166 101 -109 12
7343 12 -116 -83 62 6 111 -5 -55 35 190 -112 -130 25 -55 43 285 264 -49 89 -46 88 -14 6 141
7366 141 -24 140 -37 -99 -107 -54 127 -21 -3 -145 48 -109 63 132 160 22 -100 168 94 -31 -290 25 -89
7389 -89 -8 65 -5 -57 151 -141 98 100 -11 -100 -80 116 156 -108 19 32 150 219 -31 -63 -328 28 -36 -14 11
7414 11 66 2 -153 46 -199 -126 -64 20 76 -89 -70 321 190 -165 -32 91 -211 24 54 -77 -36 47 -52 -41
$$ packed form
7243B6q1jJ8nKK19p7j45O1j09J12k06K00m4n4J77j31l0j24K14kM8j51R6J59l24
7269a52K16l6N3j36o0J17J59j8j60n6J09r4jJ00k44L16p2k17M40j89j6j50R4m9
7293d6J01K7n0N9j6j89K85Kk3P0n07K51K03oj91J26n0j38k7J95j89K68o2l75L05
7318B3J12k10R2q1m0N8q4q0J34r6J05L25k66j3j69K46k9K0j06R9Rk15K67k10J21
7343A2j28L3J45n6J05j16n0R0J55l02j8J55q0R8K42k1l13J38j35J34j02K0J35
7366A41j65J64j77o2qN3J81j48J8j42J93j57J72O9K8j38j22K68p4j25k59L15j14
7389h9Q1P3p0n2K08k92K39Kj11q9K0J96M0k64J27J3J18O9k50l2k65L56o4K2K5
7414A1N5o4j55J99k45P3O2Q4N6j65J9L91j31l55J33J23l02K35L0j31M1Q3r9J1
$$ plain form
7438 -41 -117 6 32 -114 38 63 126 148 -54 36 8 42 -73 93 102 84 206 -24 145 -88 -26 194 -75 3 9
7463 9 -25 -98 -184 244 -61 173 10 -197 185 -18 2 108 170 -110 8 149 253 -80 -33 6 -1 -45 85 12
7487 12 170 -51 -112 116 72 -36 47 -1 -38 -198 139 164 46 138 -76 37 -142 -6 -51 23 -30 -48 148 31
7511 31 128 -14 -14 66 128 21 -66 -45 -8 97 -164 -23 31 145 -111 58 129 -1 -19 100 -132 -12 -77 76
7535 76 72 -12 53 230 147 -96 -98 -38 -90 218 -95 -168 -253 -140 34 61 58 -198 -72 -107 -60 114 17 126 103 104 -94
7562 -94 -39 -30 -104 -150 -146 -88 -170 160 31 59 4 32 176 -92 18 149 -21 -41 -23 10 -6 135 133 -46 53 140 173
7589 173 -76 -145 -198 -23 -97 -84 145 4 -83 122 -245 -65 -30 105 67 -135 -127 -40 299 -168 -59 -37 -177 -171
7613 -171 -6 161 -129 75 84 -79 124 121 -103 -119 26 -300 -8 -92 42 271 -152 143 193 78 79 147 -186
$$ packed form
7438d1p6J23K6j46J52K5O3K2k02R0k8L4j15J66Rj8J22k30J69k33O2K20k69P8O
7463Il4p3q6M28l05K34j63k07L82k03K0J06O2k80J18J41J04l33M7L9pm4J30p3
7487A2J58k21o1K28m4j08Q3m8l7j60L37K5j18R2k14J13j79J36m5P4n3j8J96j17
7511C1R7j42%Q0O2j07q7K1L7J05k61J41N4J14k56J69P1j30j8J19k32J20o5J53
7535G6mq4O5J77q3k43kO0n2L08l13p3q5J13J74K7lk56J26l5M7J74r7J09k3Jj98
7562i4N5Rp4m6MN8q2L30j29K8n5K8J44k68J10J31j70k0J8L3j6J41kj79R9Q7L3
7589A73k49o9n3J75p4J3K29j41q7K05l67J80L5J35l8k02QQ7L39m67J09K2j40O
7613a71J65J67k90K04Rj63K03lk24j6J45l26K92q4J34K29m23K95N0j15JO8l33
$$ plain form
7636 -186 57 71 -109 84 -21 -11 53 -172 305 81 -242 -86 76 -108 1 132 -35 49 57 87 22 146 -90
7659 -90 -48 -88 -31 42 19 59 112 -159 235 73 -148 31 206 109 -43 40 -38 -13 -183 170 179 -112 241 46 34
7684 34 -172 34 98 115 105 114 51 -201 -13 -25 94 -13 -95 -80 -10 -304 -16 -195 -250 -158 -116 -30 -19 75 36 206
7710 206 106 -89 3 256 -106 31 243 38 -235 40 56 -156 -377 50 -27 -58 -69 163 116 176 187 -39 -53
7733 -53 -261 -137 147 32 -29 -154 -60 -38 15 -8 -168 -234 15 -27 128 -80 -129 -112 27 -12 -72 -100 -52 106 -50
7758 -50 -62 78 39 114 95 -25 -42 -93 186 100 -3 266 115 20 -31 19 -25 13 -36 -23 42 147 123 145 -21 2
7784 2 47 56 -13 -73 -94 85 -160 97 -13 255 -4 -92 137 139 -94 69 -95 48 -81 -51 -198 -81 -273 62
7808 62 109 -75 -110 56 20 11 31 80 -82 -41 -88 -85 -108 -72 47 146 134 -70 130 7 48 -91 290 45 120 57
$$ packed form
7636a86K43J4j80J93j05J0O4k25M77k24l23J56J62j84J09J31j67Q4QL0o5J24k36
7659i0M2m0N7P3k3M0N3k71L94j62k21J79J75r7j52Q3p8K5j70L53Rk91L53j95j2
7684C4k06K06O4J7j0Ro3k52J88j2J19j07q2J5P0k94K88j79n5R2M2Q6J1R4l9J70
7710B06j00j95R2K53l62J37K12k05k73K75J6k12k21M27p7l1j1K32m7O0J1k26j4
7733e3k08J24K84j15o1j25R4K2N3k3j60o6K49m2J55k08m9J7J39l9o0k8M8J58j56
7758e0j2J40l9P5j9j20j7n1K79q6j03K69j51r5n1N0m4L8m9J3O5J05k4K2j66K3
7784BM5Ro9o0k1J79k45K57j10K68k59q8K29Kk33J63j64J43j29L0j47J17j92L35
7808F2M7j84l5J66l6rK0M9j62M1m7Lk3L6J19R9j2k04K00j23M1j39L81k45P5o3
$$ plain form
7834 57 345 115 152 82 130 101 80 27 164 -9 -110 137 23 100 25 124 -94 -195 -65 6 168 114 -40 122
7858 122 -176 -55 -35 -42 96 93 -51 -7 60 25 28 -163 65 -113 -333 165 160 94 44 -96 111 -83 7 6 -77 -106
7884 -106 -66 17 -98 217 74 150 -33 80 67 116 -122 195 -32 44 46 27 -192 246 101 79 -112 -146 16 -63
7908 -63 -244 -161 53 -17 -39 35 75 175 -12 72 -211 2 43 -69 60 -227 21 -37 -225 -57 294 -116 136
7931 136 103 37 -70 78 -69 7 56 -50 83 118 134 -19 31 84 76 89 4 -88 -110 -185 -127 62 135 272 84 0
7957 0 -5 8 155 71 -85 -88 -21 -104 27 -12 -27 -35 -161 69 -63 15 -19 -71 -37 -90 225 70 27 -310 -42 -53 81
7984 81 -72 378 125 154 -38 3 177 57 37 108 -137 115 8 -147 56 17 -69 -1 -144 150 -59 -4 -192
8007 -192 -221 -48 65 -187 -159 -49 107 112 -80 -87 91 -57 -87 -148 48 35 -136 -131 -101 16 -11 87 54 -274 165
$$ packed form
7834E7K88k30L7p0M8k9k1n3J37j73j01K47j14P7p5R9k18j01J30P1J62n4j54J62
7858A22k98J21K0pJ38lj44M4O7l5Lj91K28j78k20M98no6n0j40K07j94R0jq3k9
7884a06M0Q3j15L15j43P6j83J13j3M9k38L17k27P6Kj9k19M38j45k2j91l4J62p9
7908f3j81Q3K14p0k2P4M0J00j87Q4k83K13M1j12J29k87K48n8j88J68L51m10K52
7931A36l3o6j07J48j47P6M9j06J33L5J6j53N0N3qJ3q5r2k2p5N8J89P3J37j88q4
7957@nJ3J47q4j56lO7q3J31l9j5qj26K30j32P8l4n2L4n3L15j55m3l37K68j1J34
7984H1j53M50k53K9j92M1J74j20k0P1k45K52j07j55K03l9q6O8j43K94k09N5j88
8007a92k9J73J13k52K8J10J56Nj92pJ78j48l0o1J96j3j71NL0J17k7R8l3l28M39
$$ plain form
8032 165 -46 -117 -144 -3 -99 -209 261 257 22 -193 16 11 -83 -54 104 -101 213 10 -50 -52 -55 -153 -16 -8 38 8
8058 8 28 -103 -97 -44 -61 6 143 125 73 -98 145 133 48 146 234 -79 6 66 -53 -30 -75 -122 -39 -46 -110 -24 52 -129
8086 -129 34 100 -219 -59 42 -75 51 34 167 -61 26 43 195 143 27 109 80 -29 -89 26 -70 -65 25 47
8110 47 126 -77 9 -122 170 -16 -75 161 -131 19 -32 -232 6 66 107 -11 45 5 41 1 -250 -103 -1 -52
8134 -52 44 0 -35 -54 42 -66 220 65 100 178 51 9 -54 -152 87 364 -94 -248 147 -106 71 -51 -37 -29 -210
8159 -210 92 -49 -51 90 -97 -98 165 16 104 -49 -28 232 -240 -11 -127 121 -128 -75 -34 -7 -18 -49 -158 66
8183 66 63 -67 -58 63 -180 -19 19 185
$$ packed form
8032A65k11p1k7J41r6j10M70mk35k15K09nr4K9J58k05L14k03o0klr8J37QM6l0
8058HK0j31ON3j7O7J37j8n2j71K43j2q5R8Q8l13Q5O0j19K3m5m7Q3po4Q6P6j81
8086a29J63O6l19J60J01j17J26j7J33k28Q7J7J52n2j16Q2k9j09o0J15r6NR0K2
8110D7P9k03Q6j31K92j86n9K36k92J50n1k00K38O0M1j18N6m0L6m0k51J47J02n1
8134e2R6m4l5j9R6j08K86j55L5P8j27m2o3r8K39K77m58j54L95k53J77j22J4Qj81
8159b10L02j41kJ41j87jK63j49Q8j53K1K60m72K29j16K48k49N3M1K7j1l1j09K24
8183F6lj30RJ21k43J61L8J66
8191A85
$$ Imaginary data points
##PAGE= N=2
##DATA TABLE= (X++(I..I)), XYDATA
$$ plain form
0 0 0 0 0 0 0 0 0 0 0 -8 8 -8 8 -16 16 -24 30 -38 41 -54 64 -74 89 -105 122 -145 169 -194 224 -256 295 -335
32 -335 381 -432 488 -548 616 -691 771 -861 957 -1063 1181 -1307 1445 -1597 1762 -1943
48 -1943 2140 -2358 2599 -2864 3156 -3481 3847 -4259 4731 -5268 5896 -6632 7522 -8609
62 -8609 9982 -11775 14225 -17794 23496 -34091 60544 -275452 -324006 84602 -146307 -115894
74 -115894 103355 102607 -102469 -27046 82854 149703 253362 280494 90708 64743 115457
85 115457 -57243 -166367 54537 77003 -159189 -145132 33296 -76821 -189059 -43215
95 -43215 -7731 -145067 -48528 85009 -34303 -31478 194503 161713 -40699 5709 119493
106 119493 54404 44491 116670 47241 -24699 19117 -91332 -246525 -93925 59856 -83506
$$ packed form
0@%%%%%%%%%qJ6j6J6k4L2m0N4o8P9r5J18j38J63j94K27k67L14l63M18m80N51o30
32c35P16q13R20j036J164j307J462j632J818k020K244k488K752l042L359l705
48a943M083m498M957n463O020o637P328q106Q990r999J1164j2528J4154j6131
62h609J8591k1757K6000l2019M1290n7587R4635l35996m8554M08608k30909L0413
74a15894K19249p48k05076P5423J09900O6849J03659K7132j89786k5965N0714
85A15457j72700j09124K20904K2466k36192J4057J78428j10117j12238J45844
95d3215L5484j37336R6539J33537j19312K825K25981l2790k02412M6408J13784
106A19493o5089r913P2179o9429p1940M3816j10449j55193J52600J53781j43362
$$ plain form
117 -83506 -101969 104343 65219 -131029 -49664 101566 23703 -6927 113472 91912 6043
128 6043 40986 -25102 -155526 -37059 103176 -16390 -57197 120889 112696 -93561 -106245
139 -106245 1183 -22788 -13375 76976 25794 -42244 17581 -38161 -166846 -44759 131720
150 131720 49086 -22726 106545 101010 -86964 -88893 38123 14169 -13829 48156 11677 -45033
162 -45033 12736 -8205 -111820 -35194 103049 27732 -59377 47671 81911 -43707 -53495
173 -53495 11076 -31959 -25886 60814 24359 -33639 45135 50334 -88610 -82087 58720 36234
185 36234 -50905 25092 72195 -27038 -60859 -21440 -30437 4357 77735 39217 -10356 60713
197 60713 61013 -81155 -88238 49977 35279 -63271 -15353 36010 -33255 -63890 -32336 -33317 -5672
$$ packed form
117h3506j8463K06312l9124j96248Q1365J51230p7863l0630J20399k1560q5869
128F043L4943o6088j30424J18467J40235j19566m0807J78086q193k06257j2684
139a06245J07428k3971R413R0351n1182o8038N9825n5742j28685J22087J76479
150A31720q2634p1812J29271n535j87974j929J27016k3954k7998O1985l6479n6710
162d5033N7769k0941j03615P6626J38243p5317q7109J07048L4240j25618r788
173e3495O4571m3035O073Q6700l6455n7998P8774N199j38944O523J40807k2486
185C6234q7139P5997M7103r9233l3821L9419q997L4794P3378l8518m9573P1069
197F0713L00j42168p083J38215j4698r8550M7918N1363o9265l0635L1554r81K7645
$$ plain form
210 -5672 61131 42198 -2094 59738 83519 -29054 -55469 45717 40264 -32591 1315 37848
222 37848 -14720 -44767 -38510 -65170 -52820 23472 22254 -30340 20489 65879 -24319 -69008
234 -69008 16079 54107 22773 37015 57129 25259 260 -13942 -53323 -38913 38237 25187
246 25187 -50626 -20103 27052 -43936 -90327 -17262 36980 15367 9751 29474 24409 17201 12782
259 12782 -16806 -8341 50749 36200 -29363 -7575 36090 -11464 -62759 -32337 3711 -7718
271 -7718 -10829 4835 5015 9578 9510 -28787 -31757 30646 43941 -1079 4498 42528 18701 -35121
285 -35121 -33361 2684 11699 5949 -307 -7945 2732 1781 -38124 -41275 15356 33767 -3620 -10253
299 -10253 25570 26448 -14525 -24006 3916 19121 15007 1627 -4186 13324 12089 -26755 -40487
$$ packed form
210e672O6803j8933m4292O1832K3781j12573k6415J01186n453p2855L3906L6533
222C7848n2568l0047O257k6660J2350P6292j218n2594N0829M5390r0198m4689
234f9008Q5087L8028l1334J4242K0114l1870k4999j4202l9381J4410P7150j3050
246B5187p5813L0523M7155p0988m6391P3065N4242k1613n616J9723n065p208m419
259A2782k9588Q465N9090j4549o5563K1788M3665m7554n1295L0422L6048j1429
271g718l111J5664J80M563o8l8297k970O2403J3295m5020N577L8030k3827n3822
285c5121J760L6045R015n750o256p638J0677r51l9905l151N6631J8411l7387o633
299a0253L5823Q78m0973r481K7922J5205m114j3380n813J7510j235l8844j3732
$$ plain form
312 -40487 -5015 18726 -1427 -15951 8789 22604 -6062 -28410 -14168 14702 25400 8632
324 8632 -407 18315 19690 -12330 -31450 -9464 20905 12069 -14474 -7777 12381 -113 -29621
337 -29621 -28703 7739 24991 1845 -7938 11881 18293 -1189 -19942 -9218 19763 21100 -6140
350 -6140 -13386 8765 13224 -19567 -31698 5361 23999 -889 -10233 6662 14176 4728 -10737
363 -10737 -13136 5857 18021 -2671 -23158 -1906 19700 -10287 -33688 -2104 18413 381
375 381 -5240 7941 15654 15367 4192 -10907 -3224 22846 14363 -20137 -6544 24781 -4357 -39078
389 -39078 -16068 7252 -4427 -11773 -5617 -2790 3370 4252 -14165 -11669 30223 34396 -9104 -934
403 -934 40007 18573 -19618 -3880 16484 899 -13236 -14667 -20995 -14678 -2729 -25268 -34739
$$ packed form
312d0487L5472K3741k0153j4524K4740J3815k8666k2348J4242K8870J0698j6768
324H632r039J8722J375l2020j9120K1986L0369q836k6543O697K0158j2494k9508
337b9621R18L6442J7252k3146r783J9819O412j9482j8753J0724K8981J337k7240
350f140p246K2151M459l2791j2131L7059J8638k4888r344J6895P514r448j5465
363a0737k399J8993J2164k0692k0487K1252K1606k9987k3401L1584K0517j8032
375C81n621J3181P713k87j1175j5099P683K6070q483l4500J3593L1325k9138l4721
389c9078K3010K3320j1679p346O156K827O160Q82j8417K496M1892M173m3500Q170
403i34M0941k1434l8191J5738K0364j5585j4135j431o328O317J1949k2539r471
$$ plain form
416 -34739 12653 26624 -17999 -12090 38032 30016 -6002 6061 26538 11737 668 1806 -13206
429 -13206 -8828 13168 -12460 -38132 2758 23108 -21134 -27428 18533 18900 -14685 -5974 12413
442 12413 -1173 -1277 8265 -11457 -6966 28033 6850 -29947 4617 34085 -7579 -26997 13761
455 13761 19899 -13200 -8101 6984 -6830 1462 15016 -14151 -14793 28449 13770 -32772 -8292
468 -8292 27968 -9640 -38340 -1214 10311 -17248 -5361 11680 -3543 10385 29947 -447
480 -447 -5891 40606 33401 -20606 -9105 28815 -6854 -44288 -15004 -2832 -24736 -12098 -2356
493 -2356 -22002 -4348 24532 -4129 -18709 31288 41489 -9255 -4787 37549 12019 -21825
505 -21825 5183 13687 -9586 1528 7680 -19152 -10484 14923 -18377 -44506 4760 24564 -27086
$$ packed form
416c4739M7392J3971m4623N909N0122q016l6018J2063K0477j4801j1069J138j5012
429a3206M378K1996k5628k5672M0890K0350m4242o294M5961L67l3585Q711J8387
442A2413j3586j04R542j9722M491L4999k1183l6797L4564K9468m1664j9418M0758
455A3761O138l3099N099J5085j3814Q292J3554k9167o42M3242j4679m6542K4480
468h292L6260l7608k8700L7126J1525k7559J1887J7041j5223J3928J9562l0394
480d47n444M6497p205n4007J1501L7920l5669l7434K9284J2172k1904J2638R742
493b356j9646J7654K8880k8661j4580M9997J0201n0744M468M2336k5530l3844
505b1825K7008Q504k3273J1114O152k6832Q668K5407l3300k6129M9266J9804n1650
$$ plain form
518 -27086 -27182 22634 10389 -18291 5765 16616 4247 23798 30373 -6206 -4280 29780 1683
531 1683 -38840 -388 25411 -20440 -27362 13203 230 -26621 -4243 5547 -10162 5778 17214
544 17214 -14925 -13519 26659 3574 -38830 1973 40047 1678 -11590 24012 19840 -3984
556 -3984 7203 6228 -14872 3991 21144 -19979 -34930 6216 -4799 -46616 -16184 21495 -4448
569 -4448 -12839 20841 17840 -4856 10866 17629 -2319 15297 34794 -6655 -21849 22364 12550
582 12550 -39061 -21570 17335 -3404 -22618 -1354 -3397 -19292 -277 2583 -23163 404
594 404 37044 7675 -12068 26280 27333 -14010 -4383 27155 6684 -12841 6196 -267 -24888
607 -24888 -11619 -8273 -32895 -10459 25546 -2115 -25080 15332 29839 -8072 -9147 23364
$$ packed form
518b7086r6M9816j2245k8680K4056J0851j2369J9551O575l6579J926L4060k8097
531A683m0523L8452K5799m5851o922M0565j2973k6851K2378R790j5709J5940J1436
544A7214l2139J406M0178k3085m2404M0803L8074l8369j3268L5602m172k3824
556c984J1187r75k1100J8863J7153m1123j4951M1146j1015m1817L0432L7679k5943
569d448q391L3680l001k2696J5722O763j9948J7616J9497m1449j5194M4213r814
582A2550n1611J7491L8905k0739j9214K1264k043j5895J9015K860k5746K3567
594D04L6640k9369j9743L8348J053m1343R627L1538k0471j9525J9037o463k4621
607b4888J3269L346k4622K2436L6005k7661k2965M0412J4507l7911j075L2511
$$ plain form
619 23364 16425 1548 13866 2554 -16943 2764 4653 -29725 -18338 19982 1593 -25273
631 -25273 3822 18518 -15526 -16550 15340 9333 -2021 16330 11215 -7673 8570 10811 -20973
644 -20973 -12366 25776 9471 -25372 -5416 13032 -15556 -22563 1441 -1001 -3392 15622 6766
657 6766 -11928 8693 20934 -8590 -10956 24558 17704 -15079 -1956 14443 -11090 -20284 -2348
670 -2348 -6183 -8828 7257 1308 -14827 3332 15769 -12823 -17629 21027 22568 -7586 1285
683 1285 17188 -1041 -8870 2323 -3109 -4830 12382 5769 -17793 -5875 11155 -13407 -23902
696 -23902 8208 14033 -9365 -3001 11541 -257 -4954 4842 346 -1134 16693 12564 -11495
709 -11495 -2373 16636 -6638 -23286 2165 11893 -6840 -6738 3739 -3277 -6581 -19 -5556 -6759
$$ packed form
619B3364o939j4877J2318j1312j9497J9707J889l4378J1387L8320j8389k6866
631b5273K9095J4696l4044j024L1890o007j1354J8351n115j8888J6243K241l1784
644b0973Q607L8142j6305l4843J9956J8448k8588p007K4004k442k391J9014q856
657F766j8694K0621J2241k9524k366L5514o854l2783J3123J6399k5533r194J7936
670b348l835k645J6085n949j6135J8159J2437k8592m806L8656J541l0154Q871
683A285J5903j8229p829J1193n432j721J7212o613k3562J1918J7030k4562j0495
696b3902L2110N825k3398O364J4542j1798m697R796m496j480J7827m129k4059
709a1495R122J9009k3274j6648K5451R728j8733J02J0477p016l304O562n537j203
$$ plain form
723 -6759 13642 14477 -8916 -2571 17413 111 -16343 2345 13667 399 -2755 3980 -2315
736 -2315 -5708 -448 -7716 -11436 8686 11961 -10150 -6940 12692 2101 -13832 -1399 11273
749 11273 4099 930 4666 -877 -2284 4168 -5822 -12657 6524 12450 -7605 -8867 8230 3540
763 3540 -12188 -6501 6454 4468 2381 4250 -1152 -509 5562 -4945 -11645 5424 13524 -2796
777 -2796 -8316 4468 4460 -9265 -7805 2938 3384 2986 2692 -4301 -1862 5536 -2135 -10013 2414 12378
793 12378 860 -7767 2032 6728 -3320 -6046 -436 2316 4264 2076 -4556 -1009 5595 -1213
807 -1213 -10867 -2565 8918 2438 -6747 432 5613 -1349 -5850 -3416 1248 6112 4064 -1963 70
822 70 5737 1380 -7484 -3754 7184 5205 -3626 -2243 1568 -520 -5109 -6928 -2223 4905 3813
$$ packed form
723f759K0401Q35k3393O345J9984j7302j6454J8688J1322j3268l154O735o295
736b315l393N260p268l720K0122L275k2111L210J9632j0591j5933J2433J2672
749A1273p174l169L736n543j407O452r990o835J9181N926k0055j262J7097m690
763C540j5728N687J2955j986k087J869n402O43O071j0507o700J7069Q100j6320
777b796n520J2784qj3725J460J0743M46l98k94o993K439P398p671p878J2427R964
793A2378j1518q627R799M696j0048k726N610K752J948k188o632L547O604o808
807a213r654Q302J1483o480r185P179N181o962m501K434M664M864k048o027K033
822G0N667m357q864L730J0938j979q831J383L811k088m589j819M705P128j092
$$ plain form
837 3813 -2344 -2351 3529 3472 -4751 -4684 5706 8179 1086 -2908 503 3848 -1069 -6971 -2263 5514 4215
854 4215 -2819 -4395 1139 3107 -3852 -6764 543 5877 1231 -5775 -2191 5535 1288 -6452 -2517
869 -2517 4861 4470 -671 -2175 3624 5908 532 -4681 -1894 5482 4446 -4511 -3223 5181 626
884 626 -8779 -7160 -204 1170 -2149 -2955 -650 1603 1598 -2818 -3137 7331 11152 1675 185 8103
900 8103 5773 -3036 -4065 796 1200 -2391 -4504 -7326 -5776 -1271 -6136 -11144 223 8188 -644
915 -644 -3706 6418 9825 2215 895 6390 6756 4765 3138 -2500 -2422 3760 -2944 -13147 -5345 3277
931 3277 -5592 -11570 -1904 3488 -2830 -3601 2113 2891 4967 8020 2207 1988 10810 6052 -6663 -2520
947 -2520 7355 -53 -8898 -2219 1773 -5853 -7119 -3064 -4750 -787 5306 -1342 -3484 7430 7403
$$ packed form
837C813o157pN880n7q223O7J0390K473p093l994L411L345m917n902M708P777j299
854D215p034j576N534J968o959k912P307N334m646p006L584P726m247p740L935
869b517P378l91n141j504N799K284n376n213K787P376j036q957J288Q404m555
884F26r405J619O956J374l319q06K305K253nm416l19J0468L821r477j490P918
900H103k330q809j029M861M04l591k113k822J550M505m865n008J1367P965q832
915f44l062J0124L407p610j320N495L66j991j627n638P8O182o704j0203P802Q622
931C277q869n978R666N392o318p71N714P78K076L053n813k19Q822m758j2715M143
947b520R875p408q845O679L992p626j266M055j686L963O093o648k142J0914k7
$$ plain form
962 7403 -5281 -3103 9833 5659 -4947 488 4807 -2200 -2261 -369 -4707 -922 5584 -2372 -7960
977 -7960 3786 7379 -6376 -7128 6866 4422 -5600 -214 4261 -1378 -273 1461 -4561 -1636
991 -1636 6881 139 -7839 3381 9748 -4707 -7943 6307 5189 -4263 363 3746 -1730 -157
1005 -157 1863 -5971 -4940 5866 1561 -9689 -838 8746 -3523 -7947 4505 5006 -2659 1949
1019 1949 4554 -870 1327 4789 -3631 -5341 6932 3594 -10113 -2633 8710 -2734 -9127 1378
1033 1378 2959 -2930 265 2632 -2784 1185 7095 -3133 -7187 6816 6815 -7787 -2127 8776 46
1048 46 -7128 1319 2557 -3719 -24 3353 -3538 -1208 6407 -3311 -8872 5399 7421 -7303 -3896
1063 -3896 7730 2002 -6004 244 2486 -2605 1583 4222 -4919 -2013 8377 -666 -9563 2957
$$ packed form
962G403j2684K178J2936m174j0606N435M319p007o1J892m338L785O506p956n588
977g960J1746L593j3755p52J3994k444j0022N386M475n639J105J734o022K925
991a636Q517o742p978J1220O367j4455l236J4250j118r452M626L383n476J573
1005a57K020p834J031J0806m305j1250Q851R584j2269m424J2452N01p665M608
1019A949K605n424K197L462q420j710J2273l338j3707P480J1343j1444o393J0505
1033A378J581n889L195K367n416L969N910j0228m054J4003jj4602N660J0903q730
1048D6p174Q447J238o276L695L377o891K330P615r718n561J4271K022j4724L407
1063c896J1626n728q006O248K242n091M188K639r141K906J0390r043q897J2520
$$ plain form
1077 2957 7722 -4657 -4553 6197 1858 -5607 -155 1915 -4073 1005 4329 -4667 -2571 8040
1091 8040 77 -9486 2419 9202 -2619 -5635 4876 2880 -4460 635 951 -5020 2020 5686
1105 5686 -5642 -5317 7312 2720 -8174 -358 7975 -1537 -4924 4468 2842 -3863 1353 1660 -4717
1120 -4717 1063 5165 -4648 -4958 6989 3502 -8929 -2555 7608 -290 -5077 3041 2133 -3019 2462
1135 2462 1898 -5121 804 7327 -1909 -6076 4658 4546 -6696 -3096 5672 -1249 -4727 2660 971
1150 971 -3340 2132 1775 -4927 13 7404 -878 -6549 4758 6573 -5659 -3923 4622 567 -2613
1165 -2613 2033 -138 -3645 1773 1813 -5789 -2288 6782 370 -6812 2211 5322 -4132 -2931 4342
1180 4342 1413 -1410 2695 808 -3020 2049 3249 -4927 -2992 6567 826 -7647 -49 4671 -2721
$$ packed form
1077B957M765j2379J04J0750m339p465N452K070n988N078L324q996K096J0611
1091H040p963r563J1905O783j1821l016J0511j996p340N095L16n971P040L666
1105E686j1328L25J2629m592j0894P816Q333r512l387R392j626o705N216L07o377
1120d717N780M102r813l10J1947l487j2431O374J0163p898m787Q118r08n152N481
1135B462n64p019N925O523r236m167J0734j12j1242L600Q768o921l478P387j689
1150I71m311N472l57o702M940P391q282n671J1307J815j2232J736Q545m055l180
1165b613M646k171l507N418M0p602L501R070o412p182R023L111r454J201P273
1180D342k929k823M105j887l828N069J200q176J935R559n741q473P598M720p392
$$ plain form
1195 -2721 -3569 2125 775 -868 2341 706 -3424 2449 5119 -4111 -3904 6011 2054 -5933 -412
1210 -412 4013 -1713 -3378 1425 542 -1177 2263 725 -3806 1838 4939 -3391 -3833 5284 3263 -4509
1226 -4509 -1571 3299 -977 -3155 343 -674 -1770 2650 544 -4440 918 5171 -1901 -3375 4370
1241 4370 4401 -2158 -1023 3142 -91 -2050 399 -1495 -2532 1748 -260 -5661 -1461 3500 -1533
1256 -1533 -4289 2558 4777 -860 -686 2919 1409 -74 2295 -342 -1301 2520 1008 -5055 -2503
1271 -2503 2436 -1581 -4808 -266 2836 -1173 -1813 792 -37 350 2341 -109 -641 3680 2948 -2510
1287 -2510 -1583 3140 758 -3594 -576 2229 -625 -1773 -590 -1324 68 1531 -882 -1597 2558 2864
1303 2864 -2186 -2417 2423 1561 -2908 -1042 1648 154 -629 -730 -1242 443 1592 -162 -1019 2313
$$ packed form
1195b721q48N694j350j643L209j635m130N873K670r230K07R915l957p987N521
1210d12M425n726j665M803q83j719L440j538m531N644L101q330m42R117k021p772
1226d509K938M870m276k178L498j017j096M420k106m984N358M253p072j474P745
1241D370L1o559J135M165l233j959K449j894j037M280k008n401M200M961n033
1256a533k756O847K219n637J74L605j510j483K369k637r59L821j512o063K552
1271b503M939m017l227M542L102m009o40K605q29L87J991k450n32M321p32n458
1287b510R27M723k382m352L018K805k854j148J183p34J392J463k413p15M155L06
1303B864n050k31M840q62m469J866K690j494p83j01n12J685J149j754q57L332
$$ plain form
1319 2313 3783 -713 -2302 1593 1698 -2228 -1607 251 111 -823 -1853 -2523 -618 832 -557 -1677
1335 -1677 1536 3956 399 -1447 1727 2712 602 -28 945 1479 828 -1159 -2250 -1481 142 -1091
1351 -1091 -3115 -1044 1330 -688 -2737 -708 1290 1397 523 1086 2763 2841 947 -60 134 1428
1367 1428 379 -2078 -1109 526 -794 -3002 -2869 -746 284 -1173 -1233 857 1664 992 -531 -93 2028
1384 2028 1301 -215 -258 1333 1351 -524 -2107 -240 1518 -364 -1446 126 1221 -60 -1928 -1621
1400 -1621 118 200 -535 -911 121 1679 546 -1712 -248 2230 1234 -734 130 2023 698 -1097
1416 -1097 -1210 -37 335 300 -756 -768 1539 772 -2361 -1797 924 747 -1718 -1357 1271 457 -950 -457
1434 -457 -31 1131 1972 597 9 2100 2186 -1174 -1943 730 681 -2193 -1826 328 -485 -1107 -676 -988
$$ packed form
1319B313J470m496j589L895J05l926O21J858j40r34j030o70J905J450j389j120
1335a677L213K420l557j846L174R85k110o30R73N34o51j987j091P69J623j233
1351a091k024K071K374k018k049K029J998J07q74N63J677P8j894j007J94J294
1367A428j049k457R69J635j320k208J33K123J030j457o0K090Q07o72j523M38K121
1384B028p27j516m3J591J8j875j583J867J758j882j082J572J095j281j868L07
1400a621J739Q2p35l76J032J558j133k258J464K478r96j968Q64J893j325j795
1416a097j13J173L72l5j056j2K307p67l133N64K721j77k465L61K628q14j407M93
1434d57M26J162Q41j375n88K091Q6l360p69K673m9k874L67K154q13o22M31l12
$$ plain form
1452 -988 313 2175 780 -968 1320 2635 -700 -1995 1024 1660 -1417 -1044 875 -64 -236 55
1468 55 -1143 -610 1716 600 -1918 -161 2234 -525 -2653 435 1633 -539 -316 1256 388 499
1484 499 860 -736 -1032 1304 980 -2231 -1307 1829 -465 -2790 49 1603 -13 167 1347 82
1500 82 271 1224 -552 -1943 912 1411 -2622 -1863 1933 284 -2227 251 1728 291 751 994 -78
1517 -78 -20 1273 -860 -2553 421 2002 -1966 -1919 1951 937 -1579 108 1483 288 483 1010 -719
1534 -719 -792 1364 -401 -3073 315 2648 -1129 -1879 1725 1192 -1354 -401 1035 -500 -359 852 -1465
1551 -1465 -1751 1807 525 -2349 608 3259 52 -1250 1370 1520 -979 -368 793 -1059 -639 821
1567 821 -1662 -2378 1381 410 -2486 4 3170 597 -1336 1190 1359 -779 118 983 -572 44 1606
$$ packed form
1452i88J301J862j395j748K288J315l335j295L019O36l077L73J919r39j72K91
1468E5j198N33K326j116k518J757K395k759k128L088J198k172K23J572q68J11
1484D99L61j596k96K336l24l211R24L136k294k325K839J554j616J80J180j265
1500H2J89R53j776j391K855M99m033P59L796j649k511K478J477j437M60K43j072
1517g8N8J293k133j693K974J581l968M7L870j014k516J687J375j195J95N27j729
1534g19p3K156j765k672L388K333l777p50L604n33k546R53J436j535J41J211k317
1551a465k86L558j282k874K957K651l207j302K620J50k499O11J161j852M20J460
1567H21k483p16L759r71k896K490L166k573j933K526J69k138Q97Q65j555O16J562
$$ plain form
1584 1606 -966 -2131 1078 1320 -2184 -1169 2056 91 -2122 -189 529 -1493 -90 1127 -599
1599 -599 338 2470 341 -1365 1581 1954 -1173 -954 1735 153 -2348 -647 -295 -1964 -507 250
1615 250 -1461 -357 2236 383 -2034 960 2584 -504 -714 2093 1078 -1202 229 -19 -1289 -31
1631 -31 670 -1308 -792 1514 -121 -2647 -360 1804 -716 -1361 1673 1113 -526 240 286 -831 536
1648 536 1514 -692 -969 1551 516 -2601 -789 1388 -598 -1244 1352 1024 -527 532 295 -995
1664 -995 129 1412 -271 -1028 1654 661 -2469 -1274 1060 -430 -1145 786 690 -273 345 274 -1074
1681 -1074 64 1874 -13 -908 1363 1354 -1654 -1298 697 -525 -1305 224 229 -916 -14 148 -1211 -376
1699 -376 1727 441 -818 1732 1873 -792 -797 746 69 -691 291 396 -633 66 141 -1724 -1014 1519
$$ packed form
1584A606k572j165L209K42l504J015L225j965k213J933P18k022J403J217j726
1599e99R37K132k129j706K946L73l127K19K689j582k501J701L52j669J457P57
1615B50j711J104K593j853k417K994J624l088k10K807j015k280J431k48j270J258
1631c1P01j978N16K306j635k526K287K164k520o45L034n60j639P66M6j117J367
1648E36R78k206k77K520j035l117J812K177j986o46K596l28j551J059k37j290
1664i95J124J283j683p57K682r93l130J195K334j490p15J931r6r63O18p1j348
1681a074J138J810j887q95K271rl008L56J995j222p80J529Nj145R02J62j359Q35
1699c76K103j286j259K550J41k665nJ543o77p60R82J05j029O99P5j865P10K533
$$ plain form
1717 1519 439 -1035 860 1561 -676 -972 305 324 -174 682 519 -496 254 468 -1574 -1153 932
1734 932 445 -842 465 1146 -513 -1384 -34 -33 -214 987 299 -466 328 428 -1296 -1341 820 701 -834
1753 -834 -8 1160 -242 -1045 -72 -13 -258 991 476 -272 590 522 -1278 -1542 337 512 -1050 -407 726
1772 726 -254 -878 -316 -418 -46 1097 732 121 589 966 -744 -1113 278 1090 -12 149 593 -129 -517
1791 -517 -397 -517 -267 655 590 -194 118 917 -414 -1570 21 554 20 -12 637 15 -188 -264 -694 -91
1811 -91 665 981 -118 120 643 -201 -1442 -734 140 -381 -323 188 82 -244 -452 -695 -511 588 1250 284
1831 284 302 978 144 -530 -444 611 713 422 431 150 -196 -580 -1138 -1050 -321 410 -606 -423 74 134 -700
1852 -700 -325 606 1015 1194 1311 796 494 371 -651 -659 -360 281 -556 -776 -601 -574 -850 -866 -337 701 736
$$ packed form
1717A519j080j474J895P01k237k96J277J9m98Q56j63j015P50K14k042M21K085
1734I32m87j287J307O81j659q71J350Jj81J201o88p65P94J00j724m5K161j19j535
1753h34Q26J168j402q03R73N9k45J249n15p48Q62o8j800k64J879J75j562O43J133
1772G26r80o24N62j02L72J143l65o11M68L77j710l69J391Q12j102J61M44p22l88
1791e17J20j20K50R22o5p84L12P99j331j156J591N33n34l2O49o22k03p6m30O03
1811i1P56L16j099K38N23q44j241P08Q74n21N8N11j06l26k08k43J84J099O62r66
1831B84J8O76q34o74Q6J055J02k91Rk81l46l84n58Q8P29P31j016J83M97O0q34
1852g00L75R31M09J79J17n15l02j23j022qK99O41q37k20J75K7k76j6N29J038L5
$$ plain form
1873 736 487 614 844 755 -216 -400 278 738 614 184 216 133 -255 -1222 -733 -136 165 -369 -390 -331 -241 -608
1895 -608 -822 12 799 1279 953 688 942 484 -76 -407 -145 480 -420 -573 -855 -565 -959 -1190 -760 63
1915 63 622 609 436 758 712 -74 -365 213 884 347 56 126 83 -428 -554 -318 -81 491 148 -279 -311 -72
1937 -72 -460 -1019 -430 522 667 392 730 445 163 337 38 254 718 513 -549 -713 -524 -865 -1308 -972
1957 -972 40 326 311 618 511 245 356 139 133 617 827 18 -258 43 -141 -974 -538 452 380 219 159
1978 159 -57 -358 -224 -736 -720 -138 666 119 -477 392 338 88 192 576 531 615 423 -41 -453 -566 -656 -1130
2000 -1130 -259 398 194 -589 154 585 156 -6 590 743 585 562 147 -371 -39 -136 -839 -185 544 262
2020 262 -517 7 241 -142 -451 13 -9 6 154 -34 -548 126 408 -220 -63 833 629 -304 374 344 -315
$$ packed form
1873G36k49J27K30q9r71j84O78M60j24m30L2q3l88r67M89N97L01n34k1N9R0l67
1895f08k14Q34P87M80l26k65K54m58n60l31K62O25r00j53k82K90l94k31M30Q23
1915F3N59j3j73L22m6p86k91N78O71n37k91P0m3n11j26K36K37N72l43m27l2K39
1937g2l88n59N89R52J45k75L38k85k82J74k99K16M64k05j062j64J89l41m43L36
1957i72J012K86j5L07j07k66J11k17oM84K10q09k76L01j84q33M36R90p2j61o0
1978A59k16l01J34n12J6N82Q04n47n96Q69n4k50J04L84m5Q4j92m64m12j13r0m74
2000a130Q71O57k04p83P43M31m29j62N96J53j58k3m15n18L32r7p03O54P29k82
2020B62p79N24K34l83l09M64k2J5J48j88n14O74K82o28J57Q96k04r33O78l0o59
$$ plain form
2041 -315 -615 -24 19 -212 72 92 -516 -158 108 -321 -323 594 545 219 68 380 -179 -428 -84 -255 -31 622
2063 622 90 -470 1 314 -254 -492 171 536 -230 -97 130 -338 -396 -7 -42 -168 444 309 -271 46 560
2084 560 -189 -435 131 393 -363 -434 88 -195 -294 305 77 -56 415 675 -31 -125 536 50 -581 53 419
2105 419 -37 -13 -22 -166 -227 216 -94 -244 184 550 -429 -3 363 379 -13 -17 425 -29 49 149 -191 -363 344
2128 344 -218 -356 297 224 -298 -352 199 344 -500 -34 159 2 69 397 -49 -156 394 1 -298 253 426
2149 426 -242 -301 243 22 -67 -13 -9 -30 -14 288 -222 -257 423 151 -222 8 422 -90 -345 31 341 -160 -19
2172 -19 -15 -149 80 133 24 -224 287 117 -90 161 239 -253 -361 -94 237 -137 -54 -24 22 -36 344 75 -176
2195 -176 249 66 -311 -53 147 -41 -192 -26 168 -214 -66 13 -176 -92 157 -96 -356 402 364 -236 -256
$$ packed form
2041c15l00N91M3k31K84K0o08L58K66m29kR17m9l26j51L12n59k49L44j71K24O53
2063F22n32n60M71L13n68k38O63L65p66J33K27m68n8L89l5j26O12j35n80L17N14
2084E60p49k46N66K62p56p1N22k83r9N99k28j33M71K60p06r4O61m86o31O34L66
2105D19m56K4rj44o1M43l10j50M28L66r79M26L66J6l92mM42m54P8J00l40j72P07
2128C44n62j38O53p3n22n4N51J45q44M66J93j57O7L28m46j07N50l93k99N51J73
2149D26o68n9N44k21q9N4Mk1J6L02n10l5O80k72l73K30M14n12k55L76L10n01J41
2172a9Mj34K29N3j09k48N11j70k07K51P8m92j08K67L31l74Q3L0M6n8L80k69k51
2195a76M25j83l77K58K00j88j51J66J94l82J48P9j89Q4K49k53k60P58l8o00k0
$$ plain form
2216 -256 17 281 64 135 214 120 47 6 -436 -240 263 108 -273 119 -117 -172 -279 84 176 -222 35 189
2238 189 142 -63 244 -143 -166 139 77 -313 8 253 -253 -187 146 1 -53 12 280 179 105 130 52 93 171 110
2262 110 -103 -14 290 -30 -135 33 -63 -281 -63 -107 26 234 146 -84 -169 170 222 -103 -167 159 -31 -168
2284 -168 -12 -64 -223 38 66 -68 311 182 65 -175 32 160 -383 -234 33 7 -38 -176 -197 -4 54 198
2306 198 40 -37 202 -99 -404 -241 -48 -107 -116 60 202 47 73 7 -160 -32 34 24 200 49 37 -336 133
2329 133 220 -99 -79 -20 125 -5 119 -57 -26 61 211 -19 106 133 35 -231 -102 131 188 -147 136 251 -244
2352 -244 88 -343 -147 -209 -106 -112 -232 87 144 46 -32 156 123 197 89 165 58 -171 -157 -337 -88 55 -54
2375 -54 -109 -187 84 -151 -360 142 152 23 95 -26 117 -172 54 81 -66 192 78 142 125 187 -79 -116 -187 -177
$$ packed form
2216b56K73K64k17P1P9r4p3m1m42J96N03j55l81L92k36n5j07L63R2l98K57J54
2238A89m7k05L07l87k3L05o2l90L21K45n06O6L33j45n4O5K68j01p4K5p8M1P8o1
2262A10k13Q9L04l20j05J68r6k18K18m4J33K08q8k30q5L39N2l25o4L26j90j37
2284a68J56n2j59K61K8j34L79j29j17k40K07J28n43J49K67k6m5j38k1J93N8J44
2306A98j58p7K39l01l05J63J93n9rJ76J42j55K6o6j67J28O6j0J76j51j2l73M69
2329A33Q7l19K0N9J45j30J24j76L1Q7J50k30J25K7r8k66J29K33N7l35K83J15m95
2352b44L32m31J96o2J03oj20L19N7r8p8J88l3P4j08P6j07k29J4j80K49J43j09
2375e4n5p8K71k35k09N02J0j29P2j21J43k89K26K7j47K58j14O4j7O2k66l7p1J0
$$ plain form
2399 -177 -32 -193 -83 25 243 -84 26 78 232 193 78 122 72 146 32 -118 -73 197 -132 -182 -212 82 -111
2422 -111 -15 -37 135 41 -91 -5 -77 -12 -170 -110 -36 92 86 128 -160 45 -158 -162 -60 -177 -20 196 -52 -260
2446 -260 -53 163 -42 35 501 248 139 160 64 76 -68 -37 -37 -36 -1 -151 -331 -82 -94 -97 -316 187 334 118
2470 118 -30 -76 83 57 -78 125 158 237 339 13 54 -153 -114 -148 -69 -82 -151 -35 -190 68 2 -33 191 20
2494 20 254 244 -89 -140 -5 95 78 -195 -32 10 -27 -175 -200 -171 53 -115 42 171 285 204 -104 300 259
2517 259 67 -85 133 340 148 -130 -151 -41 -73 3 55 -53 125 65 -307 -112 29 -141 18 250 260 134
2539 134 3 269 23 128 -116 -56 -228 63 181 -317 -250 -259 -49 -130 182 297 -49 11 169 245 115 46 45
2562 45 13 109 252 -115 -438 91 -200 -341 240 -32 -65 -119 -98 -232 -79 265 4 -63 117 -34 -67 -280 216
$$ packed form
2399a77J45j61J10J08K18l27J10N2J54l9j15M4n0P4j14j50M5K70l29n0l0K94j93
2422a11R6k2J72r4j32Q6p2O5j58O0P4J28oM2k88K05k03mJ02j17J57K16k48k08
2446b60K07K16k05P7M66k53j09K1r6J2j44L1%JL5j50j80K49j2lk19N03J47k16
2470A18j48m6J59k6j35K03L3P9J02l26M1k07L9l4P9j3o9J16j55K58o6l5K24j71
2494B0K34j0l33n1J35J00j7k73J63M2l7j48k5K9K24j68J57J29J14q1l08M04m1
2517B59j92j52K18K07j92k78k1J10l2P6N2j08J78o0l72J95J41j70J59K32J0j26
2539A34j31K66k46J05k44O0j72K91J18m98O7rK10q1L12J15l46O0J58P6j30o9j
2562D5l2R6J43l67l23N29k91j41N81k72l3n4K1j34J53L44k61o7J80j51l3k13M96
$$ plain form
2585 216 -96 -18 153 -11 91 112 -219 -400 42 -63 -103 94 163 26 -144 -31 112 -269 -215 105 -51 -259
2607 -259 63 -166 -89 -179 -15 84 -355 94 161 -277 9 -142 -169 -175 170 133 -224 16 35 -226 -109 307 -54
2630 -54 27 183 305 -107 -101 -146 -65 -153 23 15 -148 113 19 -255 -122 197 1 -21 -6 339 -102 74 -82 -11
2654 -11 -74 149 -77 -158 -339 -29 -248 -232 -70 62 18 -134 -19 82 -144 -30 -79 -279 -43 158 19 -64
2676 -64 -37 50 -81 194 230 9 139 -8 12 -205 66 220 -261 175 362 -126 -24 32 -41 -227 60 134 -127
2699 -127 -55 138 54 -125 285 -68 -320 3 157 178 177 146 110 -138 -136 31 -7 49 64 -11 -57 -94 -157 -241 189 17
2725 17 46 -104 219 82 -34 51 229 -18 -27 210 45 53 -31 -59 -238 -104 130 -39 -400 -108 -15 -67 261 229
2749 229 74 107 59 -58 15 251 -106 -207 -340 110 -65 -254 7 11 -68 -41 -176 -123 -16 -44 -56 -21 -50 267
$$ packed form
2585B16l12P8J71j64J02K1l31j81M42j05m0J97O9j37j70J13J43l81N4L20j56k08
2607b59L22k29P7r0J64R9m39M49O7m38K86j51k7oL45l7l57K40J9k61J17M16l61
2630e4Q1J56J22m12Om5Q1q8J76qj63K61r4k74J33L19j96k2J5L45m41J76j56P1
2654a1o3K23k26q1j81L10k19J6J62J32m4j52J15J01k26J14m9k00K36K01j39q3
2676f4K7Q7j31K75L6k21J30j47K0k17K71J54m81M36J87m88J02N6p3j86K87P4k61
2699a27P2J93q4j79M10l53k52L23J54K1jl1l6k48KJ67l8N6J5p5m6l7o3q4M30j72
2725A7K9j50L23j37j16Q5J78k47rK37j65Qq4k8j79J34K34j69l61K92R3n2L28l2
2749B29j55L3m8j17P3K36l57j01j33M50j75j89K61Mp9K7j35N3J07k8j2L5k9L17
$$ plain form
2773 267 -293 32 31 -50 14 8 -11 -115 -151 -125 -172 42 110 -178 -363 186 155 -159 -13 137 236 -96 20 183
2797 183 262 -84 102 86 67 187 -162 -265 -173 344 -149 -96 158 179 91 -1 108 94 -84 255 96 76 341
2820 341 164 -218 -61 168 -116 -194 7 148 -122 -186 80 -126 -90 281 222 23 306 229 65 41 375 -16
2842 -16 132 -65 141 1 -131 -88 -221 -14 15 -33 -16 258 -52 -288 70 65 -168 -61 -67 183 88 142 191 -34
2866 -34 110 346 -179 -197 267 24 -91 42 87 -166 -37 51 75 198 -169 82 -80 160 185 -72 60 77
2888 77 32 -121 -159 -29 86 -184 -29 128 226 320 -74 -191 -96 206 13 57 91 172 188 -175 44 36 -7 -58 -73
2913 -73 137 -128 -289 -54 150 -119 -183 -283 -72 -161 -82 41 -25 81 211 -34 -3 19 129 -177 -141 18 108
2936 108 -73 -200 78 41 -53 242 12 121 174 -19 -178 136 -63 -11 46 -55 149 -50 -7 -74 101 99 -9
$$ packed form
2773B67n60L25jq1O4oj9j04l6K6m7K14O8k88j85N49l1l14J46J50R9l32J16J63
2797A83P9l46J86j6j9J20l49j03R2N17m93N3K54K1q8r2J09j4j78L39j59k0K65
2820C41j77l82J57K29k84p8K01J41k70o4K66k06L6L71n9j99K83p7j64k4L34l91
2842a6J48j97K06j40j32M3j33K07K9m8J7K74l10k36L58nk33J07oK50r5N4M9k25
2866c4J44K36n25j8M64k43j15J33M5k53J29Q8K4J23l67K51j62K40K5k57J32J7
2888G7m5j53l8J30J15k70J55J57R8R4l94j17R5L02j93M4L4Q1J6l63K19qm3n1j5
2913g3K10k65j61K35K04k69o4j00K11q9P9J23o6J06J30k45L1K2J10l06L6J59R0
2936A08j81j27K78l7r4K95k30J09N3j93j59L14j99N2N7j01K04j99M3o7J75kj08
$$ plain form
2959 -9 -401 77 134 10 -149 213 -233 -111 -151 -229 152 -113 124 -18 -40 250 99 -184 16 40 188 -151
2981 -151 34 -51 183 -72 93 240 28 195 -12 52 60 -34 -267 -106 53 57 -68 -123 58 80 201 279 90
3004 90 125 31 -136 -92 105 3 -95 -237 149 -136 -143 -53 91 -32 125 -43 25 61 179 129 -158 61 -92 -105
3028 -105 -232 34 340 -44 -44 115 114 -90 -132 -402 -163 183 -19 -264 -41 305 -39 -168 137 499 113 3
$$ packed form
2959il92M78N7j24j59L62m46J22m0p8L81k65K37j42k2K90j51k83K00K4J48l39
2981a51J85q5K34k55J65J47k12J67k07O4Qr4k33J61J59Mj25n5J81K2J21P8j89
3004I0L5r4j67M4J97j02r8j42L86k85pR0J44j23J57j68O8L6J18n0k87K19j53j3
3028a05j27K66L06l84%J59jk04m2k70K39L46k02k45K23L46l44j29L05L62l86j10
$$ [...]
8191a04
##END NTUPLES=NMR FID
##END=
