##TITLE=1H_Pr 5296-27
 200.13MHz,CDCl3,
 8 sc
 
 31.3.2025
##JCAMPDX= 6.0         $$ Bruker NMR JCAMP-DX V2.0
##DATA TYPE= NMR FID
##DATA CLASS= NTUPLES
##ORIGIN= UXNMR, Bruker Analytische Messtechnik GmbH
##OWNER= pz
$$ XWIN-NMR		Version 3.5
$$ Mon Mar 31 16:30:53 2025 Russian Standard Time (UT+4h)  she@DPX200
##.OBSERVE FREQUENCY= 200.1313
##.OBSERVE NUCLEUS= ^1H
##.DELAY= (6, 6)
##.ACQUISITION MODE= SIMULTANEOUS
##.ACQUISITION SCHEME= undefined
##.AVERAGES= 8
##.DIGITISER RES= 18
##SPECTROMETER/DATA SYSTEM= spect
##.PULSE SEQUENCE= zg30
##.SOLVENT NAME= CDCl3
##.SHIFT REFERENCE= (INTERNAL, CDCl3, 0, 14.3821)
##AUDIT TRAIL= $$ (NUMBER, WHEN, WHO, WHERE, WHAT)
$$ ##TITLE= Audit trail, XWIN-NMR		Version 3.5
$$ ##JCAMPDX= 5.01
$$ ##ORIGIN= Bruker BioSpin GmbH
$$ ##OWNER= she
$$ F:/spectra/data/she/nmr/H-C/1/audita.txt
$$ ##AUDIT TRAIL=  $$ (NUMBER, WHEN, WHO, WHERE, WHAT)
(   1,<2025-03-31 16:29:25.03 +0400>,<she>,<DPX200>,
      <created by zg, POWCHK disabled, PULCHK disabled
       configuration hash MD5:
       00 E9 B6 7A A2 85 ED C7 34 08 36 98 17 FE 4E 26
       data hash MD5: 16K
       FC 0D AB 3B 22 25 3E 4C 04 77 F7 CA 97 72 67 0F>)
$$ ##END=
$$ 
$$ hash MD5
$$ 72 4C 10 D1 B4 5C 62 B7 55 EA C3 10 82 FF C2 42
##$RELAX= 
##$RELAX= 
##$RELAX= 
##$RELAX= 
##$RELAX= 
##$RELAX= 
$$ Bruker specific parameters
$$ --------------------------
##$DU= <F:/spectra>
##$EXPNO= 1
##$NAME= <H-C>
##$PROCNO= 1
##$TYPE= <nmr>
##$USER= <she>
##$AMP= (0..31)
100 100 100 100 100 100 100 100 100 100 100 100 100 100 100 100 100 100 
100 100 100 100 100 100 100 100 100 100 100 100 100 100 
##$AQSEQ= 0
##$AQ_mod= 1
##$AUNM= <au_zg>
##$AUTOPOS= <>
##$BF1= 200.13
##$BF2= 200.13
##$BF3= 200.13
##$BF4= 200.13
##$BF5= 200.13
##$BF6= 200.13
##$BF7= 200.13
##$BF8= 200.13
##$BYTORDA= 1
##$CFDGTYP= 0
##$CFRGTYP= 5
##$CHEMSTR= <none>
##$CNST= (0..31)
1 1 145 1 1 1 1 1 1 1 1 1 1 1 1 1 1 1 1 1 1 1 1 1 1 1 1 1 1 1 1 1 
##$CPDPRG= <>
##$CPDPRG1= <>
##$CPDPRG2= <>
##$CPDPRG3= <>
##$CPDPRG4= <mlev>
##$CPDPRG5= <mlev>
##$CPDPRG6= <mlev>
##$CPDPRG7= <mlev>
##$CPDPRG8= <mlev>
##$CPDPRGB= <>
##$CPDPRGT= <>
##$D= (0..31)
0 0.7 0 0 0 0 0 0 0 0 0 0.03 0 0 0 0 0 0 0 0 0 0 0 0 0 0 0 0 0 0 0 0 
##$DATE= 1743424164
##$DBL= (0..7)
120 120 120 120 120 120 120 120 
##$DBP= (0..7)
150 150 150 150 150 150 150 150 
##$DBP07= 0
##$DBPNAM0= <>
##$DBPNAM1= <>
##$DBPNAM2= <>
##$DBPNAM3= <>
##$DBPNAM4= <>
##$DBPNAM5= <>
##$DBPNAM6= <>
##$DBPNAM7= <>
##$DBPOAL= (0..7)
0.5 0.5 0.5 0.5 0.5 0.5 0.5 0.5 
##$DBPOFFS= (0..7)
0 0 0 0 0 0 0 0 
##$DE= 6
##$DECBNUC= <off>
##$DECIM= 32
##$DECNUC= <off>
##$DECSTAT= 4
##$DIGMOD= 1
##$DIGTYP= 9
##$DL= (0..7)
0 120 120 120 120 120 120 120 
##$DP= (0..7)
150 150 150 150 150 150 150 150 
##$DP07= 0
##$DPNAME0= <>
##$DPNAME1= <>
##$DPNAME2= <>
##$DPNAME3= <>
##$DPNAME4= <>
##$DPNAME5= <>
##$DPNAME6= <>
##$DPNAME7= <>
##$DPOAL= (0..7)
0.5 0.5 0.5 0.5 0.5 0.5 0.5 0.5 
##$DPOFFS= (0..7)
0 0 0 0 0 0 0 0 
##$DQDMODE= 0
##$DR= 18
##$DS= 0
##$DSLIST= <SSSSSSSSSSSSSSS>
$$ [...]
##$SUBNAM0= <"">
##$SUBNAM1= <"">
##$SUBNAM2= <"">
##$SUBNAM3= <"">
##$SUBNAM4= <"">
##$SUBNAM5= <"">
##$SUBNAM6= <"">
##$SUBNAM7= <"">
##$SUBNAM8= <"">
##$SUBNAM9= <"">
##$SW= 18.0517328524113
##$SWIBOX= (0..15)
0 0 2 0 0 0 0 0 0 0 0 0 0 0 0 0 
##$SW_h= 3612.71676300578
##$TD= 16384
##$TD0= 1
##$TE= 0
##$TE2= 300
##$TE3= 300
##$TEG= 300
##$TL= (0..7)
0 120 120 120 120 120 120 120 
##$TP= (0..7)
150 150 150 150 150 150 150 150 
##$TP07= 0
##$TPNAME0= <>
##$TPNAME1= <>
##$TPNAME2= <>
##$TPNAME3= <>
##$TPNAME4= <>
##$TPNAME5= <>
##$TPNAME6= <>
##$TPNAME7= <>
##$TPOAL= (0..7)
0.5 0.5 0.5 0.5 0.5 0.5 0.5 0.5 
##$TPOFFS= (0..7)
0 0 0 0 0 0 0 0 
##$TUNHIN= 0
##$TUNHOUT= 0
##$TUNXOUT= 0
##$USERA1= <user>
##$USERA2= <user>
##$USERA3= <user>
##$USERA4= <user>
##$USERA5= <user>
##$V9= 5
##$VALIST= <valist>
##$VCLIST= <CCCCCCCCCCCCCCC>
##$VD= 0
##$VDLIST= <DDDDDDDDDDDDDDD>
##$VPLIST= <PPPPPPPPPPPPPPP>
##$VTLIST= <TTTTTTTTTTTTTTT>
##$WBST= 1024
##$WBSW= 4
##$XGAIN= (0..3)
0 0 0 0 
##$XL= 0
##$YL= 0
##$YMAX_a= 230371
##$YMIN_a= -314599
##$ZGOPTNS= <>
##$ZL1= 120
##$ZL2= 120
##$ZL3= 120
##$ZL4= 120
##$ABSF1= 10
##$ABSF2= 0
##$ABSG= 5
##$ABSL= 3
##$ALPHA= 0
##$AQORDER= 0
##$ASSFAC= 0
##$ASSFACI= 0
##$ASSFACX= 0
##$ASSWID= 0
##$AUNMP= <proc_1d>
##$AZFE= 0.1
##$AZFW= 0.1
##$BCFW= 1
##$BC_mod= 2
##$BYTORDP= 1
##$COROFFS= 0
##$CY= -3
##$DATMOD= 1
##$DC= 2
##$DFILT= <>
##$DTYPP= 0
##$F1P= 0
##$F2P= 0
##$FCOR= 0.5
##$FTSIZE= 0
##$FT_mod= 4
##$GAMMA= 1
##$GB= 0.15
##$INTBC= 1
##$INTSCL= 1
##$ISEN= 128
##$LB= 0.25
##$LEV0= 0
##$LPBIN= 0
##$MAXI= 10000
##$MC2= 0
##$MEAN= 0
##$ME_mod= 0
##$MI= 1.114404
##$NCOEF= 0
##$NC_proc= 0
##$NLEV= 6
##$NOISF1= 3.799351
##$NOISF2= 2.8
##$NSP= 1
##$NTH_PI= 0
##$NZP= 0
##$OFFSET= 14.38212
##$PC= 1
##$PHC0= -469.5026
##$PHC1= 10.59221
##$PH_mod= 1
##$PKNL= yes
##$PPARMOD= 0
##$PSCAL= 0
##$PSIGN= 0
##$REVERSE= no
##$SF= 200.129724274929
##$SI= 16384
##$SIGF1= 3
##$SIGF2= 2
##$SINO= 400
##$SIOLD= 16384
##$SREGLST= <1H.CDCl3>
##$SSB= 0
##$STSI= 0
##$STSR= 0
##$SW_p= 3205.1282051282
##$SYMM= 0
##$S_DEV= 0
##$TDeff= 0
##$TDoff= 0
##$TI= <>
##$TILT= no
##$TM1= 0
##$TM2= 0
##$TOPLEV= 0
##$USERP1= <user>
##$USERP2= <user>
##$USERP3= <user>
##$USERP4= <user>
##$USERP5= <user>
##$WDW= 1
##$XDIM= 8192
##$YMAX_p= 0
##$YMIN_p= 0
$$ End of Bruker specific parameters
$$ ---------------------------------
##NTUPLES= NMR FID
##VAR_NAME=  TIME,          FID/REAL,        FID/IMAG
##SYMBOL=    X,             R,               I
##VAR_TYPE=  INDEPENDENT,   DEPENDENT,       DEPENDENT
##VAR_FORM=  AFFN,          ASDF,            ASDF
##VAR_DIM=   8192,          8192,            8192
##UNITS=     SECONDS,       ARBITRARY UNITS, ARBITRARY UNITS
##FACTOR=    0.0002768,     1,               1
##FIRST=     0,             0,               0
##LAST=      2.2672688,     0,               0
##MIN=       0,             -314599,         0
##MAX=       2.2672688,     230371,          0
$$ Real data points
##PAGE= N=1
##DATA TABLE= (X++(R..R)), XYDATA
$$ [...]
1616e8O74o78ML09p37Q3P75l89q89R91O09j083o2R45q3p48L42N25o72R7M09l46
$$ -58 616 -62 -58 251 -486 -403 372 -17 -906 85 694 -389 -451 494 411 -337 5 530 -142 -45 364 18
1638A8m49R03l82q55P19N59q14k89J046k51o55M77K52p5m21O97n08l99R56k59
$$ 18 -431 472 90 -765 -46 513 -301 -590 456 205 -450 27 279 204 -217 480 -28 -427 529 270
1658B70j094O81O45p85l47P36L11q76J67O52m43p9L74k46k15N57J56r62J54Q76
$$ 270 -824 -143 502 -283 -630 106 417 -459 -292 360 -83 -162 212 -34 -249 308 464 -498 -344 532
1678E32k88p18N28M07p92R3N03l49M5K43j51n81O96M25j099RO25J13q44K36Q86
$$ 532 244 -474 54 461 -331 -238 265 -84 -39 204 53 -528 168 593 -506 -497 128 241 -603 -367 519
1699E19o79k8N23l1k80N30l62l89K48N08o93m86J025j16p80M3O60k03l08J73J10
$$ 519 -160 -188 335 304 24 554 192 -197 51 559 -134 -620 405 289 -491 -448 212 9 -299 -126 -16
1720a6j94K91K25m93L02O92p78n72R54r4n84j35N02j03k77L16M8k55m5K99l15
$$ -16 -210 81 306 -187 115 807 29 -543 411 317 -267 -402 100 -3 -280 36 84 -171 -216 83 -232
1741b32j30P39l18n99P27J77m72k80O46m6q3j15L73m69M7M66o12k56Q10j86o19
$$ -232 -362 377 59 -540 187 364 -108 -388 258 212 129 14 387 -82 -35 431 -181 -437 373 187 -432
1762d32K42M06k54m45O90Pl18J01Lk22J08M99m89j11P65jq24L95J83l69Oo8J12
$$ -432 -190 216 -38 -483 207 214 -104 -3 0 -222 -114 385 -104 -215 550 549 -275 120 303 -66 -60 -128 -16
1785a6k05J26j2k13N8M36l68j63P45K24o32j30M95Lm45M7K8K02j10j68m1QJ75
$$ -16 -221 -95 -107 -320 -262 174 -194 -357 388 612 -20 -150 345 348 -97 -50 -22 180 70 -98 -139 -131 44
1808D4l12j15L42J64l49L8M54P9k38j94K41J7n9j43j0o1L03rn54M74J52j78m15
$$ 44 -268 -383 -41 123 -226 -188 266 345 107 -87 154 171 112 -31 -41 -102 201 192 -362 112 264 86 -329
1831c29M43j31q7j31K15j6j23K56k46O3K71J4n16K70J99ok88J80P5J2oq7l1J15
$$ -329 114 -17 -104 -235 -20 -36 -159 97 -149 -86 185 199 -317 -47 152 146 -142 38 113 125 119 32 1 116
1855A16J12k89j21K13J99m39q2K48J18k06p7J09J88j06O7p6l0M7p7j30L27M8l55
$$ 116 228 -61 -182 31 230 -209 -291 -43 75 -131 -208 -99 89 -17 50 -26 -56 -9 -86 -216 111 159 -196
1878a96K15oMj12r3J89N2l37N78l17J73O4l90J60p1L19k4l72j24M44k68k3J0K98
$$ -196 19 13 17 -95 -188 1 53 -284 294 -23 150 214 -176 -16 -87 232 208 -164 -288 156 -112 -135 -125 173
1902A73J46k86r7R5J67k78n4J51j4L7J74j43J98k46l7o8L50j62k50K56p8L4j02
$$ 173 319 33 -64 31 198 -80 -134 17 3 40 214 71 269 23 -14 -82 268 106 -144 112 34 68 -34
1925c4l2J3j84L25k72K04P5k6Nj97J59m3m6j68K13J82k74k8K61q1J2j36J01o7
$$ -34 -66 -53 -237 88 -184 20 95 69 74 -123 36 -7 -53 -221 -8 174 -100 -128 133 52 64 -72 29 -38
1949c8J07rk78K24J64q2k71P8l8P5k31N34j94j04k9q0Q1K57j30k22K9O07j13m39
$$ -38 69 60 -218 6 170 88 -183 -105 -143 -68 -299 235 41 -63 -92 -172 -91 166 36 -186 -157 450 337 -102
1973a02O3J91k43j4J06p7J44o7q7J12K11j46Qr9K52l14p9L40j01k39J57r4j11
$$ -102 -39 152 -91 -105 1 -76 68 1 -86 26 237 91 99 0 252 -62 -141 199 98 -141 16 -78 -189
1996a89K43KJ9k46J54J69j17j80J86L75m12j49J69j58J84%k5p0J94q5l00K54j61
$$ -189 54 56 75 -171 -17 152 35 -145 41 416 4 -145 24 -134 50 50 25 -45 149 64 -236 18 -143
2019a43l7P1J56K04k66j32L50j84j82K25j67L8L50k0k51l8K34j75j34j48L30k49
$$ -143 -180 -109 47 251 -15 -147 203 19 -163 62 -105 -67 283 263 12 -26 208 33 -101 -249 81 -168
2041a68j8K43n2K24j24P0k44J39L4j62r3N44l57k22oJ75O2j85L40l96J56L64k20
$$ -168 -186 57 5 229 105 175 -69 70 104 -58 -151 393 36 -186 -192 -17 45 -140 200 -196 -40 324 104
2064A04k17K28L7l73J27J42jj79J41J17k62m8K59k4O9j44q0q6K86K21l05k88M32
$$ 104 -113 115 152 -221 -94 48 47 -132 9 126 -136 -184 75 51 120 -24 -104 -190 96 317 12 -276 156
2087A56O3l43p4N05k54k33K14N8j65K33p1o4n6J18k02K6J38jj52K2K51j43l3l0
$$ 156 219 -124 -198 307 53 -180 34 92 -73 160 89 25 -31 87 -115 -89 49 48 -104 -82 169 26 -7 -37
2111c7O9q5r8L92l65q6M30j89o8P4j25M9q0J87ok66L61n1j90l7K11k00J04K34
$$ -37 32 -53 -151 241 -124 -210 220 31 -37 37 -88 -39 -119 68 62 -204 157 106 -84 -121 90 -110 -6 228
2135B28p0j44R1J05j15k57K01J96l57K12k4j27k5L11l3k89N10o8m19p2L85o4n06
$$ 228 158 14 105 210 95 -162 39 235 -122 90 66 -61 -86 225 192 -97 413 345 -74 -146 239 175 -331
2158c31L61P4k16L12l93K6J99rJ47k81J41j17n7K09P2o3p4N8K04j95j05K04l33
$$ -331 30 104 -112 200 -193 -167 32 23 170 -111 30 -87 -144 65 137 74 0 58 262 67 -38 166 -167
2181a67N1K72q4j49J7L4L7L0J27o7k83J22K4o7J93K32m66J57m7J13m7J6P6k05
$$ -167 -116 156 72 -77 -60 -26 11 41 168 101 -182 -60 -36 -103 90 322 -144 13 -34 79 32 48 124 -81
2205h1r0Q5Q2l4N9j3K0k46L04p5p2L20o3o25M58M1k23J39r7K88k44J7J57n8m7
$$ -81 -171 -86 -4 -38 21 8 28 -218 86 11 -61 259 196 -429 29 70 -153 -14 -111 177 -67 -50 107 49 2
2230BQ3j16lQl1P3n7J19M0l50r6K83m7j3K06k47J65M4q5Qp4M6q2N3R3J07j66J7
$$ 2 85 -31 -34 -26 -57 16 -41 78 118 -232 -328 -45 -92 -105 101 -146 19 63 -22 -14 -88 -42 -124 -71 22 129 -37 -20
2258b0o5Q4K8J04j26N0q3J39j49k1L05m9j99k04L15j49J22O9k18n5J98Pl36J37
$$ -20 -85 -1 27 131 5 55 -28 111 -38 -59 246 197 -2 -206 109 -40 82 151 -67 -122 76 83 -253 -116
2282a16J56o0K04k0m00L7J71r5n1K6L03k70R9k99K73r1J74j38K0M0K4j7j72L52
$$ -116 40 -20 184 164 -236 -199 -28 -123 -174 -148 155 -115 -16 -315 -42 -133 41 -97 -77 -37 -13 -30 -202 150
2306A50k75J91j22K76k14J9O2j66J02J30r6k29N1K33Q1k46m8J64Kk7n2k1n6J08
$$ 150 -125 66 -56 220 6 25 87 -79 23 153 57 -172 -121 112 193 -53 -101 63 65 38 -14 -35 -91 17
2330A7q6n0P1OJ20j7mJ26k27N2k1j12J17J45k38M2kK2K7J56p0N2j19o5n6q8R1
$$ 17 -69 -119 -48 -42 78 61 57 183 -44 8 -13 -125 -8 137 -101 -59 -61 -39 -12 144 74 126 7 -58 -114 -202 -111
2357a11J79j70r2L92k69q2K01j5l01L88O2r2j11K3j39O8m1K02j00O5k24L12j25
$$ -111 68 -102 -194 198 -71 -153 48 33 -268 120 182 90 -21 2 -137 -69 -110 92 -8 57 -167 145 20
2380B0N6p3o2J23l20M18j72P6P3j86Q9m0j16J52j8K18k27P1M1l16J96K5j18m9
$$ 20 76 3 -59 64 -256 162 -10 66 139 -47 42 2 -114 38 20 238 11 82 123 -193 3 28 -90 -139
2404a39J58n8Q1J22p3jq5J79k07P2P3j4q9p3J19j06Q7j38J87o3j22l1j05K51j18
$$ -139 19 -39 42 164 91 90 5 184 -23 49 122 108 19 -54 65 -41 46 -92 95 32 -90 -121 -226 25 -93
2429i3Qk01K38r8Q7O3q5RR2J42j59p1K31q2k71J60nl5p1L06J40l72j3L17j92O4
$$ -93 -85 -286 -48 -146 -59 4 -81 -72 20 162 3 -68 163 81 -190 -30 -35 -70 -141 165 305 -67 -80 237 45 109
2455A09l24K99NK5j68J69j13j21J29O6j17r2K63j41O4j33K85k11J0Q5j78J92N4
$$ 109 -215 84 89 114 -54 115 2 -119 10 76 -41 -133 130 -11 53 -80 205 -6 4 89 -89 103 157
2478A57r4M0k06P9K07j78L6j54q8K05J27j21K7j2j76Q5K15j00j21n8J58L2q1n1
$$ 157 63 103 -103 -24 183 5 41 -113 -201 4 131 10 37 25 -151 -66 149 49 -72 -130 28 60 -21 -72
2502g2k6L9j16K08PO9k77L25p5m8K2K6j97M5P5r1K10q5k8m2r2N5J11j32MJ0Ll5
$$ -72 -98 -59 -175 33 40 109 -168 157 82 34 56 82 -115 -70 5 -86 124 39 11 -31 -123 -68 43 -89 -85 -75 -72 -107
2530a07J4K12j44P0j66L5J31j53P9jo3J65j43j26L34j0k84K15l9j38m2J43k9j65
$$ -107 -93 119 -25 45 -121 -86 45 -108 -29 -30 -93 72 -71 -197 137 127 -157 58 19 -119 -161 -18 -47 -212
2554b12K02j32L79l01K06j82L5p7k7J6L8J96j79J13Rq1N8k20Q6Q7k54K37K7q7
$$ -212 -10 -142 237 -64 142 -40 -5 -82 -109 -93 -55 141 -38 75 84 3 61 -159 -73 14 -240 -3 24 -63
2578f3MJ0jl4J74j67J24j27j38J72n0j4j42J67J04O1k03j2K15m0J10K5j85K5L1
$$ -63 -59 -49 -50 -84 90 -77 47 -80 -218 -46 -96 -110 -252 -85 19 80 -123 -135 80 40 150 175 -10 15 46
2603D6j06Q3j30J3m5J28q9J30j39K77j72j09J97j49Q2r4Q0j69N8R4q9J35L5J71
$$ 46 -60 23 -107 -94 -139 -11 -100 30 -109 168 -4 -113 84 -65 17 -77 3 -166 -108 -14 -103 32 67 238
2627B38m34J90JJ5j1j3o8J52J47k73m8J51l2Q7l29J20J79k70J81k8J3Mp9J80O
$$ 238 -196 -6 -5 10 -1 -14 -82 70 217 -56 -104 47 15 102 -227 -107 72 -198 -17 -45 -32 -28 -107 73 79
2652G9J5j15J5nj72J9K31J86l28K96l52N1K4lj21Q3O7m2O8%k2q4J54j29P3L32
$$ 79 94 -21 -6 -11 -183 -164 67 253 -75 221 -131 -80 -56 -59 -180 -97 -30 -72 -4 -4 -26 -110 44 -85 -12 320
2678C20k30k46J14l7L77l29J18q3K15k88N4m8j39K95k23J83K7k9j79K65j53j72
$$ 320 90 -156 -42 -79 298 -31 87 4 219 -69 -15 -63 -202 93 -130 53 80 51 -128 137 -16 -188
2700a88K64q3k55K66K01l9k76J5J31L5j83K90n16K11J69J68k56J84n0n8R5r1j46
$$ -188 76 -7 -262 4 205 166 -110 -95 36 71 -112 178 -338 -127 42 210 -46 138 88 30 125 34 -112
2723a12jJ38Ml3qJ22r5q2o8J34J16r3q2J60n4N5j06o7J67K1j82K24k2l34J91k84
$$ -112 -113 25 29 -4 -12 110 15 -67 -135 -1 115 22 -60 100 46 101 -5 -72 95 116 -66 158 136 -198 -7 -291
2749b91J08J72jJ46j45M7q9J03j66O8K03k04p7K04j09K35k31K3j0J18r0J3j7R7
$$ -291 -183 -11 -12 134 -11 36 -53 50 -116 -48 155 -49 -126 78 -31 204 -27 -4 -14 104 14 27 10 107
2773A07Q5k17Q9J83l2kl62K71n6l0j5o2Q7k52L64l50N3J85q8P0j15J2rK11k53
$$ 107 192 -25 64 247 215 213 -149 122 66 36 21 -41 46 -206 158 -192 -139 46 -42 28 -87 -75 -84 127 -126
2798a26j38K28p3L03k92J28o6j28R2k8m1K65j82J62J3k12P9r8K22l19R6M5J11
$$ -126 -264 -36 -109 194 -98 30 -36 -164 -72 -100 -141 124 -58 104 117 -95 -16 -114 108 -211 -115 -70 41
2821D1K4oj50l1J3P6kJ24j73p8K25j35k04L13J1j1rj44O0J07j96K93k34J55L9
$$ 41 65 59 -91 -122 -109 -33 -35 89 -84 -162 63 -72 -276 37 48 37 28 -116 -56 51 -145 148 -86 69 108
2846A08k42K22j54L5j23N3K68J4j82j03J23k44J29J21j40J0P3j39JK26m5K34j61
$$ 108 -134 88 -66 -31 -154 -101 167 181 -1 -104 19 -225 -96 25 -115 -105 -32 -171 -170 56 11 245 84
2869H4K8n0m2j59J38j2N5q9j54L5P4J77m6q4r6K22j27K69m8k81P4o9L5M1J05j69
$$ 84 112 62 20 -139 -1 -13 42 -47 -201 -166 -92 85 39 -45 -141 81 -46 223 175 -106 -32 -101 -66 -25 80 -89
2895h9K44j34k57L09k53J03L2J19J09Q8l67P5K04k68L17q8j70Nj41K38J51l40
$$ -89 155 21 -236 73 -180 -77 -45 74 183 271 -96 -21 183 -85 232 144 -26 -21 -162 76 227 -113
2917a13K30l35K41J22j37J33j96j69J17K2KnK0J58j19K6k8J71k26K9p3n3J29p4
$$ -113 117 -218 23 145 8 141 -55 -224 -107 -85 -83 -88 -68 90 -29 -3 -31 140 -86 -57 -130 -183 -54 -128
2941a28j43L33m8P9j43K04k20J49kp7j31kK10j33L7k2l0N5J9n0J75j57O6o9L52
$$ -128 -271 62 14 93 -50 154 -66 83 81 4 -127 -129 81 -52 -15 -37 -67 -12 7 -43 132 -25 41 -28 324
2966C24l94r4L11j24L1j09L9M6m9M8N1k47J13K16j10k9l3k1j52J74p0J18J53k81
$$ 324 -70 -164 147 23 54 -55 -16 30 -19 29 80 -167 -54 162 52 23 -10 -31 -183 -9 -79 39 192 -89
2990h9M7K09n7j21k55J05K81Ql72n8K82P2r1J40j94J92j8j26Q2J18n8J14j68J37
$$ -89 -42 167 110 -11 -266 -161 120 128 -244 -302 -20 52 -39 101 -93 99 81 -45 37 155 97 211 43 180
3014A80k39Q9M0p0O2R5k5j06N4j35O2n0l0K09r4k14k4Q6J25J29o6j77nK52q8m4
$$ 180 -59 30 70 0 62 157 132 26 80 -55 7 -43 -73 136 42 -172 -196 -110 15 144 78 -99 -104 148 60 16
3040A6lr2K20j49K31k99J3O6J77k20J36q2J50r9j49qJ12J9J66r5m2L6Qj78Q4Q9
$$ 16 13 -79 141 -8 223 -76 -63 3 180 -40 96 14 164 65 -84 -92 20 39 205 110 68 104 112 -66 18 107
3066A07o1j67q0L27L5m02K33o3O5k3J07pp6j50L04j83j82J85N7m02L10J38n9j74
$$ 107 46 -121 -201 126 161 -241 -8 -71 -6 -29 78 71 -5 -155 149 -34 -216 -31 26 -376 -66 72 13 -161
3090a61K62L7j47k23L57j70M9j74P2K85j29r8KJ43M4l9p5l8j6P6k05K44k75K84
$$ -161 101 138 -9 -232 125 -45 4 -170 -98 187 58 -40 -38 105 149 110 35 -3 -19 57 -148 96 -179 105
3114A05j42j56J89q2Q4p2J01J05rk24J91n0J2j11LK1J44k27J40m2j0L8j33K12
$$ 105 -37 -193 -4 -86 -2 -74 27 132 123 -101 90 40 52 -59 -56 -35 109 -118 22 -20 -30 8 -125 87
3138H7j10j23K76k43J20J68m51L09J53k22j32K04mj16K6J10m3Jj8L9m17M46o0
$$ 87 -23 -146 130 -113 7 175 -276 33 186 -36 -168 36 32 -84 -58 52 9 10 -8 31 -386 60 0
3161@J0j58L4NJ28l1l7L19l16K13j78O0J79q8k06O9l6J9P2p6n5k1J88Q9j86M1
$$ 0 10 -148 -114 -109 19 -12 -49 270 -46 167 -11 49 228 140 -66 3 -33 -14 58 -18 -73 -94 94 183 -3 38
3187C8j93K01R3q8p7q2j12M8O7J4K55j72l3J1m1j38J30K79k01J01j26K2J22j48
$$ 38 -155 46 139 51 -26 -108 -220 -172 -105 -91 164 -8 -41 -30 -71 -209 -79 200 -1 100 -26 -4 118 -30
3211c0o1J33Q5l04Q9K3K06j77K3N9j70O2K19j57j95J88k24K29p0rJ95l64K32k9
$$ -30 -91 42 127 -177 -88 -65 141 -36 -13 46 -124 -62 157 0 -195 -7 -231 -2 -72 -81 114 -250 -18 -47
3235d7K70k81J53n3k85O9J29O6J05j43J32j68OJ02j15J67N6k06J12Q7j29j24m5
$$ -47 223 -58 95 42 -243 -174 -45 21 126 -17 115 -53 -47 55 -60 107 163 -43 69 156 27 -97 -142
3258a42L11K30l73J14j26q4m5J81l9O2k59R2l1K6R8k6J21Q9k15l2J72J0j84j48
$$ -142 169 399 26 140 14 -70 -115 66 27 89 -170 -78 -109 -83 15 -11 110 199 -16 -48 124 134 -50 -198
3282a98J01J24j68N1K30m19O21j63k04J24j71j10J16N8m5p2K15p1oJ79p2j12j80
$$ -198 -97 27 -141 -90 140 -279 342 179 -25 99 -72 -182 -66 -8 -53 -125 90 19 13 192 120 8 -172
3305a72J35J96n9j57R2n3N3O7k15R3K18l57M06k77o4J46Jp9J16L8k15K71k70J47
$$ -172 -37 159 100 -57 35 -18 35 102 -113 -20 198 -159 247 -30 -94 52 53 -26 90 128 -87 184 -86 61
3329F1k17L01j38j15K58l38K27j18K84l41R2J72k38L03k22j71K19j85J30m9O2
$$ 61 -156 145 7 -108 150 -188 39 -79 205 -136 -44 128 -110 193 -29 -200 19 -166 -36 -85 -23
3350b3j28K03j96J99q1n5j9J33J19L8k77J70j2jQ4j83L55m36P3J18k26o9J87M1
$$ -23 -151 52 -144 55 -26 -81 -100 33 152 190 -87 83 71 70 154 -29 326 -110 -37 81 -145 -214 -27 14
3374A4l6n5l3K31l0j14j07M9J77j21l23M09ok6p4m0K11j36J08j46J80k43Oj4m0
$$ 14 -22 -77 -110 121 91 -23 -130 -81 96 -25 -348 61 55 29 -45 -85 126 -10 98 -48 132 -111 -105 -119 -159
3399a59J47K8o7K92j95k7N3n8K3j13j58K15Jl3L5J62j66R6NN0j15j25J38J53l63
$$ -159 -12 16 -51 241 46 19 72 14 37 -76 -234 -19 -18 -51 -16 146 -20 76 81 131 16 -109 29 182 -181
3424a81K76j33kJ12j40R4j21J2OR4j15L52j90R1j27Q1J7p2J14j97R2k18K1L8N8
$$ -181 95 -38 -40 72 -68 26 -95 -83 -77 17 -98 254 64 155 28 109 126 54 168 -29 63 -155 -134 -96 -38
3449c8J80Pk80R0o8J63k82R2J39O3Q3q3p1k2J06q1m4n9J32J75j35q1O5p4P7mj95
$$ -38 142 149 -131 -41 -109 54 -228 -136 3 66 149 66 -5 -27 79 -2 -46 -105 27 202 67 -14 51 -23 54 50 -145
3476a45J33j8J71j48r3O2K7k2rJ24j18K6j16K07L2o8j2N8j02l9j13K36j22K8k5
$$ -145 -12 -30 141 -7 -100 -38 -11 -33 -42 82 -36 -10 -126 81 113 45 33 91 -11 -50 -163 73 -49 -21 -46
3501d6J10j67J74j80K87k24j53K19K3k1K66k52k2N0j21o7J24J09j54M8m0K97m24
$$ -46 64 -103 71 -109 178 -46 -199 20 43 22 288 36 14 64 -57 -124 0 109 -45 3 -37 260 -164
3524a64K79j48K14l6j41K21l88J06p6j9J83j10Q4q9q2J39K11l93L34p4N8j8J7
$$ -164 115 -33 181 145 4 225 -163 -57 -133 -152 31 -79 5 -84 -166 -27 184 -209 125 51 109 91 108
3547A08l07P1K36j36J7j07J52j16K08j45j42J69p3J69o2L5j22K11j57lr4J04j46
$$ 108 -199 -128 108 -28 -11 -118 34 -82 126 -19 -161 8 -65 104 42 77 -45 166 9 6 -88 16 -130
3570a30O5O1R1j17m3J58j66J25m3%K5MQ5k27j30M18j43O0j64J90r5Rl5m7K12l2
$$ -130 -65 -4 87 -30 -73 85 -81 44 1 1 26 30 115 -112 -242 176 33 93 -71 119 24 33 -2 -49 163 131
3596A31k43K31k59L6R3k7J07j74O0k21L40k30J75Q5j14j46L14k47L92j6k47p8
$$ 131 -112 119 -140 -104 -11 -38 69 -105 -45 -266 74 -156 19 104 -10 -156 158 -89 303 287 40 -38
3618c8k3K7J26P4k98K34m3j88J91J93l84J20R3K7j74N1m1K42o4r1J3m8j01K1J04
$$ -38 -61 -34 92 166 -132 102 59 -129 62 255 -129 -9 84 111 -63 -12 -53 189 125 34 47 -1 -102 -81 23
3643B3p9j45K91P7j63M3j61r2O4R9O9j43j8J31L8Q1J50l92J38Q5j77K02P2j12
$$ 23 -56 -201 90 167 4 47 -114 -206 -142 -43 26 -117 -135 -4 34 115 265 -127 11 96 -81 121 193 81
3667H1j30P9LK9k46K93k2m3j07p4Q7J51j3j4J37l97K09M6j18j30K47L5k00K3J23
$$ 81 -49 30 33 62 -184 109 87 44 -63 -137 -50 101 88 74 211 -186 23 69 -49 -179 68 103 -97 -74 49
3692D9Kj71J68j07Lj29K23J30j35j37K98k28J47j75J71j25q7k09L09J40k35J06
$$ 49 51 -120 48 -59 -56 -185 38 168 33 -104 194 -34 113 -62 109 -16 -103 -312 -3 137 -98 8
3714Hn8J89m25L48M9j46k7j58L49k26J13R4j56q8j30K87j01p1o8Q8O2L2rP9k60
$$ 8 -50 139 -286 62 111 -35 -62 -220 129 -97 16 110 -46 -134 -264 23 -78 -149 -217 -129 -67 -35 -44 35 -225
3739b25K23J71m17Q2L66ol11K10J17j91L1k7J16j10K9j27J11j7j31j0m5J02m5
$$ -225 -2 169 -248 -166 200 194 -117 93 210 19 50 23 139 29 58 -69 42 25 -106 -116 -161 -59 -104
3762a04L0R4q0N3j88N3L46Nk42J8O7k03L75l6k62J74q1j28K08k67J11j2M4O0L0
$$ -104 -74 20 -60 -7 -195 -142 204 209 -33 -15 52 -151 224 188 -74 100 19 -109 99 -168 -57 -69 -25 35 65
3787F5k47J47K8L62k76J1j6P1l13L20p3j34P0oJ38r2j16J15j9l1j05J1p2J48J28
$$ 65 -182 -35 -7 355 79 90 74 145 -168 152 79 -55 15 9 147 55 -61 54 35 4 -101 -90 -162 -14 114
3812A14j42r8j62J53K09P4qj72J9j43J38M0O9j14J32j08R0j00K22k58J10qJ0O5
$$ 114 -28 -126 -288 -135 74 148 140 -32 -13 -156 -18 22 91 -23 109 1 91 -9 213 -45 65 57 67 132
3836A32k71M75l70K66l23P4l0N9m8j4J02L2l6j37O8j78K09j5L9J37m35J18J33
$$ 132 -139 336 -34 232 -91 -17 -47 12 -36 -50 52 84 48 -89 -21 -199 10 -5 34 171 -264 -146 -13
3859a3K4J92j20j6O3k43J34J01j86L9l9M5O8j78J13J8o4l3R5P7l2K4m0J98l46
$$ -13 11 203 83 67 130 -113 21 122 -64 -25 -64 -19 49 -129 -16 2 -62 -95 0 77 45 69 29 227 -119
3884a19j04M07p7j51M0R3r2l7L4k30l1L53j51n0K54L3k72K06Ko8j35K1Q5LR2k60
$$ -119 -223 184 107 -44 -4 89 -3 -40 -6 -236 -267 86 -65 -115 139 172 -100 106 108 40 -95 -74 11 14 106 -154
3910a54J22K5k20J88r9J20M2k4r1J30q5N7k9J07r7J77j39q7N5K30j94o1J73k43
$$ -154 -32 -7 -227 -39 -138 -18 24 0 -91 39 -46 11 -18 89 -8 169 30 -57 -2 228 34 -27 146 -97
3934i7M5J17l12L59j73o7M08k14J4j8j16R8j3m2Q4j69K4j5L17l42J51j87m2J40
$$ -97 -52 65 -247 112 -61 -128 280 66 80 62 -54 44 31 -11 73 -96 -72 -87 230 -112 39 -148 -190 -50
3958e0j5K05j7k53N8N1J64Lk10J46l03L18m4j8j32R7l0J5MJ97l1k00q6j78M67
$$ -50 -65 140 123 -130 -72 -21 143 146 -64 82 -221 97 53 35 -97 0 -30 -15 -11 186 155 -45 -131 -309 158
3983A58M3k75K2o5K06r9O5O0r1j45J72K53j38j94j46J52n0j29J93j9J72j4p8j8
$$ 158 201 -74 -52 -117 89 -10 55 115 24 -121 51 304 166 -28 -174 -22 -72 -201 -8 -27 145 131 53 35
4007C5K6k42K20rk43K89p0j17J81j28j20J45j0J9m8J03lk69K70j09N3j34J80J96
$$ 35 61 -181 39 30 -213 76 6 -111 70 -58 -178 -33 -43 -24 -72 31 28 -241 29 -80 -27 -161 19 215
4031B15l77J25P2j30J1J65j38J2J34j96j53K81j08J09Q9p0Jr7J76k08K10k68M5
$$ 215 -162 -37 35 -95 -84 81 -57 -45 89 -107 -260 21 -87 22 111 41 42 -55 121 -87 123 -145 -100
4054a00O0n2K00j45l7O8J90j38K28k37r6J20k4j68J67J14k04qJ30j27O6r2J49
$$ -100 -40 -92 108 -37 -74 -6 184 46 274 37 -59 61 37 -131 36 150 -54 -62 68 -59 7 -85 64
4077F4j76J16Q1K8j71O5j33K84j5j77rL1k5JK80j33k57L00j25k7K9m9o4J95M5
$$ 64 -112 4 85 113 -58 7 -126 158 143 -34 -43 -12 -37 -36 244 111 -146 154 29 2 31 -18 -82 113 158
4102A58r1J0k08J92p6j65R7L9J70M2j22K46l52J08j1m6n7K05L5r7pj72R5o3K01
$$ 158 67 77 -131 61 -15 -180 -83 -44 126 168 46 292 -60 48 37 -9 -66 139 174 77 70 -102 -7 -70 131
4127A31j08M2j54J24k00R2Q2J32J3J8l53P2J72k33J56O4J60j27j64J30q1Q1J07
$$ 131 23 65 -89 35 -165 -73 9 141 154 172 -181 -109 63 -170 -14 50 210 83 -81 49 -32 49 156
4150A56l36Q8k3j36K35O0j76M6L06j05j28J10j41L1o1k6J04K62M4l94PJ31j0j16
$$ 156 -180 -92 -115 -251 -16 44 -132 -86 220 115 -13 97 -44 -13 -74 -100 4 266 310 -84 -77 54 44 -72
4174g2J37j03n3q4M6LJ32P3J69k33j09j8J66J29j30K2k15J63PP4j62M7K12q5n8
$$ -72 65 -38 -91 -175 -129 -126 6 79 248 15 -94 -112 54 183 53 75 -140 23 30 104 -58 -11 201 116 58
4199E8m0J77k41rpP4ql19L20l3M7j17K01j28J62n7j50J09k8Q3j93J07J83n54K36
$$ 58 18 195 -46 -55 -62 12 4 -315 5 -28 19 -98 103 -25 137 80 -70 39 11 94 -99 8 191 -363 -127
4224a27K6J72J76j89k05R7j06J63Q6j09J07Kj62j35L09j84pK78k76K75k28j48
$$ -127 -101 71 247 58 -147 -50 -156 7 93 -16 91 93 -69 -204 105 -79 -86 192 -84 191 -37 -185
4246a85L59k57J41j35j5K37R5k40r6Q4j09J78N6k72J88q2K1K55k21J50k48L4J03
$$ -185 174 -83 58 -77 -92 145 240 0 -96 -12 -121 57 113 -159 29 -53 -32 223 2 152 -96 -62 41
4269D1p2rJo2J14m2j10J46N2j46J02J0j44p7K01O9N3j20j3j15M6L5k11K33JJ10
$$ 41 -31 -40 -39 -101 13 -29 -139 7 59 -87 15 25 -119 -196 5 74 127 7 -6 -121 -75 -40 -251 -18 -17 93
4295I3j37J0k2R9q5J90j98N6L14k75%mP0l6j6j85J55k2J35q3r7R1Mj19k7J70n
$$ 93 -44 -34 -56 43 -42 148 -50 6 320 45 45 41 111 75 59 -126 29 7 142 59 -38 53 57 -62 -89 81 76
4322G6j57K2K25o2k22K02l50L34J32n4k75L33K5k69P1q2K64j33j36Jk15M04r5
$$ 76 -81 -59 166 104 -118 84 -266 68 200 146 -129 204 229 -40 31 -51 213 80 -56 -55 -270 134 39
4345C9M4r1m5m1M5n2J87k5J87l39Q3m5J33K6M8j89j01MJ11nK1J21k11M1k16K23
$$ 39 83 -8 -53 -94 -49 -101 86 61 248 -91 -8 -53 80 106 154 -35 -136 -132 -21 -26 -5 116 -95 -54 -270 -47
4371d7M6J51k54J07m4RK7K7k16J58Oj65L17m8L3k36J65j66K2J68j13K36k79J50
$$ -47 -1 150 -104 3 -41 -32 -5 22 -194 -36 -30 -195 122 74 107 -129 36 -130 -108 60 -53 183 -96 54
4395E4k49K49pj2j16J16R7k81P6j3o7P8qJ32qK00j56K2j86M4Q6K08l50J31j51
$$ 54 -195 54 47 35 -81 35 132 -149 -73 -86 -153 -75 -83 49 41 241 85 107 -79 -35 51 259 -91 40 -111
4420a11K27Q9m7n4n7J0j38R9l9M1Q9k48M21k29o6K10l80K17j82K27%j50K87j24
$$ -111 116 205 158 104 47 57 -81 18 -21 20 109 -139 282 53 -13 197 -183 34 -148 79 79 -71 216 92
4444I2j03J92m04L33l2k5q3m1q3%L9J16J02o8j40p9J20j5L4j84L53j77L0nR9j23
$$ 92 -11 181 -223 110 78 53 -30 -71 -154 -154 -115 1 103 35 -105 -184 -64 -79 -45 -229 124 -53 -23 -28 71 -52
4470e2l0K35j54q8K70k82J27j40L91l01m0J92m07K01K11J3k24r2J56R6o4q9N5
$$ -52 -82 153 -1 -89 181 -101 26 -114 277 -24 -64 128 -279 -78 133 146 -78 -170 -14 82 18 -71 -16
4493a6J43j19J80k77K1J18k06J08J73J1p4k39K38j00K98l03j37L75j87J04j48
$$ -16 127 8 188 -89 -68 50 -156 -48 125 136 62 -177 61 -39 259 -44 -181 194 7 111 -37
4514c7j29R2P8k99J82K51j51j36k4J17ojN6j07M8K8Lj2P1n6k30L45j97Q6K10q6
$$ -37 -166 -74 4 -295 -113 138 -13 -149 -173 -56 -62 -63 -7 -114 -66 -38 -35 -47 24 -32 -262 83 -114 -28 182 96
4540I6k32L13j78k6n2K0K59k26m0L02k9n8j78r2J58j27N3j06K47j01M4j72K62
$$ 96 -136 177 -1 -27 -79 -59 200 -26 -66 236 207 149 -29 -121 37 -90 -37 -143 104 3 47 -125 137
4563A37k14K17k67K05j78m8K09o4L6m5j33K44K20j77l1p5l14M12j11J45j92q2
$$ 137 -77 140 -127 78 -100 -148 61 -3 33 -12 -145 99 319 142 111 36 -278 134 23 168 -24 -106
4585a06Q5Kj65L06j20K9m8j62J81J3nL2J70j31j20n5P6R2m37N11r8k8P6k27K92
$$ -106 -21 -19 -184 122 2 31 -17 -179 2 15 10 42 212 81 -39 -94 -18 74 -363 148 50 22 98 -129 163
4610A63k47k2o3M4n5K74o4n7l4J74q1kl9N7K9o3J2P1l0n6j46K47k60n9L64j27
$$ 163 -84 -106 -169 -125 -180 94 30 -27 -61 113 32 30 -9 48 77 14 26 97 67 11 -135 112 -148 -207 157 30
4636C0J4J37j86L6K4l2K36k30j41P9M2r1O0k18L03j89l1J77k5j49J69J40o9p7
$$ 30 44 181 -5 31 55 23 259 29 -112 -33 9 -82 -22 -240 63 -126 -157 20 -5 -154 15 155 86 9
4660IM6j4o9j40L51k28p4J76r8n0J24k1J6L2k26K65n8L6k21K17j99J84J57j43
$$ 9 55 41 -28 -168 183 -45 -119 57 -41 -91 33 12 28 60 -166 99 41 77 -144 73 -126 58 215 72
4684G2N7j74k2J75N6j01N6l0k10J96L0L6O5k54J34L5k3j06M8j95J20Q9j02p6P3
$$ 72 129 -45 -67 108 164 63 119 89 -121 75 105 141 206 -48 86 121 98 -8 40 -155 -35 54 -48 -124 -51
4709e1o7J69J01k38K37q4j14Q8J09q4J94j97Q0o6n2NK8p8m8j04K03Q5j5p7L1J62
$$ -51 -118 51 152 -86 151 67 -47 41 150 66 260 63 143 77 25 30 58 -20 -68 -172 31 116 101 24 55 217
4735B17k49j21J41R9k49J78j41J56K55l02r1O3pP3q3J56j15q8J53pJ66l13K46
$$ 217 -32 -153 -12 87 -162 16 -125 31 286 -16 -107 -44 -51 22 -61 95 -20 -108 45 38 204 -109 137
4758A37p3p6J05Lm7k9J2j50J77M3j02M8r9j06K21r8p6N0R7j59K27j13j36rM09
$$ 137 64 -12 93 96 49 20 32 -118 59 102 0 48 -51 -157 64 -34 -110 -60 37 -122 105 -8 -144 -153 256
4783B56k66j71J05l9k1O5J97k01L1K84l72J53Q5j81P5o5R6J37r0j65K63j50Q1
$$ 256 -10 -181 -76 -115 -136 -71 126 -75 -44 240 -132 21 106 -75 0 -65 31 168 78 -87 176 26 107
4806A07K2n2j03J2L5j04k34L11J67l9M7j28P5j56n4P1L6P7j37o6m1K56k7m8L15
$$ 107 129 77 -26 -14 21 -83 -317 -6 161 122 169 41 116 -40 -94 -23 13 90 -47 -113 -154 102 75 27 342
4831C42l24J28j41n1K28k61J77k18M6Kn6k22O17j82j76R5j5k8k5Q2j01J18n2j58
$$ 342 18 146 5 -46 182 -79 98 -120 -74 -72 -128 -350 267 85 -91 4 -11 -39 -64 18 -83 35 -17 -175
4855a75K97RO0j91J36l45O4N2P4O3j48J27k5J24j87l1K4J78k42K00j12K17L8m37
$$ -175 122 131 191 0 136 -209 -145 -93 -19 44 -104 23 -2 122 -65 -96 -72 106 -136 64 -48 169 207 -230
4879b30PJ58J16n9m4N8J08k33J50K6q6J01m2M3k40J04k9K23l03K78j18N7j38J88
$$ -230 -223 -65 51 -8 -52 6 114 -119 31 57 -29 72 30 73 -167 -63 -92 131 -172 106 -12 45 -93 95
4903I5k50J73j21J10o7N0j07N0l3o3M02k58j38O2k5N7P2O0Pj11O8J95m47J80J11
$$ 95 -155 18 -103 7 -60 -10 -117 -67 -100 -163 239 -19 -157 -95 -120 -63 9 69 76 -35 33 228 -219 -39 72
4928G2j39J58K3l17j08L99J2k50J29m5J61k76K02J69j20P8j49J10J04j07M7j06
$$ 72 -67 91 114 -203 -311 88 100 -150 -21 -66 95 -181 21 190 70 148 -1 109 213 106 153 47
4950D7J13j26k0J3J22pj88J36m5J47l25L8j22R8L33j78k47P7K14j05j58N8K68
$$ 47 160 34 14 27 149 142 -46 90 45 192 -133 -95 -217 -119 214 36 -211 -134 80 -25 -183 -125 143
4973A43m1j66J44p9N5q7K03k90J05J77j12j37R2J28j18J70j18j29P2M9k9J68j27
$$ 143 102 -64 80 1 56 -31 172 -118 -13 164 52 -85 7 135 17 187 69 -60 12 61 32 200 73
4996G3k69L24j39j66K20m8q8L32j72J1j08M4k1j65J16J77j01r7N5J5o2M5J16k43
$$ 73 -196 128 -11 -177 43 -5 -93 239 67 78 -30 14 -7 -172 -56 121 20 -77 -22 -7 -69 -24 92 -151
5020a51O6J80j45M1q5K69k38M3k9l9M3j10P8jK39o2k9j52J43p0Lj03k5M0nj91
$$ -151 -85 95 -50 -9 -94 175 -63 -20 -49 -88 -45 -155 -77 -78 161 99 70 -82 61 -9 -6 -109 -134 -94 -99 -290
5046b90L54j79M1K58O3j23L0k89J73K22j46j49J62o5p7o0J09K88j86j62p6J10
$$ -290 64 -115 -74 184 247 124 154 -135 38 260 114 -35 127 62 -15 -75 34 322 136 -26 -102 8
5068HJ96k58J46J23m4k07j79J75j09K33Rj58J13J9l6Q5m8l9r9J39j07l8n3J11
$$ 8 204 -54 92 215 171 -36 -215 -40 -149 84 93 -65 48 67 31 116 68 29 -70 69 -38 -76 -129 -18
5092a8kl5r0K56q7l9l8J27j5L2k22j22K34k10K11j27Q7j30K67p5j63K56N6j26
$$ -18 -20 -55 -145 111 24 -15 -53 74 59 91 -131 -253 -19 -229 -18 -145 -58 -188 79 4 -159 97 153 27
5116B7O9k2j08J56k06r5J42n3m0J17k8K94l15J07O7j58j15N3L09j0k64M0q4P7
$$ 27 96 74 -34 122 -84 -179 -37 -90 -130 -13 -41 253 -62 45 112 -46 -161 -108 201 191 -73 -33 -117 -40
5140d0k06K47J82k68J20j11l2K05j81P2J9K3J09k65k8J7J31q8R8j87K84j54J09
$$ -40 -246 1 183 -85 35 -76 -108 97 -84 -12 7 30 139 -126 -154 -137 -6 -94 4 -183 101 -53 56
5163E6n6Nj95J48L3m6K52k49J03l19L58k00J58q3Q4J57k63J30j84J42j1N6n0k91
$$ 56 0 5 -190 -42 -9 -55 197 -52 51 -268 90 -110 48 -35 49 206 -57 73 -111 31 20 76 26 -265
5187b65L22n5j72Q3o4J70k1j20K54J2k21Q7J14q3q0K04k27N7n8j20L37j8m5Q1
$$ -265 57 2 -170 -87 -151 19 -2 -122 132 144 -77 10 124 41 -39 165 -62 -5 -63 -183 154 136 91 172
5211A72q2l4K28l10j54M1J85n2k84K02m0K96k50J07j79M1l8N4J53k02K14Oj08
$$ 172 90 56 284 -26 -180 -139 46 -6 -290 -88 -128 168 -82 25 -154 -113 -151 -97 56 -146 68 74 -34
5234c4j38J68q1n5J80j9J79o2k62K89j18O9k85Q7N8J00L2lR2m74J01j5K0J73k8
$$ -34 -172 -4 -85 -140 40 21 200 138 -124 165 47 116 -169 -82 -24 76 108 105 197 -277 -176 -191 -171 2 -26
5259b6K56j61Qr9O2l7N6N3K1j73J80k76K62p1j48L2Q2J37J01j45j09j40k4K05
$$ -26 230 69 77 -22 40 3 59 112 133 -40 140 -136 126 55 -93 -61 21 158 259 114 5 -135 -159 46
5283D6j35K80l16J13n1J3J82j36k26L09N5k30k32M62n0N0K3m9n5On4q6N3j30J4
$$ 46 -89 191 -125 -12 -63 -50 132 -4 -230 79 134 -96 -328 134 84 134 157 108 53 59 5 -81 -28 -158 -144
5308a44K76j53j30J91j33l2L03k16N3k41K21j9m4K58j24m3L6j40L9J53qm9j03
$$ -144 132 -21 -151 40 -93 -125 178 -38 15 -226 -5 -24 -68 190 66 23 59 -81 -42 111 103 54 -49
5331d9J49q6o7J62l43J34L6K94k71P8l7J82j89o6J15J61j99m7M1J25Jj90MJ82
$$ -49 100 14 -53 109 -234 -100 -64 230 -41 37 0 182 -7 -73 42 203 4 -43 -2 123 124 -66 -62 120
5355A20j11OK12j86J6j96J19J84j00j49JK4J35j42J23r2K3J07k7l34N79l88J06
$$ 120 9 15 227 41 57 -139 -20 164 64 -85 -84 -60 75 -67 56 -36 -13 94 67 -267 312 -76 30
5378C0p2L4m7N7J12j12N0j29K21j54J00k43J69j5J7N8j03l7O0j10K05K7Pj18k46
$$ 30 -42 -8 -55 2 114 2 52 -77 144 -10 90 -153 16 1 18 76 -27 -64 -4 -114 91 118 125 7 -239
5403b39K07n2P6pPqJ19J09j71m2k6J06O6k48J73Ll1P0j22Np7J41k69J91O3j39
$$ -239 -32 -84 -8 -15 -8 -16 103 212 41 -1 -27 79 145 -103 70 73 42 112 -10 -5 -82 59 -210 -19 44 -95
5429i5p4K45o0j70J81J02j24k14L64q5j26K00j26J42j56L4O2K5m2J64m26J04K77
$$ -95 -169 76 16 -154 27 129 5 -209 155 70 -56 144 18 160 4 38 100 125 83 247 -179 -75 202
5452B02j94j44J06O1mQ7r0J9k68J32J67P6j35j02K41j93K9N5r3J11kJ74k33J49
$$ 202 8 -136 -30 31 27 114 24 43 -225 -93 74 150 15 -87 154 -39 -10 45 -48 63 61 235 2 151
5476A51R1l87O6qJ1Q4p1J62Mj13q6qJ50Q4nR8l83o0L55q3m5j61Q7O1J15k40M9
$$ 151 242 -145 -79 -87 -76 8 -63 99 103 -10 -96 -104 46 130 125 223 -160 -220 135 52 7 -154 -67 -6 109 -131 -82
5503h2J1Q6r4J21k63J75J04n8l8J26J10r6k10r0K75k41K96q2q8O9j58J46nj68
$$ -82 -71 15 -79 42 -221 -46 58 0 -38 88 198 102 -108 -198 77 -164 132 50 -38 31 -127 19 14 -154
5527a54K97j22o0K11kn8j55J09o2L5Q9j5Lm9KJ62m84K26k34Q8K14j5J30o9J2Q9
$$ -154 143 21 -39 172 170 112 -43 66 4 39 128 113 116 67 69 231 -253 -27 -261 -173 41 26 156 87 99 188
5553A88r3r6J23j16N1R1k22QP5j48l9R5n7K10k51J29M08l52J54p2l4Q8m3j56m6
$$ 188 95 -1 122 6 57 148 -74 -66 9 -139 -178 -83 -140 70 -181 -52 356 4 158 86 52 140 97 -59 -105
5578a05Q5p0L5J72k16m1L6J43ol19M8J19L24m11K20J9R6j03o0o8J20J0N6n5n4
$$ -105 -20 -90 -55 117 -99 -140 -104 39 33 -286 -238 -119 205 -206 14 33 129 26 -34 -102 18 28 84 29 -25
5603b5l4Q1k16o5K20n3j39K44L18l60N8J24k01L8J47j95N2J4j03J62q6J89o0k00
$$ -25 -59 22 -194 -259 -39 -92 -231 13 331 -29 29 153 -48 -10 137 -58 -6 8 -95 67 -19 170 110 -90
5627i0M7J31J35k17J15k89J30R3k77K64j90K21j62J16N6k28J78j23j0J16k9n1
$$ -90 -43 88 223 6 121 -168 -38 55 -222 42 -148 73 -89 27 83 -145 33 -90 -100 16 -13 -64
5649f4J74j55j19K07N0o1Nj6l8p2J35J38J6l88n2L38l65L63J04l68L40k7l37J11
$$ -64 110 -45 -164 43 93 32 37 21 -17 -89 46 184 200 -188 -240 98 -267 96 200 -168 172 145 -192 -81
5673h1L8Lp7O7r6L32l4k80J02j14J21j63J45j96L11l21J79J43j12l2j8J39J03
$$ -81 -43 -40 -117 -50 -146 186 152 -128 -26 -140 -19 -182 -37 -233 78 -243 -64 79 -33 -65 -83 56 159
5696A59k64J18k83K89K53k01K7l27K4J31K43j41L8r2K7m1L1Q6PJ37k85J99k04
$$ 159 -105 13 -270 19 272 71 98 -229 -205 -74 169 28 66 -26 1 -40 -9 77 84 221 -64 135 -69
5719f9M3K5K45k78O0l9J58k71J28P5J1j47R4J35j84J19J94m31p7K19k2q2KQ0j8
$$ -69 -26 -1 244 -34 26 -13 145 -126 2 77 88 -59 35 170 -14 105 299 -132 -209 10 -12 -94 -92 -12 -30
5744c0j28J24N5J44j35k05L51l5j60J62o3K2r9n1J9qj71J63j73M91q2j83k2J62
$$ -30 -158 -34 21 165 30 -175 176 141 -19 143 80 102 3 -48 -29 -37 -208 -45 -218 273 191 8 -14 148
5768A48j66n2J6j72K78P8k15L4J80j71K32q0l3n1M1J3K4j04r9qN9J02l1J81k11
$$ 148 -18 -70 -54 -226 52 130 -85 -51 129 -42 190 110 77 26 67 80 104 0 -99 -107 -48 54 23 204 -7
5793gk9K64m6m12M00j91p3P3J41k13J99k44J58J91k71r5J79k12J92J31L%k39R7
$$ -7 -36 228 182 -230 170 -21 -94 -21 120 -93 106 -138 20 211 -60 -155 24 -188 4 135 138 138 -101 -4
5817dJ88j74k04J54P4J66j81J51j97P8j4m1j4J28q6k1K68k06K3O6o4r0j5j81K98
$$ -4 184 10 -194 -40 34 200 19 170 -27 51 37 -4 -18 110 24 3 271 65 88 154 90 0 -15 -196 102
5842A02P3l24L32j63K6j21R2o5j0J10p0J56j83K06o2M5o2l32K24K11k37k5o6K50
$$ 102 175 -149 183 20 46 -75 17 -48 -58 52 -18 138 -45 161 99 144 82 -250 -26 185 -52 -77 -143 107
5866A07k11J25J61j85J1Q6o9q7K58p1l30K05N1M3l11J51Q9j13kJ37L2l9L09l58
$$ 107 -104 21 182 -3 8 94 25 -62 196 125 -205 0 51 94 -217 -66 23 -90 -92 45 77 38 347 -11
5890a1nL7J38j74n8m9J70j16j10K24m6J02j01J67j11j49J06j41K43M1j64j44J62
$$ -11 -16 21 159 -15 -73 -122 48 -68 -178 46 0 102 1 168 57 -92 14 -127 116 157 -7 -151 11
5913A1N0m8j2N2P2j57JK55k30j00J46O7K9R3k88k9M3o1k5P6k6J55k79K68o9r9
$$ 11 61 13 1 53 125 -32 -31 224 -6 -106 40 107 136 229 -59 -88 -45 -106 -131 -55 -81 74 -205 63 -6 -105
5939a05K06j76j71K28m2L8Q0k41Q0P8L1JP7j20l4R7L5j57R7O0n4j59O6J70j06
$$ -105 101 -75 -246 -18 -60 -22 58 -183 -103 -25 6 7 84 -36 -70 27 62 -95 2 62 8 -151 -85 85 -21
5964b1j56K04k6j01L04j48J62k65J3j1J55K2J32k64p9K36j77J7M2j46L0J95j64
$$ -21 -177 27 1 -100 204 56 218 -47 -34 -45 110 132 264 0 -79 157 -20 -3 39 -107 -77 118 -46
5987d6q7J99j30k9j17N2L73l03L1pJ91k9%j06p4N8K24j20J40j20m1mr8q5Q9j26
$$ -46 -133 66 -64 -93 -210 -158 215 -88 -57 -64 127 98 98 -8 -82 -24 200 80 220 100 59 55 -43 -128 -39 -165
6013a65K57p6j13L20k99o2J1K48o2j8l3J6lk7J2M1q8J1L0r0M7j05K52j39R4q4
$$ -165 92 16 -97 223 -76 -138 -127 121 59 41 8 24 21 -6 6 47 -41 -30 0 -90 -43 -148 104 -35 59 -25
6039b5K5j3k34M62j43q6K82j67J6m8k21O0l6N1J70j36R4j17K4Q4j20j26K66j87
$$ -25 0 -13 -247 215 72 -14 268 101 117 69 -152 -92 -128 -77 93 -43 51 -66 -42 42 -78 -204 62 -125
6063a25L16j23q9K29o0l63K11M6j21J58J7J02k76J8q4K09m3N2M5m09%L19P7r3
$$ -125 191 68 -21 208 148 -215 -4 42 -79 79 96 198 -78 -60 -144 65 22 74 119 -290 -290 29 106 13
6087A3L7P1o7L8j31K9M7J25j93R3j33n8m2J52l4j7J01k2Q6j62R7j36Q6N6j50K11
$$ 13 50 121 54 92 -39 -10 37 162 -31 62 -71 -129 -171 -19 -53 -70 31 9 95 -67 30 -106 -20 36 -114 97
6113I7m9J6J42k71J49l69K30P3n8m1J38j53K71r4j99J55pk09L35m5o6k7O4j80
$$ 97 48 64 206 -65 84 -285 -55 18 -40 -81 57 -96 175 81 -118 37 30 -179 156 111 45 18 82 -98
6137i8j43K59k34K96r7k9J51k4l6p4L2L9j04R0j71J95j8j29J34J9q7P5j04N4J11
$$ -98 -241 18 -216 80 -17 -46 105 81 45 -29 3 42 -62 28 -143 52 34 -95 39 58 -29 46 -58 -4 107
6162A07K09k36k3M8m48K68J54O3K1j53o8jkJ90l44J15K12p7j43N3J53j66J69l7
$$ 107 316 80 57 105 -343 -75 79 142 163 10 -58 -59 -61 129 -215 -100 112 35 -108 -55 98 -68 101 64
6186F4Qk41K32m5J19l26J67N0m1j38Q7M0p9J6p3mnO5J03j13M3K31k51J98m17K19
$$ 64 72 -169 63 18 137 -189 -22 28 -13 -151 -64 -24 -103 -87 -160 -164 -169 -104 -1 -114 -71 160 -91 107 -310 -91
6212i1q8K27k45K75k19M4J57P6j41M7O0j92Lo6K78k49O2K42j57J7k58R5K08l05
$$ -91 -179 48 -197 78 -141 -97 60 136 -5 42 102 -90 -87 -153 125 -124 -62 180 23 40 -218 -123 85 -220
6236b20L15j17j43J87j4j55K23j30jJ07q5l4n8J82j25J55M9k33L3J80n6k76J52
$$ -220 95 -22 -165 22 8 -147 76 -54 -55 52 -33 -67 -125 57 -68 87 136 -97 -64 116 60 -216 -64
6259f4k48M88p3j73J42j5P6j17K2O9r3K8J03n5k25J25j3l2m4J32M2Q7k67J78m4
$$ -64 -312 176 103 -70 72 57 133 16 38 107 14 42 145 90 -135 -10 -23 -55 -99 33 75 162 -105 73 29
6284B9j19M0j4K95k72J38jQ0n7k29J92l90M96m16J90J15k00J39R7k98j6J14n5
$$ 29 -90 -50 -64 231 -41 97 96 176 119 -110 82 -308 188 -228 -38 77 -123 16 113 -185 -201 -87 -142
6307a42K12j49L37m23J8J33j52n7L48k29P6j18J13j27K24n7n9J77r8j63K23L3
$$ -142 70 -79 258 -165 -147 -14 -166 -223 125 -104 -28 -146 -33 -160 64 7 -52 125 27 -136 87 120
6329A20j30j5K57k60J21k07M1j45J29J12KJ12j57n9J30m3k10J66J31j81K92j8
$$ 120 -10 -25 232 -28 93 -114 -73 -218 -89 23 25 137 -20 -79 51 8 -202 -36 95 -86 206 188
6351A88J2k27j92o8K38k6O0J88p9j8j15kN8j55K41m8L2J94k39r0K71o3k28J26
$$ 188 200 -27 -219 -287 -49 -75 -15 173 94 76 -39 -41 17 -138 103 55 87 281 42 -48 223 160 -68 58
6375E8J13k62Q9K00l62N3J89k90L89k12J57p2j04K99m00J34J4j54O3J67k00K57
$$ 58 171 -91 -2 198 -164 -111 78 -212 177 -35 122 50 -54 245 -155 -21 -7 -161 -98 69 -131 126
6397A26j60j46R7J33m6N4N6k67J62j26p6J47J4J10j48J27k56K02Q5o5L1P8q5l0
$$ 126 -34 -180 -83 50 4 58 114 -153 9 -117 -193 -46 -32 78 -70 57 -199 3 88 23 54 132 47 17
6421A7J6l6R5j73K58j38L9m1l2O6J26n9Q8n2m08K46n0N8O6k34J24N9r9j14L76
$$ 17 33 -3 92 -81 177 39 78 37 5 71 197 138 226 174 -234 12 -38 20 86 -148 -24 35 -64 -178 198
6446A98j31Q8j53N5j30J01K2n0j45R5O5k1J14n1j75k1K08O1Lj64K4lp7MJ66k16
$$ 198 67 155 2 57 -73 28 50 0 -145 -50 15 -6 108 57 -118 -139 69 130 133 -31 -7 -10 -87 -83 83 -133
6472a33J69k9Q8O0j17J98k81R1l9m8qJ97J08l18m2R4m4j22R5L41k60Q8j19K1J18
$$ -133 36 7 95 155 38 236 -45 46 7 -41 -49 148 256 -62 -104 -10 -54 -176 -81 260 0 88 -31 -10 108
6497A08m7j43O8q3J39N6j34N9rKj2p7J07l6L0j27q8J59nJ19j19l0K6mpq4J37P5
$$ 108 61 -82 -14 -97 42 98 -36 23 14 16 4 -73 34 -2 28 -99 -187 -28 -33 86 -33 -63 -37 -41 -48 -132 5 80
6525H0j31mJ09j65K10k2j40j33K30K20j83k51J5K60j86p5J41L7r9l1K43k08j07
$$ 80 -51 -55 54 -111 99 77 -63 -196 34 254 71 -180 -165 95 -91 -166 -25 12 -87 -118 125 -83 -190
6548a90L20k14J70m3k2J19r4p5J47k90J9L52l90K11nq4j36J95k5p7l6L26M7k96
$$ -190 130 -84 86 43 21 140 46 -29 118 -172 -153 199 -191 20 15 -69 -205 -10 -35 -112 -148 178 225 -71
6572g1K62k23q4LJ08J55k21K46n73L52j2J86l2o4q5n6K38j05NR7j36J00O9j15
$$ -71 191 -32 -116 -113 -5 150 -71 175 -398 -46 -58 128 96 32 -53 -109 129 24 29 126 -10 90 159 44
6596D4J60j79J66j40q1K5pL6n9oJ37k3J76k49O1L8j62n5J71l6j08Q7J72n2j35
$$ 44 204 25 191 51 -30 -5 -12 24 -35 -41 96 73 249 0 61 99 -63 -118 53 17 -91 -4 168 116 -19
6621a9K17k04j30m6Q1K40j9o6K7j06j91M07j63O3k34J14J5K37j24r7j25j6mJ07
$$ -19 198 -6 -136 -182 -101 139 120 54 81 -25 -216 191 28 91 -143 -29 -14 223 99 2 -123 -139 -143 -36
6645c6j63J91K8r6L9j22O4R9M8j02J85j23P9k83K77J27l11J65%K10j55N1j52J28
$$ -36 -199 -8 20 -76 -37 -159 -95 4 52 -50 135 12 91 -192 85 212 -99 66 66 276 121 172 20 148
6669A48q7j48K99k96J08j97r6J90j84M25rj94K63l01L4j2o0J54M6k72K20%k70
$$ 148 61 -87 212 -84 24 -173 -269 -79 -263 162 153 -41 222 -79 -45 -57 -117 37 83 -189 31 31 -239
6692b39R3J15M9L5kL6m2l03K8J51M9m5J30j4m1l9N3L4P1o6r3J16j19j89J44m7
$$ -239 -146 -31 18 53 51 87 45 -258 -230 -79 -30 -75 55 41 0 -39 14 48 119 53 -40 76 -43 -232 -88 -135
6718a35K52j42P0k33j2K85k82J56l5J57J34j70j55J73j90O2K24j78R6K13j24j05
$$ -135 117 -25 45 -188 -200 85 -197 -41 -76 81 215 45 -110 63 -127 -65 159 -19 77 290 166 61
6740F1j51m9L5J15j4j6K2O6j0q0l0O6n8q1N9Q2J1P9j14L5J20k03q4qM5N1J28M8
$$ 61 -90 -139 -104 11 -3 -19 3 69 59 -21 -51 15 -43 -124 -65 17 28 107 -7 28 148 -55 -139 -147 -102 -51 77 125
6768A25k50J19j3N0P3j07j78n6K06j06N8J62j28j26J53N4l2m4m4l5M64k11j1q9
$$ 125 -125 -6 -19 31 104 -3 -181 -237 -31 -137 -79 83 -45 -171 -18 36 4 -40 -84 -119 345 134 123 34
6792C4J44k62j09K54r6n9J09r9O3K00l13K22l0J71l25j69K82K6m5j7j69P7K06
$$ 34 178 -84 -193 61 -35 -94 15 -84 -21 179 -134 88 58 229 -96 -265 17 43 -2 -19 -188 -111 95
6815I5J06k75n2J12j03N9L0q0J72qq1K45n0l4j19J21q0k19J20L9J35m3k38K42
$$ 95 201 -74 -126 -14 -117 -58 -28 -108 64 56 -25 220 170 136 17 138 58 -161 -41 -2 133 90 -148 94
6839I4k13K76k66J60L7Jj09j94J33J06k9K6j09K64k26Q0K2n5j27L5K21j31j40
$$ 94 -119 157 -109 51 88 89 -20 -214 -81 25 -4 22 -87 177 -49 31 53 -2 -129 -94 127 -4 -144
6862a44PK22q9Oj1j34L23l17M42l76L22l26J04O6Kp8j42K54j39Rj02J02O4J06
$$ -144 -137 85 -4 2 -9 -143 180 -137 305 -71 251 -75 29 95 97 19 -123 131 -8 1 -101 1 65 171
6886A71k74J39j8J10l19L21K5p2l07M51k54j08K50N4N3l09J53k9qp4J4j8J96m4
$$ 171 -103 36 18 128 -191 130 155 83 -224 227 -27 -135 115 169 222 -87 66 37 29 -45 -31 -49 147 103
6910A03p5j93J95j19J42j46o2K18j83P3J08m2L3Q8p1m2j05K7J07RJ35l95K76q3
$$ 103 28 -165 30 -89 53 -93 -155 63 -120 -47 61 19 52 140 69 27 -78 -51 56 65 200 -195 81 -2
6934bj91J74n2O5j6J36k36K14J44k44J37j5j50J80k77K0jP0PK74j93o7j36JK52
$$ -2 -193 -19 -71 -6 -22 114 -122 92 236 -8 129 114 -36 144 -133 -113 -114 -44 -37 237 44 -23 -159 -158 94
6959I4j89K67k38J88j48R6j39m1J58Jj14J96j02j21J87r8J44Jj21j8q2K47k05
$$ 94 -95 172 -66 122 -26 70 -69 -110 48 49 -65 131 29 -92 95 -3 141 142 21 3 -79 168 -37
6982c7r0J59j7p2L8l2Q0k8J50j43j18K26M1j38m2Q7O4j48J88j61j30LL11q0k48
$$ -37 -127 32 15 -57 -19 -51 29 1 151 8 -110 116 157 19 -23 64 128 -20 168 7 -123 -120 191 111 -137
7007a37M2K18j11R9r3j47J08l5J3q2K34j16K7m6j76K29P7j27k9j2K33j27p3O3
$$ -137 -95 123 12 111 18 -129 -21 -56 -43 -125 109 -7 20 -26 -202 27 104 -23 -52 -64 169 42 -31 32
7031C2p1p7J66m7O1r9LR0m6j6J07j30J86q6On3J8k2J20n4o4l8r6K7k1J14K34k38
$$ 32 -39 -116 50 3 64 -35 -32 58 12 -4 103 -27 159 73 79 26 44 22 142 88 24 -14 -110 -83 -104 10 244 6
7059FJ50p3j34J28p6j09J40l6nk3J01n0L7j25Q7K0k07K01j92L19j6j01j39o4J70
$$ 6 156 83 -51 77 1 -108 32 -4 -9 -32 69 19 56 -69 18 38 -169 32 -160 159 143 42 -97 -161 9
7084IJ38l08k8K76j90K19Rk48J4K57o0p5J53k46J50J50m0l2j02k40Q8J59k54J69
$$ 9 147 -161 -189 87 -103 116 125 -123 -109 148 88 13 166 -80 70 220 180 148 46 -194 -106 53 -201 -32
7108c2J28r5Ok06m5K82J52j32j36J19l70L50K47l70J39p3RJ63r9J09j85mK34r7
$$ -32 96 1 7 -199 -244 38 190 58 -78 41 -329 21 268 -102 37 -36 -27 136 37 146 -39 -43 191 94
7132I4J52k87P4j04O6L03l25J53j83j21m9K0L24Ol6m0k99J21L00l50L09j23J91
$$ 94 246 -41 33 -71 -5 298 -27 126 -57 -178 -227 -207 117 123 87 47 -252 -131 169 -181 128 5 196
7155A96n0j55P7O7m8k11J83K1o9j23J99k5j2k3k54K94p1N4l07J50J22O9J22l72
$$ 196 146 -9 68 135 87 -124 59 80 11 -112 87 62 50 27 -227 67 -4 50 -257 -107 15 84 206 -166
7179a66K39j6j57J58M2j89l5J58j20l0J35J16mr6j3LR0j67M0J85k74M8r7J65q1
$$ -166 73 57 -100 58 100 -89 -124 34 -86 -116 19 135 131 35 22 25 115 -52 -12 173 -101 -53 -150 15 -66
7204f6o7P7J86k53J52m1n0J9p2J6K70j03L0j75J80o2k29M40k14L0n5K8o1J41o2
$$ -66 -133 -56 130 -123 29 -12 -62 -43 -115 -99 171 68 98 -77 103 41 -188 252 38 68 13 41 -20 121 59
7229E9j27lJ11j41J16N3lj83N5NJ29n4q0K68k39N1J31k25J48J82k22j97N0J02
$$ 59 -68 -71 40 -101 15 68 65 -118 -63 -58 71 17 -63 205 -34 17 148 -77 71 253 31 -166 -116 -14
7253a4l2j54K64J01l65J91P6k69J98p7j0Q5p4J95j50L2L9r4R9j68j7L39j66P4
$$ -14 -46 -200 64 165 -200 -9 67 -202 -4 -81 -91 -6 -80 115 -35 -3 36 -58 41 -127 -144 195 29 103
7277A03P0k21L7J0k41K57J51j1j89P1p1M0j00K31j02j81K76j81K63k29L78l82
$$ 103 173 -48 -11 -1 -242 15 166 155 -34 37 -34 6 -94 137 35 -146 130 -51 212 -17 361 -21
7299b1j9k2r4L19k27l0K36q4o5m4K09j73j44K13N3k01M3j98K83j60Q2J49k75O4
$$ -21 -40 -62 -156 163 -64 -94 142 58 -7 -51 158 -15 -159 54 107 -94 -51 -249 34 -126 -44 105 -170 -106
7323a06M1O6nn4R3J12kl50L90j85N0k31J39J59j01j8p7K16k12J11Nj22J41o0J42
$$ -106 -65 1 -4 -58 35 147 145 -205 185 0 50 -181 -42 117 16 -2 -79 137 -75 36 41 -81 60 0 142
7348A42k61K39r3K2n7j52O7j68K02N1J45K0j16J22k9m2j33pJ42j28K29k01N2j67
$$ 142 -119 120 27 49 -8 -160 -93 -261 -59 -8 137 157 41 163 134 92 -41 -48 94 -34 195 -6 46 -121
7372a21J44J66j99j09J55pr4J20p4J67j03j26J09p6R3k1j10J76m6jm3n2l2J25
$$ -121 23 189 -10 -119 36 29 -65 55 -19 148 45 -81 28 -48 45 24 -86 90 44 43 0 -52 -84 41
7396D1j24P9j2J23j78M4J95k27j27K60q3M9j43R0J17l3k21Q1j22K47Q7j63j5j70
$$ 41 -83 -4 -16 107 -71 -27 168 -59 -186 74 -9 40 -103 -13 104 71 -150 -69 -191 56 143 -20 -35 -205
7420b05J15J35n7J14j7n1R1J0k42J75j17J79l70K76p4J59k16J37k0p8j3NJ19j52
$$ -205 -90 45 -12 102 85 34 125 135 -107 68 -49 130 -240 36 -38 121 -95 42 22 -56 -69 -64 55 -97
7444i7P5l6M8r2j2K9Rm3M23l78J67j3j2j73k2k2J33J57j77J27p9k06M4J45J27
$$ -97 -22 -58 -10 -102 -114 -85 -76 -119 304 -74 93 80 68 -105 -127 -149 -16 141 -36 91 12 -194 -150 -5 122
7469A22l6M8o3j84K57j0j90R5j18J93k99n5K12J22J70l73R9J0K2q1J46m4k57J80
$$ 122 86 134 71 -113 144 134 -56 39 -79 114 -185 -240 -28 94 264 -109 -10 0 22 -59 87 43 -214 -34
7493c4R8P8j62K57k92Q3%j4J77J6k44mj6n6M05k05k5r2m2j19Q1K08L4j56J96j70
$$ -34 64 142 -20 237 -55 28 28 14 191 207 -37 -41 -57 -113 292 87 62 -30 -72 -191 -110 98 132 -24 172 2
7519Bo3L19j66Pmj64l7K08k26J25J16j11P1j45j12M2R9J24J35q9n3q0l8p3P7M9
$$ 2 -61 258 92 99 95 -69 -106 102 -124 1 117 6 77 -68 -180 -138 -39 85 220 131 78 -2 -40 -113 -36 13
7545A3P6n0R0j83J16n9j41L58l30J33N9j63K03k01r9J53NJ9k2J22j96J38L0j37
$$ 13 89 39 129 -54 62 3 -138 220 -110 23 82 -81 122 -79 -178 -25 -20 -1 -23 99 -97 41 71 -66
7569f6J48o1N2k84Q1PL41k35J1j68K18j29M6J14j67J29L4j22J33m1J07j18j23
$$ -66 82 21 73 -211 -130 -123 218 -17 -6 -174 44 -85 -39 75 -92 37 71 -51 82 41 148 30 -93
7592i3O7J5J17k83J76rP7j41K02j07Q6n1j04O6O7Q1l96N2K45k20J71M1j6O4p9
$$ -93 -26 -11 106 -177 -1 -10 67 -74 128 21 107 56 -48 18 85 166 -230 -178 67 -153 18 59 43 107 28
7617B8Q5P9j35j89J46j09L31l03J6M6j65Q2M9J65k50J3J42o4j91L17p9K1R0r0
$$ 28 113 192 57 -132 14 -95 236 -67 -51 -5 -170 -88 -39 126 -124 -111 31 -33 -224 93 14 35 125 35
7641C5Noj97K9J20j90J47J51j9j20K04k60j4K76k49J02k04K17O7j49j2p0J39q2
$$ 35 40 34 -163 -134 -14 -204 -57 94 75 -45 159 -101 -115 161 -88 14 -190 27 94 -55 -67 -137 2 -80
7665h0R2j08J53Q1j44P0J31j95L7K7l8N4l6r8j1J24N6j02j27J80rJ11p7L1j31
$$ -80 12 -96 57 138 -6 64 195 0 37 64 26 80 44 -54 -65 59 115 13 -114 66 57 168 91 122 -9
7690iK37l76K24J6r0p4K58k80J36J70l91J99J17n8k48K04j83L61k43J52j59j36
$$ -9 228 -148 76 92 2 -72 186 -94 42 212 -179 20 137 79 -169 35 -148 213 -30 122 -37 -173
7712a73J79k0K0n0Q5q8l4M0P7j25K44K6j27O3n1k14K60k63J50k0p7Q7QJ23j04
$$ -173 6 -14 6 -44 41 -47 -81 -41 36 -89 155 181 54 117 66 -148 112 -151 -1 -21 -98 -11 -3 120 16
7737A6l9P4K4j49J29Jj33J29Kj49Q1J41j94r7k5K32J7l0j29J0J68k57K59q0J30
$$ 16 -23 51 75 -74 55 56 -77 52 54 -95 -14 127 -67 -164 -189 43 60 30 -99 -89 79 -178 81 1 131
7762A31l42K67q7j51K39j69J80J16k14j5r6P3Oj56K06J60L9k60N7P2p7J73l28
$$ 131 -211 56 -31 -182 57 -112 68 184 -30 -45 -141 -68 -62 -218 -12 148 187 -73 -16 56 -21 152 -176
7785a76Q1L4P1M6l0K0M0P0k27l6J48j01J72K9j25N2R2k31Q4K0o9j00J05J43K9
$$ -176 -95 -61 10 56 26 46 86 156 -71 -107 41 -60 112 141 16 68 160 -71 13 33 -36 -136 -31 112 141
7810A41k27J16J56k78J12j8qj38K26o8o2j66J66P8m3L3mj24K27k40K08P4l26J51
$$ 141 -86 30 186 -92 20 2 -6 -144 82 14 -48 -214 -48 30 -13 20 16 -108 119 -121 87 161 -165 -14
7834a4M5M7m7j5mk25J84j50L30k44J13j02l4J41n4j28q0L41j21L16n7k83O9k7
$$ -14 31 78 31 16 12 -213 -29 -179 151 -93 20 -82 -116 25 -29 -157 -237 104 -17 299 242 -41 28 1
7858AP8j55L8K68l52l5K92l01R9j07J02K36P7j93k1q5K6O2q7RJ95P2l7j36j12
$$ 1 79 -76 -38 230 -122 -157 135 -166 -67 -174 -72 164 241 48 27 -58 -32 30 -57 -48 147 219 182 46 -66
7883f6R2Q2p6k20M32j11m8j1k91L63o5j33J00j19k9R6R5k96K70p3j34J13N0n3
$$ -66 26 108 32 -188 244 133 85 74 -217 146 81 -52 48 -71 -100 -4 91 -205 65 -8 -142 -29 21 -32
7907c2R3p2J5l9M2j26K67j30J15r0j84%K19p7j93K28k96M04J8j14J5k38K73J56
$$ -32 61 -11 4 -35 7 -119 148 18 133 43 -141 -141 78 1 -192 36 -260 144 162 48 63 -175 98 254
7931B54o5j71r0k7J81M1j77j62K69j66J93j60p2J40J18KK6l01J79p2o3K26kO4
$$ 254 189 18 -72 -99 82 123 -54 -216 53 -113 80 -80 -152 -12 106 108 134 -167 12 -60 -123 103 101 165
7955A65k71J92%jj56m8J64j55K02nJ93j84K3o8k15K16k04J44JJ98m02M9R0K2J35
$$ 165 -106 86 86 85 -71 -119 45 -110 92 87 280 96 119 51 -164 52 -152 -8 -7 191 -211 -162 -72 -50 85
7980H5j73J97j90J89j47P7o2j40J96L9jn1n7R5R1k4p6j80J02J48m28L35K0k50
$$ 85 -88 109 -81 108 -39 38 -24 -164 32 71 70 19 -38 57 148 124 48 -132 -30 118 -310 25 45 -205
8004b05M23k37L42k04j39r4L02j19j6O3o7k43K19o5J11j34j52L19q0m9J03N4p5
$$ -205 218 -19 323 119 -20 -114 188 69 53 116 49 -194 25 -40 71 -63 -215 104 24 -25 78 132 57
8027E7K0j04P9J60r6k82J59L6q7K77k72J75J2k13K7l5n9k8K05l8JN5j74m3Q0J47
$$ 57 77 -27 52 212 116 -166 -7 29 -58 219 -53 122 134 -79 -52 -87 -146 -174 31 -7 -6 49 -125 -168 -88 59
8053E9j24p0K03j02L24l84L39l04R7l05K74l8jq8l4J78k80L07j32J43k69M03k72
$$ 59 -65 -135 68 -34 290 -94 245 -59 38 -267 7 -31 -32 -120 -154 24 -256 51 -81 62 -207 196 -76
8076g6j42L79m1o2m7j64O6LK60k50K17K9k42L9P0M2j40J94k17O1l0K7k4K18r3
$$ -76 -218 161 120 58 11 -153 -87 -84 176 -74 143 172 -70 -31 39 81 -59 135 -82 -21 -51 -24 -48 170 77
8101G7j13m2q5J09l2K8L41k96Lk4j19K11p2L67j38j80j84K13J08l34L6L43j76
$$ 77 -36 -78 -163 -54 -86 -58 283 -13 -10 -34 -153 58 -14 353 215 35 -149 64 172 -162 -126 217 41
8124D1r7J1K62p7k34K18k39q1kK21j09m6O2r0K34O7l41OJ97m6mJ92j35J5M5j4
$$ 41 -56 -45 217 140 -94 124 -115 -196 -198 23 -86 -132 -70 -160 74 141 -200 -194 3 -43 -47 145 10 25 70 56
8150E6o7P3k9J7j41O9j71K04P0Qj70p1jm5L31j99mO3l9j49M4n0L30k83K85j92
$$ 56 -11 62 33 50 -91 -22 -193 11 81 89 -81 -152 -153 -198 133 -66 -70 -7 -46 -195 -151 -201 129 -154 131 -61
8176f1%r2J70k6M1l4l6j04J56J80j22M2R3j55j08
$$ -61 -61 -153 17 -9 32 -2 -38 -142 14 194 72 114 207 52 -56
8191e6
$$ Imaginary data points
##PAGE= N=2
##DATA TABLE= (X++(I..I)), XYDATA
0@%%%%%%%%%%Qj6J6j6K4l2M0m9N7p2Q8j04J28j52J76k08K40k80L24l70M22m80
$$ 0 0 0 0 0 0 0 0 0 0 0 8 -8 8 -8 16 -16 24 -25 32 -40 48 -56 72 -80 96 -112 128 -152 172 -198 224 -256
32b56N48o22P04p94Q93j003J121j251J395j551J724j913K114k336K582k846L135
$$ -256 292 -330 374 -420 473 -530 591 -660 735 -816 908 -1005 1109 -1227 1355 -1491 1644
49A644l456L809m195M622n098N630o229O905p677Q571r618J0865j2378J4258j6673
$$ 1644 -1812 1997 -2198 2424 -2674 2956 -3273 3632 -4045 4526 -5092 5773 -6605 7653 -9020
64i020J9906k4479L1491m3723P1100k45111O3395L66812k68689p1230J63242Q825
$$ -9020 10886 -13593 17898 -25825 45275 -199836 -136441 230371 -38318 -109548 53694 62519
76F2519j74298N8438J04624N0674O0167j2117j86956j56J14096j16405j01666
$$ 62519 -111779 -53341 51283 101957 162124 150007 -36949 -37105 76991 -39414 -141080
87a41080K24271O2409k48089n0508J78301n4367j20197J40618J15671j11177P193
$$ -141080 83191 145600 -102489 -152997 25304 -29063 -149260 -8642 107029 -4148 3045
98C045P7680j35317o3797J96781M2948j51151J6151Q5920q8977n7597Q6371K033
$$ 3045 80725 -54592 -118389 78392 121340 -29811 -13660 72260 -16717 -74314 12057 14090
110A4090l8483R8480l272j61079N0323J49296j21350j04704J68173M1525j94946
$$ 14090 -24393 74087 70815 -90264 -39941 109355 -11995 -116699 51474 92999 -101947
121a01947l911J67877m3956j25302P3939P0013m6748L5450K7979q1521M5096J13024
$$ -101947 -105858 62019 18063 -107239 -33300 36713 -10035 25415 53394 -28127 16969 129993
133A29993j03771j09571J38295P7464j63427n7982J20814k8396j09528O0712M9633
$$ 129993 26222 -83349 54946 132410 -31017 -88999 31815 3419 -106109 -45397 4236
144D236o4403L3700N4985p8007j977J21939j9742r6104R0729R8989j26500q5504
$$ 4236 -60167 -26467 28518 -49489 -51466 70473 50731 -45373 45356 144345 17845 -67659
156f7659J10970J9596r6917J7440L4985n3610O247K9925p0429r450J24267O483
$$ -67659 43311 62907 -34010 -16570 18415 -35195 -28948 977 -69452 -78902 45365 51848
168E1848j22768L8205J18755p0763q0876R5778M0592p8219L205L3328m4638k681
$$ 51848 -70920 -32715 86040 15277 -65599 30179 70771 -7448 -4243 29085 -15553 -18234
180a8234M9059m1110m2480Q3205K6127j12093M338J14710l4731q6362N3361M4771
$$ -18234 30825 -10285 -52765 30440 56567 -55526 -51188 63522 28791 -57571 -4210 40561
192D0561n0835q252K4612k8836N21N3585l2158o1740P1658N9383q9729k5640R8535
$$ 40561 -10274 -18526 6086 -22750 -22229 31356 -802 -62542 9116 68499 -21230 -46870 51665
205E1665N27p7664J7320M6221k4663j9222J2710k4172r974M4089k1839o3041N5455
$$ 51665 52192 -25472 -8152 38069 13406 -5816 6894 -17278 -27252 16837 -5002 -68043 -12588
218a2588O4795p2812m2541Q0539K8394n9992p72M9929n276k3151Q212j7733j1931
$$ -12588 52207 -20605 -63146 17393 45787 -14205 -14977 34952 29676 6525 14737 -2996 -14927
231a4927M3056q959o2697K7014N5531n0926n0183N3273M0658m0682j4506L6840
$$ -14927 28129 19170 -43527 -16513 39018 -11908 -62091 -8818 31840 -8842 -23348 13492
243A3492j835j7465J4591r005j0960M1425L035n8123K175N1157j7321m7577K4386
$$ 13492 11657 -5808 8783 -222 -11182 30243 33278 -24845 -22670 28487 11166 -36411 -12025
256a2025M3316k4850k8935J5411M651m1J5233j4624j4090L4282P604m9512p660
$$ -12025 31291 6441 -22494 -7083 -2432 -2473 12760 -1864 -15954 18328 25932 -23580 -31240
269c1240N2597P893m8447o53L9980r070k8429N847J2244R319N460k1509j3173
$$ -31240 21357 29250 -19197 -19850 20130 11060 -17369 -11522 722 10041 15501 -6008 -19181
282a9181K7287J4290l2620j4454L9374J4825m2806j1750L3117N067j7859m235
$$ -19181 8106 22396 -10224 -24678 14696 29521 -13285 -25035 8082 13149 -4710 -8945
294h945N045R984L329j6342j0388K0419J9073k1092k4103K4356K2694k4972j6717
$$ -8945 -3900 6084 9413 -6929 -17317 3102 22175 1083 -23020 1336 24030 -942 -17659
307a7659J8454J3656q324j6792j991J8107P505j5357j3355J2406K0226j3024k3968
$$ -17659 795 14451 6127 -10665 -12656 5451 12956 -2401 -15756 -3350 16876 3852 -20116
320b0116J5792K5180j1042k1773K143J9309L473k0883n755J8512P655j5427j5164
$$ -20116 -4324 20856 9814 -11959 -9816 9493 12966 -7917 -13672 4840 12495 -2932 -18096
333a8096Q719K0451m372j8579M606J8236K295j6488r232K0714J4580k0123j4677
$$ -18096 -9377 11074 6702 -11877 -7271 10965 13260 -3228 -12460 8254 22834 2711 -11966
346a1966J2834J0826j1707j5964N140J5956j930j3538o371J0488J7707q405j8905
$$ -11966 868 11694 -13 -15977 -10837 5119 3189 -10349 -16720 -6232 11475 3070 -15835
359a5835J7103K4240j4833k1277J0794J9646p864j8874K504R765j877q287j2841
$$ -15835 1268 25508 10675 -10602 192 19838 11974 -6900 -4396 5369 3492 -4795 -17636
372a7636K323K2879k816k6245P838K9178n723k5092Q478K6616m925j8275L769
$$ -17636 -15313 7566 4750 -21495 -13657 15521 9798 -15294 -6816 19800 14875 -3400 369
385C69O062k01J43j2496o256K1505M144k8075m837K9354L613k8216J991K7232
$$ 369 6431 6230 6373 -6123 -12379 9126 13270 -14805 -19642 9712 13325 -14891 -12900 14332
399A4332n441j7378N167K426n22Q198q158j3718J6174J5697k2680j5432K9959
$$ 14332 8891 -8487 -3320 -894 -1416 6782 -1376 -15094 1080 16777 -5903 -21335 8624
412H624J5352k8666m971K5468l573j4996M661n27m561R680n306k2421O840K4761
$$ 8624 23976 -4690 -9661 15807 12234 -2762 1899 1372 -3189 6491 1185 -21236 -14396 10365
426A0365j4980k5788K5431K4902k5486r381K6131M093j0265N611k0o756R490K245
$$ 10365 -4615 -30403 -4972 19930 -5556 -14937 11194 15287 5022 10633 10613 3857 13347 15592
440A5592k5796m255K8819r470l6096J4974K7250k1253j4354K2021P637q739O285
$$ 15592 -10204 -14459 14360 4890 -31206 -16232 11018 -10235 -24589 -2568 5069 -3670 2615
453B615M507q259J0562J3990k3170j1462L2105M0l9654O177K9936j5965k2067
$$ 2615 7122 -1137 9425 23415 245 -11217 20888 20928 -18726 -12549 17387 1422 -20645
466b0645J4715R358j1116M113N889j3449P408K2464j9372k0298L1355J1669l5062
$$ -20645 -5930 3428 -7688 -3575 2314 -11135 -3727 18737 -635 -20933 10422 22091 -12971
479a2971k006L0588o080k2821J1343J2608j2352J928R981j5406Q40K4348j5415
$$ -12971 -14977 15611 9531 -13290 -1947 10661 -1691 237 10218 -5188 -4348 20000 4585
492D585k6799K4114J8755l1710j3813K8613L490k3562O075J4255j0499M588J5139
$$ 4585 -22214 1900 20655 -11055 -24868 3745 7235 -16327 -10252 4003 -6496 -1908 13231
505A3231j5723l557K8725m629k9602J4352K4034k3976k1116K3464N802k6907J082
$$ 13231 -2492 -6049 22676 18047 -11555 2797 26831 2855 -18261 5203 11005 -15902 -14820
518a4820J4729j1638M28J4999j3177o615K8752M269l0131P683L3960j3440k7085
$$ -14820 -91 -11729 -11301 3698 -9479 -16094 12658 16927 -13204 -5521 28439 14999 -12086
531a2086J7983J2626k1634j315J1604j4596l035J6808j0544j6782K0794J2960
$$ -12086 5897 18523 -3111 -4426 7178 -7418 -10453 6355 -4189 -20971 -177 12783
543A2783k5706k350L1528n828k6615J6077J7975j8107m645J1874p996l616J5019
$$ 12783 -12923 -15273 16255 10427 -16188 -111 17864 -243 -4888 6986 -1010 -4626 10393
556A0393p295k0194J7613K0105k5728j4219K9837M066k5637O083J4966j3017m647
$$ 10393 3098 -17096 517 20622 -5106 -19325 10512 14578 -11059 -4976 9990 -3027 -7674
569g674J2627p275r641J5774K285k1039R484K2972j8420j5252K7361Q015k5587
$$ -7674 4953 -2322 -11963 3811 6096 -14943 -5459 17513 -907 -16159 11202 19217 -6370
582f370J171J7875p224q743Q475n662j1338J4760M808k5452K297K7922r796k1503
$$ -6370 -5199 12676 5452 -3291 5184 -478 -11816 2944 7752 -17700 -15403 12519 2723 -18780
596a8780J7218J4137j5744j420J5476m903q547J0980j106j4508J0339R309k1664
$$ -18780 -1562 12575 -3169 -4589 10887 5984 -2563 8417 7311 -7197 3142 12451 -9213
609i213l257K4074p195k4130J2390J8903j2772r550J3136J213p321R374k61j4283
$$ -9213 -12470 11604 4409 -19721 -7331 11572 -1200 -10750 2386 3599 -3722 5652 5391 -8892
623h892J0967J3879j9155j0378K0946L069k0665L645J6661r329j0188J2517J228
$$ -8892 2075 15954 -3201 -13579 7367 10436 -10229 -6584 10077 748 -9440 3077 4305
636D305j0049Q345L780j4154N442J4099j3796j2306J8293Q550k0270l320J7847
$$ 4305 -5744 2601 6381 -7773 -2331 11768 -2028 -14334 3959 12509 -7761 -11081 6766
649F766k358j0994Q141J774p443Q408L861j4227J233J6707p350j6315J0945J1872
$$ 6766 4408 -6586 1555 3329 -4114 4294 8155 -6072 -4839 11868 4518 -11797 -852 11020
663A1020j5964o304J5603q68j1115O446L623o590N049N253j0164r91J5353l126
$$ 11020 -4944 -11248 4355 3487 -7628 -1182 2441 -4149 900 6153 -4011 -5002 10351 7225
677G225j7420P488J5317j2082r786J1686J658q667L734K354o415L292Q105q573
$$ 7225 -10195 -2707 12610 528 -9258 2428 4086 -4581 -847 1507 -4908 -1616 6489 -2084
691b084o619J3829L101j5807K894J4565p412r742Q257L580o612J335K805n163
$$ -2084 -8703 5126 8227 -7580 -4686 9879 2467 -7275 982 4562 -2050 -715 2090 -3073
705c073J122Q064o743q473J2089O260j4799j530J3477k448r299M013M574l727
$$ -3073 -1951 6113 -630 -9103 2986 9246 -5553 -7083 6394 3946 -5353 -1340 3234 -493
719d93l71K825m811k84R066m351r844R147P592j1125m405J0616J608q307Q13M892
$$ -493 -864 1961 -2850 -3134 5932 1581 -8263 884 8476 -2649 -7054 3562 5170 -3137 -2324 2568
735B568k329j134L218m509j329Q781k520r891N516Q611p314o351P384M440o577
$$ 2568 239 -895 2323 -2186 -3515 5266 2746 -7145 -1629 6982 -332 -6683 701 5141 -1436
750a436j005M203j774l91L502m632k207P990l69r402K151Q829l395p527M083N703
$$ -1436 -2441 1762 -12 -403 3099 -1533 -3740 4250 3881 -5521 -3370 5459 2064 -5463 -1380 4323
766D323m268k767K954l91N90K809m544k329O554J396p813m60P911j00q453J336
$$ 4323 55 -2712 242 -149 441 3250 -1294 -3623 2931 4327 -3486 -3946 3965 3865 -4588 -3252
782c252O295k587k471J607j31J085K202l388k408N035K894n491l335O410J769
$$ -3252 3043 456 -2015 -408 -539 546 2748 -640 -3048 1987 4881 -610 -3945 2465 4234
797D234o821o51M541m45j822n86p94J944K236k155k905L694M686m268m399M878
$$ 4234 -2587 -3238 1303 858 -964 -1550 -2344 -400 1836 -319 -3224 470 5156 888 -3511 1367
813A367L783m991k465K773J324j035k382r96K043J840k174k905K403M661k340
$$ 1367 5150 159 -2306 467 1791 756 -1626 -2622 -579 1261 -913 -3818 -1415 3246 906
828I06m544L319L946k380k309O07K709k0k902j296K036J484q54l171Q05L768j097
$$ 906 -3638 -319 3627 1247 -1062 -455 2254 2234 -668 -1964 72 1556 702 -2469 -1664 2104 1007
845A007l505R44K937L50k556j410K532J772k444j736J326K264l81k734L4L085
$$ 1007 -2498 -1554 1383 1733 -823 -2233 299 2071 -373 -2109 -783 1481 1100 -1634 -1600 1485
861A485M28j847r30J756K445k316l257J783K720j676l231J98K581L1l112QK308
$$ 1485 1913 66 -864 892 3337 1021 -2236 -453 2267 591 -2640 -2442 139 170 -2942 -2934 -626
878f26J629l57j952O64M169p22l927J244L604n52m025p91K991n34k794k39N40
$$ -626 1003 646 -1306 -642 3527 2805 -1122 122 3726 3174 -851 -1642 1349 815 -1979 -2218 -1678
895a678J152M58k660o00M450J006l410l73M395J040l943p35L483k77k095l46o07
$$ -1678 -526 -68 -2728 -3328 1122 2128 -1282 -1655 2740 3780 -163 -898 2585 2308 213 -133 -740
912g40M56J407k485k095K982K656l414k576M184K535m252p96L710j46j360L16
$$ -740 -284 1123 -1362 -3457 -475 2181 -1233 -3809 375 2910 -1342 -2138 1572 1426 66 382
928C82q69L37J905o81l385J624M013k347m512L802L555m235j585K613M2j199J71
$$ 382 -487 -150 1755 1074 -2311 -687 3326 979 -3533 269 3824 -411 -1996 617 659 -540 -369
945c69r65n85K150Q19m104J44N654p78n212K959M598l075j953K235M18j344L48
$$ -369 -1334 -1919 231 1050 -3054 -2910 2744 1966 -3246 -287 4311 1236 -717 1518 1936 592 940
962I40p60k219J798K032m495j739N704k1n219J704N049j690k848K409J394j450
$$ 940 180 -2039 -241 1791 -2704 -4443 1261 1240 -3979 -2275 2774 1084 -1764 645 2039 589
978E89J058L23k860J104L440m277l348N147J199n361k89M316m98k912J748J545
$$ 589 1647 1970 -890 214 3654 -623 -3971 1176 2375 -2986 -3275 1041 543 -2369 -621 924
994I24j483J311J274l476P10M335k553m384L963K929m783j650M040O01l679J460
$$ 924 -559 752 2026 -1450 -740 3595 1042 -3342 621 3550 -1233 -2883 1157 1758 -1921 -461
1010d61J546k066J210J997l856m81N154j553n129K640M236l517l214M019J455
$$ -461 1085 -981 229 2226 -1630 -2111 3043 1490 -3639 -999 3237 -280 -3494 525 1980
1025A980l427J070J976k561R66K780l267j754M571J07n161O48N229k601m293L442
$$ 1980 -1447 -377 1599 -962 4 2784 -483 -2237 2334 2441 -2720 -2072 3157 556 -3737 -295
1041b95J801l171N83K030k115M39L545k435k882L919K306n102j020N050o80m645
$$ -295 1506 -1665 -1082 948 -1167 -728 2817 382 -2500 1419 3725 -1377 -2397 2653 1973 -2672
1057b672K505J758l020M31J993k059j99K903q34l798L098L911m816k035M977M45
$$ -2672 -167 1591 -1429 -998 995 -1064 -1263 1640 806 -2992 106 4017 -799 -2834 2143 2588
1073B588m513Q65K715k046l88J603j719j188L576J21m410J548M779l449l336M560
$$ 2588 -1925 -1060 1655 -391 -779 824 -895 -2083 1493 1614 -2796 -1248 3531 82 -3254 1306
1089A306R30l744P94K172j614j146K283r82k057L309Q40m735R00N185k630l963
$$ 1306 2236 -1508 -714 1458 -156 -1302 981 -1 -2058 1251 2091 -2644 -1744 3441 811 -3152
1105c152L355K481l050q40K193j011j258K751j039l138L004K405m480n77M490
$$ -3152 203 2684 -366 -1206 987 -24 -1282 1469 430 -2708 296 2701 -1779 -2356 2134
1120B134o74m213J975L094k777j070K635l91j778K062j23l221K651K692m036k002
$$ 2134 1460 -2753 -778 2316 -461 -1531 1104 713 -1065 997 874 -2347 304 2996 -1040 -3042
1136c042M181J155m374N73L504j813j734K636q74j801K716M54l522J391L153k730
$$ -3042 1139 2294 -2080 -1507 1997 184 -1550 1086 212 -1589 1127 1581 -1941 -550 2603 -127
1152a27k341L080J748l619l82L375j227k254K051q4j538K085Q68l314M98L495
$$ -127 -2468 612 2360 -1259 -1641 1734 507 -1747 304 220 -1318 767 1635 -1679 -1181 2314
1168B314j077l930K552K661l053j406K712k86j748J647M6j635J372J312k236j009
$$ 2314 1237 -2693 -141 2520 -533 -1939 773 487 -1261 386 432 -1203 169 1481 -755 -1764
1184a764L674j46l752J530L100k583j832K524j19j486R18K37j417R18J684j926
$$ -1764 1910 1764 -1988 -458 2642 59 -1773 751 632 -854 64 301 -1116 -198 1486 -440
1200d40j807L359R78l570K53L109j431j738J514O98j439N81P03j757L02K163j413
$$ -440 -2247 1112 2090 -1480 -1227 1882 451 -1287 227 925 -514 67 770 -987 -685 1478 65
1217F5k396K852J484l144m03K928k48k027P70R46j284M50N63j352j60K224q24
$$ 65 -2331 521 2005 -1139 -1542 1386 1138 -889 -119 827 -457 -7 556 -796 -956 1268 444
1234D44k435J808K269k105j075J754P40j693n1J161j091J02Q77j463n92K233l95
$$ 444 -1991 -183 2086 -19 -1094 660 1400 -293 -344 817 -274 -172 705 -758 -1350 883 488
1251D88k480R91K177j089j548J533J146j112p1P31m53j26J074j376q26J842J23
$$ 488 -1992 -1001 1176 87 -1461 72 1218 106 35 766 313 187 1261 -115 -941 901 1024
1268A024k447K08J915l90j703P91J335p15j43N32l51L9J072r44r04J071J020j932
$$ 1024 -1423 -1215 700 310 -1393 -602 733 18 -125 407 56 95 1167 223 -681 390 1410 -522
1286e22p26J785K36j592M3J208o93o2M93m97K34Q73p94p27O25J342j212j235J373
$$ -522 -1248 537 773 -819 -776 432 -261 -323 170 -327 -93 780 -14 -741 -116 1226 14 -1221 152
1305A52P61j337j90R90k95K96j89k32L05O56l84j234J05J267o36j335O38Q78n19
$$ 152 913 -424 -614 376 81 377 188 -44 261 917 533 -701 -596 671 35 -1300 -662 216 -303
1324c03n91N68L33J1J21k11J70O99R3r37k10J405l06j502L20Q46l94o59n99P19
$$ -303 -894 -326 7 18 139 -72 98 797 890 -47 -257 1148 842 -660 -340 506 112 -547 -1146 -427
1344d27L01k91m29L32P12Q55j110p0J050O1r36L6M98Oo21n30N09J99k11n77q5
$$ -427 -126 -417 -846 -514 198 1053 -57 -127 923 984 48 84 582 588 -33 -563 -54 145 -66 -643 -728
1365g28P84L40q65k16R09J36k54l27K74P81o66o67O60K02O4q00p7O35L26n92k41
$$ -728 56 396 -469 -685 224 360 106 -221 53 834 168 -499 161 363 427 -373 -450 185 511 -81 -322
1386c22L65K58rp02R4N22N0n73k05M40L12o85l18Q86K57m20J59k08N59K03p99
$$ -322 43 301 292 -410 -316 206 256 -317 -522 -82 230 -455 -773 113 370 -50 109 -99 460 663 -136
1407a36k35R33J03n63m05K48M92o41n33O80L8j61k7m34N23N34o4m60K88P11m85
$$ -136 -371 562 665 102 -303 -55 437 -204 -737 -57 -19 -180 -207 -641 -118 416 352 -108 180 891 406
1428D06r62O65O68q85o23M06K75J41m85j08K69M02J99o37j58J001k05q91N47N51
$$ 406 -556 109 777 -108 -731 -325 -50 91 -394 -502 -233 169 368 -269 -427 574 369 -522 25 576
1448E76m84l20L43j58m9Q3j71k25N19N17r66k29R27K56j128J49R66m88l13K16
$$ 576 92 -228 115 -43 -92 -9 -180 -405 114 631 -335 -564 363 619 -509 -360 606 118 -195 21
1468B1m5j61N65l43n32M28O72o54o68J250K17j245J00J002k57o80M30P7n54N65
$$ 21 -24 -185 380 37 -495 -67 605 -49 -717 533 750 -495 -395 607 350 -330 100 177 -377 188
1488A88k36n19K61J111o47j047J237N38j093l16Q07j68m65K60J95k10K11K65p64
$$ 188 -48 -567 -306 805 158 -889 348 886 -207 -523 284 116 -349 -89 106 -104 107 372 -392
1507c92Q0Q91m04q91P74O64p06n36P62K56q06L09K8m23L00P39r89j99J324n03
$$ -392 -312 579 175 -716 58 722 16 -520 242 498 -308 1 29 -394 -94 645 -344 -543 781 278
1527B78j074N93Q97o75p52P27L60p89N04K15m77J1R97r40n23R21K75j042k85J393
$$ 278 -796 -203 694 19 -733 -6 354 -435 69 284 -193 -182 815 -125 -648 273 548 -494 -779 614
1547F14m32o66M62L28l58k9K78p17K55Q55m11p74R60O58j431k50J487k32j156
$$ 614 182 -484 -22 306 -52 -81 197 -520 -265 590 179 -595 365 1023 -408 -658 829 597 -559
1566e59O97L89r07L87K50o11j19R93r6j136O97R15j028p21J220J83p21MO18o10
$$ -559 138 527 -380 7 257 -354 -473 520 424 -712 -15 900 -128 -849 371 554 -167 -163 455 -155
1586a55K5L34l62l99R70P1j291M67J369o26j017Q34K33p31j1O69k97j54N94n63
$$ -155 -130 204 -158 -557 413 484 -807 -340 1029 403 -614 220 453 -278 -289 380 83 -71 523 -40
1606d0n97P83O19j334L51R60m03r63O88M11m20k61N95l81k14N89m67o81O92O53
$$ -40 -637 146 765 -569 -218 742 339 -624 64 475 55 -206 389 8 -206 383 -84 -765 -73 580
1626E80j281o1J424l73q93L71O50n10j59O99k31m04O08K6j038N18P78j118m50
$$ 580 -701 -762 662 289 -604 -233 417 -93 -252 447 216 -188 420 446 -592 -74 704 -414 -864
1645h64J086J50q22j42J018l07l75N66k55l77Q27L4j094L55J076p77q56Q58O10
$$ -864 222 372 -450 -592 426 119 -256 310 55 -322 505 539 -555 -200 876 99 -757 101 711
1664G11j062r3R46n42k52N49l45l09O21J86q22j7R09j89r73M68O86p01l21O58
$$ 711 -351 -444 502 -40 -292 257 -88 -397 224 410 -412 -429 480 291 -682 -214 472 -229 -550 108
1684A08J1l50M88k06k47K89M19p78Q0O37K66j292L42P10o06o22R35k78k66N96
$$ 108 119 -231 257 51 -196 93 512 -266 -186 451 717 -575 -233 477 -129 -751 184 -94 -360 236
1704B36j82j05L4O95o61k61N28K65q13N6N44k62m38K23J70k55K67M5l33Q7L86
$$ 236 54 -51 -17 678 17 -244 284 549 -264 -208 336 74 -364 -141 29 -226 41 86 -247 -160 226
1725B26k00n07N61M98q38Q7L82K14n89J03J43k44K78j10k28q3N94Q4q84M71O12
$$ 226 26 -481 80 578 -260 -173 209 423 -166 -63 80 -164 114 4 -224 -307 287 371 -513 -42 570
1746E70n91m57M87M2r3J21J00m37K58m3p6j62O48P3p57N6O44j22n03M01o8j69
$$ 570 -21 -478 9 51 -42 79 179 -258 0 -43 -119 -281 367 440 -317 -261 383 261 -242 159 91 -78
1768g8j16K31k67J31N6j90j17N08O0l35P8M45j24n03M97M2k31K8p6j02k6J80k28
$$ -78 -194 37 -230 -99 -43 -233 -350 158 218 -117 -39 406 282 -221 276 318 87 115 39 -63 -89 91 -137
1791a37m39N39J84l61l02O58j3l21N0L82j9kj90j65J82J68N6n89J17N28m78l48
$$ -137 -576 -37 147 -214 -516 142 129 -192 -142 240 221 219 29 -136 46 214 270 -319 -202 326 -152 -500
1813e00M08L23n12RL40k27K79r1o5K59p2P6k38j05J86n5l69L79J9k18nl0K80k0
$$ -500 -92 231 -281 -272 68 -159 120 29 -36 223 151 227 -11 -116 70 15 -354 25 44 -174 -179 -209 71 51
1837E1Rj53r3L3M27m33oL37J0m15M07j75J34R6j56n5J24j87L0j74M52m7l85J13
$$ 51 60 -93 -186 -153 274 -159 -165 172 182 -233 174 -1 133 229 73 18 142 -45 -15 -189 263 216 -169 -56
1861e6K48P9m76N3R0Nk09K88j43K16J7j82O3Q8j42m7J46K16l9k1k55J11J12k86
$$ -56 192 271 -205 -152 -62 -57 -266 22 -121 95 112 -70 -7 81 -61 -108 38 254 215 194 -61 50 162 -124
1885a24j50M64k86K49j38N0rJ54q7k54K23%Q9l73K89j16J23j46J06j90L3Nk69
$$ -124 -274 190 -96 153 15 65 56 210 123 -131 92 92 181 -192 97 -19 104 -42 64 -126 -93 -88 -357
1908c57N97l2j46q4j03J60L5k83K54m9n1o0Oj6K46k23j09J52k0j1J85o5J29n4
$$ -357 240 208 62 -22 -125 35 70 -213 41 -8 -59 -119 -113 -129 117 -106 -215 -63 -83 -94 91 26 155 101
1932A01k23o6J10K07j55j12L56n8j83n8J08J29nk41j09M88k3j38n76O99Q5m61
$$ 101 -122 -188 -78 129 -26 -138 218 160 -23 -81 27 156 151 -90 -199 289 266 128 -448 251 336 -125
1954a25j6M9J12j75K07j74LM22k05j92o1L01j7j99R4J17j63j52O5K91j58m5L9
$$ -125 -141 -92 20 -155 52 -122 -119 303 98 -94 -155 146 129 -70 24 141 -22 -174 -109 182 24 -21 18
1977A8q3N1j32N4K8K18J62m23K3L73k49j53Q5O0J1r8O6J57j69R4K9m46K78L03
$$ 18 -65 -14 -146 -92 -64 154 316 -107 -84 289 40 -113 -28 32 43 -55 11 168 -1 93 122 -324 -46 257
2001B57l20j57L22L3l33KL56j8k39J71J7r5K46j02j56K22j21l0k57J99KJ1k41
$$ 257 -63 -220 102 135 -198 -196 160 142 -97 74 91 -4 242 140 -16 206 85 55 -202 -3 -1 10 -231
2024b31M12k09j40K44Q6m44L68J6j56l8j9K99l06L0K87r7l05L05k54K14K1m1l05
$$ -231 181 -28 -168 76 162 -282 86 102 -54 -92 -111 188 -118 -88 199 102 -203 102 -152 62 83 42 -263
2047b63K41K33j36n4K47k8k65k24L45k7l72K05P5L7l3j3j82N53j90k52Q8L40p3
$$ -263 -22 211 75 21 268 240 -25 -249 96 69 -303 -98 -23 14 -19 -32 -214 339 149 -103 -15 325 252
2070B52m70J57J82k26J60O6r9n0k9p4J39J60L3l28L0L48j16j56k48L45J14m73
$$ 252 -218 -61 121 -105 55 121 22 -28 -57 -131 8 168 201 -127 -97 251 135 -21 -269 76 190 -283
2092b83L41Rj55J82L2m55L29J04j26j80M98l8l99j47M97j20k62L76j1l07N8Q9
$$ -283 58 67 -88 94 126 -329 0 104 -22 -202 296 258 -141 -288 209 89 -173 203 192 -115 -57 32
2114C2j29r9K65L7j73m5L26l89R6O2L1k07R8R4k67K18K48m20l9M98p3m28R3L75
$$ 32 -97 -196 69 106 -67 -112 214 -175 -79 -17 14 -193 -95 -1 -268 -50 198 -222 -261 237 164 -264 -171 204
2138B04k10k05J39L00j41N4L9j40Q0Qk96j81M53r7j83R0K70k1M9L1l5j89L4J41
$$ 204 -6 -211 -72 228 87 141 180 40 120 128 -168 -349 104 7 -176 -86 184 163 212 243 208 19 53 194
2162A94m44K18J64o0k53L47o5m75Q2M28J5k89n3K67j22Q3m5O9m1K50j23m90J23
$$ 194 -250 -32 132 72 -181 166 101 -374 -292 136 151 -138 -191 76 -46 37 -8 61 20 270 147 -343 -220
2185b20M19j09k01J42K68l41n1K58j99J74rL4l57L39J37m47j80P26r0n39J48M35
$$ -220 199 90 -111 31 299 -42 -93 165 -34 140 131 165 -192 147 284 -163 -343 383 293 -246 -98 337
2207C37l37j27J82p6j34J94J89l32K88K9m28K8O9J03o5J00K58l28K32q2j36n6
$$ 337 0 -127 55 -21 -155 39 228 -104 184 213 -215 -187 -118 -15 -80 20 278 -50 182 100 -36 -92
2229i2J79k54N7J21K49j4m91K51P6k22o8M4L8J73j64J13Q0k8j10R9P1o1Ok16L79
$$ -92 87 -167 -110 11 260 246 -245 6 82 -140 -208 -164 -126 47 -117 -4 76 48 -62 37 108 47 53 -163 216
2254B16k0j79N3q2l9q3L5L3m5K68j52j35j12M04m1j69J44M6j65K6j3J04L7l2l2
$$ 216 196 17 70 -12 -51 -134 -99 -66 -111 157 5 -130 -242 162 121 -48 96 142 -23 3 -10 94 131 99 67
2279F7q0Q1j40K71j50P6j58k9P5n1N7j30N8J30l4J54q8j55K8Q5J07j86N6J4k04
$$ 67 -13 68 -72 199 49 125 -33 -62 13 -38 19 -111 -53 77 43 197 109 -46 -18 67 174 -12 44 58 -146
2304a46K66K1n0j83R1N8r7J77j28k90K51J16l39M7L42p7j25n0J48j01J29r8M1
$$ -146 120 141 91 -92 -1 57 -40 137 9 -281 -30 86 -253 -206 136 59 -66 -116 32 -69 60 -38 3
2327CJ19k53J79j78P4J84k33N8J19q3j21K82J18m08J05Q9L1k20J39P2m3pj42O0
$$ 3 122 -131 48 -130 -56 128 -105 -47 72 -11 -132 150 268 -140 -35 54 85 -135 4 76 33 26 -116 -56
2351e6J18L5J10k33j68J44J12N7k4k30J80l2q5O5J95K0j57j17k1pM20m97M1J08
$$ -56 62 97 207 -26 -194 -50 62 119 95 -135 45 13 -72 -7 188 208 51 -66 -87 -94 326 -171 -130 -22
2375b2L9M7j90J12j5L3j8j01J61n0k21K18j88K4K55o0om0J04O5k76J80L2N2m9
$$ -22 17 64 -126 -14 -29 4 -14 -115 46 -4 -225 -7 -195 -171 84 24 18 -22 82 147 -129 51 83 135 86
2400H6Ok88K56j69K04N4k23Q8k0n7K09j30K1M2J8j60k9k9M7J38j64J52m4n4O0
$$ 86 92 -196 60 -109 95 149 -74 14 -6 -63 146 16 37 79 97 -63 -92 -121 -74 64 -100 52 8 -46 14
2425A4j74K02K08l33%n1J12L8P3M9k18l4J56Q5l7L7k18k30K88K41j93j7N6lj90
$$ 14 -160 42 250 -83 -83 -134 -22 16 89 138 -80 -114 42 127 90 127 -91 -321 -33 208 15 -2 54 51 -139
2450a39l0n8P7k9Q8K43j67Pk8j7Nk3q0J32J21p2k11P8j38L72k48K30j36k3Q5j75
$$ -139 -169 -227 -150 -179 -91 152 -15 -8 -36 -53 -48 -71 -151 -19 102 30 -181 -103 -241 131 -117 113 -23 -46 39 -136
2476a36R0J42qm6j8O6k43R7j18L36j45k7r0J24N4ok2j36K36j86L28m65J54K03
$$ -136 -46 96 88 42 24 90 -153 -56 -174 162 17 -10 -100 24 78 72 50 -86 150 -36 292 -173 -19 184
2500A84m3j72k5r9Q4q3M5K36K51m32J25j85K02j27r9R3M1J48P9r4o4J6N5%j15
$$ 184 141 -31 -56 -155 -71 -154 -109 127 378 -54 71 -114 88 -39 -138 -45 -4 144 223 129 65 81 136 136 21
2525B1m9j1J0j5O4n3k09L03n7j33M0R0m2l9J21k2R0j2N0L8k45J16n1Q0q1J72J51
$$ 21 -28 -39 -29 -44 20 -33 -242 61 4 -129 -89 1 -41 -80 41 19 109 97 147 185 -60 56 5 85 4 176 327
2552C27m05j24MJ47J3K04n3J39k39k1L0j9L5J37r0M3j61J86k65O2rJ03J65k79
$$ 327 -78 -202 -198 -51 -38 166 113 252 13 -8 22 3 38 175 85 128 -33 153 -112 -50 -59 44 209 -70
2576g0J09j26Q1R7k25Q4J41l37L61k11J71j36q5J87O1j61K03k20j1p8J11J79j84
$$ -70 39 -87 -6 91 -134 -50 91 -246 115 -96 75 -61 -146 41 102 -59 144 -76 -87 -165 -54 125 -59
2599e9O0j99K84j47j82L42j33P0m7J94k79J37q2NM3k9Q2k65Q7J90j24Q3K10l35
$$ -59 1 -198 86 -61 -243 99 -34 36 -11 183 -96 41 -41 -36 7 -22 60 -205 -118 72 -52 31 241 -94
2623i4J11l54K21K25j26j74J84l13L10J95j94o7O2j64K93J68qk59j04J60j13J54
$$ -94 17 -337 -116 109 -17 -191 -7 -320 -10 185 -9 -76 -14 -178 115 283 275 16 -88 72 -41 113
2645A13j74K59p4j81L9L13k49j34M4j05K20m9J7R1j78pj5J68J27r8Op6k52L47
$$ 113 -61 198 124 -57 -18 295 46 -88 -44 -149 71 22 39 130 -48 -55 -70 98 225 127 133 57 -195 152
2669A52k1r9J07r6j13J85j69P8k16J51j01K88j71j5L7R0j76J63k7q4Q8n4L5M7
$$ 152 131 32 139 43 -70 115 -54 24 -192 -41 -142 146 -25 -40 -3 87 -89 74 47 -37 51 -3 32 79
2693G9j56j0j19L29j0j57L32l11J47j13K3K5k7N0K7o8j20J53j17m2L3j1P8j10
$$ 79 -77 -87 -206 123 113 -44 288 -23 124 11 34 59 32 82 109 41 -79 74 -43 -85 -52 -63 15 -95
2717i5K84o8k15J85j80O9j31O7J12r7J34Q2j57j08J90n0j16n1M43m18R9J00J56
$$ -95 189 121 -94 91 -89 -20 -151 -84 28 -69 65 147 -10 -118 72 22 -94 -145 298 -120 -21 79 235
2740B35n21L44l7J14l85J68p6J41Q9k6PL8Pj25l3R3O7k08J44j53m8K21P7l02K04
$$ 235 -286 58 21 135 -250 -82 -158 -17 72 46 53 91 98 -27 -60 33 100 -108 36 -117 -165 56 133 -169 35
2765C5J75j16k41J51J49l05R4O3J64k71K62r3r1J38J66k47k2J11M7m01Q6J4P6
$$ 35 210 94 -147 4 153 -152 -58 5 169 -102 160 67 -24 114 280 33 11 122 169 -232 -146 -132 -56
2788e6L21l06m2K8K81j08j14j30Q8J19j12K01k15Q9j78K11o7J18o7K1MM5j23j38
$$ -56 265 -41 -83 -55 226 118 4 -126 -38 81 -31 170 -45 44 -134 77 10 128 61 82 86 131 8 -130
2812a30K04o8Q1j94J09O3j01RO4j03jM4Q8j43P8m8o9j14O0K71j76j35J39OK56
$$ -130 74 6 87 -107 2 65 -36 -27 37 -66 -67 -23 65 -78 0 -48 -117 -231 -171 100 -76 -211 -72 -66 190
2837A90r3o1o3J62N2m57L01O9r9k14L15q2o4j3n4J73J99l80j0K70j77J93l55K79
$$ 190 97 36 -27 135 187 -270 31 100 1 -213 102 20 -44 -57 -111 62 261 -119 -129 141 -36 157 -198 81
2861H1o6j0J8j19J00K29o83M43k9J44K8k8j63o0J44p2R3J4j58J78q5J05j42L9
$$ 81 15 5 23 -96 4 233 -450 -7 -36 108 136 108 -55 -115 29 -43 50 64 -94 84 -1 104 -38 1
2885AJ22k38J19J79k51R1K7j44K12O0J4J1k01M6m1o2J7O2J7j78Q7L0j13K72M7
$$ 1 123 -115 4 183 -68 23 50 -94 118 178 192 203 2 48 7 -55 -38 24 41 -137 -50 -20 -133 139 186
2910A86pk66M8J13k31J81j53K12l9j66K04n7j13J43R1k39K65k78J03J5J31l32
$$ 186 179 -87 -39 74 -157 24 -129 83 44 -122 82 25 -88 55 146 -93 172 -106 -3 12 143 -189
2932a89K0M24l15J15k4jj19J43j75J97j74L04j41k09P7J22J24k91J85k42J82J3
$$ -189 -169 255 -60 55 31 30 -89 54 -121 76 -98 206 65 -144 -67 55 179 -112 73 -169 13 26
2954B6P6j32J00k16J9K6J03Rj61M2L8M3J19J45k25L1l26P6J40J69j8j22OJ69J53
$$ 26 102 -30 70 -146 -127 -101 2 11 -150 -108 -70 -27 92 237 12 43 -283 -207 -67 102 84 -38 -32 137 290
2979B90k96J17j27mm2J9mJ58j67j36L08j23L35k95q4K02M9j67p4J94j59j5J1k67
$$ 290 -6 111 -16 -20 -62 -43 -47 111 -56 -192 116 -7 328 33 -51 151 200 33 -41 153 -6 -21 -10 -277
3003b77L38j12O5m1Jkk23N2K92l5j95P0J56j49R1j00J31j45O9J07j55L6J26k75
$$ -277 61 -51 14 -27 -26 -28 -251 -199 93 58 -137 -67 89 -60 31 -69 62 -83 -14 93 -62 -26 100 -175
3027a75K69j23m0J92k0k41J29K59n2j28J8p0Qr4j94K17q5J98j97M1P1OQ1j70P2
$$ -175 94 -29 -69 123 103 -138 -9 250 198 70 88 18 26 -68 -262 -45 -130 68 -129 -88 -17 -11 70 -100 -28
3052b8L7rj12J27O5p6N7J66k27j11J47J04k67J63k6QJ6R5m7k89J95O2k3j24j00
$$ -28 9 0 -112 15 80 4 61 227 0 -111 36 140 -127 36 10 18 34 129 82 -207 -12 50 27 -97 -197
3077a97J31P5J80p8j15rMJ7j26J30p3M8L9J0KJ8JJ92k17J6k58K17Q6R6n8j68J45
$$ -197 -66 9 189 111 -4 -13 -9 8 -118 12 -61 -13 26 36 38 56 57 249 32 48 -210 7 93 189 131 -37 108
3104A08k2o9r4K9J23j16K18k82PJ74m3j40J25P4k59K03O2k4l3j65L5L17r4j55
$$ 108 86 17 -77 -48 75 -41 177 -105 -98 76 33 -107 18 92 -167 36 98 74 41 -124 -89 228 134 -21
3128b1j0qM6qR1k41K67l48J08L21j60j96K35j37O1K5j18K6P8l2mj19L15q2k64
$$ -21 -31 -39 7 -1 90 -151 116 -232 -124 197 37 -159 76 -61 0 25 -93 -67 11 -21 -25 -144 171 89 -175
3153a75J61P4l8j38j1K34N9k53J68j56k0J37J28j52K0Qj67n1K52l7k56J41J41
$$ -175 -14 60 22 -116 -127 107 166 -87 81 -75 -95 42 170 18 38 46 -121 -172 80 43 -213 -72 69
3176F9n3j88J72o8k6P4P9J7J5k4p2m2j24J90j30K09j56j06L8J62J33m20L7J64
$$ 69 16 -172 0 -68 -94 -20 59 76 91 67 -5 -47 -171 19 -111 98 -58 -164 -126 36 169 -251 -214 -50
3200e0K30m0j28j19k3Q8Jq7kK65p8n9J33k46K07L9j65J04o3J6J12N9k29P2k7J6
$$ -50 180 140 12 -107 -130 -42 -41 -128 -130 135 57 -2 131 -115 92 131 -34 70 7 23 135 194 -35 37 10 26
3226B6J09k03Okl0J85J7n0k7j90J43q3qp3K34J65k26R6k9P4j01j08K2J72N2k04
$$ 26 135 -68 -62 -64 -94 91 108 58 31 -159 -16 -99 -107 -180 54 219 -7 89 60 134 33 -75 -53 119 171 -33
3252c3m9K5Jq3P8J42K8j45R0j74j24K40j36K32k60K79p8p4N4J23q0m32M83j45
$$ -33 -82 -57 -56 -139 -61 81 109 -36 54 -120 -244 -4 -140 92 -168 111 33 -41 13 136 56 -376 107 -38
3276c8j87M00n8n4j17K21q7k5J69j2k77j13J21r7j32L35j01j40K30R9k51p6J29
$$ -38 -225 175 117 63 -54 167 80 55 224 212 -65 -178 -57 -154 -286 49 -52 -192 38 137 -114 -190 -61
3299f1Q9k9k0J24r3j50K65Q4l35J40J99l10K77l5R8k69J02nj05j97K39r3J03R5
$$ -61 28 -1 -21 103 10 -140 125 209 -126 14 213 -97 180 145 243 -26 76 71 -34 -231 8 -85 18 113
3323A13n1m2k85M05j71qj0k32J87J71l7j48J85q9K15k12K66k17K6p3p6J29k75
$$ 113 62 20 -265 140 -31 -39 -49 -281 -94 77 40 -108 77 -12 203 -9 257 40 66 -7 -83 46 -229
3346b29K92jk02J25L1K0r1J91j58J63j24qj50K64j65J9nj99K45n9M6p5J66k95
$$ -229 63 62 -140 -15 16 36 -55 136 -22 141 17 9 -141 123 -42 -23 -28 -227 18 -41 5 -70 96 -199
3370a99J22K5K2M6J38qk15L3P2N8o9O2j41r5J94J04n7nk45J33k0j20J68jJ17K9
$$ -199 -77 -52 -30 16 154 146 -69 -36 36 94 25 87 -54 -149 45 149 92 87 -158 -25 -45 -165 3 2 119 148
3396A48j74J33KP3o8k75J02J91j77Kl6J58j35P5J42j4k78K19o7k6q6j02p9L82
$$ 148 -26 107 109 182 114 -161 -59 132 -45 -43 -79 79 -56 19 161 147 -131 88 21 -5 -91 -193 -272 110
3420A10j6j71l3J86n9j61K77j21o4o6K78j28K15j01j73K16j79m8Q8M5J4k01m7
$$ 110 94 -77 -110 76 17 -144 133 12 -52 -118 160 32 247 146 -27 189 10 -38 50 95 109 -92 -139
3443a39L29l26J92n6m3O3kj19j78L99j41lQ6j47J46k82L78k82K35j7J1k68K14
$$ -139 190 -136 56 0 -43 20 18 -101 -279 120 -21 -24 62 -85 61 -221 157 -125 110 93 104 -164 50
3466E0k24P8J32K1r8o1K62l17J39O6M0j93J43o4j11K35n6j7j09J22K9M1j97Kj02
$$ 50 -174 -96 36 57 -41 -102 160 -157 -18 48 88 -105 38 -26 -137 98 42 25 -84 38 67 108 -89 -87 -189
3491a89J61P0P1j60J54N3q9r6l8J8K8J5m5L3K2k16J96J4j50m3J12J63J14k52L
$$ -189 -28 42 113 -47 107 160 71 -25 -63 -45 -17 -2 -47 -14 8 -208 -12 2 -148 -191 -79 84 198 -54 -51
3516e1Q7j00j17J20K5K90j95nk6ok7R2P4j85J18j58r1K48j47J62l8o2j26J06j94
$$ -51 36 -64 -181 -61 -36 254 59 54 28 22 -5 87 161 -24 94 -64 -155 93 -54 108 70 8 -118 -12 -206
3541b06K4O8P7KK5J47k71J37j76J77N0j6j13k3K02r8n7q1K56l30L14k24J94k66
$$ -206 -182 -114 -37 -35 -10 137 -134 3 -173 4 54 38 -75 -98 104 6 -51 -132 124 -206 108 -116 78 -188
3565a88L32L5l16J14K20j75j18Q5J10q3j7n3m5J0J84l20K91J16k48J59k12Q6J95
$$ -188 144 179 -137 -23 197 22 -96 -11 99 16 -1 -54 -99 -89 95 -225 66 182 -66 93 -119 -33 162
3588A62k51K13l3j30J56j93J10Pj00O1J37k60J8J95l8L4N6j74K03l80J13K27k75
$$ 162 -89 124 91 -39 117 -76 34 41 -59 2 139 -121 -103 92 54 88 144 -30 173 -207 -94 133 -142
3611a42K18Kr1q1N4K4n6O6P7j47J80j05l9jR4l57L19O5r7J1M4k34J43p9P7k64
$$ -142 76 78 -13 -94 -40 -16 -72 -6 71 -76 104 -1 -40 -41 53 -304 15 80 -17 -6 38 -196 -53 -132 -55 -319
3637c19J21P6J58p2N8j5J54p0j9k7j55J34J39k07L70m55K18j07j39K41j03p7k24
$$ -319 -198 -122 36 -36 22 7 161 91 72 45 -110 24 163 -44 326 -129 89 -18 -157 84 -19 -96 -320
3660c20K25N3J71j94O7n6R4Q4j19J64k16R5L9k09J75j1M6p0J99j78nk5P5l5j71
$$ -320 -95 -42 129 -65 2 -54 40 124 5 169 -47 48 87 -122 53 42 88 18 217 39 34 9 84 49 -122
3685a22K2K60k72L96j83P1j02l0p6O4p7J49PL4l37M25j52j04j06J04J78j01j67
$$ -122 -100 160 -112 284 101 172 70 40 -36 28 -49 100 107 141 -196 229 77 -27 -133 -29 149 48 -119
3708a19K39M7p7j92J35J19k09O2r6j2R3L7J1o8k70K94n6K02Pj47j39K1R4p6J16
$$ -119 120 167 90 -102 33 152 -57 5 -91 -103 -10 27 38 -30 -300 -6 -62 140 147 0 -139 -118 -24 -100 16
3733A6O8Mj81K31r5n3L9k66J51J55j10r3K85j46q5K95k88J01l14M02j00L6O1j16
$$ 16 84 88 -93 138 43 -10 29 -237 -86 69 -41 -134 151 5 -80 215 -73 28 -286 116 16 52 113 -3
3757cp8J60j9o6N2q6J50j75J81N0k64O7kJ38j41n6L3m3K12k74K95rj6o2Nq8p9
$$ -3 -81 79 60 -6 46 -40 110 -65 116 166 -98 -31 -33 105 -36 -92 -59 -102 110 -164 131 122 106 44 49 -39 -118
3784a18J53R6j49J27r6K69k74o7O9K6j00K3K8j2j69K30J13j61l4p5K12j54K69
$$ -118 35 131 -18 109 13 282 8 -59 10 36 -64 -41 -13 -25 -194 36 149 -12 -46 -121 91 -63 206
3807B06l19l2J21j5J17j44l7J10k8J4j13M4n6L63q0n1j98k47M42r2PP6j09K9m4
$$ 206 -113 -145 -24 -39 78 -66 -103 7 -21 -7 -120 -76 -132 231 151 100 -98 -345 97 5 12 88 -21 8 -36
3832c6j18J14nj93J00J16L05l54Q5n1J59k06K30Jj45k32K80l0J1Q0j32k3J2K43
$$ -36 -154 -40 -45 -238 -138 -22 283 -71 14 -37 122 -84 146 147 2 -230 50 20 31 111 -21 -44 -32 211
3856B11j13j21j41J10J10M6j8m5l52M04J3J22m0j16k4j91J52M7k30J64Mj6p5J09
$$ 211 98 -23 -164 -54 56 102 84 39 -313 91 104 226 186 70 46 -145 7 54 -176 -12 -8 -24 -99 10
3880A0K1R7k65L7J66j23K7n1K49k38J66j54K30j45J93k63j20L08k6j9k44K12O9
$$ 10 31 128 -137 -100 66 -57 -30 -81 168 -70 96 -58 172 27 220 -43 -163 145 119 100 -144 68 137
3903A37pk98L16l63L65j13k7O1m7O6k07P4J85j44O4lj1J03j36J14j81j11L24k17
$$ 137 130 -168 148 -215 150 37 10 71 24 90 -117 -43 142 -2 62 59 48 151 15 129 -52 -163 161 -56
3927e6P3j38k7qL39j13k34O4J96r8P6p3j07J10k21O1K2J26J27j19Q9J75k08Q0
$$ -56 17 -121 -148 -156 183 70 -164 -100 96 -2 74 1 -106 4 -217 -156 -134 -8 119 0 89 264 56 136
3951A36n0j9J6m5k80L08k34L1J69j97L66o3j18j39J0j70K5K44R1Rj4m6j5q6O8
$$ 136 86 67 83 38 -242 66 -168 -137 32 -165 201 138 20 -119 -109 -279 -254 -10 81 90 76 30 15 -71 -3
3976cP6l9M4J59o3J30k89j34Q9K18j66M4Lo7lj02L12k48L3jj31mO0J36j09R9j5
$$ -3 73 34 78 237 174 304 15 -119 -30 188 22 66 69 2 -1 -103 209 -39 -6 -7 -138 -142 -82 54 -55 44 29
4003B9O5o5O0k31N0P4j63N0N0NP4R0n3r0O2q7K03N7j34J1J48k41jo6K69l41K01
$$ 29 94 29 89 -142 -92 -18 -181 -131 -81 -76 -2 88 35 -55 7 -80 123 180 46 57 205 -36 -37 -103 166 -175 26
4030B6M4N1j25j42J77L84l23j35R7p0K45k43j16R3j1L08j82n5k15J37j17J43R
$$ 26 70 121 -4 -146 31 415 92 -43 54 -16 229 -14 -130 -37 -48 260 78 23 -192 -55 -172 -29 -20
4053b0r3K79j19j6k9j7O9j58r6J48r2M52l08j62K35j22O4n2O8M4j86J88k05k0
$$ -20 -113 166 47 31 2 -15 54 -104 -200 -52 -144 308 0 -162 73 -49 15 -37 31 75 -111 77 -128 -148
4077a48K91q5R7k22N7L4j0Q9j75K8J19k20J54Rj59m4J55K02j7j77J3n2L5j21J90
$$ -148 143 58 155 -67 -10 24 14 103 -72 -44 75 -145 9 18 -141 -185 -30 172 155 -22 -9 -61 -26 -147 43
4102D3r0J01j8p5J26p8J16l14L21j70k8r5K07j03J22k08J72Nk60L17j89J11J09
$$ 43 -47 54 36 -39 87 9 125 -189 132 -38 -66 -161 46 -57 65 -143 29 34 -226 91 -98 13 122
4125A22k93O8L23j81k2j16j15K89p5JJ13k97J4K91M9k89Q7K17k19l8P5q0J72L0
$$ 122 -171 -103 220 39 17 -99 -214 75 0 1 114 -183 -169 122 171 -118 -31 186 -33 -71 4 -76 96 126
4149A26J1k08J13M1m0n0Q8q7Q8R8j76J23l03R8Q4j90J17J18%J37k15J80k29R0
$$ 126 137 -71 42 83 43 -7 81 -6 82 180 4 127 -176 -78 6 -184 -67 51 51 188 -27 153 -76 14
4173A4j65J38q2L12j91J80k64J95k45o3J21r3P3j13J56M9j40J15j55J14M9j56
$$ 14 -151 -13 -95 217 26 206 -58 137 -108 -171 -50 -143 -70 -183 -27 22 -118 -3 -158 -44 5 -151
4195a51N3J15J05n4k00J09J99q4O9k43O6J21M8k94P2K37q7p1n4p0l1J65j13m7
$$ -151 -98 17 122 68 -132 -23 176 92 161 -82 -16 105 153 -141 -69 168 81 10 -44 -114 -145 20 -93 -140
4219a40K59k46J44O4k34J50P5Nj3nj77m7J03j20M9J93l24J59J68N9j13m2J09j08
$$ -140 119 -127 17 81 -153 -3 72 77 64 59 -118 -165 -62 -182 -133 60 -264 -105 63 122 9 -33 76 -32
4243c2Kr6m3L66j83ML8j32K04p8k90K31j0p3R8q5J40Mj39L6LQ6j66J18m6M9L9
$$ -32 -30 -126 -169 197 14 18 56 -76 128 50 -240 -9 -19 -92 6 -79 61 65 -74 -38 -35 51 -115 3 -43 6 45
4270D5kJ3O5l8j02R2k1L3j3qj51q0M08Km32J88qM4qK26o2k8j33o5r3lq7J75Lj8
$$ 45 43 56 121 83 -19 73 52 85 72 64 -87 -167 241 243 -189 -1 -9 35 27 253 191 163 30 -35 -128 -131 -218 -43 -40 -58
4300e8J53j23J65M6l53L80k38Q8m8l8J28r8m3o5K68j99K2J01n5J66j86j23J38
$$ -58 95 -28 137 183 -170 210 -28 60 12 -26 102 4 -39 -104 164 -35 -13 88 33 199 13 -110 28
4323B8J12n3k2P2l56J76M1m2m0J02J26R6k37j07K94k13J71r9n6p2o6K75j76Q4
$$ 28 140 87 65 137 -219 -43 -2 -44 -84 18 144 240 3 -104 190 -23 148 49 -7 -79 -145 130 -46 38
4347C8J5m0l8J02o0Qqn4k05J43L13l59K38p4j62K17j41L2J2oL0J98j00k08J27
$$ 38 53 13 -25 77 17 25 17 -37 -242 -99 214 -145 93 19 -143 74 -67 -35 -23 -29 1 199 99 -109 18
4372A8J42j16n1R0j07J58n5j34j15Q2J8r0L3O3K08k39Q7J17n3j19K2qO2m1j69
$$ 18 160 44 -7 83 -24 134 79 -55 -170 -88 -70 -160 -127 -64 144 -95 -8 109 56 -63 -41 -49 13 -28 -197
4397a97K99j54m8J19j04J10J69L4l18QP0j07K03j2M0p9j30J6M8j06R2M4O1Qj30
$$ -197 102 -52 -100 19 -85 25 194 228 -90 -82 -12 -119 84 72 112 33 -97 -81 -33 -139 -47 -3 58 66 -64
4422f4n5K05j69o4K1J54PJ53j64n9L2j07P5k1L8M4j30J8j32L52r0p0Q4p2q3J61
$$ -64 -119 86 -83 -147 -126 28 35 188 24 -35 -3 -110 -35 -56 -18 26 -104 -86 -218 134 44 -26 58 -14 -97 64
4448F4j84K15J29j50l44J14J25K07k24J96j61J18k61J18K65k96mJ15R5m4k00J84
$$ 64 -120 95 224 74 -270 -156 -31 176 -48 148 -13 105 -156 -38 227 -69 -73 42 137 93 -107 77
4470G7k63J66J13l54K42j27K04p6J40k63N3R0K3j45J45K98k27k21P5K03r4J41
$$ 77 -186 -20 93 -261 -19 -146 58 -18 122 -141 -88 2 25 -120 25 323 96 -125 -50 153 59 200
4492B00k43Rq8J44m8J47k53M2JJ43J43k72L0M0k26K41qk09R5J55J46j62k13J72
$$ 200 -43 -34 -122 22 -26 121 -132 -90 -89 54 197 -75 -45 -5 -231 10 2 -207 -112 43 189 27 -186 -14
4516a4J24J83l23R4M9j60j2M5J8j07j3K6K75k28K9J7l1J00Pq0J06k40l3K66k60
$$ -14 110 293 -30 64 113 -47 -59 -14 4 -103 -116 -90 185 -43 -14 3 -28 72 79 -1 105 -135 -168 98 -162
4541a62J68J39L4l50J14J46J02l16R1l1J52j68L3j35J90k05L76k03k3M5Q6j47
$$ -162 6 145 179 -171 -57 89 191 -125 -34 -65 87 -81 -48 -183 7 -198 178 -25 -48 -3 83 -64
4563f4m0n5N2M8k2l9L7j59L33J3j97J26J07j59J7K47j55J10j9j12l0R8Oq3k69
$$ -64 -104 -159 -107 -59 -81 -120 -83 -242 91 104 -93 33 140 -19 -2 245 90 200 181 69 39 137 143 60 -209
4588b09K61R1j14k29K87r0N0O6j81K57j19Q3j76p8J88j98Q0r3N6J48k05P9N2r3
$$ -209 52 143 29 -200 87 -3 47 113 -68 189 70 153 -23 -101 87 -111 -31 -124 -68 80 -125 -46 6 -87
4612h7J83K3r2RK3j8n2q4J36n0Q8J06j98J72j85J13K7l7O9l08K13j39Q5L4j06
$$ -87 96 119 27 36 59 41 -11 -95 41 -9 79 185 -13 159 -26 87 114 77 146 -162 51 -88 -3 31 -75
4637g5J67p9j75J65k46N5L84l32L25q6r2j87L54k29J16j60k1K52j20j04K85k44
$$ -75 92 13 -162 3 -243 -188 196 -136 189 103 11 -176 178 -51 65 -95 -116 136 16 -88 197 -47
4659d7J14j07J87k04j15L00j56m0M8J4K10l02Q3j45K49k51N6J76j41q5K17o5j13
$$ -47 67 -40 147 -57 -172 128 -28 -68 -20 -6 204 -98 -15 -160 89 -162 -106 70 -71 -156 61 -4 -117
4682a17K43j96J25j50J67lJ9j62RJ95j71K01K7r8j74J13N0K36m07j7J42j59ML4
$$ -117 126 -70 55 -95 72 69 88 -74 -65 130 -41 160 187 89 -85 28 78 314 -93 -110 32 -127 -123 -89
4706h9L1k38K71j89K34M7O3k29l5pK24j61K16m5k72K23m7J98k18k1O3O5j07j12
$$ -89 -58 -296 -25 -214 20 67 130 -99 -134 -141 83 -78 138 93 -179 44 -3 195 -23 -44 19 84 -23 -135
4730a35N5L8j5M1N3k32J12m2J06L01k33k4j22O4J04Q7l35M20j04j43J85o6r7M9
$$ -135 -80 -42 -57 -16 37 -195 -83 -125 -19 282 49 25 -97 -33 71 158 -177 243 139 -4 181 115 18 67
4754F7l6j29K58j92J00L0Jj07P2k67J07n5J05j23J33m0l2K15j3j02K41j00m1K05
$$ 67 31 -98 160 -32 68 98 99 -8 64 -203 -96 -151 -46 -169 -36 -76 -108 107 94 -8 233 133 92 297
4778B97n66L45J37R8k70q4j33L0O5J60p0p7J94O3j65m7n4O3j6j9j09k43J36O6
$$ 297 -269 76 213 311 41 -43 -176 -146 -81 79 9 -68 126 189 24 -23 -77 -14 -30 -49 -158 -401 -265 -199
4802a99J08Q2k20K96j22J57k55K23j67J86o7K4l70L28MM9j93J22j42R7jK47k24
$$ -199 -91 -9 -229 67 -55 102 -153 70 -97 89 22 46 -324 4 8 57 -136 -14 -156 -59 -60 187 -37
4825c7p6K92l36M72n05M00m23k3K76j59R5J67o9q1k1k3K3M0j82K79j18lP1q9j2
$$ -37 -113 179 -157 315 -190 210 -213 -236 40 -119 -24 143 74 -7 -28 -51 -28 12 -170 109 -9 -12 59 -30 -42
4850d2j27R9J48j8n9o3J19K91k20l82K61o1j75J77K76l74L14j45nO4O0j42J90
$$ -42 -169 -70 78 60 1 -62 57 348 128 -254 7 -54 -229 -52 224 -150 164 19 14 78 138 -4 186
4873A86k69J53j87J29J01J2n6q8K16j22q5j7J91m43J06J47N2J26j20r0J77r3O7
$$ 186 -83 70 -117 12 113 125 69 -19 197 75 -10 -27 164 -279 -173 -26 26 152 32 -58 119 26 93
4896I3J0j18k57L50j18l7K4L3J17R9k69K15k75O9J08J36j16P0l06J4nj21K02L1
$$ 93 103 -15 -272 78 -40 -77 -53 -20 97 196 -73 142 -133 -64 44 180 64 134 -172 -158 -163 -284 -82 -51
4920e1O3o0R1q8r8K46r8k12LL28j13P7o4J83k43k26P8l7J60L4j9L06k06j2o4N9
$$ -51 12 -48 43 -45 -143 103 5 -207 -204 124 11 88 24 207 -36 -262 -184 -221 -61 -27 -46 260 54 42 -22 37
4946C7j01j42J87q0K64j85o5J56m5J03k4q6J17j54m7m5K08j35J87q0j22Q2k35
$$ 37 -64 -206 -19 -99 165 -20 -85 71 26 129 105 19 136 -18 -65 -110 98 -37 150 70 -52 30 -205
4969b05J48j15J41J75k77N6J24k6p9j65L04N4l17K75j2q6%j04N2JM26k22L8j02
$$ -205 -57 -172 -31 144 -133 -77 47 21 -58 -223 81 135 -182 93 81 -5 -5 -109 -57 -56 370 148 186 84
4993H4r0K34l98K20N7j0n5r0J62j35J43j19rN2k01K59j11N0j46N7J4j58J89n7
$$ 84 -6 228 -170 50 107 97 42 -48 114 -21 122 3 -6 46 -155 104 -7 43 -103 -46 -32 -190 -1 -58
5017e8q5R0J44o2j7m6n4J16l5j70K06o4O6O3p5k14Q5Q7K14j80j29J59r1J12l59
$$ -58 -143 -53 91 29 12 -34 -88 28 -7 -177 29 -35 31 94 19 -195 -110 -23 191 11 -118 41 -50 62 -297
5042b97L71Kl3j82P2j29L44j42P9j70N0k7K08j91J15j39K57k47lKj1L6J38k00
$$ -297 74 76 43 -139 -67 -196 148 6 85 -85 -35 -62 146 -45 70 -69 188 -59 -62 -60 -71 -35 103 -97
5066i7K25r2j35k7n3K30kR1j48j0J01j08K7J37o8K9O1j59J18j61J41Q6j93P8l19
$$ -97 128 36 -99 -126 -179 51 49 140 -8 -18 83 -25 2 139 71 100 161 2 120 -41 100 186 -7 71 -248
5091b48L57j25J69j51o3R0L4p8P7N4k28Q0l3qk5J23k3J15k49QL30j28j71K11p
$$ -248 109 -16 153 2 -61 29 63 -15 62 116 -112 -32 -65 -73 -98 25 2 117 -132 -124 206 78 -93 118 111
5116A11o0O4k02m7J69J55%j88K0o8k8N5J88j77J2o5J14j13l5J71p6J05n9q6p2
$$ 111 51 115 -87 -134 35 190 190 2 22 -46 -74 -19 169 -8 4 -61 53 -60 -95 76 0 105 46 -40 -112
5141a12J45kk34L91k29J40m3p2l3j2K17k5j42Q9O6j42M5Q9l3M8o4k56j3K20q0
$$ -112 33 31 -203 188 -41 99 56 -16 -49 -61 156 131 -11 78 144 2 47 136 103 151 87 -169 -182 38 -42
5166d2N3O0Kj85O1J54k10j29K23M7K0k18Q1J35j22J28k16Q6J72lk33K5P0K24q9
$$ -42 11 71 73 -112 -51 103 -107 -236 -13 34 54 -164 -83 52 -70 58 -158 -72 100 97 -136 -111 -41 183 94
5191I4k39N6J62j60j7J46l03L12%m0O3j3k08K29r6J64%j04k9M8o4J11k74R0nJ62
$$ 94 -145 -89 73 -87 -104 42 -261 51 51 11 74 61 -147 82 -14 150 150 46 17 65 1 112 -162 -72 -77 85
5217H5j52O0O8j8J8Ok29O0j52Q0K31KJ11j80j01K49j97R4K15l15R0j47J84j22
$$ 85 -67 -7 61 43 61 67 -162 -102 -254 -174 57 59 170 -10 -111 138 -59 35 250 -65 25 -122 62 -60
5241f0j30M68k52Mk29L02o3k61K22J40q1L3l00K93k55J27k3jN8J66j68l7RJ46
$$ -60 -190 278 26 30 -199 103 40 -221 1 141 60 93 -207 86 -169 -42 -65 -66 -8 158 -10 -47 -38 108
5265A08k32k36L44k59K11j89P0K58j33M6j89J99j6k6r3K16k38J84OM5jp0j92K04
$$ 108 -124 -360 -16 -275 -64 -253 -183 75 -58 -12 -201 -2 -18 -44 -137 79 -159 25 31 76 75 5 -187 17
5289A7n9J38l3j61R2J51k21J84j35m7k6J48r7K39j79k01p3J47N2j09R3L7J93j06
$$ 17 -42 96 63 -98 -6 145 -76 108 -27 -74 -100 48 -49 190 11 -190 -263 -116 -64 -173 -80 -43 150 44
5313D4r3k21J07K41j14k92K76J83l99L57k7k85K37P3M1k17OM1L7P6J04j13O0O0
$$ 44 -49 -270 -163 78 -36 -328 -52 131 -268 89 62 -223 14 87 128 -89 -83 -42 -5 71 175 62 122 182
5337A82n3L3o0n2r5K52k35k7lK5j16o1J7K12l2O4k9p3Jp5o5P1Q4MJ1j04J0K32
$$ 182 129 162 102 50 -45 207 -28 -55 -58 -33 -149 -210 -193 19 -13 51 22 -51 -50 -125 -190 -119 -35 -31 -20 -124 -114 118
5365A18j45K60j62m03K07K56k04L5l7J76lO0j86K19J16k39p9K0k9M4j32J61J37
$$ 118 -27 233 71 -332 -125 131 -73 -38 -75 101 98 158 -28 191 307 68 -11 9 -20 24 -108 53 190
5388A90n67L62q1o0J50p7M8L15k36N4j06J21%r0k5M0m2K4mK16j89K11p1j16MQ2
$$ 190 -377 -15 -96 -156 -6 -83 -35 280 44 98 -8 113 113 23 -2 38 -4 20 16 232 43 254 183 67 71 153
5414A53j56j3j13J36k3J09P7l27N5l6J88R9j87L3R3p3N1l3j93L50j10k79L02r
$$ 153 -3 -16 -129 7 -16 93 170 -157 -102 -138 50 149 -38 -5 88 15 66 33 -160 190 80 -199 103 94
5438I4j66j51J92m4J32j93J57r5J38j31K4J37k36R0Nj39K74k78K14O4k74K19R0
$$ 94 -72 -223 -31 -75 57 -136 21 -74 64 -67 -43 94 -142 -52 -47 -186 88 -190 24 88 -186 33 123
5461A23o4q8Ol7p0K04L8k59J95J06j54O0L5J4k57K23q0KN3j5kj6K62k61J69j6
$$ 123 59 -29 -23 -60 -130 74 112 -147 48 154 0 60 95 109 -148 75 -5 -3 50 35 33 17 279 18 187 171
5487A71N2k76M8j16M2Q6n2J32q2o2j3N1J37q4O8o2K38m16J36j60K47l7J39k34
$$ 171 223 -53 -5 -121 -79 7 -45 87 5 -57 -70 -19 118 34 102 40 278 -138 -2 -162 85 48 187 -47
5511d7n8O3q6J70k09Q4N9J4o0n0j20K29m9L33l87O3R6j06j06K59K4Q4j27J1r6
$$ -47 -105 -42 -128 42 -167 -83 -24 -10 -70 -120 -240 -11 -60 273 -114 -51 45 -61 -167 92 116 200 73 84 -12
5536a2k80K96J74m0q7K8K9M2k74oK58l4j86J53j44O3k5J8R1oj87L0M4J06j03m7
$$ -12 -292 4 178 138 51 79 108 150 -124 -130 128 94 -92 61 -83 -20 -45 -27 64 58 -129 -99 -55 51 -52 -99
5562i9J72J01j69J66l63M6K8L26j13p9o8K01nj03k44J39J07r8R4J01o4k4j10Q8
$$ -99 73 174 5 171 -192 -146 -118 208 95 16 -52 149 144 41 -203 -64 43 -55 39 140 76 52 -58 30
5586C0m9j4m7J12j54K04r1j49R0Q1r5O8r1J37j61K40P6j36j76P8J20kj43J84o
$$ 30 -19 -33 -80 32 -122 82 -9 -158 -68 13 -82 -14 -105 32 -129 111 187 51 -125 -47 73 71 -72 112 106
5611A06r8N0l0j58j5Q0K33k04l2p4R9J94q8J1k23J74OQ0k58Q1M2kO1j58J43j21
$$ 106 8 58 28 -130 -145 -65 168 -36 -68 -142 -43 151 63 74 -149 25 31 111 -147 -66 -24 -26 35 -123 20 -101
5637a01L15j15j98N7J87m6r0j19j11L11j73K19k20J18j1n3L3n7J93n2q3KN3Q8
$$ -101 214 99 -99 -42 145 99 9 -110 -221 90 -83 136 -84 34 23 -30 3 -54 139 87 4 6 59 147
5661A47l1l4k36M2k3K93j39L3m4j94J93j42J82k94L39N9k15k1M1O7k54J74j15
$$ 147 116 82 -154 -112 -135 158 19 52 8 -186 7 -135 47 -247 92 151 -64 -85 -44 23 -231 -57 -172
5684a72J70jj9O5K1n5J29k64J17N3l3r0j65J28K15q7NL7Rq6j83L23j66q5J85J26
$$ -172 -2 -3 -22 43 64 9 138 -126 -9 44 11 -79 -244 -116 99 12 17 54 63 -23 -206 117 -49 -134 51 177
5710A77mL7n4k27j15k7K9L20j33j42K37N0k26J40q4L9J67k05k7k44J14K56mj21
$$ 177 173 210 156 -71 -186 -213 -184 136 3 -139 98 148 -78 62 -22 17 184 -21 -48 -292 -178 78 74 -47
5734d7qJ30j67oJ70j35J20k63K84j87K0J25j40P6M8m8J9J01J5k13K37k65J23M4
$$ -47 -55 75 -92 -98 72 -63 57 -206 78 -109 -89 36 -104 -28 20 -28 -9 92 107 -106 131 -134 -11 33
5758C3p4m5J21N1J75k06l8N9n7o6L0k4j12J03o5q6L50k45J7J80k27K34p9j12Q4
$$ 33 -41 -86 35 86 261 55 17 76 19 -47 -17 -41 -153 -50 -115 -201 149 -96 -79 101 -126 108 29 -83 1
5783AJ1K7L5J76k97M0K0L7J8J65j34k08J93n9l2k7K6n9mR1Pr8q4J66J2j24r8J2
$$ 1 12 39 74 250 -47 -7 13 50 68 233 99 -109 84 25 -7 -34 -8 -67 -71 20 27 -71 -155 11 23 -101 -199 -187
5811a87J13r4Q1ll1O3J18O1j94J05K97l60J34m0k56L00j56J24J22k01L4p3r6K52
$$ -187 -74 -168 -87 -90 -121 -58 60 121 -73 32 329 -31 103 63 -193 107 -49 75 197 -4 30 -43 -139 113
5835A13j79Q7J03j59J95l20L80j02l35K43j69K39J5r1Q5k45J05N6q0N8j26K15
$$ 113 -66 21 124 -35 160 -160 220 118 -217 26 -143 96 111 20 105 -140 -35 21 -59 -1 -127 88
5857H8q9l95K72l8J12O7J22m29K23JJ23j66M8j16J33L0J72k49j3M0O5k28K59j9
$$ 88 -1 -396 -124 -162 -50 17 139 -290 -67 -66 57 -109 -61 -177 -44 -14 158 -91 -104 -64 1 -227 32 13
5881A3K4K5q3j1l4J26l7P6O8p2N8j77P5j38j9J97%j59j86K78K6l4Jm3k3j44L85
$$ 13 37 62 -21 -32 -66 60 23 99 167 95 153 -24 51 -87 -106 91 91 -68 -254 24 50 16 17 -26 -49 -193 192
5908A92j64J20K6l77L11j84K22L7l20K19o4l8n1j7L4Qn6L6P4k1q3L65j64k08J52
$$ 192 28 148 174 -203 108 -76 146 183 -137 82 18 -20 -71 -88 -54 -46 -102 -66 8 -13 -96 269 105 -103 49
5933D9o6J59k04Q8k0Q5k19J96k19K49M8lk37jN0P9p0%j39J69o8K9K19j73P5q7
$$ 49 -17 142 -62 26 6 91 -128 68 -151 98 146 143 -94 -95 -45 34 -36 -36 -175 -6 -74 -45 174 1 76 -11
5959a1J30j10P2j56J05n6l1K2j00L20j61j00J49o4J08j00j32N0J61l2l5rm3p0
$$ -11 119 9 81 -75 30 -26 -57 -35 -135 185 24 -76 73 9 117 17 -115 -65 96 64 29 20 -23 -93
5983i3J10k5k71K54Q5j7j40R9k82K16P7q3L6L6k8J17mp4K9j3l9k01J86K27j19
$$ -93 17 -8 -279 -25 60 43 -97 2 -280 -64 13 -70 -34 2 -26 91 87 13 42 29 -10 -211 -25 202 83
6008H3j16K02r9j1Mj08p0K60l47J64j03J95n6j21J08J44k0k3q9P8j29J26k17J21
$$ 83 -33 169 70 59 63 -45 -115 145 -202 -38 -141 54 -2 -123 -15 129 109 86 -3 75 -54 72 -145 -24
$$ [...]
8191B02
##END NTUPLES=NMR FID
##END=
