##TITLE=1H_Pr 5292
 200.13MHz, CDCl3,
 8 sc
 
 28.4.2025
##JCAMPDX= 6.0         $$ Bruker NMR JCAMP-DX V2.0
##DATA TYPE= NMR FID
##DATA CLASS= NTUPLES
##ORIGIN= UXNMR, Bruker Analytische Messtechnik GmbH
##OWNER= pz
$$ XWIN-NMR		Version 3.5
$$ Mon Apr 28 14:44:13 2025 Russian Standard Time (UT+4h)  she@DPX200
##.OBSERVE FREQUENCY= 200.1313
##.OBSERVE NUCLEUS= ^1H
##.DELAY= (6, 6)
##.ACQUISITION MODE= SIMULTANEOUS
##.ACQUISITION SCHEME= undefined
##.AVERAGES= 8
##.DIGITISER RES= 18
##SPECTROMETER/DATA SYSTEM= spect
##.PULSE SEQUENCE= zg30
##.SOLVENT NAME= CDCl3
##.SHIFT REFERENCE= (INTERNAL, CDCl3, 0, 14.3821)
##AUDIT TRAIL= $$ (NUMBER, WHEN, WHO, WHERE, WHAT)
$$ ##TITLE= Audit trail, XWIN-NMR		Version 3.5
$$ ##JCAMPDX= 5.01
$$ ##ORIGIN= Bruker BioSpin GmbH
$$ ##OWNER= she
$$ F:/spectra/data/she/nmr/H-C/1/audita.txt
$$ ##AUDIT TRAIL=  $$ (NUMBER, WHEN, WHO, WHERE, WHAT)
(   1,<2025-04-28 14:43:10.93 +0400>,<she>,<DPX200>,
      <created by zg, POWCHK disabled, PULCHK disabled
       configuration hash MD5:
       00 E9 B6 7A A2 85 ED C7 34 08 36 98 17 FE 4E 26
       data hash MD5: 16K
       B2 16 72 51 3E E0 E4 DA 90 9F E3 D7 6E 2D 36 90>)
$$ ##END=
$$ 
$$ hash MD5
$$ 43 A1 BC 58 D7 C8 3A 55 07 48 AC 65 0D 42 6D 84
##$RELAX= 
##$RELAX= 
##$RELAX= 
##$RELAX= 
##$RELAX= 
##$RELAX= 
$$ Bruker specific parameters
$$ --------------------------
##$DU= <F:/spectra>
##$EXPNO= 1
##$NAME= <H-C>
##$PROCNO= 1
##$TYPE= <nmr>
##$USER= <she>
##$AMP= (0..31)
100 100 100 100 100 100 100 100 100 100 100 100 100 100 100 100 100 100 
100 100 100 100 100 100 100 100 100 100 100 100 100 100 
##$AQSEQ= 0
##$AQ_mod= 1
##$AUNM= <au_zg>
##$AUTOPOS= <>
##$BF1= 200.13
##$BF2= 200.13
##$BF3= 200.13
##$BF4= 200.13
##$BF5= 200.13
##$BF6= 200.13
##$BF7= 200.13
##$BF8= 200.13
##$BYTORDA= 1
##$CFDGTYP= 0
##$CFRGTYP= 5
##$CHEMSTR= <none>
##$CNST= (0..31)
1 1 145 1 1 1 1 1 1 1 1 1 1 1 1 1 1 1 1 1 1 1 1 1 1 1 1 1 1 1 1 1 
##$CPDPRG= <>
##$CPDPRG1= <>
##$CPDPRG2= <>
##$CPDPRG3= <>
##$CPDPRG4= <mlev>
##$CPDPRG5= <mlev>
##$CPDPRG6= <mlev>
##$CPDPRG7= <mlev>
##$CPDPRG8= <mlev>
##$CPDPRGB= <>
##$CPDPRGT= <>
##$D= (0..31)
0 0.7 0 0 0 0 0 0 0 0 0 0.03 0 0 0 0 0 0 0 0 0 0 0 0 0 0 0 0 0 0 0 0 
##$DATE= 1745836990
##$DBL= (0..7)
120 120 120 120 120 120 120 120 
##$DBP= (0..7)
150 150 150 150 150 150 150 150 
##$DBP07= 0
##$DBPNAM0= <>
##$DBPNAM1= <>
##$DBPNAM2= <>
##$DBPNAM3= <>
##$DBPNAM4= <>
##$DBPNAM5= <>
##$DBPNAM6= <>
##$DBPNAM7= <>
##$DBPOAL= (0..7)
0.5 0.5 0.5 0.5 0.5 0.5 0.5 0.5 
##$DBPOFFS= (0..7)
0 0 0 0 0 0 0 0 
##$DE= 6
##$DECBNUC= <off>
##$DECIM= 32
##$DECNUC= <off>
##$DECSTAT= 4
##$DIGMOD= 1
##$DIGTYP= 9
##$DL= (0..7)
0 120 120 120 120 120 120 120 
##$DP= (0..7)
150 150 150 150 150 150 150 150 
##$DP07= 0
##$DPNAME0= <>
##$DPNAME1= <>
##$DPNAME2= <>
##$DPNAME3= <>
##$DPNAME4= <>
##$DPNAME5= <>
##$DPNAME6= <>
##$DPNAME7= <>
##$DPOAL= (0..7)
0.5 0.5 0.5 0.5 0.5 0.5 0.5 0.5 
##$DPOFFS= (0..7)
0 0 0 0 0 0 0 0 
##$DQDMODE= 0
##$DR= 18
##$DS= 0
##$DSLIST= <SSSSSSSSSSSSSSS>
$$ [...]
##$SUBNAM0= <"">
##$SUBNAM1= <"">
##$SUBNAM2= <"">
##$SUBNAM3= <"">
##$SUBNAM4= <"">
##$SUBNAM5= <"">
##$SUBNAM6= <"">
##$SUBNAM7= <"">
##$SUBNAM8= <"">
##$SUBNAM9= <"">
##$SW= 18.0517328524113
##$SWIBOX= (0..15)
0 0 2 0 0 0 0 0 0 0 0 0 0 0 0 0 
##$SW_h= 3612.71676300578
##$TD= 16384
##$TD0= 1
##$TE= 0
##$TE2= 300
##$TE3= 300
##$TEG= 300
##$TL= (0..7)
0 120 120 120 120 120 120 120 
##$TP= (0..7)
150 150 150 150 150 150 150 150 
##$TP07= 0
##$TPNAME0= <>
##$TPNAME1= <>
##$TPNAME2= <>
##$TPNAME3= <>
##$TPNAME4= <>
##$TPNAME5= <>
##$TPNAME6= <>
##$TPNAME7= <>
##$TPOAL= (0..7)
0.5 0.5 0.5 0.5 0.5 0.5 0.5 0.5 
##$TPOFFS= (0..7)
0 0 0 0 0 0 0 0 
##$TUNHIN= 0
##$TUNHOUT= 0
##$TUNXOUT= 0
##$USERA1= <user>
##$USERA2= <user>
##$USERA3= <user>
##$USERA4= <user>
##$USERA5= <user>
##$V9= 5
##$VALIST= <valist>
##$VCLIST= <CCCCCCCCCCCCCCC>
##$VD= 0
##$VDLIST= <DDDDDDDDDDDDDDD>
##$VPLIST= <PPPPPPPPPPPPPPP>
##$VTLIST= <TTTTTTTTTTTTTTT>
##$WBST= 1024
##$WBSW= 4
##$XGAIN= (0..3)
0 0 0 0 
##$XL= 0
##$YL= 0
##$YMAX_a= 237881
##$YMIN_a= -267832
##$ZGOPTNS= <>
##$ZL1= 120
##$ZL2= 120
##$ZL3= 120
##$ZL4= 120
##$ABSF1= 10
##$ABSF2= 0
##$ABSG= 5
##$ABSL= 3
##$ALPHA= 0
##$AQORDER= 0
##$ASSFAC= 0
##$ASSFACI= 0
##$ASSFACX= 0
##$ASSWID= 0
##$AUNMP= <proc_1d>
##$AZFE= 0.1
##$AZFW= 0.1
##$BCFW= 1
##$BC_mod= 2
##$BYTORDP= 1
##$COROFFS= 0
##$CY= -3
##$DATMOD= 1
##$DC= 2
##$DFILT= <>
##$DTYPP= 0
##$F1P= 0
##$F2P= 0
##$FCOR= 0.5
##$FTSIZE= 0
##$FT_mod= 4
##$GAMMA= 1
##$GB= 0.15
##$INTBC= 1
##$INTSCL= 1
##$ISEN= 128
##$LB= 0.25
##$LEV0= 0
##$LPBIN= 0
##$MAXI= 10000
##$MC2= 0
##$MEAN= 0
##$ME_mod= 0
##$MI= 1.114404
##$NCOEF= 0
##$NC_proc= 0
##$NLEV= 6
##$NOISF1= 3.799351
##$NOISF2= 2.8
##$NSP= 1
##$NTH_PI= 0
##$NZP= 0
##$OFFSET= 14.38212
##$PC= 1
##$PHC0= -1190.818
##$PHC1= 15.99221
##$PH_mod= 1
##$PKNL= yes
##$PPARMOD= 0
##$PSCAL= 0
##$PSIGN= 0
##$REVERSE= no
##$SF= 200.129724274929
##$SI= 16384
##$SIGF1= 3
##$SIGF2= 2
##$SINO= 400
##$SIOLD= 16384
##$SREGLST= <1H.CDCl3>
##$SSB= 0
##$STSI= 0
##$STSR= 0
##$SW_p= 3205.1282051282
##$SYMM= 0
##$S_DEV= 0
##$TDeff= 0
##$TDoff= 0
##$TI= <>
##$TILT= no
##$TM1= 0
##$TM2= 0
##$TOPLEV= 0
##$USERP1= <user>
##$USERP2= <user>
##$USERP3= <user>
##$USERP4= <user>
##$USERP5= <user>
##$WDW= 1
##$XDIM= 8192
##$YMAX_p= 0
##$YMIN_p= 0
$$ End of Bruker specific parameters
$$ ---------------------------------
##NTUPLES= NMR FID
##VAR_NAME=  TIME,          FID/REAL,        FID/IMAG
##SYMBOL=    X,             R,               I
##VAR_TYPE=  INDEPENDENT,   DEPENDENT,       DEPENDENT
##VAR_FORM=  AFFN,          ASDF,            ASDF
##VAR_DIM=   8192,          8192,            8192
##UNITS=     SECONDS,       ARBITRARY UNITS, ARBITRARY UNITS
##FACTOR=    0.0002768,     1,               1
##FIRST=     0,             0,               0
##LAST=      2.2672688,     0,               0
##MIN=       0,             -267832,         0
##MAX=       2.2672688,     237881,          0
$$ Real data points
##PAGE= N=1
##DATA TABLE= (X++(R..R)), XYDATA
0@%%%%%%%%%%%%%%%%%%Nj3J6j6J6j6J8k6L2l2L6m4M8n2O0o8P7q5R6j08J19j32
$$ 0 0 0 0 0 0 0 0 0 0 0 0 0 0 0 0 0 0 0 5 -8 8 -8 8 -8 10 -16 16 -16 20 -24 24 -28 32 -36 41 -44 52 -56 63 -69
40f9J46j63J81j99K19k39K63k91L20l53L89m30M75n23N79o45P20q08R12j037J191
$$ -69 77 -86 95 -104 115 -124 139 -152 168 -185 204 -226 249 -274 305 -340 380 -428 484 -553 638
61F38j388J650k004K513l305M671p438J5000p2032k06137K53151K02044j86134
$$ 638 -750 900 -1104 1409 -1896 2775 -4663 10337 -61695 -267832 -14681 187363 1229
74A229r2015J36362l2163j06369J28101Q4933j89668p0565J91723M2261j58359
$$ 1229 -90786 45576 13413 -92956 35145 120078 -69590 -140155 51568 93829 -64530
85f4530L779J18510k7644m9437N5377k4986q9653O8926J03595q6205q5494Q7381
$$ -64530 -60751 57759 30115 -19322 36055 11069 -78584 -9658 93937 7732 -77762 9619
97I619M6759p4316J4851O7801p1438p3753Q6307N2261q2345j0359P1979l8859
$$ 9619 56378 -17938 -3087 64714 -6724 -80477 5830 58091 -24254 -34613 37366 -1493
109a493o1061P5688M3483r5484j3619J02091k1422r5385O1406R1665q0430p5000
$$ -1493 -62554 13134 56617 -38867 -52486 49605 28183 -67202 -5796 85869 5439 -69561
121f9561Q0290L9243p6886J547P1425l1741n7738N1402L7098o2301j8281N5538
$$ -69561 10729 49972 -26914 -25367 46058 14317 -43421 7981 45079 -17222 -35503 20035
133B0035l981m3322J4234J8760j2981K4318J9453o3683k8850Q2580K9116q2597
$$ 20035 16054 -27268 -13034 5726 -7255 17063 36516 -27167 -56017 26563 55679 -26918
145b6918j4390O9290j2473m9279M5699L2040p0830j6491P6915o879p2283L5103
$$ -26918 -41308 27982 15509 -33770 11929 43969 -26861 -43352 33563 26684 -45599 -10496
157a0496O4248n3931m7061O4124K2754o5276M213N7318l0353m3379M9731K3828
$$ -10496 53752 -179 -47240 16884 39638 -25638 -21425 35893 5540 -37839 11892 35720
169C5720n9174R49O0832k8374o2863M1434N4453m1484l2225L5753K717k6637K8628
$$ 35720 -23454 -22505 38327 9953 -52910 -11476 42977 1493 -30732 5021 7738 -18899 9729
182I729K1532m9665j5365N5629M918m6681J4076L3941l2548k0649M3002K686m7916
$$ 9729 31261 -18404 -33769 21860 26778 -19903 -5827 28114 -4434 -25083 17919 20605 -27311
195b7311J4159M4023l0844l4418M3105K1010m8777m523M7817j3242m2242K7868
$$ -27311 -13152 30871 27 -34391 8714 29724 -19053 -23576 24241 10999 -31243 -3375
207c375L4228l2888j7523L3434k949l1578K2049K7237l7101k1974M1018J2606
$$ -3375 30853 -2035 -19558 13876 10927 -20651 1398 28635 -8466 -30440 10578 23184
219B3184l6739K065K7504j8546j7803L0464Q026l5602M109L4953j4559k7194K4226
$$ 23184 -13555 -11490 16014 -2532 -20335 10129 18155 -17447 -13338 21615 7056 -20138 4088
232D088J5825l0521k925L1621j0684k9254K1243K1983k7963j1335K9090l439k7848
$$ 4088 19913 -10608 -13533 18088 7404 -21850 -607 21376 -6587 -17922 11168 7729 -20119
245b0119J7653K4454k7346j7826L2987J0175l0738O05K4682j2037j6248K1449
$$ -20119 -2466 21988 -5358 -23184 9803 19978 -10760 -10155 14527 2490 -13758 7691
257G691P016k7269K203K7580j0770k4720J5650J6450j9076o170J8869l914j6145
$$ 7691 14707 -12562 -10359 17221 6451 -18269 -2619 13831 -5245 -11415 7454 3540 -12605
270a2605J4344J2321k0469n925K3131q77k1388Q465J6516j4169r880J7771J210
$$ -12605 1739 14060 -6409 -12334 10797 9920 -11468 -3003 13513 -656 -10536 7235 8445
283H445j9655O419J7327j4016j3568J9107P136k0186J72J9304o937j5348J3238
$$ 8445 -11210 -4791 12536 -1480 -15048 4059 11195 -8991 -8819 10485 3548 -11800 1438
296A438J0303j6508l345J7551l525j5531R250J1424j3873o588J5292O5j5149N374
$$ 1438 11741 -4767 -8112 9439 5914 -9617 -367 11057 -2816 -9404 5888 5953 -9196 -3822
310c822J1979r700p085J1908K019j2382M268J1631q854p889J2226M232j3293M07
$$ -3822 8157 -1543 -8628 3280 5299 -7083 -2815 8816 -38 -7927 4299 8531 -4762 -4355
324d355J1938n348r466Q881M988j1715p02J1880l656j1027P177Q481r648m005
$$ -4355 7583 2235 -7231 1650 6638 -5077 -5779 6101 2445 -8582 -1405 7076 -2572 -6577
338f577J0805L4r819M536Q273p298n087Q853J411r102J809P588n485n743P263
$$ -6577 4228 4262 -5557 -1021 7252 -46 -5133 3720 5131 -3971 -2162 5426 -59 -5802 1461
353A461K280p952L52P283l345m860O062K267o815R52P220l260n537N040L755o340
$$ 1461 3741 -4211 -3859 3424 79 -4781 1281 3548 -3267 -2315 4905 1645 -3892 1148 4903 -1437
369a437j020O026k358n313M580L225o301j706O431l92n747K653M159m068j603
$$ -1437 -2457 3569 1211 -4102 478 3703 -2598 -4304 2127 1735 -4012 -1359 2800 -1268 -2871
384b871N657j12n724K333M782k973l054L467L57l883J964L118m183k895M963J428
$$ -2871 2786 2674 -3050 -717 4065 1092 -1962 1505 1862 -2021 -57 3061 -1122 -4017 946 2374
400B374m943O9L715j728j585L954J37n186J965N422k060m837K805K962l189l86
$$ 2374 -2569 -2500 1215 -513 -2098 1856 1993 -3193 -1228 4194 2134 -2703 102 3064 -125 -511
416e11K534k853k644M739J939n848j244N287j34l831K233K354l982r4N434q89
$$ -511 2023 -830 -3474 1265 3204 -2644 -3888 1399 1265 -2566 -333 2021 -1961 -2055 3379 2490
432B490n367K160M746k988k949L086O18l770J421L011l505k045M287L06m608J964
$$ 2490 -2877 -717 4029 1041 -1908 1178 1796 -1974 -553 2458 -1047 -3092 1195 1501 -3107 -1143
448a143L814l583k681N714J718o060m0N465j363l605K791J300m770N82N321k131
$$ -1143 2671 -912 -3593 2121 3839 -2221 -2261 3204 1841 -1764 1027 2327 -2443 -1861 3460 1329
464A329m890K295K400k352M66K643l766k212O466K186p296j089P404J42o260J451
$$ 1329 -3561 -1266 1134 -1218 -752 1891 -1875 -4087 2379 4565 -2731 -3820 3584 3726 -2534 -1083
480a083M191l320j709M816p44o052J557N515j631m784J505K027j082J542J157
$$ -1083 3108 -212 -1921 2895 2151 -3901 -2344 3171 1540 -3244 -1739 288 -794 748 1905
495A905m177j029O041J717o601r72N644K59l756J186J153l397Q5N481j214o869
$$ 1905 -2272 -3301 2740 4457 -2144 -3116 2528 2787 -969 217 1370 -2027 -1942 3539 2325 -4544
511d544Q18O047K72l775n12K58N59L708L89n843j774P367K701o834k068M736R5
$$ -4544 -3726 2321 2593 -1182 -1694 -1436 -877 2831 3220 -2623 -4397 2970 5671 -1163 -3231 1505 1600
528A600k531K453Nn739O16Q102m71q242l85N838J123k216l14j043p93L892J652
$$ 1600 -931 1522 1527 -4212 -3596 4506 4035 -4207 -4592 1246 2369 153 -161 -1204 -1997 1895 3547
545C547m475j166M446j008l919L137K762n328j487O175Jp009J494O331k835m233
$$ 3547 -928 -2094 2352 1344 -2575 562 3324 -2004 -3491 2684 2685 -4324 -2830 3501 666 -3567
561c567L883J824m305J035N113k700m541L400K493l464M24M017m136m496N896
$$ -3567 316 2140 -2165 -1130 3983 1283 -3258 142 2635 -829 -405 3612 -524 -5020 876
576H76M097o254l417N843Q12n022J661M566l245l545M282K161l600p1K919j658
$$ 876 4973 -1281 -4698 1145 1957 -3065 -1404 3162 -83 -3628 654 2815 -785 -856 2063 405
592D05j954K849L94l514R83L569k594l960L716K562l966j075M970j156m989K981
$$ 405 -1549 1300 1694 -1820 -837 2732 138 -3822 -106 2456 -1510 -2585 2385 1229 -3760 -779
608g79N375m040m521M517L049m407r04M306j396l633K553K266l741o15M193j606
$$ -779 4596 556 -3965 552 3601 -806 -1710 2596 1200 -2433 120 2386 -1355 -1970 2223 617
624F17m450L384L678m202k229M552L66m048J993L603l904j952N007P21n387L20
$$ 617 -3833 -449 3229 -973 -3202 1350 1716 -2332 -339 3264 -640 -2592 2415 3136 -2251 -1931
640a931M624j814l160K650P99l808J640M128l283l729M289K465m537k15N056j768
$$ -1931 2693 879 -2281 369 1168 -2640 -1000 3128 -155 -3884 405 2870 -1667 -1882 3174 1406
656A406m504L310L752m189k275L857L09l847J438L284k886k584L700J521m121
$$ 1406 -3098 212 3964 -225 -2500 1357 1666 -2181 -743 2541 -345 -2929 771 2292 -1829
671a829j52L319q19j849K144L78l059J394L827j954l760J829K869k087j039K143
$$ -1829 -1981 1338 519 -1330 814 1192 -1867 -473 3354 1400 -2360 -531 2338 251 -788 1355
687A355j300k589K283K874l113k339K958J313k506M52K250j765j859L269J214
$$ 1355 55 -2534 -251 2623 -490 -2829 129 1442 -1064 -612 1638 -127 -1986 1283 2497
702B497l713m30L485p69k487J410J532k656n01L281q76l495J734K961j929j737
$$ 2497 -1216 -1646 1839 1070 -1417 -7 1525 -1131 -1632 1649 773 -2722 -988 1973 44 -1693
718a693K254J91k160J461K043k193j885L161R15l112N1K845j614j939J852J263
$$ -1693 561 752 -1408 53 2096 -97 -1982 1179 2094 -1018 -967 1878 264 -1675 177 1440
734A440k701j54K555j031k198K304J810k928o17K875k27k457J215J683j928p33
$$ 1440 -1261 -1415 1140 109 -2089 215 2025 -903 -1520 1355 1128 -1329 -114 1569 -359 -1092
750a092K444q9k961J047K501j915j691J825R47k297L70K261j408j667K062J214
$$ -1092 1352 1263 -1698 -651 1850 -65 -1756 69 1016 -1281 -911 1350 -58 -1725 337 1551
766A551j984o37K577m67k128J273J502k155j168K673J13k406L45K012j433j248
$$ 1551 -433 -1070 1507 1040 -1088 185 1687 -468 -1636 1037 1150 -1256 -911 1101 -332 -1580
782a580K106N22k313K1K750q74k013J617J459j977l74J893n81k010J566J288k049
$$ -1580 526 1048 -1265 -1244 1506 632 -1381 236 1695 -282 -656 1237 656 -1354 212 1500 -549
799e49r77K088J52k156P89J571j245r91J868L18j867K82K117j152j387J735Q75
$$ -549 -1526 562 714 -1442 -653 918 -327 -1318 550 868 -999 -717 1400 248 -1139 596 1471
816A471j959l00K047p41j527Q32J065j583m29J881j71j858P52J574j295p17J602
$$ 1471 -488 -788 1259 518 -1009 -177 888 -695 -1124 757 586 -1272 -520 1054 -241 -958 644
833F44P7j253K59J435p65j271J354O22j715k07J621n45j379R92R01j585k01J505
$$ 644 721 -532 -273 1162 397 -874 480 1102 -613 -820 801 256 -1123 -131 770 -815 -1016 489
851D89j87j219P79J012r67o60J636j81j258M75J234j028r70J082M53j252K1J093
$$ 489 302 -917 -138 874 -93 -753 883 702 -556 -81 1153 125 -845 237 690 -562 -541 552
869E52n77j010Q55O91j062k10J312k09j064O61Q86p65k50J015l14j003L62J006
$$ 552 -25 -1035 -180 511 -551 -761 551 342 -722 -61 825 60 -190 825 511 -492 -130 876
887H76q39r41J017L85j157j01J379o50r69J195N58j036l22J173j15q44N70P25
$$ 876 37 -904 113 498 -659 -760 619 -31 -1000 195 753 -283 -605 568 453 -391 179 904
905I04r55m85J255r9j066K01R67r53n27J076j65r77M89J174q20p29Q46O35r90
$$ 904 -51 -536 719 620 -446 -245 722 -231 -758 318 153 -824 -335 839 19 -710 136 771 -219
924b19k68R77j98n87M38M39p13l14P28o8q83M94M29n21k16O68j6j041P32Q70m91
$$ -219 -487 490 292 -295 143 582 -131 -445 283 215 -668 -174 255 -266 -482 186 170 -871 -139 731 240
945B40p24Q21M25o75k13O20k59o54M09N74p11n23M61N54o08r5J14K0o0N55j15
$$ 240 -484 337 762 87 -126 494 235 -419 -10 564 -147 -670 -209 345 -263 -358 -244 -224 -284 271 156
966A56m52Q3P54j74n92L13L40o79P5N75j07q69L89M69l55n44L38L15j41L4J80
$$ 156 -296 -213 541 367 -225 88 428 -251 -176 399 292 -577 -188 281 -74 -618 -280 35 -106 -72 108
987A08k77l0O05r4o71J96N11k67l85O44J5r02J84P85j43q84L45M26k84k74K98
$$ 108 -169 -199 406 312 -359 -163 348 81 -304 340 355 -547 -363 422 279 -605 -260 166 -118 -392 -94
1008i4K25j60J45O5l04K19L53m23MK73k17k04k0O49l52p19L51M19n5l82j51M14
$$ -94 131 -29 116 181 -123 96 449 26 30 303 86 -118 -138 511 159 -560 -209 210 155 -227 -378 36
1030C6k4n2M30l18m7j9PM66j74m83J14M84q0k15k76K0M1J05k37o8J29L54m54k5
$$ 36 12 -40 390 72 25 6 13 479 305 -178 -64 420 340 125 -151 -131 -90 15 -222 -290 -161 193 -261 -286
1054b86L04J41l04J53L17k35l54L46K87j01o21L36M4N5k41M1jm4J4M8%J88r9l38
$$ -286 18 159 -145 8 325 90 -264 82 369 268 -353 -17 27 82 -159 -118 -119 -163 -149 -101 -101 87 -12 -350
1078c50M57M37l72j88L44k6m12O0L00j84j89q1K20j4Jk9l35J81K04Q8l42J84J47
$$ -350 107 544 172 -16 328 302 -110 -50 250 66 -123 -204 16 2 3 -26 -361 -180 24 112 -230 -46 101
1101A01j84J15K85j70l04K65q1K33n4j99l6N4r9n1RJ08p3j94J37J96K6k01K08
$$ 101 -83 32 317 147 -157 108 27 260 206 7 -29 25 -74 -125 -116 -8 -81 -275 -138 58 84 -117 91
1124I1K7j0J72k88J71oQ2n77P8K49rj99K8L36l99j5N48k76l27N8O27j45l36M56
$$ 91 118 108 280 -8 163 157 239 -338 -260 -11 -20 -219 -191 145 -254 -269 279 3 -324 -266 361 216 -120 336
1148C36k88l38L99K68l72j36J58K24l72j2L08k48m19N68J61m30O7K82r2q8R1J06
$$ 336 48 -290 109 377 5 -131 27 251 -121 -133 175 -73 -492 76 237 -193 -126 156 64 -24 67 173
1170A73j53O0N7m7n6J7K61l01J2N1j10K4P5l8k18j0RL58k50J72J65k02p1J08K26
$$ 173 20 80 137 90 34 51 312 11 23 74 -36 -12 63 25 -193 -203 -194 164 -86 86 251 49 -22 86 312
1195C12k27k91K27O4jj24R8k49k29L12L68m11k40M09N1j82p7M23k32j79L90K58
$$ 312 85 -206 21 85 84 -40 58 -191 -420 -108 260 -151 -391 18 69 -113 -190 233 1 -178 212 470
1217D70n75N3M48k92k00K57pl52J53R7j0m61K08L45l61J44J37J15l04K46L33n09
$$ 470 -105 -52 396 104 -96 161 154 -198 -45 52 42 -419 -211 134 -227 -83 54 169 -135 111 444 -65
1239f5l1J01Pn2R5Q1l01n9L58j78l61L12J34l50N2K92j0k50K50L34j48k98K54
$$ -65 -96 5 12 -40 55 136 -165 -224 134 -44 -405 -93 41 -309 -257 35 25 -225 25 359 211 -87 167
1262A67K35l79M8K9o6k38J98J79l76o7K89O4k81o6N24l24j53M11j6j70j9L19j25
$$ 167 402 23 71 100 34 -204 -6 173 -203 -270 19 83 -198 -264 260 -64 -217 194 178 8 -11 308 183
1285A83l93M12o0l80J23M71l20k41L3K06l18j1M12j29j68m2M43j81k39L12kq2
$$ 183 -210 202 142 -238 -115 356 36 -205 -172 34 -284 -295 117 -12 -180 -222 221 40 -199 113 111 29
1307B9J5L06k09k23K22Nl64j00N27m57q4L09J1l78J83M39j19j38m1L46k91j10
$$ 29 44 350 141 -82 140 145 -219 -319 208 -249 -333 -24 -13 -391 -208 231 112 -26 -67 279 -12 -122
1329a22L55Q1n30K87K03k91k78K27L06n08l8M44k19k03K20J94k82j33M06J9l29
$$ -122 233 314 -216 71 274 -17 -295 -68 238 -270 -308 136 -83 -286 -66 128 -154 -287 119 138 -191
1350a91K56J30j32j89J75l2k35pM12l40j20K75J88m93J94K09K3l69L45K23m50
$$ -191 65 195 63 -126 49 17 -218 -225 187 -153 -273 2 190 -303 -109 100 123 -246 99 322 -128
1371a28P1L89k02l03K12K50k29j24L35k44j75j5L56l70k9J11J12j84R1K22j00
$$ -128 -57 332 130 -173 39 289 60 -64 271 27 -148 -163 193 -177 -206 -95 17 -167 -76 146 46
1392D6l43M48R0k93L4J71j9j77j1J47j9k99K33J33l84Q9K32q8j62K42M8j29R9
$$ 46 -297 151 241 -52 -18 153 134 -43 -54 93 74 -225 8 141 -243 -154 78 -10 -172 70 118 -11 88
1415H8J67p2k44J39J03k94K09M0J6n18L37L21n64JK98R1l17J17K74k58j76K06
$$ 88 255 183 -61 78 181 -113 96 136 152 -366 -29 292 -272 -271 27 118 -199 -82 192 -66 -242 -36
1437c6K30k38L6K03m4l87M46k34l1n7K18m9j90OL55l79p7J52J93l50K74J45j80
$$ -36 194 -44 -8 195 151 -236 210 -24 -55 -112 106 57 -133 -127 228 -151 -228 -76 117 -233 41 186 6
1460Fk26L45J97m26k8L86o3l00J67k5k47Q1K09j74n5J18K36m03K1J78J59m72L97
$$ 6 -220 125 322 -104 -132 254 191 -109 58 33 -214 -133 76 -98 -153 -35 201 -202 -181 -3 156 -316 81
1483H1R5ok44J71J24k05j31L42j34l05J48K16j94k59K78n9j9P4K31k68J14J82
$$ 81 176 170 -74 97 221 16 -115 227 93 -212 -64 152 -42 -301 -23 -82 -101 -27 204 -64 50 232
1505B32j12o9J31L4k54Q1J09L0m44J10J49j09j64K96Ok96L3J57K5o7J13O6n0R4
$$ 232 120 51 182 216 -38 43 152 182 -262 -152 -3 -112 -276 20 26 -270 -237 -80 -55 -122 -9 57 7 101
1529A01J68j71j34P9J55l27j4J66K9k30J43J70j09j67n3J63L3J0J94j09j31J53
$$ 101 269 98 -36 43 198 -129 -143 23 52 -178 -35 135 26 -141 -194 -31 2 12 206 97 -34 119
1551A19K46j12k8P3p5j27j86K56l01k7L7K07k21j78K94n7j82K19K84k19j24K58
$$ 119 365 253 225 298 223 96 -90 166 -135 -162 -125 82 -139 -317 -23 -80 -262 -43 241 22 -102 156
1573A56j4k77L39n6l81J67P8n4j12J8L32j93j36K15r6j46J65K29j58l46N01p6
$$ 156 142 -135 204 148 -233 -66 12 -42 -154 -136 196 3 -133 82 -14 -160 5 234 76 -270 231 155
1595A55k55J61P1k14J25R8O3k65j33L53j82j39K14Lj21p0K58j53j27O1J64p9Q3
$$ 155 -100 61 132 -82 43 141 204 -61 -194 159 -23 -162 52 55 -66 -136 122 -31 -158 -97 67 -12 71
1618G1L7J31k28qJ65j95j04Q2J54j24m8K22j76k43J15O6j3o0K01K86k23k08K57
$$ 71 108 239 11 3 168 -27 -131 -49 105 -19 -67 155 -21 -264 -149 -83 -96 -156 45 331 108 -100 157
1641A57lk14jK81j69k03M07j74j74j1J52%j35J30J33l64K21J02j55n7L03j77p1
$$ 157 154 -60 -61 220 51 -152 255 81 -93 -104 48 48 -87 43 176 -188 33 135 -20 -77 226 49 -22
1664b2J3K28j51k01J32Q0k94Q9R8J35k51lK89m12J65K35o6k86K72K36k53n3J38
$$ -22 -9 219 68 -133 -1 79 -215 -126 -28 107 -144 -147 142 -270 -105 130 64 -222 50 286 33 -20 118
1687A18r4j73Q5K46k75P1q5k1j43K43m2J27j28K5R5Pj85J00J80k06QK41Qk49J25
$$ 118 24 -149 -64 182 -93 -22 -107 -128 -271 -28 -70 57 -71 -46 49 56 -129 -29 151 -55 -47 194 202 -47 78
1712G8nL7n4jj13N2j47J35j67n8J54J53k03m3J93j10J57J55j23j94K2J75k41Q7
$$ 78 73 110 56 55 -58 -6 -153 -18 -185 -243 -89 64 -139 -182 11 -99 58 213 90 -104 -82 93 -148 -61
1736f1P3O2l39J42J96m9k05R5J04j08k1J03J23k21P5J43Jn8J61j0j62M9K04k80
$$ -61 12 74 -265 -123 73 24 -181 -86 18 -90 -111 -8 115 -106 -31 112 113 55 216 206 44 93 297 17
1760A7r0M4J30j92P1J68k44P0R6K0j49J8K21L6k97K38J24l80R1J03l1r0oJ02j52
$$ 17 -73 -29 101 -91 -20 148 -96 -26 70 90 -59 -41 180 216 -81 157 281 -99 -8 95 64 -26 -32 70 -82
1785h2l5J22K50l30j47K50NMj64J99n1q6J08J31n1n6j4l7j7O0N1j78j82L37J4
$$ -82 -117 5 255 -75 -222 28 33 37 -127 72 21 -65 43 174 123 67 53 16 -1 59 110 -68 -250 87 101
1810A01k53K60j35r0q3M46j68j69j39L96k32P0J27J03m21J60K29j72j06J00j3
$$ 101 -152 108 -27 -117 -200 246 78 -91 -230 166 -66 4 131 234 -187 -27 202 30 -76 24 11
1831A1k66J93J14Lj94k5L41l38R0K36j38k1Q0j26kQ9r6Q2j45J0L58l82j06L89
$$ 11 -255 -62 52 55 -139 -164 177 -161 -71 165 27 6 86 -40 -42 47 -49 33 -112 -102 256 -126 -232 157
1855A57k31OR5O2j43k0R3k3MR0Q1O2l15J65p4j4M0M4n1k00Q9R7q7j26K68j5j37
$$ 157 -74 -68 27 89 -54 -74 19 -4 0 90 171 233 -82 83 9 -5 35 79 28 -172 -83 14 -73 -199 69 54 -83
1882h3J26M4R3l60J01J38q8J20m5p7J3Q8l7j3j66J27K7p4J9K8J26j53lm5J36J51
$$ -83 43 87 180 -180 -79 59 -29 91 46 -31 -18 70 33 20 -146 -19 8 -66 -47 -19 107 -46 -49 -94 42 193
1908A93j00lj28K57m7k35on1K14r6J30j37k83K52Q0oJ3n4K59j97r2J89n1l57J85
$$ 193 93 90 -38 219 172 -63 -69 -120 94 -2 128 -9 -292 -40 40 34 47 -7 252 55 -37 152 101 -256 -71
1933g1K40kj89j45K51O4l78L65k30j4O5K32j47R1r4N9k08J20kj70K3J07J75q5
$$ -71 169 167 -22 -167 84 148 -230 135 -95 -109 -44 188 41 132 38 97 -111 9 7 -163 -140 -33 142 57
1957E7R8j41m5K1MJ89k61P2k0K42n10K15K3j9j0J46J71k71J46j11K75l74M7K76
$$ 57 155 14 -31 -10 -6 183 -78 -6 -26 216 -294 -79 -56 -75 -85 61 232 -39 107 -4 271 -103 -56 220
1981B20k14l1J80j42o6J26j6l5j63L08k18j37K01J71k68K5J16J75m35K29J02k00
$$ 220 6 -25 155 13 -53 73 57 22 -141 167 -51 -188 13 184 -84 -59 57 232 -203 26 128 -72
2003g2N6Q0P8l05l5L04j62K8K02k91PqK14rm5j41K07K3k10K1l8j3N2J72j12n7
$$ -72 -16 64 142 -163 -198 106 -56 -28 174 -117 -110 -118 96 87 42 -99 108 131 -79 -58 -96 -109 -57 115 3 -54
2029e4M3j44J88K2p5l0J85j51Rq9o3J73K4o5Q4j0J05j97J10N7j12N1k28J99o3
$$ -54 -11 -155 33 55 -20 -50 135 -16 -7 -96 -159 14 38 -27 57 47 152 -45 65 122 10 61 -167 32 -31
2054c1r1R5r6M7J32r0J14L1n3j31mK8K2R2j81K11l9j63L33k28j41Q2M4j32J25
$$ -31 -122 -27 -123 -76 56 -34 80 111 58 -73 -77 -49 -27 65 -116 95 56 -107 226 -2 -143 -61 -17 -149 -24
2079b4N6Q0qk53R8R3j71O6J17q7j6N8J38k57P8K10k18o0J15J20k63Q5M2qj57K65
$$ -24 32 112 104 -149 -51 42 -129 -63 54 -33 -49 9 147 -110 -32 178 -40 -100 15 135 -128 -43 -1 -9 -166 99
2105I9j46P3j22J30m1k4O9O0r2j87K05j24k1J63j09O5L7n8K70l29o6J28Q7p4l4
$$ 99 -47 26 -96 34 -7 -31 38 98 6 -181 24 -100 -121 42 -67 -2 35 -23 247 -82 -148 -20 67 -7 -41
2130d1J33j92J11K21n0j43n0J97k20%J11m2o4j01Q3N8n9q3J50m1j11J41K07k78
$$ -41 92 -100 11 232 182 39 -11 186 -34 -34 77 35 -29 -130 -47 11 -48 -131 19 -22 -133 8 215 -63
2154f3M0K76k61j09J20O3j20m5J56p3m1J09k22K78n2p2Qj23J01mm3R6Q4n5j78
$$ -63 -23 253 -8 -117 3 66 -54 -99 57 -16 -57 52 -170 108 56 -16 -8 -131 -30 -34 -77 19 103 48 -130
2179a30J41O5K42n12L94l62N3j0J20j24J55j41O6l1J60m5j19k1J32M1j47P3Q3
$$ -130 11 76 318 -194 200 -162 -109 -119 1 -123 32 -109 -43 -74 86 41 -78 -99 33 74 -73 0 83
2202H3k7j70K55j31k4o4J76p8j10K08Np4j08n0K40j24K5M2m7j80J51n9J0p7J43
$$ 83 56 -114 141 10 -14 -78 98 20 -90 118 123 49 -59 -109 131 7 32 74 27 -153 -2 -61 -51 -128 15
2227A5o3k1N5J19n3p7Mo4p8K00R4j49l38L76K07j66M2j84K08k33P0J04k23J80
$$ 15 -48 -69 -14 105 52 -25 -21 -85 -163 37 131 -18 -356 20 227 61 103 -81 127 -106 -36 68 -155 25
2251B5R8Q0m02K06M9j59l8K74n2p5j6j06K00l3j10oJ22j7Rn7j6p0J76k78K03J53
$$ 25 123 203 -199 7 56 -103 -141 133 81 6 -10 -116 84 51 -59 -65 57 40 49 -8 -24 -94 82 -196 7 160
2277A60j52k2j17J22J1J7K0K0m1k4N6k77J46J74K5k17M3J35o9j03J67p9j82J06
$$ 160 8 -14 -131 -9 2 19 39 59 18 -6 50 -227 -81 93 118 -99 -56 79 10 -93 74 -5 -187 -81
2301h1Q3L7j36R5o7M7K8J47k59M7M4J48j8j32M2P4k50j5J87J43k21L5M7j01N9
$$ -81 2 39 -97 -2 -69 -22 6 153 -106 -59 -15 133 115 -17 25 99 -151 -166 21 164 -57 -22 25 -76 -17
2326a7J23k23%R7K7J21j45n9J33q2J90j33k4p1J16J16q4j47k8K34j16Q2oj39j2
$$ -17 106 -117 -117 -20 7 128 -17 -76 57 -25 165 32 8 -63 53 169 85 -62 -90 144 28 110 104 -35 -47
2351d7J13j35J00r6M0l0M0K2L6M6k03J61k89J79j12K83m8r8R9j11n3J26q2KJ40
$$ -47 66 -69 31 -65 -25 -55 -15 7 43 89 -114 47 -242 -63 -175 108 60 -38 61 -50 -103 23 -59 -57 83
2376H3k5j10K75j78k5l88L60Np5K59k51P2N2j23J06q4J55j7j78J64j26L6Q9j5
$$ 83 58 -52 223 45 20 -368 -8 -3 -78 181 -70 2 54 -69 37 -47 108 91 -87 77 -49 -13 76 61
2400F1j33J26J00k44J6J80m5j02J95l37K99m4K4L4p4p5o9J31k82K66O0o4l1M7
$$ 61 -72 54 154 -90 -74 106 61 -41 154 -183 116 72 96 130 56 -19 -88 43 -239 27 87 23 -8 39
2424C9j04m6J76q6R6PQ2j55J59q7o0l3k88N70n5j01k92J80j36O6q3K56r3j40M2
$$ 39 -65 -111 65 -21 75 82 164 9 168 81 21 -12 -300 270 215 114 -178 2 -134 -68 -151 105 12 -128 -86
2449h6K7J18l1Q5J21j02%M6j84O7M8k0K1l9m1pL2l7k1R0j04o1J3N4R4k06J55m5
$$ -86 -59 59 28 113 234 132 132 178 -6 61 109 89 110 71 30 23 55 18 -3 87 -17 -78 -65 -11 83 -123 32 -13
2477a3k3l0R5M7k04M8Q2j6oRp7P7j09N8Ol3J7L13k15O0p1j60O9j20P9J81N2j24
$$ -13 -36 -66 29 76 -128 -80 2 -14 -20 -11 -88 -11 -120 -62 -56 -89 -72 241 26 86 15 -145 -76 -196 -117 64 116 -8
2505hR7j35J45j06J79j94R6O3p2j18O4N9l08J52J90j21P8P2%l29o8L67l03O4J06
$$ -8 89 -46 99 -7 172 -22 74 137 65 -53 11 70 -238 -86 104 -17 61 133 133 -196 -264 103 -200 -136 -30
2530c0M7J5n8K3J59j37R1j16k5P7m4n9l1J84P7o8j39N0j08J05j19l0Q8Q2O4Q9
$$ -30 17 32 -26 -3 156 19 110 -6 -31 46 2 -57 -88 96 173 105 -34 16 -92 13 -106 -136 -48 34 98 187
2556A87l86J46J65n0k36J48O7Q5j52q7J33O7q7P8j53R6j48J28L7N5k37J05R5r4
$$ 187 -199 -53 112 62 -174 -26 41 126 -26 -113 20 87 0 78 -75 21 -127 1 38 93 -144 -39 56 -38
2580c8M4j5J10k37J13k9P2M0j15L3j53M3J60O5j06L3Kj5J3J8k2o1L5r2N6J37j39
$$ -38 6 -9 101 -136 -23 -52 20 60 -55 -22 -175 -132 28 93 -13 20 22 7 20 38 16 -45 -10 -102 -46 91 -48
2607d8O7L2q2O2p1J23j69J38o2q0r8J32k5L3J45j29J49k29K69q7k21O1Q0M7N4
$$ -48 19 51 -31 31 -40 83 -86 52 -10 -90 -188 -56 -81 -48 97 -32 117 -112 157 70 -151 -90 -10 37 91
2632I1k08J35M6j30Q3k9kl1K1k4M3k7m2J5P3R4j14n0k3Q5J24j11j73J77Jn1K7
$$ 91 -117 18 64 -66 17 -12 -14 -45 -24 -48 -5 -32 -74 -59 14 108 -6 -56 -79 6 130 19 -154 23 24 -27 0
2659@J15R9j85lm4Nn2N5M5qpp2J63j09n5J34o3N3j80J31plPM6R5j87j22K01J4
$$ 0 115 214 29 26 -18 -13 -65 -10 35 27 20 -52 111 2 -53 81 18 71 -109 22 15 12 19 65 160 -27 -149 52 66
2688F6q7K1M2Lm2M5j98J76oj47J10L9r9N0J8M3J06j29j89J7J96kj67J0%l3J00
$$ 66 -21 0 42 45 3 48 -150 26 20 -127 -17 22 -77 -27 -9 34 140 11 -178 -161 35 33 -134 -124 -124 -157 -57
2715e7j8J8j39L09q2K2j51J62p2J54k62k2K15m6L3j58K8m9J07MK56j97K7j29N3
$$ -57 -75 -57 -196 113 31 53 -98 64 -8 146 -116 -138 77 31 64 -94 -66 -115 -8 -4 252 55 82 -47 6
2740Fq8o5K85j48R8j20j23P4p1Q5J46k03J79o9J38r7O5k06J93j93L7n3K5J1K79
$$ 6 -82 -147 138 -10 88 -32 -155 -81 -152 -67 79 -124 55 -14 124 27 92 -114 79 -114 -77 -130 -105 -94 185
2765A85j86j17P9R0JOl3o7p3J1J16L0p6N6R2k7p4M9p4m9L7P8o6k9j00R1J2l8Q9
$$ 185 -1 -118 -39 51 52 58 25 -42 -115 -104 12 42 -34 22 114 87 13 62 -12 -61 -24 54 -12 -41 -141 -50 -38 -76 13
2794A3j82K25j03j71L19j82O6M6p9l4J71j02k19L4J77N3k4J1j3j5K5Q4k37J36
$$ 13 -169 56 -47 -218 101 -81 -15 31 -48 -82 89 -13 -232 -198 -21 32 8 19 6 -9 16 100 -137 -1
2818aNK1N5r2j22P4m5J64J6Q3k73J24J05j58o3J30K5k05J04j2K20p5oL5n9P9m6
$$ -1 4 25 80 -12 -134 -60 -105 59 75 158 -115 9 114 -44 -107 23 48 -157 -53 -65 155 80 74 109 50 129 83
2845H3l6j7mO9n1J79j11j65j16J30J78r4q1l9O9O0m7J58q6qk21J53m5j24J29J24
$$ 83 47 30 26 95 44 223 112 -53 -169 -39 139 45 -36 -75 -6 54 7 165 79 71 -150 3 -42 -166 -37 87
2871H7j97N0N6Mo5O5K7n6J82k78PK8K2J16m0K4P0pK4r1J57l78O4J48J3q0MJ32
$$ 87 -110 -60 -4 0 -65 0 27 -29 153 -125 -118 -90 -68 48 8 32 102 95 119 28 185 -193 -129 19 32 -48 -44 88
2899H8j23o1M0OK35k08K6J22j56l3oj56J91J50k36Q5r6lKJ67m4R0K2q8p6j69L7
$$ 88 -35 -96 -56 -50 185 -23 3 125 -31 -64 -70 -226 -35 115 -121 -36 -132 -135 -133 34 -10 80 102 14 -62 -231 -194
2926a94J25L9J62j85J6nK55j14L9m3j08j7l9L0J61r8N2k1p9J2J15l2l23M26k14
$$ -194 -69 -30 132 -53 -37 -42 213 99 138 95 -13 -30 -69 -39 122 24 76 55 -24 -12 103 71 -252 174 -40
2951d0n5NK39j4l58J70L0j31PK94j87j8mJ38J00r7Kj01J12k66J52L7r6J85j43
$$ -40 -95 -90 149 135 -223 -53 -23 -154 -147 147 -40 -58 -62 76 176 79 81 -20 92 -174 -22 15 -81 104 -39
2976c9J56n4l06J86J58p6P9q1p6r1K11k00J09M6k7m5M2J8l5lO7k9o3J2K3K1N7
$$ -39 117 63 -243 -57 101 25 104 23 -53 -144 67 -133 -24 22 -5 -50 -8 10 -25 -28 39 10 -53 -41 -18 3 60
3003F0l1j33M1J01j87J63m8J07j23LR4r3J3q5J02k2O8m8L3j02J95j5p1j11J54
$$ 60 29 -104 -63 38 -149 14 -34 73 -50 -47 47 -46 -33 -118 -16 -38 30 -18 15 -87 108 93 22 -89 65
3028F5o6m2Q6l1O9p6P6q7R4r8J76l41L18pj53J62l16J27N0J10k98R9K20j91P6
$$ 65 -1 -43 43 12 81 5 81 -6 88 -10 166 -175 143 136 -17 145 -171 -44 6 116 -182 -83 137 -54 22
3053B2k8m0J73l9o1ln2j07J37j46J73j29O3n5Qp5l8K79j33L3o8p3J38J5o2%J34
$$ 22 -6 -46 127 88 27 24 -28 -135 2 -144 29 -100 -37 -92 -84 -159 -197 82 -51 -18 -86 -159 -21 -6 -68 -68 66
3080F6j20Q3l3J8np8Pm8J40k3L2q9o8J20j93KJ44Rl0n7J60l2J8j60J67k33K50
$$ 66 -54 29 -4 14 9 -69 -62 -110 30 7 39 -50 -118 2 -191 -189 -45 -36 -66 -123 37 5 23 -137 30 -203 47
3107D7j63J63k22K55Mk94K58J23m1j17Jk9m2J35m0k10L05j03j79P6J24m5J60L4
$$ 47 -116 47 -175 80 84 -210 48 171 130 13 14 -15 -57 78 38 -172 133 30 -149 -73 51 6 166 200
3131B00k72J81j12NN6j03k5l4R8P6j66O4l5lj6K9P6j36J18l3Q7k31P4p5J45J69
$$ 200 -72 109 -3 2 58 -45 -70 -104 -6 70 -96 -32 -67 -70 -86 -57 19 -117 1 -32 55 -176 -102 -177 -32 137
3157A37j11O6j13j2o4Q4R4j0j18r6L09r6j10K9N5l2j23K69j94LM8j59J32n1J11
$$ 137 26 92 -21 -33 -97 -13 81 71 -47 -143 166 70 -40 -11 44 12 -111 158 -36 -33 15 -144 -12 -63 48
3182D8j71K27j30o4J58j40R9k3j13J84Lp8J02q0r6R1J2o4N9j39J31n9P4l9J09
$$ 48 -123 104 -26 -90 68 -72 27 4 -109 75 78 0 102 22 -74 17 29 -35 24 -115 16 -43 31 -8 101
3207A01j13k21K44j66K84j06K0J8j10M1J5J5M5l7J08m7l6p8P0j40J82l6q3O9q2
$$ 101 -12 -233 11 -155 129 23 43 61 -49 -8 7 22 67 30 138 91 55 -23 47 -93 89 53 -30 39 -43
3232d3j0R8J07k62K00j33j5M4K5p3Q1KJ1K5nl1J80k55Q9j11j09J37m0J17o9MQ9
$$ -43 -53 45 152 -110 90 -43 -58 -14 11 -62 19 21 32 57 52 21 201 -54 35 -76 -185 -48 -88 29 -40 -36 53
3259E3m7r6K33j09kl1p5Q4n2K08j93O7K3N0o8j18K04j45O8N7j30j0PJ12r7Q3k63
$$ 53 6 -90 143 34 32 1 -74 10 -42 166 -27 40 63 113 45 -73 131 -14 54 111 -19 -29 -22 90 -7 76 -187
3286a87L11J1k0J04j67K9l5p3N1JO9j19Q5j4j83J60o4J21j16mk4R5o5K2lJ20k61
$$ -187 124 135 115 219 52 81 46 -27 24 25 94 -25 60 46 -137 23 -41 80 -36 -40 -64 31 -34 -12 -15 105 -156
3313a56J27j37K53%n4M3j54J47L2j93Q1K11k47J12k41K82n2K5r0J6k12J69k2L3
$$ -156 -29 -166 87 87 33 76 -78 69 101 -92 -11 200 -47 65 -176 106 54 79 -11 5 -207 -38 -60 -27
3337b7L7j34J42j07M4j6J02j40NR9J76j85J31j05o8o3RO6J76q2p3O3r4n1J81j07
$$ -27 10 -124 18 -89 -45 -61 41 -99 -94 5 181 -4 127 22 -46 -109 -100 -34 142 60 -13 50 -44 -95 86 -21
3363b1n1j54L69j80J83j89OJ03k09J84J68l42p2K44J13r5J59k61J21N7k51P5m4
$$ -21 -72 -226 143 -37 146 -43 -37 66 -143 41 209 -133 -205 39 152 57 216 -45 76 133 -118 -43 -87
3386h7J09j01J43j25J99k51k3K04j11q5K41r7P9k14K43j48j15Q4R2n4l4J24q4
$$ -87 22 -79 64 -61 138 -113 -136 68 -43 -128 113 16 95 -119 124 -24 -139 -55 37 -17 -51 73 -11
3409a1P6j82L9L9J46k78Q9L26j40oN6k10o3J97R2m9N5j23J29n7l4n3l4mq0mQ3
$$ -11 65 -117 -78 -39 107 -171 -82 244 104 98 154 -56 -119 78 170 121 176 53 182 125 91 38 4 0 -80 -84 -1
3436aj9K7N2L2J0j71J13j13O2L0l2L5j80K01j27J38k20J10Q0o0Q3j41J57j53J0
$$ -1 -20 7 59 91 101 -70 43 -70 -8 22 -10 25 -155 46 -81 57 -163 -53 27 -33 50 -91 66 -87 -77
3461g7J33j22L6n5J49r7pq8L0M9p0M8j0N1J12l4M4j50M5J09m5k46L20j02q0j05
$$ -77 56 -66 -30 -85 64 -33 -40 -128 -98 -49 -119 -71 -81 -30 82 48 92 -58 -13 96 51 -195 125 23 -57 -162
3487a62J17J53k37Q0l5K24J00m23J79L2j83K66o6j06K6R1j4N4j01O7j31P7R9J12
$$ -162 -45 108 -129 -49 -84 140 240 -183 -4 28 -155 111 45 -61 -35 56 42 96 -5 62 -69 8 107 219
3511B19k35Lk4Q8j49k9K13m3l8K12k77J11k6j72J64n3k4R2lN3r6j61J92J87k17
$$ 219 -16 -13 -37 51 -98 -127 86 43 5 217 -60 51 25 -147 17 -36 -60 32 29 82 -14 -175 17 204 -13
3536a3Q1O1k74O0J14o2J39n9j59K0N9l6J82j39K0K3J0rj1j36J83p8J23k20K08
$$ -13 68 129 -145 -85 29 -33 106 47 -112 -92 -33 -69 113 -26 -6 17 27 18 7 -129 54 -24 99 -121 87
3561H7j89J53O8l02J83n2q7J56M9OK0q2j59J51M5k9l2n9J60j04m3l4J53Rj59J05
$$ 87 -102 51 119 -183 0 -52 -139 17 66 72 92 10 -149 2 47 18 -14 -73 87 -17 -60 -94 59 68 -91 14
3587A4K9j22K6M3N6k37L40j86J08j06m1K05k68P7M8L5l4m9J54k16J50P7k49K83
$$ 14 43 -79 -53 -10 46 -191 149 -37 71 -35 -76 129 -139 -62 -14 21 -13 -62 92 -124 26 103 -146 137
3611A37j33j4r3J7oo7K74j27r4O4K63k65J38j61M5J02k6m5j18J47Q0k00J59r3
$$ 137 4 -10 -103 -86 -92 -159 115 -12 -106 -42 221 -44 94 -67 -22 80 54 9 -109 38 118 -82 77 -16
3635a6O2j99K45r6nK71l60J04oL9m2N5o7ko5J13Rk2k6n1n0O4J21j71J37O3j26
$$ -16 46 -153 92 -4 -9 262 -98 6 0 39 -3 52 -15 -17 -82 31 40 18 -8 -59 -109 -45 76 -95 42 105 -21
3662b1LK0R6k54J51j0j5N5R5j13J86l30J49k5Q4k19Q0n2K5L5M0O1J7N7r2p4P8
$$ -21 -18 2 98 -156 -5 -15 -30 25 120 7 193 -137 12 -13 71 -148 -68 -120 -95 -60 -20 41 58 115 23 -51 27
3689B7j6L3J4K5o3mj07J04K4k56J70J03Q0n1j16J82n2j84R7K6r4Q7n2Q7o5n1N0
$$ 27 11 44 58 83 20 16 -91 13 37 -219 -49 54 134 83 -33 149 97 -87 10 36 -58 29 -23 64 -1 -52 -2
3716bl8j06K57L4j19p8j9R8p6K7J1JJ45j48j9j52J78n6K41j55J66j47j76N1L0
$$ -2 -40 -146 111 145 26 -52 -71 27 -49 -22 -11 -10 135 -13 -32 -184 -6 -62 179 24 190 43 -133 -82 -52
3741e2o1J80n6K3J31j83J56j20O1J40j31j29M0K12k09r1J63j32K00j60K7NJ08
$$ -52 -113 67 11 34 165 -18 138 18 79 219 88 -41 -1 211 2 -89 74 -58 142 -18 9 14 122
3764A22J4k7J5l05J42n1k1Q0J2M0k1J66k84K20m5J2j27J63o7J02j20K0j16J15
$$ 122 136 109 124 -181 -39 -90 -111 -31 -19 21 0 166 -118 102 57 69 -58 105 38 140 20 40 -76 39
3788C9J5j71J56P2k7L1k01J52j24R0J67j51q2L4j70K88l5p8N8j64L9n2J81q9j8
$$ 39 54 -117 39 111 84 115 -86 66 -58 32 199 48 -34 0 -170 118 83 5 63 -101 -62 -114 67 -22 -40
3813d0k1O2J55ml26J69K1K5J08j46j02l2K34p9j25K20K9Jk07J11p5m6J31O8j67
$$ -40 -61 1 156 152 -174 -5 16 41 149 3 -99 -131 103 24 -101 119 148 149 -58 53 -22 -68 63 131 -36
3838c6J2j41K52j00M1N3j47j23J16M2p5J69j58L4OQ6j67M3O8M9l1OP5j76Q3%J08
$$ -36 -24 -165 87 -13 28 81 -66 -189 -73 -31 -106 63 -95 -61 -55 31 -136 -93 -25 24 -7 -1 74 -102 -19 -19 89
3865H9o6R1r8J73j41Q5j41p0J70k87K02m5L0n7K01k07M1p0R7p3J70l7p4N7L6j47
$$ 89 23 114 16 189 48 133 -8 -78 92 -195 7 -38 -8 -65 136 -71 -30 -100 -3 -76 94 57 -17 40 76 -71
3891g1j22J85q3J69J5R3l87N1K49j85M9Q1r4L4K48l42J59j13JK07K2k55k2K56
$$ -71 -193 -8 -91 78 93 186 -201 -150 99 -86 -37 44 -50 -16 232 -110 49 -64 -63 144 166 -89 -111 145
3915A45k64p4K63o5J3J8LM8K2J3j94M4J5Kq6P4o4K13j54q8K8P1P0mLq2J30q1o
$$ 145 -119 -193 70 5 18 36 39 87 109 122 -72 -28 -13 -11 -97 -23 -87 126 -28 -116 -88 -17 53 49 52 -30 100 19 13
3944A3j68O6J96k95K08m9J9k3J49j72J90l0j85J2J74j49J1o6K00P1j76L2j48J49
$$ 13 -155 -89 107 -188 20 -29 -10 -33 116 -56 134 104 -81 -69 105 -44 -33 -99 101 172 -4 28 -120 29
3968B9j09L6J1J81j75j7o2OM2L6o7J9Q7J2K33l21J14j4j4P2j5k05J18n7k4Pk3
$$ 29 -80 -44 -33 148 -27 -44 -106 -100 -58 -22 -89 -70 17 29 262 -59 55 41 27 99 84 -121 -3 -60 -84 -77 -100
3995a00L7K3J11p8P4n2J4L1K4pj05Q0Mj07k7R8N6j3q7N6j68J45L9j68N3l7K42
$$ -100 -63 -40 71 -7 67 15 29 60 84 77 -28 52 56 -51 -78 20 76 63 -24 32 -136 9 48 -120 -67 -104 138
4022A38q4K2j54Q8k12K70jj48K9OJ10J14r3n4k9q7J98j46Qo2J01Q8M6j67l2l8
$$ 138 54 76 -78 10 -202 68 67 -81 -52 -46 64 178 85 31 2 -85 113 -33 -25 -87 14 102 148 -19 -51 -89
4048h9J26j74N8L1J51r1j22K15k00K30j01n2R2o4l3J62n5m8J65k43M2N1k13J99
$$ -89 37 -137 -79 -48 103 12 -110 105 -95 135 34 -18 74 10 -23 139 84 36 201 -42 0 51 -162 37
4072C7k8k0L2j40P2K01j13m5O6J1p5J29k11K14k40J44q2j3J19j14J50k44J42k0
$$ 37 9 -11 21 -119 -47 154 41 -4 62 73 -2 127 -84 130 -110 34 -48 -61 58 -56 94 -150 -8 -28
4096b8M1M0j13J19M9k11J49p0M6m8r3J19lj02P1J5j34J74L1m3k2J15j89J48r3
$$ -28 13 53 -60 59 108 -103 46 -24 22 -26 -119 0 -3 -105 -34 -19 -153 21 52 9 -13 102 -87 61 -32
4121c2l1P4J18p5j1p0q7R7J43k06J25P1j01j65J20j38L6J45KQ7k24J18K2J41k31
$$ -32 -63 11 129 54 43 -27 -114 -17 126 -80 45 116 15 -150 -30 -168 -132 13 15 102 -122 -4 18 159 -72
4146g2qK3k0J83p6j53K41o0l1j10J09Qk1P5j15J39j9l0Nj9Lr8j4q2K94j91Q9J28
$$ -72 -80 -57 -77 106 30 -123 118 58 27 -83 26 34 13 88 -27 112 93 63 68 49 52 -46 -60 -142 152 -39 50 178
4174A78q2j87J59j2Mk4j26P8m7l7K25j28j20N7o2J29j59J90p3R7j05M6J03j04
$$ 178 96 -91 68 56 60 36 -90 -12 -59 -96 129 1 -119 -62 -124 5 -154 36 -37 60 -45 1 104 0
4198@N7k00J65K7r0l2l2J91P0Nk90K69l38K62j01q5K60j69j22K10j30P9L2NJ5
$$ 0 57 -143 22 49 -41 -73 -105 86 156 161 -129 140 -198 64 -37 -122 138 -31 -153 57 -73 6 38 43 58
4223E8j32R9o6j4P9R3k6k59J55r7N7K09j73Q2q7M6j73K17o4pJ17j46m8J53l3n8
$$ 58 -74 25 -41 -55 24 117 91 -168 -13 -110 -53 156 -17 65 -22 24 -149 68 4 -3 114 -32 -80 73 40 -18
4249a8o6K46k14J09o7j97K22R8r0J53k38M1j38m4K67o0P0j71J80n3o3l0m0J19
$$ -18 -84 162 -52 57 -10 -207 15 113 23 176 -62 -21 -159 -203 64 4 74 -97 83 30 -33 -63 -103 16
4273A6j9p3Q3q7K32o3k17R4M2P1l1j27N2jN5o3R0r6J38k1r8J17n1k0P1J75k65
$$ 16 -3 -76 7 -80 152 89 -128 -34 8 79 48 -79 -27 -28 27 -36 54 -42 96 75 -23 94 43 23 94 269 4
4300DL8J52q7j14m1P3M2j0o1J55j03P9j09O8k64k7J17L1j40K73l4k9M4M3l0k0
$$ 4 42 194 107 -7 -48 25 67 57 -4 151 48 127 18 86 -178 -205 -88 -57 -197 76 42 13 57 100 70 50
4326E0%l4j12l8J85mJ54j37M7N5j94n5J15j7k2j2J53j55n1K05J6k80K43j37j9
$$ 50 50 16 -96 -134 51 47 201 64 111 166 -28 -83 32 15 -7 -19 134 -21 -72 133 149 -131 112 -25 -44
4351d4J74k40m7J39j1J34r8k3J09j50J97O0k33Q3J5k00K61m7K2r0mo6J39r6q0
$$ -44 130 -110 -157 -18 -29 105 7 -16 93 -57 140 200 -33 50 65 -135 126 79 101 11 7 -59 80 -16 -96
4376i6J58l6j26M3P4J19j00Q9j52P6N5j02J38j29lN8R9j58JN0j3q0J30p9Rj19
$$ -96 62 26 -100 -57 17 136 36 125 -27 49 104 2 140 11 8 66 165 7 8 58 45 -35 95 16 25 -94
4402i4J33N7j48j18J59Q2p1l3oJ6L2j50L1J31R0k50J68o1m4q9J80J40k85J33P3
$$ -94 39 96 -52 -170 -11 71 0 -33 -39 -23 9 -141 -110 21 111 -139 29 -32 -76 -165 15 155 -130 3 76
4427G6pq5O5r7j02L44k31R6j70m8Q9l9Q7pN6j01o2K58j54OR2j13O3j74J80nj49
$$ 76 69 -16 49 -48 -150 194 -37 59 -111 -159 -70 -109 -22 -29 27 -74 -136 122 -32 -26 66 -47 16 -158 22 17 -132
4454a32L3J62o6J28k14Q2r1N4J50j60Q3q2RL4l9Q1N2q4J9J4j05l7J06M2j02L08
$$ -132 -99 63 -3 125 -89 -7 -98 -44 106 -54 29 -53 -44 -10 -49 32 84 0 19 33 -72 -109 -3 39 -63 245
4480B45j71n7k01J99n6J40j7j5j66J23j1j30K02M9r8j1K6j59K77j57m1P0J3k15
$$ 245 74 17 -184 15 -41 99 82 67 -99 24 13 -117 85 134 36 25 51 -108 169 12 -29 41 54 -161
4504a61J94m1R2j29K3jj15K44k78m7K56J35j82q9J27m7R2J2j0q1Q3j94J31q2J77
$$ -161 33 -8 84 -45 -22 -23 -138 106 -172 -219 37 172 -10 -99 28 -19 73 85 75 -6 77 -117 14 -68 109
4529A09k13K15j37n1J52j0j54Q0qJ65j51Qj45Q3L3n5J00M9r7j49J76nJ24j08J34
$$ 109 -104 111 -26 -77 75 65 -89 -9 -17 148 -3 5 -140 -57 -24 -79 21 70 -27 -176 0 -5 119 11 145
4554A45P3r6k43J75p2j6M1O3NN4r3mM5j22J14n9n8l3J42j67J58O9o9k8J6j02j80
$$ 145 218 122 -121 54 -18 -34 7 70 75 129 36 32 77 -45 69 10 -48 -81 61 -106 52 121 52 24 40 -62 -242
4581b42J99Lmj23J94P5j02m9J83j85O0m1N9j6o2K56k36l3o7J36j01K01j45m3P1
$$ -242 -43 -40 -44 -167 27 102 0 -49 134 -51 9 -32 27 11 -51 205 -31 -64 -131 5 -96 105 -40 -83 -12
4606a2k8m7J24j7r0Q8o0ql8J87k75J61P9o3qr6K03j20l8J61j78K26j52L3L1J0
$$ -12 -40 -87 37 20 -70 18 -42 -50 -88 99 -176 -15 64 1 -7 -103 100 -20 -58 103 -75 151 -1 32 63 73
4632G3O7l80M68m22J99J11j35O9r4k6OO0mJ07j0l0j15Q1O6n9%r2R5qp7J20r1n
$$ 73 140 -240 228 -194 5 116 -19 50 -44 -70 -64 -4 -8 99 89 59 -56 25 91 32 32 -60 35 27 -50 70 -21 -26
4660b6J34j01kj34j4ON6K41k71J96p3J12m0j08Q5%j64jJ96k23K24J0k26K21o8
$$ -26 108 7 5 -129 -143 -137 -81 160 -111 85 12 124 84 -24 61 61 -103 -104 92 -131 93 103 -123 98 30
4685C0j43K3Q1n5j2J43j06J17o2J9R4m1r6N8j97J89Qp8j08J76q2jj15J6J28Q2
$$ 30 -113 -90 -9 -64 -76 67 -39 78 16 35 129 88 -8 50 -147 42 50 -28 -136 40 -42 -43 -158 -142 -14 68
4711F8j57M5N6J8k1P1l3Jj62K1Q8J01j38o3J09n6Q3J7L3J22j14k0l7P9j93K73
$$ 68 -89 -44 12 30 9 80 47 48 -114 -93 -5 96 -42 -105 4 -52 31 48 81 203 89 69 32 111 -82 191
4737A91j47j89L23k16J07n7j77P3L4j30J44P5J91l12j31K50M2j35j9O9J9LJ46
$$ 191 44 -145 178 -38 69 12 -165 -92 -58 -188 -44 31 222 -90 -221 29 71 -64 -83 -14 5 8 154
4760A54l63O2J32o2qr0M02j00p6j54K30MKk36J00P7k0j86J5K15j00o1R2j13K9
$$ 154 -209 -147 -15 -77 -85 -175 227 127 51 -103 127 131 133 -103 -3 74 54 -132 -117 98 -2 -63 29 -84 -55
4785e5K37j91L6R7j42n5K04j61j0J48q3r8M4n1lO3k7J1J29L7j38L8j01nO3J34
$$ -55 182 -9 27 124 -18 -73 131 -30 -40 108 25 -73 -29 -80 -83 -20 -47 -36 93 130 -8 30 -71 -76 -13 121
4811A21j71J0J33m4k15Q4k9K40k26l8J70J00j39j82K16j4M2N8k4M9m1m1q9j49
$$ 121 -50 -40 93 49 -166 -82 -111 129 -97 -135 35 135 -4 -186 30 16 58 116 92 141 100 59 -30 -179
4835a79K14J9q7j8Q6l9j11K23q6J6N5k08K7J11l4j14LJ55o1N7L6r3P4L7n0R9j84
$$ -179 35 54 -33 -51 35 -4 -115 108 22 38 93 -115 -88 23 -11 -125 -122 33 -28 29 65 -28 46 83 33 132 -52
4862e2J65j20J65j06O5j54J1J20Qj27J56k3j87R2o0r4J88J07j65J42k15J95k24
$$ -52 113 -7 158 52 117 -37 -26 94 102 -25 131 108 -79 13 -47 -141 47 154 -11 131 -84 111 -113
4885a13m7L53M3k18L1p4Q8p7J37j28r2J65M9j08k2K2L9J00k69J04J57j46oo2M9
$$ -113 -160 193 236 18 49 -25 63 -14 123 -5 -97 68 117 9 -13 9 48 148 -121 -17 140 -6 -12 -74 -25
4910b5J37j58J60j96K14k39jJ69P0mj5k4j17L7O8N0K5O1k75J75n5j5l2j09kJ02
$$ -25 112 -46 114 -82 132 -107 -108 61 131 127 112 88 -29 8 76 126 151 212 -63 112 57 42 10 -99 -101 1
4936AQ3k47J32Q1L0N3k87J92p3J75j1j82J87k25L3R5Q9q1p5L7j7L5j69J20J09
$$ 1 84 -163 -31 50 80 133 -154 38 -35 140 129 -53 134 -91 -58 37 126 45 -30 7 -10 25 -144 -24 85
4961H5j23j38L8J21k9O6l5kJ5k9P3j99K21j34L4O9j28K92l13N9j1J51p0Q4q4j00
$$ 85 -38 -176 -138 -17 -46 20 -15 -17 -2 -31 42 -157 64 -70 -36 33 -95 197 -116 -57 -68 83 13 97 13 -87
4987h7J65m8J8Mk41K26j47J72J9p7J98k59J05J59l50L63k01k7j0M9M2q9J35km8
$$ -87 78 30 48 52 -189 37 -110 62 81 4 202 -57 48 207 -143 220 19 -8 -18 31 73 -16 119 117 69
5012F9m7J6O9o7O1k06J97M0k55L56k17K71m21K31J9k04R9j4J01J01k38J10n7j73
$$ 69 22 38 107 40 101 -105 92 132 -123 233 16 287 -134 97 116 -88 11 -3 98 199 -39 71 14 -159
5036a59P4K30j22n2k0j23Q1K69k22J22q3M4rl2J8rm5R0j32J60q4l7K0p7R1j12
$$ -159 -85 145 23 -29 -49 -172 -91 178 -44 78 -5 39 30 -2 16 7 -38 52 -80 80 -4 -41 -21 -98 -7 -119
5062a19J66L7j88J89j05j2J3J23j59m0q4K42r8R9J0NQ7r0j09L1R4j89M4O8N2j23
$$ -119 47 84 -104 85 -20 -32 -19 104 -55 -95 -179 63 -35 64 74 79 166 76 -33 -2 92 -97 -53 15 67 -56
5088e6J13r3k6j1P1n3J59l07O3J04R5l7k2j2Q0j44L4O3M5j53L12l15Q1Q2J13j55
$$ -56 57 -36 -62 -73 -2 -55 104 -203 -140 -36 59 22 0 -12 68 -76 -42 21 66 -87 225 -90 -9 73 186 31
5114C1rQk5o6Q6O8j13L5M5m2LK6j90O8J31J14j78k11O1J63J42j14j38J11N6M5
$$ 31 22 30 5 -61 25 93 -20 15 60 18 21 47 -143 -75 56 170 -8 -219 -158 5 147 33 -105 6 62 107
5140A07p3j57K23j18J34p9%R7j73O6k04L24J2j63J06j96Q4JO3J30j93J10j81P8
$$ 107 34 -123 100 -18 116 37 37 134 -39 27 -177 147 159 -4 102 -94 -10 -9 54 184 -9 101 -80 -2
5164bJ01j40j08J51j48K76j23j36L00j65J5J9q0o1O7qQ8j54K15j69l9L2j2J9R
$$ -2 99 -41 -149 2 -146 130 7 -129 171 6 21 40 -40 -101 -34 -42 46 -108 107 -62 -101 -69 -81 -62 -53
5189e3J29N6j64J18k0Q2j77Q3r5Nn3M3J77l1j57J28j1N3l05J6J14N7j04Q1R7j99
$$ -53 76 132 -32 86 66 148 -29 54 -41 -36 -89 -46 131 100 -57 71 60 113 -192 -176 -62 -5 -109 -28 69 -130
5215a30J18o9O2k7pj8L22j38Jm7j51O0J86q2j7p7J30Pj86k6P6L7r2J87o1n4J16
$$ -130 -12 -81 -19 -46 -53 -71 251 113 114 67 -84 -24 162 80 63 -14 116 123 -63 -89 -13 24 -68 119 58 4 120
5242A20j39j3J47l17K31j29J42j9q1N3J31k03n0L1K2J12lP3j21O6L0lp0j66J98
$$ 120 -19 -32 115 -202 29 -100 42 23 -58 -5 126 -77 -127 -96 -74 38 35 108 -13 53 83 80 10 -156 42
5267D2o1J79k8k04M6J3j7j56N1J12J89j83p6L5O0k72L27L2J8p7j83K10R0mj41
$$ 42 -19 160 132 -72 -26 -13 -30 -186 -135 -23 166 -17 -93 -58 2 -270 57 89 107 30 -153 57 147 143 2
5292BK02l80J5M10k30J9KO2k08P2Kor6J71k09J90k9N4N1mk7o3j38J10J14k32K64
$$ 2 204 -176 -161 249 19 38 40 102 -106 -34 -32 -38 -134 37 -172 18 -11 43 94 90 63 0 -138 -28 86 -146 118
5319A18l5j03L6N3O6j83J12r8K9q6O2J57j87J0K19k23K7N6j48O8m5M6j09M6M6
$$ 118 83 -20 16 69 135 -48 64 -34 -5 -91 -29 128 -59 -49 170 -53 -26 30 -118 -50 -95 -49 -158 -112 -66
5344f6O3n5K31k25K14q8j4j02j11k5Q4N6J8m1r3K09j79J44J23l14J47K28k01j17
$$ -66 -3 -58 173 -52 162 74 60 -42 -153 -178 -94 -38 -20 -61 -154 55 -124 20 143 -171 -24 204 3 -114
5368a14n2K47j58J04n3J30l8j2K5r6J40k31J50O5j52J24l28J97l3k9J20L5k19
$$ -114 -166 81 -77 27 -26 104 66 54 79 -17 123 -108 42 107 -45 79 -249 -52 -85 -114 6 41 -178
5391a78J90q6N5O9p7j3o1O0J07N9j32Q1q6j25L64k38J3N3m3q4Q9l4N9j13J04P5
$$ -178 12 -74 -19 50 -27 -40 -101 -41 66 125 -7 74 -12 -137 227 -11 2 55 12 -72 17 -17 42 -71 33 108
5417A08m3qj22j7J26p4q8K09j95J89j31lN9r8J22j40R2P2K9o7M2oQ4k30J01r9
$$ 108 65 57 -65 -82 44 -30 -118 91 -104 85 -46 -49 10 -88 34 -106 -14 58 87 20 62 56 140 -90 11 -88
5443h8K78l36K03N0r4j97K51J02j20Pp3N1j5j17M8p2J25M1j80O9J1n4Q5k5k7J13
$$ -88 190 -146 57 107 13 -184 67 169 49 56 -17 34 19 -98 -50 -122 3 44 -136 -67 -56 -110 -25 -50 -77 36
5469C6Nn0m6J10q6K3n6O5L8nj03OO4j9J47j62j16L35p5j78Q6p4M5k3L3q5J36L4
$$ 36 41 -9 -55 55 -31 -8 -64 1 39 34 -69 -63 1 -18 129 -33 -149 186 111 -67 19 -55 -10 -33 0 -85 51 85
5497H5j2jJ4j38m6j00K09r0K9R9l4j05L7L2P2JmK6j52n6J21L4k28J61p2Q1K2P0
$$ 85 73 72 86 -52 -98 -198 11 -79 -50 49 15 -90 -53 -21 51 52 48 74 -78 -134 -13 21 -207 -46 -118 -37 -15 55
5525E5j09M2l6J49o1l5j2j8j06J20J1R9j34P1k48L36j77K02k38J67j82J24M7M9
$$ 55 -54 -12 -48 101 40 5 -7 -25 -131 -11 0 99 -35 36 -212 124 -53 149 -89 78 -104 20 67 116
5549A16j8jj62K4k2J25J2j67r2K73J6k40J82J7J7l08J25Q6M3Pj24J29j33P9j10
$$ 116 98 97 -65 -41 -63 62 74 -93 -185 88 104 -136 46 63 80 -228 -103 -17 26 33 -91 38 -95 -16 -126
5574a26J52r7M1j04NJ82P1j37j0qm5O2q2PR4k4lJ64m13K18Nj18M3K73j23j20P0
$$ -126 26 -71 -30 -134 -129 53 124 -13 -23 -31 -76 -14 -96 -89 5 -19 -22 142 -271 -53 -48 -166 -123 150 27 -93 -23
5601b3m3J75K9j93l5J79k13Q8K0R9K0j05jk2MJ4P5o1N0Q9k42J74p2K23j18j18
$$ -23 -66 109 138 -55 -90 89 -124 -36 -16 83 103 -2 -3 -25 -21 -7 68 7 57 146 -96 78 6 229 111 -7
5627gJ8n2N0j01J08j07J53Q2k33L1q5Q3j18J22N0P1j81O6R0j64L7P5p7lL7J42
$$ -7 11 -41 9 -92 16 -91 62 144 -89 -58 -143 -60 -178 -56 -6 65 -116 -50 40 -124 -87 -12 -89 -92 -55 87
5653H7ok8n6j08J1J17J6m8j48J33mnJ73j37J58p3o3m7M1PJ72l36L36j51j68J04
$$ 87 81 53 -3 -111 -100 17 33 -15 -163 -30 -34 -39 134 -3 155 82 19 -28 13 20 192 -144 192 41 -127 -23
5679b3J10nj88R7R1J64l88L42o6j77J39k77K57k28K36j22lJ32j52Q8q4K51p1k34
$$ -23 87 82 -106 -9 82 246 -142 200 134 -43 96 -181 76 -152 84 -38 -41 91 -61 27 -57 194 123 -111
5703a11p3K59j8n6k5Q1q2j43K10P6j20K7p7J50k26p5K17R0j43l5R4k8Q5q7J5j5
$$ -111 -184 75 57 1 -24 57 -25 -168 42 118 -2 25 -52 98 -128 -203 14 104 -39 -74 20 -8 77 -10 5 -10
5729a0J02q7j11J12J22j47K57k30M5J9l1m3j25K65k17m8J84K4j51K14j0j38r2
$$ -10 92 5 -106 6 128 -19 238 8 53 72 41 -2 -127 138 -79 -127 57 81 -70 144 134 -4 -96
5752i6J03M4L3J6k70N6J59k4P4j68J04L1lr3Q1l3k0pP7p1o1J52k18K92j41R2k63
$$ -96 7 51 84 100 -170 -114 45 21 95 -73 31 62 59 -34 47 14 -6 -13 64 -7 -68 84 -134 158 17 109 -154
5779a54L48q9j26j01Q9Q9j95J85j7j35K42m2J48j24j15R1k52J44J63j64J52l4
$$ -154 194 105 -21 -122 -33 56 -139 46 29 -106 136 94 242 118 3 94 -158 -14 149 -15 137 103
5801A03o9j68K27j04N5j66P8K00k80J71r3J46p2n0r5Q7M8Mr5J40J5j90n2J39%
$$ 103 34 -134 93 -11 44 -122 -44 156 -124 47 -46 100 28 -22 -117 -30 18 22 -73 67 82 -108 -160 -21 -21
5826b1K54j53k85J96J06k2K2l8j84R2%J07r7l6Q9j29L3K71j83L2j1o6r2M6J8O
$$ -21 233 80 -205 -9 97 75 97 59 -125 -33 -33 74 -23 -59 30 -99 -66 205 22 54 43 -23 -115 -69 -51 -45
5852d5P3j47J57L2r7J44m8j46J08j47M9M6P6n5p1J17j3o7O1k08K21R9k38K00j05
$$ -45 28 -119 38 70 -27 117 69 -77 31 -116 -67 -21 55 0 -71 46 33 -34 27 -181 40 139 -99 101 -4
5877dJ28j28J46j42J28p0p9J37k02J6Q5j4j21J89jk28L59jk89l7Q5J5o7J20j60
$$ -4 124 -4 142 0 128 58 -21 116 -86 -70 15 1 -120 69 68 -160 199 198 -91 -128 -43 -28 -95 25 -135
5902a35J43o1P1%q0J8j22PR0j05K05N6j16R5O4j32p1o9J20j18K47j00j33J6K34
$$ -135 8 -53 18 18 -62 -44 -166 -159 -69 -174 31 87 -29 66 130 -2 -73 -142 -22 -140 107 7 -126 -110 124
5927A24m9j00k9m4J9P0R4j55M6Q6k56J35o2J17j0J3p6J61pJ49l31J22n5k2k3L9
$$ 124 75 -25 -54 -98 -79 -9 85 -70 -24 62 -194 -59 -121 -4 -14 -1 -77 84 77 226 -105 17 -38 -60 -83 -44
5953d4N0rj9O1j43J9J47j43J30j74P1J5j5J7K1l3kk3R7j62J14P4J5oo6O6o2M6
$$ -44 6 -3 -22 39 -104 -85 62 -81 49 -125 -54 -39 -54 -37 -16 -49 -51 -74 23 -139 -25 49 64 58 -8 58 -4 42
5981D2k53K11KJ29j33J32j54J74k60O2p6J82K7j37J16o3k7K10j05m5j61K57k90
$$ 42 -211 0 2 131 -2 130 -24 150 -110 -48 -124 58 85 -52 64 1 -26 184 79 34 -127 130 -160
6004a60L9L07k96Q0P6j21Jm3r8J72K5J4N4P5l7j11M7J8o8O8k9k2j3m5jJ52j05
$$ -160 -121 186 -110 -30 46 -75 -74 -117 -215 -43 -18 -4 50 125 88 -23 24 42 -26 42 13 -9 -22 -67 -68 84 -21
6031b1J28j55P8L1j38M4K57k74M5O2n9K09j66k0n3l4l6J52m6j33R4k1j0O5r1%
$$ -21 107 -48 30 61 -77 -33 224 -50 -5 57 -2 207 41 21 -32 -66 -102 50 4 -129 -35 -56 -66 -1 -92 -92
6057i2J54M6p4J06o9n1N9k7j90J0J11K1R1M5k66M4J06J50k2k51J46p9J53j58j0
$$ -92 62 108 34 140 71 20 79 52 -138 -128 -17 4 95 140 -126 -82 24 174 152 -99 47 -32 121 -37 -47
6082d7L5J04j55P9q4N7l1K18j48o7J2K0M1l3k4M7j34J63R0k03R8K9M2j1j03j14
$$ -47 -12 92 -63 16 -68 -11 -42 176 28 -39 -27 -7 34 1 -23 24 -110 53 143 -60 38 67 109 98 -5 -119
6108a19O7j0J66O2k39Q9j4p8R3m5L9K5r4N2K6j35K28j37j2J02j21L7J50j21N8
$$ -119 -52 -62 104 166 -73 16 2 -76 17 -28 11 36 -58 -6 20 -115 113 -24 -36 66 -55 -18 132 11 69
6133F9k0p6j8r1Q0O2Q9r5p8J94k14P7O2%p2J32J02j46P6j41J16M4j13M7m0j43
$$ 69 49 -27 -45 -136 -56 6 95 0 -78 116 -98 -21 41 41 -31 101 203 57 133 -8 108 152 39 86 46 -97
6159i7N2J67m2k35M66j68k10Q2o6l0K3O7oL6j12J04k1P4o6n2m8J37q6j35K49N6
$$ -97 -45 122 80 -155 311 143 -67 15 -51 -81 -58 9 3 39 -73 31 10 84 18 -34 -82 55 -31 -166 83 139
6185A39j49j76L26q2Q3j24r6MJ01R6j32k9m6O7j58J74l2K11j70q4R4j32J24N2
$$ 139 -10 -186 140 58 141 17 -79 -75 26 122 -10 -39 -85 -18 -176 -2 -34 177 7 -77 17 -115 9 61
6209F1j24J14M1L0q1p7n4K0Q3k24L04L0k82N1m4K33p0O3q7j3J4J9l2N1j38J59
$$ 61 -63 51 92 122 41 -36 -90 -70 13 -211 93 123 -159 -108 -152 81 11 74 -13 -26 -12 7 -25 26 -112 47
6235D7j57O2jR2r2o4P4m4m8J25r4J26L5j25J25n1q9r0O2K23j37K6J14p8j15M0
$$ 47 -110 -48 -49 43 -49 -113 -39 -83 -131 -6 -100 26 61 -64 61 10 -79 -169 -107 116 -21 5 119 41 -74 -34
6261c4O4L1j12J63j03J3N8p5K0J2k6m2J12j38K03j78L3J1PK1j6j10J19M4p8L9
$$ -34 30 61 -51 112 9 22 80 5 25 37 11 -31 81 -57 146 -32 1 12 19 40 24 -86 33 77 -1 38
6287C8j66L36j96%p2L48j56j34P2O1j93J06j16R9m7o5J66m7p7J18j39p3J39k4
$$ 38 -128 208 12 12 -60 288 132 -2 70 131 -62 44 -72 27 -20 -85 81 34 -43 75 -64 -137 2 -22
6311b2J8R5l7j76O6J3J22j55Q3j26L5o3J77o4N0J36l2q1m4N8n3J01p7j01J1N3
$$ -22 -4 91 54 -122 -56 -43 79 -76 7 -119 -84 -147 30 -34 16 152 120 39 -5 53 0 101 24 -77 -66 -13
6337a3j6J23l5ml7K5J1j03r9q0K58N2o2j6l29L02N1P7j40L2r6j29L94j52j86J06
$$ -13 -29 94 59 55 18 43 54 -49 -148 -228 30 82 20 4 -325 -23 28 105 -35 -3 -99 -228 166 14 -172 -66
6363f6P1k6PQk0K2J0R3k22R7M5p8N2j03J11p3Q1K1j01J7J41p2k8jJ07k03J32k24
$$ -66 5 -21 -14 -6 -26 -4 6 99 -123 -26 19 -59 -7 -110 1 -72 9 30 -71 -54 87 15 -13 -14 93 -110 22 -202
6391b02L28J07k97r9J14N5%j52K7L24k29Q5r7J3j72P8O8K2M7K0N8j47J23K9k37
$$ -202 126 233 -64 -163 -49 6 6 -146 -119 205 -24 61 -36 -23 -195 -117 -49 -27 20 40 98 -49 74 103 -134
6416a34J50p0Q6O9P7k59J37j0o3J9J02k0j00J28j63J61j5K5n9r9j62J90L0r3k0
$$ -134 16 -54 32 101 178 -81 56 46 -17 2 104 84 -16 112 -51 110 95 120 61 -38 -200 -10 20 -73 -93
6441i3Q8K34j51k56l3J13Q5j04n1K66j06m0Q5N9j52P6N7m8r8L6J04r4J16l1j70
$$ -93 -5 229 78 -178 -211 -98 -13 -117 -168 98 -8 -48 37 96 -56 20 77 29 -69 -33 71 -23 93 62 -108
6466a08Q5j1k9NK9J66J8l1k20J21k73K77m7l4Q4O2n2j28J21J04m1q5j8q9n8K02
$$ -108 -23 -34 -63 -58 -29 137 155 124 -96 25 -248 29 -18 -52 32 94 42 -86 35 139 98 13 -5 -94 -152 50
6492E0j61P3Q8k25R9O8j69J80J25j16l5Qp3J27N9j00P8j34o8J08J74j95l1J90
$$ 50 -111 -38 50 -175 -76 -8 -177 3 128 12 -23 -15 -88 39 98 -2 76 -58 -126 -18 156 -39 -70 120
6516A20j09J13k64J74kR8j97J59j34J10k1qR2J2j08j34m2J91q1N4Mo8j4k7J13
$$ 120 11 124 -140 34 32 130 -67 92 -42 68 47 39 131 143 35 -99 -141 50 -31 23 27 -41 -55 -82 31
6541C1k6K6r7J53j40J37j34J42j27l7J97j37NJ9k8J83j40K8L0r3J65m4j55o0J56
$$ 31 5 31 -66 87 -53 84 -50 92 -35 -72 125 -12 -7 12 -16 167 27 55 85 -8 157 113 -42 -102 54
6566E4j83m2K86n3j37k9J65j00m6J13p8k9J05J10r8j16R1m8qNJ95j27Jr9o3O4
$$ 54 -129 -171 115 62 -75 -104 61 -39 -85 28 -50 -79 26 136 38 -78 13 -35 -43 -38 157 30 31 -68 -131 -67
6592f7L6m9P2J40j75K10j70q4K9j1J4K08k50J3K6m0P5j46J23l3L2L8l0K20r9j10
$$ -67 -31 -80 -8 132 -43 167 -3 -87 -58 -69 -55 153 -97 -84 -58 -98 -23 -169 -46 -79 -47 -9 -39 181 82 -28
6618b8R5o6j16L03l26K83m9p0O6j26P7jo3Orp1J06J27o2K8j33r0J02L0p9J15N9
$$ -28 67 1 -115 188 -138 145 96 26 92 -34 43 42 -21 -15 -24 -95 11 138 76 104 -29 -119 -17 13 -66 49 108
6645A08j21jJ54j7j04J35j99Nm7QK43k78J55j62J32P8k12J52k5j64J35q5J55j49
$$ 108 -13 -14 140 123 19 154 -45 -40 -87 -79 164 -114 41 -121 11 89 -123 29 4 -160 -25 -110 45 -104
6669a04J3J92j37o0J49L1l76K66Q4op0J34j64p5K43k91J76Q3j71K9N3L1K1j9j16
$$ -104 -91 101 -36 -96 53 84 -292 -26 58 52 -18 116 -48 -123 120 -171 5 88 -83 -54 -1 30 51 32 -84
6694h4K06j25n9J51j62l7J38j80J91n4K2o7O7r0J53n7J3r1P5n5J37k18J04PO8
$$ -84 122 -3 -62 89 -73 -110 28 -152 39 -15 7 -60 7 -83 70 13 26 -65 10 -45 92 -126 -22 -15 53
6719E3j12J00j62MP7Q4o2Ol3m1R4P2k5k46J50J31q0k1p1L0k3P4j1No6J10j48K24
$$ 53 -59 41 -121 -117 -40 44 -18 -12 -45 -86 8 80 55 -191 -41 90 10 -11 -82 -52 -75 -1 -12 -7 -73 37 -111 113
6747A13n0J9k05N3J29k58J75J65k10l7o6J93r7J2K4K10j76J10o0r4J29o7n8J23
$$ 113 63 82 -123 -70 59 -199 -24 141 -69 -106 -172 21 -76 -64 -40 170 -6 104 44 -50 79 12 -46 77
6771G7q2J72o7j42Rj04qJ40j15J13q0k4J55n0n7J49m7JJ39k32K04q5j7J3m9J20
$$ 77 -5 167 100 -42 -33 -137 -145 -5 -120 -7 -87 -111 44 -6 -63 86 39 40 179 -53 151 66 49 62 13 133
6797A33k21J09l3Q7k14J37M3N2j04j5l0J43J81k80j1J9n3r0K26p0q5Q1j0M7m1
$$ 133 -88 21 -12 75 -139 -2 41 93 -11 -26 -56 87 268 -12 -23 -4 -57 -147 79 9 -76 5 -5 42 1
6822Aj13P0L3J9Q8j57J47j13j31J36KR1m6k5j42K49j54K0jl4Q6K6n3M4o3m8J79
$$ 1 -112 -42 -9 10 98 -59 88 -25 -156 -20 -18 73 27 2 -140 109 -45 -25 -26 -60 26 52 -1 43 -20 -68 111
6849A11k05K04q1L7r2k2rK54j75j89J95j85J4L1O0N8j52j2J49M2r2N6o9J86k34
$$ 111 -94 110 29 66 -26 -48 -57 197 22 -167 28 -157 -143 -112 -52 6 -146 -158 -9 33 -59 -3 -72 114 -120
6874a20K16o3j05J08J4l6jj04K1P6j96K41K62l41n7M8J54k08m3J67j74M7L3l7
$$ -120 96 33 -72 36 50 14 13 -91 -70 6 -190 51 313 -28 -85 -37 117 -91 -134 33 -141 -94 -61 -98
6898i8O2o8J15j6O4j1n3J14k08m5J93j30N7N7j68NK40j64n0M7O6l0j62J60p7K09
$$ -98 -36 -104 11 -5 59 48 -5 109 -99 -144 49 -81 -24 33 -135 -130 110 -54 -104 -57 9 -21 -183 -23 -100 109
6924A09j55q4J59k1j69J80J77k13P4j30K35j93P8J67j88J43j04p3j9P0K4k08L4
$$ 109 -46 -130 29 8 -161 19 196 -17 57 -73 162 -31 47 214 26 169 65 -8 -27 43 67 -141 -107
6947a07J68r5L7O3p5l9N5J6j96J88j89K09q9j9J69j01l5p1k0M3J04L1J4p2o7Q8
$$ -107 61 -34 3 66 -9 -48 7 23 -173 15 -174 35 -54 -73 96 -5 -40 -111 -131 -88 16 47 61 -11 -78 10
6973A0R0j89Q9j61J31M3P8pk43J66m7R4o0o5R1K5p1o9O2K1q3O3N9k0KR5k55R0
$$ 10 100 -89 0 -161 -30 13 91 84 -159 7 -40 54 -6 -71 20 45 -26 -95 -33 -12 -95 -32 27 7 9 104 -151 -61
7001f1J25r4Q2j45R6k33L60k53K2J45j59K30k50P1R5j5n3j8l5J5N3P7L8q6Q1j05
$$ -61 64 -30 52 -93 3 -230 130 -123 -101 44 -115 115 -135 -64 31 16 -37 -55 -90 -75 -22 55 93 7 88 -17
7027a7M5L0k8q0M3K9N1o6mp1N6K4j63K44K9m3N3m2k10J59o9p1M2J33o0m8O2m9
$$ -17 28 58 30 -50 -7 22 73 7 3 -68 -12 12 -151 93 122 79 132 90 -120 39 -30 -101 -59 74 14 -34 28 -21
7055b1K41l02J12M3m2K6lj0k7o8P6k1lN9O9o0q8L3O7j9j1q1K8L9PJ2l4l0r7K20
$$ -21 220 -82 30 73 31 57 54 44 17 -51 25 4 1 60 129 69 -19 14 81 62 51 -30 -2 37 44 56 22 -8 -105 115
7085A15k6l6j43L7Q8r2J2L9j3o0N6J28j12jL7Q0n4j66N5K48l87J77J1J60j61p5
$$ 115 89 53 -90 -53 35 -57 -45 -6 -19 -79 -23 105 -7 -8 29 109 55 -111 -56 192 -195 -18 -7 153 -8 -83
7111h3K8J47k0L0j16j98M07k75P5K1q6P9K27k48K8kM8K3K6k12l3K46j34J50k05
$$ -83 -55 92 72 102 -14 -212 195 -80 -5 16 -70 9 236 -12 16 14 62 85 111 -101 -134 112 -22 128 -77
7136g7R8L2Jk3L0r1J32q5j52R0k8p7J01k3P3K2m8O4K3j29J94j74M2p5n7K17j64
$$ -77 21 53 54 31 61 -30 102 17 -135 -45 -73 -150 -49 -72 1 23 -25 39 62 -67 127 -47 -5 -80 -137 80 -84
7163h4J86j82J48j41nJ87k06K23k75Q1m9Q3o8J37ol0M8m4j1J5j9j05J22m9J44
$$ -84 102 -80 68 -73 -78 109 -97 126 -149 -68 -117 -34 -102 35 29 -1 47 3 -8 7 -12 -117 5 -44 100
7188A00j34O6M3q0J42Q0j10l35O9K26j26J33r4O0L8M1j73J37J8j8m3j9n0J08p5
$$ 100 -34 32 75 -5 137 217 107 -228 -159 67 -59 74 -20 40 78 119 -54 83 101 83 40 21 -29 79 4
7213Do7J72k13J46k47K53m4j06J76k9L6q8J05l4j2j46M5J58p1j83J20j42J81R
$$ 4 -63 109 -104 42 -205 48 4 -102 74 45 81 -7 98 64 52 -94 -49 109 38 -145 -25 -167 14 23
7237B3k9l5K0j74J73K0m4J12r4RN1J43l39J65j19K08k38K28k23M0Q9j43K67j6
$$ 23 -6 -41 -21 -195 -22 -2 -46 66 -28 -19 32 175 -164 1 -118 90 -148 80 -143 -103 -14 -157 110 94
7261I4k62J44J46r9J62k31R0j8LJ8J0N8j48M0J53k2j21j3k6K6j37K10j83J28n7
$$ 94 -168 -24 122 23 185 -46 44 26 29 47 57 115 -33 7 160 138 17 4 -22 4 -133 77 -106 22 -35
7286c5J31q7j78J71p0M2j9O2j8j27N0j2J04R4m2j55N7j00J39j1o7k5O2K32k19
$$ -35 96 9 -169 2 -68 -26 -45 17 -1 -128 -78 -90 14 108 66 -89 -32 -132 7 -4 -71 -96 -34 198 -21
7311b1l1P6JM3j10J38J2j25j2P6n5j03R7J79k17j48K01Qn2J58K0j18l8Q7q3P3
$$ -21 -52 24 25 68 -42 96 108 -17 -29 47 -8 -111 -14 165 -52 -200 1 9 -43 115 135 17 -21 66 -17 56
7337E6l3j33J39j6Q6o6k20j9J82q8R8l2RK11j56j13K72q9k26R3j74K00J06n9j13
$$ 56 23 -110 29 13 99 33 -187 -206 -24 -112 -14 -46 -37 174 18 -95 177 88 -138 -45 -219 -19 87 28 -85
7362h5MM2Q4j6q0N1m9J14j77N9jQ9j56K0J68j30J19j77J68j92K75j3k97K4J86
$$ -85 -81 -39 45 29 -51 0 -49 65 -112 -53 -54 35 -121 -101 67 -63 56 -121 47 -145 130 117 -180 -156 30
7387C0j85J32L4p6q4J01J51j06j10P8J06j97L21j32j81J12L6n1j13K36r9J01j42
$$ 30 -155 -23 11 -65 -149 -48 103 -3 -113 -35 71 -126 195 63 -118 -6 30 -21 -134 102 3 104 -38
7410c8O4p4O1K0n4R0J72l41Q2L6j18m0K33j05j45J75r8K00r3J46j82o8Q4K4n2
$$ -38 26 -48 13 33 -21 69 241 -100 -18 18 -100 -140 93 -12 -157 18 -80 120 27 173 -9 -77 7 31 -21
7435b1n9K8K0R6q4O7m8J3Q9j16k4k0J56j08k4nJ14o4J6%r1K30j16j67N5L4p3J76
$$ -21 -80 -52 -32 64 -20 47 -1 12 101 -15 -39 -59 97 -11 -35 -40 74 10 26 26 -65 165 49 -118 -63 -29 -102 74
7463G4m1Lr8J32j23m0K2J26j6j56J98m5K1p0M6m8Q3j01m2J3P1J73j42P9J16l65
$$ 74 33 36 -62 70 -53 -93 -71 55 39 -117 81 36 57 -13 33 -15 68 -33 -75 -62 9 182 40 119 235 -130
7489a30J18J5K22j82m4M7j30O9kJ16j86K91k81J79j38L2N9j41R1J10j93Q3n6K2
$$ -130 -12 3 225 43 -1 46 -84 -15 -17 99 -87 204 -77 102 -36 -4 55 -86 5 115 -78 5 -51 -29
7513b9J7o5L5L8k5l0r1K57p6L2m4R1o7j69M4N2p9O6O3r5m6J22K49j93j73P1R7
$$ -29 -12 -77 -42 -4 -29 -59 -150 107 31 63 19 110 43 -126 -82 -30 -109 -43 20 -75 -121 1 250 57 -116 -45 52
7540E2k2q8o3J67j70N7J56N4p9J58l51J58j83J75L0k16M6K82j4n4mk61Q4Q1l2
$$ 52 30 -58 -121 46 -124 -67 89 143 64 222 -129 29 -154 21 51 -165 -119 163 149 95 91 -170 -86 -5 -37
7565c7R9k36M0l1J27J8j8j3l4L63l20J33k9k20J06J53j73K70o6m2j36J0o3j01
$$ -37 62 -174 -134 -165 -38 -20 -38 -51 -85 278 -42 91 62 -158 -52 101 -72 198 132 90 -46 -36 -99 -200
7589b00J52mP6j03J74j28J08n7m5OL0q6L1n4J94K0j46M7j8K3J0j1O2j45J53k2
$$ -200 -48 -52 24 -79 95 -33 75 18 -27 -21 9 -77 -46 -100 94 114 -32 15 -3 20 30 19 81 -64 89 67
7615F7m7Rl2q0j1J64n6O8n2m6k2K25k88n5K7P9O0k6J11j83J26k25K35r8o4J98
$$ 67 20 29 -3 -83 -94 70 14 82 30 -16 -38 187 -101 -156 -129 -50 10 -16 95 -88 38 -187 48 -50 -114 84
7641H4k14J51j8J2M5L7j33Q6r9N4j23J39pJ5R1k23J8J01R0N4m06K01p4J25lm5
$$ 84 -130 21 3 15 60 97 -36 50 -49 5 -118 21 14 29 120 -103 -85 16 106 160 -246 -45 -119 6 3 -42
7667d2k2J25P9k04P8o1O4K5j28K21j97J45j50J38R6j73k3M2j07J57m9O4q9P5J06
$$ -42 -64 61 140 -64 14 -47 17 42 -86 135 -62 83 -67 71 167 -6 -29 13 -94 63 14 78 -11 64 170
7692A70j51J29j19J08k67K13J2j58J91p8J32j16M8k0j15r1P2J09j10qN6l1p2j21
$$ 170 19 148 29 137 -130 83 95 -63 128 50 182 66 114 94 -21 -112 -40 69 -41 -49 7 -24 -96 -217
7716b17K66k7j65PM7J67r5K9q7N5K70j92K9j49PM6L2jN3K4jP3r4n7j05J75k45
$$ -217 49 22 -143 -136 -89 78 -17 12 -75 -20 250 58 87 -62 -55 -9 23 22 75 99 98 171 77 20 -85 90 -155
7743a55J73K11k74L5J08j12m3k3Q2L6j30J43j7R9K9l30J97mO0k96J13O7J07O9
$$ -155 18 229 -45 -10 98 -14 -57 -80 2 38 -92 51 34 133 162 -168 29 25 85 -211 -98 -31 76 145
7767A45l9j8j28m4J51k19J06J25k27K20p8NP5k5q1L4M5j32Q2o9J15j96O9P6N2
$$ 145 106 88 -40 -84 67 -152 -46 79 -148 72 -6 -1 74 49 -32 2 47 -85 -3 -72 43 -153 -84 -8 44
7792D4K1J6m0N5j42QQ7j03j16J36J95k7j85M3R0rj69L65l14OJ35k02K28j34j1
$$ 44 65 81 41 96 -46 -38 49 -54 -170 -34 161 134 -51 -8 82 73 -96 269 -45 -39 96 -106 122 -12 -23
7817b3n4R3n6K92k01J23j67j31J94l3p5O4O6j03P8oj38j76L42m8j07n0l1O7Q0
$$ -23 -77 16 -40 252 51 174 7 -124 70 37 -38 26 92 -11 67 61 -77 -253 89 41 -66 -116 -147 -80 0
7842@J3m1O8j07n9K0K06j22j6L8O9j65R8L5J17j60O7q6mO5r6n7K36J21j13j04
$$ 0 13 -28 40 -67 -126 -106 100 -22 -38 0 69 -96 2 37 154 -6 61 -25 -29 36 -60 -117 119 240 127 23
7868B3L5k3J43l27O3J52q3j1L0L1o4Q9Jr5J41p1k5k16N1LP6J20M6r3p6l4J24P
$$ 23 58 35 178 -149 -86 66 -17 -28 2 33 -31 58 59 -36 105 34 9 -207 -156 -153 -77 43 89 -4 -80 -114 10 17
7896A7q6N8j9j11J43K8k1j22J76k7j37P9rJ3k0l2N9n0J0m5R6n9L43j72j52J15
$$ 17 -69 -11 -30 -141 2 30 9 -113 63 36 -101 -22 -31 -18 -38 -70 -11 -61 -51 -96 0 -59 284 112 -40 75
7922G5j27J11j54L0j13J16P5m0jj4r3R7J7J59l19L5L38m05J98J40o2j71M1K3J21
$$ 75 -52 59 -95 -65 -178 -62 13 -27 -28 -42 -135 -38 -21 138 -181 -146 192 -213 -15 125 63 -108 -67 -44 77
7947G7J9o4K56k94K9P8l4K6j6m0N4j19N2J8l3J02j35J2o4k3K25j59j15J32o3J66
$$ 77 96 32 288 -6 23 101 67 93 77 37 91 -28 24 42 9 111 -24 -12 -76 -99 126 -33 -148 -16 -79 87
7973H7k65K22J3j3q9j1j64J63P7nO9j8j3Q4k82R9J71q2p9J30k37J03R2NKJ36j93
$$ 87 -178 44 57 44 -45 -56 -220 -57 20 15 84 66 53 137 -145 -46 125 43 -36 94 -143 -40 52 57 59 195 2
8000Bpr7J15p5K01p9L3j63O6O0j29J4J45q1J67j80j03m0P5K88j99l80L70l0l3
$$ 2 -5 -102 13 -62 139 60 93 -70 -4 56 -73 -59 86 5 172 -8 -111 -151 -76 212 13 -367 3 -27 -60
8025f0l8K13p7n0J09m8J25l48J30p6J53J7j52J98j58K56j80J5j06N7K13k91K88
$$ -60 -98 115 38 -12 97 49 174 -174 -44 -120 33 50 -102 96 -62 194 14 29 -77 -20 193 -98 190
8048A90k88J80j32mkk2J59j62J53k15O1p4jK20q9k9k0J54j25J83j68K22r8k8p5
$$ 190 -98 82 -50 -54 -56 -78 81 -81 72 -143 -82 -156 -157 63 -26 -55 -75 79 -46 137 -31 191 93 65 -10
8073a0n5K3j07L9P2j36J17O0p1P4j6l0N3P1k58J44J71j28k1K57k44J0Nj32J31
$$ -10 -65 -42 -149 -110 -38 -174 -57 3 -68 6 -10 -40 13 84 -174 -30 141 13 -8 249 5 15 20 -112 19
8098A9j04J2J09j19J99qj79Pp4K21m5k03K09k5j29K28j29J7J29k95K11j29p2N5
$$ 19 -85 -73 36 -83 116 108 -71 -64 -138 83 38 -165 44 19 -110 118 -11 6 135 -160 51 -78 -150 -95
8122i5J65j44k8J00N7J00j53L5j6Q6mn1Q0K8k2j13r1K4j24Q1q0M2P3k0k2P9oO2
$$ -95 70 -74 -102 -2 55 155 2 37 21 107 103 52 132 160 138 25 -66 -42 -166 -85 -165 -123 -50 -70 -92 -13 -19 43
8150D3j8j28J67j24J52M5m4k21O7j15K64j05M0JJ05k03nJ2j34K94p3j4ML6J15
$$ 43 25 -103 64 -60 92 137 93 -128 -61 -176 88 -17 23 24 129 -74 -79 -67 -201 93 20 6 10 46 161
8175A61o6j35qR3p0l7J30p1K0J9j71L02j32MK56l80
$$ 161 95 -40 -48 45 -25 -62 68 -3 17 36 -135 167 35 39 295 -85
8191h5
$$ Imaginary data points
##PAGE= N=2
##DATA TABLE= (X++(I..I)), XYDATA
0@%%%%%%%%%%%qJ6j6J6k4L2l2M0n0N8p2Q8j04J20j44J68j92K24k56K94l34L77
$$ 0 0 0 0 0 0 0 0 0 0 0 0 -8 8 -8 8 -16 16 -16 24 -26 32 -40 48 -56 64 -80 88 -104 120 -136 158 -176 201
33B01m31M90n53O21o94P78q71R69j076J195j324J466j622J790j974K175k397K641
$$ 201 -230 260 -293 328 -366 412 -459 510 -566 629 -695 771 -851 939 -1035 1140 -1257 1384
51A384k909L207l538L906m319M788n325N944o671P536q583R885j1557J3797j6959
$$ 1384 -1525 1682 -1856 2050 -2269 2519 -2806 3138 -3533 4003 -4580 5305 -6252 7545 -9414
66i414K1799l0214M8917j66320Q5301K87812k46220j22842J46827M6878j28904
$$ -9414 12385 -17829 31088 -135232 -49931 237881 -8339 -131181 15646 62524 -66380
77f6380R4124Q3731j60356q7884K00928N2790j72063k1786J46067j9618q2408
$$ -66380 27744 111475 -48881 -136765 64163 116953 -55110 -76896 69171 49553 -32855
88c2855L7921J2907p7056N1798R6207q0935j01793Q8968O7341p9759j7272P1950
$$ -32855 5066 17973 -59083 -7285 88922 7987 -93806 -4838 62503 -17256 -34528 37422
100C7422m5098o8350Q4316O8571q6306l3792P5023j6441o8749N8569N2759q7534
$$ 37422 -7676 -76026 8290 76861 -9445 -43237 31786 15345 -53404 5165 57924 -29610
112b9610k8921J01954j922r7704M3078R4219p4327q6284Q1471N8631p8304j7961
$$ -29610 -58531 43423 41501 -56203 -13125 81094 6767 -79517 1954 60585 -17719 -35680
124c5680P4778j7742o5454M2767M7289n9059k8544N9255N840n1258J0227L2686
$$ -35680 39098 21356 -44098 -1331 45958 -13101 -41645 17610 23450 -27808 -17581 15105
136A5105j4200J607J5375m5039k3263P7213L2130q3345k2709P7810K636n9541
$$ 15105 905 2512 17887 -27152 -50415 26798 58928 -24417 -47126 30684 33320 -26221
148b6221K8635L9540o0814k5361P5270N442p5592K0936O8506m6445n7440N9678
$$ -26221 2414 41954 -18860 -44221 31049 36491 -39101 -18165 50341 3896 -53544 6134
160F134L4935o5660r022O2676j7078n0269M2107L4742n4985j1770O0370j5172
$$ 6134 41069 -24591 -33613 29063 11985 -38284 3823 38565 -16420 -28190 32180 17008
172A7008o2494L6659N9868m3103m5499L8720J7709l1720J3142K3566m0673j8186
$$ 17008 -45486 -8827 51041 7938 -37561 1159 18868 -12852 290 23856 -16817 -35003
184c5003N5001J1624n1610M100M0772k3713k7546L9046J1772m6257O111M6486
$$ -35003 19998 31622 -19988 -15888 24884 1171 -26375 12671 24443 -21814 -15703 30783
196C0783k3198m0292L7273K7621m7438j3620M8621m613m5053K1448L9447l0898
$$ 30783 7585 -32707 4566 32187 -15251 -28871 19750 15137 -29916 -8468 30979 81
208H1k6113L3908P919l2159J3203K9730l0038k5056M0248J7796m0159o325L1679
$$ 81 -26032 7876 15795 -16364 -3161 26569 -3469 -28525 11723 29519 -10640 -16965 14714
221A4714j0844k3272K5096J2419l3896j919L6113r431l1398K0024K2373k7520
$$ 14714 3870 -19402 5694 18113 -15783 -17702 18411 8980 -22418 -2394 19979 -7541
233g541r209L2016l431l0551J6428K5935k5212j7305K8416L863k8896J0275K6064
$$ -7541 -16750 15266 11835 -18716 -2288 23647 -1565 -18870 9546 13409 -15487 -5212 20852
246B0852k3495k1579L0671J4410l2583m561K8377o207k0397J7899J1878k4527
$$ 20852 -2643 -24222 6449 20859 -11724 -16285 12092 5885 -14512 3387 15265 -9262
258i262k249K7958o783k6749J3466K0502j7758j1888J8920R67j8138R208J4132
$$ -9262 -11511 16447 9664 -17085 -3619 16883 -875 -12763 6157 7124 -11014 -1806 12326
271A2326j8006r388K2521L106k2345N098J9775j1252j3193J6523N595j8879K847
$$ 12326 -5680 -15068 7453 10559 -11786 -6688 13087 1835 -11358 5165 10760 -8119 -5272
284e272J8482j0931j5632J6384J0193k0239l777J9775m001j7581J0536J2980j5053
$$ -5272 13210 2279 -13353 3031 13224 -7015 -10792 8983 4982 -12599 -2063 10917 -4136
297d136o625J7612M05j6526O516J3933j1549q737J4847L103j5591K409J3507p700
$$ -4136 -10761 6851 7256 -9270 -2754 11179 -370 -9107 5740 8843 -6748 -4339 9168 1468
311A468j0460J0965M228j2408J223J1807o432r889J1106O220j2791j414J2986
$$ 1468 -8992 1973 6201 -6207 -4984 6823 391 -9498 1608 7828 -4963 -6377 6609
324F609k643j0519P463P182j0695k992J2057j792j1992N394R577q800o573J0271
$$ 6609 3966 -6553 910 8092 -2603 -5595 6462 4670 -7322 -1928 7649 -1151 -7724 2547
338B547K014j0438K338R236n785o422Q553L556q964M45Q659l725o654O380M016
$$ 2547 4561 -5877 -3539 5697 -88 -6510 2043 5599 -3365 -2920 5739 2014 -4640 1740 5756
353E756q156j128P548k278o450M474L551o458q23P078j845o481M383N381n726
$$ 5756 -2400 -3528 4020 1742 -4708 -234 3317 -3141 -3964 3114 1269 -5212 -829 4552 -1174
368a174k000O129k73n438L227M512n642k773O140N70o363J079M804l628k867N010
$$ -1174 -3174 2955 2682 -2756 471 4983 -659 -3432 2708 3278 -3085 -2006 2798 -830 -3697 1313
384A313N97n818J543N670k458l670L438J807l319Q16L643l346l014M747J860n428
$$ 1313 1910 -3908 -2365 3305 847 -2823 615 2422 -897 -81 3562 216 -2798 1949 3809 -1619
400a619q37M052j094k882K881L96m282J098N442k020n098K886M036k382j598K704
$$ -1619 -2456 1596 502 -2380 501 897 -3385 -2287 3155 1135 -3963 -1077 2959 577 -1021 1683
416A683j133k255L582K124n446j962N481N07m887Q62K754k908j149M742k78n594
$$ 1683 550 -1705 1877 4001 -1445 -3407 2074 2581 -2306 -1444 1310 -1598 -2747 1995 1717 -3877
432c877J767N409k368l747L462J940l489O11L160k440k633L654R89m694O24M030
$$ -3877 -2110 3299 931 -2816 646 2586 -903 -292 2868 428 -2205 1449 2438 -2256 -1632 2398
448B398k826l611M921K217o061q48O147n63m293K516K502l679j44M999j227n429
$$ 2398 -428 -4039 882 3099 -2962 -3810 2337 1774 -2519 -3 2499 -1180 -1324 3675 2448 -2981
464b981K094L647k465j352K465k390k453M833K219o964j712P882O06o697O35N761
$$ -2981 -887 2760 295 -1057 1408 -982 -3435 1398 3617 -3347 -5059 2823 3429 -3268 -2633 3128
480C128k347k833M302M43n520J025O369k166n446J539L249j520k30P28k912j284
$$ 3128 781 -2052 2250 2693 -2827 -1802 4567 2401 -3045 -1506 1743 223 -7 721 -2191 -3475
496c475N477J123o016j214O232J056m727O77K477k259m5M108p69o532J248O411
$$ -3475 2002 3125 -2891 -4105 2127 3183 -1544 -867 1610 -649 -694 3414 2645 -3887 -2639 3772
512C772m02n496p94K378L21J589L34n062r68O915K371p391k067O256J221l509
$$ 3772 3370 -2126 -2920 -542 -221 1368 1702 -3360 -4328 2587 4958 -2433 -4500 1756 2977 -532
528e32Q81J452m173L44O841o96q545j97P104R13m455n91K01k28K771J446m039
$$ -532 349 1801 -2372 -2028 4813 4117 -4428 -4625 2479 3392 -1063 -1654 -1453 -1681 1090 2536 -1503
545a503j617M817L08m196K088L717l969k657N989N43o869P58O466k314n547L244
$$ -1503 -3120 1697 2005 -2191 -103 3614 -355 -3012 2977 3520 -3349 -2591 3875 1561 -3986 -742
561g42L039m129m25M925k090m727L185M016l141j140L857k327m215N029M671o299
$$ -742 2297 -1832 -2257 2668 578 -4149 -964 3052 -89 -1229 2628 301 -3914 1115 5786 -513
577e13m013N750K107n554M69M515k680m152L778L283m261j165L561m66k484K692
$$ -513 -4526 1224 3331 -2223 -1754 2761 81 -4071 -293 2990 -1271 -2436 1125 659 -1825 867
593H67J363l386L45L584j760m027L264L177m132j860M613n72m901K082N158l746
$$ 867 2230 -1156 -811 2773 1013 -3014 250 3427 -705 -2565 2048 1476 -3425 -1343 3815 69
609F9n096M748L823m287j889M598j58l975J943K935k847j582L957p88m318K558
$$ 69 -5027 -279 3544 -743 -2632 1966 1808 -2167 -224 2711 -136 -1718 2239 1451 -2867 -309
625c09L779l899l039M238J269m215P79L748k709k880M814J548n396j47N442q95
$$ -309 3470 -429 -3468 770 2039 -2176 -1397 2351 -358 -3238 1576 3124 -2272 -2419 3023 2128
641B128m245K233J878l180L02L924k483m550L845L232m487j413M714n35m831K683
$$ 2128 -2117 116 1994 -1186 -884 3040 557 -3993 -148 3084 -1403 -2816 1898 1363 -3468 -785
657g85M119l405l016M101J364l774Q20L272k249k890L444J329l656q66L525l45
$$ -785 3334 -71 -3087 1014 2378 -1396 -576 2696 447 -2443 1001 2330 -1326 -2192 1333 988
673I88l002J759J006k307N60L564j798l941K400L619k195j609J860q5k390J773
$$ 988 -2014 -255 751 -1556 -996 2568 770 -3171 -771 2848 653 -956 904 819 -1571 202
689B02K798l063k806L180J607l025k5K263j618j799K660J613l254j047L927n1
$$ 202 3000 -63 -2869 311 1918 -1107 -1132 1131 -487 -2286 374 1987 -1267 -2314 1613 1562
705A562k890R90K151k151p56K764j98l639J159L468k020k590K004R96j995L00
$$ 1562 -1328 -338 1813 -338 -1094 1670 1472 -2167 -1008 2460 440 -2150 -146 850 -1145 -845
721h45K305j742k106L106J331l039l66L164q86k397J767J614k461n07K532r13
$$ -845 1460 -282 -2388 718 2049 -990 -1356 1808 922 -1475 292 1906 -555 -1062 1470 557
737E57k440J633K161k872j342K946O13k919P80K389j635j226K349L72k732O72
$$ 557 -1883 -250 1911 -961 -2303 643 1256 -1663 -883 1506 -129 -1355 994 1366 -1366 -694
753f94K812j290k631J906J470k235m77K395j054k279J966J679k272j007K488R4
$$ -694 2118 828 -1803 103 1573 -662 -1139 1256 202 -2077 -111 1568 -704 -1711 777 871
769H71k257J016K148j829j343K361P39k506n1K279j021j683J541P54k263J54K383
$$ 871 -1386 -370 1778 -51 -1394 967 1706 -800 -851 1428 407 -1276 265 1019 -1244 -1090 1293
786A293p45k439J415J646j436r03J934j39j937J366J751j719j402K034N19k068
$$ 1293 548 -1891 -476 1170 -266 -1169 765 626 -1311 55 1806 87 -1315 719 1238 -830
802h30L13J621r12j662J835N72j898k25K156o10j818J513J057j587n44J887J06
$$ -830 -517 1104 192 -1470 365 937 -961 -1186 970 360 -1458 55 1112 -475 -1019 868 974
819I74j807O99J330j173p46J361N5j631K74J650j079j341J455P24j677K12J535
$$ 974 -833 -134 1196 23 -723 638 693 -938 -664 986 -93 -1434 21 745 -932 -720 815
836H15o17j041J056Q68j445l74J770l13j320O70R01j197n63J335j12j395L93J195
$$ 815 198 -843 213 1081 -364 -738 1032 719 -601 69 970 -227 -790 545 433 -962 -569 626
854F26r21p17J273M43j509L07J440o37j064J142O65j286k29J159k52j146O78R04
$$ 626 -295 -1012 261 704 -805 -498 942 305 -759 383 1048 -238 -467 692 440 -706 -28 876
872H76j492k55J110O8j313O35R30q27l65Q31L03r73K81J064o59q47J079L49j048
$$ 876 -616 -871 239 307 -1006 -371 559 -268 -633 198 501 -472 -191 873 214 -633 446 795 -253
891b53k06J164n18j123R27O35j189k24J135l1j032M40R56p37l92J168j57j074
$$ -253 -459 705 187 -936 -9 626 -563 -787 348 317 -715 -275 681 -56 -448 720 563 -511
909e11M38R22n86o84O13J58q64j79J341n21j142J050O88j050m33R82r6m01L47
$$ -511 -73 849 263 -421 192 350 -514 -693 648 127 -1015 35 723 -327 -760 222 126 -275 72
928G2N59n91l95J090J8j097L57M06k51m90N19j29q07L88P81m02r69P00P34p24
$$ 72 631 40 -355 735 753 -344 13 419 168 -322 197 68 -739 -351 430 28 -941 -241 493 -231
948b31j57N12m2k47J76N60m73m57L96N87o45j52R4rJJ93j12n51J0Q41j97n82L92
$$ -231 -388 124 82 -165 11 571 98 -359 37 624 -21 -173 -79 -88 -87 106 -6 -557 -547 294 97 -485 -93
971i3M40l97j20M99J54p30P8Q16k40n24K7M12m60j18J84j7k62M71m7o52J63P94
$$ -93 347 -50 -170 329 483 -247 -169 647 407 -117 -90 322 -138 -256 -72 -89 -351 120 73 -579 -416 378
993C78l42l02N51J75q39K06Q07k72q54K54P12m15l61L22J13l35kK08j59qR3l5
$$ 378 36 -266 285 460 -379 -173 634 362 -492 -238 474 59 -302 20 133 -202 -204 4 -155 -163 -70 -105
1015a05m2L56J15l71j38Q12k98o54R3P47k32l29k85L73k3j77J35mk08J39J13J39
$$ -105 -147 209 324 -47 -185 627 329 -325 -232 515 283 -46 -331 42 19 -158 -23 -27 -235 -96 17 156
1037A56j42j54P5K92K20l50l31J79J26M4r0j52N7J12j76k00M12j46k03O6J80R5
$$ 156 14 -140 -65 227 447 97 -234 -55 71 115 25 -127 -70 42 -134 -334 78 -68 -271 -205 -25 70
1059G0k37R0M72k53l77K31L07j94J60j57k11m3J95q8L0n3p0j08J52L17m21k36
$$ 70 -167 -77 395 142 -235 -4 303 109 269 112 -99 -142 53 -35 -5 -58 -128 -236 -84 233 -188 -424
1081d24K80L22l74J19M66l12k2j35K44j29J04Ll56qK79J24n05J24M1J15j89J05
$$ -424 -144 178 -196 -77 389 77 55 -80 164 35 139 142 -214 -222 57 181 -324 -200 -159 -44 -233 -128
1103a28L72m00L1J22J87J65k70J52r2n1L0o3n6J5j56J20J1o4m1M0K5j03R1l2K0
$$ -128 244 -156 -125 -3 184 349 79 231 139 88 118 55 -1 14 -142 -22 -11 -75 -116 -76 -51 -154 -63 -95 -75
1128g5K79k55J16l13N20P7m10L0J96l49P1L23Q9o97j21O76j22m18J96K95m86M14
$$ -75 204 -51 65 -248 272 349 -61 -31 165 -184 -113 210 299 -398 -519 157 35 -383 -187 108 -378 36
1150C6Q1j6l66L27M07l87r8K74k78p0J00K01o44J87K83m8k51J62J25k69RL14O4
$$ 36 117 101 -265 62 469 82 -16 258 -20 -90 10 211 -433 -246 37 -11 -262 -100 25 -244 -235 79 143
1173A43k16J49P9nj74J55J50k74J13j00n6k18K48J98l31q8K9K77j87P5J98p0l51
$$ 143 -73 76 155 150 -24 131 281 7 120 20 -36 -254 -6 192 -139 -227 -198 79 -108 -33 165 95 -256
1196b56L54n2M9p7O5j72j88K81K93l75j14L00j39j43j91M64l56L1K94K23m26n5
$$ -256 98 46 95 18 83 -89 -277 4 297 -78 -192 108 -31 -174 -365 99 -257 -226 68 291 -135 -190
1218a90O12l91J4j30L63l60q5N97l77m09K01K87j28k98K55J03m13K48K38j97p7
$$ -190 422 31 45 -85 278 -82 -167 430 53 -356 -155 132 4 -294 -39 64 -349 -101 137 -60 -137
1239a37L91J82n27L00K68n00k9J99J37n23%M14k29j05K01K5m55L2M30mm02K45
$$ -137 254 436 -91 209 477 -23 -52 147 284 -239 -239 175 -54 -159 42 67 -388 -356 74 70 -332 -87
1261h7L51k25k50K74Q1l26L55J78k20k49K22j11j44j18M12k79p2K93l2k90K2K21
$$ -87 264 39 -211 63 144 -182 173 351 131 -118 104 -7 -151 -269 143 -136 -208 85 53 -237 -215 6
1283FJ07k76K27K77m22N1J96j5l66J44L01j72k01L59j23m12J18M03l93q7J59L33
$$ 6 113 -163 64 341 -81 -30 166 151 -215 -71 230 58 -143 216 93 -319 -201 202 -191 -278 -119 214
1305B14o33K07O95k88m16L53K49n35jL44p3j69Q3K04l97m1K71n2l17L9L91j17
$$ 214 -419 -212 483 195 -221 132 381 -154 -155 189 116 -53 30 234 -163 -204 67 15 -302 -263 128 11
1327A1k35L82K2l00J13L21k55k09J77L89n50mM38l76k79K87K54l45j19K70K9k19
$$ 11 -224 158 180 -120 -7 314 59 -150 27 416 -134 -138 300 -76 -355 -68 186 -159 -278 -8 21 -198
1349a98Q5L13j76j79L54R0k65o3N42l84l34L15K02m90j4N37l14k92K03K72k31
$$ -198 -113 200 24 -155 199 289 24 -39 503 119 -215 100 302 -188 -202 335 21 -271 -68 204 -27
1370b7k51M43L9m97L91L11k33l72N13r5l33l8L12o7m15M31j5k62r4L67k01k12
$$ -27 -278 165 204 -293 98 409 176 -196 317 222 -111 -149 163 96 -319 112 97 -165 -259 108 -93 -305
1392c05L33J78j96m0K80o8k62K09J63l67j8K49l0j71q8K74m9m69L11J77l58Q2
$$ -305 28 206 10 -30 250 182 -80 129 292 -75 -93 156 126 -45 -133 141 92 -377 -66 111 -247 -165
1414a65M86k85l81J34M47l18j05L10o3k66M32r2j36j88L77o6l90P2L47j93j83
$$ -165 321 36 -345 -211 236 -82 -187 123 60 -206 226 134 -2 -190 187 121 -269 -197 150 -43 -226
1435b26P7K36j29j80K77Q0l97J81L83m07J32K66r8l65L61J00k36l06L53q0j31
$$ -226 -149 87 -42 -222 55 135 -262 -81 302 -105 27 293 195 -170 191 291 55 -251 102 22 -109
1456a09j64L90j31l24L48J14k37jL13Qm09K75J67l16n6K84j5k39oJ57k91n9M95
$$ -109 -273 117 -14 -338 10 124 -113 -114 199 207 -202 73 240 -76 -132 152 137 -102 -108 49 -242 -301 194
1479A94j37k04k1L86j64l33L77J77l05L7K39n8j76K26L4m46j3L08J3l36K6K5j27
$$ 194 57 -147 -168 218 54 -279 98 275 -30 7 246 188 12 238 272 -174 -187 121 134 -202 -176 -151 -278
1502b78j4L13p8j57K10K92l89K8J94K22n04L57N5j3j32O0r2q7j79L91j09m11K12
$$ -278 -292 21 -57 -214 -4 288 -101 -73 121 343 -161 196 251 238 106 166 74 -13 -192 199 90 -321 -109
1525a09J07j47P3J30J7j59J93J44j77j40J37K03k22l3J65Oj46l35L32k04o5K16
$$ -109 -2 -149 -76 54 71 -88 105 249 72 -68 69 272 50 17 182 188 42 -293 39 -165 -230 -14
1547a4j03k05J95L80l15O3P5K6j06j38L18J7k35pL13l21L7K17k72j13r8K40r4
$$ -14 -117 -322 -127 253 -62 1 76 102 -4 -142 176 193 -42 -49 264 -57 -20 197 -75 -188 -286 -46 -140
1570a40j19K31q1p8M5L91j97k66M10q0j55j3K50j85j37K52qk24q6L68l26k15L24
$$ -140 -259 -28 -109 -187 -142 249 52 -214 196 116 -39 -52 198 13 -124 128 120 -104 -190 178 -148 -363 -39
1593c9L09m43N5K64k86J67J23J34l78jL68j89k8J8M7j14j28K45j87Rk72L68j15
$$ -39 270 -173 -118 146 -140 27 150 284 -94 -95 273 84 56 74 121 7 -121 124 -63 -54 -326 42 -73
1616g3K6n6K16j65Kp1K99j66J05j64J40l3j09K63j75l5O1j57j23J58J19j47j06
$$ -73 -47 -103 113 -52 -50 -121 178 12 117 -47 93 60 -49 214 39 4 65 -92 -215 -57 62 -85 -191
1639a91L16j12N4j49J86j33n6K48M8j33NR2j59O3lO7l40k2K28N8k82K05J1k46
$$ -191 125 13 67 -82 104 -29 -85 163 211 78 83 175 16 79 76 143 -197 -219 9 67 -215 -10 1 -245
1663b45r0O78j76m02L18Q0j26j11L36l27o6J20J11O1l63L41j38m1L9J11k2k29
$$ -245 -335 343 167 -235 83 163 37 -74 262 -65 -131 -11 100 161 -202 139 1 -40 -1 110 88 -141
1685a41J12J2j82L34j8j7j12J7j6J09J22j23j0r5j85K69l10L5J45m3K8q7J89m
$$ -141 -29 -17 -199 135 117 100 -12 5 -11 98 220 97 87 -8 -193 76 -234 -199 -54 -97 -69 -156 33 29
1709B9m6Q2j18J64j36J55K6j82J44q7o1j93K66J36k18l6N6k9j29K83j04o5L2n3
$$ 29 -17 65 -53 111 -25 130 156 -26 118 31 -30 -223 43 179 -39 -75 -19 -48 -177 106 2 -63 -31 -84
1733h4J04M9L3Lj36k5J16k3n7l0L47k73j43J79j15n0J50J63l19J64J72k34j50
$$ -84 20 69 102 105 -31 -56 60 37 -20 -50 297 24 -119 60 -55 -105 45 208 -111 53 225 -9 -159
1756a59L28l8j19j89L00J39l37L5K09k67K3K68k92P7j39O8j9M8J4N1k8O6J0l9
$$ -159 169 131 12 -177 123 262 -75 -40 169 -98 -75 193 -99 -22 -161 -93 -112 -64 -50 1 -27 39 49 10
1780A0J59j79J73q2l5P2o8o2n9QQ9j89l4K21j05q4Q6J14L5o0O4o1j33R6K81k45
$$ 10 169 -10 163 81 46 118 50 -12 -71 -63 26 -163 -197 24 -81 -165 -79 35 70 10 74 13 -120 -24 257 12
1806A2n5j2R0j61J69Q1j64L2J8K5r3J5J13j13l3J6Q7n4R4J57j67j58J93R1k38
$$ 12 -43 -55 35 -126 43 124 -40 -8 10 35 -58 -43 70 -43 -76 -60 27 -27 67 224 57 -101 92 183 -55
1831e5J7J94k30J4j03J34J6q0o0nJ46J76q9k39O4J06m8rN7R6k02k8M6R0j39q1
$$ -55 -38 156 -74 -60 -163 -29 -13 -93 -153 -158 -12 164 75 -164 -100 6 -42 -51 6 102 -100 -128 -82 8 -131 -212
1857b12L41k17N7q5J51o6j17J84p2P9K09j52j72J90R3j24p6J18k07J49J81o2j69
$$ -212 129 -88 -31 -116 35 -31 -148 36 -36 43 252 100 -72 118 211 87 11 129 -78 71 252 190 21
1880B1m9L3k3R3q5j08J11O0j21K31J37l53J40R8l23O8O4R7j26JK43k64J7Q4J49
$$ 21 -28 5 -18 75 -10 -118 -7 53 -68 163 300 -53 87 185 -138 -70 -6 91 -35 -34 209 -55 -38 46 195
1905A95l98R0J68p0J44j69N8N1j42K29o2k06J14L4j23J54j28N9r3mJ87J3j69J17
$$ 195 -203 -113 55 -15 129 -40 18 69 -73 156 94 -112 2 36 -87 67 -61 -2 -95 -99 88 101 -68 49
1929D9L4m0mJ8j77Q0n5K37j26JK1K6k45lK65q6j05l8K33j87jJ45p0j53K13Q6k6
$$ 49 83 43 39 57 -120 -40 -95 142 16 17 38 64 -181 -184 81 -5 -110 -148 85 -102 -103 42 -28 -181 32 118 92
1956I2k65J26K07l54J68J84j36p2l7L45l60lJ20k8j85J02K15j83k18K53J1k1R
$$ 92 -173 -47 160 -194 -26 158 22 -50 -87 258 -102 -105 15 -13 -198 -96 119 -64 -282 -29 -18 -39 -30
1979c0J78k98M9J32k2j10J4K21j33r7J38J12k30O7J08j83mO8Q3j69L49k11j01
$$ -30 148 -150 -101 31 9 -101 -87 134 1 -96 42 154 -76 -9 99 -84 -88 -20 63 -106 243 32 -69
2002f9P4J6p3o4J26J10o2j70K23n9j69r2J32Q6j30J85J67k92j66J23J87pO6k7
$$ -69 5 21 -52 -116 10 120 58 -112 111 52 -117 -209 -77 9 -121 64 231 -61 -227 -104 83 76 142 115
2026A15j93J51j7n2Oj07r1O8l5J21K03l26J95l6o5J24r6Q7np3J57j07J24j09k
$$ 115 -78 73 56 4 10 -97 -188 -120 -155 -34 169 -157 38 2 -63 61 -35 52 47 -26 131 24 148 39 37
2051C7k2j18P5J26q3Pj23K7M1p8J49j12q4K05mk93O1K26P8o9n8K32l44P8J92n4
$$ 37 15 -103 -28 98 15 22 -101 -74 -33 -111 38 -74 -158 47 43 -250 -189 37 115 46 -12 220 -124 -46 146 92
2077I2j49J85r9K8j66K27n6j89m8J42M7m6l9J38j20P3M1P5k43M4J34o4qp9j20
$$ 92 -57 128 29 57 -109 118 62 -127 -175 -33 14 -32 -71 67 -53 20 61 136 -107 -63 71 7 -1 -80 -200
2102b00K04J02m1r9n8K84j67j17j35J81K7Q5J89k24j22J8LK23n5r1J20j48n9J46
$$ -200 4 106 65 -34 -92 192 25 -92 -227 -46 -19 66 255 31 -91 -73 -70 153 98 7 127 -21 -80 66
2126F6j29j37J62K9N5j16K31l3j26R1k07J58n0L8K92m14K2J38j85Q8l4L2p5j77
$$ 66 -63 -200 -38 -9 46 -70 161 128 2 93 -114 44 -6 32 324 -90 -68 70 -115 -27 -61 -29 -104 -281
2150b81L69k11N8K62k10J5J63k04R7k20J48K91k54r9R8J74j96J86q7p4M9l6Kr1
$$ -281 88 -123 -65 197 -13 2 165 -39 58 -162 -14 277 23 -76 22 196 0 186 99 25 74 38 40 -51
2174e1K88j96l9j21J95n9q9Q1J74j52L6NJ2r4j04J79K9r8Q0K6j77L6n2P9j85l
$$ -51 237 41 2 -119 76 17 -72 9 183 31 67 72 84 -10 -114 65 94 -4 76 102 -75 -39 -91 -12 -197 -200
2200b00P8R2M4o1J25j09j15K19q8J41j48k3J77q0j74J77Qj4o1j40J00K76j32Q
$$ -200 -122 -30 14 -47 78 -31 -146 73 -15 126 -22 -45 132 52 -122 55 63 49 -12 -152 -52 224 92 100
2224A00q5P5Oj56R9o9j07J63m8J6K3o3j0J2j7P1J59k05o5K2J20j73P7J17j9M3
$$ 100 15 90 96 -60 39 -30 -137 26 -22 -6 17 -46 -56 -44 -61 10 169 -36 -101 -79 41 -132 -55 62 43 86
2250H6J3Kj28K9L3Nk69K92p9j68K66O0j73l5J01k3p7j4m2J03JJ97j26r5J00O8
$$ 86 99 101 -27 2 35 40 -229 63 -16 -184 82 142 -31 -66 35 12 -65 -79 -121 -18 -17 180 54 -41 59 127
2276A27o4j4p6q2o6J32P7m2N8j48J95r4k4QM6j62J65J64k61j41M29j69m6l6J76
$$ 127 63 49 -27 -109 -175 -43 34 -8 50 -98 97 3 -21 -13 33 -129 36 200 -61 -202 227 58 12 -24 152
2301A52Mk42N7J19j55j32P0J5Q3j44J57mJ60k23L0J44l18J43L32l84J95R8k11
$$ 152 156 -86 -29 90 -65 -197 -127 -112 -29 -173 -16 -20 140 -83 -53 91 -227 -84 248 -136 59 157 -54
2324e4q3n9J52m3q0K62l2o4P6r8K9m4J06P5j32j43K91j73L1J9q1O4p3R7k26J04
$$ -54 -137 -196 -44 -87 -167 95 63 -1 75 -23 6 -38 68 143 11 -132 159 -14 17 36 -45 19 -54 43 -183 -79
2350g9N2N8R0j94j5Q3j1j71J16j13J93m4R4J23k35J4j28J64J37k16R6r1P8K8k22
$$ -79 -27 31 121 -73 -88 -5 -16 -187 -71 -184 9 -35 59 182 -53 -39 -167 -3 134 -82 14 -77 1 29 -193
2375a93J94M0j44J53K9m2j04L5JO0j8j36J26l9N1P6m4J46k29L6q8QO3M7Q0j05
$$ -193 1 41 -103 50 79 37 -67 -32 -31 29 11 -125 1 -38 13 89 45 191 -38 -2 -90 -82 -19 28 108 3
2401Cl0k6Q5j89J63j93L27j62L9j39O5J65m69L14J69j7j97R7Kn7K09j67P4j27
$$ 3 -27 -53 32 -157 6 -187 140 -22 17 -122 -57 108 -361 -47 122 105 -92 5 7 -50 159 -8 66 -61
2425f1J97j1m2J08q6j48R5j22K0r8J93J31k42p1J05j96K15oJ12m6p9N2j26M2N
$$ -61 136 125 83 191 105 -43 52 -70 -50 -148 45 176 -66 -137 -32 -228 -13 -19 93 47 -32 20 -106 -64 -59
2450e9J80r4Kl4R3o4j46J72j8o3kJ71j13l8O3N2r8M9j69J62j28J43j45J57n0j00
$$ -59 121 27 29 -5 88 24 -122 50 32 -31 -33 138 25 -13 50 102 4 53 -116 46 -82 61 -84 73 23 -77
2476g7Rj44J93J2q4Q2Op6K3jJ92j9k21O8j64J45KO2K5j5k3N8oJ5pj17J39j00L5
$$ -77 -68 -212 -19 -7 -91 -9 -3 -79 -56 -57 135 116 -105 -37 -201 -56 -54 8 33 18 -5 53 47 62 55 -62 77 -23 12
2505A2J9j54K74j28p4L0m5O2J4J29Q4j97j1JM8k75J91J65k13qP9j5qK0j11l2J3
$$ 12 31 -123 151 23 -51 -21 -66 -4 10 139 223 26 15 16 64 -211 -20 145 -68 -76 3 -12 -20 0 -111 -143 -130
2532a30J67Q8n6L2j18j7P5N6p7j81N5K3J60Q3j29j17J03R0j26N9o2Q6j06j2n0
$$ -130 37 125 69 101 -17 -34 41 97 20 -161 -106 -83 77 160 31 -86 17 107 -19 40 -22 64 -42 -54 -104
2557a04J11j02J14j77J34m9J81N5j59K9j98J15R1n6m2n0K4o6J84r0n4M2k5P3J57
$$ -104 7 -95 19 -158 -24 -73 108 163 4 33 -165 -50 41 -15 -57 -107 -83 -149 35 -55 -109 -67 -92 -19 138
2582A38j11p2j66L10l8k25J51N6j88J19P1M7l8P9M5k74Q4p3K22j1l0j63K1N0j95
$$ 138 27 -45 -211 99 61 -164 -13 43 -145 -26 45 92 54 133 178 -96 -12 -85 137 126 96 -67 -46 4 -191
2607a91K95o6j64K56j72l0J2J77r9J04J3l69J83J39r4o8O0O5n1l7pJ30j42Nj38
$$ -191 104 38 -126 130 -42 -72 -60 117 18 122 135 -234 -51 88 -6 -74 -14 51 0 -37 -44 86 -56 -51 -189
2632a89P0K86o6N3k07J32j21p7K13j36J0J53j10M5j15J11j50M7o3l5p9K55k9O
$$ -189 -119 167 101 154 -53 79 -42 -119 94 -42 -32 121 11 56 -59 52 -98 -51 -114 -149 -228 27 -2 4
2656Dj42J32n2j4O5K19l8k17Q8j87O5N3J08o4k47J11J5M1L0L2J45k01o2J02j23
$$ 4 -138 -6 -58 -72 -7 212 174 -43 45 -142 -77 -24 84 20 -227 -116 -101 -60 -30 2 147 -54 -116 -14 -137
2681a37J86n0r0j3Q5O3n5Q8J9p8j16J79k12K54j92K0n0J08M1o2nn5J13q1L2j13
$$ -137 49 -1 -91 -104 -19 44 -11 77 96 18 -98 81 -131 123 -69 -49 -99 9 50 -12 -17 -72 41 -40 -8 -121
2707a21K37k30p9K47j57L5O8N3k02K68j13J44j85l9J98k15N4m9O4P8p5K17j75
$$ -121 116 -114 -193 54 -103 -68 0 53 -149 119 6 150 -35 -74 124 -91 -37 -86 -22 56 -19 198 23
2730B3R8Q5n9k83J32m8q4K46j4n8k46K27j70K55j53n4M2J36k7j38J2n0J42j00
$$ 23 121 206 147 -136 -4 -52 -136 110 96 38 -208 19 -151 104 -49 -103 -61 75 48 -90 -78 -128 14 -86
2754h6J93j30j0K12j05q8J15j82J04p5Q1L9k7o3k4o2K00R9j43j00N7j9o5J44j05
$$ -86 107 -23 -33 179 74 -14 101 -81 23 -52 29 68 41 -22 -46 -108 92 191 48 -52 5 -14 -79 65 -40
2779d0M5K8Q4j13o5K4K9M0Nk8r1J0j37N9J22P4j59K09j40p3K7J64r3ljJ05j12
$$ -40 5 33 117 4 -61 -37 -8 32 37 9 -82 -72 -209 -150 -28 46 -113 96 -44 -117 -90 74 -19 -22 -23 82 -30
2806c0J04qk93K44J17j60L9N8k01J59q5K01k21k6J07R6j16k3K6p8o3J51J9l5m5
$$ -30 74 66 -227 17 134 -26 13 71 -130 29 -56 145 -76 -102 5 101 -15 -38 -12 -90 -153 -2 17 -18 -63
2831f3P2K2J24j15l0j51J03J43R4l48l1J85j31jK8OJ66k5ll2P0k80L01q3j59K03
$$ -63 9 31 155 40 10 -141 -38 105 199 -149 -180 5 -126 -127 -99 -93 73 48 45 13 83 -197 104 21 -138 65
2857F5j01J12m9j99J29o1Q7lO3j2j22J34k11J24J41j44l0J93j63m5J0o6J82o6
$$ 65 -36 76 27 -172 -43 -104 -17 -20 43 31 -91 43 -168 -44 97 -47 -77 116 -47 -92 -82 -148 34 -32
2881c2%J13pj49J78nj58K28m3j15l3J28mj80J59k30J42J96k72J08j15N3j50K24
$$ -32 -32 81 74 -75 103 98 -60 168 125 10 -23 105 101 -79 80 -150 -8 188 -84 24 -91 -38 -188 36
2905C6j9L4j52J05M2k2r4n1N4J4j06P2J1l4J67j61J20m5K48k82M2M0m9P8n4o0
$$ 36 17 51 -101 4 46 24 -70 -121 -67 -53 -159 -87 -76 -110 57 -104 16 -29 219 -63 -21 19 -30 48 -6 -66
2931f6r1K52r4MM9j6J3N4m6j17K7J56l16K41J8LJ09l17M1J54j35M0J0n8J67m0
$$ -66 -157 95 1 5 54 38 51 105 59 -58 -31 125 -191 50 68 71 180 -137 -96 58 -77 -37 -27 -85 82 42
2957D2pr1K22p5N5j68r9K84j94o2k0K49j23l7K01j38J58k07K2lK18j55j81J94
$$ 42 35 -56 166 91 146 -22 -121 163 -31 -93 -113 136 13 -24 177 39 197 -10 12 9 227 72 -109 85
2981H5j63L0J78j27N4k7pn1Qj20K68m4m8j52j7J21k16K8L58n8k5j22n9L18j99
$$ 85 -78 -48 130 3 57 30 23 -28 -20 -140 128 84 36 -116 -133 -12 -228 -200 158 100 75 -47 -106 212 13
3006A3j20Pj7J07J53R8k43L6M3r5r3K24j40j5j16K62j14p4J01O9j76J66J00j92
$$ 13 -107 -100 -117 -10 143 241 -2 34 77 -18 -111 113 -27 -42 -158 104 -10 -84 17 86 -90 76 176 -16
3030a6l6J20j56K74l59O0J3P3J63j70Q3o8j07J04q8J42k9nm5QK0q9K49p7j13L2
$$ -16 -52 68 -88 186 -173 -113 -100 -27 136 -34 49 -19 -126 -22 -110 32 3 -2 -47 -39 -19 -108 141 64 -49 -17
3056a7M4j79K34j36O3J60k1k0j66n3Q6M9l0Rj11J72k26jQ2l5J7QJ79j32J29k27
$$ -17 27 -152 82 -54 9 169 148 128 -38 -91 -5 44 14 23 -88 84 -142 -143 -61 -96 -79 -71 108 -24 105 -122
3082a22P4p4j3J42J1L4L5m4j30L8J57n0r9n7K9J86p3k52J71K4J12K6o1J2j35J08
$$ -122 -48 -122 -135 7 18 52 87 43 -87 -49 108 58 -41 -98 -69 117 44 -208 -37 -13 99 125 64 76 -59 49
3108D9j19J18j03R9Q7j13j12K21j27J9j28L8N3J44j22R6j9j49J6K0J04n5j57J57
$$ 49 -70 48 -55 44 131 18 -94 127 0 19 -109 -71 -18 126 4 100 81 -68 -52 -32 72 17 -140 17
3132A7J14j34j1M8R3j18R2l51L43p5p8N8M9qJ02j69K2j12J97o6Oj13Q5J9J4J08
$$ 17 131 -3 -14 34 127 9 101 -250 93 18 -60 -2 47 39 141 -28 -6 -118 79 13 19 -94 -9 10 24 132
3158A32m8j26r1R8j3J67j64J39O7k82j4J96p4Q5o7q2N4J5K03j31Q7k95K7J62r4
$$ 132 84 -42 -133 -35 -48 119 -45 94 161 -121 -135 61 -13 72 5 -77 -23 -8 195 64 151 -144 -117 45 -49
3183d9J49j28J46j64P5j0J4L5N3j65J27J03k21J41k30k3rJ54j25R3k0K3O1l8J40
$$ -49 100 -28 118 -46 29 19 33 68 121 -44 83 186 -35 106 -124 -147 -156 -2 -127 -34 -54 -31 30 -8 132
3208A32n9r7P2mJ02k84P8M1R9j24N5Q6Q9k7M4k69J02r9k9J78k12J56j11N3O8J46
$$ 132 73 -24 48 44 146 -138 -60 -19 80 -44 11 97 186 159 203 -66 36 -63 -92 86 -126 30 -81 -28 40 186
3234A86k02j19Q7Mo9P9L27k88R8j00j53K05m0k9j25J91Q2r8k5L3l1R2j46J35k09
$$ 186 -16 -135 -48 -44 -113 -34 293 5 103 3 -150 55 15 -14 -139 52 134 36 11 44 13 105 -41 94 -115
3259a15QJ23q3R6r1K1Q6R5j82j48J53o3K61o1j63J7P5L3j1k3j64K56k69R6P6j7
$$ -115 -107 16 -67 29 -62 -41 45 140 -42 -190 -37 -100 161 100 -63 -46 29 62 51 28 -136 120 -149 -53 23 6
3285Fk7J24j30m3J35R5j43j07K73k07K2j05n9J58J28m7m9l8M0k01J28N0p4K56
$$ 6 -21 103 -27 -70 65 160 17 -90 183 -24 -2 -107 -166 -8 120 73 24 -14 26 -175 -47 3 -71 185
3309A85j10q5k3j1J73j7k42J40k5R6j12j7L2J02j34J62j05J87p6k23K90l57RK28
$$ 185 75 -10 -33 -44 129 112 -130 10 -15 81 -31 -48 -16 86 -48 114 9 196 120 -103 187 -170 -161 67
3333F7j63J55j5k9j35J29n8N2nk0Q6K0j37M7O6N4j7p6M3r8k19N4K25k9k4J5j25
$$ 67 -96 59 44 15 -120 9 -49 3 -2 -22 64 84 -53 -6 60 114 97 21 64 -34 -253 -199 26 -3 -27 -12 -137
3360a37J99n6M3j38JK13r9n9q1K76j31m9r2J37j4P1p2l8k1KL7j39K42j00O2Pj87
$$ -137 62 6 49 -89 -88 125 26 -33 -114 162 31 -18 -110 27 13 84 12 -26 -47 -45 -8 -147 95 -5 57 64 -123
3387a23J65l8n4l0j04J72j05N7J64qo5K7o2O1j21p6J37L7k7J23k52N1J02J2j19
$$ -123 42 4 -50 -80 -184 -12 -117 -60 104 96 31 58 -4 57 -64 -140 -3 34 7 130 -122 -71 31 43 -76
3412g6JJ56r4O0L1j43P3p3mJ41p1J8Qo5r7J76nm7m5R3J90k69k5L8J22J6o8j53
$$ -76 -75 81 -13 47 78 -65 8 -65 -69 72 1 19 27 -38 -135 41 36 -11 -56 37 227 -42 -67 -29 93 109 41 -112
3440a12J95p6J61n3j76J23j76K9J18R7j73J48o7n0N1j48M5J07r1n1J08Pn7k3m
$$ -112 83 7 168 115 -61 62 -114 -85 33 130 -43 105 38 -12 39 -109 -64 43 -48 -99 9 16 -41 -64 -68
3465f8o7J56q6q5J02m8K32j23LQ5j82J26k5N0j43jJ01L4K1j54J55l27K92j41P2
$$ -68 -135 21 -65 -150 -48 -96 136 13 16 101 -81 45 20 70 -73 -74 27 61 82 -72 83 -244 48 -93 -21
3490b1k32J79N0M7O4r5J59j23p3N9j55R9J21q4n6J96k04J50k01J16j23j15L10
$$ -21 -253 -74 -24 23 87 -8 151 28 -45 14 -141 -42 79 -5 -61 135 -69 81 -120 -4 -127 -242 68
3513F8q4K1l7o6M4l6L0j7N8n0J36Kk9n5k7J51l3r3K6N4j04l8L15k39K8m2M5j31
$$ 68 -16 5 -32 -98 -54 -90 -60 -77 -19 -69 67 69 40 -15 -42 109 76 -17 9 63 -41 -79 236 -3 25 -17 28 -103
3541a03R2m1J21k71O1J59j23Q8j05j52J61K26j44kJ67j18N3j88J44N3J40j25P
$$ -103 -11 -52 69 -202 -141 18 -105 -17 -122 -274 -113 113 -31 -33 134 16 69 -119 25 78 218 93 100
3564A00j52M8J00q2J32j75J91j85R1M5K5J0k93o3K79p5p2J79or0n1p0N9q0R0K4
$$ 100 -52 -4 96 14 146 -29 162 -23 68 113 138 148 -145 -208 71 -4 -76 103 97 7 -44 -114 -55 -135 -45 -21
3590b1o4K39l75K42P9j73J70j34p6Q9M9J04j04J32o1j19J74k24l4J18P4J56l07
$$ -21 -85 154 -221 21 100 -73 97 -37 -113 -24 25 129 25 157 96 -23 151 -73 -107 11 85 241 -66
3613f6J55k7j50nJ37OK7j78J17l7J47p3J2j21R2q7R8r8J8K8J2J00j34j65J74K3
$$ -66 89 62 -88 -93 44 50 77 -101 16 -21 126 53 65 -56 36 -51 47 -51 -33 -5 7 107 -27 -192 -18 5
3639Ek0n7J5J06L5j78n9K22Q4j94j07K21j58k7J5M2Q8J9N3r5qq2J8k2K76j18j26
$$ 5 -15 -72 -57 49 84 -94 -153 69 153 -41 -148 73 -85 -112 -97 -55 33 52 105 10 2 -80 -62 -84 192 74 -52
3666e2L3K8j20J25r8L0j30J86O3O2j87K1L5j1J73k40Q5J14n2k2j27K8N5J05m9
$$ -52 -19 9 -111 14 -84 -54 -184 2 65 127 -60 -39 -4 -15 158 -82 3 117 65 43 -84 -56 -1 104 55
3691E5j83J27J13k14M0J04j37K46k32J34k9Q7j29L5o8R3j07K13j32m3j38Q9k3
$$ 55 -128 -1 112 -102 -62 42 -95 151 -81 53 24 111 -18 17 -51 42 -65 148 16 -27 -165 -76 -99
3714i9J56lJ26k44J83k9k3L6Qp9j65M4kJ13Lj23o4K16K9j23N4l5l3J13n0J55k53
$$ -99 57 54 180 -64 119 90 67 103 111 32 -133 -89 -91 22 25 -98 -162 54 83 -40 14 -21 -54 59 9 164 -89
3741h9J31r3J01k5j7j2q3j8N1J03j91K57m1j25M7j36J15K21k08p5R7k09L44p7
$$ -89 42 -51 50 25 8 -4 -87 -105 -54 49 -142 115 74 -51 -4 -140 -25 196 -12 -87 10 -199 145 68
3765F8J34l52K52p0P8j99K11j02r4q6R5J16j56J82j85Q3n5K20j28o0K38k33J91
$$ 68 202 -150 102 32 110 -89 122 20 -74 -160 -65 51 -105 77 -108 -25 -80 140 12 -48 190 -43 148
3788A48l2j91j7K32o5p3J04j80J13P8l07K66j35N2K49k34L8kj41K29k18M3O1n
$$ 148 116 -75 -92 140 75 2 106 -74 39 117 -190 76 -59 -7 242 8 46 44 -97 132 -86 -43 18 13
3812A3n2l2Q4j00k6J26O0r1k6J24J17j82N6k77J74Qm7r8J53J45k80K94r4L6p7
$$ 13 -39 -71 13 -87 -113 13 73 -18 -44 80 197 15 71 -206 -32 -24 -71 -169 -16 129 -151 143 49 85 8
3837HJ4l3J1M4j63J38r6J18k2%J06p1J6j79O8L6o7J37K7j47J00L4Pqr2J28j07
$$ 8 22 -11 0 44 -119 19 -77 41 19 19 125 54 70 -109 -41 -5 -72 65 92 -55 45 79 86 78 -14 114 7
3864Gj08J00L7N1K3k59J80R2j57Q7J74l22J80lj98J08k0Q1mj09j78J82N1J22p4
$$ 7 -101 -1 36 87 110 -149 31 123 -34 53 227 -95 85 82 -116 -8 -28 53 49 -60 -238 -56 -5 117 43
3889D3j19J04l8K0J0nj2k2J13N8q9j39J65o9O4j69j4JJ27j0J88j68K3P8k96J43
$$ 43 -76 28 -10 10 20 15 3 -19 94 152 63 -76 89 20 84 -85 -99 -98 29 19 207 39 62 140 -156 -13
3915a3J77j05M9j6j87O0K3J73j94J06k85J89L1m5Q7j21J15k36J78j14L05l07J64
$$ -13 164 59 108 92 -95 -35 -12 161 -33 73 -212 -23 8 -37 50 -71 44 -192 -14 -128 177 -130 34
3938C4o0J2kM1N5K2j92P7q0L2J73j45j5R2j78K18q4r9J88j6q7j51L07j79O8p7
$$ 34 -26 -14 -16 25 80 102 -90 -13 -93 -61 112 -33 -48 44 -134 84 0 -99 89 73 -14 -165 142 -37 31 -46
3964d6l8J90k58J97l5J9l1L1n0j05J4J37Jj08M5L8M4rj8N1l7P9j33J11r8J14M3
$$ -46 -84 106 -152 45 10 29 -2 29 -21 -126 -112 25 26 -82 -37 1 45 36 18 69 32 111 -22 89 -9 105 148
3991A48j44k5Q0R5j00k21K81pl7j64L7K7N6p9J31m2j43J51K3l4j23J26m7p5k2
$$ 148 4 -21 59 154 54 -167 114 107 70 -94 -57 -30 26 -53 78 36 -107 44 67 33 -90 36 -11 -86 -108
4016a08j02J23j8L8M3pm6J11j06M0J58K6j88K5N7M6J4j85K39j13j03M6N7m7R1
$$ -108 -210 -87 -105 -67 -24 -31 -77 34 -72 -32 126 152 -36 -11 46 92 106 -79 160 47 -56 -10 47 0 91
4041I1k4k16R2J45N9j92qR2J04Kk04J08l7p2J3P0Q7j24Q8L9r5P1k2k1j93K97j64
$$ 91 67 -149 -57 88 147 -45 -53 39 143 145 -59 49 12 -60 -47 23 110 -14 74 113 18 89 67 46 -147 150 -14
4068a4j0k7OJ5o6L47j10o3j3j39J6J87r7k01J67Rj21J7K16L1k62j3n1L18j69p7
$$ -14 -24 -51 -45 -30 -96 251 141 78 65 -74 -58 129 32 -169 -2 7 -114 -97 119 150 -112 -125 -176 142 -27 -104
4094a04N0k8K12r7J46l73J71P2K7m5j92K10j14J00o2m8p9J18J8q9J87K5p9j95
$$ -104 -54 -82 130 33 179 -194 -23 49 76 31 -161 49 -65 35 -27 -75 -154 -36 -18 -107 80 105 26 -169
4118a69J19J56n0l6M9p9k6K77k00pm4n1J76j60k6K01j45m5q8K99j28J75j63jL0
$$ -169 -50 106 56 20 69 -10 -36 241 41 34 -10 -61 115 -45 -71 130 -15 -60 -148 151 23 198 35 34 64
4143F4j0Oj7j6O0r7K4P1k34J58Q7M7k20Q3Q6j74J95Jj68L3o7j4J03N2kq7Q9Qq5
$$ 64 54 60 43 27 87 -10 14 85 -149 9 96 143 -77 6 92 -82 113 114 -54 -21 -88 -102 1 53 51 -36 53 61 -24
4172b4J62k24J95k64P9K35j67J5N7m0l7qj7K1O8r7J27j32n2K21p3OJM3m7M1k88
$$ -24 138 -86 109 -155 -76 159 -8 7 64 24 -13 -21 -38 -17 51 -46 81 -51 -103 118 45 51 52 95 48 89 -199
4199a99K65J4m0Lq8J74rk76J51O7q9Q1p7k8J63L1k41m3P5QJ21r3j75P7O7K54k88
$$ -199 66 80 40 43 -45 129 120 -156 -5 62 -27 54 -23 -51 112 143 -98 -141 -66 -58 63 -30 -205 -128 -61 193 -95
4226i5J0J13qOm0j3J66j83N8K6k44L26j80J59o3J5m0LJ22j79J17l4J14k98R5J12
$$ -95 -85 28 20 26 -14 -27 139 -44 14 40 -204 122 -58 101 38 53 13 16 138 -41 76 42 156 -142 -47 65
4252F5j19O8J68k65R0J9O5l7o4k9J37m2ql1j66J81j26m6K24J1l8J0p9j46J88q5
$$ 65 -54 14 182 -83 7 26 91 54 -10 -39 98 56 48 17 -149 32 -94 -140 84 95 57 67 -12 -158 30 -55
4278e5K07l21K13L3j40n7J62n3m7J9O4n2M6mq2K38l14K12n3j8p4Q0P5j68J16r5
$$ -55 152 -169 44 77 -63 -120 42 -11 -58 -39 25 -27 19 15 -67 171 -143 69 16 -2 -76 4 79 -89 27 -68
4304f8M9j6k1J55j55J28j32N2L7j45L9R1j26J71N1j52j10R9j4J06m6KJ6j27J81
$$ -68 -19 -35 -56 99 -56 72 -60 -8 29 -116 -77 14 -112 59 110 -42 -152 -53 -67 39 -7 -5 11 -116 65
4329F5om3Qm1K04nj97pq5J96l9jo1m8J39r7J7p1Q3lj12P3r8J9J71j05p1J43mk2
$$ 65 59 16 24 -17 187 182 -15 -22 -107 89 50 49 -12 -60 79 -18 -1 -72 11 8 -104 -31 -129 -110 61 -44 -115 28 24 2
4359Bj47Q7J19j77L9O4K20l6k31J60M2k11J39j21M9o3L6J14l1j06m1KO7j5R9j24
$$ 2 -145 -58 61 -116 -77 -13 207 171 -60 100 142 -69 70 -51 -2 -65 -29 85 54 -52 -93 -91 -24 -39 60 -64
4385f4M7J1J07j99N5l8O8jq8K08j39O7o5J48p8k2n7nJ83k32J08R5j33jN8m5l5
$$ -64 -17 -6 101 -98 -43 -81 -13 -14 -102 106 -33 34 -31 117 39 17 -40 -45 138 -94 14 109 -24 -25 33 -12 -47
4412d7n4O3J56k74K72j53m1P4j77P9K22l32J21J91j35l3J14r3MJ17p9J5k9K28
$$ -47 -101 -38 118 -156 116 -37 -78 -4 -181 -102 120 -212 -91 100 -35 -68 46 -47 -43 74 -5 10 -19 209
4436B09k30k1J44k07K49n9m84N72j54J6o8j5O0kN7N3j74J18L2j33J97j20j49J99
$$ 209 -21 -42 102 -105 144 85 -399 173 19 35 -33 -48 12 10 67 120 -54 64 96 -37 160 40 -109 90
4460I0j64K2J66P5j66k7pn2N8J01q4K9j12L7j03Q6j20R9L1j56K57Q0j42j08M6
$$ 90 -74 -52 114 189 23 -4 -11 -63 -5 96 12 41 -71 -34 -137 -51 -171 -72 -41 -197 60 140 -2 -110 -64
4485f4J06m4J27j49R4J7j35P6r3J59j49R9J6L8Kj11K61j86j2m3j46M20j43m5j
$$ -64 42 -2 125 -24 70 87 -48 28 -65 94 -55 44 60 98 100 -11 250 64 52 9 -137 283 140 95 94
4510I4k8N0r5O1J06k73J73m4Q4k39K7J03j01R4j05K18m0k08J84Qj03n2M8j0P7
$$ 94 66 116 21 82 188 -85 88 44 128 -111 -84 19 -82 12 -93 125 85 -123 61 69 -34 -86 -38 -48 29
4535B9k47L86p1nj03M8q1L4J00j43K14p8k86J35Q5k0o5M0O6N4kn5l0r1O0K5k7
$$ 29 -218 168 97 92 -11 37 -44 -10 90 -53 161 83 -203 -68 17 -3 -68 -28 38 92 90 35 5 -86 -26 -1 -28
4562b8j8K11j3j80k3mJ8J18q0J8n0Q1j59qK0o6L7J49J11j91q1K19k7j9k1J20j95
$$ -28 -46 165 152 -28 -51 -55 -37 81 1 19 -31 50 -109 -117 -97 -163 -126 23 134 -57 -138 81 54 35 14 134 -61
4589f1J15p7om1J71r4J1L5N6q8N9j52J62j78R1l9J18q2J0M8k1n1l1J7j05J42j2
$$ -61 54 -23 -29 -70 101 7 18 53 109 21 80 -72 90 -88 3 -36 82 0 10 58 37 -14 -45 -28 -133 9 -3
$$ [...]
8191d1
##END NTUPLES=NMR FID
##END=
