##TITLE=1H_Pr 5292-Eth
 200.13MHz,CDCl3 ,
 8 sc
 
 28.4.2025
##JCAMPDX= 6.0         $$ Bruker NMR JCAMP-DX V2.0
##DATA TYPE= NMR FID
##DATA CLASS= NTUPLES
##ORIGIN= UXNMR, Bruker Analytische Messtechnik GmbH
##OWNER= pz
$$ XWIN-NMR		Version 3.5
$$ Mon Apr 28 16:37:08 2025 Russian Standard Time (UT+4h)  she@DPX200
##.OBSERVE FREQUENCY= 200.1313
##.OBSERVE NUCLEUS= ^1H
##.DELAY= (6, 6)
##.ACQUISITION MODE= SIMULTANEOUS
##.ACQUISITION SCHEME= undefined
##.AVERAGES= 8
##.DIGITISER RES= 18
##SPECTROMETER/DATA SYSTEM= spect
##.PULSE SEQUENCE= zg30
##.SOLVENT NAME= CDCl3
##.SHIFT REFERENCE= (INTERNAL, CDCl3, 0, 14.3821)
##AUDIT TRAIL= $$ (NUMBER, WHEN, WHO, WHERE, WHAT)
$$ ##TITLE= Audit trail, XWIN-NMR		Version 3.5
$$ ##JCAMPDX= 5.01
$$ ##ORIGIN= Bruker BioSpin GmbH
$$ ##OWNER= she
$$ F:/spectra/data/she/nmr/H-C/1/audita.txt
$$ ##AUDIT TRAIL=  $$ (NUMBER, WHEN, WHO, WHERE, WHAT)
(   1,<2025-04-28 16:35:49.71 +0400>,<she>,<DPX200>,
      <created by zg, POWCHK disabled, PULCHK disabled
       configuration hash MD5:
       00 E9 B6 7A A2 85 ED C7 34 08 36 98 17 FE 4E 26
       data hash MD5: 16K
       6B 10 D0 CC 6E C0 0C 2C 41 F2 85 06 40 02 16 CD>)
$$ ##END=
$$ 
$$ hash MD5
$$ E7 77 3E 9F D4 48 AE 4D CE D6 D9 D9 A4 5B 2C 25
##$RELAX= 
##$RELAX= 
##$RELAX= 
##$RELAX= 
##$RELAX= 
##$RELAX= 
$$ Bruker specific parameters
$$ --------------------------
##$DU= <F:/spectra>
##$EXPNO= 1
##$NAME= <H-C>
##$PROCNO= 1
##$TYPE= <nmr>
##$USER= <she>
##$AMP= (0..31)
100 100 100 100 100 100 100 100 100 100 100 100 100 100 100 100 100 100 
100 100 100 100 100 100 100 100 100 100 100 100 100 100 
##$AQSEQ= 0
##$AQ_mod= 1
##$AUNM= <au_zg>
##$AUTOPOS= <>
##$BF1= 200.13
##$BF2= 200.13
##$BF3= 200.13
##$BF4= 200.13
##$BF5= 200.13
##$BF6= 200.13
##$BF7= 200.13
##$BF8= 200.13
##$BYTORDA= 1
##$CFDGTYP= 0
##$CFRGTYP= 5
##$CHEMSTR= <none>
##$CNST= (0..31)
1 1 145 1 1 1 1 1 1 1 1 1 1 1 1 1 1 1 1 1 1 1 1 1 1 1 1 1 1 1 1 1 
##$CPDPRG= <>
##$CPDPRG1= <>
##$CPDPRG2= <>
##$CPDPRG3= <>
##$CPDPRG4= <mlev>
##$CPDPRG5= <mlev>
##$CPDPRG6= <mlev>
##$CPDPRG7= <mlev>
##$CPDPRG8= <mlev>
##$CPDPRGB= <>
##$CPDPRGT= <>
##$D= (0..31)
0 0.7 0 0 0 0 0 0 0 0 0 0.03 0 0 0 0 0 0 0 0 0 0 0 0 0 0 0 0 0 0 0 0 
##$DATE= 1745843749
##$DBL= (0..7)
120 120 120 120 120 120 120 120 
##$DBP= (0..7)
150 150 150 150 150 150 150 150 
##$DBP07= 0
##$DBPNAM0= <>
##$DBPNAM1= <>
##$DBPNAM2= <>
##$DBPNAM3= <>
##$DBPNAM4= <>
##$DBPNAM5= <>
##$DBPNAM6= <>
##$DBPNAM7= <>
##$DBPOAL= (0..7)
0.5 0.5 0.5 0.5 0.5 0.5 0.5 0.5 
##$DBPOFFS= (0..7)
0 0 0 0 0 0 0 0 
##$DE= 6
##$DECBNUC= <off>
##$DECIM= 32
##$DECNUC= <off>
##$DECSTAT= 4
##$DIGMOD= 1
##$DIGTYP= 9
##$DL= (0..7)
0 120 120 120 120 120 120 120 
##$DP= (0..7)
150 150 150 150 150 150 150 150 
##$DP07= 0
##$DPNAME0= <>
##$DPNAME1= <>
##$DPNAME2= <>
##$DPNAME3= <>
##$DPNAME4= <>
##$DPNAME5= <>
##$DPNAME6= <>
##$DPNAME7= <>
##$DPOAL= (0..7)
0.5 0.5 0.5 0.5 0.5 0.5 0.5 0.5 
##$DPOFFS= (0..7)
0 0 0 0 0 0 0 0 
##$DQDMODE= 0
##$DR= 18
##$DS= 0
##$DSLIST= <SSSSSSSSSSSSSSS>
$$ [...]
##$SUBNAM0= <"">
##$SUBNAM1= <"">
##$SUBNAM2= <"">
##$SUBNAM3= <"">
##$SUBNAM4= <"">
##$SUBNAM5= <"">
##$SUBNAM6= <"">
##$SUBNAM7= <"">
##$SUBNAM8= <"">
##$SUBNAM9= <"">
##$SW= 18.0517328524113
##$SWIBOX= (0..15)
0 0 2 0 0 0 0 0 0 0 0 0 0 0 0 0 
##$SW_h= 3612.71676300578
##$TD= 16384
##$TD0= 1
##$TE= 0
##$TE2= 300
##$TE3= 300
##$TEG= 300
##$TL= (0..7)
0 120 120 120 120 120 120 120 
##$TP= (0..7)
150 150 150 150 150 150 150 150 
##$TP07= 0
##$TPNAME0= <>
##$TPNAME1= <>
##$TPNAME2= <>
##$TPNAME3= <>
##$TPNAME4= <>
##$TPNAME5= <>
##$TPNAME6= <>
##$TPNAME7= <>
##$TPOAL= (0..7)
0.5 0.5 0.5 0.5 0.5 0.5 0.5 0.5 
##$TPOFFS= (0..7)
0 0 0 0 0 0 0 0 
##$TUNHIN= 0
##$TUNHOUT= 0
##$TUNXOUT= 0
##$USERA1= <user>
##$USERA2= <user>
##$USERA3= <user>
##$USERA4= <user>
##$USERA5= <user>
##$V9= 5
##$VALIST= <valist>
##$VCLIST= <CCCCCCCCCCCCCCC>
##$VD= 0
##$VDLIST= <DDDDDDDDDDDDDDD>
##$VPLIST= <PPPPPPPPPPPPPPP>
##$VTLIST= <TTTTTTTTTTTTTTT>
##$WBST= 1024
##$WBSW= 4
##$XGAIN= (0..3)
0 0 0 0 
##$XL= 0
##$YL= 0
##$YMAX_a= 533707
##$YMIN_a= -505661
##$ZGOPTNS= <>
##$ZL1= 120
##$ZL2= 120
##$ZL3= 120
##$ZL4= 120
##$ABSF1= 10
##$ABSF2= 0
##$ABSG= 5
##$ABSL= 3
##$ALPHA= 0
##$AQORDER= 0
##$ASSFAC= 0
##$ASSFACI= 0
##$ASSFACX= 0
##$ASSWID= 0
##$AUNMP= <proc_1d>
##$AZFE= 0.1
##$AZFW= 0.1
##$BCFW= 1
##$BC_mod= 2
##$BYTORDP= 1
##$COROFFS= 0
##$CY= -3
##$DATMOD= 1
##$DC= 2
##$DFILT= <>
##$DTYPP= 0
##$F1P= 0
##$F2P= 0
##$FCOR= 0.5
##$FTSIZE= 0
##$FT_mod= 4
##$GAMMA= 1
##$GB= 0.15
##$INTBC= 1
##$INTSCL= 1
##$ISEN= 128
##$LB= 0.25
##$LEV0= 0
##$LPBIN= 0
##$MAXI= 10000
##$MC2= 0
##$MEAN= 0
##$ME_mod= 0
##$MI= 1.114404
##$NCOEF= 0
##$NC_proc= 0
##$NLEV= 6
##$NOISF1= 3.799351
##$NOISF2= 2.8
##$NSP= 1
##$NTH_PI= 0
##$NZP= 0
##$OFFSET= 14.38212
##$PC= 1
##$PHC0= -1344.2
##$PHC1= 8.592211
##$PH_mod= 1
##$PKNL= yes
##$PPARMOD= 0
##$PSCAL= 0
##$PSIGN= 0
##$REVERSE= no
##$SF= 200.129724274929
##$SI= 16384
##$SIGF1= 3
##$SIGF2= 2
##$SINO= 400
##$SIOLD= 16384
##$SREGLST= <1H.CDCl3>
##$SSB= 0
##$STSI= 0
##$STSR= 0
##$SW_p= 3205.1282051282
##$SYMM= 0
##$S_DEV= 0
##$TDeff= 0
##$TDoff= 0
##$TI= <>
##$TILT= no
##$TM1= 0
##$TM2= 0
##$TOPLEV= 0
##$USERP1= <user>
##$USERP2= <user>
##$USERP3= <user>
##$USERP4= <user>
##$USERP5= <user>
##$WDW= 1
##$XDIM= 8192
##$YMAX_p= 0
##$YMIN_p= 0
$$ End of Bruker specific parameters
$$ ---------------------------------
##NTUPLES= NMR FID
##VAR_NAME=  TIME,          FID/REAL,        FID/IMAG
##SYMBOL=    X,             R,               I
##VAR_TYPE=  INDEPENDENT,   DEPENDENT,       DEPENDENT
##VAR_FORM=  AFFN,          ASDF,            ASDF
##VAR_DIM=   8192,          8192,            8192
##UNITS=     SECONDS,       ARBITRARY UNITS, ARBITRARY UNITS
##FACTOR=    0.0002768,     1,               1
##FIRST=     0,             0,               0
##LAST=      2.2672688,     0,               0
##MIN=       0,             -505661,         0
##MAX=       2.2672688,     533707,          0
$$ Real data points
##PAGE= N=1
##DATA TABLE= (X++(R..R)), XYDATA
$$ plain form
0 0 0 0 0 0 0 0 0 0 0 0 0 0 0 0 0 -3 8 -8 8 -8 16 -16 22 -24 30 -35 40 -48 55 -62 76 -84 98 -110 126 -143
36 -143 161 -181 204 -228 256 -283 315 -349 387 -430 477 -523 577 -638 703 -772 851 -936
54 -936 1034 -1139 1256 -1389 1538 -1711 1908 -2138 2407 -2727 3105 -3546 4000 -4187 2193 28123
70 28123 533707 145564 -409885 23480 227352 -126338 -70165 246959 -68403 -332619
80 -332619 127247 312772 -179923 -189293 226519 113050 -142365 39126 98394 -116361 -38075
91 -38075 183449 -24757 -225038 71895 200894 -99711 -81701 138964 -26063 -150713
101 -150713 86887 121747 -126414 -96685 121629 23086 -107886 83148 98474 -150273 -62357
112 -62357 147293 -14830 -136551 54199 88135 -106465 -59290 141915 23810 -148382
$$ packed form
0@%%%%%%%%%%%%%%%lJ1j6J6j6K4l2L8m6N4o5P5q8J03j17J38j60J82k08K36k69
36a43L04l42L85m32M84n39N98o64P36q17R07j000J100j215J341j475J623j787
54i36J970k173K395k645K927l249L619m046M545n134N832o651P546q187O380K5930
70B8123N05584l88143n55449M33365K03872l53690N6173L17124l15362k64216
80c32619M59866J85525m92695r370M15812j13469k55415J81491N9268k14755P8286
91c8075K21524k08206k00281K96933J28999l00605J8010K20665j65027j24650
101a50713K37600L4860k48161K9729K18314r8543j30972J91034J5326k48747Q7916
112f2357K09650j62123j21721J90750L3936j94600M7175K01205j18105j72192
$$ plain form
122 -148382 26900 111287 -88652 -69034 103201 13081 -98144 31339 95612 -47155 -62149
133 -62149 84404 40317 -83468 -4202 38016 -40254 19930 69271 -58056 -75428 76932
144 76932 80796 -66279 -55156 55856 237 -44193 62625 24129 -98348 7890 106881
155 106881 -26039 -87398 40912 61957 -58088 -34906 61817 -16549 -60771 59390 33824
166 33824 -85768 -4699 79949 -22001 -62843 40429 38717 -64223 -14621 79404 -12021
177 -12021 -66408 38792 32128 -48550 9289 47590 -38334 -48293 47276 39792 -52364 -18651
189 -18651 48851 -14995 -29230 47557 3714 -55571 23797 52735 -34819 -39674 44990 27559
201 27559 -48659 -863 47059 -31715 -32031 53211 7179 -58357 7461 43736 -19755 -28571 31465
$$ packed form
122a48382J75282Q4387j99939J9618J72235r0120j11225J29483O4273j42767j4994
133f2149J46553m4087j23785P9266M2218p8270O0184M9341j27327j7372J52360
144G6932L864j47075J1123J11012n5619m4430J06818l8496j22477J06238R8991
155A06881j32920o1359J28310K1045j20045K3182R6723p8366m4222J20161k5566
166C3824j19592Q1069Q4648j01950m0842J03272j712j02940M9602R4025r1425
177a2021n4387J05200o664q0678N7839L8301q5924r959R5569p484r2156L3713
189a8651O7502o3846j4235P6787m3843n9285P9368K8938q7554m855Q4664j7431
201B7559p6218M7796M7922p8774l16Q5242m6032o5536O5818L6275o3491q816O0036
$$ plain form
214 31465 11018 -44788 11953 50499 -31858 -36962 39927 12613 -33986 10182 25491 -24867
226 -24867 -18675 37003 7765 -48718 6268 42406 -26828 -26915 31995 3195 -26953 15688 22392
239 22392 -25013 -15952 36663 8768 -40766 8662 34502 -24248 -15104 31719 -2308 -28855
251 -28855 11625 22164 -20703 -18692 27763 6008 -34687 10864 30357 -23089 -14405 27680
263 27680 2008 -22523 7742 20261 -14603 -15857 24425 5895 -29550 8889 23205 -21168
275 -21168 -12657 20435 -258 -19551 5408 17176 -12687 -13506 22194 4716 -23737 10702 18455
288 18455 -18860 -6907 20589 -110 -18134 4946 16445 -12304 -12890 19032 408 -22815
300 -22815 10913 15397 -18090 -6806 17881 1911 -15196 3615 15752 -9270 -10122 17852 1149
$$ packed form
214C1465k0447n5806N6741L8546q2357n104P6889k7314m6599M4168J5309n0358
226b4867O192N5678k9238n6483N4986L6138o9234q7N8910k8800l0148M2641O704
239B2392m7405R061N2615k7895m9534M9428K5840n8750R144M6823l4027k6547
251b8855M0480J0539m2867K011M6455k1755m0695M5551J9493n3446Q684M2085
263B7680k5672k4531L0265J2519l4864j254M0282j8530l5445L8439J4316m4373
275b1168Q511L3092k0693j9293K4959J1768k9863q19L5700j7478k8453L4439P753
288A8455l7315J1953K7496k0699j8024K3080J1499k8749n86L1922j8624k3223
300b2815L3728M484l3487J1284K4687j5970j7107J8811J2137k5022q52K7974j6703
$$ plain form
313 1149 -18250 9151 12424 -13163 -6247 11213 1441 -12114 986 11328 -8652 -8851 14094
326 14094 651 -13539 7319 9025 -8403 -3154 8919 2162 -9116 1603 10802 -7446 -7732
339 -7732 11619 9 -11444 4591 5910 -7048 -4208 6637 2631 -9255 445 11080 -5523
352 -5523 -6974 10364 1710 -8268 3543 6057 -3992 -4826 5381 4246 -9089 -1585 9751 -5046
366 -5046 -7451 7320 1124 -7072 1604 5457 -2448 -5460 5303 6023 -8038 -1050 9690 -3789
380 -3789 -5455 7002 996 -6523 810 5602 -2458 -7261 4360 5216 -8803 -1049 8460 -4765
394 -4765 -4876 7315 1695 -6363 523 7376 -1046 -7156 5251 5593 -8355 70 7971 -5516 -5301
409 -5301 6322 1544 -6694 -1253 6311 -1393 -7131 5389 4441 -8473 1259 8319 -4401 -4225 6047
$$ packed form
313A149j9399K7401L273k5587O916J7460r772j3555J3100J0342j9980j99K2945
326A4094j3443j4190K0858J706j7428N249J2073o757j1278J0719R199j8248k86
339g732J9351j1610j1453J6035J319j2958K840J0845m006j1886R700J0635j6603
352e523j451J7338q654r978J1811K514j0049q34J0207j135j3335P504J1336j4797
366e046k405J4771o196q196Q676L853p905l012J0763P20j4061O988J0740j3479
380c789j666J2457o006p519P333M792q060m803J1621Q56j4019P754R509j3225
394d765j11J2191n620q058O886O853q422o110J2407L42j3948Q425P901j3487K15
409e301J1623m778q238N441P564p704n738J2520r48j2914R732P060j2720J76J0272
$$ plain form
424 6047 2767 -5342 -1396 6739 -1217 -7489 5108 4073 -8646 -56 6614 -3894 -4520 3955 2806
439 2806 -4685 -1677 7018 -829 -7022 6097 4880 -7402 583 6846 -3149 -4846 3991 3727 -6227
454 -6227 -3252 8026 -1105 -8915 5031 4758 -7456 -251 6540 -2462 -4753 4689 4722 -6320 -2236
469 -2236 9390 -1355 -8029 6160 3416 -8189 1060 6910 -4644 -6867 5804 5862 -8531 -3775
483 -3775 9527 -1288 -7199 6272 2680 -7634 2114 8056 -3116 -6702 4682 5609 -6452 -1981
497 -1981 6783 -4185 -4944 7831 22 -9462 2132 8027 -2999 -6555 3991 4231 -5829 718
511 718 7006 -5458 -4151 9018 1874 -7819 239 5525 -1796 -4010 3710 1053 -7210 2302 7158
526 7158 -6946 -4941 8431 1795 -7233 670 5763 -2461 -4126 6124 2690 -8194 1806 8452
$$ packed form
424F047l280q109L946Q135p956o272J2597j035j2719Q590O670j0508o26Q475j149
439B806p491L008Q695p847o193J3119j217j2282P985O263r995j697Q837k64r954
454f227K975J1278r131p810J3946k73j2214P205O791r002k291R442L3j1042M084
469b236J1626j0745o674J4189k744j1605R249N850j1554k223J2671N8j4393M756
483c775J3302j0815n911J3471l592j0314R748N942j1172l586J1384R27j2061M471
497a981Q764j0968p59J2775p809r484J1594N895j1026l556J0546K40j0060O547
511G18O288j2464J307J3169p144r693Q058N286p321k214P720k657q263R512M856
526G158j4104K005J3372o636r028P903N093q224j665J0250l434j0884J0000O646
$$ plain form
540 8452 -5151 -5693 5734 1744 -5527 190 4324 -3061 -4230 5600 1493 -8027 2675 7424 -5745
555 -5745 -3754 6985 999 -5914 1889 5912 -4299 -4625 7935 1747 -9772 2075 7206 -6012
569 -6012 -4041 6312 350 -6176 2232 5759 -5447 -4523 8580 1495 -8618 3543 6630 -5861
583 -5861 -2226 7069 -807 -7384 2763 7180 -5429 -5687 7074 679 -7904 3357 5171 -5865
597 -5865 -1846 6561 -187 -6322 2384 6056 -4758 -3096 7657 -723 -7036 4848 4282 -7113
611 -7113 -2062 6779 -304 -6665 2339 5292 -6425 -3268 8529 -574 -7415 4264 4853 -5122 -1267
626 -1267 5978 -814 -6140 3663 5865 -6314 -3160 7445 -1560 -6669 4055 3258 -5759 -924 6058
641 6058 -1150 -6320 3508 5511 -5801 -2136 6864 -1223 -4510 4476 2355 -5358 -837 5360 -776
$$ packed form
540H452j3603n42J1427l990p271N717M134p385j169R830m107r520J0702M749j3169
555e745J991J0739n986o913P803M023j0211l26J2560o188j1519J1847N131j3218
569f012J971J0353n962o526Q408L527j1206R24J3103p085j0113J2161L087j2491
583e861L635R295p876o577J0147M417j2609k58J2761o395q583J1261J814j1036
597e865M019Q407o748o135Q706L672j0814J662J0753q380o313J1884n66j1395
611g113N051Q841p083o361R004K953j1717L157J1797r103o841J1679N89r975L855
626a267P245o792n326R803K202j2179L154J0605r005n109J0724p97r017M835O982
641F058p208n170R828K003j1312L665R000q087l287Q986k121p713M521O197o136
$$ plain form
656 -776 -5363 2916 3590 -5856 -1118 5827 -2493 -4578 4118 2504 -4195 -693 4857 -649 -4640 3379
672 3379 3818 -5123 -746 5305 -2006 -3943 2935 1961 -3660 -1146 3736 -883 -4407 3028 3078 -4706
688 -4706 -404 4881 -1571 -3108 3073 2185 -3237 -793 4103 -762 -4028 3163 2376 -4981 -158 4272
704 4272 -2168 -3394 2503 1872 -3195 -617 3885 -1349 -3501 3959 2184 -4569 532 4175 -1770
719 -1770 -2619 2600 1451 -3337 -247 3786 -2039 -3563 3699 1291 -4579 661 3348 -2121 -1982 2980
735 2980 1182 -3396 435 4012 -2149 -2780 3962 764 -3947 1346 2800 -2658 -1939 2832 786 -3692
751 -3692 262 3450 -2415 -2198 3819 147 -3418 1841 2706 -2165 -1484 2945 1051 -3277 687 3174
767 3174 -2627 -1856 3423 -370 -3348 1454 2095 -2338 -1671 2665 745 -3222 915 3179 -2366 -1308
$$ packed form
656g76m587Q279O74r446M738O945q320k085Q696j614o699L502N550n506l991Q019
672C379M39q941M377O051p311j937O878r74n621K514M882m619l524P435N0p784
688d706M302N285o452j537O181q88n422K444M896m865l266P191p87p357M823M430
704D272o440j226N897o31n067K578M502n234k152P460j775o753N101L643n945
719a770q49N219j149m788L090M033n825j524P262k408n870N240K687n469J39M962
735B980j798m578L831L577o161o31O742l198m711N293J454n458P19M771k046m478
751c692L954L188n865K17O017l672l565N259Q65m871O81M429j894m328L964K487
767C174n801P71N279l793k978M802O41m433O67M336j920l967M137K264n545J058
$$ plain form
783 -1308 3540 -179 -2766 1545 2163 -1955 -1661 2529 704 -3327 664 2650 -2765 -1413 3095 -491
799 -491 -2694 1480 2174 -1681 -1477 2813 792 -3035 1279 2764 -2650 -983 2978 -510 -2586 1050
815 1050 1834 -1959 -1721 2513 356 -3193 1273 2470 -2565 -841 2906 -274 -2066 1246 2017 -1614
831 -1614 -1325 2775 239 -3117 1343 2067 -2617 -825 2321 -614 -2097 931 1743 -1724 -1317 2711
847 2711 229 -2615 1613 1933 -2119 -370 2286 -345 -1828 849 1663 -1749 -1395 2343 -164 -2650
863 -2650 1321 1413 -2172 -431 1931 -50 -1618 759 1780 -1398 -992 2487 -99 -2171 1473 1320
879 1320 -1910 -520 1530 -180 -1726 338 1551 -1553 -1135 2223 -164 -2075 1269 1326 -1359 -324
895 -324 1555 273 -1381 492 1759 -1477 -1078 2156 -239 -2019 937 907 -1431 -643 1306 121
$$ packed form
783a308M848l719k587M311O18m118K94M190j825m031L991J986n415J352M508l586
799d91k203M174O94l855K04M290k021l827M314J485n414J667L961l488k076L636
815A050P84l793K38M234k157l549M466J197n035J724L747l180j792L312P71l631
831a614K89M100k536l356M460P24m684J792L146k935j483L028Q12l467M07M028
847B711k482k844M228L20m052J749K656k631j483K677Q14l412L54L738k507k486
863b650L971R2l585J741K362j981j568K377J021l178M06L479k586k072L644j53
879A320l230J390K050j710j546K064J213l104M18L358k387j911L344N7k685J035
895c24J879j282j654J873J267l236L99L234k395j780K956l0k338P88J949j185
$$ plain form
911 121 -1695 499 1753 -1393 -910 2168 -46 -1576 1097 1147 -1106 -601 1372 261 -1830 304
927 304 1652 -1627 -1001 1749 -380 -1579 961 952 -1112 -676 1524 521 -1676 515 1720 -1269 -655
944 -655 1751 -289 -1385 666 834 -1090 -1051 1107 475 -1760 298 1419 -1272 -554 1637 -201 -1146
961 -1146 763 1160 -693 -801 1304 466 -1667 529 1281 -1508 -579 1437 -383 -1298 317 949 -714
978 -714 -954 1162 445 -1451 677 1270 -1219 -267 1407 -22 -951 302 889 -682 -846 1131 174
995 174 -1636 522 1009 -1244 -490 1006 57 -757 182 911 -407 -669 1240 243 -1292 519 994 -870
1013 -870 -389 758 -60 -852 87 738 -681 -962 1132 298 -1319 423 899 -752 -273 937 304 -693
1031 -693 118 1078 -558 -923 1096 232 -1199 392 705 -923 -523 703 58 -1009 174 1135 -704
$$ packed form
911A21j816K194J254l146M83L078k214j530K673N0k253N05J973j111k091K134
927C04J348l279O26K750k129j199K540rk064M36K200j003k197K191J205k989O14
944f55K406k040j096K051J68j924L9K158o32k235K058J121k691P18K191j838r45
961a146J909L97j853j08K105q38k133K196P52k789R29K016j820r15J615O32j663
978g14k40K116p17j896K128N93k489R52J674j429r29J253N87j571j64J977r57
995A74j810K158M87k253P54J496r49q14R39P29j318k62J909r97j535J811M75j864
1013h70M81J147q18p92R39O51j419k81K094q34j617J742M76j651M79J210o33r97
1031f93Q11R60j636l65K019q64j431J591L13j628M00J226o45j067J183R61j839
$$ plain form
1048 -704 -763 1281 126 -1132 737 918 -674 -373 827 161 -945 173 930 -904 -682 1186 -248
1065 -248 -1202 544 525 -747 -214 858 101 -831 471 956 -834 -280 1250 -230 -890 577 544 -694
1083 -694 -373 568 -27 -929 215 782 -915 -379 1001 -218 -762 579 623 -440 -147 725 205 -853
1101 -853 325 755 -825 -297 986 -233 -855 255 457 -456 -447 691 230 -858 357 948 -740 -350
1119 -350 1026 75 -706 406 704 -570 -590 854 221 -1097 327 890 -967 -467 1008 -174 -888
1136 -888 402 814 -542 -484 1033 209 -955 508 837 -847 -169 1001 -260 -962 340 653 -707
1153 -707 -662 844 52 -1059 583 761 -884 -228 964 34 -656 371 779 -547 -444 954 68 -938
1171 -938 458 570 -789 -270 704 -155 -756 191 585 -510 -427 869 90 -878 472 659 -554 -151
$$ packed form
1048g04n9K044j155j258J869J81j592L01J200o66j106J118P57j834K22J868j434
1065b48r54J746j9j272N33J072p57r32J302M85j790N54J530j480o60J467l3j238
1083f94L21R41n95r02J144N67j697N36J380j219n44J341M4j063K93Q72n20j058
1101h53J178M30j580N28J283j219o22J110K02r13RJ138m61j088J215N91j688L90
1119c50J376r51p81J112K98j274k0J444o33j318J424N63j857N00J475j182p14
1136h88J290M12j356N8J517q24j164J463L29j684O78J170j261p02J302L13j360
1153g07M5J506p92j111J642J78j645O56J192r30o90J027M08j326J03J398q86j006
1171i38J396J12j359N19R74q59o01R47L94j095Q3J296p79r68J350J87j213M03
$$ plain form
1189 -151 724 52 -733 196 742 -586 -632 734 91 -929 299 558 -678 -352 672 132 -690 141
1207 141 795 -516 -492 924 160 -827 347 641 -501 -421 525 91 -723 43 666 -569 -542 807 35
1226 35 -705 342 569 -391 -203 643 169 -616 235 732 -521 -399 695 -32 -691 258 312 -448 -312 511
1246 511 110 -639 249 649 -429 -260 754 24 -556 388 409 -358 -240 511 135 -693 168 508 -597
1265 -597 -329 582 -103 -515 228 322 -388 -149 543 128 -533 278 552 -443 -185 549 -74 -490 264 298 -376
1286 -376 -357 417 -74 -643 221 441 -552 -129 546 -84 -370 308 425 -267 -227 554 75 -500 288 366 -528
1307 -528 -145 462 -127 -470 182 305 -376 -276 444 46 -464 362 445 -413 -33 493 -36 -406 209 359
1327 359 -359 -257 485 -37 -604 241 337 -501 -192 438 -98 -390 274 422 -299 -165 607 1 -550 370
$$ packed form
1189a51Q75o72p85R29N46j328m6J366o43j020J228K59j236L26J024n40q22Q31
1207A41O54j311K4J416p64r87J174K94j142Q0R46m34q14P66O23j235K7J349p72
1226C5p40J047K27r60J88Q46m74p85Q51M97j253J22J094p27o59R49N4p60J36Q23
1246E11m01p49Q88M00j078J69J014p30n80R44K1p67J18P51l76q28Q61L40j105
1265e97K68R11o85m12P43R4p10K39O92m15o61Q11K74r95K58P34o23m16P54L4o74
1286c76J9P74m91n69Q64K20r93M23O75o30k86O78J17o92M0P81m79n75P88P8q94
1307e28L83O07n89l43O52J23o81J00P20l98n10Q26Q3q58L80N26n29l70O15J50
1327C59p18J02P42n22n67Q45R6q38L09O30n36k92O64J48p21J34P72o06n51R20
$$ plain form
1347 370 404 -432 -70 407 -157 -430 121 294 -420 -267 488 -59 -545 372 292 -366 8 453 -9 -322 343
1368 343 374 -309 -126 516 -86 -444 298 179 -432 -112 359 -77 -371 182 312 -411 -105 545 -41 -363
1388 -363 350 212 -298 27 368 -62 -352 237 238 -391 -155 374 -176 -382 212 190 -350 4 361 -68 -303
1409 -303 203 328 -278 -85 474 -109 -311 284 164 -336 -65 298 -74 -377 81 251 -351 -109 368 -76
1429 -76 -314 204 192 -191 -60 347 63 -267 234 275 -359 -127 388 -102 -328 160 172 -289 -164 260 -49
1450 -49 -373 243 280 -310 -61 373 -68 -323 228 214 -274 -105 355 29 -430 199 233 -425 -72 336 -126
1471 -126 -253 255 250 -247 -117 426 10 -336 261 316 -342 -64 372 -174 -277 181 193 -296 -141 343 -111
1492 -111 -374 266 134 -312 45 315 -117 -155 211 253 -200 -88 308 -104 -276 212 164 -314 -32 190 -151
$$ packed form
1347C70L4q36L62M77n64k73N51J73p14J53P55n47m86R17q0o58L74M45m62l13O65
1368C43L1o83J83O42o02l58P42j19o11L20M71m36k94N53J30p23L06O50n86l22
1388c63P13j38n10L25L41m30k90N89Jo29K36N29n50k06N94k2n40L54L57m29k35
1409c03N06J25o06J93N59n83k02N95j20n00K71L63l72l03M58J70o02K42M77m44
1429g6k38N18j2l83J31M07k84l30N01M1o34K32N15m90k26M88J2m61J25M24l09
1450d9l24O16L7n90K49M34m41k55N51j4m88J69M60l26m59O29L4o58L53M08m62
1471a26j27N08nm97J30N43m16l46N97N5o58K78M36n46j03M58J2m89J55M84m54
1492a11k63O40j32m46L57K70m32l8L66M2m53J12L96m12j72M88m8m78K82K22l41
$$ plain form
1513 -151 -261 163 187 -234 -83 352 -66 -253 278 240 -191 -16 253 1 -215 162 223 -197 -99 222 -137
1534 -137 -244 159 134 -295 -38 239 -28 -193 165 230 -195 -119 332 -71 -161 181 181 -235 -16 236 -80 -224
1556 -224 57 140 -252 -60 331 -98 -181 211 151 -157 64 239 -50 -154 160 134 -219 -81 221 -122 -161 167
1578 167 139 -185 -75 169 -87 -181 184 83 -197 14 195 -114 -121 129 22 -82 9 200 -3 -170 135 80
1600 80 -201 -60 95 -119 -53 109 78 -104 -24 177 -70 -155 99 152 -130 -13 207 -100 -93 148 47 -188 -15
1623 -15 137 -51 -207 109 85 -215 39 177 -76 -93 194 46 -153 58 234 -49 -161 197 72 -202 68
1644 68 195 -114 -111 168 -21 -215 37 156 -88 -165 248 48 -161 52 126 -50 -13 110 51 -199 67 121 -126
1667 -126 -116 149 -46 -200 -6 117 -87 -34 126 57 -82 2 186 -143 -85 148 58 -176 121 137 -80 -126 101
$$ packed form
1513a51j10M24K4m21J51M35m18j87N31l8m31J75K69k52k16L77O1m20R8L21l59
1534a37j07M03k5m29K57K77k67j65L58O5m25P6M51m03r0L42%m16K19K52l16j44
1556b24K81Q3l92J92L91m29q3L92o0l08K21J75k89j04L14k6l53J38L02l43l9L28
1578A67k8l24J10K44k56r4L65j01k80K11J81l09pK50j07j04R1J91k03j67L05n5
1600H0k81J41J55k14O6J62l1j82Q0K01k47q5K54N3k82J17K20l07PK41j01k35J73
1623a5J52j88j56L16k4l00K54J38k53j7K87j48j99K11J76k83j12L58j25k74K70
1644F8J27l09LK79j89j94K52J19k44p7M13k00k09K13P4j76L7J23n9k50K66N4k47
1667a26J0K65j95j54J94J23k04N3J60o9j39Q4J84l29N8K33r0k34K97J6k17m6K27
$$ plain form
1690 101 57 -169 -61 192 -90 -146 194 52 -140 74 178 -97 -60 149 88 -107 49 189 -67 -169 129
1711 129 -1 -182 31 96 -98 -91 104 45 -137 -5 173 -84 -39 148 47 -82 97 126 -18 -29 118 37 -198
1734 -198 53 69 -116 -111 124 47 -90 31 92 -92 -79 185 20 -90 31 137 -52 -35 116 30 -49 49 73 -85
1758 -85 -54 63 -22 -187 33 103 -98 -45 106 89 -91 20 74 -46 -52 105 40 -101 46 106 -142 -44 45 -19 -113
1783 -113 17 44 -62 -88 114 -33 -112 83 61 -67 -2 144 -11 -85 78 114 -105 -10 114 -19 -119 94 41
1806 41 -99 -31 53 8 -109 108 82 -130 -2 136 -2 -54 130 79 -130 41 85 -59 -56 26 37 -118 14 107
1830 107 -88 -77 49 17 -100 -19 106 -15 -95 26 42 -69 0 116 -54 -77 59 56 -81 -30 25 -66 -97 22
1854 22 105 -80 22 119 -51 -56 88 -5 -46 31 124 22 -117 112 30 -110 -8 80 -61 -94 140 27 -96 19
$$ packed form
1690A01m4k26J08K53k82n6L40j42j92K14J04k75L7K09o1j95J56J40k56j02K98
1711A29j30j81K13O5j94PJ95n9j82J32J78k57M5J87j01j29J79K9j44j1J47q1k35
1734a98K51J6j85NK35p7j37J21O1j84J3K64j65j10J21J06j89J7J51q6p9R8K4j58
1758h5L1J17q5j65K20P0k01N3J51j7j80J11N4j20oJ57o5j41J47O0k48R8Q9o4r4
1783a13J30K7j06k6K02j47p9J95k2j28O5J46j55p4J63L6k19R5J24j33j00K13n3
1806D1j40O8Q4m5j17K17k6k12J28J38j38n2J84n1k09J71M4j44LQ2J1j55J32R3
1830A07j95J1J26l2j17Q1J25j21q0J21J6j11O9J16j70k3J36lj37N1N5r1l1J19
1854B2Q3j85J02R7j70nJ44r3m1P7R3j02j39K29q2j40J02Q8j41l3K34j13j23J15
$$ plain form
1878 19 96 -106 -89 35 38 -106 46 114 -62 -65 89 -10 -105 -28 66 -21 -74 80 21 -84 21 86 -81 -31 66 23
1904 23 -79 31 140 -13 -73 114 30 -88 47 111 -69 -56 78 -33 -63 -43 85 -97 -67 86 5 -114 27
1927 27 87 -72 8 25 14 -36 67 105 -80 -67 134 6 -126 23 59 -124 5 54 -38 -36 28 78 -23 -39 155
1952 155 -28 -59 57 67 -65 -50 69 18 -71 -38 111 -59 -42 53 1 -79 -3 86 -59 -18 48 49 -52 8 89 -15
1978 -15 -10 91 -42 -45 42 86 -97 -49 70 8 -81 54 60 -31 -66 96 -14 -75 36 34 -44 -53 75 13 -74 -32 76 -96
2006 -96 -90 28 -16 -101 -8 52 -11 -52 36 1 -105 76 116 -43 -57 125 -40 -68 42 53 -2 -26 25 -11 -79 27 59
2033 59 -87 -59 74 -46 -58 32 82 -10 -10 101 7 -45 85 138 -71 -2 119 -32 -36 -6 40 9 -69 45 -10 -34 54
2060 54 82 -111 -50 15 -7 -39 42 25 1 25 80 -33 -76 65 -6 -46 -58 26 -58 -49 39 17 -104 1 78 26 -65 74
$$ packed form
1878A9P7k02J7J24Lj44J52O8j76lJ54r9r5P7R4q7n3J54n9j05J05O5j67N0R7m3
1904B3j02J10J09j53o0J87q4j18J35O4j80J3J34j11l0K0J28j82L0J53q1j19J41
1927B7O0j59Q0J7j1n0J03L8j85J3K01j28j32J49L6j83J29M9r2KO4N0j01j6J94
1952A55j83l1J16J0j32J5J19n1q9L3J49j70J7R5n2q0P6Q9j45M1O6Jj01O0Q1j04
1978a5NJ01j33lQ7M4j83M8J19o2q9J35Or1l5J62j10o1J11kp8rJ28o2q7M2J08j72
2006i6OJ18m4q5R3O0o3m1Q8l5j06J81M0j59j4J82j65k8J10J1n5k4N1l6o8J06L2
2033E9j46K8J33j20j2R0N0r2%J11r4n2J30N3k09O9J21j51mL0M6l1p8J14n5k4Q8
2060E4K8j93O1O5k2l2Q1j7k4K4N5j13m3J41p1m0j2Q4q4RQ8k2j21J05P7n2r1J39
$$ plain form
2088 74 50 -56 42 109 -39 -85 7 13 -27 -53 15 -6 -53 6 81 -20 -20 33 -15 32 -2 33 8 17 57 -38 -33 87 63 -15
2118 -15 -4 25 -28 -48 -61 65 -29 -51 95 -38 -66 24 88 -30 18 27 32 -19 63 19 -34 37 17 -38 -54 59 9 -58 -36
2147 -36 97 -33 -9 24 15 -37 9 81 -17 7 54 6 1 14 98 4 -48 72 61 -106 34 88 -72 -47 -15 35 -61 20
2175 20 59 -15 -72 35 33 -64 31 41 -20 -69 69 84 -65 -25 28 -16 -53 40 4 -46 -14 -18 -48 -9 52 51 -30 70 6 6
2205 6 -62 63 27 -50 -23 49 -76 -53 -12 -16 -13 -50 73 -11 12 76 27 -79 -17 56 30 -20 69 17 -66 -26 65 32 -39 16
2235 16 23 -32 62 -1 -5 45 49 52 66 7 28 -62 -47 26 -9 -91 24 -9 -62 -2 40 -11 -40 -11 24 -21 -37 -25 5 21 0 66
2267 66 26 -9 66 30 5 -7 49 -47 22 46 -4 56 26 -5 6 -12 -5 28 15 -8 72 -27 -22 104 27 -1 -19 40 -21 -18 -14 15
2299 15 10 -28 43 -44 -29 -20 1 7 -26 -46 60 14 -12 2 1 2 17 -11 -28 69 -1 -73 -5 17 -7 -14 15 -5 -4 1 0 0 -6 -29 -40
$$ packed form
2088G4k4j06R8O7j48m6R2Om0k6O8k1m7N9P5j01%N3m8M7l4L5k5RM0r5NJ20k4p8
2118a5J1K9n3k0j3J26r4k2J46j33k8R0O4j18M8RNn1Q2m4n3P1k0n5j6J13n0o7K2
2147c6J33j30K4L3rn2M6P2r8K4M7m8nJ3Q4r4n2J20j1j67J40N4j60K5L2N0r6Q1
2175B0L9p4n7J07kr7R5J0o1m9J38J5j49M0N3m4l7R3l6n0L2ml0L9O1jq1J00o4%
2205Fo8J25l6p7K7P2j25K3M1mLl7J23q4K3O4m9j06O2P3k6n0Q9n2q3M0R1l3p1N5
2235A6Pn5R4o3mN0MLJ4n9K1r0J5P3l5q2J15l3n3O0M2n1k9K9L5m5j6J2L0J6k1O6
2267F6m0l5P5l6k5j2N6r6O9K4n0O0l0l1J1j8PL3j3k3Q0r9NJ26p7k8j8N9o1LMK9
2299A5nl8P1q7J5RK1Ol3k0J06m6k6J4jJJ5k8j7R7p0p2O8K2k4pK9k0JNj%ok3j1
$$ plain form
2334 -40 -8 -14 38 45 -16 -4 17 -5 24 39 -53 -25 31 -14 20 6 -38 -24 -61 3 -2 -22 2 34 2 -23 4 7 -46 -47 11 1 -23
2367 -23 -46 34 -39 25 0 -21 5 -29 3 -10 -59 19 -43 10 30 -24 -38 50 12 1 -4 32 45 4 -35 41 -14 10 5 22 -12
2398 -12 1 -33 -7 50 -12 -18 5 22 30 -36 41 -31 -12 -43 -22 -25 -9 20 -15 32 20 -3 38 30 -12 -22 12 5 -22 -14 -52 -30 2
2431 2 50 -54 -50 -50 8 27 38 9 23 -51 13 34 6 9 50 27 -35 1 -34 -11 17 -4 -30 -11 -14 -26 1 22 3 38 30 -41 -14
2464 -14 -2 -63 -7 -6 -34 13 15 -22 -26 16 39 19 10 23 16 25 47 33 41 -19 11 4 12 36 7 15 -10 -87 -17 -7 8 10 6 11 13 20 -9 12
2502 12 -36 5 -51 -10 2 5 -34 -43 17 -24 -28 24 -9 -45 36 -1 55 -35 43 6 65 16 89 8 -22 31 31 22 45 -26 -41 -19 -29
2535 -29 -30 -37 -20 25 -45 10 -1 21 32 0 -7 -28 45 8 43 -32 -16 -10 -4 -26 15 -57 0 -4 -10 -8 5 -44 94 -1 24 2 44 1
2569 1 18 -2 49 2 -8 6 -31 -31 -32 11 -53 22 -2 53 7 -12 15 -37 52 27 -36 -19 -44 -14 20 25 -62 -11 9 -104 19
$$ packed form
2334d0L2oN2Po1J2K1k2K9J5r2K8N6m5L4j4m4J4l7O4nk0K4L2l2k5K7Ln3jN8j0k4
2367b3k3Q0p3O4k5k1K6l4L2j3m9P8o2N3K0n4j4Q8l8j1nL6J3m1l9P6n5K4nJ7l4
2398a2J3l4K6N7o2oK3J7Qo6P7p2J9l1K1lJ6K9l5M7j2k3M1qm2j0L4pk7Ql8K2L2
2431BM8j04M%N8J9J1k9J4p4O4K1k8LM1k3o2L6l5K3K8k1k6J9lj2K7K1j9L5qp1K7
2464a4J2o1N6Jk8M7Kl7mM2K3k0rJ3pRK2j4Qo0L0pQK4k9Qk5p7P0J0J5KmNKPk9K1
2502A2m8M1n6M1J2Ll9rO0m1mN2l3l6Q1l7N6r0P8l7N9m9P3q1l0N3%rK3p1j5K2j0
2535b9jpJ7M5p0N5j1K2J1l2pk1P3l7L5p5J6OOk2M1p2N7moKJ3m9J38r5K5k2M2m3
2569AJ7k0N1m7j0J4l7%jM3o4P5k4N5m6j9K7n2Q9k5o3J7k5L0L4Nq7N1K0j13J23
$$ plain form
2600 19 5 13 -60 -95 -31 -8 10 -33 -28 27 -1 1 -14 30 -10 5 12 19 -46 -62 -56 24 -48 -16 47 -67 -39 -6 -38 -40 27 -28 -60
2633 -60 2 19 -51 44 -38 17 11 62 -45 -42 -11 51 26 -65 -28 25 -2 -33 9 -9 17 3 -17 22 21 16 -48 -40 1 -10 20 37
2665 37 40 7 -10 -11 55 20 -40 6 67 -2 21 17 -41 -74 32 65 -75 17 -4 -5 17 33 21 -53 -4 11 14 -27 6 22 -5 23
2697 23 -7 60 37 18 15 -23 18 28 -47 7 -4 4 33 -30 14 25 -12 -47 1 -36 -36 6 3 3 -6 -16 -20 -26 -2 15 69 63 -44 -65
2731 -65 -35 40 -15 -66 9 26 16 -1 -2 -31 -84 -23 38 4 -9 -16 32 -11 3 61 -13 35 -41 -24 -24 53 -63 -21 25 -12 -65
2762 -65 -23 23 22 -13 24 -62 -10 4 8 13 -22 16 14 38 6 20 -25 16 2 -54 35 -39 -16 6 3 -38 -28 14 -16 -12 14 37 -47
2795 -47 63 72 16 26 -13 31 -11 -5 -36 -25 -6 8 -11 -25 21 -11 9 23 -22 -29 21 -19 -28 16 16 -22 -32 -38 -40 -16 8 20 -12
2828 -12 -35 6 -16 1 -22 -27 -24 -44 18 19 63 26 -2 46 1 -16 -33 -19 -36 -30 22 -7 11 -25 -33 -13 -5 49 30 18 13 -25 53 37
$$ packed form
2600A9j4Qp3l5O4K3J8m3NN5k8Kj5M4m0J5PPo5j6OQ0p2L2O3j14K8L3l2kO7n5l2
2633f0O2J7p0R5q2N5oN1j07LL1O2k5r1L7N3k7l1M2j8K6j4k0L9jno4QM1j1L0J7
2665C7Ll3j7jO6l5o0M6O1o9K3mn8l3J06L3j40R2k1jK2J6j2p4M9J5Lm1L3J6k7K8
2697B3l0O7k3j9ll8M1J0p5N4j1QK9o3M4J1l7l5M8l7%M2l%rj0moK4J7N4oj07k1
2731f5L0P5n5n1P5J7j0j7jk9n3O1O1l4j3pM8m3J4N8p4M8p6J7%P7j16M2M6l7n3
2762f5M2M6jl5L7q6N2J4MNl5L8kK4l2J4m5M1j4n6Q9p4K3K2lm1J0M2l0MK6K3q4
2795d7J10Rn6J0l9M4m2Ol1J1J9J4j9j4M6l2K0J4m5pN0m0rM4%l8j0okK4K4J2l2
2828a2k3M1k2J7k3nLk0O2JM4l7k8M8m5j7j7J4j7ON2k9J8l6qK0QN4j9j2nl8P8j6
$$ plain form
2862 37 -19 -37 -4 2 -23 23 -5 -36 20 -58 52 42 -5 -76 70 -36 -33 0 71 -28 -9 26 -24 8 7 -7 -18 42 16 5
2892 5 -2 5 50 -4 -59 67 -11 5 -2 18 13 50 12 13 -24 23 2 29 43 5 29 -15 -1 -47 -16 5 -5 -76 -44 40 18 -29 30
2925 30 -30 29 -54 -3 19 21 -21 -38 18 7 12 16 28 -14 30 -8 18 34 19 -49 -15 10 20 12 -6 -27 21 -10 -7 -3 -2 19 -4 -28
2959 -28 -23 -19 -48 -31 39 -40 -5 31 47 6 -18 -59 39 35 14 48 44 31 1 -37 -31 33 -31 4 -25 -15 -7 -17 -80 25 -5 -18 10
2992 10 51 40 -44 -3 -8 10 -7 24 -13 2 -33 25 -10 -8 -16 24 -2 13 -60 -6 -23 -37 -20 -28 -18 -41 49 -35 -17 -52 39 32 2
3025 2 16 3 -48 29 -30 17 -18 -1 36 46 25 -1 16 67 -31 9 27 29 -1 -21 -19 -17 -2 -26 17 -15 30 -24 33 -39 24 -1
3057 -1 -41 38 39 -5 18 1 -8 3 -37 28 20 -37 -7 -50 -85 -86 -9 48 5 -26 -24 -50 52 75 44 -30 -76 84 6 7 31 -36 -4
3090 -4 -56 1 28 -20 -13 -20 5 -8 4 -34 -19 -76 -45 10 -33 -12 -1 3 13 -41 -21 5 -25 2 7 9 -13 -43 37 -15 7 9 8 -5
$$ packed form
2862C7n6j8L3Ok5M6k8l1N6p8J10j0m7p1J46j06LL3P1r9J9L5n0L2jj4j1O0k6j1
2892EpPM5n4n5J26p8J6pK0nL7l8Jl7M7k1K7J4l8K4m4J4m6L1K1j0p1L2Q4k2m7N9
2925C0o0N9q3N1K2Km2j7N6j1NMJ2m2M4l8K6J6j5o8L4K5J0qj8k1M8l1LMJK1k3k4
2959b8NMk9J7P0p9L5L6J6m1k4m1R8mk1L4mj3l0l8OO4o4L5k9J0Qj0o3J05l0j3K8
2992A0M1j1q4M1nJ8j7L1l7J5l5N8l5KqM0k6J5p3N4j7j4J7qJ0k3R0q4J8l5R1pl0
3025BJ4j3n1P7n9M7l5J7L7J0k1k6J7N1r8M0J8Kl0k0KKJ5k4M3l2M5n4N7p2O3k5
3057am0P9Jm4K3j7rJ1m0O5qn7L0m3l5jP7N7m3l1Kk6J02K3l1p4m6J60p8JK4o7L2
3090dn2N7K7m8PpK5j3J2l8J5n7L1N5m3K1J1MJ0n4K0K6l0K7NKk2l0Q0n2K2Kjj3
$$ plain form
3124 -5 -4 -44 46 57 -10 -18 -37 10 3 -36 -31 -55 -41 86 11 22 16 12 30 7 -23 -19 -30 8 27 -83 -25 -9 -64 5 20 26 29 -19
3158 -19 10 -26 -41 69 15 -34 -21 -25 -3 41 -70 17 25 -9 1 3 52 19 -13 2 6 -14 -30 -52 -57 25 32 3 -2 27 34 24 16 31
3192 31 36 56 36 -5 3 30 -49 -2 -53 -25 25 -21 -9 -27 -34 56 -33 -6 41 -41 -18 -15 -7 9 37 -3 -11 30 20 5 -20 -34 -22
3225 -22 -7 -43 92 -2 18 14 8 36 10 24 2 -16 14 -3 -20 41 5 -5 1 -13 14 38 -3 23 -5 -58 -17 -53 8 0 -48 -71
3257 -71 -23 -2 25 3 -14 -29 43 -45 27 0 -52 -31 32 22 4 -54 -16 -35 -2 -20 11 -15 19 59 -30 -16 -9 -3 10 12 -37 47
3289 47 -2 -31 32 -4 -3 -30 -1 -32 -72 17 -10 46 12 39 -6 -21 51 82 45 -36 0 -18 -2 -55 -41 29 12 -2 37 44 13
3320 13 -17 17 8 21 -30 17 19 -2 -16 -19 -1 16 23 43 -21 -56 -41 26 23 16 -33 12 4 12 -47 17 67 -17 7 -2 -18 20 76 -36
3354 -36 -14 -14 55 1 7 -48 -28 -54 22 -97 24 -7 30 -6 -19 16 -37 9 16 -20 -42 24 -4 12 10 20 29 -34 28 18 -40 -10
$$ packed form
3124eJm0R0J1o7qj9M7pl9Nk4J4J27p5J1omJ8k3l0Mj1L8J9j10N8J6n5O9J5OLm8
3158a9K9l6j5J10n4m9J3mK2M4j11Q7Ql4J0KM9l3l2J5Mk0j6k2nQ2Pk9nK9Pj0qJ5
3192C1NK0k0m1QK7p9M7n1K8N0m6J2j8pR0q9K7M7q2K3LQJ6K8m0qM1j0j5k5j4J2
3225b2J5l6J35r4K0moK8k6J4k2j8L0j7j7O1l6j0Oj4K7K4m1K6k8n3M1l6O1qm8k3
3257g1M8K1K7k2j7j5P2q8P2k7n2K1O3j0j8n8L8j9L3j8L1k6L4M0q9J4POJ3Km9Q4
3289D7m9k9O3l6Jk7K9l1m0Q9k7N6l4K7m5j5P2L1l7q1L6j8J6n3J4P0j7j4L9Pl1
3320A3l0L4rJ3n1M7Kk1j4lJ8J7PK0o4l5J5O7lpm9M5qQn9O4N0q4K4rj6L8N6j12
3354c6K2%O9n4On5K0k6P6j19J21l1L7l6j3L5n3M6Pl6k2O6k8J6kJ0Ro3O2j0n8L0
$$ plain form
3386 -10 6 -11 5 -12 -58 17 46 -13 49 10 33 -6 23 39 34 0 -18 -34 -7 37 5 7 -54 -20 -24 -23 30 -13 -21 -7 32 -7 3
3419 3 -42 -22 -42 19 -55 11 1 -18 -44 -16 12 -69 70 -25 74 -6 11 -39 -67 -22 -59 -51 61 -47 -58 -12 55 46 17 -45
3449 -45 14 -26 -45 31 -57 -18 27 -23 -70 16 -8 -16 -19 44 47 33 -17 1 -26 11 -43 -18 8 27 67 1 -35 -20 22 21 -43 -53
3481 -53 3 6 23 -12 27 -4 -24 26 14 -63 33 16 -14 28 16 18 -16 48 -28 0 8 -16 -5 29 -8 -26 38 18 41 13 1 -5
3513 -5 11 -6 -18 -83 20 19 -9 16 61 -11 -1 -9 -11 -6 8 20 32 -7 -18 -51 44 2 -46 -15 -20 1 1 60 -38 17 15 15 0 24
3547 24 9 -13 -16 -32 -27 -19 -27 -53 14 -4 45 18 60 -44 32 4 48 13 -16 -9 -9 -25 12 34 -3 34 5 -12 -32 1 -30 -4 -32
3580 -32 -10 12 27 35 -34 56 -26 17 -27 21 -70 18 37 -37 28 66 -6 -24 -5 2 47 4 -32 29 -30 -19 27 -11 -35 29 -25
3611 -25 -37 -29 11 29 -5 -75 -39 -21 27 -21 28 62 65 -22 3 22 -20 5 -9 -16 51 59 34 27 -10 11 16 3 17 -27 -73 -37 -6
$$ packed form
3386a0J6j7J6j7m6P5K9n9O2l9K3l9K9J6nl4j8j6K7M4l2Ko1L4mJN3m3qJ4L9l9J0
3419Cm5K0k0O1p4O6j0j9k6K8K8q1J39r5R9q0J7n0k8M5l7QJ12j08j1M6O7rk9o2
3449d5N9m0j9P6q8L9M5n0m7Q6k4qlO3Lj4n0J8k7L7n4K5K6J9M0o6l6J5M2jo4j0
3481e3N6LJ7l5L9l1k0N0j2p7R6j7l0M2j2Kl4O4p6K8Qk4J1L4l7j8O4k0K3k8j2o
3513eJ6j7j2o5J03jk8K5M5p2J0qkNJ4J2J2l9j1l3R5m2m8L1nK1%N9r8N5k%j5K4
3547B4j5k2lj6NQqk6O7j8M9k7M2j04P6k8M4l5k9P%j6L7K2l7L7k9j7k0L3l1K6k8
3580c2K2K2J5Qo9R0q2M3m4M8r1Q8J9p4O5L8p2j8J9PM5m3l6O1n9J1M6l8k4O4n4
3611b5j2QM0J8l4p0L6J8M8m8M9L4Lq7K5J9m2K5j4pO7Qk5pl7K1Nj3J4m4m6L6L1
$$ plain form
3644 -6 20 -44 -58 14 -5 17 49 45 25 35 -12 -6 -106 -23 24 2 -7 -6 0 5 -36 67 -20 -14 -11 -49 -35 -31 42 10 1 4 43 44 -17 3
3680 3 40 41 20 -71 -36 6 41 15 6 -42 40 -12 -25 -3 39 3 42 12 15 -1 -30 24 14 62 -26 -1 21 47 -67 14 -48 54
3712 54 -19 18 11 -43 32 -32 28 -2 -28 -30 0 36 -10 6 -21 10 -48 -36 -3 -5 39 23 -33 -8 4 -35 21 8 2 23 28 23 18 31
3746 31 -26 16 -13 -27 51 -6 -33 -28 -30 -91 87 -28 -6 -27 24 -5 5 24 -4 3 -9 -54 -47 -35 -13 11 6 19 -29 5 -28 -5
3778 -5 6 -38 -62 17 -37 -68 44 -34 -20 9 24 -29 13 8 3 -5 22 -34 9 2 -25 -13 9 35 29 -23 -18 73 46 20 -29 12 26
3811 26 -11 29 -2 -3 -36 -4 42 -30 -24 -46 13 10 3 25 59 -46 16 28 14 24 50 -21 -36 -42 1 70 1 3 -3 11 -48 -29 30
3844 30 -15 -26 -89 -19 -14 14 -42 29 38 6 -19 -53 -44 -46 -4 46 -1 21 33 47 14 11 -56 -38 5 27 -29 17 27 5 23 -12 20
3877 20 -62 6 -10 -12 -11 -35 -13 -29 42 -23 19 -23 35 -12 73 -7 42 -37 10 72 -28 -4 -11 4 16 9 -29 28 -11 -3 44 -46
$$ packed form
3644fK6o4j4P2j9K2L2mk0J0m7Oj00Q3M7k2rJONm1J03q7OLl8J4MP3l2rLL9Jo1K0
3680CL7Jk1r1L5M2L5k6rm8Q2n2j3K2M2l6L9l0Lj6k9N4j0M8q8K5K2K6j14Q1o2J02
3712E4p3L7pn4P5o4O0l0k6kL0L6m6J6k7L1n8J2L3kM4j6n6K5J2l9N6j3oK1NnnJ3
3746C1n7M2k9j4P8n7k7Nko1J78j15K2k1N1k9J0J9k8Pj2m5PJ2K2K4nJ3m8L4l3K3
3778eJ1m4k4P9n4l1J12p8J4K9J5n3M2nnqK7n6M3pk7J2K2K6on2NR1k7k6m9M1J4
3811B6l7M0l1jl3L2M6p2Ok2N9lpK2L4j05O2J2j4J0K6p1j5oM3O9o9KoJ4n9J9N9
3844C0m5j1o3P0NK8n6P1Rl2k5l4RkM2N0m7K2J2J4l3lo7J8M3K2n6M6J0k2J8l5L2
3877B0q2O8j6kJk4K2j6P1o5M2m2N8m7Q5q0M9p9M7O2j00K4pJ5J2pl8N7l9QM7r0
$$ plain form
3909 -46 -32 12 36 -50 -4 -3 4 -2 -27 9 1 6 -35 34 -38 57 -14 18 31 -29 -8 18 2 -23 8 -19 19 0 -9 41 10 53 -42
3942 -42 10 -38 20 0 34 -14 -29 -24 -44 -11 17 -32 16 -80 32 -18 -63 49 8 13 -24 -14 -9 7 -29 -5 11 -93 -60 -36
3972 -36 57 -5 25 30 15 30 17 -20 -20 48 -44 26 51 54 -7 43 -19 -20 -47 -15 -2 50 17 -61 -8 -39 -24 -29 41 70 -3 30 9
4005 9 20 -22 -34 22 -1 -57 31 -1 17 32 -48 -7 11 -16 23 11 -22 -32 -7 -25 30 -45 31 3 13 -15 7 23 9 -12 -81
4036 -81 -11 14 -24 -36 -28 -33 83 44 -8 -33 13 -20 58 -30 -2 20 1 32 8 29 13 27 20 -9 52 -1 -11 52 -22 -47 -41 -45
4068 -45 2 15 30 21 -38 -7 -13 19 9 -49 36 -4 5 -32 26 0 -23 -5 -12 -7 -35 33 -17 7 -18 -39 -6 10 -23 -35 -13 27 18
4101 18 9 12 -18 -17 -10 -6 -6 26 45 -19 46 -6 -11 28 32 17 -10 14 45 -48 -11 53 8 -13 -48 80 -1 -42 32 -6 3 -18 36 27 10
4136 10 -30 -6 -32 -14 3 -21 -48 14 -14 -34 -3 -2 -3 -18 27 -5 -11 22 -5 -16 -41 -63 -41 7 -16 -18 16 -10 24 22 10 11 -63
$$ packed form
3909d6J4M4K4q6M6JPok5L6qNm1O9p2R5p1L2J3o0K1K6j6k5L1k7L8j9rN0l1M3r5
3942d2N2m8N8k0L4m8j5Nk0L3K8m9M8r6J12n0m5J12m1Nl7J0NJ6l6K4J6j04L3K4
3972c6R3o2L0Nj5J5j3l7%O8r2P0K5Lo1N0o2jk7L2J3N2l3p8N3l1J5nP0K9p3L3k1
4005IJ1m2j2N6k3n6Q8l2J8J5q0M1J8k7L9j2l3j0K5j8N5p5P6k8J0k8K2J6j4k1o9
4036h1P0K5l8j2QnJ16l9n2k5M6l3P8q8K8K2j9L1k4K1j6J4pk9O1n3j0O3p4k5Om
4068d5M7J3J5rn9L1oL2j0n8Q5m0Rl7N8k6k3J8pNk8O8n0K4k5k1L3J6l3j2K2M0r
4101A8rLl0JPM%L2J9o4O5n2nL9Mj5k7K4L1r3L7O4m5k1l5J28q1m1P4l8Rk1N4rj7
4136A0m0K4k6J8J7k4k7O2k8k0L1Jjj5M5l2oL3k7j1k5k2K2M8k3kL4k6L4kj2Jp4
$$ plain form
4169 -63 22 3 -32 -41 -11 5 -3 39 46 -3 7 -25 -28 -39 -14 17 50 -13 -24 1 45 0 -18 12 -1 -25 -29 34 0 4 -22 8 28
4202 28 -5 39 -47 5 25 -54 -39 -65 -15 43 -42 24 -3 -11 1 41 -39 42 -8 -37 -47 57 8 -30 77 -14 58 33 -18 4
4232 4 17 70 -1 76 25 14 -21 -52 3 40 33 49 43 15 26 -45 -2 -4 40 -20 61 3 10 5 42 12 -59 20 6 22 -2 -32 9
4265 9 -31 -10 -11 -7 3 -21 12 -2 3 -27 36 16 21 -26 -35 32 6 41 2 1 21 -40 20 -38 -77 -72 28 28 24 8 -6 -28 -9 21 33
4300 33 -37 24 29 -16 -8 -17 54 -3 -30 3 11 -102 -37 -36 -30 -34 37 4 -57 9 19 48 71 -26 17 29 -44 -24 -6 -81 -17 -2 58
4333 58 19 12 4 3 27 -3 -7 21 -14 -27 -1 -38 11 -9 -18 -45 -3 23 16 22 9 2 16 15 -10 33 1 25 -3 -7 19 -50 -7 35 42 12
4369 12 -52 21 22 4 42 32 18 1 21 33 50 10 -27 12 10 -20 33 29 -52 17 -15 -36 25 -2 -47 29 -16 0 -26 -62 18 19
4401 19 7 -5 32 -1 31 -24 -74 16 33 17 -38 -22 18 -7 -19 44 -1 10 19 -15 59 -4 -9 -23 24 8 16 -6 -35 -6 5 17
$$ packed form
4169f3Q5j9l5rL0J6qM2Pm9J0l2lj1K5L1L3o3j1K5M4m5j8L0j3k4mO3l4Mk6L0K0
4202B8l3M4q6N2K0p9J5k6N0N8q5O6k7qJ2M0q0Q1n0k9j0J04m9l8J07r1P2k5n1K2
4232DJ3N3p1P7n1j1l5l1N5L7pJ6ok8J1p1M3kM4o0Q1n8PnL7l0p1P9j4J6k4l0M1
4265Im0K1jMJ0k4L3j4Nl0O3k0Nm7rO7k6L5l9jK0o1O0n8l9NJ00%mj6j4k2J9L0J2
4300C3p0O1Nm5QrP1n7k7L3Qj13O5JOmP1l3o1O6J0K9K3r7M3J2p3K0J8p5O4J5O0
4333E8l9pqjK4l0mK8l5j3K6l7M9k0rk7M2K6pOj3pJ4jk5M3l2K4k8mK6o9M3M2Pl0
4369A2o4P3Jj8L8j0j4j7K0J2J7m0l7L9kl0N3mq1O9l2k1O1k7m5P6m5J6k6l6Q0J
4401A9j2j2L7l3L2n5n0R0J7j6n5J6M0k5j2O3m5J1Rl4P4o3nj4M7j6Qk2k9K9J1J2
$$ plain form
4433 17 42 20 -9 0 1 43 4 40 -6 -7 41 -22 8 -28 -14 40 -30 -63 -28 0 -2 -21 -33 -10 -53 2 61 -8 -15 -3 14 21 -21
4466 -21 -41 -67 15 -63 -8 -52 4 1 47 -1 35 -69 12 -5 -68 5 4 71 6 -26 27 -27 35 -52 -56 -10 17 11 17 -7 -33 28
4498 28 -26 28 -12 -5 -4 14 15 4 16 9 -24 24 -5 14 -14 -26 9 -24 -33 3 -56 19 -23 -38 -11 2 -26 55 -2 45 6 -9 -23
4531 -23 -21 -48 -25 16 -1 -11 35 8 42 65 1 36 0 -3 -18 2 46 66 -29 31 -6 -49 -51 -11 -29 -1 58 -20 9 -31 36 0
4563 0 30 36 -4 -14 54 12 67 -7 36 41 -28 48 -3 12 12 -25 23 19 -39 26 2 4 -18 -43 10 8 28 6 -23 -6 -3 -26 -48 -19
4597 -19 -58 -22 -3 -2 -3 -33 -35 -49 -27 36 70 51 -63 -27 27 -43 5 -21 18 -6 31 -44 -44 -37 30 0 -22 -37 26 24 8 31 -68
4630 -68 -3 10 -13 -31 36 51 41 -30 36 -64 -27 15 -54 -29 51 -51 -76 -54 -29 50 -8 -20 -3 36 -36 17 1 -14 19
4659 19 24 11 -14 4 18 -23 11 10 -8 12 9 27 42 14 71 23 -5 -16 8 26 -41 -47 -8 41 -33 -23 -40 -22 -57 -41 3 -32
$$ packed form
4433A7K5k2k9RJM2l9L6m6jM8o3L0l6J4N4p0l3L5K8kj9j2K3m3N5N9o9pJ2J7Pm2
4466b1k0k6Q2p8N5m4N6lM6m8L6j04Q1j7o3P3jO7o5l2N3n4O2q7mM6K7oOk4k6O1
4498B8n4N4m0PJJ8Jj1J2pl3M8k9J9k8j2L5l3rL6n9P5m2j5K7J3k8Q1n7M7l9j5j4
4531b3Kk7K3M1j7j0M6k7L4K3o4L5l6lj5K0M4K0r5O0l7m3kM0j8K8N9p8K9m0O7l6
4563@L0Om0j0O8m2N5p4M3No9P6n1J5%l7M8mn8O5k4Kk2k5N3kK0k2k9J7Lk3k2K9
4597a9l9L6J9Jjl0kj4K2O3L4j9j14L6N4p0M8k6L9k4L7p5%PO7l0k2j5O3kj6K3r9
4630f8O5J3k3j8O7J5j0p1O6j00L7M2o9K5Q0j02k5K2K5P9n8j2J7L9p2N3j6j5L3
4659A9Nj3k5J8J4m1L4jj8K0lJ8J5k8N7m8k8j1K4J8o7oL9M9p4J0j7J8l5J6M4l5
$$ plain form
4691 -32 23 3 -18 -38 -7 -9 0 -12 -16 11 -22 -50 43 -7 36 -9 37 -22 -9 27 -17 -25 -29 -4 8 16 -23 39 -24 -44 7 -41 -43 26
4725 26 -49 -9 48 -10 -10 -34 -72 6 30 -39 13 26 6 -29 -15 -20 2 -47 -14 -21 5 -20 -23 9 42 -33 -8 35 -14 -30 6 10 62
4758 62 -22 17 5 -20 -28 8 -26 -4 -6 14 7 30 -13 8 17 -16 -27 -27 -10 25 24 -28 21 -57 -25 24 -7 -11 6 -27 -29 -14 35 16
4792 16 -9 -103 34 -10 39 -23 -29 38 29 -18 -35 3 -42 44 -47 -2 -2 7 19 -7 -16 16 -50 -35 -20 -48 14 -13 46 -4 -16 3
4824 3 -6 -45 17 25 11 -21 -86 -11 36 -11 -15 -1 -29 -35 -24 -32 0 7 26 -50 -34 18 17 14 42 -3 -30 0 -16 72 -52 11 -7 -41
4858 -41 9 -3 58 29 -23 23 6 21 -4 4 -18 1 11 40 93 -9 -18 -16 -29 -20 -27 13 -3 9 5 -48 -2 36 -26 -43 -19 -28 38
4891 38 9 -20 15 -70 29 -32 33 20 -48 39 -34 35 28 29 1 -6 24 5 -19 -65 -1 -37 -6 -53 -4 5 -3 -22 26 19 12 -54 -10 -3
4925 -3 -23 2 -10 -22 10 -12 -55 -21 -75 -6 43 -13 -27 -16 24 -25 2 17 -5 -53 -40 49 14 34 4 45 15 50 34 -31 -15
$$ packed form
4691c2N5k0k1k0L1kRj2mK7l3k8R3n0M3m5M6n9J3L6m4qmK5J2Ql9O2o3k0N1m8kO9
4725B6p5M0N7n8%k4l8P8K4o9N2J3k0l5J4nK2m9L3pK6k5lL2L3p5K5M3m9j6L6MN2
4758F2q4L9j2k5qL6l4K2kK0pK3m3K1Rl3j1%J7L5jn2M9p8L2M9l1mJ7l3kJ5M9j9
4792A6k5r4J37m4M9o2oO7rm7j7L8m5Q6r1M5%RJ2k6rL2o6J5J5k8O2k7N9n0j2J9
4824Crl9O2Qj4l2o5P5M7m7mJ4k8oJ1qL2PJ9p6J6N2jlK8m5k7L0j6Q8j24O3j8l4
4858d1N0j2O1k9n2M6j7J5k5Qk2J9J0K9N3j02rKj3RpM0j6J2mn3M6L8o2j7K4rO6
4891C8k9k9L5q5R9o1O5j3o8Q7p3O9pJk8pL0j9k4m6O4l6L1m7M9Rqj9M8ppo6M4P
4925ck0K5j2j2L2k2m3L4n4O9M9n6j4J1M0m9K7J5k2m8J3Q9l5K0l0M1l0L5j6o5J6
$$ plain form
4956 -15 -30 8 -81 -23 -34 29 26 4 -50 -32 33 -9 7 -14 35 -27 -4 11 30 12 38 37 -27 28 8 37 -9 -20 -14 21 18 -36
4988 -36 23 6 0 -11 -44 -4 -10 8 25 37 13 -54 32 -6 1 15 34 -15 22 3 -8 -5 -15 -4 16 12 7 3 63 8 -22 -31 9 29
5022 29 -12 -10 -38 -17 -20 72 -64 -33 -42 -23 34 17 -20 -8 58 6 -46 0 -4 16 26 -5 1 65 -20 41 -10 19 4 22 -23 -5
5054 -5 9 26 34 -13 21 -43 -7 -24 31 -28 -3 21 -7 -14 88 -45 18 17 -25 -2 42 38 4 -21 -23 -16 33 19 0 -24 39 71 -8
5087 -8 -9 85 -11 5 -2 -20 -21 -12 -17 -5 -32 26 26 -48 1 39 -7 7 -15 25 -8 -8 -28 -11 -23 -33 -6 3 3 -7 -14 -25 -10 -25 28 21
5123 21 44 -27 -4 2 1 -37 -34 -2 46 16 -31 38 -31 -23 -50 -32 -38 4 -5 11 -34 -30 -30 -14 -57 64 9 -15 5 12 8 -44 1 23 -83
5158 -83 13 22 -8 -7 34 -20 -1 -38 9 -98 20 -8 -24 -1 -24 -12 63 -50 -25 -28 -27 25 -34 12 -28 -37 -52 37 -41 -1 15
5189 15 -1 -12 -29 -8 0 -11 5 39 -3 -9 -9 -4 17 54 -1 -14 21 -16 16 -69 3 -38 5 21 -6 -22 -6 -23 0 -46 16 -39
$$ packed form
4956a5j5L8q9N8j1O3lk2n4J8O5m2J6k1M9o2K3J5J9j8K6jo4N5k0K9m6j1OL5ln4
4988c6N9j7oj1l3M0oJ8J7J2k4o7Q6l8PJ4J9m9L7j9j1Lj0J1K0mnmO0n5l0rM0K0
5022B9m1Kk8K1lR2j36L1rJ9N7j7l7J2O6n2n2M6mK0J0l1OO4q5O1n1K9j5J8m5J8
5054eJ4J7Qm7L4o4L6j7N5n9K5K4k8pJ02j33O3jm2K3M4ml4k5kPM9j4j9k4O3L2p9
5087hjR4r6J6pj8jRnJ2k7N8%p4M9L8m6J4k2M0l3%k0J7j2j0K7R%j0pj1J5j5N3p
5123B1K3p1K3Ojl8LL2M8l0m7O9o9Qk7J8oM2rJ6m5M%J6m3J21n5k4K0Pmn2M5K2j06
5158h3R6Rl0JM1n4J9l7M7j07J18k8j6K3k3J2P5j13K5lJN2n9M6m0rj5Q9p8M0J6
5189A5j6j1j7K1Qj1J6L4m2o%NK1L7n5j3L5l7L2q5P2m1M3J6k7j6J6j7K3m6O2n5
$$ plain form
5221 -39 -24 -63 27 -11 -16 49 35 -35 -37 19 -25 10 80 71 27 -68 -38 -20 44 -33 -19 46 4 3 -8 -9 -29 -41 -4 -37 -5 17 11
5254 11 14 -66 -33 38 -15 4 10 -59 8 -81 -23 -58 -15 1 -24 11 -55 53 -15 7 9 12 23 -40 -33 -20 61 -24 17 -15 -28 -22 22
5287 22 -43 -38 -31 -11 -10 15 22 39 -72 -9 28 -39 -23 -51 -4 -19 38 48 27 38 18 6 -18 -41 -15 16 15 42 -32 1 2 -9 36
5320 36 -13 6 69 18 -22 -3 -10 -30 -37 11 29 20 -46 5 7 -58 -34 -37 -37 -23 -37 -20 -7 0 12 36 7 2 23 3 -41 -42 -49 -47 13 11
5356 11 13 -18 11 -9 12 5 -18 -79 -13 28 30 2 -3 30 -28 21 24 8 -9 -33 -10 1 -9 -37 -10 8 30 23 48 6 1 -18 -29 -54
5390 -54 -20 20 -2 5 -42 11 58 32 -31 -16 5 -15 16 -29 -45 -35 23 -2 18 -15 44 31 -29 -14 30 16 -19 47 6 35 23
5421 23 -37 12 -30 34 0 -3 7 -7 20 -25 3 -38 44 -17 -1 35 2 -13 -52 9 -13 -2 -22 16 -7 20 -34 -8 41 -27 -46
5452 -46 -26 2 59 47 -31 -5 19 -5 17 21 30 -20 0 -22 35 8 18 -37 -3 -17 -39 27 -52 42 15 64 -28 -30 -3 -34 -55 -14
$$ packed form
5221c9J5l9R0l8nO5j4p0kN6m4L5P0rm4r5L0J8O4p7J4O5m2jj1jk0j2L7l3L2K2o
5254A1Lq0L3P1n3J9Oo9O7q9N8l5M3J6k5L5o6J08o8K2KLJ1o3PJ3Q1q5M1l2j3OM4
5287B2o5NPK0JK5PJ7j11O3L7o7J6k8M7j5N7J0k1J1k0j2k4k3K6L1jK7p4L3Jj1M5
5320C6m9J9O3n1m0J9pk0pM8J8ro6N1Ko5K4l%J4j4J7J3PJ2K4k9nK1k0m4jpKO0k
5356A1Kl1K9k0K1pk3o1O6M1Kk8nL3n8M9Lj6j7k4K3J1j0k8K7J8K2pK5m2nj9j1k5
5390e4L4M0k2Pm7N3M7k6o3J5K1k0L1m5j6J0N8k5K0l3N9j3o0J5M4j4l5O6m1K9j2
5421B3o0M9m2O4l4lJ0j4K7m5K8m1Q2o1J6L6l3j5l9O1k2J1k0L8k3K7n4K6M9o8j9
5452d6K0K8N7j2p8K6K4k4K2MRn0K0k2N7k7J0n5L4j4k2O6p9R4k7M9r2kK7l1k1M1
$$ plain form
5484 -14 -31 9 -15 -39 -7 -69 17 10 -54 2 -15 -6 15 0 24 -10 -60 -80 -22 36 -27 43 18 20 66 10 6 56 7 11 84 -45
5516 -45 -49 -6 -63 -34 -8 -13 -37 8 -45 -27 23 -21 16 -13 -37 -4 9 -11 -27 -44 30 -18 29 13 16 61 -28 -15 -3 -1 2 -33 10
5549 10 -24 13 14 -14 -57 -73 -28 19 9 45 -24 8 45 13 -6 -25 2 28 -68 45 -30 -17 -43 -41 27 -37 -22 21 -5 -5 -61
5580 -61 21 -49 -49 -27 -63 3 -13 -22 -65 53 13 2 31 20 46 -19 3 45 38 24 -32 -11 19 -35 -44 35 -14 20 -36 -24 -43 1
5612 1 10 26 -17 -26 10 -37 32 5 -68 12 -13 44 31 -16 2 21 -39 -54 14 14 5 -14 2 -7 -9 -4 -44 24 24 22 14 -66 -8 30 -9 35
5648 35 34 -30 -15 1 7 -14 -2 -64 -66 -12 8 -74 60 -36 -43 1 47 -42 -83 -34 40 3 24 43 -17 -28 11 38 -33 13 -40 -37
5680 -37 63 -9 -1 24 41 13 -7 -27 -34 41 38 -10 -55 -69 -25 -23 1 3 -29 25 30 -41 43 21 -47 -23 -36 21 -50 2 -4 45 29
5713 29 -28 -4 -28 33 -17 -16 -3 11 48 -11 -36 -12 -26 22 20 -62 1 -50 -24 24 -30 -68 -28 6 -1 -3 -19 -73 -24 67 -26 70
$$ packed form
5484a4j7M0k4k4L2o2Q6po4N6j7RK1j5K4l4n0k0N8N8o3P0k5KM6n6mN0m9MP3j29
5516d5mM3n7K9K6nk4M5n3J8N0m4L7k9k4L3J3k0j6j7P4m8M7j6LM5q9J3J2KLl5M3
5549A0l4L7Jk8m3j6M5M7j0L6o9L2L7l2j9j9K7K6r6J13p5J3k6KO8o4J5M3k6%n6
5580f1Q2p0%K2l6O6j6rm3J18m0j1K9j1K6o5K2M2pj4n6K1L0n4rP9m9L4n6J2j9M4
5612ARJ6m3rL6m7O9k7p3Q0k5N7j3m7J8J9o0j5O8%rj9J6rkNm0O8%kqq0N8L8l9M4
5648C5jo4J5J6Ok1J2o2kN4K0q2J34r6pM4M6q9m1M9P4l7K1J9o0j1L9K7p1M6n3L
5680c7J00p2QK5J7k8k0k0pP5lm8m5j4M4KK4Kl2N4Np1Q4k2o8K4j3N7p1N2oM9j6
5713B9n7K4k4O1n0JJ3J4L7n9k5K4j4M8kq2O3n1K6M8n4l8M0L4pkj6n4M9R1r3R6
$$ plain form
5745 70 -70 -23 1 -23 -4 53 -8 -7 -13 -57 -43 35 -10 40 -37 -44 28 -27 -11 7 27 14 67 -65 -8 -11 -19 37 -41 -9 -10 -28
5777 -28 -21 -14 -22 -26 -16 -21 14 -47 -18 -6 -35 -29 10 7 16 26 25 -3 -9 -51 -19 -41 63 -3 16 -4 -3 49 16 28 -31 -4 -13 10 38 -52
5813 -52 8 -13 25 29 25 -1 8 38 -13 4 -14 18 57 13 -48 -18 -7 56 -33 -53 -18 -16 -46 -22 25 3 10 -28 -30 14 17 -26 19 -18
5847 -18 -18 9 42 15 24 -33 -2 -16 -57 22 -24 40 -59 15 -24 -5 2 -27 23 -18 -21 8 -53 -17 -21 15 -18 3 -4 29 3 56 -47
5880 -47 -36 -18 17 2 14 -29 -16 31 -36 -6 59 38 -67 -35 -72 -43 41 33 36 -29 -27 0 -27 37 -44 46 -3 -3 20 -44 -7 -42
5912 -42 -39 76 -23 -33 23 23 60 22 -12 1 -4 51 -16 9 10 14 48 -26 25 -7 28 -31 -16 7 74 29 -67 11 0 -59 24 18 -34
5945 -34 24 -6 13 -13 15 36 38 2 21 38 -53 -35 -3 -12 2 34 -9 39 28 5 -1 62 -21 -24 -25 -38 3 -5 7 27 -51 -44 -45 -5
5979 -5 -61 3 -46 79 -26 -20 1 28 -28 21 5 -38 37 -19 -3 27 -4 -23 -18 30 -5 30 21 -19 -63 15 -6 13 20 13 45 -14
$$ packed form
5745G0j40M7K4k4J9N7o1Jom4J4P8m5N0p7pP2n5J6J8K0j3N3j32N7lqN6p8L2jj8
5777b8PPqmJ0nL5o1K9J2k9OL9lRJ0jk8om2L2k2J04o6J9k0JN2l3J2n9K7rK3K8r0
5813e2O0k1L8Mmk6RL0n1J7j8L2L9m4o1L0J1O3q9k0L5Kl0K4M7k2Pl8kM4Lm3M5l7
5847a8%K7L3k7Rn7L1j4m1P9m6O4r9P4l9J9Pk9N0m1lK9o1L6mL6l3K1pL3k6N3j03
5880d7J1J8L5j5J2m3J3M7o7L0O5k1j05L2l7K9Q4qLo5KK7k7O4q1R0m9%K3o4L7l5
5912d2LJ15r9j0N6%L7l8l4J3nN5o7K5JML4p4N1l2L5n9J5K3O7m5r6P8j1n9Q3on2
5945c4N8l0J9k6K8K1Kl6J9J7r1J8L2rJ4L2m3M8j1k3oO3q3ljj3M1qJ2K0p8PjM0
5979en6O4m9J25j05OK1K7n6M9j6m3P5n6J6L0l1j9NM8l5L5rm0m4P8k1J9PpL2n9
$$ plain form
6011 -14 40 13 -15 4 13 -42 13 -27 -43 -20 -95 -51 23 -12 -25 1 24 -35 31 46 -12 -13 35 -52 -74 11 13 30 -23 -26 22 6
6043 6 16 29 17 -10 24 -5 35 -16 8 -7 -43 2 48 18 -27 43 32 19 30 36 7 25 -37 -8 -46 -23 0 -11 -15 4 39 -50
6075 -50 -2 34 39 -35 5 -36 25 -41 -9 -23 -1 -13 -30 7 -1 13 -60 -46 -19 32 -9 -31 29 34 -18 8 20 23 -44 -7 2 -16 31
6108 31 -28 -45 3 -33 -73 -8 -53 -19 -14 42 -36 59 -3 -73 30 -18 2 -75 -18 -26 -46 38 34 -77 -18 12 6 -21 -64 22 -34
6139 -34 -18 -4 31 22 -5 -4 7 -3 -3 40 12 -26 60 -5 -4 16 -39 20 -12 -48 -12 8 48 -16 10 -24 -45 16 5 13 -16 -42 28
6172 28 -9 -5 -44 7 -12 17 -3 -20 -19 20 -21 21 -48 29 37 -81 -6 -1 -4 -16 -85 -31 -74 -45 -14 -40 18 17 -9 -12 18 20 -13 -16
6206 -16 40 -4 -16 2 -15 31 -8 21 -24 11 -35 -11 -40 1 -23 -21 -35 7 -31 -28 -1 -29 -17 -31 62 55 -15 12 16 -69 24 -5
6238 -5 -46 -17 -32 40 34 10 21 41 37 -12 -11 11 1 -11 9 18 -33 -13 -25 0 35 -10 -61 45 37 8 -8 -34 -2 0 1 -54 -45 30
$$ packed form
6011a4N4k7k8J9Rn5N5m0j6K3p5M4P4l5j3K6K3n9O6J5n8jM8q7k2Q5KJ7n3lM8j6
6043FJ0J3j2k7L4k9M0n1K4j5l6M5M6l0m5P0j1j3J1Ok9J8o2K9l8K3K3j1mJ9L5q9
6075e0M8L6Np4M0m1O1o6L2j4K2j2j7L7qJ4p3J4K7N1m1k2O0Nn2K6J2Lo7L7Rj8M7
6108C1n9j7M8l6m0O5m5L4NN6p8R5o2p0J03m8K0p7N7qk0Q4mj11N9L0ok7m3Q6n6
6139c4J6J4L5rk7JJ1j0%M3k8l8Q6o5JK0n5N9l2l6L6K0M0o4K6l4k1O1j1Qk9k6P0
6172B8l7Ml9N1j9K9k0j7JL9m1M2o9P7Qj18P5Nlj2o9N4m3K9L1k6N8jk6lL0Kl3l
6206a6N6m4j2J8j7M6l9K9m5L5m6K4k9M1k4Kj4M2l8LK7k8J2j4R3pp0K7Mq5R3k9
6238em1K9j5P2ok4J1K0mm9JK2j0j2K0Rn1K0j2K5L5m5n1J06qk9j6k6L2KJn5RP5
$$ plain form
6272 30 -43 12 -14 10 -9 20 -9 -15 -13 -44 -15 -29 -62 -23 -49 -38 -52 6 -21 -14 -14 -48 34 35 -30 -12 16 5 82 10 0 -1 -6 -24
6306 -24 40 -2 -22 1 3 34 -11 -60 10 -2 15 -6 15 21 11 -27 26 -23 -34 -22 -14 22 46 21 -16 12 8 -8 29 30 22 21 -31 -19
6340 -19 -39 9 1 -24 10 -37 -8 -3 0 6 -71 -44 -7 23 -6 3 -61 26 -8 1 -28 -36 30 31 36 -1 6 3 -44 8 0 -1 28 -6 2 -17 -49
6377 -49 11 -40 25 -34 31 -14 5 -10 38 -4 -7 11 -34 -3 16 6 -69 -6 -65 -1 -4 -63 -32 -11 13 7 23 13 -31 14 -16 30
6409 30 -43 -35 -41 -27 -28 64 -29 -46 -8 32 55 -32 42 -20 -16 7 33 20 -16 6 -57 23 -54 -36 -3 -26 -6 -2 -32 -23 28 -38 33
6442 33 -14 18 14 -21 -5 -28 -59 7 -38 -36 -26 -26 -33 -43 -34 -24 6 7 -37 -26 6 -38 -30 40 27 18 20 26 -4 -52 -14 -7 21 25 14 -57
6478 -57 -9 40 -7 10 7 5 -18 3 21 25 -6 6 17 -24 36 -61 -60 38 -5 0 22 11 -21 -15 22 -4 -4 -25 19 2 -49 -7 -42 5
6512 5 -28 23 -54 -9 4 -14 3 -45 -68 -4 3 11 12 11 -29 16 -18 2 -44 -18 -9 2 8 -4 -25 -88 7 4 3 42 -11 -27 -9 -59 -19
$$ packed form
6272C0p3N5k6K4j9K9k9oKl1K9j4l3L9k6J1j4N8k7P%l4Q2Jo5J8K8j1P7p2j0jnj8
6306b4O4m2k0K3KL1m5m9P0j2J7k1K1Oj0l8N3m9j1J2QL6K4k5l7K8mj6L7Jqjn2J2
6340a9k0M8qk5L4m7K9NLOp7K7L7L0k9Ro4Q7l4Rk9qO6JNl7Plm7N2qjK9l4Qj9l2
6377d9O0n1O5n9O5m5J9j5M8m2lJ8m5L1J9j0p5O3n9O4ln9L1K1K4oJ6j0m4M5l0M6
6409C0p3QoJ4jR2r3j7L8M0K3q7P4o2MK3K6j3l6K2o3Q0p7J8L3k3K0Ml0RN1o6P1
6442C3m7L2ml5J6k3l1O6m5KJ0%pj0RJ0L0Jm4J1L2m4QP0j3rKOl0m8L8PK8Mj1p1
6478e7M8M9m7J7lkk3K1J8Ml1J2J1m1O0r7JR8m3NK2j1l2OL7k6%k1M4j7n1M2l5M7
6512El3N1p7M5J3j8J7m8k3O4PQJjm0M5l4K0m6K6RJ1Oj2k1o3R5ljL9n3j6J8n0M0
$$ plain form
6547 -19 -7 -32 20 -24 -30 -7 32 -12 21 -80 45 -13 -35 49 -26 -17 -18 -65 -53 22 24 5 23 10 -10 -18 -20 35 -38 -17 -31 6
6579 6 -59 66 43 8 -42 0 -9 14 38 -46 16 -3 29 1 -18 36 -34 -65 28 27 24 9 -2 -96 35 50 -2 0 -32 -19 -9 13
6611 13 50 -27 -8 58 3 0 -36 6 41 -9 -2 -5 31 -2 -26 -33 -22 -40 -16 36 31 16 104 36 40 -29 -32 8 -46 -1 14 36 -2 24
6645 24 24 -50 25 -18 -43 -15 -7 30 -8 2 24 2 -41 43 -10 19 32 -29 4 -70 27 -21 10 17 -9 30 -4 -10 -29 48 21 28 -45
6678 -45 9 28 18 22 -33 28 -49 33 -3 -55 -9 3 17 -29 32 33 -57 -19 38 37 10 18 -50 19 14 7 36 42 -14 -44 -4 -31 -47 28
6712 28 -23 26 3 33 -7 6 -27 -72 2 18 31 25 -24 9 46 33 2 -36 -29 -14 -83 -19 48 -25 -1 12 46 -45 31 -25 -51
6743 -51 33 -5 8 32 -14 -48 -8 20 15 5 -31 -8 45 16 20 -26 -13 -6 8 29 4 0 -1 -9 -25 14 52 24 -19 17 -72 16 6
6776 6 45 28 -45 16 -11 -20 22 -5 9 4 11 -12 -6 -13 -6 -9 -26 -13 -61 -28 -27 30 10 -25 13 -21 39 2 -3 0 3 34 30 -34 -28 9 10 3
$$ packed form
6547a9J2k5N2m4oK3L9m4L3j01J25n8k2Q4p5Rjm7J2P5Kj9J8j3k0qkN5p3K1j4L7
6579Fo5J25k3l5n0M2rK3K4q4O2j9L2k8j9N4p0l1R3jlj5j1r4J31J5n2Kl2J3J0K2
6611A3L7p7J9O6n5ll6M2L5n0PlL6l3k4pJ1j8K4N2nj5Q8o8Mo9lM0n4M5J5K2l8K6
6645B4%p4P5m3k5K8QL7l8J0K2k2m3Q4n3K9J3o1L3p4R7m8L1Pk6L9l4oj9P7k7Pp3
6678d5N4J9j0Mn5O1p7Q2l6n2M6J2J4m6O1Jr0L8N7jk7Qo8O9npK9On6l0M0k7j6P5
6712B8n1M9k3L0m0J3l3m5P4J6J3om9L3L7j3l1l8PJ5o9O4O7p3K4J3L4r1P6n6k6
6743e1Q4l8J3K4m6l4M0K8nj0l6K3N3k9Mm6J3PJ4K1k5mjqj6L9L8k8m3L6q9Q8j0
6776FL9j7p3O1k7rM2k7J4nPk3OpPlj7J3m8L3JN7k0l5L8l4O0l7nLLL1mo4OL7Jp
$$ plain form
6814 3 1 -67 -5 42 32 -47 19 -12 10 57 13 -12 7 7 49 -7 49 -14 -3 7 -25 13 -18 11 28 39 -21 18 0 -16 3 42
6846 42 37 75 -28 24 -48 15 10 -5 12 16 68 12 5 -79 -20 38 -8 -6 14 -29 -33 -9 -6 8 -58 -12 -14 41 51 9 -10 23 -15 1
6880 1 -14 1 -60 -40 33 17 32 -32 12 -9 12 -4 -57 -11 -9 -7 -20 -32 -6 13 24 12 -30 -31 -30 -29 -10 -52 49 22 37 5 -36
6913 -36 8 -17 -13 -30 -35 0 -5 -10 34 -47 50 36 -18 52 -10 -26 -10 51 -20 43 -49 22 11 33 -22 30 -20 7 -51 24 36 -2
6945 -2 13 -7 18 1 -16 -59 -9 -38 59 -10 24 -2 46 35 -37 24 46 14 1 -28 -60 2 -9 -54 6 -21 40 28 -37 -4 18
6976 18 17 55 -19 -11 3 46 -30 -1 11 -50 -3 -7 20 32 8 -26 9 26 11 10 71 -4 -43 18 -29 -11 63 25 7 -12 19 -43
7008 -43 25 51 -41 22 26 -13 38 16 37 65 41 -2 11 -9 1 12 -2 -25 19 -25 -42 -43 34 -37 -62 -28 -11 -21 -2 20 -17
7039 -17 28 0 36 45 7 57 -9 41 37 58 20 -6 -22 -2 -12 24 61 16 -12 28 -32 58 -1 19 8 6 23 -35 -25 21 19 42
$$ packed form
6814Cko8O2M7j0p9O6l1K2M7m4k5J9%M2n6N6o3J1J0l2L8l1K9J7J1o0L9j8j6J9L9
6846D2nL8j03N2p2O3nj5J7MN2n6pq4N9N8m6KK0m3mK4LJ4o6M6kN5J0m2j9L3l8J6
6880Aj5J5o1K0P3j6J5o4M4k1K1j6n3M6KKj3j2K6J9J1j2m2jJJJ9m2J01k7J5l2m1
6913c6M4k5Mj7nL5nnM4q1R7j4n4P0o2j6J6O1p1O3r2P1j1K2n5N2n0K7n8P5J2l8
6945bJ5k0K5j7j7m3N0k9R7o9L4k6M8j1p2O1K2l2j3k9l2O2j1m5O0k7O1j2o5L3K2
6976A8jL8p4QJ4M3p6K9J2o1M7mK7J2k4l4L5J7j5jO1p5l9O1m7J8P4l8j8j9L1o2
7008d3O8K6r2O3Ml9N1k2K1K8k4m3J3k0J0J1j4k3M4m4j7jP7p1k5L4J7j0J9K2l7
7039a7M5k8L6Rl8N0o6N0mK1l8k6j6K0j0L6L7m5k8M0o0R0n9K0j1kJ7n8J0M6kK3
$$ plain form
7071 42 -24 42 -1 31 6 -27 -10 2 -24 -27 4 -18 -87 -7 12 13 -8 5 37 -35 13 -26 -41 -16 4 32 -15 -21 33 59 -16 41
7103 41 11 21 -65 -2 63 5 -43 -18 -98 -46 -48 -27 -2 -23 -28 37 -2 16 21 -25 7 -11 13 53 9 26 -50 -13 20 0 -10 -7
7135 -7 -5 -9 -26 16 -37 38 31 -29 -33 -12 -5 20 45 -39 25 48 -8 -13 14 18 20 -21 38 -36 -34 20 65 -13 -10 -41 -2 -14 -38 -26 -33 -5
7171 -5 21 -16 -10 15 6 41 18 -1 -40 -14 17 -10 32 -29 -20 10 21 10 -26 32 7 -11 7 -52 22 5 -3 5 8 -61 -14 -9 3 -23
7205 -23 -68 -33 12 -30 -42 -37 -18 -34 9 21 2 8 -24 5 -4 -17 -12 -31 -45 51 -24 13 -88 -14 37 -19 42 -41 -7 14 -62 47
7237 47 -2 -33 66 -9 53 13 -55 56 -9 1 10 -69 22 -22 -7 -32 21 -2 73 29 15 -1 -9 5 -29 20 -20 41 -9 38 57
7268 57 15 19 29 23 13 -15 -47 43 57 -53 22 16 -3 58 11 -30 10 7 31 -17 -20 22 -17 12 14 32 -42 21 5 2 -7 30 24 24 -37
7303 -37 -22 -23 36 -47 -21 -2 -36 3 9 -14 12 -40 32 37 -24 -50 -24 10 -7 -10 -45 -4 -10 -53 16 21 14 -9 22 -7 -26 -14 -37 21
$$ packed form
7071D2o6O6m3L2k5l3J7J2k6lL1k2o9Q0J9Jk1J3L2p2M8l9j5K5K0K8m7oN4K6p5N7
7103D1l0J0q6O3O5n8m8K5q0N2kK1K5k1nO5l9J8Nm6L2j8K4M0m4J7p6L7L3k0j0L
7135gKmj7M2n3P5po0mK1PK5K5q4O4K3n6nK7MKm1N9p4KN4M5p8Ll1L9j2k4J2pK8
7171eK6l7OK5rL5k3j9l9K6L1k7M2o1RL0J1j1l6N8k5j8J8n9P4j7qQLo9M7NJ2k6
7205b3m5L5M5m2j2NJ9j6M3J2j9Ol2K9rj3Nj9j4R6p5L7j01P4N1n6O1q3L4K1p6J09
7237D7m9l1R9p5O2m0o8J11o5J0Rp9R1m4J5k5N3k3P5m4j4j6qJ4l4M9m0O1n0M7J9
7268E7m2MJ0oj0k8l2R0J4j10P5oj9O1m7m1M0lK4m8lM2l9K9KJ8p4O3j6lrL7o%o1
7303c7J5jN9q3K6J9l4L9Ok3K6n2P2No1k6K6L4j7ll5M1om3O9Npk3L1k9j9J2k3N8
$$ plain form
7337 21 -48 -23 -5 -59 -30 13 2 13 -40 -57 -11 6 57 12 -32 56 25 -48 10 8 -22 -21 -8 -8 16 -56 -40 -18 -20 -24 -36 18 26
7370 26 25 -5 -23 43 55 32 17 -8 -48 -56 -4 -30 -6 5 28 41 -13 14 7 -3 9 -8 9 5 1 17 -34 73 -29 -40 -10 -18
7402 -18 4 15 29 -13 -20 -7 10 -7 -27 33 -3 -28 16 -27 5 15 8 23 -6 27 49 -16 -43 -37 -30 6 -8 -18 -9 -22 -45 -6 -1
7435 -1 43 -45 9 -10 -21 -7 -32 -26 -15 19 -27 -16 10 48 4 -22 -1 -23 -44 -48 -1 -26 12 -84 -18 66 -29 -12 30 8 32 -5
7467 -5 43 -15 -49 20 -7 -38 -21 16 38 -29 34 -24 0 -24 -31 -73 -16 67 43 -25 14 -20 -13 26 4 1 3 -40 -14 -54 -16 13 -31
7500 -31 8 -33 21 -39 -14 -5 -38 43 -28 67 1 -10 -56 12 -38 -12 -21 9 -30 -41 -8 9 22 5 -9 -26 -14 -19 7 -34 -18 -11
7532 -11 -29 -23 -8 -54 -42 -25 -9 22 -10 -57 -35 -43 -10 -4 6 -20 23 16 -4 -24 -9 -21 -45 -62 28 13 -35 18 -20 73 5 -3 -20
7565 -20 -12 -22 28 -32 31 -2 27 -13 -15 -17 -53 23 12 0 34 -11 7 -38 -11 -30 43 -10 -63 -37 -67 -11 51 7 41 -35 -30 80
$$ packed form
7337B1o9K5J8n4K9M3j1J1n3j7M6J7N1m5m4Q8l1p3N8kl0JJ3%K4p2J6K2kmj2N4Q
7370B6jl0j8O6J2k3j5k5m0qN2k6K4J1K3J3n4K7pj0J2j7J7mmJ6n1J07j02j1L0q
7402a8K2J1J4m2pJ3J7j7k0O0l6k5M4m3L2J0pJ5k9L3K2o5k7OPL6j4j0Rj3k3L9N
7435aM4q8N4j9j1J4k5OJ1L4m6J1K6L8m4k6K1k2k1mM7k5L8r6O6Q4r5J7M2k2K4l7
7467eM8n8l4O9k7l1J7L7K2o7O3n8K4k4pm2N7Q3k4o8L9l4PL9k2lKm3K6m0L8K9m4
7500c1L9m1N4o0K5Rl3Q1p1R5o6j1m6O8n0K6rL0l9j1L3J7J3j7j4j7J2nK6m1J6P
7532a1j8OJ5m6J2J7J6L1l2m7K2qL3OJ0k6M3pk0k0J5j2k4j7R0j5m8N3l8R3o8qj7
7565b0Qj0N0o0O3l3K9m0kkl6P6j1j2L4m5J8m5K7j9P3n3n3K6l0N6O2m4L4p6NJ10
$$ plain form
7597 80 -21 -4 4 32 24 -7 -33 -63 -57 -28 -30 -8 -16 -73 -15 -11 -42 32 -4 -1 22 2 5 -36 -14 6 -1 18 0 0 -48 10 -43 -26 -9
7632 -9 36 20 -6 22 -30 -39 -69 15 2 41 13 -28 -2 -17 17 -25 8 12 43 -19 -51 -41 -51 -8 30 43 29 -17 -12 9 -9 69
7664 69 4 32 -25 -53 2 0 -59 40 -23 17 21 -13 -18 1 18 24 -63 -16 19 -19 -1 34 3 -25 10 0 0 45 -15 -25 -1 19 14
7697 14 -9 -7 -27 -15 -12 32 -6 -62 -22 3 -11 55 -32 -42 -48 -19 -2 25 -39 -55 -18 21 4 -18 -67 28 29 2 22 18 10 6 -28 -10
7731 -10 25 15 31 -6 -5 -29 -31 -53 -8 -36 -50 -32 40 -4 -30 28 -42 8 15 11 1 14 -6 -21 -35 -17 18 24 -41 -9 -27 21 -54
7764 -54 7 23 -24 -16 36 6 33 14 -8 -62 16 -30 -22 -25 41 13 1 35 -46 -20 -28 66 -73 17 15 16 11 -16 18 22 41 2 -46 -31
7798 -31 -13 -16 12 49 -9 -16 0 -38 -52 -4 -50 38 -31 9 17 -19 -33 58 -48 -11 28 -47 -23 7 -22 -1 -34 -34 -11 -39 -21 -31
7830 -31 2 -9 -42 -32 -16 -12 -26 -13 -6 -16 16 -17 -1 -49 -18 -51 16 -29 -7 -13 -53 -12 -15 -3 9 -18 -22 -41 0 55 -19 8 -2
$$ packed form
7597H0j01J7QK8ql1k6l0OK9kK2qn7N8Ml1P4l6LK3k0Lm1K2K0pJ9j8%m8N8n3J7J7
7632iM5j6k6K8n2rl0Q4j3L9k8m1K6j5L4m2L3ML1o2l2J0j0M3L8J3j4m6NK1j8P8
7664F9o5K8n7k8N5kn9R9o3M0Ml4nJ9J7Oq7M7L5l8J8L5l1k8L5j0%M5o0j0K4K0n
7697A4k3Kk0J2LM4l8n6M0K5j4O6q7j0oK9J7K7o4j6L7L9j7k2m9R5Jk7K0mqml4J8
7731a0L5j0J6l7Jk4kk2M5k8j4J8P2m4k6N8p0N0Pmj0J3k0j5j4J8L5Oo5L2j8M8p5
7764e4O1J6m7QN2l0K7j9k2n4P8m6QlO6k8j2L4q1K6qR4j39R0kJnk7L4MJ9l9m8J5
7798c1J8lK8L7n8pJ6l8j4M8m6Q8o9M0Ql6j4R1j06L7L9p5K4L0k9K1l3%K3k8J8j0
7830c1L3j1l3J0J6Mj4J3Pj0L2l3J6m8L1l3O7m5K2om0M1lJ2J2k7mj9M1N5p4K7j0
$$ plain form
7863 -2 0 31 -73 7 -76 -43 -5 9 27 4 -31 -16 -29 45 -13 -1 -50 -14 5 -51 10 3 12 16 -8 30 -13 2 3 -14 -25 41 23
7896 23 26 -22 19 13 0 -11 -9 26 17 -20 11 -20 17 -9 -38 -44 -48 -9 -31 24 -49 -82 -63 -75 -34 -33 4 -1 23 -42 12 0 -7 -4 17
7931 17 -16 45 19 -48 -23 6 -13 -54 19 26 22 -61 -31 -33 41 -13 -66 16 -23 27 -52 -50 12 -3 -32 -12 -26 11 -26 -4 -51 26
7963 26 -12 -64 6 -16 1 -31 -37 -60 20 53 -15 -2 -48 -8 9 -60 -4 32 -10 -38 23 18 28 26 -28 14 -14 4 28 -71 -2 -3
7995 -3 -12 15 25 15 70 -19 -6 7 -24 20 -15 -37 -30 -14 40 -24 -35 10 37 -8 -25 1 -9 -34 -2 14 22 30 -28 -50 -12 -20 17
8028 17 -21 6 -2 -12 -59 -40 -21 1 -72 -32 -12 -32 -32 -42 -22 26 34 -36 -19 17 -4 -34 16 32 -28 -12 -47 5 -42 39 -22 -39
8060 -39 32 -25 46 50 -26 18 -39 -3 -10 26 -4 -16 54 4 -1 -6 -5 -8 -52 -35 18 0 -26 31 -45 35 -7 30 13 17 -7 -26 -64 22
8094 22 19 14 -9 4 -41 7 14 16 34 6 -1 -10 15 38 -41 -46 -79 -34 -23 -24 -22 -28 -38 -40 62 37 3 -40 -36 -40 -32 -12 -43 59 -39 18
$$ packed form
7863bKL1j04Q0q3L3L8J4J8k3l5J5j3P4n8J2m9L6J9n6O1pRMk4L8m3J5Jj7j1O6j8
7896B3Lm8M1oj3j1KL5rl7L1l1L7k6k9omL9k2N5p3l3J9j2M1JL7nK4o5N4j2pLK1
7931A7l3O1k6o7K5K9j9m1P3Pmq3L0kP4n4n3Q2l9N0p9KO2j5k9K0j4L7l7K2m7P7
7963B6l8n2P0k2J7l2ok3Q0L3o8J3m6M0J7o9N6L6m2k8O1nJ0kn4M2k8J8K4r9O9j
7995crK7J0j0N5q9J3J3l1M4l5k2PJ6N4o4j1M5K7m5j7K6j0k5L2J6QQn8k2L8qL7
8028A7l8K7qj0m7J9J9K2p3M0K0k0%j0K0M8Qp0J7L6k1l0N0J6o0J6l5N2m7Q1o1j7
8060c9P1n7P1Mp6M4n7L6pL6l0j2P0n0nnJlm4J7N3j8k6N7p6Q0m2L7j7Mk4j9l8Q6
8094B2lnk3J3m5M8PKJ8k8prK5K3p9nl3M5J1jKoj0kJ02k5l4m3MmQK0l1J02r8N7
$$ plain form
8130 18 -11 -31 -2 -2 -15 -81 -31 26 -63 -38 -24 -53 9 -3 50 17 -5 -13 -35 17 -43 -58 9 -18 37 -2 18 -40 -4 -9 -25 -15
8162 -15 -3 18 23 -19 -10 -44 -46 -35 25 41 33 -30 -23 17 5 27 9 -20 -37 27 64 -15 57 -15 -80 -2 14 -14 -4
$$ packed form
8130A8k9k0K9%j3o6N0N7q9K5J4k9O2j2N3l3k2qk2N2o0j5O7k7N5l9K0n8L6nj6J0
8162a5J2K1Nm2Rl4kJ1O0J6qo3PM0j2K2j8k9j7O4L7p9P2p2o5P8J6k8J0
8191d
$$ Imaginary data points
##PAGE= N=2
##DATA TABLE= (X++(I..I)), XYDATA
$$ plain form
0 0 0 0 0 0 0 0 0 8 0 8 -8 8 -16 16 -24 29 -32 40 -48 64 -77 88 -104 128 -146 174 -200 232 -264 304 -352
31 -352 400 -450 512 -578 650 -730 818 -914 1019 -1135 1259 -1398 1545 -1711 1890 -2084
47 -2084 2298 -2533 2790 -3072 3386 -3733 4120 -4555 5042 -5599 6239 -6984 7866 -8925
61 -8925 10225 -11870 14022 -16975 21281 -28182 41000 -72729 315227 267515 -505661 -19778
73 -19778 300941 -58662 -162585 195549 -20219 -291729 95440 348200 -154941 -243461
83 -243461 212205 159656 -194291 -33746 112379 -82476 -73726 153310 4326 -206345 49916
94 49916 226667 -89239 -149906 112584 15597 -160260 52703 128296 -117685 -118496 123224
105 123224 62105 -116764 27404 103090 -126929 -86390 153985 25056 -142224 40410
$$ packed form
0@%%%%%%%QqQj6J6k4L2m0N3o1P2q8J12j41J65j92K32k74L20l74M32m96N68o56
31c52P52q50R62j090J228j380J548j732J933k154K394k657K943l256L601l974
47b084M382m831N323n862O458p119P853q675R597j0641J1838j3223J4850j6791
61h925J9150k2095K5892l0997L8256m9463O9182j13729L87956m7712p73176M85883
73a9778L20719l59603j03923L58134k15768k71510L87169K52760n03141q8520
83b43461M55666n2549l53947J60545J46125j94855Q750K27036j48984k10671K56261
94D9916J76751l15906o0667K62490r6987j75857K12963P5593k45981q11K41720
105A23224o1119j78869J44168P5686k30019M0539K40375j28929j67280J82634
$$ plain form
115 40410 117071 -75726 -68849 129506 44596 -149969 -1453 132309 -61517 -91862 101296
126 101296 42184 -99333 14917 101359 -36299 -77459 68885 54040 -87277 -21213 67967
137 67967 -15796 -5778 59480 -41131 -73673 69678 77544 -76158 -75534 57593 27944 -52948
149 -52948 30909 34658 -85619 -8810 105850 -18759 -99256 33270 74642 -49803 -49882 61638
161 61638 11289 -63158 39629 48686 -77386 -20599 84002 -11585 -74162 29620 49935
172 49935 -52376 -26553 75318 3205 -74803 28567 53248 -43762 -8892 50196 -24845
183 -24845 -46903 45142 45952 -50172 -31572 51567 1627 -42187 31733 15491 -55537 10293
195 10293 54811 -30698 -46099 41000 35727 -45987 -14463 50541 -14561 -40675 44845 19388
$$ packed form
115D0410P6661j92797O877J98355q4910j94565J48516J33762j93826l0345J93158
126A01296n9112j41517J14250Q6442j37658m1160J46344j4845j41317O6064Q9180
137F7967q3763J0018O5258j00611l2542J43351P866j53702O24J33127k9649q0892
149e2948Q3857L749j20277P6809J14660j24609q0497J32526M1372j24445p9J11520
161F1638n0349p4447J02787R057j26072N6787J04601r5587o2577J03782K0315
172D9935j02311K5823J01871p2113p8008J03370K4681r7010L4870N9088p5041
183b4845k2058R2045Q10r6124J8600Q3139m9940m3814P3920j6242p1028O5830
195A0293M4518q5509j5401Q7099n273q1714L1524O5004o5102k6114Q5520k5457
$$ plain form
207 19388 -58841 518 51135 -15150 -37510 23688 18892 -39748 -1297 48580 -23622 -46350
219 -46350 37950 25850 -37025 1024 30986 -16725 -20613 32184 14890 -43196 -1304 47575
231 47575 -17466 -36548 30576 14107 -31307 6193 23352 -21733 -19998 30572 13333 -39409
243 -39409 36 40493 -15924 -24241 30856 6705 -30226 8235 25514 -16226 -21089 23453
255 23453 12553 -33245 912 32865 -19308 -24130 25698 6897 -25785 3366 21609 -10157
267 -10157 -17530 20700 12995 -26984 2242 28252 -15779 -18142 21644 5248 -20565 2369 17461
280 17461 -9557 -16867 16699 9281 -24785 2646 22088 -15586 -12028 21430 3879 -18212 3655
293 3655 18286 -7370 -14857 16183 7276 -22260 5157 19240 -16379 -11817 17621 3023 -17139
$$ packed form
207A9388p8229N9359N0617o6285k2360O1198m796n8640L8451M9877p2202k2728
219d6350Q4300j2100o2875L8049K9962m7711l888N2797j7294n8086M1892M8879
231D7575o5041j9082O7124j6469m5414L7500J7159m5085J735N0570j7239n2742
243c9409L9445M0457n6417q317N5097k4151l6931L8461J7279m1740m863M4542
255B3453j0900m5798L4157L1953n2173m822M9828j8801l2682K9151J8243l1766
267a0157p373L8230p705l9979K9226K6010m4031k363L9786j6396k5813K2934J5092
280A7461k7018p310L3566p418l4066K7431J9442l7674L558L3458j7551k2091K1867
293C655J4631k5656p487L1040q907k9536K7417J4083l5619M562K9438j4598k0162
$$ plain form
306 -17139 45 15137 -6183 -13553 14263 6728 -18303 5422 16848 -11228 -8369 12963 3803
319 3803 -11330 -692 11531 -5021 -11519 11163 4369 -15485 3187 10972 -8889 -5930 8647
332 8647 2685 -8280 -95 10964 -3531 -9203 10818 4690 -11812 3011 8825 -6379 -5032
345 -5032 6233 2758 -8457 -2267 9900 -3485 -10147 8209 4256 -9706 1607 7516 -3427
358 -3427 -4537 5145 5327 -6525 -2894 10251 -1629 -9250 6474 3879 -8095 3 5438 -2738
372 -2738 -5833 3095 5723 -6837 -3983 9544 -1182 -7536 6463 3622 -6407 794 6320 -1133
386 -1133 -6084 3187 6607 -7014 -3890 8697 -2727 -7513 6045 2508 -7330 -614 6552 -543
400 -543 -7271 3234 7348 -6555 -2410 9274 -2623 -6396 6660 3305 -6491 -1472 6096 -212
$$ packed form
306a7139J7184J5092k1320p370K7816p535k5031K3725J1426k8076K859K1332r160
319C803j5133J0638J2223j6552o498K2682o794j9854J8672P785j9861K959J4577
332H647n962j0965Q185J1059j4495n672K0021o128j6502J4823N814j5204J347
345e032J1265l475j1215O190J2167j3385o662J8356l953j3962J1313N909j0943
358c427j110R682J82j1852L631J3145j1880p621J5724k595j1974Q098N435q176
372b738l095Q928K628j2560K854J3527j0726o354J3999k841j0029P201N526p453
386a133m951R271L420j3621L124J2587j1424m786J3558l537r838O716P166p095
400e43o728J0505M114j3903M145J1684j1897l773J3056l355r796N019P568o308
$$ plain form
414 -212 -7468 2694 5693 -7824 -2199 8616 -3464 -6417 5662 3433 -5264 -1614 6451 933
428 933 -6856 3614 6551 -7151 -1922 8032 -2562 -5867 3676 2903 -4732 -2879 5305 380 -7646
443 -7646 3383 6406 -7006 -1853 7864 -1719 -5275 4132 4672 -4472 -3370 7395 1411 -9078
457 -9078 2936 6848 -7109 -2866 6749 -1874 -5946 3193 4483 -5440 -3735 8311 1065 -8910
471 -8910 4435 6512 -7114 -622 8114 -2843 -6691 5158 6267 -7435 -5604 8900 1026 -9318
485 -9318 3653 4759 -7583 -81 8074 -2682 -7135 4103 6775 -5106 -3724 7399 -674 -5949
499 -5949 6523 2473 -9141 1207 8573 -3042 -7781 2843 5194 -5215 -2310 6577 -3235 -5820
513 -5820 7848 3248 -8446 -282 7122 -540 -4402 2880 2909 -5485 398 7459 -4978 -6643 7689
$$ packed form
414b12p256J0162K999j3517N625J0815j2080k953J2079k229q697L650Q065n518
428I33p789J0470K937j3702N229R954j0594l305R543p73p635J853Q184m925q026
443g646J1029L023j3412N153R717r583l556R407N40r144J102J0765n984j0489
457i078J2014L912j3957M243R615q623m072R139J290r923J705J2046p246r975
471h910J3345K077j3626O492Q736j0957l848J1849J109j3702J831J4504p874j0344
485i318J2971J106j2342P502Q155j0756m453J1238K672j1881J382J1123q073n275
499e949J2472m050j1614J0348P366j1615m739J0624K351j0409K905Q887r812k585
513e820J3668m600j1694Q164P404p662l862P282K9q394N883P061j2437j665J4332
$$ plain form
528 7689 2919 -8488 -823 6081 -1639 -5077 4198 3703 -7205 -339 9052 -3384 -6963 6105
542 6105 3959 -5427 -432 4905 -1655 -4559 3968 2849 -7443 134 7718 -4788 -6030 6455
556 6455 2291 -6437 575 6085 -2633 -4975 6476 3783 -8918 325 9093 -4216 -5661 6414
570 6414 1884 -6492 577 5555 -4152 -5730 6874 3038 -9108 1008 7988 -4884 -4202 6912
584 6912 820 -6884 2163 7683 -3750 -6567 6436 3370 -7940 1290 6532 -5290 -3769 5984
598 5984 342 -6708 1043 6290 -3450 -4735 6617 1623 -7444 3309 6224 -5950 -2819 7319
612 7319 1020 -6734 1066 5948 -4677 -4800 7499 1131 -8768 2307 6035 -5080 -3062 5577
626 5577 326 -5879 2495 6653 -4756 -4480 7463 1033 -7212 3071 4987 -5151 -2132 5660
$$ packed form
528G689m770j1407P665O904p720l438R275m95j0908O866R391j2436l579J3068
542F105k146r386M995N337o560k904Q527j119j0292P577P584j2506j242J2485
556F455m164q728P012N510q718k342J1451k693j2701R243Q768j3309j445J2075
570F414m530q376P069M978r707j578J2604l836j2146J0116O980j2872O82J1114
584F912o092p704R047N520j1433k817J3003l066j1310R230N242j1822J521R753
598E984n642p050P751N247r740j285J1352m994r067J0753K915j2174L131J0138
612G319o299p754P800M882j0625j23J2299o368r899J1075L728j1115K018Q639
626E577n251o205Q374M158j1409K76J1943o430q245J0283J916j0138L019P792
$$ plain form
640 5660 -385 -6661 1830 5906 -5001 -4192 6589 457 -5845 3281 3591 -4846 -1139 5738 372
655 372 -5197 1889 4762 -4521 -2670 5978 -973 -5643 3213 3226 -4512 -1806 4327 15 -4821 2008
671 2008 4629 -4185 -2160 5728 -434 -4502 2804 3106 -3205 -1473 3643 119 -4390 1706 3713
686 3713 -4367 -2076 4843 -940 -4171 2323 2582 -3083 -1423 3914 397 -4047 2217 3606 -4056
701 -4056 -1026 4935 -1120 -3911 2345 2443 -3130 -1565 3329 -535 -4109 2569 2929 -4553 -827 4746
717 4746 -1125 -3286 2456 2201 -2660 -744 3838 -701 -3890 2977 2433 -4508 -415 3909 -1788 -2844
733 -2844 2406 1354 -3321 -645 3804 -1217 -3499 3356 2071 -3901 696 3673 -1937 -2181 2753
748 2753 1372 -3226 -401 3594 -1474 -3193 2955 1002 -4038 807 2914 -2140 -2011 2599 1401
$$ packed form
640E660o045o276Q491M076j0907Q09J0781o132o302R126L10q437L707O877n366
655C72n569P086K873r283J851Q648o951m670Q856J3p738K706O133m312m836O829
671B008K621q814K025P888o162m068P306L02o311J732N116l524m509O096K007
686C713q080K291O919n783l231O494K59n665J660N337l517m444O264J389p662
701d056L030N961o055k791O256R8n573J565M894l864l574O678L60p482L726N573
717D746n871k161N742k55m861J916M582m539l189O867n44o941M093M324n697j056
733b844N250j052m675K676M449n021k282O855j285n972M597K977n610k44M934
748B753j381m598K825L995n068j719O148j953n040M845K107n054J29M610j198
$$ plain form
763 1401 -2868 -58 3563 -1465 -2505 3412 910 -3476 1069 2679 -2028 -2000 2208 1053 -3132 -249
779 -249 3166 -1848 -2528 3111 628 -3160 1152 2606 -1560 -1655 2434 1523 -2899 -2 3224 -1822
795 -1822 -2262 2995 178 -3161 834 2233 -1780 -2024 2122 1202 -2995 252 3258 -1905 -1774 3209
811 3209 371 -2647 995 2290 -1437 -1791 2158 1004 -3065 228 2797 -2302 -1910 2647 1 -2486
827 -2486 798 2078 -1274 -1581 2295 1058 -2841 720 2837 -1984 -1366 2594 15 -2284 647 1666
843 1666 -1463 -1789 2034 664 -2957 668 2424 -2036 -1095 2387 88 -1799 750 1941 -1052 -1476
859 -1476 2165 708 -2682 756 2036 -2026 -1039 1891 -65 -1920 259 1603 -1151 -1500 2028 626
875 626 -2338 1028 1987 -1590 -682 1832 249 -1534 209 1661 -1012 -1590 1801 267 -2499 608
$$ packed form
763A401m269K810L621n028j040N917k502m386M545J610m707K8M208j155m185K883
779b49L415n014o80N639k483l788M312J454m166r5M089r11m422K897L226n046
795a822m40N257k817l339L995J399m013k44M146r20m197L247L006n163J31M983
811C209k838l018L642J295l727l54L949j154m069L293K569n099L92M557k646k487
827b486L284J280l352l07L876j237l899L561K117m821O18L960k579k299K931J019
843A666l129l26L823j370l621L625J756m460R41L482k299j887K549J191k993m24
859a476L641j457l390L438J280m062R87K930j956j855K179J344k754l49L528j402
875F26k964L366R59l577R08K514j583j783J743J452k673n78L391j534k766L107
$$ plain form
891 608 1594 -1507 -849 1418 322 -1369 170 1767 -821 -1361 2061 567 -2044 785 1583 -1235
907 -1235 -775 1197 213 -1567 -67 1632 -1108 -1598 1814 378 -2018 691 1421 -1084 -569 1362
923 1362 591 -1392 151 1863 -953 -1420 1762 161 -1881 563 1054 -1220 -929 1122 511 -1641
939 -1641 -70 1787 -877 -1162 1792 357 -1450 677 1247 -741 -890 1141 735 -1463 -224 1564
955 1564 -1018 -1165 1384 -30 -1521 496 1124 -703 -935 1068 828 -1283 146 1736 -943 -848 1588
972 1588 119 -1413 396 1000 -622 -1096 775 599 -1490 -53 1371 -1080 -811 1511 59 -1077
988 -1077 300 1047 -324 -750 1047 764 -1482 171 1338 -934 -819 1086 36 -1069 -1 710
1004 710 -388 -955 774 585 -1207 199 1343 -701 -524 1004 192 -677 95 822 -340 -975 797
$$ packed form
891F08R86l101O58K267j096j691J539J597k588n40L422j494k611K829P98k818
907a235M60J972r84j780J500J699k740m90L412j436k396K709P30k505N15J931
923A362p71j983J543J712k816m67L182j601k042K444M91k274K91K051o11k152
939a641J571J857k664k85K954j435j807K127N70j988j49K031m06k198J239J788
955A564k582j47K549j414j491K017O28j827k32K003k40k111J429J590k679R5K436
972A588j469j532J809O04j622m74J871j76k089J437J424k451K69K322j452j136
988a077J377P47j371m26J797k83k246J653J167k272J15J905j050j105J068P11
1004G10j098n67J729j89j792J406J144k044J77J528q12q69P72P27j162o35J772
$$ plain form
1021 797 499 -1448 -4 1033 -811 -686 766 306 -793 -77 999 -262 -999 1058 794 -1181 155
1038 155 1059 -634 -542 735 205 -964 -121 995 -546 -1142 950 371 -1330 389 1160 -689 -590 877
1056 877 323 -816 105 1112 -482 -827 1105 201 -1277 334 806 -803 -434 733 51 -911 138
1073 138 878 -624 -621 1185 146 -1037 575 835 -563 -298 606 257 -727 96 835 -669 -701 852
1091 852 -121 -1019 434 536 -549 -342 579 293 -710 133 1005 -481 -460 1066 147 -900 312 679
1109 679 -391 -512 493 327 -972 -104 880 -643 -772 916 196 -851 237 785 -389 -585 804
1126 804 551 -925 139 1139 -670 -702 987 37 -1028 288 723 -602 -770 753 366 -1033 151
1143 151 1063 -627 -494 1091 69 -836 372 856 -414 -612 733 304 -1086 229 844 -888 -569
$$ packed form
1021G97k98j947J444J037j844J25J452m60j099P16J076j261p37K057k64j975J336
1038A55R04j693R2J277n30j169Q43J116j541n96K092n79j701J719P71j849R9J467
1056H77n54j139R21J007j594l45J932r04j478J611M72j609L69J167o82r62J049
1073A38P40j502LJ806j039j183J612K60j398K65R04l49r84Q23P39j504l2J553
1091H52r73q98J453J02j085K07R21k86j003Q43Q72j486K1J526r19j047J212L67
1109F79j070j21J005j66j299Q68R84j523j29J688p20j047J088N48j174j96J389
1126H04k53j476J064J000j809l2J689r50j065J316M35j325j68J523l87j399J184
1143A51R12j690J33J585j022r05J208M84j270j98J345m29j390J315O15j732L19
$$ plain form
1160 -569 930 21 -863 202 706 -363 -611 817 368 -862 292 921 -563 -387 753 -42 -680
1177 -680 120 615 -356 -685 630 214 -964 127 784 -532 -345 713 143 -634 122 819 -271 -684
1195 -684 768 432 -875 94 669 -576 -503 545 126 -747 -100 664 -336 -700 689 332 -794 226
1213 226 758 -330 -337 584 288 -590 -8 679 -417 -666 683 227 -926 105 525 -441 -418 478 244
1232 244 -544 51 819 -327 -518 779 234 -715 226 529 -402 -348 444 140 -655 -70 598 -429 -669
1251 -669 599 135 -683 227 497 -320 -289 497 351 -543 63 698 -268 -455 646 41 -668 152 450 -317
1271 -317 -356 321 160 -597 18 547 -416 -362 658 103 -480 249 469 -282 -250 397 200 -558 49 489 -447
1292 -447 -442 478 -53 -516 166 341 -281 -270 470 172 -480 158 585 -452 -204 526 7 -437 150 342 -306
$$ packed form
1160e69J499r09q84J065N04j069k48J428m49j230J154O29j484J76J140p95o38
1177f80Q00M95r71l29J315m16j178J091O57j316J87J058n70p77P56O97j090m13
1195f84J452l36j307R69N75j245P3J048m19q73O47P64j000l64J389l57j126J020
1213B26N32j088pR21k96q78N82O87j096k49J349m56j153J031M20r66K3Q96k34
1232B44p88N95P68j146j91J297n45r49R41L03r31N4P92l04p95N85O68j027k40
1251f69J268m64q18R10K70q17L1P86j46q94O06O35r66j87J101o05p09Q20K98p67
1271c17l9O77j61p57O15N29r63N4J020n55n83P29K20p51L2O47j97p58O07M40r36
1292d47NR20n31m63O82J75o22J1P40k98o52O38M27j037K48P30n19m44N87J92o48
$$ plain form
1313 -306 -338 366 101 -596 123 438 -518 -260 537 40 -370 169 371 -190 -285 480 194 -583 257 470 -424
1334 -424 -254 411 -103 -461 68 282 -311 -294 386 84 -510 259 502 -363 -53 476 27 -407 161 406
1354 406 -282 -265 431 13 -571 146 309 -490 -225 444 -24 -408 105 450 -255 -227 516 48 -486 236 400
1375 400 -372 -138 331 -100 -402 149 271 -351 -317 403 -16 -529 231 330 -349 -67 402 46 -327 177 368
1396 368 -295 -178 492 8 -480 209 196 -425 -148 267 -69 -363 59 268 -272 -241 426 52 -394 300 251
1417 251 -281 -122 332 41 -375 57 242 -297 -237 319 -105 -374 100 208 -297 -134 294 76 -343 139
1437 139 384 -203 -144 384 30 -187 169 212 -272 -184 221 4 -369 13 295 -265 -210 374 7 -322 140
1458 140 292 -132 -114 330 66 -375 141 354 -252 -203 397 -5 -327 116 189 -321 -174 309 66 -396 217
$$ packed form
1313c06l2P04k65o97P19L15r56K58P97m97m10N39K02n61r5P65k86p77Q40K13q94
1334d24J70O65n14l58N29K14n93J7O80l02n94P69K43q65L10N29m49m34N68K45
1354D06o88J7O96m18n84P17J63p99K65O69m68l84N13L45p05K8P43m68n34P22J64
1375D00p72K34M69m31l02N51J22o22L4P20m19n13P60R9o79K82M69l56l73N04J91
1396C68o63J17O70m84m88O89j3o21K77M15l36k94M22K09n40L1O67l74m46O94m9
1417B51n32J59M54k91m16M32J85n39O0N56m24k69M74J08n05J63M28k18m19M82
1437A39K45n87N9N28l54k17L56M3m84Q8M05k17l73L82K82n60N5N84l67l29M62
1458A40J52m24J8M44k64m41N16K13o06M9O00m02l22M43P3n10J47M83k43m62O13
$$ plain form
1479 217 390 -304 -65 457 15 -280 192 227 -224 -151 310 37 -406 134 258 -271 -67 334 -54 -277 136
1500 136 237 -213 -120 305 3 -313 211 267 -346 -138 272 -50 -251 87 122 -248 -189 248 -37 -310 129
1521 129 190 -246 -52 275 42 -185 144 257 -131 -114 304 -10 -293 125 226 -231 -74 240 -80 -287 90
1542 90 188 -226 -129 264 35 -227 152 234 -217 -24 300 11 -181 85 189 -190 -70 263 -10 -249 79
1563 79 78 -258 -97 177 21 -200 112 182 -173 -56 229 -20 -192 208 145 -181 -38 106 -13 -168 55 105
1585 105 -155 -90 214 -25 -256 107 97 -108 58 207 44 -130 61 154 -155 -80 140 -6 -170 136 127 -153
1607 -153 -104 86 -60 -148 72 170 -129 -93 185 -9 -114 165 119 -156 -5 162 -27 -177 75 118 -242 -84
1629 -84 165 -130 -176 94 66 -129 -11 192 -49 -111 139 116 -182 10 212 -76 -152 163 105 -160 -1 111
$$ packed form
1479B17J73o94K39N22m42k95M72L5m51P3M61k73m43N40J24n29K04M01l88k23M13
1500A36J01m50R3M25l02l16N24N6o13K08M10l22k01L38L5l70N9M37k85k73M39
1521A29O1m36J94L27k33k27L29J13l88J7M18l14k83M18J01m57J57L14l20k07L77
1542I0R8m14R7L93k29k62L79Q2m51J93L24k89j92K66J04l79J20L33k73k39L28
1563G9jl36J61K74j56k21L12P0l55J17K85k49j72M00o3l26J43J44j19j55K23N0
1585A05k60O5L04k39k31L63j0k05J66J49j63j74J91R3l09P5K20j46j64L06rk80
1607a53M9J90j46q8K20R8k99L6K78j94j05K79m6k75J51J67j89j50K52M3l60J58
1629h4K49k95m6K70k8j95J18K03k41o2K50k3k98J92K02k88p6L15n8k65J59J12
$$ plain form
1651 111 -50 -155 135 107 -282 -8 163 -111 -66 96 105 -180 -6 145 26 -150 148 114 -152 -16 146 -142
1673 -142 -177 59 6 -179 -44 100 -66 -138 97 83 -201 28 186 -58 -82 118 62 -127 -40 145 -45 -99 108
1696 108 38 -203 2 128 -90 -80 117 116 -94 -19 154 -60 -139 215 124 -175 -34 143 -36 -121 44 87 -208
1719 -208 10 142 -129 -126 91 44 -122 46 120 -61 -14 127 131 -101 7 166 -28 -80 75 40 -127 -2 108
1742 108 -59 -62 54 24 -130 44 99 -79 -64 168 35 -64 16 144 -38 -77 118 51 -109 7 110 -84 -132
1765 -132 84 -2 -123 19 105 -78 -62 76 104 -99 64 93 -118 -82 90 56 -116 28 75 -102 -90 170 31
1788 31 -107 29 123 -123 -69 154 -12 -57 59 106 -54 -25 120 44 -121 69 54 -135 -28 68 -22 -63 0 61
1812 61 -73 -10 58 34 -111 75 50 -77 -4 82 1 -35 92 95 -97 -32 152 12 -102 57 -24 -119 -52 86 21
$$ packed form
1651A11j61j05K90k8l89K74J71k74M5J62Rk85J74J51j19j76K98l4k66J36J62k88
1673a42l5K36n3j85J35J44j66p2K35j4k84K29J58k44k4K00n6j89Q7J85j90n4K07
1696A08p0k41K05J26k18J0J97jk10P5J73k14p9L54r1k99J41J77j79q5J65M3k95
1719b08K18J32k71LK17m7j66J68P4j81M7J41Mk32J08J59j94n2J55l5j67J25J10
1742A08j67lJ16l0j54J74N5j78J5K32j33r9Q0J28j82l9J95o7j60J16J03j94m8
1765a32K16q6j21J42Q6j83J6J38K8k03J63K9k11L6J72l4j72J44M7j77J2K60j39
1788C1j38J36R4k46N4K23j66m5J16M7j60K9J45p6j65J90j5j89J07R6r0m1O3O1
1812F1j34O3O8k4j45J86k5j27P3Q6q1l6J27Lj92O5J84j40j14J59q1r5O7J38o5
$$ plain form
1837 21 -100 58 58 -59 -3 108 -38 -81 96 102 -79 -22 105 -7 -73 -15 69 -144 11 116 -61 -125 76 9
1861 9 -109 -14 82 -51 -79 10 100 -134 -33 128 -8 -93 123 21 -72 -30 106 29 -69 64 103 -95 3 124 -41
1886 -41 -48 169 68 -126 -39 122 17 -105 45 141 -130 -40 109 -100 -112 106 -13 -66 -17 97 -18 -117 102
1909 102 47 -94 56 121 -39 -57 89 10 -134 48 124 6 -78 29 28 -117 102 36 -56 -42 66 -9 -4 -16 115
1934 115 15 -119 95 46 -51 -4 46 -86 -17 29 80 -89 -31 78 -21 -128 48 11 -83 22 98 24 -34 37 93
1959 93 -52 -53 25 -57 -58 48 -8 -141 88 23 -47 -91 18 10 -65 -36 68 -38 -31 93 24 -77 78 91 7 28 55
1986 55 25 -34 24 76 -77 -58 88 -21 -67 18 5 -69 -30 90 58 -8 34 74 -55 -47 85 58 -78 19 70 -24 -66
2013 -66 118 11 -53 27 57 -131 -28 39 19 -105 55 61 -2 -46 81 83 -90 47 81 -82 -69 65 24 -75 6 52
$$ packed form
1837B1j21J58%j17N6J11j46m3J77Oj81N7J27j12o6N8Q4k13J55J05j77o4K01o7
1861Ij18R5R6j33k8Q9R0k34J01J61j36q5K16j02r3M2J36p7r8J33L9j98R8J21j65
1886d1pK17j01j94Q7J61j05j22J50R6k71R0J49k09j2K18j19n3M9J14j15r9K19
1909A02n5j41J50O5j60j8J46p9j44J82P6j18q4J07jj45K19o6r2J4J08p5Nj2J31
1934A15j00j34K14m9r7M7N0j32O9M6N1j69N8J09r9j07J76l7r4J05P6p4n8P1N6
1959I3j45jP8q2jJ06n6j33K29o5p0m4J09qp5K9J04j06PJ24o9j01J55J3q4K1K7
1986E5l0n9N8N2j53J9J46j09m6Q5j3p4L9J20l2o6M2M0j29QJ32k7j36R7N1r4m2
2013f6J84j07o4Q0L0j88J03O7k0j24J60Oo3m4J27Kj73J37L4j63J3J34m1r9Q1M6
$$ plain form
2039 52 -51 -98 85 48 -87 5 63 -82 -34 84 25 -66 6 43 -20 -7 22 -39 -59 21 76 -117 -93 28 -25 -88 50
2066 50 101 -78 27 33 22 -59 41 83 -52 -25 26 -11 -24 -29 17 -52 37 100 38 -85 69 31 -54 -6 69 -21 36 -48
2094 -48 54 -10 -29 -7 13 14 -32 32 -31 -35 20 47 -67 2 57 -24 -77 31 -10 25 20 47 -43 -19 74 3 -61 24 29 -23 -10
2125 -10 64 -29 -68 36 48 -56 -69 52 28 -91 -25 75 -10 24 71 -46 -94 48 38 -23 -13 -42 -56 23 21 10 -29
2152 -29 -18 53 -82 -15 1 56 -42 61 67 -7 -18 27 99 -59 -7 92 22 -55 17 -3 -47 -26 108 44 -52 17 19 -44 -7
2181 -7 27 13 -14 87 42 29 -69 46 34 8 29 83 -79 -31 59 -77 -52 29 23 -16 -3 26 1 -38 29 4 -53 5 48
2210 48 19 -16 9 18 -71 2 47 -72 -49 35 28 -51 -8 26 -29 -44 -14 40 -10 36 55 -27 -50 -15 38 18 -28 94 -23 18
2240 18 92 -23 -8 -5 37 -1 -25 57 6 -29 -2 44 33 -26 29 -12 -19 48 0 28 -92 40 35 -34 30 19 1 -40 -33 23 -79
$$ packed form
2039E2j03m7J83l7j35R2N8j45M8J18n9r1P2L7o3J3K9o1k0Q0N5j93K4J21n3o3J38
2066E0N1j79J05Oj1q1J00M2j35K7N1l7j3nM6o9Q9O3o2j23J54l8q5M8P5r0N7q4
2094d8J02o4j9K2K0Jm6O4o3mN5K7j14O9N5q1n3J08m1L5nK7r0K4R3p1o4Q5Nn2J3
2125a0P4r3l9J04J2j04j3J21k4j19O6J00q5L4M7j17m8J42j0o1J0k9j4P9kj1l9
2152b9J1P1j35O7J6N5r8J03Op4j1M5P2j58N2R9p0p7P2k0m4K1J34o4r6O9Ko3L7
2181gL4j4k7J01m5j3r8J15j2k6K1N4j62M8R0j36K5Q1ol9J3K9k5l9O7k5n7N8M3
2210D8k9l5K5Rq9P3M5j19K3Q4pp9M3L4n5j5L0N4n0M6J9q2k3L5N3k0m6J22j17M1
2240A8P4j15J5LM2l8k4Q2n1l5K7M6j1n9N5m1pO7m8K8j20J32no9O4j1j8m1PN6j02
$$ plain form
2271 -79 -51 47 -45 -2 13 25 47 -22 44 4 -56 5 26 -50 -4 22 -38 -11 17 -48 -15 -8 33 40 -46 6 42 -10 25 3 -10
2302 -10 -22 -78 47 -15 -58 17 -76 -53 61 44 -81 -5 32 -32 2 15 -8 -45 14 -24 3 -32 34 -19 -16 0 77 -4 -34
2331 -34 35 45 -19 50 -26 -26 10 30 -26 -10 -25 26 -8 -3 42 -41 -14 -5 -60 10 -31 5 48 21 -8 -33 -39 -31 -12 -31 -42 -36 29
2364 29 -40 13 21 10 26 17 0 -2 24 5 10 -40 -21 -18 -22 -41 -7 3 -45 26 2 -9 -10 0 -22 -42 -7 -45 -58 1 -12 7 -9 23
2398 23 -33 -21 -34 -7 -6 -22 21 -24 10 -34 -45 12 9 -8 -9 25 -14 -22 -3 7 -31 10 -15 -45 -31 13 -11 -20 -64 27 40 -26 40
2431 40 -15 -15 -20 0 -1 31 14 -18 -22 11 -2 27 15 22 7 -13 -48 24 -42 -21 -33 12 23 -11 -18 3 -41 -7 -23 -43 -2 -42 29
2464 29 22 23 -33 -4 7 -29 -27 -3 -50 -26 53 -38 -31 34 27 -16 14 -14 -8 10 28 57 33 16 -98 36 17 -56 -71 -22 35 -2
2496 -2 30 -27 -5 -22 -4 51 22 -56 24 12 -32 31 9 50 13 15 20 1 -23 25 -19 -10 -42 -10 32 9 21 8 -10 11 42 10
$$ packed form
2271g9K8R8r2M3J5J2K2o9O6m0o0O1K1p6M6K6o0K7K8o5L3PM1Pq6N2L6n2L5k2j3
2302a0j2n6J25o2m3P5r3K3J14j7j25P6L7o4L4J3k3l7N9l8K7l5O6n3LJ6P7q1l0
2331c4O9J0o4O9p6%L6K0n6J6j5N1l4NM5q3K7Rn5P0m1L6M3k7k9k5oQJ9j9j1OO5
2364B9o9N3Qj1J6rj7kK6j9Nn0J9Lmj9L4J0m8P1k4j1jJ0k2k0L5l8j3N9j3J9j6L2
2398B3n6J2j3K7Jj6M3m5L4m4j1N7lj7jL4l9qJ9J0l8M1k5l0J4M4k4rm4R1J3o6O6
2431D0n5%nK0jL2j7l2mL3j3K9j2Pj5k0l5P2o6K1j2M5J1l4pK1m4L4j6k0M1m0P1
2464B9pJn6K9J1l6KK4m7K4P9r1PO5pm3L0k8OJ8J8K9k4j7j14J34j9p3j5M9N7l7
2496bL2n7K2j7J8N5k9p8Q0j2m4O3k2M1l7KNj9k4M8m4Rl2L2M2k3J2j3j8K1L1l2
$$ plain form
2528 10 0 34 -49 1 5 4 53 -9 -30 0 -5 -79 -27 -29 -87 25 -22 -54 -40 -13 24 5 24 19 -9 -52 -6 -37 57 26 16 -33
2560 -33 36 -40 -29 -23 0 -29 -53 61 -35 24 13 39 -12 22 30 30 -75 4 45 -41 -44 40 -15 -13 17 5 20 21 10 12 -12 12 10
2593 10 -25 -56 23 16 -22 21 13 36 12 -45 10 -12 -32 -10 -80 -36 -32 24 21 13 45 32 -12 -32 21 4 15 -2 -7 -24 27 27 -29 41
2627 41 7 1 -7 27 30 -42 -1 33 -16 8 24 -20 -41 -52 4 -7 20 -12 62 -8 -61 -9 11 -20 18 1 27 19 -15 17 -15 -3
2659 -3 22 34 3 12 7 -28 0 -15 -79 22 -37 0 -9 4 -8 -24 19 25 -41 -9 -22 -35 -1 10 -31 -1 -7 -17 6 56 -14 2 -16
2692 -16 -57 12 -11 15 -46 10 36 -14 -35 65 -13 -56 -28 -6 27 -16 3 -1 -17 -17 -4 21 -5 31 -37 10 -11 -30 -49 -54 32
2723 32 -14 39 -15 -50 12 43 27 -51 21 -31 23 -60 -5 -18 -15 22 -29 -4 -50 13 12 11 -37 -15 -19 9 11 40 24 25 6 -12 -70
2756 -70 17 12 -61 3 40 -98 62 -39 1 9 -60 13 1 -40 -37 35 18 -2 -36 17 38 55 48 -40 17 16 -19 -49 13 -45 4
$$ packed form
2528A0j0L4q3N0MjM9o2k1L0np4N2kn8J12m7l2J4K7L7j9J9nk8m3M6l1R4l1j0m9
2560c3O9p6J1OK3k9k4J14r6N9j1K6n1L4Q%j05P9M1q6lQ4n5KL0j2J5Jj1Kk4K4k
2593A0l5l1P9pl8M3qK3k4n7N5k2k0K2p0M4MN6lqL2j3m4k0N3j7J1j7nj7N1%n6P0
2627D1l4oqL4Lp2M1L4m9K4J6m4k1j1N6j1K7l2P4p0n3N2K0l1L8j7K6ql4L2l2J2
2659cK5J2l1Rnl5K8j5o4J01n9L7rJ3j2j6M3Oo6L2j3j3L4J1m1L0oj0K3N0p0J6j8
2692a6m1O9k3K6o1N6K6n0k1J00p8m3K8K2L3m3J9mj6%J3K5k6L6o8M7k1j9j9nQ6
2723C2m6N3n4l5O2L1j6p8P2n2N4q3N5j3LL7n1K5m6O3jjm8K2mK8KK9j6Jj9j8n8
2756g0Q7np3O4L7j38J60j01M0Qo9P3j2m1LP2j7k0l4N3K1J7pq8N7jl5l0O2n8M9
$$ plain form
2787 4 -13 -46 13 -13 -40 24 17 32 44 -1 39 -17 -41 27 -28 1 -47 -34 -4 -27 11 54 -30 -25 -39 4 26 6 19 77 10 -53
2819 -53 46 33 -12 14 -36 -3 49 59 3 -15 13 18 -7 -68 -23 23 25 34 7 42 23 6 6 -6 -47 -21 36 11 -84 31 -13 -37
2851 -37 19 -61 14 7 -16 9 71 1 -39 33 9 35 30 71 89 2 71 74 1 49 -8 36 -24 29 42 -6 -17 4 -16 9 26 -9
2883 -9 -5 11 0 -18 -11 -29 38 -36 -32 37 -30 -39 10 -16 -43 -11 -13 -11 28 -51 -35 25 18 -13 -21 -12 -25 37 -25 -14 -1 16 29 0 -22
2918 -22 36 -13 -17 -32 -9 -28 -41 4 14 15 4 20 -8 -32 5 21 -37 24 45 26 10 64 -17 -14 -19 15 14 -64 -47 22 -25 6 -7
2951 -7 58 50 62 -36 -3 35 -1 3 -1 -35 7 -14 -52 18 14 28 -29 2 33 -69 13 25 -37 57 -51 11 3 32 5 -20 4 -23
2983 -23 43 -13 -37 -26 -5 48 -24 -5 39 -12 10 -26 13 -4 7 23 -20 27 24 -23 -25 22 17 33 -50 -20 27 3 -39 -20 -52 -10
3015 -10 24 -8 26 -1 40 -27 14 38 20 -8 11 54 -52 -55 10 -26 -54 -18 38 -37 -73 18 12 57 12 35 31 34 -11 -4 -38 12
$$ packed form
2787Dj7l3N9k6k7O4pJ5J2m5M0n6k4O8n5K9m8J3L0k3L8M3q4Nj4M3K2k0J3N8o7o3
2819e3R9j3m5K6n0L3N2J0n6j8K8Nk5o1M5M6KRk7L5j9j7%j2m1K6N7k5r5J15m4k4
2851c7N6q0P5pk3K5O2p0m0P2k4K6nM1J8q7O9Lp3M8n7M4o0N3J3m8j1K1k0K5J7l5
2883iMJ6j1j8Pj8O7p4MO9o7rM9k6k7L2kKL9p9J6O0pl1qRj3O2o2J1J3J7J3k9k2
2918b2N8m9mj5K3j9j3M5J0Jj1J6k8k4L7J6n8O1K1j9j6N4q1LnL4jp8J7O9m7L1j3
2951gO5qJ2r8L3L8l6Mml4M2k1l8P0mJ4n7L1L1j02Q2J2o2R4j08O2qK9k7k5K4k7
2983b3O6n6k4J1K1N3p2J9M4n1K2l6L9j7J1J6m3M7lm7kM7nJ6q3L0M7k4m2J9l2M2
3015a0L4l2L4k7M1o7M1K4j8k8J9M3j06lO5l6k8L6N6p5l6R1oM5m5K3mLm5Pl4N0
$$ plain form
3047 12 -56 24 25 14 104 -21 7 -38 -35 -12 6 -39 20 35 -2 32 29 -32 34 1 30 -19 -39 -4 -41 -15 -40 -36 -24 25 38 -16
3079 -16 9 -9 -2 4 -20 4 0 27 -40 11 -4 6 36 -29 3 -6 17 -32 -43 -24 -27 -12 25 -9 33 3 -23 2 3 -7 -33 -16 -35
3112 -35 6 -53 60 13 23 20 -12 -4 58 -28 -26 2 3 59 -23 -60 -17 22 -29 -45 -23 44 1 -15 -2 -2 7 -62 50 -16 -7 -13 -84
3145 -84 24 25 8 -3 38 -40 10 -2 8 -2 -29 11 10 36 -37 13 10 -12 -9 -2 -6 14 41 6 -21 8 3 -18 -11 38 30 -18 -11 26 -17
3180 -17 40 72 -39 -39 5 -16 -35 60 55 -46 2 10 23 -26 -18 -50 -27 1 50 -4 -23 0 8 4 10 28 6 -25 3 43 -2 -33 -11
3213 -11 1 30 -75 -13 -2 -25 -13 -6 82 32 30 3 -20 8 59 6 -8 -27 8 -20 -2 -81 -1 2 12 -8 -31 58 -35 -15 -78
3244 -78 -51 65 17 2 21 35 -34 20 8 -10 5 -24 25 47 -11 0 25 14 15 -8 39 -10 24 6 31 8 25 1 -14 -6 31
3275 31 13 4 -12 45 -68 -6 -5 26 31 15 4 27 -15 3 -27 17 31 -1 18 -19 -29 -24 5 34 -1 -14 -5 -23 -9 -42 -46 41 -24
$$ packed form
3047A2o8Q0Jj1R0j25K8m5LK3J8m5N9J5l7L4lo1O6l3K9m9k0L5l7K6k5MJ2M9J3n4
3079a6K5j8POk4K4mK7o7N1j5J0L0o5L2rK3m9j1J9lJ5L7l4M2l0k6K5Jj0k6J7j9
3112c5M1n9J13m7J0ll2QO2q6KK8JN6q2l7M3L9n1j6K2O7m3j6J3%Ro9J12o6Rop1
3145h4J08Jj7j1M1p8N0j2J0j0k7M0jK6p3N0lk2LPmK0K7l5k7K9nk1PM9qm8PL7m3
3180a7N7L2j11%M4k1j9R5nj01M8QJ3m9Ql2K3K8M9n4j9K3QmOJ8k2l1K8M0m5l1K2
3213a1J2K9j05O2J1k3J2PQ8n0kk7k3K8N1n3j4j9L5k8J8p9Q0LJ0k0k3Q9r3K0o3
3244g8K7J16m8j5J9J4o9N4j2j8J5k9M9K2n8J1K5j1Jk3M7m9L4j8K5k3J7k4j5QL7
3275C1j8rj6N7j13O2JL1Nj6j1K3m2J8l0M4J4l2J9l7j0NK9K9l5j3Rj8J4l3mQ7o5
$$ plain form
3308 -24 35 24 -22 43 39 -9 -1 77 0 -14 -21 -32 -51 -7 -1 61 -11 16 -16 -81 6 -21 15 65 -5 -23 -38 -1 -13 30 -8 18
3340 18 6 29 0 -47 -56 -28 -5 32 12 9 -47 -43 -5 11 12 -60 -33 -17 -23 -30 39 -7 2 0 -15 22 -1 -21 -4 -1 -1 43 -14 44 -17
3375 -17 10 2 -3 56 20 -24 5 25 18 23 38 -57 -21 -46 21 -44 -51 14 4 22 20 -12 -9 -15 10 41 -7 -34 32 -38 -71 -16 -23 -36 14
3410 14 -17 -22 -9 -68 18 -47 8 29 1 15 10 5 43 -1 -34 9 53 -24 21 -5 -39 -42 -9 16 16 0 -33 -59 18 -18 -3 -40 -20
3443 -20 -14 -8 -8 80 -33 -31 -12 81 -44 0 -9 -12 -28 -33 -10 -10 2 -7 -3 -52 21 -7 -32 -57 -23 19 12 -43 -35 17 36 7 3 -69 -30 -16
3479 -16 5 13 32 1 28 12 1 -1 -32 -38 19 -22 -50 -11 14 26 -1 15 11 4 81 -2 -15 -83 -28 30 -7 -35 -49 26 -8 -15 -19 -21
3513 -21 -68 -12 45 11 52 6 13 -36 -29 -37 6 5 -29 50 -16 -2 5 -27 -56 51 40 37 -11 -46 10 -30 -4 62 -29 18 4 -10 -45
3546 -45 -38 -53 -36 -14 -31 -22 44 23 13 -33 15 31 -37 67 13 -10 -54 -27 8 62 -2 11 17 -7 11 7 -25 -31 -50 -41 -4 0 40
$$ packed form
3308b4N9j1m6O5mm8QP8p7j4pj1j9M4OO2p2K7l2o5Q7k7L6N0p0j8j5L7j2M3l8K6
3340A8j2K3k9m7rK8K3L7k0ln6ML8J6Jp2K7J6opO9m6Rkj5L7k3k0J7L%M4n7N8o1
3375a7K7qnN9l6m4K9K0pNJ5r5L6k5O7o5pO5j0J8kl2LoK5L1m8k7O6p0l3N5pj3N0
3410A4l1nJ3n9Q6o5N5K1k8J4nnL8m4l3M3M4p7M5k6l4lL3K5%j6l3k6P7l6J5l7K0
3443b0OO%Q8j13KJ9R3j25M4rlj6nK3%J2rMm9P3k8k5k5L4M2pn5QN2J9k9mp2L9J4
3479a6K1QJ9l1K7j6j1kl1oN7m1k8L9K5J2k7J6mpP7q3j3o8N5N8l7k8j4P5l4pmk
3513b1m7N6N7l4M1m6Pm9PqM3jl4P9o6J4Pl2k9J07j1lm8l5N6m0K6O6r1M7j4j4l5
3546d5Pj5J7K2j7RO6k1j0m6M8J6o8J04n4k3m4K7L5N4o4J3Ok4J8ml2oj9RL7MM0
$$ plain form
3579 40 -6 36 25 13 14 13 6 -28 -4 1 11 -30 4 38 -21 -11 -23 22 2 38 10 12 5 27 17 -18 -31 -22 10 15 -8 -17 14 -57 -25
3614 -25 -1 41 26 27 -11 -24 -21 -59 -16 41 -17 37 -17 12 37 -6 -27 -23 14 -38 33 -12 7 18 71 -46 -18 26 -2 9 -69
3645 -69 -24 48 -46 53 -2 -32 71 10 -5 19 -28 -11 -4 0 -10 0 -25 42 25 7 9 -9 -26 95 -43 -57 53 26 -4 44
3675 44 -13 -28 28 57 33 -24 0 26 30 -7 4 -5 -25 -21 36 12 -8 -17 -53 2 64 -26 -27 -13 -79 -30 7 14 -25 23 4 62 3
3708 3 4 -35 -11 26 4 23 -5 -6 -15 27 44 48 18 -9 13 -13 -54 57 5 -36 56 -38 2 -20 27 14 -17 3 -12 19 -43 25
3740 25 -10 -22 -29 17 -26 13 25 -24 36 13 13 -4 -25 21 -25 -21 20 -39 -15 43 -1 33 20 -11 28 -19 -33 -59 2 -55 -9 -18
3772 -18 -52 -12 -3 -91 -38 -54 -34 -66 -25 -17 32 -32 14 -20 8 -7 38 24 -3 -23 -1 -10 -36 34 -20 45 -22 16 10 -3 -14 -14 -13
3805 -13 40 -42 7 -12 -5 -16 23 -48 15 26 -27 -62 13 -22 1 4 -25 -11 -9 10 24 -33 28 -27 -43 13 36 -11 34 6 -9 24
$$ packed form
3579D0m6M2j1j2Jjpl4K4NJ0m1L4L4n9J0j2M5k0L6k8KpK2j0l5j3RL2Nk3rL1p1L2
3614b5K4M2j5Jl8j3Ll8M3N7n8N4n4K9K5m3k1ML7n2P1m5J9J1N3j17K8M4k8J1p8
3645f9M5P2r4R9n5l0J03o1j5K4m7J7PMj0J0k5O7j7j8Kj8j7J21j38j4J10k7l0M8
3675D4n7j5N6K9k4n7K4K6Ml7J1rk0MN7k4k0rl6N5O2r0jJ4o6M9L7Pl9M8j9N8n9
3708CJl9K4L7k2J9k8jrM2J7Ml0k7K2k6m1J11n2m1R2r4M0k2M7j3l1K0j5L1o2O8
3740B5l5j2pM6m3L9J2m9O0k3%j7k1M6m6MM1n9K4N8m4L4j3l1L9m7j4k6O1n7M6r
3772a8l4M0Rq8N3j6K0l2M1QM9o4M6l4K8j5M5j4k7k0K2rk6P0n4O5o7L8oj3j1%J
3805a3N3q2M9j9Pj1L9p1O3J1n3l5P5l5K3Lk9J4KJ9J4n7O1n5j6N6K3m7M5k8j5L3
$$ plain form
3837 24 11 -23 11 3 -58 -8 8 -35 -13 -40 29 -13 -3 7 -30 12 22 13 5 -52 -53 60 25 -51 14 -52 -21 2 -5 -24 -69 1
3869 1 -55 31 10 49 24 -19 -22 -30 4 18 75 0 14 -39 -23 -19 -10 1 20 0 -20 7 -7 -30 -44 -16 -3 5 14 -38 -50 46 -5 5
3903 5 26 0 21 16 -10 49 -14 0 18 -22 13 -18 -25 42 12 48 -30 -6 -34 -29 7 -7 46 5 6 7 -56 -48 -26 1 26 -15 -16 -63
3937 -63 18 13 -32 -20 39 62 27 -15 24 25 -3 -23 -8 -3 -56 -29 4 -24 29 10 -42 11 -6 18 -14 -42 -7 53 27 -34 -38 4
3969 4 37 64 -13 24 -17 28 11 -6 -61 -28 0 -18 49 -7 -19 1 23 41 -17 -6 -12 41 9 -14 30 17 -47 2 23 -37 -37 43
4001 43 -15 39 -12 12 2 33 4 35 -33 61 -42 -16 39 30 2 51 -11 -1 -17 -19 -36 14 -21 -54 -8 -43 11 1 -15 23 -39
4032 -39 11 40 2 9 -57 49 -27 -49 20 21 43 -26 23 3 -19 -9 -52 -33 -17 6 2 -15 35 -17 -36 38 58 32 -40 12 -2
4063 -2 -26 -27 3 -28 -75 -4 8 18 -36 3 -44 -29 4 -33 9 54 -22 3 11 -5 8 -22 29 22 -14 -26 -33 -10 -11 -51 10 3 -31 -61
$$ packed form
3837B4j3l4L4qo1N0J6m3K2k7O9m2J0J0l7M2J0rqn7jJ13l5p6O5o6L1K3pj9m5P0
3869An6Q6k1L9k5m3lqL4J4N7p5J4n3J6MRJ1J9k0k0K7j4k3j4K8J3QRn2j2R6n1J0
3903EK1k6K1nk6N9o3J4J8m0L5l1pO7l0L6p8K4k8NL6j4N3m1JJo3QK2K7K5m1jm7
3937f3Q1nm5J2N9K3l5m2L9Jk8k0J5Nn3K7L3k8N3j9n2N3j7K4l2k8L5O0k6o1mM2
3969DL3K7p7L7m1M5j7j7n5L3K8j8O7n6j2K0K2J8n8J1oN3l2k3M4j3o4M9K1o0%Q0
4001D3n8N4n1K4j0L1k9L1o8R4j03K6N5rk8M9o2J0j6kj7N0l5l3M6l5N4j0j6L8o2
4032c9N0K9l8Po6J06p6k2O9JK2o9M9k0k2J0m3J9J6K3mj7N0n2j9P4K0k6p2N2j4
4063bk4jL0l1m7P1J2J0n4L9m7J5L3l7M2M5p6K5Qj6J3l0N1pl6j2pK3jm0O1pl4l0
$$ plain form
4097 -61 12 -36 11 34 10 -19 5 -16 -44 3 -43 -48 10 5 18 1 5 -61 50 46 -16 9 14 36 35 25 49 -11 2 5 -1 36 22 -29
4131 -29 -11 -30 -6 35 -33 42 2 -3 54 0 -45 -54 -13 12 34 2 32 35 -27 60 22 -42 40 5 -26 -51 47 -53 -11 -6 5 72
4163 72 33 31 18 16 20 43 -12 -23 33 46 -1 -1 -18 -29 -23 -11 -28 -49 -11 37 25 -4 33 7 11 6 8 66 19 52 -37 10 28 1
4197 1 12 -6 19 -11 -10 -20 32 -12 4 -18 -28 37 31 19 14 -4 12 42 -37 -31 -35 -36 2 -28 20 28 -45 13 -39 -54 -18 -27 -10 19 -11
4232 -11 -5 17 -18 -42 -26 -20 -5 13 12 27 -18 3 26 -10 10 1 20 12 16 -50 -3 -22 -11 -54 -24 54 -19 -20 39 14 -2 -29 -7 -36
4266 -36 43 -32 -18 14 -23 39 -7 -33 -16 -49 17 18 -22 56 31 25 36 19 3 -12 -1 7 6 39 30 24 4 -28 -7 -10 -28 39 21 -78
4300 -78 -37 -16 -34 27 10 -18 -3 -4 -75 -35 62 2 -14 9 0 42 -6 -8 -13 -15 -16 50 -60 -19 30 -30 1 -13 -4 -25 1 -61 62
4333 62 -4 -33 -43 27 53 -19 15 29 -11 46 38 21 -25 21 -32 -70 25 -51 8 35 -21 5 -15 48 -7 -13 -29 43 7 -42 34
$$ packed form
4097f1P3m8M7K3k4k9K4k1k8M7m6nN8nJ3j7Mo6J11mo2K5NK2jj0K4o0J3LoL7j4n1
4131b9J8j9K4M1o8P5m0nN7n4m5rM1K5K2l2L0Lo2Q7l8o4Q2l5l1k5R8j00M2NJ1O7
4163G2l9kj3kMK3n5j1N6J3m7%j7j1OJ2j7k1L8M8j2k9L7k6MnKN8m7L3q9M7J8k7
4197AJ1j8K5l0Jj0N2m4J6k2j0O5oj2nj8J6L0p9OmjL8l0M8Qp3N8n2j5L6rJ7K9l0
4232a1OK2l5k4J6OJ5J8jJ5m5K1K3l6K0rJ9qMo6M7j9J1m3L0P8p3jN9k5j6k7K2k9
4266c6P9p5J4L2l7O2m6k6J7l3O6Jm0P8k5oJ1j7j6j5J1QjL3rok0l2K1lj8O7j8r9
4300g8M1K1j8O1j7k8J5jp1M0R7o0j6K3rM2m8knkjO6j10M1M9o0L1j4Rk1K6o2J23
4333F2o6k9j0P0K6p2L4J4m0N7qj7m6M6n3l8R5p6N9K7n6K6k0O3n5oj6P2l6m9P6
$$ plain form
4364 34 1 -12 26 0 29 -9 40 4 28 21 -20 0 32 -7 -27 20 38 -51 14 -17 -21 -30 21 25 64 2 -14 11 11 -54 -16 5 76
4397 76 -3 14 38 3 10 15 69 -15 32 -28 42 -21 2 46 -11 55 -31 22 51 -38 -30 -45 -30 79 47 -18 35 3 27 45 -21
4428 -21 28 22 -1 -4 22 -26 3 -23 -14 -29 21 -1 -28 6 -9 51 17 -3 53 20 -33 -44 -68 20 -41 40 -3 38 -6 -1 60 -10
4460 -10 22 32 -8 20 11 40 33 -41 26 -3 26 8 -39 -7 9 -12 -34 -28 27 -21 -15 -25 -11 -10 -22 27 28 -35 -4 -3 16 -64 2 -30
4494 -30 -36 -8 2 28 8 -20 -7 51 -13 5 4 1 -13 29 -34 -13 15 -2 23 28 -8 2 -37 24 9 -26 3 26 -15 -21 42 -36 4
4527 4 -20 -64 37 35 26 23 -18 0 47 -65 46 -17 25 -10 -44 -1 -47 52 16 4 43 -6 4 -32 -30 -32 15 7 20 -13 65 -28
4559 -28 0 -33 -45 -22 11 -8 45 13 4 -3 -15 27 20 53 -34 -13 6 -24 14 13 -19 -34 -1 10 24 -15 -22 34 28 -19 0 -43 -16
4592 -16 -26 -14 0 39 23 44 -28 -54 23 -14 -6 -27 -11 -32 -34 -34 4 -3 36 -16 -28 31 -10 32 4 7 51 14 9 -17 -17 -2 -28 15
$$ packed form
4364C4l3j3L8k6K9l8M9l6K4pm1K0L2l9k0M7J8q9O5l1mrN1ML9o2j6K5%o5L8K1P1
4397G6p9J7K4l5PNN4q4M7o0P0o3K3M4n7O6q6N3K9q9Qj5J5J09l2o5N3l2K4J8o6
4428b1M9ok3lK6m8K9k6Rj5N0k2k7L4j5O0l4k0N6l3n3j1k4Q8o1Q1m3M1m4NO1p0
4460a0L2J0m0K8rK9pp4O7k9K9j8m7L2J6k1k2ON5m8Oj0J4Jj2M9Jo3L1JJ9q0O6l2
4494c0oK8J0K6k0k8J3N8o4J8jlj4M2o3K1K8j7K5Nl6J0l9O1j5l5K9K3m1oO3p8M0
4527Dk4m4J01krlm1J8M7j12J11o3M2l5l4M3m6R9l6j2L9m9J0l6KkM7qJ3l3P8r3
4559b8K8l3j2K3L3j9N3l2rpj2M2pL3q7K1J9l0L8jl2j5L3J1J4l9pN6om7J9m3K7
4592a6j0J2J4L9j6K1p2k6P7l7Qk1J6k1k%L8pL9n2j2N9m1M2k8LM4l7nk6%J5k6M3
$$ plain form
4626 15 -26 -25 39 -58 -28 -41 31 10 -18 9 -7 -10 -36 -27 16 64 -1 3 9 -34 45 24 -20 -51 -39 41 1 26 -46 35 -40 -4 -41
4659 -41 -6 21 28 -10 25 81 12 27 14 51 7 12 4 23 -21 -7 10 14 -2 -14 6 -28 11 -13 9 65 3 3 87 -5 9 -18 -27
4692 -27 -14 -59 15 -40 -37 3 43 29 13 7 -1 -25 21 2 -33 61 -46 -14 -10 -47 26 17 21 -9 7 7 -2 -16 27 14 34 9 -5 67
4726 67 7 -1 50 8 -49 71 57 -13 -7 26 -45 16 39 -20 -20 -28 -12 8 26 39 -6 -13 11 18 23 -47 31 -30 15 9 25 9 -23 -12
4760 -12 7 -65 -20 23 2 -35 -17 -98 -11 0 8 40 31 -12 13 0 -6 -25 -20 -31 -19 16 -53 -22 8 9 40 -9 22 11 -19 64 4
4793 4 -54 -12 -9 -20 -47 -12 -55 3 36 27 37 25 40 -19 5 17 -52 -13 -26 30 -7 -7 37 -22 -3 37 -47 -89 18 -3 36 -10
4825 -10 25 -26 32 12 3 4 -16 25 44 -25 -13 -55 17 21 -8 -8 14 46 -43 -37 2 15 -7 51 30 -2 -22 -36 -3 22 -59 -27 -2
4858 -2 -23 -11 -35 -43 -10 64 -8 37 -8 -41 -64 -15 9 20 -11 -54 -18 -54 -25 -31 -25 6 -35 7 3 16 -39 -12 14 2 4 -15 9
$$ packed form
4626A5m1JO4r7L0j3P2k1k8K7j6lk6RM3M8o5MOm3P9k1m4l1J2Q0m0K5p2Q1p5L6l7
4659d1L5K7Pl8L5N6o9J5j3L7m4NqJ9m4J4J7Mj6j2K0l4L9k4K2N6o2%Q4r2J4k7r
4692b7J3m5P4n5LM0M0j4j6oqk4M6j9l5R4j07L2Ml7P3rMl0J6%rj4M3j3K0k5j4P2
4726F7o0qN1m2n7J20j4p0OL3p1O1K3n9%qJ6K0J8J3m5pK4PNp0P8o1M5oJ6j6l2J1
4760a2J9p2M5M3k1l7J8q1Q7J1QL2rm3K5j3oj9Nj1J2L5o9L1L0JL1m9L1j1l0Q3o0
4793Dn8M2Lj1k7L5m3N8L3rJ0j2J5n9K4J2o9L9j3N6l7%M4n9J9M0q4m2J07k1L9m6
4825a0L5n1N8k0rJk0M1J9o9J2m2P2Mk9%K2L2q9OL9J3k2N8k1l2k0j4L3K5q1L2K5
4858bk1J2k4qL3P4p2M5m5l3k3M9K4J1l1m3L6l6K9oOL1m1M2mJ3n5K7K6j2Kj9K4
$$ plain form
4891 9 6 4 -12 52 28 -21 -18 -23 1 13 11 -35 -10 17 -12 -15 -2 26 -96 -10 39 -50 0 -25 13 -37 -43 1 0 15 28 26 -23 21 -43
4926 -43 -3 -31 -11 61 -22 13 -63 15 -22 10 46 26 -41 19 36 39 -81 -36 12 -46 11 19 -10 -43 51 -37 52 -27 31 31 -23
4957 -23 -23 -53 34 -21 28 11 -38 74 44 -39 -3 57 29 18 11 -16 -9 20 -14 -55 39 16 -6 -2 22 45 26 45 -45 12 -61 10
4989 10 11 -55 -5 6 -32 48 -16 -8 12 -39 -66 -5 -17 -65 8 -9 -24 -27 -17 -20 -22 -53 15 -13 -38 -33 -3 -26 3 62 8 -1 7 -32
5023 -32 57 -15 7 3 -19 -24 66 13 10 -19 5 -9 -49 -31 18 -23 -18 -7 25 -45 -22 -27 49 25 -8 -43 18 24 -36 -14 8 -57 -11
5056 -11 16 41 -27 -52 -25 -45 8 -27 7 0 19 28 16 -4 -10 -27 -7 -9 -9 -43 51 44 -8 19 1 -3 1 -24 78 -16 -38 14 -18 -34
5090 -34 16 -40 19 -42 -10 -5 -3 36 -54 -21 0 -32 -1 12 19 -41 26 8 -39 9 -31 20 -63 -48 -26 38 -51 -26 -43 -5 -34 -10
5122 -10 6 -10 9 -56 38 -11 -7 -20 0 29 5 32 1 -4 -40 30 5 1 -9 -28 -8 -17 -9 10 14 4 46 -34 25 12 -37 58 25
$$ packed form
4891Ilkj6O4k4m9LnK4J2km6K5K7k9lJ3K8j22Q6M9q9N0k5L8n0oM4jJ5J3km9M4o4
4926d3M0k8K0P2q3L5p6P8l7L2L6k0o7O0J7Lj20M5M8n8N7Qk9l3R4q8Q9p9N8%n4
4957b3%l0Q7n5M9j7m9J12l0q3L6O0k8j1pk7PK9l4m1R4k3k2MK4K3j9J9r0N7p3P1
4989A0Jo6N0J1l8Q0o4QK0n1k7O1j2m8P3j7j5lJ0lkl1O8k8k5NL0k3K9N9n4rQl9
5023c2Q9p2K2mk2nR0n3lk9K4j4m0J8M9m1NJ1L2p0K3nP6k4l3l5O1Oo0K2K2o5M6
5056a1K7K5o8k5K7k0N3l5L4pJ9Rj2k0oj7K0k%l4R4pn2K7j8mMk5J02r4k2N2l2j6
5090c4N0n6N9o1L2NKL9r0L3K1l2L1J3Po0O7j8m7M8m0N1q3J5K2O4q9K5j7L8k9K4
5122a0J6j6J9o5R4m9Mj3K0K9k4K7l1nl6P0k5mj0j9K0rQJ9Mj0M2q0N9j3m9R5l3
$$ plain form
5155 25 -51 36 17 -8 -65 -86 -14 56 6 -92 -41 18 6 -8 11 28 55 -19 13 27 -30 15 -28 6 -7 3 -46 -9 20 12 -20
5186 -20 33 -30 -36 14 -50 -8 -36 38 3 13 15 -17 41 38 -29 75 8 39 -42 34 24 -43 -25 0 -21 29 37 -43 0 18 -20 -2
5218 -2 34 -21 18 -37 -20 42 1 -39 29 47 -32 -30 34 5 15 -32 -59 22 -5 -59 8 -7 74 5 -6 -38 9 -12 -29 -13 0
5249 0 -31 32 27 49 -36 -16 5 18 -7 -6 39 -21 15 38 0 -46 -17 9 6 -13 0 25 12 14 11 -10 10 -13 -36 11 -36 -38 -6 -22
5283 -22 -38 -2 5 -16 15 27 -25 61 69 -18 -2 -13 -15 16 14 35 -27 -10 -18 12 38 -15 -3 -23 -39 -32 -11 -24 -10 45 29 -8 5
5316 5 -44 -8 -40 7 -36 3 -23 16 28 -39 -26 -30 -48 7 -7 -53 40 -38 -12 -17 -8 29 -13 -3 -18 31 12 66 -8 -44 -7 -36
5348 -36 7 -4 26 4 -11 5 -17 -26 5 -42 -14 -6 0 15 -14 -42 -62 -17 -25 11 -27 65 9 10 60 -8 -9 -39 -44 3 -26 30 -40 28
5382 28 64 29 27 -28 -41 -42 23 10 29 57 -9 -24 -11 33 37 50 -32 -60 -29 -13 5 -42 43 4 -18 -29 -21 9 -36 26 13 -56
$$ packed form
5155B5p6Q7j9k5n7k1P2P0n0r8N1N9j2j4J9J7K7p4L2J4n7M5m3L4j3J0m9L7K9ql2
5186b0N3o3oN0o4M2k8P4l5J0Kl2N8lo7J04o7L1q1P6j0o7J8K5k1N0Qq0M3J8l8J8
5218bL6n5L9n5J7O2m1m0O8J8p9KO4k9J0m7k7Q1k7n4O7j5Q1o9j1l2M7k1j7J6J3
5249@l1O3nK2q5K0K1J3k5JM5o0L6K3l8m6K9K6lj9J3K5j3Klk1K0k3k3M7m7kL2j6
5283b2j6L6Pk1L1J2n2Q6Qq7J6j1kL1kK1o2J7qL0K6n3J2k0j6PK1j3J4N5j6l7J3
5316Em9L6l2M7m3L9k6L9J2o7J3mj8N5j4m6R3p8K6nRL7m2J0j5M9j9N4p4l6L7k9
5348c6M3j1L0k2j5J6k2rL1m7K8QOJ5k9k8k0M5qL6l8R2n6JN0o8jl0nM7k9N6p0O8
5382B8L6l5kn5j3jO5j3J9K8o6j5J3M4MJ3q2k8L1J6J8m7Q5l9k2j1QL0m5O2j3o9
$$ plain form
5414 -56 -6 17 23 9 -1 -36 -14 4 -10 -47 28 31 10 -12 -55 38 -6 -6 51 -30 10 -37 -24 15 -37 -27 8 -3 -45 -23 -5 -34
5446 -34 24 -39 -26 -10 -13 52 2 -92 25 4 -11 25 -32 -22 -30 43 -5 6 20 2 -24 14 37 -57 54 13 -10 31 37 -19 -26
5477 -26 -6 -19 -27 -44 -56 35 6 -99 -7 7 31 -50 -31 -1 29 24 -2 -16 -23 11 -5 25 10 -54 -16 -33 5 -28 -11 53 9
5508 9 -22 22 -50 13 35 4 -57 5 -14 33 62 -17 11 60 -23 -21 -7 -29 23 -18 32 17 16 3 -18 48 -18 -8 6 6 4 -61 -3
5541 -3 60 28 19 -11 89 -19 25 9 58 10 61 33 33 -11 -15 38 41 62 -20 -19 7 1 -25 12 -2 -53 32 -34 -27 5 11 -16 -15 21
5575 21 -24 9 -21 -47 30 17 26 39 21 19 -66 36 -8 -2 4 -4 -39 -10 -22 -32 5 31 -46 -11 48 -10 5 -21 -18 43 16 -17 65
5608 65 22 -2 -8 -25 -6 -14 33 3 59 -49 -26 -63 -1 5 31 6 12 -17 26 -1 -63 -57 20 -48 12 46 14 0 -12 -24 -2 -26
5640 -26 -47 1 -24 18 18 -16 51 -27 28 -3 -7 8 -17 23 21 -19 25 -16 14 -3 -28 -33 47 44 47 34 -61 0 6 22 -36 7 35 12
$$ packed form
5414e6N0K3Oj4j0l5K2J8j4l7P5Lk1k2m3R3m4%N7q1M0m7J3L9n2J0L5j1m2K2J8k9
5446c4N8o3J3J6lO5n0r4J17k1j5L6n7J0qP3m8J1J4j8k6L8K3r4J11m1k3M1On6p
5477b6K0j3qj7j2R1k9j05R2J4K4q1J9L0L0nk6j4pL4j6L0j5o4L8j7L8l3J7O4m4
5508Il1M4p2O3K2l1o1O2j9M7K9p9K8M9q3KJ4k2N2m1N0j5jj3k1O6o6J0J4%ko5N8
5541cO3l2rl0J00j08M4j6M9m8N1k8%m4mN3LK1q2JK6ok6L7j4n1Q5o6PL2Ok7JL6
5575B1m5L3l0k6P7j3RJ3j8kq5J02m4OOql5K9j2j0L7K6p7L5N9n8J5k6LO1k7l3Q2
5608F5m3k4oj7J9qM7l0N6j08K3l7O2OK6k5Ok9M3k7o2OP7o8O0L4l2j4j2j2K2k4
5640b6k1M8k5M2%l4O7p8N5l1mJ5k5M0km0M4m1L0j7k5nQ0lLj3r5O1OJ6n8M3K8k3
$$ plain form
5674 12 81 19 -10 -15 -38 3 -29 55 -25 7 5 15 -11 -44 -3 -20 -36 15 -60 26 -10 60 -52 -42 25 -50 -19 -6 -40 -24 35
5705 35 -18 -21 -55 -6 -41 54 39 -7 4 -22 3 4 12 33 -18 -6 54 -58 32 6 38 5 -3 18 -76 -8 14 4 -33 -14 -37 44
5737 44 45 -11 26 -32 11 -33 -1 34 -103 4 -11 21 -36 15 30 6 -4 -65 21 -37 -25 -44 -33 -14 4 -8 43 -59 12
5766 12 17 45 40 33 -15 -15 0 -18 -29 1 43 -55 -30 19 -9 5 -6 10 -43 29 13 49 27 55 -12 -17 65 16 22 29 -43 44 -10 -41
5800 -41 9 40 -24 -11 -5 -9 -48 -27 36 50 35 -19 15 3 -31 16 13 -7 44 -31 -39 3 -8 -19 10 18 26 28 -20 0 17 -3 -31 13
$$ packed form
5674A2O9o2k9nk3M1l2Q4q0L2kJ0k6l3M1j7j6N1p5Q6l6P0j12J0O7p5L1J3l4J6N9
5705C5n3ll4M9l5R5j5m6J1k6K5JQK1n1J2O0j12R0k6L2l3qK1r4O8K2j0l7J9k3Q1
5737D4Jn6L7n8M3m4L2L5j37J07j5L2n7N1J5k4j0o1Q6n8J2j9J1J9J8j2N1j02P1
5766A2NK8npm8%J5j8j1L0M2r8K5M9k8J4j1J6n3P2j6L6k2K8o7nQ2m9OPp2Q7n4l1
5800d1N0L1o4J3Oml9K1O3J4j5n4L4j2l4M7lk0N1p5qM2j1j1K9QQKm8K0J7k0k8M4
$$ [...]
8191e
##END NTUPLES=NMR FID
##END=
