##TITLE=1H_Pr 5291-Q
 200.13Hz, CDCl3.
 8 sc
 
 13.4.2026
##JCAMPDX= 6.0         $$ Bruker NMR JCAMP-DX V2.0
##DATA TYPE= NMR FID
##DATA CLASS= NTUPLES
##ORIGIN= UXNMR, Bruker Analytische Messtechnik GmbH
##OWNER= pz
$$ XWIN-NMR		Version 3.5
$$ Mon Apr 13 14:12:39 2026 Russian Standard Time (UT+4h)  she@DPX200
##.OBSERVE FREQUENCY= 200.1313
##.OBSERVE NUCLEUS= ^1H
##.DELAY= (6, 6)
##.ACQUISITION MODE= SIMULTANEOUS
##.ACQUISITION SCHEME= undefined
##.AVERAGES= 8
##.DIGITISER RES= 18
##SPECTROMETER/DATA SYSTEM= spect
##.PULSE SEQUENCE= zg30
##.SOLVENT NAME= CDCl3
##.SHIFT REFERENCE= (INTERNAL, CDCl3, 0, 14.3821)
##AUDIT TRAIL= $$ (NUMBER, WHEN, WHO, WHERE, WHAT)
$$ ##TITLE= Audit trail, XWIN-NMR		Version 3.5
$$ ##JCAMPDX= 5.01
$$ ##ORIGIN= Bruker BioSpin GmbH
$$ ##OWNER= she
$$ F:/spectra/data/she/nmr/H-C/1/audita.txt
$$ ##AUDIT TRAIL=  $$ (NUMBER, WHEN, WHO, WHERE, WHAT)
(   1,<2026-04-13 14:11:27.46 +0400>,<she>,<DPX200>,
      <created by zg, POWCHK disabled, PULCHK disabled
       configuration hash MD5:
       00 E9 B6 7A A2 85 ED C7 34 08 36 98 17 FE 4E 26
       data hash MD5: 16K
       54 9D DA A1 2E 01 72 F0 F0 16 60 14 47 80 E4 D8>)
$$ ##END=
$$ 
$$ hash MD5
$$ EE ED F3 D9 02 D9 19 B2 E9 C0 D1 80 FD A6 A1 8D
##$RELAX= 
##$RELAX= 
##$RELAX= 
##$RELAX= 
##$RELAX= 
##$RELAX= 
$$ Bruker specific parameters
$$ --------------------------
##$DU= <F:/spectra>
##$EXPNO= 1
##$NAME= <H-C>
##$PROCNO= 1
##$TYPE= <nmr>
##$USER= <she>
##$AMP= (0..31)
100 100 100 100 100 100 100 100 100 100 100 100 100 100 100 100 100 100 
100 100 100 100 100 100 100 100 100 100 100 100 100 100 
##$AQSEQ= 0
##$AQ_mod= 1
##$AUNM= <au_zg>
##$AUTOPOS= <>
##$BF1= 200.13
##$BF2= 200.13
##$BF3= 200.13
##$BF4= 200.13
##$BF5= 200.13
##$BF6= 200.13
##$BF7= 200.13
##$BF8= 200.13
##$BYTORDA= 1
##$CFDGTYP= 0
##$CFRGTYP= 5
##$CHEMSTR= <none>
##$CNST= (0..31)
1 1 145 1 1 1 1 1 1 1 1 1 1 1 1 1 1 1 1 1 1 1 1 1 1 1 1 1 1 1 1 1 
##$CPDPRG= <>
##$CPDPRG1= <>
##$CPDPRG2= <>
##$CPDPRG3= <>
##$CPDPRG4= <mlev>
##$CPDPRG5= <mlev>
##$CPDPRG6= <mlev>
##$CPDPRG7= <mlev>
##$CPDPRG8= <mlev>
##$CPDPRGB= <>
##$CPDPRGT= <>
##$D= (0..31)
0 0.7 0 0 0 0 0 0 0 0 0 0.03 0 0 0 0 0 0 0 0 0 0 0 0 0 0 0 0 0 0 0 0 
##$DATE= 1776075086
##$DBL= (0..7)
120 120 120 120 120 120 120 120 
##$DBP= (0..7)
150 150 150 150 150 150 150 150 
##$DBP07= 0
##$DBPNAM0= <>
##$DBPNAM1= <>
##$DBPNAM2= <>
##$DBPNAM3= <>
##$DBPNAM4= <>
##$DBPNAM5= <>
##$DBPNAM6= <>
##$DBPNAM7= <>
##$DBPOAL= (0..7)
0.5 0.5 0.5 0.5 0.5 0.5 0.5 0.5 
##$DBPOFFS= (0..7)
0 0 0 0 0 0 0 0 
##$DE= 6
##$DECBNUC= <off>
##$DECIM= 32
##$DECNUC= <off>
##$DECSTAT= 4
##$DIGMOD= 1
##$DIGTYP= 9
##$DL= (0..7)
0 120 120 120 120 120 120 120 
##$DP= (0..7)
150 150 150 150 150 150 150 150 
##$DP07= 0
##$DPNAME0= <>
##$DPNAME1= <>
##$DPNAME2= <>
##$DPNAME3= <>
##$DPNAME4= <>
##$DPNAME5= <>
##$DPNAME6= <>
##$DPNAME7= <>
##$DPOAL= (0..7)
0.5 0.5 0.5 0.5 0.5 0.5 0.5 0.5 
##$DPOFFS= (0..7)
0 0 0 0 0 0 0 0 
##$DQDMODE= 0
##$DR= 18
##$DS= 0
##$DSLIST= <SSSSSSSSSSSSSSS>
$$ [...]
##$SUBNAM0= <"">
##$SUBNAM1= <"">
##$SUBNAM2= <"">
##$SUBNAM3= <"">
##$SUBNAM4= <"">
##$SUBNAM5= <"">
##$SUBNAM6= <"">
##$SUBNAM7= <"">
##$SUBNAM8= <"">
##$SUBNAM9= <"">
##$SW= 18.0517328524113
##$SWIBOX= (0..15)
0 0 2 0 0 0 0 0 0 0 0 0 0 0 0 0 
##$SW_h= 3612.71676300578
##$TD= 16384
##$TD0= 1
##$TE= 0
##$TE2= 300
##$TE3= 300
##$TEG= 300
##$TL= (0..7)
0 120 120 120 120 120 120 120 
##$TP= (0..7)
150 150 150 150 150 150 150 150 
##$TP07= 0
##$TPNAME0= <>
##$TPNAME1= <>
##$TPNAME2= <>
##$TPNAME3= <>
##$TPNAME4= <>
##$TPNAME5= <>
##$TPNAME6= <>
##$TPNAME7= <>
##$TPOAL= (0..7)
0.5 0.5 0.5 0.5 0.5 0.5 0.5 0.5 
##$TPOFFS= (0..7)
0 0 0 0 0 0 0 0 
##$TUNHIN= 0
##$TUNHOUT= 0
##$TUNXOUT= 0
##$USERA1= <user>
##$USERA2= <user>
##$USERA3= <user>
##$USERA4= <user>
##$USERA5= <user>
##$V9= 5
##$VALIST= <valist>
##$VCLIST= <CCCCCCCCCCCCCCC>
##$VD= 0
##$VDLIST= <DDDDDDDDDDDDDDD>
##$VPLIST= <PPPPPPPPPPPPPPP>
##$VTLIST= <TTTTTTTTTTTTTTT>
##$WBST= 1024
##$WBSW= 4
##$XGAIN= (0..3)
0 0 0 0 
##$XL= 0
##$YL= 0
##$YMAX_a= 561037
##$YMIN_a= -582140
##$ZGOPTNS= <>
##$ZL1= 120
##$ZL2= 120
##$ZL3= 120
##$ZL4= 120
##$ABSF1= 10
##$ABSF2= 0
##$ABSG= 5
##$ABSL= 3
##$ALPHA= 0
##$AQORDER= 0
##$ASSFAC= 0
##$ASSFACI= 0
##$ASSFACX= 0
##$ASSWID= 0
##$AUNMP= <proc_1d>
##$AZFE= 0.1
##$AZFW= 0.1
##$BCFW= 1
##$BC_mod= 2
##$BYTORDP= 1
##$COROFFS= 0
##$CY= -3
##$DATMOD= 1
##$DC= 2
##$DFILT= <>
##$DTYPP= 0
##$F1P= 0
##$F2P= 0
##$FCOR= 0.5
##$FTSIZE= 0
##$FT_mod= 4
##$GAMMA= 1
##$GB= 0.15
##$INTBC= 1
##$INTSCL= 1
##$ISEN= 128
##$LB= 0.25
##$LEV0= 0
##$LPBIN= 0
##$MAXI= 10000
##$MC2= 0
##$MEAN= 0
##$ME_mod= 0
##$MI= 1.114404
##$NCOEF= 0
##$NC_proc= 0
##$NLEV= 6
##$NOISF1= 3.799351
##$NOISF2= 2.8
##$NSP= 1
##$NTH_PI= 0
##$NZP= 0
##$OFFSET= 14.38212
##$PC= 1
##$PHC0= -3871.882
##$PHC1= 18.79231
##$PH_mod= 1
##$PKNL= yes
##$PPARMOD= 0
##$PSCAL= 0
##$PSIGN= 0
##$REVERSE= no
##$SF= 200.129724274929
##$SI= 16384
##$SIGF1= 3
##$SIGF2= 2
##$SINO= 400
##$SIOLD= 16384
##$SREGLST= <1H.CDCl3>
##$SSB= 0
##$STSI= 0
##$STSR= 0
##$SW_p= 3205.1282051282
##$SYMM= 0
##$S_DEV= 0
##$TDeff= 0
##$TDoff= 0
##$TI= <>
##$TILT= no
##$TM1= 0
##$TM2= 0
##$TOPLEV= 0
##$USERP1= <user>
##$USERP2= <user>
##$USERP3= <user>
##$USERP4= <user>
##$USERP5= <user>
##$WDW= 1
##$XDIM= 8192
##$YMAX_p= 0
##$YMIN_p= 0
$$ End of Bruker specific parameters
$$ ---------------------------------
##NTUPLES= NMR FID
##VAR_NAME=  TIME,          FID/REAL,        FID/IMAG
##SYMBOL=    X,             R,               I
##VAR_TYPE=  INDEPENDENT,   DEPENDENT,       DEPENDENT
##VAR_FORM=  AFFN,          ASDF,            ASDF
##VAR_DIM=   8192,          8192,            8192
##UNITS=     SECONDS,       ARBITRARY UNITS, ARBITRARY UNITS
##FACTOR=    0.0002768,     1,               1
##FIRST=     0,             0,               0
##LAST=      2.2672688,     0,               0
##MIN=       0,             -582140,         0
##MAX=       2.2672688,     561037,          0
$$ Real data points
##PAGE= N=1
##DATA TABLE= (X++(R..R)), XYDATA
$$ plain form
0 0 0 0 0 0 0 0 0 0 0 0 0 0 0 -6 5 0 8 -8 8 -12 16 -16 24 -28 32 -36 44 -52 60 -68 78 -92 107 -119 134 -154
36 -154 173 -196 219 -244 274 -305 341 -375 419 -465 513 -565 623 -687 757 -833 916 -1009
54 -1009 1113 -1228 1352 -1495 1656 -1840 2050 -2294 2577 -2911 3302 -3743 4170 -4218 1609
69 1609 34181 561037 35716 -493778 225279 324796 -344857 -85088 424228 -200692 -453715
80 -453715 344539 329970 -449044 -120288 485936 -54324 -373962 273115 227969 -419856
90 -419856 -89568 413632 -115653 -350886 268059 219003 -340502 230 398175 -163890
100 -163890 -368888 263566 236420 -333354 -101642 295955 -64983 -187955 248096 97224
110 97224 -337523 22908 360257 -133494 -332567 171321 200093 -199167 -39000 207230
$$ packed form
0@%%%%%%%%%%%%%oJ1nQj6J6k0K8l2M0n2O0o8Q0r6J12j28J46j70J99k26K53k88
36a54L27l69M15m63N18n79O46p16P94q84R78j078J188j310J444j590J749j925
54a009K122k341K580k847L151l496L890m344M871n488O213p045P913q388N827
69A609L2572N26856n25321n29494P19057R9517o69653K59769N09316o24920k53023
80d53715P98254j4569p79014L28756O06224n40260l19638O47077m5146o47825
90d19856L30288N03200n29285k35233O18945m9056n59505L40732L97945n62065
100a63890k04998O32454k7146n69774K31712L97597l60938j22972M36051j50872
110I7224m34747L60431L37349m93751j99073N03888K8772l99260J60167K46230
$$ plain form
120 207230 -91688 -151690 218936 96187 -282477 -38972 254262 -59951 -207096 131819
130 131819 127797 -167265 -14052 203039 -54802 -176915 104938 99557 -157039 -29815 158937
141 158937 -60236 -143962 144979 135603 -167480 -86923 161206 19587 -136505 31928 63347
152 63347 -101930 7225 162639 -49344 -166704 101223 154165 -124614 -112746 110192
162 110192 21938 -105122 55780 79737 -113857 -27741 163189 -11995 -162179 57461
172 57461 119216 -112430 -70597 135597 3864 -132313 67844 115488 -104192 -55876 124551
183 124551 -22552 -130385 85082 95971 -143833 -51835 170986 6753 -146046 52818
193 52818 97378 -97882 -28237 116636 -56623 -122399 118980 98814 -149416 -43461 157039
$$ packed form
120B07230k98918o0002L70626j22749l78664K43505K93234l14213j47145L38915
130A31819m022k95062J53213K17091k57841j22113K81853n381k56596J27224J88752
141A58937k19173q3726K88941r376l03083Q0557K48129j41619j56092J68433L1419
152F3347j65277J09155J55414k11983j17360K67927N2942k78779J1868K22938
162A10192q8254j27060J60902K3957j93594Q6116J90930j75184j50184K19640
172E7461O1755k31646M1833K06194j31733j36177K00157M7644k19680M8316J80427
183A24551j47103j07833K15467J0889k39804R1998K22821j64233j52799J98864
193E2818M4560j95260O9645J44873j73259o5776K41379k0166k48230J05955K00500
$$ plain form
204 157039 -13566 -124088 71543 62902 -122391 -1563 134475 -65120 -116480 119427
214 119427 75886 -141111 -8445 139880 -59833 -113385 107905 56870 -135279 9384
224 9384 131324 -70868 -90126 126498 34786 -153632 25974 143053 -87341 -109275 122030
235 122030 46556 -130756 29938 117061 -94085 -73934 140557 16241 -157741 41799
245 41799 137122 -93881 -87594 128596 23541 -133260 47211 111724 -107208 -69900 138578
256 138578 7496 -145280 53830 121424 -102775 -69961 135022 9754 -135846 52922
266 52922 108471 -105476 -60538 134572 -1123 -136687 63067 112878 -110796 -65811 135376
277 135376 4087 -135102 55804 105001 -106428 -54801 136422 -4293 -136273 65028
$$ packed form
204A57039j70605j10522J95631q641j85293J20828J36038j99595n1360K35907
214A19427m3541k16997J32666J48325j99713n3552K21290n1035j92149J44663
224I384J21940k02192j9258K16624r1712j88418J79606J17079k30394k1934K31305
235A22030p5474j77312J60694Q7123k11146K0151K14491j24316j73982J99540
245D1799R5323k31003O287K16190j05055j56801J80471O4513k18932L7308K08478
256A38578j31082j52776J99110O7594k24199L2814K04983j25268j45600J88768
266E2922N5549k13947M4938J95110j35695j35564J99754M9811k23674M4985K01187
277A35376j31289j39189J90906M9197k11429N1627J91223j40715j31980K01301
$$ plain form
287 65028 110792 -111251 -62379 135330 605 -133558 60386 105306 -108944 -55835 135577
298 135577 -4469 -135501 62542 106765 -110024 -58838 134087 -725 -131267 60625
308 60625 104283 -105946 -55083 131685 -3205 -130696 60408 104027 -105361 -57699 128610
319 128610 -19 -127163 56283 99854 -102270 -54705 126638 -1543 -126661 56867
329 56867 102390 -99496 -56735 124051 2053 -122594 53703 97863 -98245 -54302 122618
340 122618 -480 -123721 53439 99250 -96852 -56749 119688 2810 -119237 50863
350 50863 95449 -93280 -52219 117897 676 -117779 51569 95686 -92116 -55016 114043
361 114043 4135 -113826 45678 90367 -86609 -50888 108730 1244 -110027 47134
$$ packed form
287F5028M5764k22043M8872J97709j34725j34163J93944M4920k14250N3109J91412
298A35577j40046j31032J98043M4223k16789N1186J92925j34812j30542J91892
308F0625M3658k10229N0863J86768j34890j27491J91104M3619k09388M7662J86309
319A28610j28629j27144J83446M3571k02124M7565J81343j28181j25118J83528
329E6867M5523k01886M2761J80786j21998j24647J76297M4160j96108M3943J76920
340A22618j23098j23241J77160M5811j96102M0103J76437j16878j22047J70100
350E0863M4586j88729M1061J70116j17221j18455J69348M4117j87802L7100J69059
361A14043j09908j17961J59504M4689j76976L5721J59618j07486j11271J57161
$$ plain form
371 47134 89687 -85219 -52021 106753 6038 -105983 41193 85790 -78436 -48233 100097
382 100097 2261 -101642 43210 82553 -80548 -48676 100306 4523 -101266 38697 81522
393 81522 -73938 -45838 94036 2038 -94331 42853 76843 -77471 -43120 97302 2079
404 2079 -97000 38997 77102 -72228 -43016 89228 -254 -89260 41511 70111 -74487
415 -74487 -37246 92025 -2455 -90597 41700 72225 -70702 -38999 85614 -257 -81762
426 -81762 39381 61416 -70174 -29257 85689 -9455 -85262 44073 66595 -69968 -35468
437 -35468 80557 -2549 -74138 39957 53232 -68141 -20777 82787 -14617 -79308 47679
448 47679 59981 -70471 -28194 78625 -9548 -71736 43288 48576 -68532 -16461 77899
$$ packed form
371D7134M2553j74906L3198J58774j00715j12021J47176M4597j64226L0203J48330
382A00097r7836j03903J44852L9343j63101L1872J48982r5783j05789J39963M2825
393H1522j55460K8100J39874r1998r6369J37184L3990j54314L4351J40422r5223
404B079r9079J35997L8105j49330K9212J32244q9482q9006J30771K8600j44598
415g4487L7241J29271r4480q8142J32297L0525j42927L1703J24613q5871q1505
426h1762J21143K2035j31590M0917J14946r5144p5807J29335K2522j36563L4500
437c5468J16025q3106p1589J14095J3275j21373M7364J03564r7404o4691J26987
448D7679J2302j30452M2277J06819q8173o2188J15024N288j17108N2071R4360
$$ plain form
459 77899 -20164 -70902 53558 49978 -75511 -18774 82946 -14494 -72084 44323 46280 -63720
471 -63720 -9650 70444 -29337 -63307 61598 42811 -81890 -15636 83001 -15797 -67505 43725
483 43725 38110 -62232 -572 69161 -35075 -60573 63542 39390 -78403 -8906 78037
494 78037 -23487 -62650 50907 35308 -67592 -2549 67779 -32206 -54119 60134 27739
505 27739 -77321 4799 81104 -34437 -67560 57065 41135 -66314 -5027 61501 -33293
516 -33293 -43993 65828 18174 -85466 10320 86788 -37095 -70718 54989 38132 -63490
527 -63490 1773 59894 -40320 -43691 70898 20181 -84384 9296 80729 -38017 -60982
538 -60982 60041 30010 -71087 4540 67041 -36548 -48488 59516 17353 -71984 17552
$$ packed form
459G7899r8063n0738J24460l580j25489N6737J01720r7440n7590J16407J957j10000
471f3720N4070Q0094r9781l3970J24905j8787j24701O6254R8637r8798n1708J11230
483D3725n615j00342O1660O9733j04236k5498J24115k4152j17793O9497Q6943
494G8037j01524l9163J13557j5599j02900O5043P0328r9985k1913J14253l2395
505B7739j05060Q2120P6305j15541l3123J24625j5930j07449O1287O6528r4794
516c3293j0700J09821m7654j03640R5786P6468j23883l3623J25707j6857j01622
527f3490O5263N8121j00214l371J14589n0717j04565R3680P1433j18746k2965
538f0982J21023l0031j01097P5627O2501j03589j1940J08004m2163q9337Q9536
$$ plain form
549 17552 70446 -50077 -56784 72331 34349 -76943 -4017 65984 -26412 -39985 52980 5819
561 5819 -70543 27952 73848 -55196 -62132 70214 36643 -71429 -3368 58354 -31823 -35912
573 -35912 59401 7588 -73329 22716 71990 -47313 -53572 65285 25272 -71767 6584 64637
585 64637 -35801 -45938 54822 16981 -61888 16323 56027 -48282 -40836 70857 19151
596 19151 -79599 4372 72225 -24591 -47884 41600 15029 -49727 21596 49523 -53423 -41497
608 -41497 71944 24217 -76186 -2477 64372 -21146 -40716 41229 10672 -53285 19412 53648
620 53648 -44272 -41316 61016 20452 -65407 6608 59859 -31283 -44250 47653 20016 -53914
632 -53914 6885 46661 -34263 -30050 56058 8188 -67615 14168 66233 -31997 -51299 42438
$$ packed form
549A7552N2894j20523o707J29115l7982j11292P2926P0001r2396j3573R2965m7161
561E819p6362R8495M5896j29044o936J32346l3571j08072O8061O1722r0177m089
573c5912R5313n1813q0917R6045M9274j19303o259J18857m0013r7039P8351N8053
585F4637j00438j0137J00760l7841p8869P8211L9704j04309P446J11693n1706
596A9151r8750Q3971O7853r6816k3293Q9484k6571o4756P1323K7927j02946J1926
608d1497J13441m7727j00403P3709O6849q5518j9570Q1945l0557o3957P2697L4236
620E3648r7920K956J02332m0564q5859P2015N3251r1142j2967R1903k7637p3930
632e3914O0799L9776q0924M213Q6108m7870p5803Q1783N2065r8230j9302R3737
$$ plain form
644 42438 25709 -43666 6523 37994 -36334 -24900 58965 8035 -68929 9308 63239 -26530
656 -26530 -45913 38241 19301 -43464 9640 40614 -34627 -28831 51789 10632 -57731 11289
668 11289 53161 -30995 -38297 45572 18123 -49760 4577 42445 -26757 -26779 42214 3443 -51200
681 -51200 19790 50178 -38452 -39134 49014 20897 -48138 2494 37830 -25364 -19557 43671 -1420
694 -1420 -52229 21940 49621 -37865 -36793 45299 14856 -45452 8597 36154 -30025 -20119 44368
707 44368 753 -47590 20223 41460 -36893 -26317 47028 6811 -47620 13091 38507 -29361
719 -29361 -21045 38650 -1500 -40443 23160 33179 -40955 -20375 49491 3441 -47315 14497
731 14497 35707 -28497 -15971 37408 -6104 -37901 26888 30617 -41403 -16564 47193 -1360
$$ packed form
644D2438j6729o9375N0189L1471p4328J1434Q3865n0930p6964P8237N3931q9769
656b6530j9383Q4154j8940o2765N3104L0974p5241N796Q0620m1157o8363O9020
668A1289M1872q4156p302Q3869k7449o7883N4337L7868o9202k2O8993l8771n4643
681e1200P0990L0388q8630o82Q8148k8117o9035N0632L5336o3194N807O3228m5091
694a420n0809P4169K7681q7486J072Q2092l0443o0308N4049K7557o6179R906O4487
707D4368m3615m8343O7813K1237p8353J0576P3345m0217n4431O0711K5416o7868
719b9361Q316N9695m0150l8943O3603J0019p4134K0580O9866m6050n0756O1812
731A4497K1210o4204J2526N3379m3512l1797O4789L729p2020K4839O3757m8553
$$ plain form
743 -1360 -43484 18614 30477 -32772 -12711 38786 -8069 -36810 26495 26863 -38825 -10322 44329
756 44329 -7222 -39969 23748 28455 -34435 -11235 37661 -8203 -33139 25244 21273 -37684
768 -37684 -6153 41507 -10717 -37557 24544 25751 -33060 -8538 35625 -9042 -29896 25483
780 25483 19227 -35657 -4311 38433 -11600 -33888 24497 21934 -33328 -6611 34719 -10282
792 -10282 -29682 24450 18338 -33614 -3327 36400 -11928 -31178 25625 20742 -33290 -5510
804 -5510 34891 -10380 -29510 23949 17891 -33166 -3447 35124 -12266 -30538 25079 19440 -33189
817 -33189 -4740 34810 -10735 -29400 24372 18794 -32310 -3829 34570 -11380 -29489 24531
829 24531 18606 -33033 -4453 34517 -11183 -29816 23938 18635 -32436 -4083 34313 -11393
$$ packed form
743a360m2124O2098J1863o3249K0061N1497m6855k8741O3305L68o5688K8503N4651
756D4329n1551l2747O3717M707o2890K3200M8896m5864k4936N8383l971n8957
768c7684L1531M7660n2224k6840O2101J207n8811K4522M4163m4667k0854N5379
780B5483o256n4884L1346M2744n0033k2288N8385k563n5262K6717M1330m5001
792a0282j9400N4132o112n1952L0287L9727m8328j9250N6803m883n4032K7780
804e510M0401m5271j9130N3459o058n1057K9719L8571m7390j8272N5617n639n2629
817c3189K8449L9550m5545j8665N3772n578n1104K8481L8399m5950j8109N4020
829B4531n925n1639K8580L8970m5700j8633N3754n303n1071K8353L8396m5706
$$ plain form
841 -11393 -29203 24821 18751 -32726 -3645 34843 -11400 -29221 25010 18265 -33411 -3640
853 -3640 34804 -12150 -29799 24761 17845 -33108 -2857 34206 -13078 -28571 26416 17460 -33872
866 -33872 -2233 35168 -12468 -28585 25337 16769 -32649 -1574 33196 -14069 -27629 26042
878 26042 15779 -33449 -1589 33508 -13217 -27146 25045 15744 -31359 -952 31885 -13162
890 -13162 -25346 25100 14415 -31468 -465 31676 -13426 -25952 24008 14650 -30281 -1208
902 -1208 29781 -12756 -23851 23719 12951 -29802 523 30274 -13246 -24239 23787 14019
914 14019 -29013 -688 28678 -12397 -22678 22705 11939 -28846 484 28405 -13404 -23102
926 -23102 22974 12753 -28187 -166 27948 -11866 -21741 21947 11975 -26813 767 26883
$$ packed form
841a1393j7810N4024o070n1477K9081L8488m6243j7821N4231o745n1676K9771
853c640L8444m6954j7649N4560o916n0953L0251L7063m7284j5493N4987q956n1332
866c3872L1639L7401m7636j6117N3922q568m9418L1075L4770m7265j3560N3671
878B6042j0263m9228L1860L5097m6725j3929N2191r301m7103L0407L2837m5047
890a3162j2184N0446j0685m5883L1003L2141m5102j2526M9960r358m4931K9073
902a208L0989m2537j1095M7570j0768m2753L0325K9751m3520j0993M8026r768
914A4019m3032K8325K9366m1075j0281M5383j0766m0785K9330K7921m1809r698
926b3102M6076j0221m0940K8021K8114l9814r875M3688r972l8788K7580K6116
$$ plain form
938 26883 -12872 -21230 22432 11458 -27781 -121 27038 -11926 -21763 20615 11456 -25659 712
951 712 25397 -12629 -19759 22327 10728 -26891 1155 26778 -12148 -20871 20865 10850 -25507
964 -25507 946 24375 -13158 -18866 21958 8777 -26875 2703 26011 -13714 -19921 22025
976 22025 10168 -25276 2097 23904 -13201 -16961 22098 6752 -26177 4787 24794 -15652
988 -15652 -18856 22641 8519 -25538 2720 22576 -13527 -15251 21384 4885 -24493 6906
1000 6906 23084 -16530 -16260 23356 6935 -24935 3866 21454 -13736 -13807 20145 2830 -22884
1013 -22884 8041 20339 -17787 -14181 23522 5039 -24388 5126 20627 -13432 -12051 19552
1025 19552 1732 -20985 9294 18202 -18250 -11704 23271 2611 -24240 6355 19588 -14396
$$ packed form
938B6883l9755q358M3662j0974l9239K7660K7159l8964r837M2378r159l7115K6371
951G12K4685l8026p130M2086j1599l7619K8046K5623l8926q723M1736j0015l6357
964b5507K6453K3429l7533n708M0824j3181l5652K9578K3308l9725o207M1946
976B2025j1857l5444K7373K1807l7105l760L9059j5346l2929L0964K0007m0446
988a5652l204M1497j4122l4057K8258J9856l6103j724L6635j6499k9378L1399
1000F906J6178l9614K70L9616j6421l1870K8801J7588l5190p1L3952j7315k5714
1013b2884L0925J2298l8126L606L7703j8483k9427K9514J5501l4059J381L1603
1025A9552j7820k2717L0279Q908l6452O546L4975k0660k6851L0595J3233l3984
$$ plain form
1037 -14396 -11838 18715 1312 -19197 9341 15896 -17850 -8838 23368 761 -23634 7739
1049 7739 19666 -14097 -11687 17402 1177 -17482 8827 13457 -17726 -7390 22432 -470
1061 -470 -22909 7994 18899 -13760 -10974 17128 1568 -16514 8446 13122 -16270 -6479 21000
1074 21000 -1498 -21758 8979 17913 -15299 -11390 17840 2196 -17213 6913 12562 -14737
1086 -14737 -5218 19907 -2936 -20890 11076 18368 -16461 -11754 18760 3242 -17058 6031
1098 6031 11759 -14290 -4533 19266 -4122 -20864 11412 17799 -16813 -11291 19024 2782 -17063
1111 -17063 6559 12536 -13741 -4880 18351 -3429 -18955 11411 15650 -17586 -9741 19865 1567
1124 1567 -18864 5922 13359 -12536 -5374 16344 -3882 -16742 12791 14315 -18687 -8602 21437
$$ packed form
1037a4396K558L0553j7403k0509K8538O555l3746R012L2206k2607k4395L1373
1049G739J1927l3763K410K9089j6225j8659K6309M630l1183J0336K9822k2902
1061d70k2439L0903J0905l2659K786K8102j5560j8082K4960M676k9392R791K7479
1074B1000k2498k0260L0737Q934l3212L909K9230j5644j9409K4126N649k7299
1086a4737R519K5125k2843j7954L1966P292l4829M707L0514j5518k0300K3089
1098F031N728k6049R757K3799k3388j6742L2276O387l4612N522L0315j6242j9845
1111a7063K3622N977k6277Q861K3231k1780j5526L0366M239l3236P845K9606j8298
1124A567k0431K4786P437k5895P162K1718k0226j2860K9533J524l3002J0085L0039
$$ plain form
1137 21437 1717 -19275 5672 13383 -11935 -4942 15443 -4854 -16284 13079 13167 -19060 -7729
1150 -7729 20897 449 -18736 6986 13237 -12563 -4830 15798 -3754 -15070 12100 11456 -17859
1163 -17859 -5393 20180 -1909 -19005 8059 13626 -12962 -6235 14484 -2855 -13184 11258
1175 11258 9320 -17347 -3313 20425 -2706 -18765 8459 13943 -12220 -5980 13614 -3003
1187 -3003 -12473 11007 8394 -17156 -3115 19154 -3348 -17792 9070 12731 -12976 -5240 14497
1200 14497 -2609 -12454 10299 8253 -15295 -1826 17574 -4882 -16331 10512 11782 -14316
1212 -14316 -5566 14557 -2223 -12262 9025 7087 -14163 -490 16554 -5815 -15247 11355
1224 11355 11375 -13919 -4918 14201 -2246 -11413 8793 6320 -13565 -410 15207 -6137 -14015
$$ packed form
1137B1437j9720k0992K4947P711k5318O993K0385k0297j1430K9363Q8l2227J1331
1150g729K8626k0448j9185K5722O251k5800P733K0628j9552j1316K7170o44k9315
1163a7859J2466K5573k2089j7096K7064N567k6588O727K0719j7339j0329K4442
1175A1258j938k6667J4034K3738k3131j6059K7224N484k6163O240J9594j6617
1187c003r470K3480k613k5550J4041K2269k2502j4444K6862L661k5707P736J9737
1200A4497j7106r845K2753k046k3548J3469J9400k2456j1449K6843J270k6098
1212a4316Q750K0123j6780j0039K1287j938k1250J3673J7044k2369r432K6602
1224A1355K0k5294R001J9119j6447r167K0206k473j9885J3155J5617k1344p878
$$ plain form
1237 -14015 10825 9572 -13814 -3593 13944 -2940 -11132 8842 6470 -12321 -62 13645
1249 13645 -5996 -11890 11056 7797 -13970 -2560 13793 -3476 -11258 8161 5966 -11486 105
1262 105 12177 -6257 -10420 11237 6853 -13374 -1530 13462 -3574 -10411 8173 5619 -10937
1275 -10937 46 11241 -5882 -9648 10085 5678 -12705 -1031 12433 -4014 -9930 8156
1287 8156 5712 -10371 -81 10825 -4950 -8662 9423 5140 -11812 -513 11809 -4340 -9832
1300 -9832 7967 5468 -10427 -643 10437 -4636 -8528 8882 4899 -11160 -64 11603 -4391
1313 -4391 -9329 8475 5711 -10483 -661 10570 -4465 -8654 8401 4649 -11108 -198 11171
1326 11171 -4860 -9323 8524 5565 -10729 -493 10917 -4285 -8576 8588 5045 -10790 -13
$$ packed form
1237a4015K4840j253k3386J0221J7537j6884q192J9974k372j8791J2259J3707
1249A3645j9641n894K2946l259k1767J1410J6353j7269p782J9419k195j7452J1591
1262A05J2072j8434m163K1657m384k0227J1844J4992j7036o837J8584k554j6556
1275a0937J0983J1195j7123l766J9733m407j8383J1674J3464j6447n916J8086
1287H156k444j6083J0290J0906j5775l712J8085m283j6952J1299J2322j6149n492
1300i832J7799k499j5895R784J1080j5073l892J7410l983j6059J1096J1667j5994
1313d391m938J7804k764j6194R822J1231j5035m189J7055l752j5757J0910J1369
1326A1171j6031m463J7847k959j6294J0236J1410j5202m291J7164l543j5835J0777
$$ plain form
1339 -13 11045 -4795 -9075 8660 5020 -11097 -352 10867 -4735 -8985 8461 4929 -10795
1352 -10795 24 10784 -4838 -8446 9130 4713 -11031 397 11214 -5048 -8827 8842
1364 8842 4560 -10868 321 10394 -5553 -8249 9207 3906 -11287 969 10944 -5600 -8228
1377 -8228 9388 4241 -10841 983 10531 -5577 -7684 9286 3383 -10989 1476 10284 -6389
1390 -6389 -7961 9508 3557 -11033 1109 10108 -5617 -7099 9064 2909 -10366 2180 10001
1403 10001 -6414 -7181 9592 3195 -10699 1331 9603 -5821 -6843 8634 2352 -10124 2146
1416 2146 9132 -6430 -6506 9359 2661 -10219 1968 9389 -5720 -6291 8716 2343 -9582 2188
1430 2188 8489 -6305 -5933 8943 1888 -10111 2025 8807 -5887 -6041 8307 2108 -8872 2272
$$ packed form
1339a3J1058j5840m280J7735l640j6117J0745J1219j5602m250J7446l532j5724
1352a0795J0819J0760j5622l608J7576m417j5744J1428J0817j6262l779J7669
1364H842m282j5428J1189J0073j5947k696J7456n301j5193J2256R975j6544k628
1377h228J7616n147j5082J1824R548j6108k107J6970n903j4372J2465Q808j6673
1390f389j572J7469n951j4590J2142Q999j5725j482J6163o155j3275J2546P821
1403A0001j6415p67J6773o397j3894J2030Q272j5424j022J5477o282j2476J2270
1416B146O986j5562p6J5865o698j2880J2187P421j5109n71J5007o373j1925J1770
1430B188O301j4794L72J4876p055j1999J2136O782j4694j54J4348o199j0980J1144
$$ plain form
1444 2272 8027 -5834 -5167 8752 1748 -9399 2323 8441 -5755 -5757 7825 1812 -8668 1964
1458 1964 7419 -5783 -5070 8026 1409 -8773 2421 7947 -5541 -5147 7916 1939 -8297 2057
1472 2057 7357 -5280 -4722 7402 1097 -8206 2449 7158 -5884 -4988 7731 1546 -8282 1971
1486 1971 7100 -4996 -4422 7231 1163 -7676 2666 6882 -5636 -4485 7652 1297 -8194 1990
1500 1990 6899 -5109 -4604 6888 1050 -7489 2377 6562 -5441 -4097 7553 1088 -7960 2444
1514 2444 7161 -4984 -4616 6831 1332 -7138 2128 6003 -5393 -3857 7264 536 -8081 2495
1528 2495 6985 -5144 -4543 6830 1441 -6875 2316 5837 -5112 -3194 7203 278 -7690 2925
1542 2925 6584 -5593 -4307 6886 992 -7123 2074 5480 -4965 -2960 6789 -230 -7090 3553
$$ packed form
1444B272N755j3861O67J3919p004j1147J1722O118j4196kJ3582o013j0480J0632
1458A964N455j3202P13J3096o617j0182J1194N526j3488L94J3063n977j0236J0354
1472B057N300j2637N58J2124o305r303J0655M709j3042Q96J2719o185r828J0253
1486A971N129j2096N74J1653o068q839J0342M216j2518J151J2137o355r491J0184
1500A990M909j2008N05J1492n838q539R866M185j2003J344J1650o465r048J0404
1514B444M717j2145L68J1447n499q470R266L875j1396J536J1121o728q617J0576
1528B495M490j2129O01J1373n389q316R191L521j0949J918J0397o925p968J0615
1542B925L659j2177J286J1193n894q115R197L406j0445K005R749p019o860J0643
$$ plain form
1556 3553 6241 -5815 -3772 7305 1015 -6944 2155 5356 -4765 -2693 6286 -699 -6820 3587
1570 3587 5545 -6204 -3541 7274 700 -6916 2274 5351 -4477 -2401 6050 -720 -6021 3928
1584 3928 5006 -6251 -2907 7271 94 -7065 2331 5180 -4543 -2527 5605 -858 -5577 3990
1598 3990 4450 -6202 -2261 7451 -151 -6879 2723 5280 -4502 -2439 5380 -866 -5278 3802 3765
1613 3765 -6284 -1871 7223 -744 -6919 3022 5251 -4563 -2541 5460 -481 -4807 3703 3432 -5912
1628 -5912 -1237 7063 -1203 -6831 3301 5165 -4962 -2727 5178 -520 -4717 3365 3118 -5620 -854
1643 -854 6741 -1518 -6386 3844 5015 -5008 -2396 5514 -375 -4611 3169 2812 -5328 -562 6139
1658 6139 -2189 -6041 4085 4501 -5457 -2289 5625 -329 -4455 2991 2815 -4728 -156 5722 -2325
$$ packed form
1556C553K688j2056K043J1077o290p959R099L201j0121K072Q979o985o121J0407
1570C587J958j1749K663J0815o574p616R190L077r828K076Q451o770n301R949
1584C928J078j1257L344J0178p177p159R396K849r723K016Q132o463m719R567
1598C990M60j0652L941R712p602o728R602K557r782K063P819o246m412R080l7
1613C765j0049M413R094p967o175R941K229r814K022Q001n941m326Q510k71r344
1628e912M675Q300q266n628J0132J864j0127K235P905n698m197Q082k47q738M766
1643h54P595q259m868J0230J171j0023K612P910n889m236P780l57q140M766O701
1658F139q328l852J0126M16r958L168P914n954m126P446j76p543M572N878q047
$$ plain form
1673 -2325 -5417 4343 4227 -5606 -2244 5487 -451 -4668 2603 2557 -4476 -251 5247 -2264 -4985 4354
1689 4354 3830 -5444 -1771 5684 -367 -4679 2562 2868 -4106 -426 4726 -2199 -4540 4143 3158 -5621
1705 -5621 -1611 5750 -564 -4746 2509 3056 -3736 -507 4475 -1951 -4015 4160 2980 -5428 -1223
1720 -1223 5673 -769 -4901 2436 2964 -3854 -810 4222 -1769 -3913 3849 2756 -5115 -879 5609
1735 5609 -907 -4737 2797 3304 -3846 -930 4174 -1493 -3703 3480 2280 -5095 -641 5349 -1441
1750 -1441 -4798 2951 3241 -3950 -994 4269 -1294 -3442 3497 2226 -4786 -247 5259 -1550 -4613
1765 -4613 3152 2956 -4239 -967 4113 -1432 -3524 3281 1953 -4578 -56 4911 -1828 -4136 3471
1780 3471 2795 -4259 -602 4312 -1415 -3411 3206 1795 -4338 43 4453 -2157 -3857 3491 2251
$$ packed form
1673b325l092R760j16r833L362P731n938m217P271m6p033M225N498p511k721R339
1689D354n24r274L673P455o051m312P241L06o974L680N152o925k341Q683r85q779
1705e621M010P361o314m182P255N47o792L229M982o426k064Q175j180q408M205
1720a223O896o442m132P337N28o818L044N032n991k144P762j093p871M236O488
1735E609o516l830P534N07p150K916N104n667k210P183j200p375M454N990o790
1750a441l357P749K90p191K956N263n563k148O939j271p012M539N506o809l063
1765d613P765j96p195L272N080n545k092O805j328o531M522M967o739k308P607
1780C471o76p054L657M914n727j996O617j411o133M381M410o610j700P348j240
$$ plain form
1795 2251 -4289 -442 4236 -1450 -3240 3160 1782 -4007 300 4182 -2054 -3320 3437 1979 -4203
1810 -4203 -260 3966 -1631 -3188 2895 1522 -3796 160 3779 -2049 -3005 3431 1804 -3918 133
1825 133 4004 -1582 -2898 3018 1549 -3687 174 3478 -1954 -2801 3063 1326 -3926 204 3677
1840 3677 -1766 -2856 3012 1479 -3493 209 3450 -1672 -2506 3019 1287 -3621 356 3555 -1939
1855 -1939 -2811 2958 1391 -3572 101 3316 -1708 -2551 2852 1194 -3442 425 3462 -1780 -2495 3091
1871 3091 1370 -3530 186 3385 -1646 -2621 2763 1078 -3453 348 3039 -2037 -2515 3046 1176
1886 1176 -3635 323 3459 -1645 -2522 2827 1215 -3163 561 3085 -2017 -2263 3082 951 -3695
1901 -3695 328 3383 -1837 -2494 2735 1054 -3192 512 3001 -1925 -2030 3140 875 -3480 716
$$ packed form
1795B251o540L847M678n686j790O400j378n789M307L882o236j266O757j458o182
1810d203L943M226n597j557O083j373n318L956L619n828r56O436j627n722M051
1825A33L871n586j316N916j469n236L861L304n432q47N864j737n252M130L473
1840C677n443j090N868j533m972L702L241n122q34N525j732m908L977L199n494
1855a939q72N769j567m963L673L215n024q43N403j658m636L867L037n242p15N586
1871C091j721m900L716L199n031r75N384j685m531L801K691n076m78N561j870
1886A176m811L958L136n104q77N349j612m378L724K524n102k46N345k131m646
1901c695M023L055n220o57N229j681m246L704K489m926j05N170k265m355M196
$$ plain form
1916 716 3292 -1921 -2304 2850 991 -3241 483 2697 -2015 -1960 2846 551 -3375 805 3093 -2054
1932 -2054 -2156 2900 1054 -3003 562 2772 -1824 -1654 2814 370 -3239 928 2849 -2130 -2072 2768
1948 2768 736 -3095 441 2518 -1768 -1590 2708 439 -2861 1042 2761 -1983 -1840 2761 725
1963 725 -2947 499 2492 -1689 -1681 2370 316 -2758 806 2446 -2085 -1684 2752 664 -2828 638
1979 638 2573 -1513 -1544 2350 458 -2517 827 2311 -1953 -1595 2553 452 -2857 474 2394 -1621
1995 -1621 -1608 2292 484 -2471 798 2325 -1722 -1363 2613 475 -2670 734 2429 -1735 -1628 2263
2011 2263 447 -2545 597 2037 -1790 -1400 2393 265 -2639 807 2314 -1720 -1501 2425 555
2026 555 -2403 696 2090 -1663 -1225 2350 125 -2550 851 2044 -1916 -1465 2355 317 -2510 779
$$ packed form
1916G16K576n213l83N154j859m232L724K214m712N5M806k295l926M180K288n147
1932b054j02N056j846m057L565K210m596J70M468k444l609M167J921m979N8M840
1948B768k032l831L536K077m286J78M298k269l300L903J719m744J43M601k036
1963G25l672L446J993m181QM051k054l074L564J640m531M01M436k088l492L466
1979F38J935m086l1L894j892k975L344J484m264L58M148k101l309L331J920m015
1995a621J3L900j808k955L269J527m047L59L976k138l145L404J695m164J07L891
2011B263j816k992L142J440l827L90L793k128k904L446J507m034K19L926j870
2026E55k958L099J394l753M38L575k225k675L401J193l960M51L820k038k827L289
$$ plain form
2042 779 2012 -1617 -1147 2268 217 -2238 1028 1964 -1851 -1172 2448 156 -2525 711 1965 -1650
2058 -1650 -1227 2054 -42 -2149 1010 1691 -1973 -891 2421 107 -2324 977 2007 -1617 -1093 2051
2074 2051 30 -2002 1024 1491 -1942 -856 2264 -183 -2353 974 1837 -1697 -1027 2002 79 -1840
2090 -1840 998 1436 -1692 -546 2240 -220 -2238 1115 1794 -1763 -1127 1929 19 -1947 822 1207
2106 1207 -1681 -491 2122 -392 -2079 1284 1826 -1769 -911 2069 129 -1780 899 1258 -1599 -471
2122 -471 1908 -553 -2051 1261 1489 -1954 -908 2155 74 -1870 778 1229 -1383 -325 1791 -492
2138 -492 -1757 1540 1410 -1962 -739 2094 -8 -1993 686 1196 -1401 -438 1578 -575 -1584 1410
2154 1410 1294 -1876 -637 2183 27 -1824 811 1371 -1328 -464 1574 -542 -1410 1267 1029 -1948
$$ packed form
2042G79J233l629M70L415k051k455L266R36l815O79L620k292k681L236J254l615
2058a650M23L281k096k107L159O81l664J082L312k314k431L301J030l624N24L144
2074B051k021k032L026M67l433J086L120k447k170L327Q63l534O70L029j923j919
2090a840K838M38l128J146K786k460k018L353O79l557O36L056j910j966K769L85
2106A207k888J190K613k514j687L363N42l595Q58K980j940j909K679L59k857J128
2122d71K379k461j498L312K28l443J046L063k081j944K648M51k612J058K116k283
2138d92j265L297j30l372J223K833k102j985K679N10k597R63K016k153j009K994
2154A410j16l170J239K820k156j851K635N60k699Q64K038k116q68K677k38k977
$$ plain form
2170 -1948 -545 2081 -227 -1939 767 1335 -1223 -512 1501 -324 -1241 1251 947 -1805 -354 2130
2186 2130 -324 -1963 830 1375 -1313 -630 1335 -310 -1267 1081 813 -1684 -199 1996 -321 -1815
2202 -1815 1012 1437 -1218 -637 1461 -165 -1190 1007 738 -1695 -218 1806 -547 -1871 1034 1311
2218 1311 -1450 -768 1491 -43 -1223 960 844 -1434 -21 1813 -560 -1699 1165 1254 -1539 -767
2234 -767 1545 -156 -1351 819 708 -1466 -57 1662 -659 -1581 1268 1255 -1488 -493 1741 -100
2250 -100 -1305 903 757 -1329 -57 1595 -752 -1424 1292 973 -1638 -477 1645 -286 -1361 972
2266 972 708 -1321 32 1488 -649 -1239 1316 938 -1625 -286 1615 -349 -1428 881 636 -1309
2282 -1309 -11 1291 -757 -1167 1336 730 -1616 -56 1611 -407 -1227 984 776 -1257 -14 1219
$$ packed form
2170a948J403K626k308j712K706N68k558P11K013j825r17K492l04k752J451K484
2186B130k454j639K793N45k688O83J965j645r57K348k68k497J485K195k317j494
2202a815K827M25k655N81K098j626j025K197k69k433J477K024k353j324K905K77
2218A311k761O82K259j534j180K183j16k278J413J834k373j139K864Q9k793P72
2234g67K312j701j195K170j11k174J409J719k321r22K849j3k743R95K234j841
2250a00j205K208j46k086J272J652k347o72K716l19k611J161K122j931j075K333
2266I72k64k029J353J456k137n90K555l78k563J339J901j964j079K309k45j945
2282a309J298J302k048m10K503o06k346J560J667k018q20K211k08k033J243J233
$$ plain form
2298 1219 -684 -1018 1111 521 -1503 -69 1439 -597 -1205 950 654 -1231 -6 1249 -567 -900
2314 -900 1192 530 -1367 111 1355 -580 -1123 973 663 -1224 -14 1085 -574 -918 972 416
2330 416 -1227 148 1253 -524 -965 1052 612 -1140 39 1128 -435 -810 907 444 -1095 31
2346 31 1055 -590 -934 927 466 -1181 -42 1143 -481 -822 880 451 -1044 112 1081 -537 -808
2363 -808 931 473 -1170 -13 1107 -505 -880 782 462 -1107 -18 1008 -518 -774 939 420
2379 420 -1109 194 1174 -493 -841 924 487 -1064 31 964 -563 -834 856 348 -1166 136 1062
2396 1062 -603 -885 901 536 -1009 48 1025 -472 -672 941 300 -1076 174 1044 -676 -819 957
2413 957 379 -1141 62 951 -563 -693 856 225 -989 238 1024 -604 -708 1049 433 -1025 105
$$ packed form
2298A219j903l34K129n90k024J434J508k036o08K155k96j885J225J255j816l33
2314i00K092o62j897J478J244j935n43K096l10j887J210J099j659l44J890n56
2330D16j643J375J105j777m41K017m40j752J179J089j563l75J717m63j539J126
2346C1J024j645l44J861m61j647J139J185j624l41J702m29j495J156R69j618k71
2363h08J739m58j643J157J120j612l75J662l20j569J089J026j526k56J713n19
2379D20j529J303R80j667l48J765m37j551J095R33j527k71J690n08j514J302R26
2396A062j665k82J786l65j545J057R77j497k00J613o41j376J250Q70j720j43J776
2413I57n78j520J203Q89j514j30J549o31j214J227P86j628j04J757o16j458J130
$$ plain form
2430 105 1006 -475 -654 749 140 -1028 234 825 -748 -706 945 232 -1078 147 949 -485 -607
2447 -607 865 306 -854 295 821 -675 -545 919 224 -1096 164 916 -528 -646 719 224 -802
2464 -802 222 684 -580 -422 930 168 -936 290 943 -524 -630 685 237 -845 168 652 -573
2481 -573 -497 850 45 -938 274 874 -568 -566 805 207 -738 263 660 -525 -416 771 -6 -914 253
2500 253 758 -651 -647 768 192 -820 209 603 -574 -338 764 -8 -785 437 833 -554 -498 816
2518 816 162 -811 207 567 -556 -411 701 -50 -834 294 624 -666 -452 753 134 -710 262 729
2536 729 -445 -330 668 26 -675 342 606 -616 -309 732 96 -855 214 547 -526 -359 679 29
2554 29 -683 324 547 -532 -247 762 72 -688 281 584 -522 -381 635 4 -698 250 496 -592
$$ packed form
2430A05R01j481j79J403o09j168J262N91j573M2J651p13j310J225Q02j434j22
2447f07J472n59j160J149N26j496J30J464o95j320J260P52j444j18J365m95j026
2464h02J024M62j264J58J352p62j104J226O53j467j06J315m48j082J013M84j225
2481e73P6J347q05r83J212O00j442KJ371n98r45J001L97j185J09J187p77r08J167
2500B53N05j409MJ415n76j012J029L94j177K36J102p72p77J222L96j387N6J314
2518H16o54r73J018L60j123J45J112p51p84J128L30j290K14J205o19q44R72M67
2536G29j174J15R98o42p01J017K64j222L07J041o36r51J069L33j073J67J038o50
2554B9p12J007K23j079K85J009o90p60R69L03j106J41J016o31p02R48K46j088
$$ plain form
2572 -592 -328 671 -56 -697 321 554 -523 -327 674 138 -637 322 599 -496 -216 641 -66 -651 302
2591 302 555 -579 -346 595 18 -691 248 445 -441 -205 633 -51 -594 419 526 -619 -301 724 1
2610 1 -644 258 529 -549 -275 573 -109 -610 355 458 -591 -205 755 22 -666 335 556 -529 -216
2629 -216 618 -33 -504 391 372 -652 -165 724 -157 -707 300 429 -503 -276 550 -48 -460 404 392 -529
2649 -529 -58 711 -183 -635 365 474 -559 -206 459 -132 -502 288 257 -556 -17 638 -202 -545 443 431
2669 431 -458 -178 557 25 -442 334 284 -502 -27 579 -235 -557 349 359 -561 -254 493 -65 -516 346 191
2690 191 -431 29 501 -196 -459 482 350 -507 -174 562 -80 -478 194 201 -470 -33 419 -247 -454 437 318
2711 318 -544 -129 540 -63 -382 259 273 -325 -27 400 -203 -394 395 287 -533 -125 511 -162 -450 259
$$ packed form
2572e92K64R99p27o41J018K33j077J96J001n36p75R59K77j095K80Q57p07n85R53
2591C02K53j134K33R41n77p09R39J97q86K36Q38o84n43J013J07j145L18J025p23
2610Ao45R02K71j078K74Q48o82n01R65J03j049L86R60p33o88J001K21j085L13
2629b16Q34o51m71Q95j9j024M87Q89q81n50J007J29r32K27Q26n98m12Q64j2r21
2649e29M71P69q94m52J000J09j033L53O65n91l70P90l1q13N39O55q40l43R88j2
2669D31q89K80P35n32m67P76n0p86M75O06q14l22R06J0r20L07P47n58m51Q62j55
2690A91o22M60M72o97k63R41j32q57L33P36o42l98O72Po71M37M52o66k07Q91j19
2711C18q62M15O69o03l19O41J4n98K98M27o03j91P89j08q20M08O36o73k88P09
$$ plain form
2731 259 226 -268 -22 375 -223 -288 469 257 -552 10 558 -146 -472 244 283 -353 -138 319 -218 -379 369
2752 369 170 -548 -27 482 -120 -424 271 348 -284 -115 439 -133 -278 356 190 -425 -13 380 -257 -440
2772 -440 247 259 -381 -116 417 -74 -287 345 154 -385 99 529 -128 -400 341 224 -427 -81 385 -113
2792 -113 -295 276 133 -376 30 424 -207 -351 358 283 -364 21 433 -71 -263 366 171 -388 53 418
2812 418 -254 -345 347 136 -391 -36 381 -125 -318 289 152 -366 98 409 -210 -249 367 100 -376 0 405
2833 405 -146 -266 225 64 -392 23 260 -241 -222 325 111 -394 58 410 -169 -251 324 164 -301 75 319
2854 319 -164 -246 215 158 -413 85 298 -200 -299 255 141 -336 51 301 -112 -215 314 128 -349 104 410
2875 410 -163 -251 318 110 -363 9 282 -183 -291 233 82 -311 15 259 -171 -286 354 170 -293 72
$$ packed form
2731B59l3m94K46L97n98o5P57k12q09N62N48p04l26P16L9o36K15M57n37j61P48
2752C69j99p18N21N09o02l04O95P7o32J69N54n72j45O34j66o15M12L93o37j83
2772d40O87J2o40K65N33m91k13O32j91n39M84M30o57k72P41j17o51L46M66m98
2792a13j82N71j43n09M06L94o31j44P09p5o47L85M12n04j92O29j95n59M41L65
2812D18o72r1O92k11n27L55M17n06j93O07j37n18M64L11o19l9O16k67m76L76M05
2833D05n51j20M91j61m56M15K37n01J9N47k14n05M52L52n79q2N75j60m65L76K44
2854C19m83q2M61n7n71M98K13m98r9N54j14m77L87K50m13j03N29j86m77M53L06
2875D10n73q8N69k08m73L72K73m65j08N24j51l93L26K44m30j15O40j84m63L65
$$ plain form
2895 72 380 -132 -181 191 45 -275 65 235 -272 -208 262 77 -317 1 337 -175 -248 281 103 -255 41
2916 41 304 -177 -163 321 101 -365 100 313 -182 -224 229 4 -260 60 251 -224 -143 299 89 -329 111
2937 111 372 -178 -168 328 125 -295 96 270 -183 -171 330 -82 -359 141 227 -249 -197 271 107 -267 90
2958 90 248 -155 -81 246 41 -258 86 241 -236 -106 321 6 -308 45 165 -195 -67 212 -25 -203 184
2979 184 186 -213 -72 286 63 -234 69 166 -134 -86 216 -28 -197 128 128 -205 -149 216 -7 -271 47 96 -156
3002 -156 -38 236 -26 -185 117 196 -198 -55 186 19 -274 84 211 -140 -167 163 12 -190 108 121 -161
3023 -161 -44 223 83 -187 56 233 -107 -125 213 2 -146 95 117 -231 -103 252 -17 -191 79 190 -147
3044 -147 -116 159 60 -133 123 224 -142 -34 270 -52 -148 93 153 -201 -115 151 40 -197 -7 137 -151 -74
$$ packed form
2895G2L08n12m9L72j46l20L40J70n07O4M70j85l94L18L36n12p3N29j78l58K96
2916D1K63m81J4M84k20m66M65K13m95m2M53k25k64L20J91m75Q1M42k10m18M40
2937A11K61n50J0M96k03m20L91J74m53J2N01m12k77N00Q6m76N2M68j64l74L57
2958I0J58m03P4L27k05k99L44J55m77J30M27l15l14L53J20l60J28K79k37j78L87
2979A84Kl99J41L58k23k97L03R7l00M8L02k44j69L25%l33N6L65k23k64L18M9k52
3002a56J18K74k62j59L02P9l94J43K41j67k93L58J27l51k7L30j51k02K98J3k82
3023a61J17K67j40k70K43J77l40j8L38k11j48K41K2l48J28L55k69j74K70J11l37
3044a47L1K75r9j93K56J01l66J08L04l22r6K41O0l54Q6K66j11k37J90J44k88P7
$$ plain form
3066 -74 233 -61 -180 111 194 -152 -122 232 52 -202 100 111 -166 -21 163 -61 -179 108 32 -184 -33 222
3088 222 23 -193 148 154 -119 -23 250 -16 -93 133 112 -179 -55 229 -46 -214 40 113 -201 -78 154 -57
3110 -57 -169 61 106 -157 -51 184 14 -173 124 145 -169 -62 147 -85 -187 90 133 -227 -30 192 -47
3131 -47 -200 115 112 -150 -31 206 29 -97 128 71 -121 -3 150 -64 -167 85 120 -192 -28 109 -54 -143
3153 -143 64 108 -125 -87 158 -37 -84 105 76 -122 1 195 -52 -110 40 104 -115 -2 92 -67 -164 132 86
3176 86 -172 -4 166 17 -128 112 174 -95 15 140 -69 -140 143 72 -126 16 143 -67 -184 116 28 -145
3198 -145 -52 97 -66 -114 127 41 -105 68 159 -24 -128 107 123 -81 -40 146 -36 -93 82 -50 -108 12 95
3221 95 -64 -80 70 120 -92 34 117 57 -30 79 55 -102 0 35 -84 -122 62 40 -100 -45 81 -82 -61 110
$$ packed form
3066g4L07k94j19K91Q3l46L0L54j80k54L02J1k77J45J84k24j18K87p6k16J51K55
3088B22j99k16L41Ok73R6K73k66p7K26k1k91J24K84k75j68K54P3l14J23K32k11
3110e7j12K30M5k63J06K35j70j87K97K1l14J07K09k32j02K77M3l60J97K22k39
3131d7j53L15lk62J19K37j77j26K25n7j92J18J53k14j03K52L5l12J64J37j63q9
3153a43K07M4k33L8K45j95m7J89k9j98J23J94k47n8J50O4k19J13R4j59r7K96m6
3176H6k58J68J70j49j45K40O2k69J10J25k09p1K83p1j98J42J27k10j17L00q8j73
3198a45R3J49j63m8K41q6j46J73R1j83j04K35J6k04M1J86j82n7J75j32n8J20Q3
3221I5j59j6J50N0k12J26Q3o0q7J09k4j57J02L5j19l8J84k2j40N5J26j63K1J71
$$ plain form
3245 110 61 -58 80 142 -29 -101 100 102 -107 21 128 6 -90 64 -28 -108 -43 42 -61 -110 57 55 -130 1
3269 1 129 -28 -64 82 11 -92 19 52 -57 -74 83 3 -189 17 131 -114 -124 57 12 -99 23 93 -77
3292 -77 -32 142 19 -118 -18 149 -54 -38 41 60 -81 15 91 -74 -60 120 -18 -143 43 80 -50 -63 57
3315 57 38 -89 13 42 -19 -35 88 -17 -127 -18 66 -24 -98 83 19 -104 -13 84 -32 -45 34 -4 -71 66 57 -10
3341 -10 -94 68 67 -88 26 116 -70 -92 64 -30 -102 -4 53 -84 -83 34 -17 -116 86 90 -55 -78 91 -29 -41 -25
3367 -25 95 -57 -96 8 -29 -96 23 39 -134 -79 65 4 -128 53 41 -48 0 120 -33 -86 92 92 26 -63 59
3392 59 -21 -41 25 36 -70 14 87 -20 -62 7 91 -83 -27 80 40 -20 28 64 -52 -43 54 -45 -102 34 6 -50 -59 53
3420 53 -34 -50 18 59 -19 -51 90 16 -72 31 97 -94 -33 96 64 -103 42 3 -121 -27 87 -12 -89 24 13 -50
$$ packed form
3245A10m9j19J38O2j71p2K01Kk09J28J07j22r6J54r2q0O5Q5j03m9J67kj85J31
3269AJ28j57l6J46p1j03J11L3j09j7J57q0j92K06J14k45j0J81m5j11J22P0j70
3292g7M5J74j23j37J00J67k03J6P9J9j41R6P6j65J4J80j38j25J86L7j30j3J20
3315E7j9j27J02K9o1j6J23j05j10J09Q4r0p4J81o4j23R1R7j16j3P9l8o7J37ro7
3341a0q4J62jj55J14R0j86k2J56r4p2R8N7j37JJ17n1r9K02Mj45k3J69j20j2J6
3367b5J20j52l9J04l7o7J19J6j73N5J44o1j32J81j2q9M8J20j53n3J78%o6q9J22
3392E9q0k0O6J1j06Q4P3j07m2O9Q4j74N6J07m0o0M8L6j16RR7r9n7J36k8n6rJ12
3420E3q7j6O8M1p8l2J41p4q8J03O6j91O1J29l2j67J45l9j24R4J14r9p7J13j1o3
$$ plain form
3446 -50 18 106 62 28 49 58 -24 -13 31 12 -149 45 45 -84 -16 40 -15 -120 -12 -25 -99 -90 83 10 -82 91 13 -67
3474 -67 70 105 -23 -50 65 57 -97 -50 26 -39 -51 73 50 -96 -29 72 9 -2 37 55 -68 2 127 11 -22 -37
3500 -37 12 -98 -18 77 -48 -119 77 39 -70 -68 110 23 -38 16 65 -57 -9 72 -17 -59 61 86 -82 -28 31 -32 -61
3527 -61 -3 -30 -70 6 83 -40 -56 59 18 -55 -117 9 35 -4 25 58 -86 14 66 -56 -70 88 7 -136 -32 66
3553 66 45 -70 21 28 -14 -14 103 -28 -21 52 45 -57 -23 109 -49 -23 13 29 -34 -10 33 6 -73 -1 27 -66 23 94 -43
3582 -43 -42 14 -7 -6 -25 47 17 -51 27 12 -48 -16 67 -17 -34 -24 4 22 -52 61 3 -49 42 26 -87 5 23 -13 -35 21
3612 21 16 -66 -20 27 -29 -39 30 24 -81 3 72 -95 -58 14 -11 -30 48 49 -21 -104 49 50 -78 45 74 6 -37 53 18 9
3642 9 -35 39 -25 -56 10 0 -19 -14 69 -41 -17 90 0 -7 -8 -6 -26 -67 -4 -5 -39 17 23 15 -75 21 80 -51 1 46 -19 -16 45
$$ packed form
3446e0O8Q8m4l4K1Rq2J1M4j9j61J94%j29O8N6n5j05J08j3p4RJ73p3r2J73p8q0
3474f7J37L5j28k7J15qj54M7P6o5j2J24k3j46O7J01o3j1L9J8j23P0J25j16l3j5
3500c7M9j10Q0R5j25p1J96l8j09KJ78q7o1N4M9j22M8Q1q9m2J20K5j68N4N9o3k9
3527f1N8k7m0P6P7j23j6J15m1p3o2J26K6l9K9L3j44J00N2j22j4J58q1j43J04R8
3553F6k1j15R1Pm2%J17j31PP3pj02L4J32j58K6L6J6o3K4M3k7p9P2K8r3Q9P1j37
3582d3JN6k1Jj9P2l0o8P8j5o0L2Q3q4j7J0K8J8p4J13n8n2R1j6j13R2J8l6k2N6
3612B1nq2M6M7n6j0O9oj05Q4O9j67L7P2k5j9P8Jp0q3J53Jj28J23K9o8m3R0l5r
3642Im4P4o4l1O6j0j9NQ3j10K4J07r0pjKk0m1O3jl4N6Oqr0R6N9j31N2M5o5LO1
$$ plain form
3675 45 8 -9 2 -3 10 -28 34 40 -89 8 34 -33 -49 -45 77 -77 -20 51 -13 -10 -14 24 -13 14 72 -80 -33 2 -7 -9 -20 15
3707 15 -52 -34 39 -13 -50 51 42 -64 -17 68 60 -37 -12 11 -67 -26 38 62 4 -13 21 22 -54 93 -22 -39 -6 34 24 -39
3737 -39 92 43 22 -24 -4 -47 59 48 22 -90 -18 68 -13 6 42 -11 -61 29 2 -62 -11 36 3 -34 3 53 -34 21 28
3766 28 60 -18 28 8 -28 -63 28 14 -56 14 -5 -22 -70 90 -9 -5 -21 -53 6 7 90 -2 -63 40 12 -99 31 78 -5
3795 -5 -54 -21 35 24 -9 25 -18 -52 54 -23 -30 -1 92 55 -25 49 14 -11 14 -2 -27 -53 40 4 -30 -2 35 46 -7 3 43
3826 43 -4 -21 13 35 -75 24 70 -32 33 0 -42 -60 81 52 -95 -47 -31 22 -30 21 32 -24 -12 -3 9 7 5 25 -8 28
3856 28 57 -39 -22 -11 67 -47 -1 -18 -9 -22 -23 -11 1 19 46 -2 -49 22 16 -30 22 24 -36 -28 37 37 -58 3 63 17 -36 16 22
3889 22 -53 -15 35 10 -95 60 -6 -21 20 54 30 15 40 59 -19 -7 10 -3 33 32 23 -23 20 74 -8 -11 48 11 14 -53 90
$$ packed form
3675D5l7j7J1nJ3l8O2Oj29R7K6o7j6MJ22j54N7P1o4LmL8l7K7N8j52M7L5rkj1L5
3707A5o7J8P3n2l7J01rj06M7Q5qr7K5K3p8M1O4K4n8j7L4Jp6J47j15j7L3M0j0o3
3737c9J31m9k1m6K0m3J06j1k6j12P2Q6q1J9L6n3n0R0k7o4N1M7l3l7L7N0q7N5P
3766B8L2p8M6k0l6l5R1j4p0P0j9j7m8J60r9Mj6l2N9JQ3r2o1J03k8j11J30M7q3
3795em9L3N6j1l3L4m3l4J06p7pK9R3l7q0P4l5k5K5j6k5k6R3l6l4K8L7J1n3J0M0
3826D3m7j7L4K2j10R9M6j02O5l3m2j8J41k9j47M8J6N3n2N1J1n6J2RJ2kkK0l3L6
3856B8K9r6J7J1P8j14M6j7Rj3jJ2J2J8K7m8m7P1om6N2Ko0QO5%r5O1O0m6n3N2O
3889B2p5L8N0k5j05J55o6j5M1L4k4j5K5J9p8J2J7j3L6jrm6M3N4q2lN9l7Lo7J43
$$ plain form
3920 90 -41 -50 88 -1 -11 17 -24 7 46 14 44 4 -54 13 52 -8 -61 -34 8 32 59 -28 -38 80 51 26 25 44 32 4
3950 4 -33 -3 -100 -18 -40 -66 -36 -23 26 16 47 97 11 -8 34 -44 14 4 33 -25 -19 9 43 -51 14 6 7 -77 29 41 46 -4
3982 -4 27 -27 -57 -31 54 -12 38 74 -35 -31 42 17 -16 0 38 -19 -72 21 -2 -49 57 21 -37 -12 25 4 -23 -56 -6 -42
4012 -42 12 12 -44 18 -15 11 -35 21 38 -38 -50 15 27 21 -5 26 -3 11 26 45 -33 -29 5 36 0 4 28 -53 -56 -9 -3 -44 29
4045 29 14 1 -32 48 19 4 -36 10 -21 -5 34 -6 -38 8 -58 -56 -13 74 -34 -21 2 34 7 -94 -9 25 21 34 8 -12
4075 -12 -41 67 24 -19 -7 -19 -59 -31 28 -64 -33 -65 -31 -26 -13 38 -5 -20 -15 9 7 -53 67 -23 -9 -7 41 -41 -79 56 42
4106 42 -94 -33 -14 -22 -15 -9 -39 -59 64 -8 -5 37 110 -36 -64 -18 -7 -19 -21 -7 9 48 -57 -45 -84 24 66 7 -18 16
4136 16 19 -18 8 46 12 -19 13 -22 -75 10 31 -10 -60 -9 -36 -18 -40 72 -42 -46 -2 60 -14 -23 42 -18 57 17 68 -83
$$ packed form
3920I0j31rJ38q9j0K8m1L1L9l2L0m0n8O7L9o0n3K7M2K4K7q7j0J18k9k5jJ9j2k8
3950Dl7L0r7Q2k2k6L0J3M9j0L1N0q6j9M2p8N8j0K9n8OK8L4r4O5qJq4J06J2Nn0
3982dL1n4l0K6Q5o6N0L6j09MP3k5l3J6L8n7n3R3k3m7J06l6n8K5L7k1k7l3N0l6
4012d2N4%n6O2l3K6m6N6J7p6j2O5J2ok6L1k9J4J5J9p8ML4L1l6MK4q1lM7Om1P3
4045B9j5j3l3Q0k9j5m0M6l1J6L9m0l2M6o6KM3Q7j08J3K3L2k7j01Q5L4mJ3k6k0
4075a2k9J08m3m3J2j2m0K8N9r2L1l2L4NJ3N1m3j5NK4ko0J20r0J4KM8q2l8J35j4
4106D2j36O1J9qPOl0k0J23p2LM2P3j46k8M6J1j2kJ4J6L9j05J2l9J08M2n9k5L4
4136A6Ll7K6L8l4l1L2l5n3Q5K1m1n0N1k7J8k2J12j14mM4O2p4rO5o0P5m0N1j51
$$ plain form
4166 -83 -19 14 25 -56 18 17 -8 10 19 13 -67 -27 13 -3 -36 20 14 -24 -16 28 -18 22 48 13 35 34 24 -59 21 14 34 -21 27 -17
4200 -17 -29 -24 50 7 -8 -25 -36 41 -12 87 33 -87 2 55 18 15 10 -14 -11 -14 -65 -90 1 14 -13 -1 9 4 3 -26 56 -34 -25 -28
4234 -28 40 -47 -10 -33 -57 24 -26 -20 34 -80 94 23 -6 -60 -18 -26 50 27 -15 23 26 -3 -15 26 18 2 -15 34 28 -49 -7 -4
4266 -4 -84 -26 -23 -5 -15 -11 9 24 -4 2 -37 -32 51 -35 -5 -35 -8 39 -32 31 25 1 -4 9 8 8 -26 48 31 6 4 -1 -22 52 60 0
4302 0 -16 32 -12 -17 -11 -36 17 -22 16 0 2 27 -29 2 -56 -24 1 -28 63 34 -11 27 41 31 7 2 31 -21 41 0 -20 -49 -61
4335 -61 8 -5 -2 67 44 0 -42 102 -23 -7 43 -16 -34 -1 16 -41 -26 58 26 -78 -33 9 7 39 30 4 6 13 16 14 -7 -14 48
4368 48 -2 -5 -2 -46 -2 5 -6 -8 -18 -18 -57 10 16 12 55 59 16 -24 -11 38 1 44 27 113 3 -15 41 -26 3 -9 37 -52 -38 -42
4402 -42 32 -53 2 -17 29 36 -32 25 -25 15 55 17 -42 15 9 -54 25 -36 -46 -55 -54 -58 -14 33 -59 -28 -49 26 -29 24 91 -20
$$ packed form
4166h3O4L3J1q1P4jk5J8Roq0M0M0j6l3N6ol8QM4m6M0K6l5K2jj0q3Q0pK0n5M8m4
4200a7j2NP4m3j5j7j1P7n3R9n4j20Q9N3l7lnk4Lln1k5R1J3k7J2J0njk9Q2r0Rl
4234b8O8q7L7k3k4Q1n0ON4j14J74p1k9n4M2qP6k3m2L8Lk9j2M1qj6j7M9op7M2L
4266dq0N8LJ8j0MK0J5k8Ol9NQ3q6L0l0K7M7p1O3ok4nJ3j%l4P4j7k5knk1P4Qo0
4302@j6M8m4nOk5N3l9L8j6KK5n6L1n8L2K5k9R1k9m5L8J4j0k4nK9n2O2m1k0k9j2
4335f1O9j3LO9k3m4m2J44j25J6N0n9j8L3J7n7J5Q4l2j04M5M2kL2rk6KPLkk1pO2
4368D8n0lLm4M4Pj1kj0%l9O7OmM3Mm3m0J3M9l7M3j7Q6j10j8N6o7K9j2M6q9J4m
4402d2P4q5N5j9M6Po8N7n0M0M0l8n9N7oo3P9o1j0rJmM4M7r2L1k1P5n5N3O7j11
$$ plain form
4434 -20 42 23 71 -13 -33 51 -8 27 17 22 -58 -58 41 -9 -15 -16 -67 38 -1 16 31 28 53 37 6 -27 14 -33 -5 -8 -38 22 -8
4467 -8 -10 -15 30 14 -18 20 11 16 32 -7 30 -3 -11 -6 -14 42 -49 18 12 13 -9 -43 -16 -42 -17 11 -30 -32 23 48 0 9 42 39 25 2 5
4504 5 -55 53 15 -39 -6 -14 -5 -22 -68 31 38 3 -7 41 -84 -48 -16 14 -26 -19 19 -27 22 -11 -51 -31 6 9 -15 -23 48 30 -6
4537 -6 16 -16 9 26 -42 -39 -18 14 -8 30 15 37 -25 -28 -20 -14 -14 -35 27 -12 -58 -3 2 48 -14 -16 -30 1 -8 55 12 34 25 -33 15
4572 15 14 8 21 31 3 38 -47 -21 30 -17 24 -26 -4 -57 14 2 -24 -26 4 -25 3 41 -52 21 4 6 -17 -18 13 35 -43 1 29
4605 29 -9 -30 -18 -7 13 -35 25 10 -11 -1 -22 11 -15 36 -8 27 41 -38 28 -14 -6 -2 -5 33 -12 -31 -53 4 3 -21 39 25
4637 25 -27 13 -10 3 -12 -4 -48 16 -1 27 -20 -24 2 30 0 47 33 -28 -9 56 70 -17 -38 21 -23 -12 -8 -10 -29 1 33 -12
4669 -12 22 93 16 -35 22 24 40 0 -9 -7 -25 13 42 -35 10 35 -54 -63 -29 -50 19 3 87 -19 -20 17 9 -9 -47 51 42 -3 29
$$ packed form
4434b0O2j9M8q4k0Q4n9L5j0Nq0%R9n0ojn1J05l9J7J5lK5j6l1l3M1m7K8ll0O0l0
4467hknM5j6l2L8rNJ6l9L7l3qNqN6r1O7oJk2l4K7k6K5K8m1kN5K5m8RL3lj4k3L
4504Eo0J08l8n4L3qRj7m6R9Pl5j0M8j25L6L2L0m0PL8m6M9l3m0K0L7Lk4qP1j8l6
4537fK2l2K5J7o8LK1L2k2L8j5K2o2lQO%k1O2l9m6N5NM6o2kj4L1rO3m3K2rn8M8
4572A5joJ3J0k8L5q5K6N1m7M1n0K2n3P1j2k6kL0k9K8L8r3P3j7Kk3jL1K2p8M4K8
4605B9l8k1J2J1K0m8O0j5k1J0k1L3k6N1m4L5J4p9O6m2QMlL8m5j9k2N7jk4O0j4
4637B5n2M0k3J3j5Qm4O4j7K8m7mK6K8l0M7j4o1J9O5J4q7k1N9m4J1Mkj9L0L2m5
4669a2L4P1p7n1N7KJ6m0rKj8L8K9p7M5K5q9rL4k1O9j6Q4j06jL7qj8l8R8rm5L2
$$ plain form
4702 29 21 -22 -38 -21 50 18 -14 -16 3 -56 -12 -30 -24 -53 -3 -18 30 30 -35 -23 11 38 42 -13 -5 17 19 14 -2 5 2 2 0 -45 14 35
4738 35 -19 -16 22 -2 -5 -31 -22 -9 -4 44 -13 32 26 33 -20 -46 7 34 -8 25 -10 20 50 32 2 -31 1 41 -7 -17 35 20 -80
4771 -80 27 12 -35 -28 1 7 -34 74 23 -8 -43 12 3 -39 -44 44 8 37 8 -33 0 -42 33 43 31 19 -67 6 -35 -2 -1 -89
4803 -89 -5 -29 6 8 46 -13 -59 26 -13 -18 -67 -27 -54 47 18 9 16 -35 28 -44 -10 -15 1 -11 31 -20 16 27 55 0 19 37
4835 37 7 -6 50 -2 15 13 31 -32 37 3 43 17 -20 -7 44 -36 -3 3 29 -47 37 -14 28 24 46 -51 7 -6 26 51 -1 -3
4867 -3 -21 47 17 10 -20 -22 31 -46 2 -16 -15 4 25 32 26 -57 2 17 -13 6 48 -16 18 -6 11 -8 -16 -25 -20 0 -39 87 -26 30
4901 30 62 -59 -18 88 -16 -4 12 22 -40 10 19 22 4 -14 22 -31 -7 44 15 -5 -1 4 47 10 27 -21 13 -36 18 40 13
4932 13 -15 -42 -15 -21 33 4 12 0 10 -3 23 -1 15 9 -20 37 2 12 -33 3 -59 31 30 -50 3 1 -48 1 27 -21 -19 -2 101
$$ packed form
4702B9qm3j6J7P1l2l2kJ9n9M4j8Ok9N0j5M8%o5J2L4K7Mn5QK2Knj6Pl%km5N9K1
4738C5n4LL8k4lk6RJ3NM8n7M5oPn3k6N3K7m2L3l5L0L0j8l0l3L2M0m8j0N2j5j00
4771h0J07j5m7PK9Om1J08n1l1l5N5rm2nQ8l6K9k9m1L3m2P5J0j2j2q6P3m1L3Jq8
4803h9Q4k4L5KL8n9m6Q5l9nm9M0k7J01k9rPn1O3p2L4nJ6j2M2n1L6J1K8n5J9J8
4835C7l0j3N6n2J7kJ8o3O9l4M0k6l7J3N1q0L3OK6p6Q4n1M2mK2r7N8j3L2K5n2k
4867cj8O8l0pl0kN3p7M8j8JJ9K1Poq3N9J5l0J9M2o4L4k4J7j9qrNK0l9J26j13N6
4901C0L2j21M1J06j04J2J6J0o2N0RLj8j8L6n3K4N1k9k0MNM3l7J7m8L4m9N4K2k7
4932A3k8k7K7oN4k9Qj2J0j3K6k4J6ok9N7l5J0m5L6o2R0jq0N3km9M9K6m8KJ7J03
$$ plain form
4965 101 -22 -29 61 12 2 46 4 11 16 8 12 -3 -33 29 -29 12 -19 -21 -29 44 5 -11 -42 61 -36 -11 -6 -36 13 -36 53 17 -30
4998 -30 -60 30 0 -20 -17 -9 -19 -14 39 10 -36 -18 -24 34 10 30 14 -16 36 26 5 34 68 3 -6 -25 19 -42 44 -2 6 28 -63
5031 -63 39 -50 8 17 34 19 30 3 -25 4 22 -10 -49 -28 0 -25 23 -9 7 -10 26 -25 69 -13 59 -2 -28 8 59 -44
5061 -44 -10 27 14 19 -39 -18 -18 -13 -36 -44 23 21 -10 -27 22 27 -6 14 70 18 4 32 32 58 20 9 -44 -27 -3 14 -37 30 -26 34
5095 34 62 11 28 -54 -28 28 -41 60 -17 -20 -53 -28 9 -29 22 -49 -2 -66 -17 -63 19 -25 84 -4 -5 9 4 41 3 8 -14
5126 -14 26 9 -7 -19 -23 -4 27 -22 -69 15 28 -9 -7 14 -12 35 44 -8 -40 20 67 -48 -58 10 -27 2 -2 0 13 -14 -1 -52
5158 -52 -17 -42 32 -22 13 40 23 2 29 -21 21 -3 -17 21 -42 37 12 -5 1 -21 24 33 -51 7 21 -28 17 -1 12 18 55 3
5190 3 47 22 -27 -14 14 -3 9 16 13 -25 20 -10 3 31 -13 -48 24 -6 -57 -11 -13 -3 -23 15 12 28 -5 1 -61 -11 20 -17 -18 5
$$ packed form
4965A01j23pR0m9j0M4m2PNqMj5l0O2n8M1l1kqP3l9j6l1J03r7K5Nl0M9m9Q9l6m7
4998c0l0R0l0k0LQj0NN3k9m6J8oN8k4K0j6l0N2j0k1K9L4o5rj9M4o1Q6m6QK2r1
5031f3J02q9N8RJ7j5J1k7k8K9J8l2l9K1K8k5M8l2J6j7L6n1R4q2P2o1k6L6N1j03
5061d4L4L7j3Nn8K1%Nk3qO7kl1j7M9Nl3K0N6n2j4K8%K6l8j1n3J7K4J7n1O7n6O0
5095C4K8n1J7q2K6N6o9J01p7ll3K5L7l8N1p1M7o4M9m6Q2m4J09q8jJ4nL7l8Nk2
5126a4M0j7j6j2mJ9L1m9m7Q4J3l7KK1k6M7Rn2l2O0M7j15j0O8l7K9mKJ3k7J3n1
5158e2L5k5P4n4L5K7j7k1K7n0M2k4j4L8o3P9k5j7Ok2M5Rq4N8J4m9M5j8J3OL7n2
5190CM4k5m9J3K8j7J2Pll8M5l0J3K8m4l5P2l0n1M6kJ0k0L8lJ6l3Oo2N0L1l7jK3
$$ plain form
5224 5 6 -10 36 8 -34 17 -9 -17 -5 -3 1 -38 48 -15 2 13 -14 19 62 77 21 20 -19 36 67 -6 -29 3 -52 22 -19 -3 0 -27
5258 -27 1 -20 11 1 -45 26 34 -54 -26 9 -4 -16 13 20 10 -13 -4 -18 -32 -13 66 21 9 -6 12 -45 15 -12 -13 68 -44 -59
5290 -59 -4 -5 -18 28 33 27 8 -1 -31 31 6 62 19 15 -32 3 -9 -9 20 -58 -8 44 22 -5 -23 18 -42 -10 22 -30 16 12 31 16
5324 16 -9 13 5 54 35 -31 37 -18 27 42 40 -49 32 2 13 16 4 8 23 -10 20 -5 19 9 -28 12 8 43 -9 -36 16 -53 -22
5357 -22 -5 46 -26 16 7 -27 -60 -50 23 -35 -18 21 10 -31 -11 1 -44 -11 -4 6 -36 -39 -11 -50 -93 14 -38 -34 108 -43 27
5388 27 -43 58 46 -49 -6 59 19 3 3 -11 -14 -33 15 14 -61 8 -13 14 10 14 -25 22 15 26 39 -24 -29 18 -23 6 25 13 -48
5421 -48 17 -26 19 -2 11 -36 -36 -8 21 39 -24 21 42 -52 8 16 18 41 61 39 -41 5 -33 -67 -53 -34 3 -55 17 -18 41 4
5453 4 10 6 -19 1 7 16 5 -9 -16 11 12 41 6 7 42 -10 -21 -15 -22 -22 17 77 49 -17 -12 4 48 18 5 53 13 1 -13 -41 -24 29
$$ packed form
5224EJj6M6k8m2N1k6qJ2KMl9Q6o3J7J1k7L3M3J5n6jl9N5L1p3k3L2n5P4m1J6Lk7
5258b7K8k1L1j0m6P1Qq8K8L5j3j2K9Pj0k3Rj4j4J9P9m5j2j5J8n7O0k7jQ1j12j5
5290e9N5jj3M6Noj9rl0O2k5N6m3mm7L5j2%K9p8N0N2k2k7j8M1o0L2L2n2M6mJ9j5
5324A6k5K2qM9j9o6O8n5M5J5kq9Q1l0J1Lj2MJ5l3L0k5K4j0l7M0mL5n2k7N2o9L1
5357b2J7N1p2M2rl4l3J0P3n8J7L9j1m1K0J2m5L3PJ0m2lK8l9m3J07n2MJ42j51P0
5388B7p0J01j2r5M3O5m0j6%j4lj9M8jp5O9k1K7mMl9M7pJ1J3o3nM7m1K9J9j2o1
5421d8O5m3M5k1J3m7%K8K9J8o3M5K1r4O0QKK3K0k2q0M6l8l4J4J9L7n8P2l5N9l7
5453DOmk5K0ORj1j4pK7JK9l5JL5n2j1Op%L9O0k8o6NJ6M4l0j3M8m0j2j4k8J7N3
$$ plain form
5489 29 29 20 24 -16 -44 -14 18 44 7 41 -6 -10 58 6 -26 7 16 3 3 -17 -24 -29 18 -6 11 -4 -3 3 41 -11 18 -27 2 45 28
5524 28 31 -1 10 -5 -59 -59 35 -12 -15 38 -17 25 -31 9 -74 -2 -5 -7 38 38 37 69 26 -9 37 46 1 0 39 32 5 3 -1 49 89 -10
5560 -10 36 -12 14 24 13 7 -30 -65 32 53 17 -16 -31 -8 60 11 -17 -22 -53 23 12 1 -17 22 28 18 22 -40 -15 -14 -18 -78 -26
5593 -26 -31 22 -12 3 -37 -55 16 18 -2 32 -8 69 18 4 -8 -27 -3 -5 -29 -40 16 23 -7 20 -18 -60 -16 18 26 -26 -8 49 -15
5626 -15 14 64 -14 -7 -21 -7 94 40 40 19 31 -25 13 -60 -1 38 50 5 -105 -27 12 -19 -23 44 36 -44 -6 -23 12 -28 18
5657 18 48 -3 9 -23 5 61 -27 77 44 -43 -15 -7 11 44 -5 -16 28 0 -51 21 -3 52 -17 22 34 11 -45 31 -19 31
5687 31 0 3 -10 5 37 19 45 -78 12 16 -2 -3 8 -50 -41 43 -6 31 11 -8 2 -34 6 -79 -18 23 10 -37 -28 -82 31 -41
5719 -41 46 -16 -18 -24 2 -10 28 -8 -7 25 5 41 29 0 -2 91 -52 49 -9 -39 -9 18 39 -10 -22 43 17 27 46 -13 -30
$$ packed form
5489B9%rMm0k8L0L2K6l7L4m7mO8n2l2L3Rj3%k0pnM7k4J7j5JOL8n2K9m5K9M3j7
5524B8Ll2J1j5n4%R4m7lN3n5M2n6M0q3P2lkM5%jL2m3l5M6Rm5jL9pk7kmN0M0r9
5560a0M6m8K6J0j1ol7l5R7K1l6l3j5K3O8m9k8nl1P6j1j1j8L9Oj0Mo2K5Jmo0N2
5593b6nN3l4J5m0j8P1Kk0L4m0P7n1j4j2j9K4kk4j1N6Pl0K7l8m2M4L4Qn2J8N7o4
5626a5K9N0p8Pj4J4J01n4%k1J2n6L8p3N9L9J2m5j10P8L9l1mO7qq0L8j7L5m0M6
5657A8L0n1J2l2K8N6q8J04l3q7K8QJ8L3m9j1M4k8n1P2k4N5o9L9J2k3n6P6n0N0
5687C1l1Lj3J5L2j8K6j23R0Mj8jJ1n8RQ4m9L7k0j9J0l6M0q5O1M1j3m7Rn4J13p2
5719d1Q7o2koK6j2L8l6JL2k0L6j2k9kR3j43J01n8l0L0K7K1m9j2O5k6J0J9n9j7
$$ plain form
5750 -30 -6 24 -41 -7 13 -56 55 1 5 -47 -27 20 12 -3 -3 -33 -32 -9 44 37 -40 -12 -36 38 8 -17 -4 5 -51 43 -1 4 19
5783 19 -37 -14 8 15 -12 -2 -10 68 29 47 70 -31 15 18 12 27 18 19 -30 10 21 20 -16 -19 19 15 48 -40 5 -17 15 72 -32 44
5817 44 -15 -54 24 15 -18 -49 11 -37 -7 -36 96 -10 6 -17 31 -14 -16 -13 11 24 41 25 14 4 12 -7 -4 68 -40 9 -61
5848 -61 -9 29 -54 -39 16 -33 7 2 -1 18 -4 1 15 10 16 -44 69 5 4 -22 49 2 -37 -35 24 30 -18 6 -24 2 41 -7 29 -65
5882 -65 50 -21 -23 -13 -27 35 7 52 -23 20 -13 43 -9 10 9 14 38 49 40 11 -5 4 49 44 15 7 -17 -37 -32 9 -13 -13 -25 75
5916 75 -39 10 44 2 -5 92 26 17 37 -4 1 18 4 -1 -26 20 0 -21 -24 -17 12 45 -15 -42 -19 5 27 11 -20 -10 -11 -25 43
5949 43 -17 9 -18 -44 37 30 -21 -39 -18 15 0 -1 17 5 -25 -12 27 34 -53 32 -12 -37 23 18 -28 4 -57 6 62 -15 20 17 -16
5982 -16 -11 -12 59 35 3 34 28 -5 34 -11 -19 80 -32 -31 34 22 5 -16 7 -8 -3 57 -20 16 -8 10 -44 -30 15 5 -42 41 79
$$ packed form
5750c0K4L0o5L4K0o9J11n4Mn2K0M7qj5%l0JK3N3pp7K8k4P4l0k5J3Rn6R4m4NJ5
5783A9n6K3K2Pk7J0qP8l9J8K3j01M6LoJ5rJm9M0J1jl6lL8mL3q8M5k2L2N7j04P6
5817D4n9l9P8rl3l1O0m8L0k9J32j06J6k3M8m5kLK4J3J7j6j1j0Qj9LP2j08M9p0
5848f1N2L8q3J5N5m9M0nlJ9k2NJ4nOo0J13o4jk6P1m7l9KN9Om8K4l0K6L9m8L6r4
5882f5J15p1kJ0j4O2k8M5p5M3l3N6n2J9jNK4J1rk9j6RM5nk9qk4k0NM1k2%j2J00
5916G5j14M9L4m2pR7o6rK0m1NJ7j4nk5M6k0k1lPK9L3o0k7K3K4K2j6l1J0jj4O8
5949D3o0K6k7k6Q1pn1j8K1L3j5jJ8j2l0J3L9Pq7Q5m4k5O0nm6L2o1O3N6p7L5ll3
5982a6NjP1k4l2L1ol3L9m5qR9j12JO5j2j7k1K3j5NO0p7L6k4J8n4J4M5j0m7Q3L8
$$ plain form
6015 79 33 -3 -3 -4 37 -34 14 -16 -17 55 -1 12 16 -5 -11 25 37 29 25 -1 41 44 19 35 -39 0 6 -23 -21 21 69 -10 27 5 2 27
6051 27 -15 -39 33 -30 36 68 38 -65 0 23 28 -30 -7 -16 37 41 -40 37 -1 28 7 0 -52 14 5 -75 65 57 -18 7 8 20 -31
6084 -31 38 -22 -25 58 -26 -25 1 1 57 3 -18 -9 -22 -29 3 -45 -34 47 -33 33 24 3 -15 -35 30 5 -26 28 28 -10 55 -26 4 45
6118 45 17 -13 9 13 26 36 -28 76 -6 16 33 -50 20 -42 -14 20 18 8 46 28 45 45 32 -14 -5 48 14 11 19 -27 24 9 16
6151 16 13 -14 33 34 18 48 -2 -2 -53 83 48 26 -58 -26 -10 10 -29 -43 -4 18 43 32 18 10 -12 -20 30 17 -3 29 -32 20
6183 20 21 46 4 -56 -22 -25 2 -1 36 32 2 -14 32 -3 -21 -2 28 -71 -29 8 -28 -16 22 -1 -12 6 12 -34 37 -57 -2 -26 -10
6216 -10 3 -8 35 6 8 -38 -15 -26 21 17 -12 6 26 3 26 -49 86 3 -13 55 -21 13 26 1 -21 52 -8 -9 14 38 17
6247 17 6 -43 -7 -26 4 29 -46 -35 3 -11 -25 59 -55 -14 39 7 31 -24 14 22 -25 -23 -18 -59 -37 -17 6 42 23 -35 16
$$ packed form
6015G9m6l6%jM1p1M8l0jP2n6J3Mk1oL6J2qmk6M2Lk5J6p4L9Ok9KM2M8p9L7k2lK5
6051B7m2k4P2o3O6L2l0j03O5K3Nn8K3rN3Mq1P7l8K9k1pn2O6rq0J40qp5K5JJ2n1
6084c1O9o0lQ3q4JK6%N6n4k1Rj3pL2m8J1Q1q0O6rk1j8k0O5k5l1N4%l8O5q1L0M1
6118D5k8l0K2MJ3J0o4J04q2K2J7q3P0o2K8L4kj0L8j8J7%j3m6RN3l4lQm6N1j5P
6151A6lk7M7Jj6L0n0%n1J36l5k2q4L2J6K0l9j4L9K2K5j1j4qk2qN0j3k0L2o1N2
6183B0JK5m2o0L4lK7lL7ml0j6M6l5j8J9L0r9M2L7l6J2L8k3j1J8Om6P1r4N5k4J6
6216a0J3j1M3k9Km6K3j1M7mk9J8K0k3K3p5J35q3j6O8p6L4J3k5k2P3o0jK3K4k1
6247A7j1m9L6j9L0K5p5J1L8j4j4Q4j14M1N3l2K4n5L8Qm7KNm1K2K0K3L6j9n8N1
$$ plain form
6278 16 -8 -28 2 -26 74 6 22 -10 -27 -22 -2 59 -84 -12 24 -39 -17 -32 8 37 8 -22 -23 9 18 -23 48 22 7 6 -47
6309 -47 -9 11 9 7 -48 48 28 -27 12 -17 -1 -18 -38 -16 -50 8 -31 5 8 -5 -41 -7 6 -42 22 40 43 3 -30 -6 42 -39
6341 -39 55 23 -72 3 0 22 29 -34 -28 34 -8 21 4 25 -22 -37 -4 -13 31 -2 22 -16 37 -5 51 -3 18 9 -39 -38 38 -37 8
6374 8 -6 -40 49 -25 9 31 -33 72 -11 12 -29 4 -28 91 -45 -11 19 -45 22 -22 -18 25 11 25 11 -41 -29 0 -22 48
6404 48 -1 -16 -2 -24 -21 21 18 1 -53 6 32 -2 -15 -12 -1 -22 27 4 -20 -13 -11 15 -4 16 -17 13 2 -51 -50 -27 -17 -23 24 -26
6438 -26 -1 -9 36 39 -47 7 34 -20 8 51 19 -20 -17 52 20 -4 -33 -37 47 27 -45 35 -44 5 -31 -18 10 -2 -61 -63 -37 -14 -1
6471 -1 -13 -33 -28 2 -35 -3 -19 4 26 35 15 -57 22 27 15 2 30 16 -22 7 1 -53 12 -20 3 4 11 3 12 7 36 11 68 -42 -17
6506 -17 6 -9 3 35 -18 1 5 9 -16 -20 6 -11 -18 23 -30 35 20 13 11 12 -8 5 -12 22 -18 38 -29 -40 -28 17 -15 -5 -24 -24
$$ packed form
6278A6k4k0L0k8J00o8J6l2j7NK0O1j43P2L6o3K2j5M0K9k9l0jL2Rm1P1k6j5jn3
6309d7L8K0kkn5R6k0n5L9k9J6j7k0K2l4N8l9L6Lj3l6L4J3m8O4J8Lm0l3K4M8q1
6341c9R4l2r5P5lK2Po3OO2m2K9j7K1m7j5L3rM4l3K4l8N3m2N6n4K1rm8JP6p5M5
6374Hj4l4Q9p4L4K2o4J05q3K3m1L3l2J19j36L4L0o4O7m4MM3j4J4j4n2J2K9k2P0
6404D8m9j5J4k2LM2lj7n4N9K6l4j3LJ1k1M9k3k4PKK6j9K0l3L0j1n3JK3J0oM7n0
6438b6K5qM5Lq6N4K7n4K8M3l2l9LO9l2k4k9mQ4k0p2Q0p9M9l6J3K8j2n9kK6K3J3
6471aj2k0NL0l7L2j6K3K2Rk0p2P9Nj2j3K8j4l8K9on4O5l2K3JPqRnK9k5N7j10K5
6506a7K3j5J2L2n3J9MMk5mK6j7pM1n3O5j5pkJk0J3j7L4m0N6o7j1J2M5l2J0j9%
$$ plain form
6540 -24 7 4 9 6 25 2 34 4 2 1 -9 46 24 -35 19 -65 -45 36 -24 15 10 -8 -1 -18 -9 22 30 1 26 -28 21 -2 1 33 14
6575 14 17 38 -4 -18 1 -8 41 -7 34 -54 -28 -1 39 7 11 -7 -59 -28 20 -16 -58 -4 16 6 42 46 5 25 48 -28 -9 21
6607 21 32 17 4 5 29 -27 4 6 29 0 8 -19 48 -30 14 35 83 85 23 -24 -11 37 -46 32 -21 19 -1 -11 48 18 35 27 -31
6640 -31 66 34 -37 -13 -19 70 -68 30 48 30 -17 -14 53 30 13 -36 13 -2 18 35 26 -16 -26 52 11 61 13 -2 -7 19 30 8
6672 8 9 19 0 29 21 14 24 -30 5 23 -35 -15 -8 -2 -60 -18 56 -58 74 -7 -6 -13 -33 4 -10 18 38 -24 -21 32 21 10 -18 4
6706 4 -23 9 7 75 13 -55 26 -28 35 51 -43 -14 37 26 49 -32 -7 7 16 32 -15 -26 0 -44 30 33 -13 -20 69 1 13 -9 6
6739 6 -32 -71 30 -3 -3 4 62 -67 -62 10 24 -8 -6 32 6 -7 -25 58 30 -10 -13 -19 44 93 -74 -21 25 10 -21 31 27 -1 8
6772 8 19 11 -13 17 -9 -41 -13 35 1 -17 48 -31 -46 -7 15 48 -7 35 52 -14 7 -6 -56 24 -11 0 32 -3 -15 -8 43 11
$$ packed form
6540b4L1lNlJ9k3L2l0kjj0N5k2n9N4q4K0Q1o0L9nj8Pj7RL1Qk9K5n4M9k3LL2j9
6575A4LK1m2j4J9rM9m8M1q8K6K7M0l2Mj8n2L1M8l6m2N4K0j0L6Mm1K0K3p6J9L0
6607B1J1j5j3JK4n6L1KK3k9Qk7O7p8M4K1M8Ko2m7J3M8q3P8n3M0k0j0N9l0J7qn8
6640c1R7l2p1K4oQ9j38R8J8j8m7LO7k3j7m9M9j5K0J7rm2j0P8m1N0m8j5nK6J1k2
6672HJJ0j9K9qpJ0n4L5J8n8K0POn8M2P4j14J32q1Jpk0L7j4K8K0o2LN3j1j1k8K2
6706Dk7L2kO8o2o8Q1n4O3J6r4K9N1j1K3q1K5J4RJ6m7j1K6m4P4Lm6pQ9o8J2k2J5
6739Fl8l9J01l3%PN8j29NP2J4l2KL8k6j3j8Q3k8m0loO3M9j67N3M6j5l1N2mk8R
6772HJ1qk4L0k6l2K8M8l4j8O5p9j5L9K2L3n5M2J7o6K1j3n0Q0l5J1L2l5j2PN1l2
$$ plain form
6804 11 -14 -34 -57 -42 -20 -4 17 -20 17 -8 17 51 5 -20 -7 43 -10 -28 -13 47 4 37 -10 21 44 -44 -13 -20 13 2 -26
6835 -26 -12 -61 30 55 17 -34 -5 -28 -31 14 -14 10 -14 11 82 17 12 41 21 3 -6 8 0 10 36 18 36 10 8 -36 -5 0 18
6868 18 -7 7 -25 6 -26 -11 -6 -53 7 16 4 -34 16 31 49 28 -9 41 -15 36 10 -50 22 15 -24 8 -22 -54 3 -23 29 8
6900 8 -19 35 16 1 21 -27 -5 12 -28 -11 48 33 49 -11 0 26 -25 -50 -29 -21 26 -32 -7 -10 21 0 29 -22 -4 36 -3 1
6932 1 -28 18 -26 -50 38 -37 -49 2 14 16 -48 -22 8 2 -51 17 30 99 9 38 22 -49 9 -35 7 0 -12 -29 4 -16 11 -16
6964 -16 22 -22 7 15 17 -62 32 -29 -15 -62 -74 26 -45 -6 6 -3 7 -14 55 -20 -17 1 -9 -13 -1 -33 4 -10 12 29 43 28
6996 28 34 -26 -13 -14 26 5 -31 -15 -31 16 10 18 7 -10 24 -17 22 13 -24 -22 1 36 0 -7 17 -27 17 39 4 -68 -16 -6 11 -27
7030 -27 16 34 33 -5 -28 6 -27 -23 2 -16 -17 52 9 14 15 -27 -38 11 38 -78 -42 4 -57 -8 -8 -46 16 25 20 -9 -24 26 23 6
$$ packed form
6804A1k5k0k3J5K2J6K1l7L7k5K5L4m6k5J3N0n3j8J5O0m3L3m7L1K3q8L1pL3j1k8
6835b6J4m9R1K5l8n1K9k3lM5k8K4k4K5P1o5nK9k0j8rJ4qJ0K6j8J8k6km4L1NJ8
6868A8k5J4l2L1l2J5Nm7O0Rj2l8N0J5J8k1l7N0n6N1k6o0P2pl9L2l0l2N7k6N2k1
6900Hk7N4j9j5K0m8K2J7m0J7N9j5J6o0J1K6n1k5K1QM7n8K5lL1k1K9n1J8M0l9M
6932Ak9M6m4k4Q8p5j2N1J2Ko4K6L0on3O8J3O9r0K9j6p1N8m4M2pj2j7L3k0K7k7
6964a6L8m4K9QKp9R4o1J4m7j2J00p1L9J2rJ0k1O9p5LJ8j0mJ2l2L7j4K2J7J4j5
6996B8Oo0J3jM0k1l6J6j6M7oQj1j7L4m1L9rl7KK3L5l6pK4m4M4K2l5p2N2J0J7l8
7030b7M3J8jl8k3L4l3MK5j8jO9m3NJm2j1M9K7j16L6M6o1M9%l8O2Rnk9j5N0lj7
$$ plain form
7064 6 -8 24 46 -2 -7 -27 24 22 -51 9 34 34 21 -44 20 -28 59 -40 30 25 -41 34 30 -29 -8 45 -21 -24 26 13 -23 -25 -31 23 5
7099 5 -8 -10 19 -12 49 0 1 12 44 39 -20 -31 -1 -14 0 -34 -22 -18 -33 -8 53 36 14 -55 2 20 0 -18 26 19 -29 -12 -7 4
7133 4 -6 -13 -41 -31 57 -44 32 -37 1 -27 19 46 18 22 54 38 -4 -5 7 -43 8 -23 -49 20 28 -56 -3 47 -17 48 -27 0
7165 0 -11 8 24 -15 7 -11 7 -32 -10 52 16 -28 37 -27 31 57 -78 -37 -17 -18 11 7 -5 25 19 -2 9 45 8 25 -30 -30
7197 -30 21 27 -28 9 -36 -8 17 -33 65 -30 -1 23 -18 -8 -25 41 66 -12 21 7 47 26 11 36 48 -44 5 24 -34 -42 -11
7228 -11 46 38 39 47 -10 4 -10 40 -12 -47 19 27 31 33 0 0 26 -28 6 26 40 -15 13 -12 4 12 -10 -47 -13 -26 28 11 43 1
7262 1 -6 77 18 77 9 -33 34 -57 -4 0 7 -50 -5 -48 -8 0 -6 -44 -23 -33 -27 -77 5 -37 -12 15 -25 -11 16 -6 14 3 -16 -13
7296 -13 -29 31 36 34 -35 -19 -42 8 52 -59 2 15 15 27 -2 72 -10 19 -20 -9 28 -1 37 -24 -19 -13 14 4 58 -12 -12 36 19
$$ packed form
7064Fj4L2K2m8nk0N1kp3O0K5%j3o5O4m8Q7r9P0no6P5mn9K1N3o6lN0j3l6koN4j8
7099Ej3kK9l1O1m9JJ1L2nn9j1L0j3J4l4J2Mj5K5O1j7k2o9N7J8k0j8M4pm8J7NJ1
7133Dj0pk8J0Q8j01P6o9L8k8M6K7k8ML2j6m2jJ2n0N1l1k6O9Qq4N3N0o4O5p5K7
7165@j1J9J6l9K2j8J8l9K2O2l6m4O5o4N8K6j35M1K0jK9mj2L0ok1J1L6l7J7n5%
7197c0N1On5L7m5K8K5n0R8r5K9K4m1J0j7O6K5p8L3j4M0k1j5K5J2r2M9J9n8qL1
7228a1N7qJQn7J4j4N0n2l5O6QMKl3%K6n4L4K0J4n5K8k5J6Qk2l7L4j3N4j7L2m2
7262ApQ3n9N9o8m2O7r1N3MPn7M5m3M0Qol8K1j0On0Q2m2K5K7m0J4K7k2K0j1j9L
7296a3j6O0Nko9J6k3N0M4j11O1J3%J2k9P4q2K9l9J1L7k9L8o1NOK7j0N4p0%M8j7
$$ plain form
7329 19 35 -34 15 51 23 1 -3 20 20 4 10 -7 -16 7 14 2 -29 11 -8 -12 -16 11 3 35 36 -9 -1 0 -26 -2 -2 -7 -27 -19 -11 -12 -24 12
7367 12 28 10 6 7 0 -23 15 27 18 -21 -7 21 1 -5 -33 22 -36 -23 -35 5 39 -27 -62 6 -9 -36 -12 -3 18 -75 -22 -43 15
7400 15 -2 -27 4 4 -1 -33 -47 -13 62 20 -32 -15 7 13 22 26 52 19 -15 19 -1 18 -4 39 86 6 10 -21 26 -3 20 7 -8
7433 -8 -53 28 1 -13 1 39 4 -69 10 -49 34 20 16 -8 -7 32 -53 0 25 2 -10 -58 -41 -8 -7 22 34 16 22 18 17 -2 2 -14
7467 -14 11 9 -42 27 18 -10 -5 -7 -7 -38 6 24 22 -19 30 31 17 -8 -33 13 -24 79 -17 33 -2 4 4 -3 -1 -10 0 26 25 -2 -22 -47
7503 -47 -8 -46 10 11 15 -6 31 -60 -1 10 28 14 42 -17 11 -32 -30 -10 -10 -47 1 13 14 -8 -40 24 -62 5 23 -3 31 -18 47
7536 47 24 1 -44 13 17 -16 -33 33 11 -29 -51 19 76 42 7 14 16 -14 47 18 6 -12 12 -29 31 -45 -19 37 -100 27 -10
7567 -10 24 -45 24 50 -3 20 37 11 -13 50 -40 32 -30 15 -28 17 -4 -5 9 24 22 5 9 17 4 25 46 -20 4 16 5 -35
$$ packed form
7329A9J6o9M9L6k8k2mK3%j6Oj7rK3Pj2l1M0j9mmK7qL2Jm5QJk6K4%nk0QQjj2L6
7367A2J6j8mJpk3L8J2rl9J4K8k0ok8N5n8J3j2M0L4o6l5O8j5k7K4RK1r3N3k1N8
7400A5j7k5L1%nl2j4L4P5m2n2J7K2ORMK6l3l4L4k0J9k2M3M7q0Ml1M7k9K3j3j5
7433hm5Q1k7j4J4L8l5p3P9n9Q3j4mk4JL9q5N3K5k3j2m8J7L3JK9J2j8Omjj9Mj6
7467a4K5kn1O9rk8Nk%l1M4J8km1M9Jj4k5k5M6l7J03r6N0l5O%pKrJ0K6jk7k0k5
7503d7L9l8N6JMk1L7r1N9J1J8j4K8n9K8m3KK0%l7M8J2Jk2l2O4q6O7J8k6L4m9O5
7536D7k3k3m5N7Ml3j7O6k2m0k2P0N7l4l5PKl0O1k9j2j8K4m1O0p6K6N6j37J27l7
7567a0L4o9O9K6n3K3J7k6k4O3r0P2o2M5m3M5k1jJ4J5kj7MQj3K1K1o6K4J2j1m0
$$ plain form
7599 -35 14 12 28 -45 13 -15 31 21 -58 -22 47 -21 53 35 -4 -36 -6 26 2 -29 -16 -38 9 55 -19 39 -36 -30 76 -5 -11
7630 -11 -8 33 48 30 -11 -43 17 82 9 -4 -37 72 12 -33 -27 44 -45 24 -39 -30 23 -8 -14 36 -32 -47 12 38 52 -6 11 -12
7662 -12 -46 1 8 77 21 -12 58 -42 17 -35 20 -3 -22 -26 -12 17 -11 14 6 -27 32 38 49 22 -47 85 27 -7 18 0 58
7693 58 17 35 -52 -10 19 0 -22 23 -5 -51 -15 11 1 -2 5 -9 -36 -8 20 -10 -13 -19 -30 -1 -9 49 39 53 -3 35 -31 16 -17
7726 -17 47 39 4 28 25 30 5 1 -47 -45 -58 -14 18 7 -16 -6 -13 24 1 2 -23 27 20 6 -1 -16 -39 -22 63 38 -47 -19 -12 -7 36 43
7762 43 -4 -26 -22 5 26 -8 -21 -32 21 -26 9 -10 27 29 57 -12 10 28 23 49 4 61 20 -15 -43 29 -4 -31 35 17 10 23
7794 23 -1 60 12 -69 13 68 -61 -27 -12 3 -17 14 17 -12 -6 -51 18 -15 -27 24 33 -56 -8 3 -24 1 -16 -18 -7 28 19 53
7826 53 4 38 29 -21 -14 14 13 8 -62 26 -43 27 17 46 25 -10 4 6 -22 -9 -18 27 -7 7 36 8 -16 22 23 25 -20 18 31 32 -63
$$ packed form
7599c5M9kJ6p3N8k8M6j0p9L6O9o8P4j8l9l2L0L2k4l1J3k2M7M6p4N8p5OJ06q1o
7630a1LM1J5j8m1l2O0O5p3j3l3J09o0m5OP1q9O9o3RN3l1oN0o8j5N9K6J4n8J7k3
7662a2l4M7PO9n6l3P0j00N9n2N5k3j9mJ4K9k8K5ql3N9OJ1k7o9J32n8l4K5j8N8
7693E8m1J8q7M2K9j9k2M5k8m6L6K6j0lPj4k7K8K8l0loj1K9qN8j0J4n6L8o6M7l3
7726a7O4ql5K4lNk5mm8Kj3M4L2j1k3J0pL7k3Jk5N0pj4pj5k3J7Q5k5q5K8PNM3P
7762D3m7k2MK7K1l4j3j1N3m7L5j9L7KK8o9K2J8nK6m5N7m1l5k8P2l3k7O6j8pJ3
7794B3k4O1m8q1Q2N5j29L4J5J5k0L1Lk9Om5O9l3j2N1Rq9M8J1k7K5j7kJ1L5rL4
7826E3m9L4rn0PK8jnp0Q8o9P0j0K9k1l5J4Kk8J3rM5l4J4K9k8k4L8JKm5L8J3Jr5
$$ plain form
7861 -63 20 -20 -5 4 21 -46 42 85 -33 38 16 34 3 64 -15 3 -15 -19 14 46 40 -12 14 -2 -15 35 39 -56 49 15 -15
7892 -15 27 16 47 2 30 16 8 13 -24 31 -10 59 63 14 9 46 29 -2 -6 -43 3 -12 -23 -15 -47 -12 -36 8 16 25 31 51 -28 -6 38
7927 38 23 -28 -8 -21 61 20 20 -10 31 52 53 44 23 -13 -28 18 -13 -49 -17 43 5 50 3 12 -6 7 84 -18 19 -14 13 -18
7959 -18 6 28 18 26 -32 12 2 -2 56 35 43 -17 38 -32 -9 -17 -3 -38 -53 -26 -13 -22 10 14 -13 -27 49 -22 -16 -24 -19 -12 -19 29 -2 -14
7995 -14 14 -17 -2 14 72 65 -27 16 -43 0 -46 57 -19 13 26 8 -6 34 6 13 75 2 -19 -14 52 19 11 21 -25 -19 -52 -26
8027 -26 -44 -28 0 -8 -24 31 -49 -74 28 -7 20 27 68 -44 -60 -34 14 52 23 52 -39 2 21 32 -8 5 -40 53 16 18 0
8058 0 1 57 -55 16 8 50 4 47 29 29 -6 18 -4 12 34 66 -4 5 17 9 -22 -12 48 13 7 -38 -24 51 4 -29 14 -21 -9
8091 -9 -5 54 -34 15 -7 -48 34 -8 -7 -22 25 -3 34 -20 -37 13 19 6 3 -14 -38 51 -16 -3 -83 -42 -37 -25 49 -3 0 31 69 5
$$ packed form
7861f3Q3m0J5RJ7o7Q8M3j18P1k2J8l1O1p9J8j8mL3L2on2K6j6j3N0Mr5J05l4l0
7892a5M2j1L1m5K8j4qNl7N5m1O9Mm9nL7j7l1ml7M6j5j1Ql2L5k4M4QROK0p9K2M4
7927C8j5n1K0j3Q2m1%l0M1K1Jrk1l6j5M6l1l6L2O0l8M5m7Rj8J3P7j02L7l3K7l1
7959a8K4K2j0Qn8M4j0mN8k1Qo0N5p0K3qJ4l5j5K7J3rL2Mk7j4P6p1OqNPpM8l1j2
7995a4K8l1J5J6N8pr2M3n9M3m6J03p6L2J3j8j4M0k8PO2p3k1NO6l3qJ0m6Ol3K6
8027b6j8J6K8qj6N5q0k5J02l5K7PM1j12j6K6M8L8k9K9r1M1J9J1m0J3m5R3l7Kj8
8058@JN6j12P1qM2m6M3j8%l5K4k2J6K2L2p0RJ2ql1J0O0l5om5J4P5m7l3M3l5J2
8091iMN9q8M9k2m1Q2m2Jj5M7k8L7n4j7N0Oj3lj7k4Q9o7J3q0M1NJ2P4n2LL1L8o4
$$ plain form
8125 5 14 -18 4 -13 -4 -32 26 -2 24 -70 -24 -9 2 76 -9 20 50 -30 -2 11 12 -69 35 56 -75 -16 42 5 12 33 -23 -13
8157 -13 55 -13 -5 -1 8 -25 -7 -66 25 20 -28 33 10 -4 -22 4 -26 -16 38 -7 22 11 -8 -19 35 15 4 -4 16 -9 -10 -27 -35 11
$$ packed form
8125ERl2K2j7Rk8N8k8K6r4M6J5J1P4q5K9L0q0K8J3Jq1J04K1j31N9N8l7PK1n6J0
8157a3O8o8QMRl3J8n9R1nm8O1k3j4j8K6l0J0N4m5K9j1j9j1N4k0j1qK0k5jj7qM6
8191A1
$$ Imaginary data points
##PAGE= N=2
##DATA TABLE= (X++(I..I)), XYDATA
$$ plain form
0 0 0 0 0 0 0 0 0 8 -8 8 -8 8 -16 16 -24 24 -37 40 -48 64 -75 88 -104 126 -144 173 -200 232 -264 304 -350
31 -350 398 -450 509 -576 650 -729 813 -909 1016 -1132 1255 -1391 1542 -1703 1883 -2077
47 -2077 2289 -2523 2780 -3061 3373 -3719 4105 -4538 5023 -5576 6215 -6960 7838 -8892
61 -8892 10188 -11829 13974 -16914 21200 -28053 40726 -71789 302975 179247 -582140 130219
73 130219 393349 -284140 -235496 394980 -80824 -445314 278008 419285 -404124 -217289
83 -217289 479771 38611 -448595 164648 293714 -362430 -167105 434457 -10424 -382620
93 -382620 204447 301261 -310104 -111159 370569 -94485 -402649 216500 306711 -305987
103 -305987 -168777 331375 25643 -241379 162555 142706 -306475 -41982 352547 -86072
$$ packed form
0@%%%%%%%Qj6J6j6J6k4L2m0M8o1P7q8J12j39J63j92K30k70L17l73M32m96N68o54
31c50P48q48R59j085J226j379J542j722J925k148K387k646K933l245L586l960
47b077M366m812N303n841O434p092P824q643R561j0599J1791j3175J4798j6730
61h892J9080k2017K5803l0888L8114m9253O8779j12515L74764j23728p61387P12359
73A30219K63130o77489M8644O30476m75804l64490P23322J41277q23409J86835
83b17289O97060m41160m87206O13243J29066o56144J95325O01562m44881l72196
93c82620N87067R6814o11365J98945M81728m65054l08164O19149R0211o12698
103c05987J37210N00152l05732k67022M03934j9849m49181K64493L94529m38619
$$ plain form
113 -86072 -357532 159388 278146 -182877 -115516 211342 -27841 -184479 156964 120332
123 120332 -264620 -73054 274510 -8746 -231826 102723 174253 -150304 -69947 187847
133 187847 -27051 -200136 78789 140236 -133298 -63237 165640 -10500 -148973 108613
143 108613 141584 -164309 -118506 163577 50107 -155438 5307 103798 -64112 -23423 138851
154 138851 -28095 -169184 75787 162084 -118683 -139536 119236 70825 -106312 21258
164 21258 97145 -85897 -55039 140690 4836 -171682 31019 142018 -86866 -95560 129602
175 129602 41068 -134316 35624 128355 -89574 -90725 115069 15728 -131674 55206 117093
186 117093 -115643 -73482 163709 30480 -164145 21723 122941 -79552 -66420 109226
$$ packed form
113h6072k71460N16920J18758m61023O7361L26858k39183j56638L41443l6632
123A20332l84952J91566L47564k83256k23080L34549P1530l24557Q0357K57794
133A87847k14898j73085K78925O1447k73534P0061K28877j76140j38473K57586
143A08613L2971l05893M5803K82083j13470k05545J60745R8491j67910M0689J62274
154A38851j66946j41089K44971Q6297k80767k0853K58772m8411j77137J27570
164B1258P5887j83042L0858J95729j35854j76518K02701J10999k28884q694K25162
175A29602q8534j75384J69940R2731k17929j151K05794r9341j47402J86880O1887
186A17093k32736M2161K37191j33229j94625J85868J01218k02493J3132J75646
$$ plain form
196 109226 -14408 -121394 92741 116059 -136594 -72794 157364 14668 -145833 42172
206 42172 94880 -100066 -32094 133772 -31380 -128371 95528 99195 -134730 -45239 142141
217 142141 -28252 -131110 86231 87971 -124170 -23011 139035 -39873 -113431 101160
227 101160 63714 -144601 -5046 152255 -58399 -129399 108345 80850 -129719 -8908
237 -8908 126451 -64955 -99540 119431 45408 -153644 13631 152661 -68194 -113874 115460
248 115460 57739 -134096 12248 125330 -80198 -93954 125863 39574 -145807 23747
258 23747 136719 -80611 -98493 121494 40118 -139682 21940 125528 -80888 -85986 124134
269 124134 31563 -138257 33511 128133 -89407 -92081 125755 35339 -139224 26217 122954
$$ packed form
196A09226j23634j06986K14135K3318k52653O3800K30158j42696j60501J88005
206D2172N2708j94946O7972J65866j65152r6991K23899L667k33925Q9491J87380
217A42141j70393j02858K17341J740k12141J01159J62046j78908p3558K14591
227A01160l7446k08315J39555J57301k10654p1000K37744k7495k10569J20811
237h908J35359j91406l4585K18971p4023j99052J67275J39030k20855m5680K29334
248A15460n7721j91835J46344J13082k05528j3756K19817q6289j85381J69554
258B3747J12972k17330j7882K19987q1376j79800J61622J03588k06416n098K10120
269A24134r2571j69820J71768R4622k17540k674K17836r0416j74563J65441R6737
$$ plain form
280 122954 -83307 -82001 124524 25690 -140181 35312 126539 -90596 -88805 126699 32783
291 32783 -137299 31390 123093 -86417 -82309 125582 26186 -139355 33973 123854 -88842
302 -88842 -85245 124862 29454 -136289 31311 120535 -85741 -81772 121848 26636 -134258
313 -134258 33199 120897 -84361 -82264 120540 29845 -131027 28914 116120 -81772 -79702
324 -79702 116864 26690 -130303 29624 117074 -80414 -81680 114682 30242 -126206 26910
335 26910 113480 -77465 -77397 113783 28020 -125987 27834 114246 -77445 -80317 110558 29861
347 29861 -123060 24284 109718 -74295 -75863 108269 27167 -120662 26428 109693 -73380
358 -73380 -76725 106233 30578 -116526 21733 104814 -68027 -72417 99981 26259 -112618
$$ packed form
280A22954k06261J306K06525r8834j65871J75493R1227k17135J791K15504r3916
291C2783j70082J68689R1703k09510M108K07891r9396j65541J73328Q9881k12696
302h8842L597K10107r5408j65743J67600Q9224k06276L969K03620r5212j60894
313a34258J67457Q7698k05258K097K02804r0695j60872J59941Q7206j97892K070
324g9702J96566r0174j56993J59927Q7450j97488j266J96362q4440j56448J53116
335B6910Q6570j90945O8J91180q5763j54007J53821Q6412j91691k872J90875q0697
347B9861j52921J47344Q5434j84013j568J84132q1102j47829J47090Q3265j83073
358g3380l345J82958p5655j47104J38259Q3081j72841m390J72398p3722j38877
$$ plain form
369 -112618 23191 101946 -68368 -72924 98246 29530 -109096 18267 98463 -61152 -68285
380 -68285 92024 26261 -103099 21421 94721 -63295 -67088 92730 27053 -103648 17245
391 17245 93261 -58360 -65750 85802 24123 -96824 20932 87835 -61628 -61248 90034
402 90034 23544 -99205 19450 89700 -56809 -61275 83056 21864 -91728 21276 81386
413 81386 -60026 -55563 84927 17340 -94027 22433 83354 -57720 -56779 80628 20101
424 20101 -85548 20886 73854 -55856 -46167 80150 10172 -87688 27473 77722 -58907
435 -58907 -52748 76872 16370 -79840 21449 65085 -55755 -37969 77686 3375 -82852
446 -82852 32474 71919 -60187 -44780 76764 9694 -77074 27226 61818 -57598 -33631
$$ packed form
369a12618J35809P8755j70314m556J71170o8716j38626J27363Q0196j59615p133
380f8285J60309o5763j29360J24520P3300j58016l793J59818o5677j30701J20893
391A7245P6016j51621p390J51552o1679j20947J17756O6903j49463L80J51282
402I0034o6490j22749J18655P0250j46509m466J44331o1192j13592J13004O0110
413H1386j41412M463J40490o7587j11367J16460O0921j41074R41J37407o0527
424B0101j05649J06434N2968j29710R689J26317o9978r7860J15161N0249j36629
435e8907O159J29620o0502r6210J01289M3636j20840J7786J15655p4311q6227
446h2852J15326L9445j32106J5407J21544o7070q6768J04300L4592j19416K3967
$$ plain form
457 -33631 74955 -2156 -76759 37323 61621 -66597 -35416 81307 2060 -79501 30618
468 30618 61349 -55132 -28347 69267 -9810 -68362 46829 54361 -73833 -30133 84540
479 84540 -361 -77599 30235 53845 -54768 -20088 67181 -18044 -66708 50799 51667 -72421
491 -72421 -24409 80647 -6963 -71585 38510 50243 -61002 -19501 69485 -15349 -62980
502 -62980 46973 41748 -70698 -12039 80851 -20592 -76513 46963 55829 -63300 -23598
513 -23598 66021 -13843 -53609 51151 32236 -77393 -3851 88401 -24611 -81275 46815
524 46815 55629 -61060 -18933 62951 -21917 -53291 57066 32682 -79903 -5670 84996 -23777
536 -23777 -72127 50675 46885 -66849 -12428 71224 -21258 -59666 49032 33674 -67753
$$ packed form
457c3631J08586p7111p4603J14082K4298j28218L1181J16723p9247q1561J10119
468C0618L0731j16481K6785R7614p9077n8552J15191P532j28194M3700J14673
479H4540q4901p7238J07834K3610j08613L4680Q7269q5225m8664J17507Q68j24088
491g2421M8012J05056q7610o4622J10095J1733j11245M1501Q8986q4834m7631
502f2980J09953n225j12446N8659R2890j01443n5921J23476Q866j19129L9702
513b3598Q9619p9864l9766J04760j8915j09629P3542R2252j13012n6664J28090
524D6815Q814j16689M2127Q1884q4868l1374J10357k4384j12585P4233R0666j08773
536b3777m8350J22802l790j13734N4421Q3652r2482l8408J08698j5358j01427
$$ plain form
547 -67753 -466 72507 -34958 -65211 62794 46482 -76943 -19749 73528 -11279 -54315
558 -54315 40811 23787 -62878 11979 74456 -42555 -69691 64371 50638 -72865 -21039
569 -21039 66018 -14898 -48448 46680 21948 -68474 7747 74722 -35736 -64457 57731 40583
581 40583 -69854 -9036 70246 -21555 -56365 47061 32551 -60069 -756 60044 -33406 -49950
593 -49950 60529 30068 -77525 -7539 77953 -14951 -61623 34121 32503 -46384 3713 51060
605 51060 -38304 -46255 64770 33981 -75980 -13813 71869 -9781 -54156 31493 25562 -48940
617 -48940 4365 54772 -32766 -48812 54116 32141 -64338 -6879 64243 -19325 -52961 40946
629 40946 33017 -52186 -6680 51856 -20946 -39477 45949 19151 -63829 2825 68270 -24147
$$ packed form
547f7753O7287P2973j07465l0253J28005j6312j23425N7194R3277q4807m3036
558e4315R5126j7024q6665P4857O2477j17011k7136J34062j3733j23503N1826
569b1039Q7057q0916l3550R5128k4732r0422P6221O6975j10458k8721J22188j7148
581D0583j10437O0818P9282r1801l4810J03426j4510r2620N9313O0800r3450j6544
593d9950J10479l0461j07593O9986Q5492r2904m6672R5744j618p8887N0097M7347
605E1060q9364p951J11025l0789j09961O2167Q5682q1650m4375Q5649n931p4502
617d8940N3305N0407q7538j6046J02928k1975r6479N7459P1122q3568l3636R3907
629D0946p929q5203M5506N8536p2802j8531Q5426k6798q2980O6654O5445r2417
$$ plain form
641 -24147 -60564 38165 39713 -43952 -9653 41993 -21836 -31845 49174 16998 -65624 821
653 821 68000 -18136 -55817 33153 33241 -42118 -5123 42761 -23363 -36090 44118 20159 -56250
666 -56250 229 56898 -21327 -46444 39639 29198 -48745 -6603 47651 -15959 -35614 35344
678 35344 15430 -48042 8192 51597 -30390 -46252 44575 30486 -50177 -9577 44191 -14070
690 -14070 -29093 35789 9665 -48890 12421 52591 -30568 -44394 42562 26436 -46628 -3342
702 -3342 41542 -20213 -29119 38029 10524 -47615 9723 45612 -29237 -34563 43225 17185 -48293
715 -48293 3749 44576 -21698 -30497 35051 10076 -40685 12599 37667 -33147 -27657 46261
727 46261 11986 -49908 5473 42401 -22254 -26612 33755 5057 -38563 17261 35579 -34810
$$ packed form
641b4147l6417R8729J548q3665L4299N1646o3829j0009Q1019l2176q2622O6445
653H21O7179q6136l7681Q8970Q8p5359L6995M7884o6124j2727Q0208k3959p6409
666e6250N6479N6669p8225k5117Q6083j0441p7943M2142N4254o3610j9655P0958
678C5344j9914o3472N6234M3405q1987j5862R0827j4089q0663M0600N3768n8261
690a4070j5023O4882k6124n8555O1311M0170q3159j3826Q6956j6126p3064M3286
702c342M4884o1755q906O7148k7505n8139N7338L5889p4849n326P7788k6040o5478
715d8293N2042M0827o6274q799O5548k4975n0761N3284K5068p0814N490P3918
727D6261l4275o1894N5381L6928o4655m358O0367k8698m3620N5824J8318p0389
$$ plain form
739 -34810 -23936 45787 8091 -46361 10335 37911 -26539 -22271 36597 2052 -39168 17453
751 17453 32474 -33745 -19318 42480 1583 -43187 16122 35355 -29599 -20043 37415 1937
763 1937 -36009 17381 27934 -32388 -14143 40461 -2758 -40913 17749 32144 -29903 -17811
775 -17811 35084 -404 -33625 17942 25375 -31190 -11760 38456 -3412 -36864 18859 28802
787 28802 -29576 -14670 34730 -2181 -33348 17470 24360 -30070 -11359 35759 -4500 -34671
799 -34671 19296 26713 -30061 -13256 35317 -2302 -32773 17894 24546 -29249 -10902 35091
811 35091 -4617 -33836 18972 25382 -30150 -12687 34607 -3340 -33112 17973 24701 -29049
823 -29049 -11503 34526 -3679 -32644 18622 24946 -29234 -11607 34825 -3364 -33014 17974
$$ packed form
739c4810J0874O9723l7696n4452N6696K7576o4450M268N8868l4545m1220N6621
751A7453J5021o6219J4427O1798m0897m4770N9309J9233o4954R556N7458l5478
763A937l7946N3390J0553o0322J8245N4604m3219l8155N8662J4395o2047J2092
775a7811N2895l5488l3221N1567P433n6565J9430N0216m1868l3452N5723R943
787B8802n8378J4906M9400l6911l1167N0818O890n4430J8711M7118m0259l0171
799c4671N3967P417n6774J6805M8573l7619l0471N0667O652n3795J8347M5993
811C5091l9708k9219N2808O410n5532J7463M7294l7947k9772N1085O728n3750
823b9049J7546M6029l8205k8965N1266O324n4180J7627M6432l8189k9650N0988
$$ plain form
835 17974 24721 -29097 -11857 33963 -4074 -32878 18426 24403 -29561 -11530 34751 -3769
847 -3769 -32673 18916 24589 -29611 -10952 35209 -4220 -33092 18978 24329 -29783 -10856 34215
860 34215 -5552 -32547 20024 23348 -31141 -10269 35531 -5112 -32557 19616 23490 -29456
872 -29456 -9082 34054 -6203 -31063 20657 22268 -30557 -8975 34135 -6265 -31408 19360
884 19360 21774 -29194 -8674 32415 -6314 -29256 19750 20540 -28801 -7346 32620 -6486 -29339
897 -29339 19416 20873 -27858 -8166 30734 -6071 -27682 18536 18665 -27657 -6520 30692 -7196
910 -7196 -27997 19034 19666 -26953 -7301 29847 -5835 -26113 18236 17909 -26279 -5778 29353
923 29353 -7241 -26541 18525 18090 -26487 -6827 28568 -6252 -25648 17330 17245 -25021 -5604
$$ packed form
835A7974O747n3818J7240M5820l8037k8804N1304N977n3964J8031M6281l8520
847c769k8904N1589N673n4200J8659M6161l9429k8872N2070N351n4112J8927M5071
860C4215l9767k6995N2571L324n4489K0872M5800m0643k7445N2173L874n2946
872b9456K0374M3136m0257k4860N1720J611n2825K1582M3110m0400k5143N0768
884A9360K414n0968K0520M1089l8729k2942M9006P90m9341K1455L9966l9106k2853
897b9339M8755J457m8731J9692L8900l6805k1611M6218J29m6322K1137L7212l7888
910g196k0801M7031O32m6619J9652L7148l5682k0278M4349l27m4188K0501L5131
923B9353l6594j9300M5066m35m4577J9660L5395l4820j9396M2978q5m2266J9417
$$ plain form
936 -5604 27654 -6769 -24449 18344 17033 -25570 -5759 28218 -6046 -25094 16548 16781 -23982
949 -23982 -5750 25904 -7102 -23429 17735 15511 -25223 -4827 27675 -6620 -24201 17257
961 17257 16578 -23577 -4856 25769 -7207 -22209 17942 14027 -25222 -3287 26925 -8633 -23810
974 -23810 18172 15333 -24439 -4198 25358 -7753 -20851 18291 12384 -24497 -811 26342
986 26342 -10325 -22271 19736 13947 -24847 -3102 24537 -8606 -19612 17738 10137 -23713
998 -23713 907 24305 -11998 -20148 20567 12055 -24571 -1255 24045 -8838 -17955 17510 8570
1011 8570 -22060 2621 22029 -13416 -17930 20981 9628 -24784 -162 22975 -9642 -16782
1023 -16782 17042 7151 -20670 4087 20405 -13940 -15186 21543 7540 -24330 1960 22454
$$ packed form
936e604L3258l4423j7680M2793j311m2603J9811L3977l4264j9048M1642K33m0763
949b3982J8232L1654l3006j6327M1164k224m0734K0396L2502l4295j7581M1458
961A7257o79m0155J8721L0625l2976j5002M0151l915l9249K1935L0212l5558j5177
974b3810M1982k839l9772K0241K9556l3111j3098L9142n907l6881K3686K7153
986B6342l6667j1946M2007n789l8794K1745K7639l3143j1006L7350p601l3850
998b3713K4620K3398l6303q150M0715q512l6626K3316K5300l2883r117L5465q940
1011H570l0630K4681J9408l5445m514L8911j1353l4412K4622K3137l2617p140
1023a6782L3824r891k7821K4757J6318l4345j246L6729j4003l1870K6290K0494
$$ plain form
1035 22454 -10712 -16249 16811 6437 -19797 3902 17765 -14069 -12715 21112 4976 -24019
1047 -24019 3721 22365 -11047 -15863 16374 6772 -17770 4027 15930 -13723 -10775 20426
1059 20426 3308 -23506 4157 21255 -11330 -15435 15779 6350 -17303 3617 15336 -12525
1071 -12525 -9852 19369 2792 -21730 5535 20400 -12350 -14993 16935 6773 -18173 2191
1083 2191 15094 -11276 -9382 17660 1083 -20970 7211 20155 -14016 -15319 18253 7937
1095 7937 -18172 1611 14925 -10301 -8332 17250 207 -20749 7747 19599 -14678 -15120 18083
1108 18083 6988 -18636 1897 15166 -10396 -8892 16706 990 -18897 7786 17965 -14692
1120 -14692 -12878 19262 5821 -19916 2137 16491 -9684 -9864 14575 624 -17100 8363
$$ packed form
1035B2454l3166n537L3060j0374k6234K3699J3863l1834J354L3827j6136k8995
1047b4019K7740J8644l3412m816L2237r602k4542K1797J1903k9653K948L1201
1059B0426j7118k6814K7663J7098l2585m105L1214r429k3653K0920J1719k7861
1071a2525K673K9221j6577k4522K7265J4865l2750k643L1928j0162k4946K0364
1083B191J2903k6370J894K7042j6577k2053K8181J2944l4171j303L3572j0316
1095G937k6109J9783J3314k5226J969K5582j7043k0956K8496J1852l4277m42L3203
1108A8083j1095k5624K0533J3269k5562J504K5598j5716j9887K6683J0179l2657
1120a4692J814L2140j3441k5737K2053J4354k6175j80K4439j3951j7724K5463
$$ plain form
1132 8363 15819 -16246 -11684 20696 5466 -20752 2206 16906 -8842 -9171 14199 93 -16276
1145 -16276 9193 15085 -16601 -10934 20314 3976 -20468 3174 16203 -10147 -9349 14551 634
1158 634 -15734 8292 13769 -15121 -8462 19724 1967 -19937 5197 16766 -10859 -10329 13990
1171 13990 1609 -14412 7109 11317 -14935 -6659 19295 384 -20090 5837 16900 -10468
1183 -10468 -10023 13420 1703 -13222 7377 10819 -14410 -5991 18512 -243 -19105 6183 15485
1196 15485 -11457 -9375 13935 1206 -13877 6651 10773 -13054 -5083 17059 -1368 -17232
1208 -17232 8125 14585 -12709 -8796 14841 1622 -13858 5627 9787 -12139 -4063 15601 -2857
1221 -2857 -16419 8800 13714 -12922 -8230 14583 1461 -12942 5877 9223 -11423 -3324 14801
$$ packed form
1132H363P456l2065M562L2380j5230k6218K2958J4700k5748l29K3370j4106j6369
1145a6276K5469N892l1686N667L1248j6338k4444K3642J3029k6350P98K3900j3917
1158F34j6368K4026N477k8890O659K8186j7757k1904K5134J1569k7625N30K4319
1171A3990j2381j6021K1521M208k6252Q276K5954j8911k0474K5927J1063k7368
1183a0468M45K3443j1717j4925K0599L442k5229Q419K4503j8755j8862K5288R302
1196A5485k6942K082K3310j2729j5083K0528M122k3827P971K2142j8427j5864
1208a7232K5357O460k7294L913K3637j3219j5480J9485M160k1926Q076J9664j8458
1221b857j3562K5219M914k6636M692K2813j3122j4403J8819L346k0646Q099J8125
$$ plain form
1234 14801 -2951 -15020 8537 11895 -12855 -6972 14050 95 -13063 5945 9028 -10898
1246 -10898 -3323 13452 -2886 -12924 8947 10247 -12683 -5138 14407 -445 -12854 5925
1258 5925 8703 -10180 -3124 11938 -3456 -11775 8786 8656 -12656 -4275 13766 -984 -12161
1271 -12161 6149 8376 -9673 -2671 11535 -3014 -10645 8306 7789 -11763 -3542 12744 -1751
1284 -1751 -11657 6096 7902 -9587 -3075 10866 -2507 -9957 7505 7268 -10707 -2776 12332
1297 12332 -1784 -11001 6382 7882 -9441 -3273 10576 -2220 -9821 6734 6722 -10455 -2720
1310 -2720 11593 -2239 -10799 6602 7769 -9573 -3078 11019 -1806 -9729 6622 6859 -9986
1323 -9986 -2486 11314 -2455 -10635 6670 7457 -10000 -3284 10979 -2028 -10059 6631 7049 -9855
$$ packed form
1234A4801j7752j2069K3557L358k4750N883K1022j3955j3158J9008L083j9926
1246a0898P575J6775j6338j0038K1871J300k2930P545J9545j4852j2409J8779
1258E925K778j8883P056J5062j5394q319K0561j30k1312Q381J8041j4750j1177
1271a2161J8310K227j8049P002J4206j4549p631J8951n17j9552Q221J6286j4495
1284a751r906J7753J806j7489O512J3941j3373p450J7462k37j7975P931J5108
1297A2332j4116r217J7383J500j7323O168J3849j2796p601J6555j2j7177P735
1310b720J4313j3832q560J7401J167j7342O495J4097j2825p923J6351K37j6845
1323i986P500J3800j3769q180J7305P87j7457O716J4263j3007q031J6690M18j6904
$$ plain form
1337 -9855 -2477 11381 -2244 -10190 7000 7318 -10015 -2729 11275 -2278 -10285 6687 7018 -10041
1351 -10041 -2644 10877 -2651 -10004 7128 6687 -10373 -2124 11565 -2643 -10107 7305 7052
1364 7052 -10007 -2092 10952 -2999 -9595 7495 6091 -10693 -1759 11251 -3496 -10039 7654
1377 7654 6388 -10469 -1625 11064 -3312 -9235 7761 5844 -10241 -816 11026 -4062 -9325
1390 -9325 8152 5850 -10665 -1429 10705 -3663 -8965 7454 5013 -10083 -375 10467 -4392
1403 -4392 -8727 8348 5514 -10231 -786 10540 -3584 -8286 7477 4678 -9662 -203 9839
1416 9839 -4558 -8193 7959 4618 -10153 -437 9954 -3925 -8014 7480 4546 -9170 103
1429 103 9416 -4266 -7278 7955 4034 -9739 84 9616 -4164 -7857 7148 4075 -8971 0
$$ packed form
1337i855P378J3858j3625p946J7190L18j7333P286J4004j3553q007J6972L31j7059
1351a0041P397J3521j3528p353J7132m41j7060Q249J3689j4208p464J7412k53
1364G052j7059P915J3044j3951o596J7090j404j6784Q934J3010j4747o543J7693
1377G654j266j6857Q844J2689j4376n923J6996j917j6085R425J1842j5088n263
1390i325J7477k302j6515R236J2134j4368n302J6419k441j5096R708J0842j4859
1403d392m335J7075k834j5745R445J1326j4124m702J5763k799j4340R459J0042
1416I839j4397l635J6152l341j4771R716J0391j3879m089J5494k934j3716R273
1429A03R313j3682l012J5233l921j3773R823R532j3780l693J5005l073j3046Q971
$$ plain form
1443 0 8603 -4335 -6801 7524 3584 -9192 418 9294 -3987 -7111 7118 4001 -8454 145
1457 145 8255 -4093 -6470 6920 3084 -8731 391 8443 -4250 -6711 6893 3564 -8279 204
1471 204 8175 -3668 -6045 6707 3134 -7960 740 7906 -4272 -6253 6908 3233 -8375 91
1485 91 7757 -3748 -6041 6160 2807 -7602 851 7546 -4147 -5709 6923 3136 -7979 447
1499 447 7751 -3589 -5842 6103 2768 -7508 496 7059 -4144 -5506 6560 2546 -7960 641
1513 641 7669 -3725 -5901 6164 3172 -7104 533 6800 -3794 -4920 6439 2207 -7901 919
1527 919 7550 -4096 -5980 6026 2976 -7182 373 6532 -3809 -4694 6371 1939 -7511 1541
1541 1541 7410 -4238 -5436 6485 2689 -7222 588 6417 -3849 -4430 5992 1315 -7211 1789
$$ packed form
1443@Q603j2938k466J4325l940j2776R610Q876j3281l124J4229l117j2455Q599
1457A45Q110j2348k377J3390l836j1815R122Q052j2693k461J3604l329j1843Q483
1471B04P971j1843k377J2752l573j1094Q700P166j2178j981J3161l675j1608Q466
1485I1P666j1505k293J2201l353j0409Q453O695j1693j562J2632l787j1115Q426
1499D47P304j1340k253J1945l335j0276Q004O563j1203j362J2066m014j0506Q601
1513F41P028j1394k176J2065k992j0276P637O267j0594j126J1359m232j0108Q820
1527I19O631j1646j884J2006l050j0158P555O159j0341q85J1065m432r450R052
1541A541N869j1648j198J1921l796r911P810N829j0266n81J0422m677q526R000
$$ plain form
1555 1789 6802 -4852 -5105 6743 2521 -7226 733 6447 -3407 -3981 5822 1114 -6682 2250 6306
1570 6306 -5146 -4768 6720 2006 -7451 673 6136 -3575 -3985 5464 921 -6182 2407 5825 -5105
1585 -5105 -3934 7113 1653 -7342 1162 6245 -3562 -4044 5157 759 -5904 2436 4972 -5355 -3473
1600 -3473 6985 986 -7379 1569 6285 -3600 -3868 5232 934 -5400 2467 4664 -5152 -2902 6767
1615 6767 492 -7368 1780 6092 -3990 -4128 5052 1003 -5299 2140 4293 -4804 -2305 6774 132
1630 132 -6976 2393 6244 -4104 -3988 5174 1041 -5188 1914 3866 -4756 -2100 6236 -476 -6871
1645 -6871 2675 5841 -4504 -3739 5423 1117 -5069 1941 3907 -4271 -1692 5877 -831 -6300 3072
1660 3072 5330 -4992 -3578 5494 872 -5257 1656 3736 -3993 -1375 5483 -995 -5695 3507 5096
$$ packed form
1555A789N013j1654k53J1848m222r747P959N714r854n74R803m708p796Q932M056
1570F306j1452L78J1488m714r457Q124N463r711m10R449m543p103Q589L418j0930
1585e105J171J1047n460q995Q504N083r807m82R201m398o663Q340K536j0327J882
1600c473J0458n999q365Q948M716r885k68R100m298o334P867K197r816K250R669
1615F767o275p860R148M312j0082j38R180m049o302P439K153r097K499R079o642
1630A32p108R369L851j0348J16R162m133o229P102J952q622K656Q336o712o395
1645f871R546L166j0345P65R162m306o186P010J966q178K579P569o708n469R372
1660C072K258j0322J414R072m622o129O913K080p729K618O858o478m700R202J589
$$ plain form
1675 5096 -5010 -3208 5771 945 -5198 1577 3637 -3733 -1556 4902 -1217 -5386 3288 4454 -5087
1690 -5087 -2898 5739 681 -5236 1679 3969 -3375 -1610 4593 -851 -4704 3206 3934 -5052 -2459
1705 -2459 5637 375 -5477 1535 3917 -3282 -1842 4219 -709 -4299 3221 3673 -4862 -1966 5752
1720 5752 319 -5340 1631 4086 -3214 -1944 4044 -626 -4272 2801 3251 -4745 -1972 5458 -46
1735 -46 -5379 1862 4154 -3319 -2098 4216 -145 -3987 2674 3103 -4370 -1510 5345 -435 -5293 2105
1751 2105 3980 -3653 -2261 4135 -231 -3968 2439 2912 -4251 -1195 5229 -603 -4902 2521 3960
1766 3960 -3690 -1940 4322 -316 -4025 2355 2707 -4159 -1115 4757 -1009 -4763 2666 3512 -3875
1781 -3875 -1682 4414 -324 -3877 2402 2708 -3799 -749 4552 -1118 -4274 2799 3114 -4039 -1517
$$ packed form
1675E096j0106J802Q979m826o143O775K060p370K177O458o119m169Q674J166r541
1690e087K189Q637n058n917O915K290p344J765O203n444l853P910P28q986K593
1705b459Q096n262n852P012K382p199J440O061m928l590P520M52q535K896P718
1720E752n433n659O971K455p300J270N988m670l646P073M50p996K773P430n504
1735d6n333P241K292p473J221O314m361l842O661M29p473K860O855n780m858P398
1751B105J875p633J392O396m366l737O407M73p163L056O424n832m299P423J439
1766C960p650J750O262m638l709O380L52o866L044N872n766l754P429Q46p387
1781c875K193O096m738l553O279L06o507L050N301n670l156P073L15p153K522
$$ plain form
1796 -1517 4311 -643 -3872 2337 2491 -3686 -658 4182 -1163 -3795 2922 2860 -3912 -1092 4288 -616
1812 -616 -3668 2371 2394 -3552 -779 3839 -1223 -3582 2672 2350 -3839 -860 4070 -852 -3429 2432
1828 2432 2382 -3286 -567 3759 -1001 -3164 2663 2118 -3593 -610 3785 -1095 -3433 2407 2128 -3386
1844 -3386 -711 3607 -1006 -3059 2493 1999 -3336 -360 3705 -1078 -3138 2476 2243 -3369 -683
1859 -683 3538 -878 -3076 2268 1780 -3245 -505 3471 -1217 -3144 2511 2021 -3367 -500 3620 -892
1875 -892 -2979 2343 1992 -3075 -403 3354 -1208 -2895 2539 1759 -3589 -554 3575 -1099 -3024 2275
1891 2275 1947 -3071 -285 3254 -1220 -2626 2699 1745 -3408 -263 3558 -1182 -3001 2237 1753 -3146
1907 -3146 -369 3058 -1397 -2657 2518 1451 -3410 -39 3478 -1275 -2852 2551 1809 -3040 -222
$$ packed form
1796a517N828m954l229O209J54o177L028M840n345k632O717o2o772K820N380m904
1812f16l052O039K3n946K773M618n062k359O254l22o189K979M930m922k577N861
1828B432n0n668K719M326m760k163N827n45n711K983M395m880k338N840k79n514
1844c386K675M318m613k053N552m94n335K976M065m783k060N614k33n612K686
1859f83M221m416k198N344m88n025K740L976m688j927N655m90n388K867M120m512
1875h92k087N322l51n067K672L757m562j687N434p80n348L035M129m674j925N299
1891B275l28n018K786L539m474j406N325r54n153L145L821m740j819N238m84m899
1907c146K777L427m455j260N175j067m861L371L517m753j577N403p42m849K818
$$ plain form
1922 -222 3063 -1230 -2415 2507 1207 -3299 81 3286 -1550 -2794 2428 1569 -3052 -214 2916
1937 2916 -1202 -2149 2439 1229 -2943 322 3170 -1517 -2496 2498 1426 -2999 -190 2763 -1275
1952 -1275 -2256 2188 926 -2899 246 2839 -1489 -2276 2489 1328 -2858 -38 2839 -1071 -2026 2154
1968 2154 1039 -2664 246 2593 -1546 -2210 2315 1103 -2931 -87 2726 -1098 -2186 1994 1075
1983 1075 -2410 236 2540 -1312 -1906 2335 1117 -2837 -1 2691 -1172 -2127 1896 985 -2509 59
1999 59 2423 -1375 -1910 2184 999 -2689 223 2683 -1131 -1965 2081 1198 -2455 62 2356 -1283
2015 -1283 -1829 2078 761 -2636 196 2450 -1390 -2010 2130 1013 -2483 140 2380 -1169 -1640 2131
2031 2131 768 -2473 410 2405 -1446 -1834 2148 827 -2536 175 2215 -1347 -1700 1934 626
$$ packed form
1922b22L285m293j185M922j300m506L380L205m836j244N222q59m621K838L130
1937B916m118r47M588j210m172L265K848m687r79M994j072m425K809K953m038
1952a275r81M444j262l825L145K593m328p87M765j161m186K820K877l910r55M180
1968B154j115l703K910K347m139o64M525j212m034K844K813l824j088M180r19
1983A075l485K646K304l852n94M241j218l954K836K692l863r55M023r11l494K568
1999E9K364l798n35M094j185l688K912K460l814q34M046q83l653K517K294l639
2015a283n46L907j317l397K832K254l840o20M140j117l496K623K240l549m71L771
2031B131j363l241K883J995l851l88L982j321l363K711K040l562l53L634j308
$$ plain form
2046 626 -2385 411 2163 -1463 -1497 2293 734 -2472 335 2342 -1197 -1580 1901 578 -2142 448
2062 448 1878 -1644 -1484 2172 435 -2568 445 2200 -1299 -1488 1809 613 -1983 605 1887 -1433
2078 -1433 -1151 2154 349 -2407 515 2032 -1518 -1528 1786 465 -2051 448 1668 -1390 -1028 2076
2094 2076 193 -2201 802 2173 -1421 -1475 1923 594 -1990 337 1592 -1321 -1005 1844 -110 -2214
2110 -2214 769 1959 -1586 -1439 1980 644 -1928 442 1667 -1178 -816 1859 -5 -2044 913
2125 913 1780 -1713 -1312 2029 428 -2093 266 1533 -1170 -860 1650 -109 -1749 1116 1692 -1671
2141 -1671 -1078 2154 453 -1980 394 1689 -1105 -845 1536 -167 -1732 969 1402 -1789 -990 2027
2157 2027 295 -2113 475 1689 -986 -837 1515 -13 -1439 941 1282 -1631 -865 2077 157 -2084
$$ packed form
2046F26l011K796J752l626l4L790j559l206K807K007l539l83L481j323k720K590
2062D48J430l522J60L656j737l003L013J755l499j89L297j196k596K588J282l320
2078a433K82L305j805k756K922J517l550j0L314j321k516K499J220l058L62L104
2094B076j883k394L003J371l594n4L398j329k584K327J255k913L16K849j954k104
2110b214K983J190l545J47L419j336k572K370J225k845L62K675j864k039K957
2125I13Q67l493M01L341j601k521K359J267k703L10K510j759j640K865N76l363
2141a671N93L232j701k433K374J295k794K60K381j703j565K701M33l191P99L017
2157B027j732k408K588J214k675J49K352j528j426K380L41k913P66K942j920k241
$$ plain form
2173 -2084 480 1609 -1113 -1078 1294 58 -1441 761 1161 -1561 -615 2018 73 -1968 640 1695
2189 1695 -1029 -1001 1357 190 -1362 677 1039 -1542 -621 1847 -120 -1992 672 1643 -1136 -1054 1446
2206 1446 330 -1348 628 1116 -1293 -447 1746 -108 -1915 789 1600 -1322 -1113 1428 248 -1442
2222 -1442 512 996 -1235 -435 1752 -167 -1702 952 1577 -1338 -928 1649 282 -1424 558 1061
2238 1061 -1180 -432 1568 -379 -1761 897 1338 -1480 -884 1669 211 -1481 587 1154 -1128 -335
2254 -335 1544 -341 -1536 1036 1285 -1528 -787 1684 36 -1608 484 1073 -1126 -436 1436 -418
2270 -418 -1375 1090 1141 -1465 -528 1736 26 -1493 668 1059 -1191 -430 1316 -435 -1315 959 859
2287 859 -1489 -431 1604 -218 -1445 725 1072 -1103 -306 1368 -268 -1162 964 858 -1333 -271
$$ packed form
2173b084K564J129k722L5K372j236j499K202M00k722R46K633j945k041K608J055
2189A695k724K8K358j167j552K039L62k581R21K468j967j872K664R71k779Q2K500
2206A446j116j678J976M88k409Q46K193j854j807K704Q11k922K09K541j180j690
2222a442J954M84k231Q00K187j919j535K654O25k915M10K577j367j706J982N03
2238A061k241P48K000j947j382K658M41k818N96K553j458j692K068N67k282P93
2254c35J879j885j195K572K49k813P41K471j648j644K092N89k199O90J872j854
2270d18r57K465N1k606R37K264j710j519K161L91k250P61J746j751q80K274j00
2287H59k348J058K035j822j227K170L47k175P97J674j636q94K126j06k191J062
$$ plain form
2303 -271 1533 -271 -1407 810 916 -1164 -433 1219 -339 -1109 866 734 -1193 -176 1423 -302
2319 -302 -1201 876 934 -1098 -319 1185 -232 -1074 755 637 -1216 -241 1169 -424 -1197 788 794 -1151
2337 -1151 -305 1198 -219 -1016 714 742 -975 -103 1136 -349 -1092 790 724 -1154 -376 1139 -253
2354 -253 -1159 616 671 -1037 -166 1082 -284 -929 781 751 -1037 -176 1225 -254 -1054 678 696 -967
2372 -967 -304 1029 -296 -988 690 515 -1100 -262 1144 -327 -1049 741 715 -958 -227 1082 -255
2389 -255 -853 743 544 -1040 -92 1091 -371 -1055 712 600 -1065 -264 1028 -323 -862 802 560
2406 560 -941 22 1162 -379 -866 833 635 -988 -168 970 -325 -863 624 418 -1022 -99 944
2423 944 -553 -864 843 557 -1031 -136 1091 -239 -800 728 542 -863 87 933 -479 -843 796
$$ packed form
2303b71J804j804j136K217J06k080P31J652j558p70J975j32j927J017J599j725
2319c02q99K077N8k032P79J504j417q42J829j18j853R75J410j593p73J985Oj945
2337a151Q46J503j417p97J730K8j717Q72J239j485p43J882o6j878P78J515j392
2354b53r06J775N5j708Q71J248j366o45J710l0j788Q61J401j479q00J732J8j663
2372i67O63J333j325o92J678j75j615Q38J406j471p22J790k6j673P31J309j337
2389b55n98J596j99j584R48J183j462o84J767j12j665Q01J292j351n39J664k42
2406E60j501R63J140j541m87J699j98j623Q20J138j295n38J487k06j440R23J043
2423I44j497l11J707k86j588Q95J227j330n61J528j86j405R50Q46j412l64J639
$$ plain form
2440 796 414 -1098 -96 948 -361 -841 659 400 -895 2 881 -453 -673 841 430 -974 52
2457 52 1002 -360 -832 615 393 -884 -29 719 -527 -659 772 221 -971 62 1027 -345 -738 697
2475 697 453 -763 58 758 -426 -566 759 235 -978 42 917 -454 -819 663 346 -816 -26
2492 -26 709 -414 -583 718 242 -835 157 849 -443 -624 686 409 -813 7 745 -429 -594 628
2510 628 151 -797 103 773 -507 -646 799 333 -738 70 769 -299 -491 612 302 -804 168 670
2528 670 -481 -599 699 191 -839 7 679 -402 -488 600 222 -755 135 711 -412 -472 749 234
2546 234 -784 79 665 -443 -538 508 184 -698 71 606 -503 -474 619 162 -763 180 748 -404 -524
2565 -524 645 237 -657 139 587 -410 -427 594 57 -742 142 577 -461 -554 573 216 -688 93 602
$$ packed form
2440G96l82j512J002J044j309m80J500k59j295Q97Q79j334k20J514m11j404J026
2457E2R50j362m72J447k22j277Q55P48j246j32J431n51j192J033R65j372l93J435
2475F97k44j216Q21P00j184j40J325n24j213J020Q75j371l65J482l17j162P90
2492b6P35j123j69J301m76j077R92O92j292j81J310k77j222Q20P38j174j65J222
2510F28m77r48R00O70j280j39J445m66j071Q08O99j068j92J103l10j106R72N02
2528F70j151j18J298n08j030Q46O72j081q6J088l78r77Q90N76j123o0J221n15
2546B34j018Q63N86j108r5J046l24q82P69N35j109K9J093m57r25R43N68j152j20
2565e24J169m08q94P96M48r97j7J021n37p99Q84M35j038r3J127l57r04P81N09
$$ plain form
2584 602 -381 -345 588 138 -725 234 624 -408 -441 621 147 -790 120 576 -362 -416 522 59 -665 219
2604 219 651 -484 -374 695 174 -673 213 688 -355 -358 539 103 -611 220 565 -523 -426 645 85
2623 85 -787 114 591 -469 -420 571 56 -511 295 432 -474 -264 706 8 -689 230 602 -455 -395 488
2643 488 41 -607 203 396 -487 -227 671 -22 -633 304 602 -380 -310 541 74 -535 231 413 -436 -200
2663 -200 534 -120 -634 286 476 -479 -361 514 42 -475 205 407 -426 -86 606 -120 -614 397 460 -531
2683 -531 -342 518 10 -509 130 297 -372 -157 410 -117 -520 405 368 -496 -209 606 44 -503 166 346
$$ packed form
2584F02r83L6R33m50q63R59L90j032l3J062m74r37R10M56r38n4R38m63p24Q84
2604B19M32j135J10J069n21q47Q86M75j043lQ97m36p14Q31L45j088R7J071n60
2623H5q72R01M77j060M9R91n15n67Q06J37r06K10R70o98o97R19L72j057O0Q83
2643D88m47o48Q10J93q83K60Q98o93o11R37K98r82P0Q51m67o09P66J82q49K36
2663b00P34o54n14R20J90r55J18Q75m72n17O80K02q33L40O92p26m94J011O3r91
2683e31J89Q60n08n19O39J67o69K15N67n27m03R25l7q64K87Q15n62n47O69J80
$$ [...]
8191f2
##END NTUPLES=NMR FID
##END=
