##TITLE=1H_Pr 5291-Pr
 200.13Hz, CDCl3.
 8 sc
 
 13.4.2026
##JCAMPDX= 6.0         $$ Bruker NMR JCAMP-DX V2.0
##DATA TYPE= NMR FID
##DATA CLASS= NTUPLES
##ORIGIN= UXNMR, Bruker Analytische Messtechnik GmbH
##OWNER= pz
$$ XWIN-NMR		Version 3.5
$$ Mon Apr 13 14:02:00 2026 Russian Standard Time (UT+4h)  she@DPX200
##.OBSERVE FREQUENCY= 200.1313
##.OBSERVE NUCLEUS= ^1H
##.DELAY= (6, 6)
##.ACQUISITION MODE= SIMULTANEOUS
##.ACQUISITION SCHEME= undefined
##.AVERAGES= 8
##.DIGITISER RES= 18
##SPECTROMETER/DATA SYSTEM= spect
##.PULSE SEQUENCE= zg30
##.SOLVENT NAME= CDCl3
##.SHIFT REFERENCE= (INTERNAL, CDCl3, 0, 14.3821)
##AUDIT TRAIL= $$ (NUMBER, WHEN, WHO, WHERE, WHAT)
$$ ##TITLE= Audit trail, XWIN-NMR		Version 3.5
$$ ##JCAMPDX= 5.01
$$ ##ORIGIN= Bruker BioSpin GmbH
$$ ##OWNER= she
$$ F:/spectra/data/she/nmr/H-C/1/audita.txt
$$ ##AUDIT TRAIL=  $$ (NUMBER, WHEN, WHO, WHERE, WHAT)
(   1,<2026-04-13 14:00:39.34 +0400>,<she>,<DPX200>,
      <created by zg, POWCHK disabled, PULCHK disabled
       configuration hash MD5:
       00 E9 B6 7A A2 85 ED C7 34 08 36 98 17 FE 4E 26
       data hash MD5: 16K
       FA 31 74 77 0C C0 19 44 D9 DD B2 16 4A 35 96 1D>)
$$ ##END=
$$ 
$$ hash MD5
$$ F1 47 65 AC 46 02 9C 21 8C 9A BE A2 6F 54 23 1E
##$RELAX= 
##$RELAX= 
##$RELAX= 
##$RELAX= 
##$RELAX= 
##$RELAX= 
$$ Bruker specific parameters
$$ --------------------------
##$DU= <F:/spectra>
##$EXPNO= 1
##$NAME= <H-C>
##$PROCNO= 1
##$TYPE= <nmr>
##$USER= <she>
##$AMP= (0..31)
100 100 100 100 100 100 100 100 100 100 100 100 100 100 100 100 100 100 
100 100 100 100 100 100 100 100 100 100 100 100 100 100 
##$AQSEQ= 0
##$AQ_mod= 1
##$AUNM= <au_zg>
##$AUTOPOS= <>
##$BF1= 200.13
##$BF2= 200.13
##$BF3= 200.13
##$BF4= 200.13
##$BF5= 200.13
##$BF6= 200.13
##$BF7= 200.13
##$BF8= 200.13
##$BYTORDA= 1
##$CFDGTYP= 0
##$CFRGTYP= 5
##$CHEMSTR= <none>
##$CNST= (0..31)
1 1 145 1 1 1 1 1 1 1 1 1 1 1 1 1 1 1 1 1 1 1 1 1 1 1 1 1 1 1 1 1 
##$CPDPRG= <>
##$CPDPRG1= <>
##$CPDPRG2= <>
##$CPDPRG3= <>
##$CPDPRG4= <mlev>
##$CPDPRG5= <mlev>
##$CPDPRG6= <mlev>
##$CPDPRG7= <mlev>
##$CPDPRG8= <mlev>
##$CPDPRGB= <>
##$CPDPRGT= <>
##$D= (0..31)
0 0.7 0 0 0 0 0 0 0 0 0 0.03 0 0 0 0 0 0 0 0 0 0 0 0 0 0 0 0 0 0 0 0 
##$DATE= 1776074438
##$DBL= (0..7)
120 120 120 120 120 120 120 120 
##$DBP= (0..7)
150 150 150 150 150 150 150 150 
##$DBP07= 0
##$DBPNAM0= <>
##$DBPNAM1= <>
##$DBPNAM2= <>
##$DBPNAM3= <>
##$DBPNAM4= <>
##$DBPNAM5= <>
##$DBPNAM6= <>
##$DBPNAM7= <>
##$DBPOAL= (0..7)
0.5 0.5 0.5 0.5 0.5 0.5 0.5 0.5 
##$DBPOFFS= (0..7)
0 0 0 0 0 0 0 0 
##$DE= 6
##$DECBNUC= <off>
##$DECIM= 32
##$DECNUC= <off>
##$DECSTAT= 4
##$DIGMOD= 1
##$DIGTYP= 9
##$DL= (0..7)
0 120 120 120 120 120 120 120 
##$DP= (0..7)
150 150 150 150 150 150 150 150 
##$DP07= 0
##$DPNAME0= <>
##$DPNAME1= <>
##$DPNAME2= <>
##$DPNAME3= <>
##$DPNAME4= <>
##$DPNAME5= <>
##$DPNAME6= <>
##$DPNAME7= <>
##$DPOAL= (0..7)
0.5 0.5 0.5 0.5 0.5 0.5 0.5 0.5 
##$DPOFFS= (0..7)
0 0 0 0 0 0 0 0 
##$DQDMODE= 0
##$DR= 18
##$DS= 0
##$DSLIST= <SSSSSSSSSSSSSSS>
$$ [...]
##$SUBNAM0= <"">
##$SUBNAM1= <"">
##$SUBNAM2= <"">
##$SUBNAM3= <"">
##$SUBNAM4= <"">
##$SUBNAM5= <"">
##$SUBNAM6= <"">
##$SUBNAM7= <"">
##$SUBNAM8= <"">
##$SUBNAM9= <"">
##$SW= 18.0517328524113
##$SWIBOX= (0..15)
0 0 2 0 0 0 0 0 0 0 0 0 0 0 0 0 
##$SW_h= 3612.71676300578
##$TD= 16384
##$TD0= 1
##$TE= 0
##$TE2= 300
##$TE3= 300
##$TEG= 300
##$TL= (0..7)
0 120 120 120 120 120 120 120 
##$TP= (0..7)
150 150 150 150 150 150 150 150 
##$TP07= 0
##$TPNAME0= <>
##$TPNAME1= <>
##$TPNAME2= <>
##$TPNAME3= <>
##$TPNAME4= <>
##$TPNAME5= <>
##$TPNAME6= <>
##$TPNAME7= <>
##$TPOAL= (0..7)
0.5 0.5 0.5 0.5 0.5 0.5 0.5 0.5 
##$TPOFFS= (0..7)
0 0 0 0 0 0 0 0 
##$TUNHIN= 0
##$TUNHOUT= 0
##$TUNXOUT= 0
##$USERA1= <user>
##$USERA2= <user>
##$USERA3= <user>
##$USERA4= <user>
##$USERA5= <user>
##$V9= 5
##$VALIST= <valist>
##$VCLIST= <CCCCCCCCCCCCCCC>
##$VD= 0
##$VDLIST= <DDDDDDDDDDDDDDD>
##$VPLIST= <PPPPPPPPPPPPPPP>
##$VTLIST= <TTTTTTTTTTTTTTT>
##$WBST= 1024
##$WBSW= 4
##$XGAIN= (0..3)
0 0 0 0 
##$XL= 0
##$YL= 0
##$YMAX_a= 332750
##$YMIN_a= -352352
##$ZGOPTNS= <>
##$ZL1= 120
##$ZL2= 120
##$ZL3= 120
##$ZL4= 120
##$ABSF1= 10
##$ABSF2= 0
##$ABSG= 5
##$ABSL= 3
##$ALPHA= 0
##$AQORDER= 0
##$ASSFAC= 0
##$ASSFACI= 0
##$ASSFACX= 0
##$ASSWID= 0
##$AUNMP= <proc_1d>
##$AZFE= 0.1
##$AZFW= 0.1
##$BCFW= 1
##$BC_mod= 2
##$BYTORDP= 1
##$COROFFS= 0
##$CY= -3
##$DATMOD= 1
##$DC= 2
##$DFILT= <>
##$DTYPP= 0
##$F1P= 0
##$F2P= 0
##$FCOR= 0.5
##$FTSIZE= 0
##$FT_mod= 4
##$GAMMA= 1
##$GB= 0.15
##$INTBC= 1
##$INTSCL= 1
##$ISEN= 128
##$LB= 0.25
##$LEV0= 0
##$LPBIN= 0
##$MAXI= 10000
##$MC2= 0
##$MEAN= 0
##$ME_mod= 0
##$MI= 1.114404
##$NCOEF= 0
##$NC_proc= 0
##$NLEV= 6
##$NOISF1= 3.799351
##$NOISF2= 2.8
##$NSP= 1
##$NTH_PI= 0
##$NZP= 0
##$OFFSET= 14.38212
##$PC= 1
##$PHC0= -3704.637
##$PHC1= 10.59231
##$PH_mod= 1
##$PKNL= yes
##$PPARMOD= 0
##$PSCAL= 0
##$PSIGN= 0
##$REVERSE= no
##$SF= 200.129724274929
##$SI= 16384
##$SIGF1= 3
##$SIGF2= 2
##$SINO= 400
##$SIOLD= 16384
##$SREGLST= <1H.CDCl3>
##$SSB= 0
##$STSI= 0
##$STSR= 0
##$SW_p= 3205.1282051282
##$SYMM= 0
##$S_DEV= 0
##$TDeff= 0
##$TDoff= 0
##$TI= <>
##$TILT= no
##$TM1= 0
##$TM2= 0
##$TOPLEV= 0
##$USERP1= <user>
##$USERP2= <user>
##$USERP3= <user>
##$USERP4= <user>
##$USERP5= <user>
##$WDW= 1
##$XDIM= 8192
##$YMAX_p= 0
##$YMIN_p= 0
$$ End of Bruker specific parameters
$$ ---------------------------------
##NTUPLES= NMR FID
##VAR_NAME=  TIME,          FID/REAL,        FID/IMAG
##SYMBOL=    X,             R,               I
##VAR_TYPE=  INDEPENDENT,   DEPENDENT,       DEPENDENT
##VAR_FORM=  AFFN,          ASDF,            ASDF
##VAR_DIM=   8192,          8192,            8192
##UNITS=     SECONDS,       ARBITRARY UNITS, ARBITRARY UNITS
##FACTOR=    0.0002768,     1,               1
##FIRST=     0,             0,               0
##LAST=      2.2672688,     0,               0
##MIN=       0,             -352352,         0
##MAX=       2.2672688,     332750,          0
$$ Real data points
##PAGE= N=1
##DATA TABLE= (X++(R..R)), XYDATA
$$ [...]
1872b104K411N49k358J97K777j232j881J826J699k178p79K659J2k727J453J399
1888A723k243q65K078J46k472M25K126j104j689J664J314k381L50K057n96j549
1904a016J102J561j619o83J651L00k357L95J829j667r21J311P74j638k04J803
1920F21m50j483Q15K166j772q36K148Q1k050R28J576j320j531J661N38j977l77
1937a262K297r34j595J049J251j391o64K026R3k151J113K173j758j328J975P90
1953A684k459L03J694j038j407J081J009j815m53J920O7k380J437J441j505o18
1969a039J581P80j602J62J909j136j650J611M11j406n82J846q70j297P13J296
1985G27j395n85J659L21j687M28J727q44j369J977N40j674J51J001l58j486J028
$$ plain form
1872 -2104 307 856 -1502 -1305 1472 240 -1641 185 1884 -294 -1073 1586 1598 -1129 324 1723
1888 1723 -520 -1385 693 839 -1633 -1208 918 -186 -1875 -211 1103 -1278 -928 1129 533 -1016
1904 -1016 86 1647 28 -655 996 1296 -1061 -666 1163 -504 -1425 -114 660 -978 -1182 621
1920 621 171 -1312 -497 1669 -103 -939 1209 1290 -760 168 1744 424 -1107 554 1092 -885 -1262
1937 -1262 1035 101 -1494 -445 806 -585 -1249 777 870 -1281 -168 2005 247 -1081 894 1684
1953 1684 -775 -472 1222 184 -1223 -142 867 -948 -1401 519 586 -1794 -357 1084 -421 -1039
1969 -1039 542 1322 -280 -118 1791 655 -995 616 1027 -379 -961 885 15 -1282 -569 727
1985 727 -668 -1253 406 727 -960 -532 1195 351 -1018 959 1499 -175 -24 977 619 -867 161
2002A61P18j237r73J778J0j647N07J458q23j340J822N58j389j15K012p55j505
2019g60J515M19j337p74J641k59j418N95J251j631n75J712J34j666Q48J195p25
2036A65q21J012N94r01k77J183n09j286R97Q34j311q15J371J19j359K22J253p32
2054b61p56J078N57j115lJ344l73q58O97P41q23o13R57J88j271K07O35o21n17
2073h07R80j28q19J78J359k81j384J022R05j023l90J156j17j110O43M38p82p70
2091i30J249J18j527K58J242q55p09J023L71q22J56J198k84j103R88R18j420k63
2109c92J127o5j454P51P46j016k20P23J21j217J60J225l80p82N66R00q82N9P28
2128F98j98o12N18P52j390l72J128J65j453l2J084o94k96O79K36j074K60J233
$$ plain form
2002 161 879 -358 -1331 447 457 -1190 -683 775 -48 -1388 434 992 -397 -512 1500 745 -760
2019 -760 755 1174 -163 -937 704 445 -973 -378 873 -758 -1333 379 513 -1153 -305 890 165
2036 165 -656 356 950 49 -228 955 446 -840 157 991 -320 -1135 236 355 -1004 -782 471 -261
2054 -261 -1017 61 618 -497 -500 844 471 -387 310 1051 228 -385 572 760 -511 -304 331 -290 -807
2073 -807 173 45 -774 -596 763 482 -902 120 1025 2 -388 768 651 -459 184 622 -160 -930
2091 -930 319 437 -1090 -832 410 -445 -1154 -131 240 -582 -426 772 488 -615 373 1291 -129 -392
2109 -392 735 670 -784 -33 713 -303 -523 200 321 -896 -736 489 109 -673 -107 793 -89 -30 698
2128 698 500 -112 406 1158 -232 -604 524 689 -764 -796 288 -406 -702 -23 213 -861 -601 632
2146F32j86j406J094R92r71l71P80o8p41M4P23o11o34N44Q10j476l19J725m45
2165A16j335J034O53p05k22R82k6r64P31O83r28o36R13N78q76p03J125k68j064
2184i12Q26K72q16m1Q19K14j151P40R79o26p25Q16M21r75r6J088q20n30M46M62
2204C91j080r3J069n9q75M66P06p41l39R66K75j435Q99P63p52o74Q69M14j015
2223b45j18P81J63j174L87L27r60q1J338l10q88M83R66m51q25R22L05p67O9P24
2243F46m43p22Q47K68j040p6M90N27r86k32Q34k52n0M97K7n62j54J034l29o07
2263b83L63O66m91p89R21K0p16O0K84j23n60O15L88r86o4J196l95r34P98O09m09
2284A70n46J182n84q36O62N55n85n75O47L42r96j67Q75k86k65K79M69p99J21R09
$$ plain form
2146 632 446 -960 134 1126 155 -216 564 496 -245 -201 522 -89 -723 -179 631 -845 -1164 561 116
2165 116 -1219 -185 468 -237 -459 523 497 -467 264 947 19 -617 296 874 -2 -705 420 152 -912
2184 -912 -86 186 -630 -671 148 362 -789 -49 930 304 -421 395 816 -159 -255 833 13 -517 -71 391
2204 391 -689 -782 287 228 -647 -181 525 -216 -555 411 686 -749 150 913 161 -513 356 770 -245
2223 -245 -363 418 581 -593 -206 121 -839 -920 418 108 -780 -297 669 218 -607 315 620 -147 -78 646
2243 646 203 -519 328 596 -444 -520 -30 497 -489 -721 113 -139 -189 308 335 -227 -381 653 324 -283
2263 -283 80 746 255 -534 387 407 -309 -249 35 -88 -648 -33 355 -631 -695 501 106 -828 -30 579 170
2284 170 -376 806 222 -614 48 603 18 -557 90 432 -564 -731 144 -142 -407 -128 341 -458 -337 572
2304E72r7q43L58Q26o63k17L78N4o58M83J98p34n95R27M5n56l3R03l53k21K35
2325IM42L7k43K28o4m56J29O20n76m66K98L62m79k97J86K39l16R0L68m71O7M93
2347B00J05p29N03L97q5n68K77K41m95j91P64l36p38N01L62p43N5O01n0n95J14
2368d10P65o09J0O21K67q38K46K76l08q8M47N4q07k14Q40k59q19J093l12k99o
2389c50O08l21m49L81O45l5n03K99P1l90pM30k73k18l3K93j07l43L31J09o80M83
2411e9L10m39k53O97J28l07J28P8J12k51k38N09k59n67L35p2l4R3J55k10k23J10
2433b57N67o14L79L19k63l09O19k95l68j27O78l50m24N91L51p97O9L74p9l74J77
2454a33M97q09J70O36j29l41m6M36j96j18M19J31m80l44P05l39l92J86M14l10
$$ plain form
2304 572 475 -368 -10 816 153 -64 314 368 -290 193 391 -343 -938 -11 34 -522 -555 348 -5 -226 9
2325 9 451 488 245 473 409 -47 82 702 126 -340 -42 320 -159 -456 -270 -31 -347 -257 111 -360 -293 200
2347 200 305 -424 79 476 391 -177 100 341 -154 -345 419 83 -655 -154 208 -535 -480 121 71 -524 -410
2368 -410 355 -254 -244 377 644 -194 52 328 20 -68 379 433 -374 -588 252 -7 -826 267 -45 -344 -350
2389 -350 258 -63 -512 -131 514 479 -24 275 346 -44 -51 379 106 -112 -145 148 41 -302 29 138 -542 -59
2411 -59 251 -188 -441 256 384 77 205 283 395 144 -94 415 156 -411 -76 -148 -182 -89 66 -144 -367 -257
2433 -257 310 -304 75 394 131 -178 441 146 -222 -349 329 -21 -445 146 497 -300 -231 143 64 -310 -133
2454 -133 364 -445 -275 361 232 -109 -155 281 85 -33 386 517 37 -307 398 59 -333 -147 267 -43
2474d3m32N05J50o76J02N05J08n03M25P8j34R7J12p6l17J43K47m69o1L64o4j64
2496a03o7K72J36n75M01L56m42j59L39P2n69N39L15n34j40N94N5p53m3L55nl89
2518c45K57L03n09J23J48J24m07L41M18m79j40M68K4m28N0K82l74n3M23ro29K28
2540a84K77j58n2K03N8m29P8J42L63m79L23K17k18j53M1J60k69K8L1l17K19pL20
2563A94m31J53J99J87n84L19K2j43N8K33Q8m34Q7K87K33n14p7M01m10L6J07n8
2585d7l48J93L02q9n4J02K98n27J30K11j02j56J75K49m54J07L30n5n33J42L82
2606B56l68r8J26Nk65M40K56m88J95K43j80M8k2L56l26l02K29J61n19J99l0K33
2628A49l29K08j4m18K55J20q9j15J78K59j43k14K92o8q1J10K01j45m4k5J79m83
$$ plain form
2474 -43 -475 30 180 -496 -394 111 219 -284 141 219 85 182 294 218 -99 44 291 -178 -239 125 61 -103
2496 -103 -170 102 238 -337 64 420 -22 -181 158 230 -339 200 515 -19 -159 435 490 -263 -306 49 44 -345
2518 -345 -88 215 -294 -171 -23 101 -306 35 453 -26 -166 302 326 -102 -52 230 -144 -197 226 217 -412 -184
2540 -184 93 -65 -117 86 144 -285 -207 -65 298 -181 142 359 141 -12 29 189 -80 -52 -21 -338 -119 -126 194
2563 194 -237 -84 115 302 -282 37 59 -84 -26 207 295 -139 -52 235 468 -46 -123 278 -132 -96 11 -47
2585 -47 -395 -202 100 11 -43 59 357 -170 -40 171 69 -87 88 337 -117 -10 320 265 -268 -126 256
2606 256 -112 -210 -84 -79 -344 96 352 -136 59 302 122 170 148 504 178 -124 105 266 -253 -54 -84 149
2628 149 -180 28 14 -404 -149 -29 -118 -233 -55 204 61 -153 139 71 -10 100 301 156 112 87 266 -217
2650b17J56q9j26J04n1K22m5j74K53J03k24J84M34k32k35Q3M37p90K15M00m35
2671b7k25J90K40k97k49J82p7K67k0J54m9k51M21j70Mq0L35Ro80Q0L48q3l32L29
2695A9j3k03n8N12k43k76N69k2m47P2L9J12l81M28m6k62J76J77n8k90J34L00l67
2718a28m66Q28l77J2k1j5J58k63L62J10k96J31K00N5n98M65J08m19L0J09L59j26
2740B18l17Q2m3l36L96M8m80M28K89N8l66Q7L73o91K05r6O81o23J0Pm8k98L72
2763d4J57j76J22k57J46j11M02k17j04J02k9L1P5k8J51k21k95L60J39m65k3J75
2785a10K93m53L22q3l92L53j77K17Q6j33J46JK5M3J26m86K96K68k79k22k6J92
2807Gj49j3K06j34J5NJ07ko7L36m1j80j72J08K80j63l04L37j39j59L1J01j31L3
$$ plain form
2650 -217 -61 -150 -276 -172 -223 -1 -46 -220 33 136 -88 96 530 298 63 146 583 -207 8 408 -27
2671 -27 -252 -62 178 -119 -368 -186 -263 4 -16 138 89 -162 259 89 93 13 348 357 -323 -243 105 22 -310 19
2695 19 6 -197 -255 257 14 -262 307 285 -162 -90 -51 61 -320 108 62 -200 -24 153 95 -195 -61 239 -128
2718 -128 -594 234 -143 -131 -152 -167 -9 -272 90 200 -96 35 235 290 -308 157 265 -154 -124 -15 344 218
2740 218 -99 -17 -60 -396 0 48 -432 -4 285 343 -23 64 437 -254 -49 -145 536 -87 -77 -70 -118 -416 -44
2763 -44 113 -63 59 -198 -52 -163 239 22 -82 20 -9 22 97 69 220 -1 -296 64 203 -262 -285 -110
2785 -110 183 -270 52 -31 -423 -70 -247 -30 56 -77 69 70 95 138 264 -222 74 342 63 -159 -185 7
2807 7 -142 -155 51 -83 -68 -63 44 42 -25 311 270 90 -82 26 306 143 -161 176 37 -122 -91 10 -121 -88
2831h8O4J50l76J55K11l35j26M84j37r3J63K32j15l01K50m3j62K14j94j3m70P11
2853A81l43R1M7j19J87m20M00J45k33j28K17M1k43K00J1j68P2r3K48o17M25K39
2875A40k31l90K56J84k47L50L22l24j98j7J65O6j07J38l5rk79K77M1o1Q6P3l76
2898a76m4L08r8J5o6J89N3j78J6J32k70J38K28n1m70L10J33n5k8p9o6l00J60P9
2922a20O1M17m69J03J1J40K3j44J31j30K42l54J23J40p0k34K26q7L4l23L26j24
2944g8j80L77k75J10q9J65k8P0j41M95k54l11L43k3r3J86L6m58K0O1J28k00P7
2967f2J72l53K32o9M2j04L25k81J62oj11J79J10q8j90J16j17j85K2J75j80l5K38
2990hq1J61l25J46O6L03j84l7jk01J84J86j9j64J37m70K17nJ4q0J84K94l53j89
$$ plain form
2831 -88 -24 126 -250 -95 116 -219 -345 139 2 -91 72 304 189 -112 138 95 -67 147 -47 -60 -530 181
2853 181 -162 -71 -24 -143 44 -376 24 169 -64 -192 25 66 -177 23 34 -134 -62 -155 93 -524 -99 140
2875 140 -91 -481 -225 -41 -288 62 384 60 -138 -155 10 76 -31 107 72 63 -216 61 102 41 127 200 -176
2898 -176 -220 88 -10 5 -61 128 181 3 19 151 -119 19 247 196 -274 36 169 114 86 7 -59 -359 -199 -120
2922 -120 -59 358 -111 -8 3 143 166 22 153 23 265 -89 34 174 104 -130 96 9 43 -280 46 -78
2944 -78 -258 119 -156 -46 -135 30 2 72 -69 426 172 -139 204 181 88 274 310 -148 -128 -67 61 -139 -62
2967 -62 110 -243 -11 -80 -38 -142 183 -98 64 58 -53 126 236 148 -42 74 -43 -228 -206 -31 -211 -246 -8
2990 -8 -89 72 -253 -107 -41 262 78 41 40 -161 23 209 190 26 163 -307 -90 -95 -81 -161 23 317 -36 -225
3014b25J70L6r5J8L48l06j13L32L1k10p1L2o3L44j96j35K96j26o9j36l7O2M77
3037C64l92J31j48M7K2J61o0k42J86R6%k27j22J36k31N5K13l1r3qK60k95J95j27
3061a10n2K12j20L11j09k52L18k40m3q5M2mP4n0K71J75j61j16n0k08J02J87k58
3084a66K05j5J38k91L6J64j79J18J93L7m31J9L97l30J91R5j4J19L8n65R7K14j68
3107i8J71L02l09J41l1j90j35K96r2j06J96j89J71k53J96j89Q4n7l5K22r3j1Q8
3130G9m7k0j21K10k25J54o5J34k11M4J9J03l29Q9K19ll0J91p0j90J84J13k24j79
3154a75L07j10Oj0N7k4P2RJ04l7l15K01RJ80k37K9j8j36K0M0j09L47m35J66J57
3179I8j01O9J30k78K48k19M1j51J55r9J70L7k73L3j07L67k39K79l1k0r8j16L18
$$ plain form
3014 -225 -55 -19 -114 -96 252 -54 -167 165 196 -14 -85 -53 -116 228 32 -103 193 67 -2 -138 -175 -113 364
3037 364 -28 103 -45 2 24 185 125 -117 69 165 165 -62 -184 -48 -279 -224 -11 -42 -135 -143 117 -178 17 -110
3061 -110 -162 50 -70 241 132 -120 198 -42 -85 -170 -128 -132 -58 -108 163 338 177 61 11 -197 -95 92 -166
3084 -166 39 24 162 -129 -93 71 -108 10 203 240 -191 -172 225 -105 86 181 167 286 324 -241 -144 70 -98
3107 -98 73 375 66 207 176 -14 -149 147 55 -51 145 -44 127 -126 70 -119 -35 -92 -127 95 2 -9 79
3130 79 32 12 -109 101 -124 30 -35 99 -112 -68 -49 54 -275 -186 33 30 0 191 121 -69 115 228 4 -175
3154 -175 132 22 28 18 75 51 123 132 236 199 -116 85 94 274 37 66 48 -88 -68 -28 -137 210 -225 -59 98
3179 98 -3 66 196 -82 166 -53 -12 -163 -8 -107 63 100 -173 -140 -247 120 -119 160 129 109 11 -105 213
3202B13m15J78j10J03Q9j09J63MJ90m12k9j47J97J91r9oP3rj40p6J09l5R7k02
3226a82J71j3j08m5n0J58K90L6l07RK9R5k72K68J39l2P4j56q0K96k61J65k01m3
3250b0K83n38J10m0L15pj12Q7j66q5L9M5K66J6l27L09P4l83J25Q0k13J94q8p7
3274a13J53j66L14j93Q5k1O6J43m32J30K18j05j7Jj11m8J83j65R4J5j57J10N4
3297C8k36Kj10P9P0R5j5J34l5J70l62L20n9j10r7k0J25p5j94M82j33M2P9l86K32
3322C6k98J87K0j03m4J47q8K40J05j11n5KJ04p4N6j99P6k63M0J88K63j60l7J42
3346A74j74r8J2j94J31J57J1K09j28pM2k81K21Q7l03L4K92p2j65J94o1P1k76L40
3370B16r0p6j11Jq6K36n4J96j82k01J81M5k17J75M8k18J25J78m04J00K27j88L37
$$ plain form
3202 213 -202 -24 -134 -31 58 -51 112 116 306 -106 -135 -282 -85 106 7 1 74 65 -75 -151 -42 -77 20 -182
3226 -182 -11 -24 -132 -177 -227 -69 221 257 -50 -41 -12 83 -189 79 218 186 260 104 24 320 59 224 23 -20
3250 -20 263 -275 -165 -205 110 103 -9 78 -88 -173 -134 -89 177 193 -134 175 249 -134 -9 71 -142 52 -36 -113
3274 -113 40 -126 188 -5 80 59 125 268 -164 -34 184 79 62 63 -48 -96 87 -78 16 31 -126 -16 38
3297 38 -198 -196 -306 -227 -157 -62 -77 57 22 192 -170 150 91 -19 -116 -136 -11 -86 -280 202 69 111 190 -196 36
3322 36 -262 -75 -55 -158 -202 -55 -143 97 202 91 36 38 142 68 124 -75 1 -262 -222 -34 229 69 32 174
3346 174 0 -98 -86 -280 -149 8 19 228 100 93 135 -146 75 162 -141 -107 185 113 -52 142 81 152 -124 216
3370 216 126 50 -61 -60 -146 90 36 232 50 -151 30 75 -142 33 81 -137 -12 166 -238 -138 89 -99 238
3393B38l22O6J99j49K40l62K11Qj22J75l34J57Q6M0k45J51J50p1j93n6L47l08
3415i4K56k08J31j02K5P7J05l05l7J55R2j00J78j1p5k82K81k68J50k9P5J70j06
3438G8Pj6q7K0J94o4J69l53K08k33J11j3J1J06k05o3L91m54L37j77L3r2k5K5J60
3463F8k17K28j51K06j38l45O05p2l62oK63j12J5p4R0J4j2QJ49l68O4L54k50N4
3487A1q9q0N20n68L41j90j72L57j5j24K57Q4j77j38J8l2j71n3L35j34rm5n8l6
3511a68K3K3J88k42N2k6j34M38R8m22N8j16J51N8L38m66p4L54p2J54l33m7J05
3534f0L16l16K54k04j90M83k70j24L09j36j27J07K98n11L86l58J65j68L20m37
3554b63L21l08J01J07p4o0k52M09J25M3j57J49j67j14L4J35j72M22l71J39k42
$$ plain form
3393 238 -84 -18 181 32 272 -90 121 129 7 182 -152 5 91 131 -114 37 187 116 -77 -133 214 -94
3415 -94 162 -46 85 -17 8 85 190 -115 -152 3 95 -5 173 162 87 -195 86 -182 -32 -61 14 184 78
3438 78 85 69 -18 2 196 132 301 -52 156 -77 34 21 32 138 -67 -130 261 -193 144 -33 0 -92 -117 -92 68
3463 68 -149 79 -72 134 -4 -349 256 184 -178 -184 79 -33 -18 -92 -2 12 0 8 157 -211 -147 207 -43 11
3487 11 -78 -158 362 -206 135 -55 -227 130 115 -9 248 332 155 17 35 3 -168 -221 114 -20 -29 -74 -132 -168
3511 -168 -145 -122 66 -176 -124 -150 -284 154 252 -170 -112 -228 -77 -19 319 -147 -221 133 61 215 -118 -165 -60
3534 -60 256 -60 194 -10 -200 283 13 -111 198 62 -65 42 340 -171 215 -143 22 -146 174 -263
3554 -263 58 -250 -149 -42 -116 -176 -428 -19 106 149 -8 141 -26 -140 -106 29 -143 279 -92 47 -195
3575a95J16L26m88J77J48K3j11o2P9r3K88o2k88M03j72j96J59R5J29n61L18j99
3597a66m8M47j58m5K1j24J74l32K04l7L39m35J46P8j1o7R4L9l06J78j1Q9l2pp5
3622d5k1j57L74j21L4j20n2M7j08L38k82J13K90m02J65J9l6J66j66q4r8J14J9
3645a3M7r1K99k52N1l27L94k1N7j32m7J58j99J27N7n8n3j90K63j95K07q9l8J85
3669A40j42j2k31J90rK07N1l86k9J66J74k77P5R1j36Q6O6J64N3P1l93p8J21J97
3693A59j09K7j54PJ47j53Q6Q0j4l4n9J57j97j05P2P9M7m3L0k97J51K5K80l8j29
3718A5N0J10p3k2Rk25n0r5O27l94J9j61Mqk53O31l6l4J0j99j44J20K00o8J12k42
3744i7j94J79K5rj36p4K23N3L2Mj44M1L43m81J95K2k3J38k62M76l63j54J64k41
$$ plain form
3575 -195 -79 247 -241 -64 84 107 -4 -66 13 -80 208 146 -142 261 89 -107 52 147 276 -285 33 -166
3597 -166 -214 233 75 30 51 -73 101 -231 -27 -64 275 -160 -14 64 53 -14 80 119 -187 -9 -20 69 37 30 -45
3622 -45 -66 -223 151 30 64 -56 -108 -61 -169 169 -113 0 290 -112 53 72 36 202 36 -48 -146 -32 -13
3645 -13 34 -57 242 -10 41 -286 108 87 144 12 -35 123 -76 51 108 50 -3 -193 70 -125 82 -7 -45 140
3669 140 -2 -14 -245 -55 -64 143 194 -192 -221 -55 119 -158 -83 8 -128 -42 24 188 241 312 -81 -159 -38 159
3693 159 50 77 -77 -70 77 -76 10 90 76 42 -17 140 -57 -162 -90 -11 36 -7 23 -274 -123 -98 182 144 15
3718 15 65 175 102 80 89 -136 -186 -281 346 -48 -29 -190 -186 -194 -447 184 148 114 124 -75 -219 -99 101 33 145 -97
3744 -97 -291 -112 -87 -96 -232 -306 -83 -30 2 6 -138 -97 246 -235 -40 -18 -41 97 -165 311 -52 -206 -42 -283
3768b83J21L02n8j61L3k14K05r1L08k18r3K80l49L98k13K04l63K82j36J15P1J9
3790A59n2r9q5Jq4jK26j2k08K21j90J27mj94J87o2o6J26L10l16L4J18j92J13J3
3815G0K4nQ7l00L90m26j03L73j03K7Q3k43J56o0j39K43j91J97k35M1J71r5j88
3838b26K25R7M4j45k63L3L67Q0m35N02l76K13j68j27P9R4K12k70K5j20M26k86
3860a9j84J54L5p1K40j94O5k49j1Q4L8P2r2J80j84J74j25L35j94l9K88n69J37
3883a29K23q2j07L41k21J09m8j27QQ7J17o4k63J10Q4k93J47K69j56QJ23j50pK22
3907B01M5j77N7k53N9K95k87rJ17k50R3Q1N8p5J76r8K47l16L3j34Q2K12l40J85
3931Br9Q5J75k38J96p2l68M40j12j43JJ0MJ28j48o5K07J45j9j73j14J82j08J38
$$ plain form
3768 -283 -162 140 82 -79 -46 -260 -55 -146 162 -56 -149 131 -218 180 -33 171 -192 90 -46 69 140 159
3790 159 107 8 -77 -76 -160 -161 65 53 -155 66 -124 3 -1 -195 -8 -70 -136 -10 300 -16 18 136 -56 57 70
3815 70 94 89 176 -124 266 -160 -263 110 7 34 117 -126 30 -30 -169 74 -117 80 -155 -114 57 -38 -226
3838 -226 -1 96 140 -5 -268 -235 132 212 -223 279 -97 116 -52 -179 -100 -6 206 -64 -39 -159 267 -19
3860 -19 -203 -49 -14 -85 155 -39 26 -223 -234 -150 -112 -40 -132 48 -136 38 -87 248 54 15 303 -266 -129
3883 -129 94 12 -95 246 25 134 86 -41 -33 54 171 107 -156 -46 38 -255 -108 161 5 13 136 -14 -21 201
3907 201 246 69 126 -127 -68 227 -60 -69 48 -202 -109 -28 30 -45 131 33 280 -36 -3 -137 -55 157 -183 2
3931 2 -97 -12 163 -75 121 49 -319 121 9 -134 -133 -123 -119 9 -139 -204 3 148 129 -44 -158 24 -84 54
3955E4j39l5J67N7j17j22O1L47l05l8J61n4k38j30L49M6l29p2N70l8j39n9k88
3978b91P0M07k62J71J41m03O3J82j61M9P7J64j42J93k12k13J82k60J71J54K07
3999B87n42L08m4Qj9J25J1k72L02l98M21j69l31K68jJ30k31L18o79P65l12k27
4021b82L32j14L8mrn8j58L15mP6k42K37J15l70K11P7l39K71m2j98K39r3K02n1
4045A49r0Ro4l8K61k64m8J24M4n0j24j00P1J58J62n1j51J63J70l28J41l02K16
4068E8l9Nj34J4J73Rn0j74RJ02j02J42M1m2O2k19J73l21K20J57Q7j27j86O3q9
4093a68l5J79j43K9J79jm7J15k94J19N4N3J87k52K91n20J61P5J14m3J0K2n5l5
4117eJ23J7m2J59j31j65J8K56j74p4P6p1NK65l67J65l23J77k7J77j37N0k26J50
$$ plain form
3955 54 -85 -120 47 104 -13 -135 -74 273 -32 -70 91 37 -201 -331 18 64 -265 -337 233 195 56 -3 -291
3978 -291 -221 186 -76 95 236 -167 -104 78 -83 -34 43 207 65 258 46 -167 15 -245 -74 80 287
3999 287 -255 53 9 17 -2 123 134 -138 164 -234 187 18 -313 -45 -46 84 -147 171 -508 257 -55 -282
4021 -282 50 -64 -26 -30 -39 -97 -255 60 56 132 -110 127 242 -128 83 160 -179 92 50 -148 91 -2 200 149
4045 149 59 68 4 -34 227 -37 -85 39 83 33 -91 -191 -120 38 200 149 -2 161 331 3 144 -158 58
4068 58 19 24 -110 -96 77 86 36 -138 -129 -27 -129 13 54 12 74 -145 28 -293 -73 84 171 44 -142 -79 -168
4093 -168 -203 -24 -167 -138 41 40 -7 108 -186 -67 -13 40 227 -25 266 -254 -93 -18 96 53 63 85 30 -5
4117 -5 118 135 93 252 121 -44 -26 230 56 -18 58 -13 -8 257 -110 55 -268 -91 -118 59 -78 -28 -254 -104
4141a04M6r9K26L1l3L5J92l30L0K50k36L2l36K96Lk6J89l7m34K56r9K17M8l17
4165b00K44lK6j18K25qk9j66J43j22j99R0OJ94k53J00j76J52o2J43L2L8k97L2
4189b08K13O1l7J14p0L7l2M8r9k10J94Q7r6k5j00J38R5p6k49K40J20j61j82rK44
4214C7j81K84M0m03J29o3J65j21R8J25m22N32j60j35J56P2m0k14Q7K15k03p6L10
4237B32j65j4J25k60L17j25j63J12k49K26j4J13K54k7l09j78J33P1Nm7j14p9N25
4260C69l23p7J94k48Q7K4J65m5l55k9J07K8q7R3K35L0l2k18K90j58j4M5J06k49
4284f2O2o2p5K31k01K5L1K5O3k0j8j44J59J13j27J85k55l6M09m4l07K6k7o5j39
4309b53J38K7Pm0J7K85k69K5r7J63J51l00K8K76j26p1J41k84J99k9j89K80p5l6
$$ plain form
4141 -104 -58 -157 69 100 67 102 294 -36 -6 244 8 40 -296 0 3 -23 166 129 -305 -49 -148 69 117 -200
4165 -200 44 41 67 -51 174 166 137 -29 114 -8 -207 -117 -111 83 -170 -70 -246 -94 -156 -13 19 57 -240 -208
4189 -208 5 66 29 143 73 110 78 126 27 -183 11 98 2 -23 -123 15 110 34 -215 25 145 -16 -198 -207 37
4214 37 -144 140 180 -223 -94 -157 8 -113 -15 110 -312 220 60 -75 81 153 113 -101 -14 201 -2 -78 232
4237 232 67 53 178 -82 235 110 -53 59 -190 36 22 135 389 362 53 -125 8 79 84 37 -77 -156 369
4260 369 46 -31 163 -85 2 26 191 146 -209 -238 -131 -103 -190 -97 138 168 136 -82 208 50 36 81 187 -62
4284 -62 0 -62 -137 94 -107 -82 -51 -26 37 17 -1 -145 14 127 0 185 -70 -106 303 259 -48 -22 -49 -114 -253
4309 -253 -115 -88 -81 -121 -104 181 -88 -63 -160 3 154 -146 -118 158 32 -39 102 -182 17 -12 -201 79 4 -32
4333c2r9Q8R6j51J66%k48P1J79m4p6J45J53m00Q5p6R6N2o3P0j88J89J8QJ03r5
4359D7j13N6k74K91n4m0L1m8J58J07k17l11N05j43N4j63J76K5pr0J1k04M38j34
4383A01L0n02O10j29j17rk81L33j73L42m63L75j10J25l62K36K08k57P7J9LL3k36
4406a47R6o8p4L4q6Q9k3L0J98j05L47k95Q9j71J68Rj51J8R0K9q4Q6j60Q8j66J20
4432c9K23k91jK85j51j33J55o5J31j57j32M5j12R8J35J06p2j8J02j14k01L16k1
4455H9j69J27l0J48j75k09M19r0o7j82K08j90K26r4J41l37N4J52J38j94J0N6N9
4478I0k50L21j3R6k10k4m7K40j89J64j52k10J81P9j97J33M2L7nq3N8j22p5K73
4502A37N8j12j19R4j92R2M3P2j51K1K44r8J06l57J23j51j8K51M8M5k53j47K45
$$ plain form
4333 -32 -131 -43 53 -98 68 68 -180 -109 70 26 -50 95 248 -152 -67 -143 -47 5 -58 12 -176 13 31 39 142 47
4359 47 -66 -10 -284 7 -47 -87 -56 -104 54 161 -56 -367 138 -5 49 -114 62 87 80 -10 1 -203 235 101
4383 101 131 -371 239 110 -7 -16 -297 36 -137 205 -258 117 7 132 -230 6 214 -43 34 53 56 89 -147
4406 -147 -51 -119 -193 -159 -245 -156 -179 -149 49 -56 291 -4 85 -86 82 91 -60 -42 48 77 -7 79 -81 7 -159 -39
4432 -39 184 -107 -108 177 26 -107 48 -17 114 -43 -175 -130 -242 -144 -9 97 25 7 109 -5 -206 110 89
4455 89 -80 47 17 165 -10 -219 200 110 43 -139 69 -121 105 11 152 -185 -131 21 159 -35 -25 31 90
4478 90 -160 161 148 244 34 10 -37 203 14 178 26 -184 -3 76 -121 12 54 91 86 3 61 -61 -136 137
4502 137 195 83 -36 58 -134 -42 1 73 -78 -57 187 89 195 -162 -39 -190 -208 43 91 136 -117 -264 -19
4525a9K4m1M0L55j94J18n1j70j49P9N5j98M91o11L19j72L57j60j3j14J39j67J32
4548E0J04j40ll29K14J50j51j2O7K15l00J51k20L93l27L62k43N6QJ04j07J05p5
4571G2m4j64K65j32N3P9j82J48q4J47j86J23l15K68j04k6R6j10J91O5q1J4j72
4594g9J25M6m17j45L60K6J92k78o1j1L14j06K06r8j61K64k81R7j82J43l5J58l11
4617b34K79p1K2K12p4m50M22j34q7J51j32K13l0j75n2J97o6L41n38J14K06m9k40
4640a75k1p6J01K92j16k01J0P5L1K81j33j09J82m31J78p0K93R8m6r9J03p6m3j3
4664C5M7k7KO0r1J89m85M24k29j33J86j70K01j73K69j05J75k43L5j64P5M9j70
4687b43J63K91J43k54l49J15L66l34MP3P9m7L6j1L18k49R8j40j61R0K83q9l33
$$ plain form
4525 -19 5 -36 4 359 165 283 232 62 -87 -8 47 -151 340 -271 48 -124 233 73 60 -54 85 -82 50
4548 50 154 14 11 -318 -104 46 -105 -117 -50 165 -135 16 -204 189 -138 224 -19 37 45 149 42 147 72
4571 72 28 -136 129 -3 50 129 -53 95 11 158 -28 95 -220 48 -56 -82 14 -96 95 160 79 93 -79
4594 -79 46 92 -325 -470 -110 -84 108 -170 -231 -242 72 -34 172 74 -87 177 -104 -7 -189 -46 -81 77 -234
4617 -234 45 -26 -4 208 134 -316 106 -28 -115 36 -96 117 87 -88 -140 57 -9 332 -206 -92 114 65 -175
4640 -175 -196 -272 -171 121 5 -196 -186 -111 -80 201 68 -41 141 -290 -112 -182 111 209 163 64 167 91 48 35
4664 35 82 55 57 117 26 215 -270 154 -75 -208 -22 -192 9 -164 105 0 175 -68 -33 -197 -122 -73 -243
4687 -243 -80 211 354 100 -249 -134 232 -102 -98 -25 54 7 43 32 350 101 199 59 -102 -12 271 182 -151
4710a51K37j84J45l50K20j33M53j96r3K70q0J64j63k25J37K04j50j50m3J32N2
4731I6j17R2k18J58l7j72J27%K05j2j85K05j3l02%l37P02k37rJ67k20L5J49j04
4755b7j79J04M39m36J08l5l5j01J20j34j03K76r4K94l53N33n13J48l0N2j50K54
4777A38N5k38K4o5L48k45R0j09j70K10Q2k19K42m4j65j35L59j14m8M6O2J2k09
4800i3O0k41K29O6l53N12k31N6J82j44o2K13j66J48J96k97N9Q3m92K93l8K48o0
4823A68k36J34j26J66m55L07J39j5j54J13j77K57m41L31l5O6j75kQ7PK44l81L03
4846A25l5l87K63j9K06ql47K35K59j58L2O2M4m49J58R0q2L9j74Q2J46l40pK3M0
4871b02K57r5n7J29j70M64k86j57L75l33J98J47j08q4k03N47m67k07M33q0o4k4
$$ plain form
4710 -151 86 -98 47 -303 -83 -216 237 41 -52 218 138 302 139 -86 51 255 105 -45 -88 44 96
4731 96 -21 71 -147 11 -26 -198 -71 -71 134 122 -63 142 129 -173 -173 -510 192 -45 -54 113 -107 -72 77 -27
4755 -27 -206 -102 337 -99 9 -26 -61 -162 -42 -176 -279 -3 -97 197 -156 377 -136 12 -18 34 -116 138
4777 138 193 -45 -21 -86 262 17 107 -2 -172 38 120 -99 143 99 -66 -201 158 44 -4 42 104 116 -93
4800 -93 -33 -274 -45 21 -332 180 -51 5 187 43 -19 194 28 176 372 75 134 217 -275 18 -20 228 168
4823 168 -68 66 -60 106 -349 -42 97 82 -72 41 -136 121 -320 11 -24 42 -133 -135 -48 -41 203 -178 125
4846 125 90 -297 -34 -53 153 145 -202 33 292 134 166 228 272 -177 -19 71 -11 28 -146 -64 82 -258 -265 -242 -202
4871 -202 55 -40 -97 32 -138 326 40 -117 258 -75 123 270 162 78 -125 422 -45 -252 181 101 37 13
4893A3K47k42j6N0r1L33j49j77p4M23m56M38k80J4J43j50J44l7J21l84J16m1R3
4916C8J01j01n6K71nk99J63o7l7O3J49k97J64k38M10j3j37j58l2J45L8j42J77
4939A37n4%J03m78L66q4M6m6j10J08M1n6KJ8P8J41j65k14K54k27j20M32m00L77
4963A49m9l16Q1K04k22J63K22j43k10J02J42l08M78o21J44J81l02L10L8k07K39
4984G5L1K0J69j02k92L02k23O1P3m67M60J2l83M02k57k5j6J05K66k93m5L13l11
5007a25J71Pj76P1j73J50n6L64k94P8Mn7J78o5p7l8j14J07K4Oo6J35K4k93P2J5
5033a28K16j97P5J01j56J75j47k1k37K25K58j43L3m9j54m3K09j07J84k09r9n6
5055b70L34J04m6m40K51J13m5K4K2q8j91J94K65k5j76j31K41l19J91j07J55k79
$$ plain form
4893 13 260 18 2 52 -39 294 145 -32 -106 317 -139 299 19 33 176 26 170 133 254 -130 -14 -55 38
4916 38 139 38 -18 253 248 -51 112 45 8 71 220 -77 87 -151 259 246 109 -49 -81 64 102 -40 137
4939 137 83 83 186 -292 74 -10 36 -10 -120 -12 29 -27 -25 -7 71 212 47 -167 87 -140 -260 172 -228 149
4963 149 100 -216 -135 69 -153 10 232 89 -121 -19 123 -185 293 -328 -184 -3 -305 5 43 -164 75
4984 75 106 126 295 193 -99 203 -20 41 114 -353 107 119 -264 138 -119 -144 -160 -55 211 -82 -127 186 -125
5007 -125 46 53 -123 -52 -225 -75 -131 233 -61 17 21 -36 142 77 0 -38 -152 -45 -21 -15 -81 54 78 -215 -143 -128
5033 -128 88 -109 -34 67 -89 86 -61 -82 -319 -94 164 21 54 5 -149 -192 17 -90 94 -115 -214 -270
5055 -270 64 168 122 -318 -67 46 1 25 47 -41 -232 -38 227 202 26 -105 136 -183 8 -99 56 -223
5077b23J09k1K57J21n53L66j94J84J05k32N33m49m1L39o5o36L84j90K84j3j98
5098a33J85j05No0K43k9j84J92J2j75N2qJ9J19l35Q8j80J45L16j89K78P1n00K03
5122C0q4j58K51j52Q2K61J35j60K1j55mj94J41j06J1j58L3L58l04o0K31O5k97
5145b13O2M33k90K2j87J62n3p6L97k29j2j56K09j18M7J53R8l76K98k2k23K85k18
5168gk13R2N5K39l74L38J2P2l25R2j40%K39j29J41l82N52k16k53K63np9J04k24
5192a48K01L0Jj69j21oK95l19L9L10L6j8q7n2O5k61L68j76P5oJ40l2k53Q9j34
5217a33P5O8Rk40N8K10pk85R4J62J26j09K6k42L21k18p1j6J85j32K23j96n1K44
5241A01Jj92J55l2J91j72j93N7N8p3j79K61j10K32o0p6q9K32j66J15J8P3l33%
$$ plain form
5077 -223 -114 -135 122 243 -310 56 -138 46 151 -81 452 3 -38 301 236 -400 -16 -206 78 65 -133
5098 -133 52 -53 -48 -108 135 106 -78 114 126 -49 3 -5 14 133 -202 -114 -294 -149 167 -22 256 327 -173 30
5122 30 -54 -212 39 -113 -31 230 365 205 226 71 67 -127 14 -92 -81 -239 -206 152 -152 -212 19 84 -213
5145 -213 -151 282 -8 14 -173 -11 -64 -140 257 28 16 -140 69 -49 -2 151 249 -127 171 149 -74 211 -7
5168 -7 -220 -128 -73 166 -208 130 142 214 -111 -19 -159 -159 80 -49 92 -290 262 46 -207 56 51 -28 76 -148
5192 -148 53 83 84 -85 -206 -212 83 -236 -197 113 149 131 44 -8 57 -204 164 -12 63 57 197 165 -88 1 -133
5217 -133 -58 10 19 -221 -163 47 40 -245 -151 11 137 28 54 -188 133 -85 -156 -172 13 -119 104 -92 -143 101
5241 101 102 -90 65 33 224 52 -141 -84 -26 -99 -278 -17 -127 105 45 -31 -120 112 -54 61 79 152 -181 -181
5265a81K10J16q1J31j8L6j15m27J98L33k54M41l20nj31Po5J81R8r4j85P8J97j27
5289B3L17m95K42J07j4m07L32k35J20p4J08j02J01j79J28j11K1K17j02K07p3j44
5311a3J06l5k56O8j4P1k73K16M33k42J8j61N0L8Q8K6j93J73J32j86J14j01k12
5334a53K16K83l73o3J01k31K93p4JJ68P5j93J04K01l57PK72k98J07M3j16l28L51
5357C6M9j12M7J03j39k11J83k1J70q2j80KR8J11j0K2k6J07J55l20r7J22J01k90
5381a82L11j87J50j47j02p4K69r0K4J20L6Q3l82kp2L86k94N35m22QQ4q0N3k49
5405b24J54K70k77P2q1J78k29J53P1m3j18K56l69R2j92K23L04p3m33N37k09p1
5427iJ71j59K14m20kM08m07J10M1j83L62m2n4m01L64K58k06p0m6J78N9l70L66
$$ plain form
5265 -181 29 145 64 195 177 213 98 -329 -131 202 -52 389 69 64 -67 -60 -125 56 154 60 -125 -47 150 23
5289 23 340 -155 87 194 180 -227 105 -130 -10 -84 24 -78 23 -156 -28 -139 -118 99 -3 204 131 -13
5311 -13 93 58 -198 -130 -144 -73 -346 -130 303 61 79 -82 -32 6 94 120 -73 100 232 46 160 59 -153
5334 -153 63 346 -27 -90 11 -220 73 -1 0 168 243 50 154 355 -2 5 277 -21 86 129 13 -315 36
5357 36 85 -27 20 123 -16 -227 -44 -65 105 23 -157 -155 -57 54 44 66 40 147 302 -18 -115 7 108 -182
5381 -182 129 -58 92 -55 -157 -231 38 -52 -28 92 128 211 -171 -173 -245 141 -153 382 -40 -32 52 -28 25 -224
5405 -224 -70 200 -77 -5 -86 92 -137 16 87 44 -74 182 -187 -95 -287 -64 240 167 -266 271 62 -9
5427 -9 162 3 217 -203 -205 203 -204 -94 -53 -236 126 84 30 -371 -7 251 45 -25 -71 107 166 -204 162
5450A62q6K44j80l8k30K2O3Q7J27l39J89M4q5K39l55K51k33JK69m07K99L3m2k14
5474a79J87M5j8L6j67K54m26K99j6Q9n0j98L30p5K43l53J08L7N4r3j35j01j4J16
5498b7J09p8O9n9j88R0K20p3J20j46Q8n39M21M4k87L86j04m8Kl24K97J38L8p3
5522G6p0K66j6j35j73K8OL3J78O2l72o9K65j77k14K97K44j53l7o9r4J16K3o9K40
5547A86p0QM5m1j25L8k14K41j42L6O6q8km2O3l18N73k95n3K03M7j15j48N0K01
5572A04o4p4j1J40k40L47j72P0N3j67J54j62j15M0j30J30J47%Q6M9q8M9q0l93
5596c27P1K27Q2K6j00K07j75k28L7Q3L83k11j60j42K74L0o0Jj3K4j61M8K94j14
5620I6j72J69P2j40j01J22K3J58k87MJ42J3m2l30L33R8o2k50J18m2O8J01k38p7
$$ plain form
5450 162 76 320 140 102 -128 -106 -43 44 171 -168 21 65 -20 219 -136 115 -118 -117 152 -255 44 77 35 -179
5474 -179 8 53 35 71 -96 158 -268 31 15 104 54 -144 186 111 354 1 109 146 200 107 -28 -129 -143 -27
5498 -27 82 4 73 14 -174 -84 136 63 183 37 125 -414 7 51 -236 150 46 -2 0 -324 -27 111 149 76
5522 76 6 272 256 121 -52 -24 -18 15 193 255 -117 -186 79 -98 -312 -15 229 76 39 -30 -124 -8 15 -54 186
5547 186 116 124 169 128 3 41 -173 68 -74 -38 28 -60 -62 -104 -41 -359 214 -81 -134 69 116 1 -147 -97 104
5572 104 40 -34 -45 95 -145 202 30 100 153 -14 140 -22 -137 -97 -227 -97 50 50 136 185 97 146 66 -327
5596 -327 -256 -29 53 79 -21 186 11 -217 -180 -97 286 75 -85 -227 47 77 17 18 5 29 -132 -84 210 96
5620 96 -76 93 165 25 -76 46 69 227 -60 -56 86 99 57 -273 60 158 96 -154 -36 -78 -10 91 -147 -224
5644b24K20M9J33J19k10l7R6j83J48k26J42k0Kj07K14j27q3m7l53N04r3R8o9J51
5668I7j15L9j47K04O1j65q5J00P5l19K74j94O5J3L75l66P8Q0P7j95J68j11j84
5691a75j69K37K40j26kJ39j46Pl5J63j12J41j29j73P7K00k7N7m8rj26l1K00l18
5715a65N82n02K33l56M8M85j55j00k5o8R1j5J60l85K42q7j42PL57k58QK9L2P5
5739I1J02q3k82M09k45n8R4O1l31n1N36p7k31l8K83J5j88j1j82m2J37K0L86l20
5763ej15L9N7J13m2j33j7J4J22J74l60J32J23O5o1j22n4J4jO7J46k21j05O7L96
5788B93k45j82qM4K28k92K14m0J22j79r0J08N8K63k08L2j92oK18L3j40r4K1p5
5812a17L09l17k0K51n5K03j89r3L18m70J18M3J36l23J30k00K18J57M8j68J30K15
$$ plain form
5644 -224 -4 45 178 297 87 50 146 -37 111 -115 27 7 9 -98 116 -11 -94 -141 -494 10 -83 15 -54 97
5668 97 -18 21 -126 78 139 -26 -111 -11 64 -255 19 -175 -110 -97 278 -88 -10 70 147 -48 120 9 -175
5691 -175 -344 -107 133 7 5 144 -2 5 -30 133 21 162 33 -140 -63 137 110 167 119 110 -16 -47 153 -165
5715 -165 417 -85 148 -208 -160 325 170 70 45 -23 68 53 213 -172 70 -17 -159 -152 205 -53 -45 -16 16 91
5739 91 193 110 -172 237 -8 -66 28 89 -242 -293 243 166 -65 -103 180 195 7 -4 -186 -228 -91 -71 315 -5
5763 -5 -120 -81 -24 89 47 -86 -103 -89 33 207 -153 -21 102 167 106 -16 -70 -56 -57 10 156 -65 -170 -103 293
5788 293 48 -134 -142 -98 130 -162 52 12 134 -45 -135 -27 31 294 86 118 -74 -80 138 171 31 -63 -42 -117
5812 -117 192 -125 -145 106 51 254 65 -28 290 -180 -62 -19 117 -206 -76 -276 -58 99 147 -21 109 324
5834C24m63mN8L27m98L57L6l76L67l3j04L9m6M9k12K88j66j3j23J25M2J86l90
5857b30L85J54j16m3J50n12M00m5l81L21j22R2j44k21J10K05k5J02p7J65l48L58
5879A78jj96Q2k00L23k26j53K50M4q1q2J94k2l19K85j41j27K04L4l5J92n57O26
5902B72m31O23o48R8K15Kk80q2m3J14M82l18J45Qm20J56J81P9j96j58L29p8l38
5925b88M35j33R9k28J27K20k67mj62J68j6K05l59J91j17J50k4M7J6j00j15J39
5947a6R8q3O1j19K52j28j66L03l03J9J03m7K12O1k30k5l6j65K49Q6M6j24r8j12
5971a62K35j59L99l00K50l08k08Q0J32qK21k59L63k64J28r2R8J11q1j59l57K91
5993d9P8Q0j65n4K90k14N2O2J87k71l9Q6P6j62o9K77l18J29j31K97j17J58j7q3
$$ plain form
5834 324 -139 -143 -85 242 -256 101 137 -239 128 95 -9 30 -16 33 -179 109 -57 -70 -193 -68 -26 160 -230
5857 -230 155 309 193 150 300 -212 188 143 -238 83 -39 53 -91 -312 -202 3 -22 80 3 168 -180 178
5879 178 177 -19 63 -137 186 -40 -193 57 101 20 -62 132 110 -209 76 -65 -192 12 46 11 203 -354 272
5902 272 -159 464 -184 -86 129 131 -149 -231 -274 -160 322 4 149 157 -263 -107 74 153 -43 -201 128 50 -288
5925 -288 147 14 113 -115 12 232 -35 -39 -201 -33 -49 156 -203 -12 -129 21 -3 44 60 -40 -155 -16
5947 -16 82 -1 60 -59 193 65 -101 202 -101 -82 21 -26 186 247 17 -8 -44 -209 40 126 172 48 -50 -162
5971 -162 73 -86 313 13 263 -45 -253 -173 -41 -49 172 -87 276 12 140 48 146 257 176 17 -340 -49
5993 -49 29 109 -56 -110 180 -34 18 80 267 -4 -43 43 119 -43 -112 165 -153 -24 -155 142 25 183 166 83
6017H3R1k30O1k57K85L6K24n5j9j0k47q7K9J50K2k08J42k85L06L4O1r4K31k42
6041B1j14K3j1L7j70O7M9l9Q3l1O5k15J88L6n3o7L59n33L87q3m8P5k68N50l33
6066b5L6J43j34k30K85m1m0j67J47P9j42K32k28J38J98k66K70J04j96J21m9j99
6088C6l6j0P5k30J87P6O7q4l3N5j65J45M9J49j94N0j55j3J14j26o3L48l99j09
6112b66K32J35j51k91M45k43J82j93K18j31L7P7k19J02K69k12j62J83Nj65O6p6
6134a58N9K45j33J3j52K50J53k77Q1k87K09q2L08l15j27K09q3L4K58r2j24J4k6
6157b3L49k85j7R0j13m8R6j87L11l24K12j06K70l22J33J76l11J18m3K03k8j42
6179Ik09L02k13J10K3qN5n7l5J68l43K53j44K38k26J9J57J63k39K12m12J31L4
$$ plain form
6017 83 174 -56 5 -252 33 69 293 238 219 209 -38 -125 -96 54 76 -132 10 -275 31 65 126 32 263 21
6041 21 -93 -70 -81 -44 -214 -147 -98 -137 -54 -85 -20 -235 -47 -11 -64 -131 228 -305 82 -1 -49 26 -242 308 -25
6066 -25 11 154 20 -210 75 34 -6 -173 -26 53 -89 143 -85 53 251 -15 255 359 163 284 235 36
6088 36 0 -10 65 -165 22 98 165 81 48 103 -62 83 132 281 87 137 -18 -31 83 -43 -106 242 -157 -266
6112 -266 -34 101 -50 -341 104 -139 43 -150 68 -63 -26 51 -168 -66 203 -9 -171 12 17 -148 -82 -158
6134 -158 -99 146 13 26 -126 124 277 0 81 -206 3 -79 229 -86 -213 -4 -87 -53 205 113 -11 3 -23
6157 -23 326 41 24 114 1 -47 49 -138 173 -151 61 -45 225 -97 36 212 -99 19 -24 179 151 9
6179 9 -200 102 -111 -1 22 14 69 12 -23 145 -198 55 -89 149 -77 -58 99 262 23 235 -177 -46 -12
6202a2r3M9R1MJ19j31j72K65k3pJ17j72R9K24j63j66k88M01l23K94q1P4j01j11
6226a06J01j65L37q6j21L32j76J26j19J68j27j04k50L34l3j61M8O1Mj23K31j20
6248E1Ql43L5J69K54l46K91k84K09j97L22lQ8k87j73M12j08k0r0p0J22m0L66j28
6272B38j47k0rN1M5l46M4K06N5j95K18k36K95j76j11K09k89O4K71j41K11j37l21
6295b21N46n54L61m8j10k36n3K86M6j8J54j26j0J07j7l28J83J50R0m53L7R5j8
6318a37J28P5j33K21j53J56k45K01l19N22l13J7j36j79K05r9K95j86L31l55p1
6339a75J65k5J56J35k64k59J92m6M53m07p9K47j48K23l36M5J84Rj67Q1l58N20
6361A46k27K33k65J02l09K86L4j44O6j53M15j80j49J47J22l8J91n08K11J42O6
$$ plain form
6202 -12 -105 -56 35 39 158 27 -145 120 97 90 207 35 134 358 195 29 -259 142 -181 113 32 106 5 -106
6226 -106 -5 -170 167 81 -40 292 116 242 123 291 164 60 -190 144 111 -50 -2 59 63 -60 171 51
6248 51 59 -284 -249 -80 174 -172 119 -165 44 -153 169 166 254 -33 -206 206 98 78 -12 -82 40 0 366 238
6272 238 91 71 62 113 158 -188 -144 62 117 -78 140 -96 199 23 -88 121 -168 -104 167 26 237 100 -221
6295 -221 325 -229 132 84 -26 -262 -315 -29 17 -1 153 27 17 124 107 -221 -38 112 202 -251 -214 -119 -137
6318 -137 -9 66 -67 154 1 157 -88 113 -206 316 3 20 -116 -295 -90 -189 106 -80 251 -104 -175
6339 -175 -10 -35 121 256 -8 -267 -75 -121 332 -75 -154 93 -55 168 -168 -123 61 70 -97 -16 -374 146
6361 146 -81 152 -113 -11 -320 -34 0 -144 -78 -231 184 4 -145 2 124 86 277 -231 -20 122 188
6382A88q9j32L4j79L00j66L1K2k52K14oJ77j66j83N17k24j24J18k0j21m4L63k89
6405c1J62p9n6M2R9q1J57l85r9L33Q4qq0J29m49R1R9J6k6L30l5l97J84o8j18K73
6431H7O5j63Q6l58K68P4R4k73j43K24nj52L0J67J23Pk58O1K25l29J7M31l76J62
6455F4n1k9j10J79L7j95k1K76k09N0P6m3K39k89p9L39k27j01j51J72O9n4J32J26
6479B00j10k71L42Q9m24L90j05q7R7k27J54L3J78j53j12P6k10p4j65L20Q8O5l1
6502F3k04M3J67k0J11k35J93k6J2k37K80j46r7J4k13M32j53KO4r7J76M0j20k12
6526a63K69L1k68K18j67k0K90j28O2O4j06k3l40J97K23k40J97k86L2j20P7J17
6548h4q6NL46k51J62J39l9k36q9J46k45L47k23L0JQ2N7j20J67P8K2j18j59J28
$$ plain form
6382 188 99 -33 1 -178 122 -44 -13 9 -243 -29 -35 142 -24 -207 310 86 -38 80 60 -61 -105 258 -31
6405 -31 131 52 -4 38 137 56 213 -172 -271 62 146 138 58 187 -262 -171 -72 -56 -82 248 213 -184 0 -68 -186 87
6431 87 152 -11 75 -283 -15 59 153 -120 -263 -39 -44 -196 -166 1 124 131 -127 -66 159 -170 -153 278 -98 64
6455 64 13 -16 -126 53 90 -105 -126 150 -59 -9 67 24 263 -26 -105 234 7 -94 -245 -73 -4 -58 74 200
6479 200 90 -181 161 250 -174 216 111 24 121 -106 48 81 259 106 -6 70 -140 -214 -379 -59 29 94 63
6502 63 -141 -98 69 49 160 -75 118 92 104 -133 147 1 -96 -82 -295 137 -16 -14 50 -47 129 169 49 -163
6526 -163 106 137 -131 87 -80 -100 190 62 124 188 82 59 -281 -84 139 -101 96 -190 -158 -278 -201 -84
6548 -84 -170 -165 181 -70 92 231 192 -44 -133 13 -232 115 -108 -78 -77 5 62 -58 109 187 209 91 -68 60
6572F0k53K14%p0J84k37J16j04J52J14j20k6J28J79m19N0Mj08J75j88k71L58L12
6595B50l03R8p7j97K27p7j09K27q5j02j48K97Q5k30J05J57l37K11r3o1J9r8l3
6618b74J31K04ko2j24j08R5M3L7k1J75o6j5M4K11k14rn0O9j26lJ1J17n4j44J55
6644B0L82l74j06j19M50l59K20p6o0j47j67L44K17j97j2J22J82l35l5j05O4M68
6666C77m60j51J56J24k46J12j5R8J77k99J38J97j51qr4P3J5r4r2K22J44O9m27
6689a35R4K12k28j87J5K38M2K18m61N14l71O9K8k18J99J72j45kj05N5j91N2o5
6712b00J95Kk07L58k01q4J95J18l74K66J54k99P0p1l7J8L12l33J30L5j04l0K4
6735f3j64M56m2j08j62K53j30mj91L95j62Ljj05o8Q0J39j21mkJ11J10l15j55N6
$$ plain form
6572 60 -193 21 21 -49 135 -102 14 -90 62 176 56 30 158 337 -82 -32 -28 -136 39 -149 -420 -62 250
6595 250 -53 45 -32 -229 -2 -79 -188 39 -46 -148 -296 1 86 -144 -39 118 -219 -8 -101 -162 -143 -241 -274
6618 -274 -143 61 59 -3 -127 -235 -140 -97 -60 -81 94 28 13 57 268 54 45 -5 64 -62 -65 -54 63 9 -135 20
6644 20 402 28 -78 -197 253 -106 114 38 -22 -169 -336 8 225 28 16 138 320 -15 -50 -155 -91 377
6666 377 -83 -234 -78 46 -200 -88 -103 -5 172 -127 11 208 57 49 -45 28 43 -51 -143 79 223 292 -135
6689 -135 -41 171 -57 -244 -229 9 51 269 -192 322 -49 20 48 -170 29 201 56 54 -51 4 -187 -135 -200
6712 -200 -5 -3 -210 148 -53 -137 58 176 -198 68 222 -77 -7 -78 -115 -97 215 -118 12 47 -57 -87 -63
6735 -63 -227 229 187 79 -83 170 40 36 -155 240 78 81 80 -25 -93 -13 126 5 1 -1 110 220 -95 -250 -194
6760a94K89R2j25P4k6n0j03L61m79L55l25M39o1j85J31K2l21J09J72M4mk53n1
6783h9K05J59m56J45J01J84k41N9j34L64j79J65n18J87N4J39j43k1n1K05J4j60
6805a1L08k29j77J91k79J98K4j39K58q5j12M26l97K1Q1L0J5j60mP9m8k77J65K35
6829A13k39j55J57J20J1j8J3rk02J82J67j92N3Q3j18L7k24L37j51j51J60J77q6
6852F5j87K48l76L29r2j16K4K51O3l06k47N04J2j23K50j56j23j13K5PM6p6O3n
6876c3O9jl06M53q4j41L28l02j92K50K1k27N3O0o8o9L81l63L71q7k39K13j01m4
6900e8J9K06m51J58K88k71K32j05l41M05j7J0k42L44k72J09r9j02Q2k46L89j1
6922B7K9j05J06j02k24K75k5O2j98M02n95M48k59J14J74k22j68L19J13n38J58
$$ plain form
6760 -194 95 187 62 136 110 60 -43 318 -161 194 -131 308 247 62 193 215 -106 3 175 219 215 -38 -89
6783 -89 116 275 -181 -36 65 249 8 67 -67 297 118 283 -235 -48 6 145 2 -19 -70 135 149 -11
6805 -11 297 68 -109 82 -197 1 25 -114 144 59 -53 373 -24 -3 78 108 123 -37 -41 38 -10 -287 -122 113
6829 113 -126 -281 -124 -4 7 -11 2 -7 -209 -27 140 -52 1 84 -34 3 -221 116 -35 -186 -26 151 65
6852 65 -122 126 -250 79 -13 -129 -105 146 209 -97 -344 160 172 49 299 143 20 -93 -68 -61 -15 -91 -28 -33
6876 -33 36 35 -271 182 98 -43 285 -17 -209 41 62 -165 -112 -52 -120 -189 192 -171 200 113 -126 87 -14 -58
6900 -58 -39 167 -284 -126 162 -109 123 18 -323 82 65 75 -167 177 -95 14 -85 -187 -105 -351 38 27
6922 27 56 -49 57 -45 -269 6 -19 43 -155 247 -348 100 -159 -45 129 -93 -261 58 171 -367 -209
6943b09K92n0r5J13oj41M5O9k40O1L39l27J08J82k42mL65k22Q1j59o5K84k62J27
6967D4M9j38P4l3k74J33J98k97K61k49K19K53m60m5L41j88J29q0m8J01o8j57J93
6990d2K58j84R9m30J64J45k33J49J54P3j43o3j54K18L1j26n2J94Qj51J30j10Q
7013e7o0N3K44k13l31K46M12k61r2pN9k3lK55kj3k74R4M6l34K38J17n0p2J00n48
7039d76L09K61m0J12j63n2R7n1J20j76k51N30j27j10J25j53n3J25P2j07K5O7n0
7062C4n9n5L66k92Ro5J56p6j41R8j48K0J1j15J60J35r7j33P7J96L7l32L18p0O3
7087I7k12K33J08k59K51l19R4L9pP3k14K53j02P8k11K29j4P0k00j3l18N25l92
7110b11J38K45j51L75o79M33j2K5K54j73l95J02L9p2J40J41m4j48j27K27j23J95
$$ plain form
6943 -209 83 33 -62 51 45 -96 -51 18 -222 -161 178 -149 -41 141 -101 -105 260 38 119 -40 -105 179 -83 44
6967 44 93 -45 29 -4 -278 -145 53 -244 17 -232 -13 240 -220 -265 76 -112 17 -63 -111 -10 -78 -235 -42
6990 -42 216 32 131 -299 -135 10 -223 -74 80 153 10 -53 -207 11 42 -84 -136 58 66 -85 45 -65 -57
7013 -57 -117 -64 180 -33 -364 -118 294 33 -59 -66 -7 -30 -33 222 220 207 -67 27 73 -261 -23 94 44 -28 72 -476
7039 -476 -167 94 54 166 3 -49 48 -3 117 -59 -310 220 93 -17 108 -45 -98 27 99 -8 17 84 34
7062 34 -25 -80 286 -6 3 -62 94 18 -123 -25 -173 -153 -142 -257 -97 38 -59 -192 -115 81 118 -214 104 34 97
7087 97 -115 118 226 -33 218 -101 -7 32 25 98 -116 137 35 113 -98 131 117 187 -13 -26 -344 181 -211
7110 -211 -73 172 21 396 -283 150 138 163 417 244 -151 -49 -10 -82 58 199 155 7 -120 107 -16 179
7132A79m9n1L9o8j28J24l06N17j79J30k84J30L0n0l86M30K63p06N02k86K81k10
7154g8P3K69k21K7M0j47l4J66n3k65R2L82k55K9J68n1j59K11l55J44p7K9Q5n38
7178e18L60K68j70J49j4K18m11k11L06K71l20j11K47N3j15j00N3R8n8j18R0k9
7200f2L6l05K11M0L0j34O3n2J41O4k08j66J95K89K27k02j33R1j83j3L1J77j28
7223IJ47l18J42K20k88L47k65j0NMl1R6J53m20M47j75K01j6j81k4N1j02N3M4j34
7248d5n9p8J83K80m34K68k82K95k44J23O4k32P5R5r3p5J05J49k27J70l12M24k64
7271a14Q2k3L18j03k14Q6j95K53p3Q4j04j43J99k44K25P3J37j49Q9m4j33j26J65
7294D6j6j4j26K1J67P4k90K3qj32M1K02p1K66J61l30M7k72M08l17J34m7k55k2
$$ plain form
7132 179 130 79 118 50 -78 46 -260 257 78 208 -76 54 84 34 -352 78 341 -365 137 -149 132 -78
7154 -78 -5 264 43 70 110 -37 -71 95 42 -223 -131 251 -4 25 193 142 -17 194 -161 -17 -94 -65 20 -518
7178 -518 -158 110 -60 89 75 293 -118 -329 -23 248 -72 -183 64 117 2 -98 -45 53 -5 -123 -33 -62
7200 -62 -26 -331 -120 -80 -50 -184 -121 -173 -32 32 -176 -342 -147 142 369 167 34 125 -58 -71 -40 137 9
7223 9 156 -162 -20 200 -88 259 -6 -16 -11 -7 -38 58 211 -209 238 63 264 248 67 43 94 -8 45 89 -45
7248 -45 -104 -182 1 281 -153 115 -167 128 -116 7 71 -161 -86 9 -84 -159 -54 95 -132 38 -274 150 -114
7271 -114 -32 -55 263 160 -54 32 -163 90 17 101 -3 -146 53 -191 34 107 244 95 184 140 7 -119 46
7294 46 30 16 -110 -89 78 152 -138 -115 -123 -255 -214 -12 -83 183 344 14 61 -211 197 -120 14 -33 -288 -310
7318c10K20K36j60K12o4k55j56N7K19K04p6k15j32j01N5L92k12K69k86L6L5j74
7340b06NK04K1K4l2J77j63o7p2J58J15P9j8l61J39k43M34j77l85L47j9k11M04
7363A53k60N3j58K73j40J98p9M15n03l4N6K7K36J9m17L23O0m30j01L54m5J99j08
7386I1L0l01J88pj14k5J51j68L01P1j44J25k79J49k90L30j81K85l09J90J2m9m0
7409A6J96l65K86l29J28J89n4J28k83q4J33k2R2k81M45n2L5j69l9jK23q6N4o9
7433I1j48l3j25K71Qj73k2Q0q9J30J66k74K33k8l7P7j94O8J68p9l76K50o4p9j8
7458a97p3M54m75K54J00J60l02Q5j22L3Q5j79J83J1Q3p2j24J54qP1k82K81j27
7481gj18j82K66k75J5K90K5r9J17Q5L0j93K72k70m4OJ44n8j47J60p5J48K4K6J8
$$ plain form
7318 -310 -90 146 -14 198 134 -121 -277 -220 -1 203 127 -88 -220 -321 -266 126 -86 183 -103 -67 -32 -206
7340 -206 -201 3 24 48 16 193 30 -37 -109 49 164 243 225 -136 3 -240 194 17 -368 -21 -40 -251 153
7363 153 -107 -54 -212 61 -79 119 40 455 -48 -82 -26 1 237 256 -161 162 222 -208 -309 45 0 199 91
7386 91 121 -180 8 1 -113 -138 13 -155 146 217 73 198 -81 68 -222 108 -73 212 -97 93 105 56 16
7409 16 212 -153 133 -196 -68 121 67 195 -88 -172 -39 -61 31 -250 195 143 178 9 -30 -31 192 106 160 91
7433 91 -57 -90 -215 56 64 -109 -131 -51 -140 -10 156 -118 115 87 50 127 -67 1 169 90 -286 -36 -100 -179 -197
7458 -197 -270 184 -291 -37 63 223 -79 6 -116 -83 2 -177 6 17 100 28 -96 58 50 121 -161 120 -7
7481 -7 -125 -307 -41 -316 -301 -11 14 -85 32 117 147 -46 226 -44 -88 -82 62 4 -143 17 -58 90 114 140 158
7506A58l28K04J25p8K4n4J88r7j18j50M7k5J75J02j08k88L85O9m55L41j93L1%
7529d5K24m6%Q8k80j7M01l53J40k27J47l06L95k6m8j92K04k52L85k59l3K44j52
7552hM8ol1j05L49l48J01j52L37l39M34j24j93nn2K9Q7j08m9J33J82qj55r7o7
7577a47L89l38L2J47j15k38K48O6J50k1n01L97j58J62K7n1j96P7P0o0QJ60j64
7600e6j88K84j43J73l4q0K06j99j95M83k49l3O3n0k1O6k35n7M55l51k7J90j8N5
7624C9l0rN6l72j14N34n24M21p1J01q0N9j22K14K7l55M99l70K14J14l30M48k30
7647A19j49K73k96J69m40K82j31K30J21q3l01J46M6N6n2L3j16K97M0l15K51nj07
7670F8j31p4J97J43j14j8P6k13J86J24m82P6P7j09L01k05L38k65J91j01L2k6j12
$$ plain form
7506 158 -170 34 159 81 105 51 239 142 24 -126 -79 -104 71 173 65 -223 162 231 -224 117 -76 -45 -45
7529 -45 179 133 133 221 -59 -76 325 -28 112 -115 32 -274 121 95 47 -145 59 -193 192 -67 -100 144 -8
7552 -8 40 34 3 -102 247 -101 0 -152 185 -154 280 156 -37 -42 -94 -65 22 -86 -135 -2 180 172 17 -80 -147
7577 -147 242 -96 -64 83 -32 -270 -22 44 194 173 -328 69 -89 73 100 49 -147 -70 0 -60 -52 108 -56
7600 -56 -244 40 -103 70 36 -44 162 -37 -232 251 2 -31 32 -18 -39 27 -208 -265 190 -161 -188 2 -16 39
7624 39 9 0 56 -316 -430 104 -420 1 -70 31 -49 10 -112 102 129 -226 273 -97 117 231 -99 349 119
7647 119 -30 243 -53 116 -324 -42 -173 57 178 95 -206 -60 -14 42 -10 23 -93 204 244 -71 180 175 68
7670 68 -63 -137 60 203 89 71 147 -66 120 244 -238 -162 -85 -194 107 -98 240 -25 166 65 97 71 -41
7693d1j9J3J45k0J33k75L6J18m6k2P9j0k76K87l33J77j71L14R3nl38L03j49J27
7717A20k12R6j80L63m4j0n6Q3k23J0K14j90K10k41J92j36j1r7P6J80j84q3J94
7740G1nj50J00pK90l66m0Q2K51j54N5L6l09L67l64R6J08p3j59J70l95K22J85l8
7764b7J14P4l69K33o0R0n9L03j61j80j37M41k46O2j89J50L09m05K44k00J23k58
7786a48Q1k7m4L52k63r6K02J24J2m09L99l02O5RM7J38j0k62K85Q3k71j85L31q8
7810B3j40J00J41l45J12j9K11l5k3M1Nk9j16j94J15j34j5M53l12L46k85R9J9P8
7834I6k01K12n9Q3j28N1J18j45P6j49ok2J58l5J10j76M3l9l9K83j06k58p6K70
7858F1n1j06M53k22j84j81L80j41K5j79K18p5Q2M6J47k93J7j01K34m2l12J11J1
$$ plain form
7693 -41 -60 -47 98 78 211 -64 -28 90 44 22 101 91 -185 102 -231 -54 -225 89 182 177 -161 142 -7 120
7717 120 -92 4 -176 187 143 133 77 160 -63 -53 161 -29 181 -60 132 -4 -15 -112 -36 144 -40 -123 71
7740 71 66 -84 16 9 299 -67 -107 -25 226 72 127 163 -146 221 -143 -47 61 -12 -171 -1 -396 -174 11 -27
7764 -27 87 161 -208 25 -35 55 -4 299 138 -42 -179 262 16 78 -111 39 348 -57 187 -13 110 -148
7786 -148 -67 -94 -138 214 -49 -145 57 181 193 -216 183 -119 -54 -45 2 140 130 -132 153 236 -35 -220 111 23
7810 23 -117 -17 124 -221 -109 -128 83 48 25 66 71 42 -74 -268 -153 -287 -302 151 -161 185 -100 -1 18 96
7834 96 -105 107 48 131 3 54 172 27 103 -46 -52 -74 84 49 159 -17 26 -13 -52 231 125 -133 -209 61
7858 61 10 -96 357 135 -49 -230 150 9 34 -145 73 -2 80 126 273 -20 -3 -104 130 88 -224 -113 -102
7881a02J26J6J02k24P6l0K30j13K09k22K2r7k87J74J48j00j15L0L48l26L14k75
7903i6km0K89l28J53K05l85M21k13K6r1k3M28J6l53J7k66J86p8N4J61j75o3J49
7927hm1J66L5j80J4j82L88k00J97l83L57k70L32j52n7p6J79o2k52L79q5m20NL77
7951F1j29j77K07k42K70J34k80O9K60Mj03k87J22K78J14m33P0J18j24j69J90K6
7973b1n5K01j97K22J05l78J00J02j62o8K63j94J34j8O4l07L88k55K4J6M5k54J83
7996f2l8J15k84M29J6p8j79k94K56L46j40j35K32n5j62k0O2J13m9k13K66l30M45
8019B41k1m38r9J23K69j8j69K59k98Q9J23j39J18R9j63O7j13q7Q0O3j17M53k53
8042F9o2Q1k70J56j08J34j41L03j42k8Q3Q4L28k74l21L16l06K11k91L60L0l43
$$ plain form
7881 -102 24 40 142 -82 -6 -36 194 81 290 68 90 -7 -294 -120 28 -72 -187 -157 191 -135 179 -96
7903 -96 -98 -138 151 -177 -24 181 -204 217 4 30 -61 -84 344 360 7 24 -242 -56 -134 -80 81 -94 -157 -8
7927 -8 -49 117 152 -28 -14 -196 192 -8 189 -194 163 -107 225 73 16 -60 119 57 -195 184 99 -321 -316 61
7951 61 -68 -245 -38 -280 -10 124 -156 -87 173 177 74 -213 -91 187 301 -132 -62 56 -68 -237 -47 -21
7973 -21 -76 125 -72 150 255 -123 -23 79 -83 -151 112 -82 52 34 98 -209 179 -76 -52 -36 9 -245 -62
7996 -62 -100 15 -269 160 176 98 -81 -375 -119 227 87 -48 184 129 -33 -53 9 122 73 -140 126 -204 241
8019 241 220 -218 -317 -194 75 57 -112 147 -151 -62 61 -78 40 139 -24 43 -70 -157 -77 -14 -131 322 69
8042 69 7 88 -182 -26 -134 0 -141 162 20 -8 75 159 487 213 -108 208 -98 113 -178 182 212 -131
8064a31M2K17p5j01j13N2Q7K0J29j58m0L5q4J67j94q2K37LK5k17J16K7m4JP3K39
8090B31j43k3J6j92n2J50L8L3q3j53K00n7J14j40O0j62L55l81R7L58k78J47nj40
8114a0Q8k88L67l42J07np1K42K08m41M2j16L0K46j39K64j47l3J53J27j18l33N6
8137a13L9NN4k0L3j97N26l66o7j20L10N6K0l05N4J53k38L95p6l8L3l88J42pJ01
8162a4n3J54j24J1J1J90J37l54P9j15J04jK2j11j09L24l23J44R3P6J0k77j22M03
8186A55l48K19k3J3%
$$ plain form
8064 -131 -89 128 53 -48 -161 -109 -22 -2 127 -31 -71 -36 -120 47 -147 -229 8 11 36 -181 -65 -38 -82 -81 -8 231
8090 231 88 65 81 -111 -163 -13 25 58 -25 -178 22 -35 79 -61 -1 -163 192 -189 -92 266 -12 135 130 -10
8114 -10 78 -210 157 -185 -78 -83 -154 88 296 -145 -103 -219 -189 57 -82 182 35 2 155 282 164 -169 -113
8137 -113 -74 -69 -15 -35 -2 -199 327 -39 -106 -226 84 140 160 -145 -91 62 -176 219 143 105 138 -250 -108 -115 -14
8162 -14 -67 87 -37 -26 -15 175 312 -42 37 -78 26 25 47 -64 -173 151 -172 -28 65 141 151 -126 -248 155
8186 155 -193 26 3 16 16
8191A6
$$ Imaginary data points
##PAGE= N=2
##DATA TABLE= (X++(I..I)), XYDATA
0@%%%%%%%%%%Qj6J6j6K4l2M0m8N6p2Q8j04J20j37J61j92K25k58K98l46L97m53
32b41N14n84O64p48Q38r41J054j177J311j457J618j794J984k193K422k672K948
49A546l246L572l936M340m787N283n841O477p204Q042r023J0190j1606J3366j5622
64h449J8639k2896K9387m0610O5262k14062J50694L54785m47082q4968L59307
75A60007m3571l35402K44397K25331l63163j59855M55311M4632m21224P6112L61885
86B44460k15556k59319K87046J38123l56448j6604L59480q5771l03139K12080
96D352K08033l08307j05992L63080K407l59101Q5207L17897j48666k12449K11595
107E8056P5067k79544M9729L01541j58747k95021K22761K45731k40027j49996
$$ plain form
0 0 0 0 0 0 0 0 0 0 0 0 8 -8 8 -8 16 -16 24 -24 32 -40 48 -56 64 -73 88 -104 121 -137 161 -185 212 -241
32 -241 273 -311 353 -395 443 -498 556 -621 690 -767 851 -943 1041 -1152 1270 -1402 1546
49 1546 -1700 1872 -2064 2276 -2511 2772 -3069 3408 -3796 4246 -4777 5413 -6193 7173 -8449
64 -8449 10190 -12706 16681 -23929 41333 -172729 -22035 332750 -114332 -199300 160007
75 160007 116436 -218966 25431 250762 -112401 -272256 183055 227687 -193537 -117425 244460
86 244460 28904 -230415 56631 194754 -161694 -178298 181182 95411 -207728 4352
96 4352 212385 -95922 -201914 161166 163573 -195528 -110321 207576 58910 -153539 58056
107 58056 133123 -146421 -96692 204849 46102 -248919 -26158 219573 -20454 -170450
117a70450K38639K4457k28530J05592K05596k10401j53308K81848R5535k90429
127a01451j7195K57416p8431k14501J58710J47069k23067o8698K48514j9634k29483
138a40751J05269J76510j82232j15205K37091N9385k48145J0510K30136p3484
148E9084j67180J33467P4196j88318J0365K16227p8395k18539J21479J83503j49997
159d108j19414J59176K5218j56783P1965J45669j38385j11659J82790P2798j92089
170f4822j8454J77981m7266j48515J07976J00149j50865m4709J60170j9403j52533
181a00291P3259J24187j22898q6658J62719M6887j70061O515J52698n4434j06112
192g4189R8773N1336j33787O14J55256m5940j59387P8191J28182j07292p8704
$$ plain form
117 -170450 68189 92646 -135884 -30292 175304 -35097 -188405 93443 188978 -101451
127 -101451 -118646 138770 60339 -154162 4548 151617 -71450 -140148 108366 88732 -140751
138 -140751 -35482 141028 -41204 -156409 80682 140067 -108078 -97568 132568 59084
148 59084 -108096 25371 99567 -88751 -78386 137841 59446 -159093 -37614 145889 -4108
159 -4108 -123522 35654 60872 -95911 -23946 121723 -16662 -128321 54469 127267 -64822
170 -64822 -83276 94705 47439 -101076 6900 107049 -43816 -88525 71645 52242 -100291
181 -100291 -27032 97155 -25743 -112401 50318 97205 -72856 -66341 86357 31923 -74189
192 -74189 24584 75920 -57867 -57253 98003 52063 -107324 -29133 99049 -8243 -86947
203h6947J17355J3102j16600M9359J10041r4530q8520J29208N9250j41029j1897
214f1208J37690l8319j13364Q3510P5133j14117l5981J22388j2339j24164N6928
225b3843J05904j00787p4368J30254L4175j32860J1498J19260n0472q5975R0261
236B3047N0300j19133p546J35164l6181j30662O9017R8093r6137n7135J05095
247C3922P820j09128L8934J02936q0053q0648J12254M8391j22156k280J19372
258F9364l7517r8172P2374O9698r9420l5542J11993r552j15182N1490R5771q9293
270a3988o7921J09610L1412j14525Q405J09018m5166q6317Q5715N7312j11502
281c7947j4898J22756k6628j14433N9680Q9103q8498n8288J04256J4178j14179
$$ plain form
203 -86947 30408 43510 -73090 -23731 86310 -8220 -96740 32468 91718 -49311 -61208
214 -61208 76482 38163 -75201 8309 83442 -30675 -66656 55732 43393 -80771 -23843
225 -23843 82061 -18726 -93094 37160 71335 -61525 -50027 69233 18761 -67214 23047
236 23047 73347 -45786 -53332 81832 45651 -85011 -15994 82099 -14038 -71173 33922
247 33922 41742 -67386 -28452 74484 -5569 -86217 26037 74428 -47728 -50008 69364
258 69364 31847 -66325 6049 75747 -23673 -59215 52778 43226 -71956 -20466 75305 -13988
270 -13988 -81909 27701 59113 -55412 -47007 62011 16845 -69472 16243 73555 -37947
281 -37947 -52845 69911 43283 -71150 -11470 77633 -10865 -69153 35103 49281 -64898
292f4898K9744J04933p1570p9967J02198M6055j12564m733J14946l1087j00374
303f7317O8067P6363r6145m0066J11145n637j10587M2866R2347p7456o9068R6360
315B0872L6372j08108J694J07230l9983q7796P7307O0177r6729k2629J06761j1006
327D4162j02452M4135Q7026p5727o2104R5092K2678j06196J5308R6818n2059p8618
339g1937P9235N3103r6854j8793J07474j5351r9348N4155Q0352q1213m7589R7454
351D0688J1057j02493K2954R3376n9025p7677Q4085M6185j01837r686J02615k7653
363B2589q8201O1148O7430q2077l6456R8846M877j00268L2036Q9080o4431o4631
375f0058Q3946L0328r5272J574R0326l6131q0408O4530N8736q6839k6938R8001
$$ plain form
292 -64898 -35154 69779 -1791 -81758 20440 66495 -46069 -50802 64144 33057 -67317
303 -67317 750 77113 -19032 -59098 52047 46410 -64177 -21311 71036 -6420 -75488 20872
315 20872 57244 -50864 -49170 58060 18077 -69719 7588 67765 -28964 -51593 55168 44162
327 44162 -58290 -14155 72871 -2856 -64960 30132 52810 -53386 -38078 58740 6681 -71937
339 -71937 7298 60401 -36453 -55246 52228 36877 -62471 -8316 72036 -9177 -56766 40688
351 40688 51745 -50748 -27794 65582 6557 -71120 12965 59150 -42687 -52373 50242 22589
363 22589 -65612 -4464 62966 -19111 -55567 43279 48156 -52112 -20076 69004 4573 -60058
375 -60058 23888 54216 -41056 -39482 50844 14713 -65695 -1165 57571 -29268 -56206 41795
387D1795o843r0112M0995P5773o4128m9611Q3048K0793r2515J1775Q8811m7098
399A2683p4665P0766M5841q7141j6033Q8315j5721q1833M6638O6558p0344l9596
411e4532Q9328R913r0532K4691Q1223n0550o0642O8456L4184q2464n823Q3129
423D6381k8487p6793N5542N5604p5562k8940Q3179Q71p8131K8390O8675n0641
435H8m7266P2174K2302q1081P393P8350l5385o6323N3802M3921o8863k1700P3514
448C0926p640p2475L5767O0064n8876l7562P4917J4137p5925J2398P2535l3519
460A4747n8216N4791L6340p0571r362P4223k1896p0702M4085N4589o2603l5559
472e0134P0828J1695p1844J7490O5608m3634m6402O6788K5435p5505L27P5678
$$ plain form
387 41795 34952 -55160 -14165 61608 -2520 -52131 30917 51710 -40805 -29030 59781 12683
399 12683 -61982 8784 54625 -32516 -48549 39766 24045 -57788 -11150 55408 -14936 -54532
411 -54532 34796 44709 -45823 -21132 60091 9541 -51101 17355 51539 -30925 -36748 46381
423 46381 17894 -58899 -3357 52247 -23315 -52255 30924 31795 -46336 -17946 50729 88
435 88 -47178 24996 47298 -33783 -26390 51960 16575 -49748 4054 47975 -20888 -42588 30926
448 30926 23286 -49189 -13422 46642 -12234 -49796 25121 39258 -36667 -24269 48266 14747
460 14747 -43469 11322 47662 -22909 -32271 41952 20056 -50646 -6561 48028 -14575 -50134
472 -50134 20694 32389 -39455 -21965 43643 9 -46393 20395 45830 -29675 -29348 46330
484D6330k3543o6554M3279M8183o2068k5878P0103o091p0007L2607N7721n4179
496a0097l9575O8618J9578p2206O103P0789k8718n5739N1417L3649o4728o455
508b7364O8121k0060o6587L8915N4622n6226l8965O4243J2250o4681J6561N6695
520C7524m1086l9898O0856K4116o8051m070P0666j5157o2464L5567M4300n2633
532a0330k1956N9458m376o1972K4573N3726m3248m2276N7230K5304o4331j699
544b9897O4372j9220n0535L9559L3593n1985j2744O1889q845o5942K7523N8189
556D5957m5405m4093N3783J8489n6521P092N1550l1071m2895N3074L2456o4754
568b2338j4062P0417o263o0756K8346M3948m5414k4027N5370R49o1477J8408N7014
$$ plain form
484 46330 22787 -43767 -488 47695 -14373 -40251 29852 23761 -46246 -13639 44082 -10097
496 -10097 -49672 18946 38524 -33682 -27579 43210 14492 -41247 10170 43819 -20909 -27364
508 -27364 40757 20697 -45890 -6975 47647 -8579 -47544 16699 28949 -35732 -19171 37524
520 37524 -3562 -43460 17396 41512 -26539 -30609 40057 24900 -37564 -1997 42303 -10330
532 -10330 -32286 27172 22796 -39176 -14603 39123 -4125 -46401 10829 36133 -28198 -29897
544 -29897 34475 15255 -35280 4279 37872 -14113 -26857 35032 26187 -39755 -12232 45957
556 45957 552 -43541 10242 28731 -27790 -20698 30852 -219 -43114 9960 42416 -22338
568 -22338 -36400 34017 27754 -33002 -4656 39292 -6122 -30149 25221 26170 -35307 -16899 40115
581D0115m0443m6058N4012K7060o0214m465N8718j4871m7430L4960L4314m8734
593a3036j4719O0740o021o2723K4016N4485l8592m0704M3324J8890m7070K351
605a9059M6345k6842m1857M6771L3532n7008j7147N9778J015n1242J7832M0766
617C2884l3414k5421M6788O881n7011J1322N4431l0207m6329M1511L0053m9615
629a8127j2541N1761n312m6801K6778L7417m3328j8876N6432J756n9426J4955
641a5312N3973k8273m2891L6622K3203m5905r15M6676k3526m3932M1234L4518
653C5472n0256k0244N3362O332m7544J2860M0170l0311k5115M4670Q390n1680
665b3894P397M8094k2340m2797L2284K9989m1594j5528M4512k622m1395K2101
$$ plain form
581 40115 -328 -46386 7626 34686 -25528 -29993 28725 13854 -33576 1384 35698 -13036
593 -13036 -27755 32985 26964 -35759 -11743 42742 4150 -36554 6770 25660 -21410 -19059
605 -19059 27286 444 -41413 5358 38890 -18118 -35265 24513 25528 -25714 -7882 32884
617 32884 -530 -25951 20837 27718 -29293 -17971 36460 6253 -40076 1435 31488 -18127
629 -18127 -30668 21093 15781 -31020 -4242 33175 -10153 -29029 27403 29159 -30267 -15312
641 -15312 38661 10388 -32503 4119 27322 -18583 -19498 27178 3652 -40280 954 35472
653 35472 -14784 -35028 18334 24666 -22878 -10018 30152 -159 -25274 19396 27786 -23894
665 -23894 -16497 31597 9257 -33540 -1256 28733 -12861 -28389 16123 13501 -27894 -5793
677e793L3093l5251j9280M6183Q128m9193N595M8125j8179m0196K9220K3194l8625
690a2979m697M0383j5064m1203K8417L6238l8749k6384M4660J2932m3654O882
702a3218L9386k3503k7260L8243J4821m5690j623M6686j2949m4524K5344L3266
714B8979l7694j9163M1742J35m0018J6908L4214k9894k3754M1668J3657m6301
726a9521K193M5832j5172l6424K6620K0944l4971o333L7826j0297l9125K1743
738f685L4218l3598k3787L9092R031l7750P753L3258j9987k3713L1355J5872l7690
751a2631l484L9917r761l7170K0973K6415k9982j5914L2265J795l3309R557L1330
764B0001k1972k3936L2963J5145l6804j464L6624q287l0707J8979K2477k7940
$$ plain form
677 -5793 27300 -7951 -27231 18952 27080 -22113 -16518 31607 13428 -26768 2452 25646 -12979
690 -12979 -17676 22707 7643 -33560 -5143 31095 -7654 -34038 10622 23554 -20100 -13218
702 -13218 26168 2665 -24595 13648 28469 -17221 -18844 27842 14893 -29631 -4287 28979
714 28979 -8715 -27878 13864 13999 -26019 -9111 25103 -4791 -28545 13123 26780 -19521
726 -19521 -17328 28504 13332 -23092 3528 24472 -10499 -16832 20994 10697 -28428 -6685
738 -6685 27533 -6065 -29852 9240 18271 -19479 -11726 21532 1545 -22168 9187 25059 -12631
751 -12631 -16115 23802 14041 -23129 -2156 24259 -5723 -21637 10628 12423 -20886 -11329 20001
764 20001 -1971 -25907 7056 22201 -14603 -16067 20557 12270 -18437 542 23019 -4921
776d921j1862L3352j809l7140J3761L2152k5694k4230L1379J1697l2780R47L3270
789A8122j2845k7826K6248K0682l4163p385L7833n104l5077J5978K7722k6258
801b073j8927L1009N966l6033P411L3025k0906k5541L0764J5271l4253k075L4774
814A8412p662k9841J9702K3042k8514j1900L3432j503l4348J2165K8341k2296
826i70k1651K7153J1339l1086k63L1783j2010k5944K3472J8182k7844p462L1481
839A6180j840k9947J1402K6058k1617j8709K7776O475l1614M027K8226j5023k3096
852b1702K1714J6994k7724o183L1246l369k9033J5934K3610k3481j3699K8304
864A2611L509k9733N639K6929j5857k3714K3918J2901k9397k663K9383q330k5078
$$ plain form
776 -4921 -16783 16569 14760 -22380 -8619 23533 -2161 -26391 4988 16685 -16095 -15148 18122
789 18122 5277 -22549 3699 24381 -9782 -17167 20666 15562 -19515 -3537 24185 -2073
801 -2073 -21000 10009 15975 -20058 -12647 20378 -528 -26069 4695 19966 -14287 -16362 18412
814 18412 10750 -19091 611 23653 -4861 -16761 16671 15168 -19180 -7015 21326 -970
826 -970 -22621 4532 15871 -15215 -15478 16305 4295 -21649 1823 20005 -7839 -15301 16180
839 16180 14340 -15607 -4205 21853 236 -18473 9303 15778 -15836 -11809 16417 1394 -21702
852 -21702 12 17006 -10718 -16901 14345 10976 -18057 -2123 21487 -1994 -15693 12611
864 12611 16120 -13613 -7974 18955 3098 -20616 3302 16203 -13194 -15857 13526 5196 -19882
877a9882J7386K0196k2844j1018K8153K612k8609Q878K6045j8590j8738K3921
889G510Q596k7408j64K5650r624k3974J7329J7552k3834q848K8154j470k5430
902a5961J1575K2162j7756j4551K3399P576k6301J487K5550j2309k2030J9374
914B215J3202k4790n159K4755l761k3570J1891K0373j9062j2579K5546M072k5410
927a2277O458K3135j3490j7615J9131J0793k3805l312K3794o665k2921J4537J6151
940A3914k1023p954K2772J79k1474P504K0187j3552j3989K0167P706k2601J657
953f507K1491r965j7509J4102J1641j9023o017K0005k266k0698R877J7073j6074
966c870j0251K0241L978j9744L867J9179r444j4789J5308R454j9835k126K0162
$$ plain form
877 -19882 -2496 17700 -5144 -16162 11991 14603 -14006 -5128 20917 2327 -16411 7510
889 7510 16106 -11302 -11466 14184 4560 -19414 -2085 15467 -8367 -17215 10939 9469 -15961
902 -15961 -4386 17776 20 -14531 8868 16444 -9857 -8370 17180 4871 -17159 2215
914 2215 15417 -9373 -14532 10223 6462 -17108 -5217 15156 -3906 -16485 9061 13133 -12277
927 -12277 -5819 17316 3826 -13789 5342 16135 -7670 -10982 12812 6147 -16774 -2237 13914
940 13914 -7109 -15063 7709 7888 -13586 -6082 14105 553 -13436 6731 14437 -8164 -6507
953 -6507 14984 5019 -12490 1612 13253 -5770 -11787 8218 5952 -14746 -4869 12204 -3870
966 -3870 -14121 6120 10098 -9646 -5779 13400 3956 -10833 4475 13929 -5906 -8032 12130
979A2130o621j8427J1545J3182j6397q397J8130J829j8792N948J7395j2219j2034
992a2728J8423O366j9416J165J9009o769j6560J1850J1856j7348o060J8690k876
1005E602j8645R420J4447j5031r973J8440N061j8551K163J8774q473j3983J5531
1018D782Q345j8983j071J9016n765j8017J0268J3799j5528r645J7963J633j8720
1031a1923O533J6086j2521j1234J7820O628j8930k49K0386o144j7125J2225J1994
1044A3546j7178n395J8347l512j8315R190J5087j4683j1977J8256O630j9482J187
1057h299J8817p865j3798J4672Q533j7500k241J9721l874j9520Q843J6016j4877
1070a372j0396J7068J222j7272N158J5339j1134j2313J6369Q671j8801j952K0539
$$ plain form
979 12130 5509 -12918 -1373 11809 -4588 -12985 5145 6974 -11818 -5870 11525 -694 -12728
992 -12728 5695 12061 -7355 -6190 12819 6050 -10510 1340 13196 -4152 -10212 8478 5602
1005 5602 -13043 -3623 10824 -4207 -14180 4260 9321 -9230 -7067 11707 3234 -10749 4782
1018 4782 13127 -5856 -6927 12089 6324 -11693 -1425 12374 -3154 -12799 5164 6797 -11923
1031 -11923 -5390 10696 -1825 -13059 4761 11389 -7541 -7790 12596 6452 -10673 1552 13546
1044 13546 -3632 -9027 9320 5808 -12507 -3317 11770 -2913 -14890 3366 9996 -9486 -8299
1057 -8299 10518 2653 -11145 3527 12060 -5440 -7681 12040 8166 -11354 -2511 13505 -1372
1070 -1372 -11768 5300 6522 -10750 -5592 9747 -1387 -13700 2669 11340 -7461 -9413 11126
1083A1126l851j7264J0109J2001j3691o210J5878m15j8052N752J6546j2538j4059
1096a4668J6145Q599j7743j407J6175m181j2779J0997J0444j5232n959J9537Q20
1109A0748k0281N452J6870j0930j2323J3193N595j5760j80J6738p392j5815J3564
1122e21J2875j7794o465J9611O77j6886N654J4567j0511j0013J5553L580j9052
1135h725K749J8659r952j6795J3443J1049j5895n313J6498j870j4636R668J2804
1148A1684j5253o971J9408J745j9187L503J6749q149j2448J1048O284j4659o33
1161f879J5634o635j4771J1107J1125j3646o538J5088K873j3829K538J2853p224
1174A696q901J2339L681j4540O56J4550n277j3741P029J0922j0133p350J1781
$$ plain form
1083 11126 7275 -9989 120 12121 -1570 -7780 8098 7683 -10369 -4617 11929 -609 -14668
1096 -14668 1477 10076 -7667 -9074 7101 2920 -9859 1138 11582 -3650 -9609 9928 10748
1109 10748 -9533 -4081 12789 1859 -10464 2729 8324 -7436 -7616 9122 1730 -14085 -521
1122 -521 12354 -5440 -11905 7706 8383 -8503 -2849 11718 1207 -8806 6747 10327 -8725
1135 -8725 -5976 12683 2731 -14064 -621 10428 -5467 -10780 5718 3848 -10788 -1120 11684
1148 11684 -3569 -10540 8868 10613 -8574 -5071 11678 3529 -8919 2129 8413 -6246 -6879
1161 -6879 8755 2120 -12651 -1544 9581 -4065 -10603 4485 7358 -6471 -3933 8920 1696
1174 1696 -7205 5134 8815 -5725 -5069 9481 4204 -9537 -2508 8414 -1719 -9069 2712
1187B712R46j1795N192J0960r251q241J3457O013j4299k065J4769k168j2793O843
1201B80Q145j1713l436J2942k153j3986N893J2636r894r842J2919O037j3649N13
1215e308J3386n888r569J0956N490j3174j544J4343k461j5202O550J0960r928
1228a389o808J1277M37j1556M771J0257q268q044J2082N944j3101j083J2949l297
1242D171r708P234O041j0272k377J1003k397j1258M364J0064q114p759J0220L696
1256D908j0226J279R472m058p049P868N125r750k416J1763j354j1599M394Q486
1270F843p212n732P810J695r130J577R656n657q742R404O788j0397k740J1109
1284E272j018r176N484O963p974m563J0056L27j1729L355R926p030p861Q650M068
$$ plain form
1187 2712 3658 -8137 -2945 8015 -1236 -9477 3980 9993 -4306 -6371 8398 6230 -6563 280
1201 280 8425 -3288 -6724 6218 4065 -9921 -4028 8608 -1286 -11128 1791 7828 -5821 -5308
1215 -5308 8078 2190 -7379 3577 9067 -4107 -5651 8692 6231 -8971 -2421 8539 -1389
1228 -1389 -8197 3080 3517 -8039 -3268 6989 -1279 -9323 2759 8703 -4398 -5481 7468 4171
1242 4171 -5537 1697 7738 -2534 -4911 6092 3695 -7563 -3199 6865 -1249 -9008 1212 4908
1256 4908 -5318 -4039 5433 1375 -5674 2194 7319 -2431 -4847 6916 5562 -6037 -1643 6843
1270 6843 -369 -6101 1709 3404 -5726 -4149 5507 -150 -8892 512 7300 -3097 -5837 5272
1284 5272 4254 -4922 562 7525 -449 -5012 5044 5371 -6358 -3003 6923 -107 -7968 682 4750
1299D750r565n06R937l237q258P845O369r780k357J1025q59j0263M094P735o744
1314A86n579P875J523r392J153R480n748p230P882N205q625j705R229p24p866
1329d336M422O746p082m046Q961M58r534K262P557m788o982O398M238q190j267
1344e183Q746k082p749N829O355p470l233R168P73q832J934Q134n162o572P701
1359B357K786r628N13Q731m021p514N999N732q017k823R346k4q546M197P713o929
1375a28m605Q983J407r412J399P879m000p550O839L968q831j128Q637k073p543
1390f158N311N756o254l237Q001J039p856K048P318m686n485O352K642p679m14
1405c302P038k419p216M631N613o469l351P796P32p246K692O413l808n387O459
$$ plain form
1299 4750 -4815 -5321 4616 1379 -6879 966 7335 -2445 -4802 6223 5364 -4899 -805 6930 186
1314 186 -5393 2482 4005 -5387 -4234 5246 -502 -7732 150 5355 -3270 -4975 4254 3530 -4336
1329 -4336 86 6832 -250 -4296 4665 5123 -4411 -2149 5408 620 -6362 36 4274 -3916 -5183
1344 -5183 3563 1481 -6268 -439 5916 -1554 -4787 4381 5154 -3678 -1744 6390 1228 -5344 2357
1359 2357 5143 -4485 -3972 4759 738 -6776 -777 4955 -3062 -5885 3461 3437 -5109 -912 6801 -128
1375 -128 -4733 4250 5657 -3755 -2356 5523 1523 -6027 812 4780 -4051 -5179 3458 1385 -6158
1390 -6158 -847 4909 -1345 -4582 3419 4458 -3398 -1350 5968 1282 -4203 2149 4791 -2888 -3302
1405 -3302 3736 1317 -5899 -1268 4345 -2124 -5475 2321 3053 -4193 -1501 4912 1104 -4283 2176
1420B176K931o964q99P661j991p568M559M540o558k856O872K01p126K230P002
1435D210m935m933P551K586p421P02P621k990o206N068M287p016k291P631j235
1450B629p882L537O212o144l917P131J118p023J865P166l651n333O076L549p502
1465b169j88P164k162o294M114L764n555k609N968J89p018K369N873m572l954
1480e080O639J772n798M33N823j632m992L991L630n738j907O345j028o223K473
1495a292M634m144l694M977J946n889Q66N281k490m123M821L369n479j099N853
1510C537n68n332K261M136m102l031N033J53n781J150N472l489l930M462K883
1525B854m804r25N307k77m888L391L601n001j482N618p66n205J164M878l143m308
$$ plain form
1420 2176 5107 -1857 -2756 4905 2914 -4654 -95 4445 -2113 -4969 1903 2104 -5022 -2792 4210
1435 4210 -725 -5658 1893 4479 -2942 -2240 5381 2391 -3815 1253 5540 -1476 -3767 3864 2629
1450 2629 -5253 -1716 4496 -1648 -5565 1566 2684 -4339 -2474 4692 1041 -4292 1784 5333 -2169
1465 -2169 -2357 4807 2645 -3649 465 4229 -1326 -3935 2033 2222 -4796 -2427 3446 -1126 -5080
1480 -5080 1559 3331 -2467 -2034 3789 2157 -2835 1156 4786 -952 -2859 3486 2458 -3765 -1292
1495 -1292 3342 -802 -4496 481 2427 -3462 -2596 2685 195 -3928 893 4262 -1217 -2316 3537
1510 3537 2969 -2363 -102 4034 -68 -3099 1934 2087 -3694 -2544 2928 -561 -4491 -29 2854
1525 2854 -1950 -2875 2432 2155 -2733 658 4259 -742 -2224 3394 2628 -2577 -1413 3465 322 -3986
1541c986M531J341n358J000M819k733l554M518L053n050j404N868j59n092K142
1556f4M043m149k275M935l06n748J718N265l961m023M535K669n121l39N269j582
1572H66l705M031K910n340p42N535l93n876J944M651l852l047M253P24n085J280
1588a846M298l089l757M738L027n255q97N671k45n018K641L292l978j430M451
1603B603Q8n704J718M741l386m622M345K454m488o45M526r81l513K905L447m282
1619g94j963N926K86n756J069M992k799m078L969J499m874r6N161k169n165M101
1635f91M551n153k898O235P22n066J492M611l511l047M968J411o284N55O229k769
1651A355n810L770L698m759j494M909o55m559L128M205m831k647O194J517o189
$$ plain form
1541 -3986 545 1886 -3472 -2472 2347 -386 -3940 578 3631 -1419 -2823 3045 2886 -2206 -64
1556 -64 3979 -170 -2445 2490 2184 -3564 -1846 3419 -542 -4565 -30 2639 -2482 -2821 2448 866
1572 866 -2839 1192 4102 -1238 -1980 3555 3162 -2714 -770 3881 29 -3018 1235 1959 -3126 -1846
1588 -1846 2452 -637 -4394 344 3371 -1884 -2781 2890 2645 -2373 268 3560 -418 -1848 2603
1603 2603 2691 -3013 -1295 3446 60 -4562 -217 2237 -2251 -2896 1630 649 -2864 41 3488 -794
1619 -794 -2757 3169 3455 -2301 -1232 3760 961 -3117 852 2351 -2523 -2619 2542 373 -4792 -691
1635 -691 3860 -1293 -4191 2044 2766 -2300 -808 3803 292 -2755 2213 3624 -2660 -2105 4124 1355
1651 1355 -4455 -685 3013 -1746 -3240 1669 1014 -3545 -417 3788 -1043 -3690 2504 4021 -2168
1666b168N42N579k031m208K743K384m502q81N098j791n359L305M539l850l346
1681c946M763K115m583J30M266j651l316L886J968n345n84N173p06n229J491M337
1697B769l060l119L722J154m427J442M487l307l146M346L024m999j408N221M5
1712B744m700J810L272l471k296M724l46m893J163M824k619m219L674K640l597
1727a290q74M290q94l632L469K409m172j178M172L93m538M88L760k365k729L083
1743C92Q59l603P43L413j720l077K950K553k934j681M028L18l193M85K833k083
1759B83j718K735N24l905k52M446j475l482K086K296k717m71K646j3k672J535
1775a54K709k487j680L152J439m105k3L474j675k499J664J439k792k80L099j287
$$ plain form
1666 -2168 -1626 3953 1922 -2286 457 2841 -1661 -2542 2556 765 -4594 -1289 3250 -600 -3946
1681 -3946 817 2932 -1651 -1521 2745 1094 -2222 1664 3632 -1713 -2297 2876 2170 -3059 -1568 2769
1697 2769 -291 -3410 312 1466 -2961 -1519 2968 -339 -3485 861 3885 -1114 -2522 2699 2744
1712 2744 -1956 -146 3126 -345 -2641 2083 1737 -3156 -1993 2831 212 -4007 -333 2307 -1290
1727 -1290 -2164 2126 1232 -2400 1069 3478 -694 -1872 2300 2693 -1845 -1357 2403 38 -2691 392
1743 392 1251 -2352 -1609 1804 84 -2993 -43 2510 -424 -2105 1923 2241 -952 -467 2366 283
1759 283 -1435 1300 1824 -2081 -2333 2113 638 -2844 -758 1538 -1179 -1650 996 983 -1689 -154
1775 -154 2555 68 -1612 1540 2979 -1126 -1149 2325 650 -1849 -185 1254 -1538 -1818 1281 -6
1791fk899K322K975k915j194L216L27k724R29K315k118j587L045J51l464K31L174
1808A778j575k567J901J443j845q02K484m85k171K103J924k488j149K990L63k601
1824f97K68J592n86j768J182Q79j840n08K338p77k030J446J566j313j314K038
1840D76O31j584K86J907r78j251J609N14k519n10K656m66k675J099J941j826j057
1857a747K280J64k472J287K166j934j304K551J101k796j43K638r60k303J878J247
1873A653k736k00K532q17k358J317K105k349j196K973L56k615J138K054j458j504
1889a105K274N68k507K00J999j018k008J565J392k513l82K217m03j915J054J799
1905A217j441r17K096N98j908J07J824r49j383J487P66j665p26J772k00k122Q50
$$ plain form
1791 -6 -2905 -583 2392 -523 -1717 1499 1826 -898 31 2346 228 -1359 1686 1837 -1627 -1396 1778
1808 1778 203 -2364 -463 980 -865 -1667 817 332 -1839 264 2188 -300 -1449 1541 1904 -697
1824 -697 -429 1163 577 -1191 -9 870 -970 -1478 860 83 -1947 -501 1065 -248 -1562 476
1840 476 1107 -477 -191 1716 738 -513 1096 1610 -909 -1419 1237 771 -1904 -805 1136 -690 -1747
1857 -1747 533 697 -1775 -488 1678 -256 -1560 991 2092 -704 -847 1791 831 -1472 406 1653
1873 1653 -1083 -1283 1249 432 -1926 -609 1496 -853 -2049 924 1280 -1335 -197 1857 399 -1105
1889 -1105 1169 1737 -770 -570 1429 411 -1597 -32 1360 -1153 -1535 682 279 -1636 -582 1217
1905 1217 -224 -1141 955 1553 -355 -248 1576 627 -756 731 1497 -168 -894 878 678 -1444 -594
1922e94J598j585j069J588P94j897M99J783o29j420J207J611k007p57K251j34
1938A239k426Q87J596j774j195K038K47k321Q96J455n98j770K268R17k074M8K152
1955A585o06k001J425J284j563j436K189j90k294Q90J938j697j076J538O43j476
1971h47LJ903o92j604J558J111j565m07K034n70j631P83P19q73r70J430K64j899
1989a253K26J567q16j260J398J017j550k52J924J56j848P85J297j270o49J523
2005I95J29k052K05J509q64j323J350J097j798l06J910m76j556J126J292j576
2021c38L5J325K15j662M19J181p82j102N18P25j428J42J546j231o42P88Q25q92
2039c58l67J376J13j140L48J155q97m38J074L9j421K1J287m32j294P09P37j317
$$ plain form
1922 -594 1004 -581 -1650 -62 732 -1165 -666 1117 488 -932 275 1886 -121 -878 1373 1239
1938 1239 -1187 -300 1296 -478 -1673 365 612 -1709 -813 642 44 -1726 542 1459 -615 -567 1585
1955 1585 979 -1022 403 1687 124 -1312 877 687 -1607 -717 1221 -476 -1552 -14 629 -847
1971 -847 -844 1059 367 -1237 321 1432 -133 -540 1494 924 -707 76 795 -78 -1048 382 646 -1253
1989 -1253 -1027 540 -276 -1536 -138 879 -671 -923 1001 1157 -691 94 1391 121 -528 995
2005 995 1124 -928 -723 786 -78 -1401 -51 1046 -752 -1058 852 376 -1180 -54 1238 -338
2021 -338 -303 1022 1237 -425 -6 1175 393 -709 -191 534 -894 -752 794 -437 -1079 -291 534 -358
2039 -358 -725 651 764 -376 -28 1127 230 -208 866 905 -516 -495 792 360 -934 -225 512 -805
2057h05J11R63o2j289Q60P87p24n75J006R53j412K27R61o39p70O94L43j168m1
2076e80J414q44j026K95J431j314m51J443j28q74M61J056q14m56Q86N37j425K42
2094a47J098o59j282J076K74j181j2J425m78r85O61Q14p55p81J423J56j014K95
2112g2R12o50n37P74L6q74k31J290k66j571Q37O63j065n3R76m5q56R83N79q64
2132c4m25Q08Q03j376J5R82l22o84P6N40p12k91J038m32j215Q46J202p87p07P36
2152F1J47j90k65R65k33r95Q88M08q69l03J224p80q02K30Q20m57p82R33M9p93
2172g44O61Q83n80j208J395Q17j378j31J052%j059K57O39r42j68J167l06j535
2190a180M20J224o05p20P63P37j044O4J079m56p45R85M43j155m33J389j88j190
$$ plain form
2057 -805 -694 269 207 -1082 -222 565 -159 -734 272 1225 -187 40 1001 362 -408 286 629 -539 -580
2076 -580 834 -10 -1036 -741 690 -624 -1075 368 240 -634 -173 883 69 -387 499 1036 -389 -147
2094 -147 951 292 -990 86 360 -821 -833 592 114 -871 -210 604 -151 -932 491 647 -367 -72
2112 -72 840 190 -347 427 463 -411 -642 648 382 -1189 -352 311 -754 -807 169 124 -732 251 830 -34
2132 -34 -459 349 1152 -224 -209 773 451 -233 -157 383 -329 -620 418 -14 -1229 -383 819 32 -675 61
2152 61 208 18 -247 718 485 -510 378 786 -83 -386 838 58 -744 -514 306 -151 -933 0 49 -744
2172 -744 -83 800 220 -988 407 1224 -154 -285 767 767 -292 -35 604 -338 -506 661 355 -1180
2190 -1180 -760 464 -141 -861 -98 639 -405 -341 738 282 -463 522 965 -190 -623 766 578 -612
2208f12j43J179l60q16R73J70j335L11J509q39q26J002O62j020j19J068L4j132
2226b94M69N83j034m13R22K04j142k29J447n93q92P94P28q53Q7P60n65k52N30
2245B57M57n94o02Q93K32j168K16P76n80o48N81J13m89%P53k9p87L24P56l88m97
2266d24M82O98r38K83M38m30n09P01J32q72k65J275n23q23K87M96m13j50P87J19
2286C51p46J48J274o17q73J047K94q85k86O32j68o27K36O80p38j28P95k44q29
2305f84M07R43m91n69O21K50p11K52O64m90l78N66K12r01j32R11m47m93j70Q08
2325A68o6q24N88L36p91O05Q65n84o84M80L04m25j7L54P3m62n3Rm09QM09L94q66
2348e88M71M23j89n83K91N92k61k81N23j57o54O52L79q37k60O43K26q88J43L54
$$ plain form
2208 -612 -755 424 64 -752 221 391 -944 -633 876 37 -789 213 875 -145 -264 804 838 -294
2226 -294 175 758 -276 -689 233 437 -705 -934 513 -80 -972 -178 550 -303 -216 544 -21 -273 257
2245 257 714 120 -482 411 643 -525 -309 467 -113 -761 -180 -67 -556 -556 197 168 -619 -295 461 73 -424
2266 -424 58 756 -182 101 539 109 -400 301 433 -439 -704 571 48 -775 -488 8 -405 -555 232 351
2286 351 -395 -247 1027 410 -463 584 878 -7 -293 339 171 -456 -220 460 -278 -406 389 145 -684
2305 -684 -277 666 175 -394 227 477 -234 18 682 192 -186 380 592 -309 -441 470 23 -470 -640 168
2325 168 102 -722 -134 202 -589 16 881 297 -387 93 397 -28 -45 309 382 -80 -133 -124 -533 -525 -116 278 -588
2348 -588 -117 306 117 -466 -175 417 156 -125 398 241 -413 239 618 -219 -479 164 390 -498 -355 -1
2368al32k75P96j38p85M81N88j34o70P91R1q0m08O06j42n60M33L5n36k39O75l2
2390A64o34Q2N32k57l2K82K02m02r3L97Q6m05J75L27j73m19N13l41m09Q2K58J65
2412A00m55l4L10l11Q5M88m7l16Q5M48k01k21M22m4l24J03J62j33m28M89q5k56
2434a63j98L75N4p05P79J15o66O3P94p4m73J62K57K4o70J168j91j021J74M92l36
2455d0n46L67L40l93K3J56J03n97Q73K3j83J26N0N9l75J78O2k62k99N05Q3n12
2477b59J07L54j59l14O3O58o30K7M3J75m34O03j7L2k82JK51m78K76L51k52m49
2499c33L83K72n75p1M84k15j63n7M68J17o28M75Q2j26l46N72m53j49K77K37m06
2520a55m5K20k9k16pK67k62k78N53J28m24J20K74K06n87P99j70l73j99M64m55
$$ plain form
2368 -1 -333 -608 188 50 -735 -254 334 200 -470 321 412 332 -76 530 388 -172 261 296 -240 -479 196 164
2390 164 -470 -388 144 -113 -145 137 339 -63 -156 241 327 -78 97 424 251 -168 345 4 -405 -323 -65 100
2412 100 -355 -389 -79 -390 -305 183 136 -180 -95 353 152 -69 353 309 -15 88 250 117 -311 178 93 -163
2434 -163 -361 14 68 -637 142 257 -409 -346 448 374 -99 63 320 344 -326 842 651 -370 -196 296 -40
2455 -40 -586 -219 121 -272 -249 -93 10 -587 286 309 126 252 302 361 -14 164 226 -36 -335 170 253 -259
2477 -259 -152 202 43 -271 -208 450 -180 -153 -110 65 -369 234 217 249 -33 -32 219 -259 17 368 116 -333
2499 -333 50 322 -253 -324 160 -55 -218 -275 193 310 -318 157 239 113 -233 339 -114 -263 14 251 -155
2520 -155 -200 20 -9 -225 -232 35 -227 -505 48 176 -248 -128 146 352 -235 564 394 21 -178 286 -169
2541a69M5J51J49k47k69M18l66J89NO8k6J10K53k78l06L47K30q8j63J66J4k82
2563d9k43L20o8J07l01K70m60L04J43M1j27Q6L18l41m2M3M23l91R3J74L5m85J00
2586e0M19l43o5%K07m50K74m3K63n06M08J13l22L55j01j9k85K59J10m12J26j14
2608a76O61o19L8K03l77j29J27K63j65p7L86Q8m67K27P3Q1l19M78k14j83L94j73
2630A20r4K7j99J40l62J79J23p8m7J85L87m79n2J20k1Q7o1O07l36m62M66j50j04
2653dJ16j13l7qn8k4J52l81N14k91k00L19K76k49o3L69q2m70L68J1j62r2N51k02
2677B40o24J68L81k44jp9Q3k08M6L19P0Q3m65N26J28k53l27M12j34k50K14m83
2699c98J62J85J84n37K17J47l7L16l35K41o6j51R6R3k18K00J6k6l05K15O18p84
$$ plain form
2541 -169 -124 27 176 -71 -340 78 -288 -99 -94 -26 -52 58 311 33 -273 74 304 216 53 219 233 -49
2563 -49 -292 28 -40 67 -234 36 -424 -120 23 64 -63 23 341 0 -42 1 424 33 126 300 335 -150 -50
2586 -50 369 26 -39 -39 168 -282 -8 -51 212 -294 114 227 -95 260 159 140 -145 114 224 -188 -62 -176
2608 -176 485 -134 -96 107 -270 -399 -272 -9 -174 -251 135 223 -244 -17 56 137 -182 296 82 -101 293 120
2630 120 26 53 -146 -6 -368 -189 -66 -144 -191 -6 381 -98 -150 -30 -51 36 -25 582 246 -216 250 100 -4
2653 -4 112 -1 -38 -46 -104 -128 24 -357 157 -134 -334 -15 261 12 -51 318 236 -234 134 145 -17 -109 442 240
2677 240 -384 -216 165 -79 -80 -159 -76 -284 -238 81 151 234 -231 295 423 170 -157 255 121 -129 85 -398
2699 -398 -236 -51 133 -404 -187 -40 -77 239 -96 145 79 -72 24 117 -101 99 115 89 -216 -1 617 -167
2721a67j06L27j93l04M76K95m79K53o0K29m13P6L97l84lJ31O4J21l99M03j23m25
2743b84M73j85o0j91M23n3k41QL61l27L99k38k01J21K24q0k05O3r9K40m6k01m
2766a03J23j51o2K16n9j34K37j86m2%MM45m36J23Q0J07k01J69k16j02N2L46Nn31
2790c16L9L54k11j69L17l3k8j3J79j74J10K6l5l13M77P1k58j36Q3N0L9k2j19k44
2814c26P1J52R7j94R8K13J68k27n4J84j01JJ37j55l51J8K80Rj93J59J1j5m4l9
2838a01j40K40j67Q7J79L9J6m3l34M15j09J86k09j4K34l50k74N12j39J1K13Ol49
2861i1n1l8J01K7J40p0P6j12K22m1j55j3K66Nm42J74j90Q0j69K60R2J07l00K75
2885A53j58n5L88l67k15M12j08p6Q6l1J44k45J56o0O4J14l34n6L93j13j56J55
$$ plain form
2721 -167 -273 54 -139 -443 33 328 -151 102 42 271 -142 -66 331 -53 -56 75 139 260 -139 264 141 -284
2743 -284 189 4 -56 -247 176 123 -118 -110 251 -76 323 85 -116 5 229 149 -56 7 -92 148 102 -99 -103
2766 -103 20 -131 -193 23 -36 -170 67 -119 -161 -161 -157 288 -148 -25 55 162 -39 130 -86 -188 -136 210 215 -316
2790 -316 -277 77 -134 -303 14 -19 -47 -60 119 -55 55 81 46 -267 210 281 23 -113 -30 20 59 37 -82 -326
2814 -326 -255 -103 -6 -200 -102 111 279 52 -2 182 81 82 219 64 -287 -269 11 20 -173 -14 -3 -18 -62 -101
2838 -101 -241 -1 -168 -81 98 137 153 110 -224 191 82 268 59 45 279 -71 -345 167 28 39 252 258 -91
2861 -91 -142 -180 -79 -52 88 18 94 -18 204 163 8 -5 261 266 -176 -2 -192 -112 -281 -21 71 178 -122 153
2885 153 -5 -60 328 -39 -254 158 50 -26 60 29 173 -72 84 24 88 202 -132 -188 205 92 -64 91
2907I1j49jK14k19Q7J27qn9l39M55j08r3o1R3j59p2P8J97j47J17k4o3k6o7K51
2932A15k45R6K6N3k53L22L5L8k05J81k17q4K04l45K20n0J85m9q8K1J38l59q2N45
2956B02j00K1K38l46N8k45P2L01l57J98k6j01r3o0J56j22J76K25l9k40k3K80o4
2979A11j38q1r3K73l9o4m0Q5p9K2J92j80p3lj23q9J92K97j62K5j31n0K23m8O3
3004I0l02M83j5l03K7K50k87n7J00K6J03o89P42j97J30r6P1J36l4N1J99k03j56
3027F9j03Q2l98L21J89m29J58N2N1l8kL7J06j90K9Q8Q4r8p8P1L0j72n7K28n8p
3053c5k4j37R1l4K79j37K4l51L39j9J99l0n4p6j0P5R7K2l87J3k18L29J9J82k23
3078f6K14j35J31j78nj81J20K49r9P9j9j26pOJ12q0j74J11J73l12K26k7j29J53
$$ plain form
2907 91 -58 -59 155 -64 23 150 142 83 -256 199 91 -2 -63 30 -129 -201 -123 74 -73 44 20 -43 -69 -136 115
2932 115 -130 -34 -8 45 -208 114 149 187 -18 163 -54 -138 66 -279 -59 -109 76 27 -61 -40 98 -261 -343 202
2956 202 102 123 361 15 73 -172 -100 201 -156 42 16 -85 -178 -238 -82 -204 -28 197 158 -82 -105 175 111
2979 111 -27 -108 -201 72 33 -31 -71 14 -65 -43 149 -31 -104 -107 -230 -319 -127 170 8 33 -98 -148 75 27 90
3004 90 -212 271 256 -47 -20 230 -57 -114 -14 12 115 -574 168 -29 101 5 76 212 178 229 428 225 69
3027 69 -34 48 -350 -29 160 -269 -111 -59 -8 -46 -48 -11 95 -95 -66 22 106 8 -70 1 31 -141 -198 30 -28 -35
3053 -35 -59 -196 -105 -139 140 3 27 -324 15 -4 195 165 111 35 25 100 197 219 -168 -155 -373 -44 -25 157 -66
3078 -66 148 13 144 -34 -39 -220 -100 149 50 129 110 -16 -23 -17 95 15 -159 -48 125 -187 39 12 -117 36
3102C6r7L87l07M4k1K3k60K19O7j82p0L82L22o27Q5j85K49j74K40r4l1l8m3j75
3126b50J75o6J05L6J87k37r1p4M7k4J89K7k54M10q9K0l13K85o7J90l3q1m1j13
3150f2M5k22L31o9J52k19N6J23j49K02j40J27l6j40j08K76P6l14n0m1nQ7P7l30
3174c33R7L78j73J40o5J7j28M3J15k01Q8Q1l96K67q9K66k0r4l0K2L0r8l1p3M00
3199B13m3j97j19K87j49J67l71N13j91R0L6o32L74l5j9J92Q3l6k10J32j63J00
3221B2j70K59r9j67J82k12L94k10lK17l14J43O6l60J52J20j73L3L79k79J59k50
3243a11K05J4n1p6R0j7j15p6J59j49J03J29p7k00J4K60Kk50k5K87m06K72k41M70
3267B11k69K89m25K19K42l17M02m95J53J81M8k34J8jj64O8J46l36K03OJ27%P6
$$ plain form
3102 36 -61 326 19 63 42 65 -195 24 91 -91 -161 221 543 -84 1 -184 65 -109 131 37 6 -32 -75 -250
3126 -250 -75 -141 -36 0 187 -50 -141 -215 -168 -192 -3 24 -230 180 91 111 -202 83 16 206 173 92 51 -62
3150 -62 -17 -239 92 23 175 -44 12 135 -14 188 48 175 139 -1 -109 167 243 -71 -121 -162 -167 -80 -3 -333
3174 -333 -236 142 -31 109 44 61 -67 -24 91 -110 -22 59 -337 -70 -159 107 87 -7 -37 -15 15 -83 -114 -187 213
3199 213 170 -27 -146 141 -8 159 -212 301 110 200 236 -396 -22 -57 -76 116 199 163 -47 85 -78 22
3221 22 -148 111 12 -155 27 -185 209 -1 -4 213 -101 42 108 -252 -100 20 -153 -120 259 -20 139 -111
3243 -111 94 108 57 -19 71 54 -61 -137 22 -127 -24 105 28 -172 -158 102 104 -146 -171 116 -290 -18 -259 211
3267 211 -58 231 -194 25 267 -50 352 -143 10 191 239 5 23 22 -142 -74 72 -264 -61 -55 72 72 148
3290A48k37J60k25j62M48m0P1l23K96k35J5J4p9K55o6k15J00M13k64j45J4K53
3312A96m05J85r9K97J0j82m6j0j80J66Q6J26q4k07J35o6L73m11k63M16k08K98
3334A27j90K42j58r1j11K14L4k9m64L40r8J45J59J04r3k23J5J84N3j70N3j46K83
3357A80j30K50k99r7L23m88J48N02m44L0j93K55k4J48j16j76J78J88j30R0m52
3378b57L86k89J73J5k80K60q8p0Q8J12k15l6K98o8k51M9J81R5L0K47n88J31pL28
3402B44k23R8k21M2J07j92l6L40j18r3J61N6o5k36L7R5L07n51L90l05J57O3j58
3425a01p2Q9Nk72K00K14K9l27L05k53K16j16J67j78o5L94k32m4J30j97k0J77J53
3448B02k25r2P6L00k94N3r5N8J52k83R9K0nq8j6j26K31J13l26J70j8j73K86j30
$$ plain form
3290 148 -89 71 -154 -316 132 92 163 -160 136 -99 -84 -70 -149 106 40 -175 -75 338 74 -71 -57 196
3312 196 -209 -24 -123 174 184 2 -44 -54 -234 -68 18 144 60 -147 -12 -78 295 -116 -379 37 -171 127
3334 127 -63 179 21 -70 -181 33 67 38 -426 -86 -184 -39 120 224 131 -92 -77 107 160 -10 43 -103 180
3357 180 50 300 1 -96 227 -261 -113 389 -55 -25 -218 37 13 161 45 -131 47 235 105 195 -257
3378 -257 129 -160 13 28 -252 8 -80 -150 -62 50 -165 -201 97 29 -222 -173 8 103 133 380 -208 -77 -84 244
3402 244 21 119 -102 -60 47 -145 -181 159 41 -52 109 165 100 -136 -99 -4 303 -248 142 -163 -6 57 -101
3425 -101 -173 -84 -79 -351 -151 63 92 -235 70 -183 33 -83 84 -94 -159 235 3 -41 89 -108 -128 49 202
3448 202 -23 -115 -39 261 -33 20 -75 -17 135 -148 -49 -29 -34 -122 -138 -264 -33 80 -246 -76 -94 -267 19 -111
3472a11K7L30l00J06M6j93K58j82l6N2q4K48j80n9J79J41k71k3J05L3L4n9J9j2
3496F8q7l95L69K22k28Q9j26J05j52m7J44L9o1J9J92k29K8n1LJ27j4J44k75n8
3520a74J97l1J39k82J74j13q4J36j3J43j58L8l43M27j8K2n0r9J49m2n8J94j70
3543a6J57k17N8R6l14L49j40r6K1J31l39M58k95L32j19k51J20j67M18m77L65r
3565F5k47K86M1j60L2Q4k24K32k87j46L38OJ24k08K19K42l95J65l45P9K26l4j47
3588e4K13O5r8j19j09J54q4M6k09K85k17K7J81q9J29k6pl02N5J51j25J11O1q8
3612d9J00J5j51M76j48k64K03j74K3j62J61j26K6J30k10J91j96K26j52q6K54q2
3634Ek61L35j78K67j05k8o4K07l34L03l30J15J2J75n0k23K33m1k19K07n5J15j17
$$ plain form
3472 -111 -84 246 -54 52 98 -95 163 -19 -55 -3 -87 161 -19 -78 101 242 -29 -52 53 86 120 61 80 68
3496 68 -19 -414 -45 177 -51 38 -88 17 -135 -182 -38 1 -60 -41 151 -78 -50 -101 -98 29 15 159 -116 -174
3520 -174 23 -8 131 -151 23 -90 -174 -38 -51 92 -66 -28 -371 56 38 60 10 -89 60 18 -40 154 -16
3543 -16 141 -76 -18 78 -236 113 -27 -123 -102 29 -310 148 -147 185 66 -185 -65 -232 186 -291 74 65
3565 65 -182 104 145 -15 17 101 -123 109 -178 -324 14 20 144 -64 155 397 2 167 -178 -99 127 93 -54
3588 -54 159 224 126 7 -102 52 -32 14 -195 90 -127 -100 81 -8 121 95 88 -214 -159 -8 -133 -22 39 -49
3612 -49 51 66 -85 391 243 -21 182 8 31 -131 30 -96 -70 60 -150 41 -155 71 -81 -167 87 5
3634 5 -256 79 -99 168 63 35 -29 178 -156 147 -183 -68 -56 119 69 -154 79 38 -181 26 -29 86 -31
3657c1K08k29O7r0k5J02O8j18M8N4m2j95J69j06K33m6k15K04j10m43O11q5k03
3680a74J78l08K71K79p8l40K96J3l14O4K09o8J07n2j7j05P3j0l1m8J00K37l22
3703d0M5K24k24J28J80m21K80j76P3M4k14mK8K0J59N9m3j74j57L50J3j08J5L9
3727I6j37n7J71R9l28L92l36K36l23L39j94j58J2N32k54j26O7k89M29j48k13J41
3749d9J11l3M7j29K73k71J94o0r8r0l3P7M1k9j59L9J52O6j85J06l4MJ73M7l00
3774a40MJ50j83K11M2l3j61M49m34J58l85M32Q8q8l25R1j11N09m40j11K62J3K8
3797B6k32L05L3p0j09l2L26l00j97K10o0J00j53K69rM3l61P2M34k07K32n03M55
3820B72l81N24l53J86K01n13J23L0R0k29n7J3P0k91K83N3J26r1k25O6O8j63K40
$$ plain form
3657 -31 177 -52 15 -75 -100 2 70 -48 0 54 12 -183 -14 -120 113 67 -148 56 -54 -497 114 29 -174
3680 -174 4 -304 -33 246 168 -172 124 137 -177 -113 96 28 135 83 66 -39 34 24 -7 -55 45 282 -40
3703 -40 5 229 5 133 313 -108 172 -4 69 113 -101 -105 -77 -57 102 161 118 -56 -213 137 150 42 57 96
3727 96 -41 -98 73 172 -156 236 -100 136 -187 152 -42 -200 -188 344 90 -36 31 -258 171 23 -190 -49
3749 -49 62 29 76 -53 220 -51 143 83 -15 -105 -138 -61 -20 -49 -208 -169 -17 49 -136 -30 -64 -60 113 160 -140
3774 -140 -136 14 -169 42 84 51 -110 339 -95 63 -322 110 198 110 -215 -124 -235 274 -166 -277 -15 -2 26
3797 26 -206 99 132 62 -47 -79 247 -53 -250 -40 -100 0 -153 116 107 150 -211 -139 295 88 320 -183 272
3820 272 -109 415 62 248 449 -64 59 89 179 -50 -107 -94 -24 -315 -32 21 147 56 -169 -103 -35 -198 42
3843D2M2m23K30l3K00J99l88J07J87k23kJ82J15m31O8p9K45j9k5n3K68j26o2j34
3867a13M0p3J15r9j01J59j31J2L18p7m3r8J87j03J6K8j5j76J61jN1k27J64J32
3891A26N8q8k79J80R5l6k18n5K11j67J68K06k62L36m99J31K14P8j6l01J10n5K57
3914A94j83q4O9J28k17K0P4j82P1K97j38O0r7J42n02J44K47p8l2m4J99J39jm53
3938b27N59m12l1M10l23L46m25M0J78k16J54j48L32j66j24j17J68J06j36K54j25
3959I7L4M0J37l38J57k39J24J48q5L90n73J63k46O2lJ57pQ0pk7k01J20n6PJ20
3984E4j05L6L90k73k50L04j71M3l05o2L03K34l12L35k30k7j52J52J18p7j15L14
4006B04k97PK64j02j23K06K8l48qL95k85mK02j84O4k11j11N7K83j85O6J58P2P5
$$ plain form
3843 42 84 -339 -109 -142 58 257 -131 -24 163 -60 -62 120 235 -196 -128 -207 38 19 -6 -59 209 83 21 -113
3867 -113 -73 -146 -31 -130 -231 -72 -203 -191 127 50 7 -91 96 -7 9 37 22 -154 7 6 57 -170 -6 126
3891 126 184 96 -183 -3 92 56 -162 -217 -6 -173 -5 201 -61 275 -224 -93 121 199 183 -118 -8 -63 194
3914 194 11 -73 -4 124 -93 -73 1 -181 -110 187 49 109 12 154 -348 -204 43 -35 -67 -111 88 227 226 -227
3938 -227 332 -80 -111 299 -24 322 -103 -63 115 -101 53 -95 237 71 -53 -170 -2 104 -32 222 97
3959 97 131 171 308 -30 127 -112 12 160 75 465 -108 55 -191 -129 -132 25 18 98 91 64 -137 -17 -73 -66 54
3984 54 -51 -15 375 102 -148 156 -15 28 -277 -339 -36 198 -114 221 -9 -36 -188 -36 82 5 -110 204
4006 204 -93 -86 178 76 -47 159 187 -161 -169 226 -59 -63 139 -45 19 -192 -303 -246 37 -148 -82 76 148 223
4030B23n7m4l72M76r3k25J77l48J72K02o8n7L19j28l19j28L62j77j05K38L3L1
4052A12j41J3rn9n5K74j81R9q9j88R4K40o4J30j39J47l08m7N6K89km6J1j59L12
4077B90l68K15j21O4j58J04j28J10l24M44l2J17j36j32m4J15J27o0J58j25n3O8
4099A31P3l39K98k60ML48j36j18j0O0RJ70k87J11m5r0j09K82J91n40L81j45k96
4122c17L98J01r8J5n6n9kJ66M4j83n9J79k49O2M6k17K00J13K70m20m7J14J44l62
4146b17L42l4k01J3N5M8k00K30p9N4j85J19o1J60j02J33q9j55K63k50J38J3k82
4169b87M60j28m29L81J38k6M8m0l02rK9J7QR5K72n4k06J05m4J43j47k73J26J89
4193F6k20P0J65o2p0N5J2P3m6j42J31L5K46j22n2N1j60R2k33J84JJ5k25J57L46
$$ plain form
4030 223 166 122 -250 226 133 -92 85 -263 -91 111 43 -14 305 177 -142 -270 92 -85 -190 48 81 112
4052 112 -29 -16 -25 -84 -139 135 -46 53 -36 -224 -130 110 46 176 37 184 -124 -171 -115 174 172 126 137 -22 290
4077 290 -78 137 16 80 -78 26 -102 8 -316 128 96 213 77 -55 -99 16 143 83 241 116 63 131
4099 131 204 -135 163 -97 -93 255 119 1 -9 51 60 230 -57 54 9 -81 -190 92 283 -257 124 -21 -317
4122 -317 81 182 84 99 43 -16 -18 148 192 9 -50 129 -120 -58 -12 -229 -29 84 354 -66 -113 1 145 -217
4146 -217 125 91 -110 -97 -42 6 -194 36 -43 11 -174 -55 -116 44 -58 75 -14 -169 94 -156 -18 -5 -287
4169 -287 173 45 -384 -3 135 109 157 117 -185 -194 -165 -148 -140 -45 227 173 -33 72 28 171 24 -249 -123 66
4193 66 -154 -84 81 19 -51 4 16 89 43 -99 32 67 313 191 139 190 30 122 -111 73 74 89 -136 21 367
4218C67r3m31j12M36j99P1J59k10J90k20J85m54K93j09O2R6m7j23o4K66K06j0
4240B59l10M09k07k53j06L34Q5m8l01L96j69k69P0J19j58N14m46J95Q4k02j84
4261a88o0K21J95Ok83K63j04L7j92J57l5L23k26j30k09L49j36N7j33o8J04j08
4283a60N2K32k7K2l05J67j98K52J80l34P6j27L73M1l38O3j99K70j05K68J01m2
4305B62j98Q8J3j09j22JK23K36k98l29L48p2Qn2k6j5K08k05J72N7k79j7N1J23
4329F8Nj59n3J21P4m62L68J96o2oK27k77J71m4J07n61J91K16j01O3l94L78Q9j95
4353d0J5j11M0J49o1J59o5k74K85j29K50k82l28N87k63K37k13j16J97j35K49l00
4375a49K57O8l1o3j5r2K1J97j73j85J07L49l22J60l01o2J86j13P8K36j65k23J07
$$ plain form
4218 367 274 -157 -269 167 -32 39 198 -12 178 -42 143 -311 -18 -127 -65 31 -16 -139 -203 63 269 259
4240 259 -51 358 151 -102 -208 126 211 163 -138 258 89 -180 -110 9 -149 365 -81 114 198 -4 -188
4261 -188 -248 -27 168 174 -109 154 50 87 -105 52 17 340 114 -16 -225 124 -12 45 -88 -156 -52 -160
4283 -160 -108 124 97 119 -186 -19 -217 35 215 -119 -43 -170 203 244 -94 -31 -230 40 -65 203 304 262
4305 262 64 152 165 56 -66 -65 158 394 96 -233 115 43 51 -1 -27 -42 166 -39 133 190 -89 -106 -55 68
4329 68 73 -86 -139 -18 56 -406 -38 158 96 90 317 40 211 167 274 -287 -96 120 19 82 -312 66 155 -40
4353 -40 -25 -136 -96 53 -8 151 86 -188 97 -32 218 -64 -392 195 -68 169 -44 -160 37 -98 151 -149
4375 -149 108 176 145 82 67 -25 -4 193 20 -165 -58 291 -31 129 -172 -234 -48 -161 -83 153 -12 -235 -128
4398a28K85k54K20P4M1m78K46K9n9O8J70k79J48K11n68K77J8R4k32m2L69j57o
4421D7j16K93j58L53m98K02J2p0k2r6m9K39k31J73j24M9J08O6j77L1k2k72K04
4444e8k9J62J0J61j47%l0n7p0M8N0k62K53p2L3nl14M87l64K84q6J60j67J3r1k7
4470a18J99j8L6pn8K3r1M4J77n24M58k08K77m46K20M4j45J82j52k2Q4r9p1Q1N1
4495h3m6L01k76K72k82L50p0p5j68PP9n0o2j4J7O7L5J31j80l16L49N0m8j58Q8
4520h2K6M39k32k05m0J25P1k19R7q2O6l4JJ18j1k17K16j34K75j92n6k5K08M6l50
4545a91J94j98n0Q2LK67N1l70M81k64J62k0l20K07j44J34OK50l63L3K05K7j59
4568B3L1j07q5p9J74N8L48l28n0k1j83J90j07L4K42k27L55j20k00K35o61O10n4
$$ plain form
4398 -128 157 -97 123 197 238 -240 6 35 -24 44 214 -65 83 294 -274 3 21 115 -117 -159 210 53 47
4421 47 -69 224 66 419 -79 123 135 65 43 -53 -102 137 -94 79 -45 4 112 178 1 32 10 -262 -58
4444 -58 -87 75 85 246 99 99 69 12 -58 -10 40 -222 31 -41 -8 -13 -327 160 -204 80 -6 154 -13 0 -91 -118
4470 -118 81 63 99 92 34 57 -34 10 187 -337 121 -87 190 -256 -36 8 -137 45 -107 -129 -45 -144 -215 -134 -83
4495 -83 -129 172 -104 168 -114 236 166 91 -77 -70 9 -41 -103 -117 -100 -33 2 133 -47 -363 -14 36 -12 -170 -82
4520 -82 -56 383 151 -54 -94 31 102 -117 -20 -102 -36 -70 -69 49 38 -179 37 -97 178 -14 -70 -95 113 159 -191
4545 -191 3 -195 -245 -163 -160 107 158 -212 269 5 167 147 -173 34 -110 24 30 280 -83 -50 155 182 23
4568 23 54 -53 -138 -217 -43 15 363 35 -15 -36 -219 -29 -136 -102 140 -87 268 148 -52 183 -478 132 78
4591G8j59k6kJ26P6p9l19L84j25J63l00M54l56P2j07M7L35k77j01L03k25p2K43
4614A33j0J64l32k1K8l9Q6P7j2lk2K17j89j78L0N1l05L06j46j48M45j23k12K4
4638a79K3O8J0l2J2K77j4j22J45l14J12J10j79J86J21j94m22K95j03O0k4J18K5
4661b1L53m44k0j55J81lJ67J18J3j96k06L29o9n4l40J45J92J24m7l9n5K5o5J42
4685G5j54P0j53K31N8J2j23O3l17L74k86M4j13R2J09J66p0k75J14j54K31J72k29
4708f3J20m6q0K04n5j94P1K7J58J05L0j35r6k01M6J46k43L68l3l09K79L6k89J19
4732c5J99l36K58j40J79k85mJ5L2J35j5M7k90J28N8l11M88j07j54J89k21K95k48
4755a23J74j04R7j6O4k04j37J99p0K12l43J40J83n3J13n4J61k34j22K48j37K7
$$ plain form
4591 78 -81 -107 -109 17 93 14 -305 79 -46 117 -183 271 -85 -13 -120 -73 262 -15 -116 187 -38 -110 133
4614 133 123 287 -45 -66 -38 -77 9 86 74 71 49 266 77 -101 -71 -20 -325 -19 -165 -313 132 9 -203 -179
4638 -179 -156 -88 -78 -110 -98 179 165 43 188 -126 -14 96 -83 103 224 30 -392 -97 -200 -140 -164 -46 -21
4661 -21 332 -112 -132 -287 -106 -109 58 176 189 -7 -213 116 47 -7 -347 -202 -10 114 67 28 -27 -2 -67 75
4685 75 -79 -9 -162 69 127 139 16 79 -238 136 -150 -106 -219 -127 -18 148 78 -197 -83 -237 -6 166 -63
4708 -63 57 11 -69 135 80 -114 -43 -16 142 247 277 142 46 -155 -109 37 -206 162 129 -180 99 135 -154 -35
4732 -35 164 -172 86 -54 125 -160 -164 -149 -117 18 3 50 -240 -112 -54 -365 123 16 -138 51 -170 125 -123
4755 -123 51 -53 44 28 92 -112 -249 -50 -120 92 -251 -111 72 19 132 78 239 5 -117 131 -6 21
4777B1J11R1j18j16J40k47J44j58K82k23P8J5J45k36j18K92m38M36R7J9m11J86
4799hj42L86l08K48k84L56m22L5L51J10l91K68k08O6J93j00j66J41R6k63M6p2
4821f8Q1K91m39j29P6K62L0Pk22J60l14M63q8l03Q3J65m5k02m7K05K55j55J95
4844B61k86K59l21Q6j07J35J38l6j6k07Q1l0O1q6J40k2q3L8j03K22j80M3O6k93
4868b40K50M0K39k59m2j29L21N4k25k3K94j83o5P2j55QM75l87k16L97l82J63m43
4891d36K45K91J95m33j39K82j79lL03k09J27q4O0K94k11j03J14j52R7j20L90j73
4913A56k16J97j04m1lP2k5j38K64m03J86n1J71l06K17j1J4K9j24K41M6j20r4j17
4937a60K92j50l9r7K24J66k93J24j5n6k3k39K73j5N9J0k68J64J54k14K73K7k97
$$ plain form
4777 21 132 223 105 -11 129 -118 26 -132 150 -73 5 20 165 -71 -189 103 -335 101 198 217 -194 -8
4799 -8 -150 236 -72 176 -108 248 -174 -139 212 322 -69 199 -9 57 250 150 -16 125 221 -42 4 -68
4821 -68 13 304 -135 -264 -188 74 104 111 -111 49 -265 198 110 -193 -110 55 10 -192 -239 -34 221 66 261
4844 261 -25 234 -87 -1 -108 27 165 129 113 -94 -13 -43 18 -68 72 50 -33 5 -98 124 -56 -13 53 -240
4868 -240 10 50 289 30 -12 -141 180 234 9 -14 280 97 32 104 -51 -43 432 45 -171 226 -156 7 -436
4891 -436 -191 100 295 -138 -277 5 -174 -177 126 -83 44 -40 20 314 103 0 114 -38 59 -61 329 156
4913 156 -60 137 33 -8 -11 61 36 -102 162 -241 -55 -106 65 -241 -24 -35 -21 8 -116 125 171 51 -43 -160
4937 -160 132 -18 -57 -154 70 236 -57 67 52 -4 -27 -266 7 -8 51 61 -207 -43 111 -103 170 197 -100
4960a00j93K36M9P3J43k01K6j19J92j71j0J63K9k09P5j06KlJ21j26K52j87jJ1
4984e4j67L40j93k96K55J95J29k27K87l95N1J16N3p7j50j56L76k8j58J7j84K52
5006a4J6o7J51N2m94K26J59m5r0q5K35n4J9R1k25K49j35o4K80K8r6k70J38m2o6
5031a03j03L72j29n3J06j63J69j45K62n2mJ15j55k89L35j56n5K05p0QJ12m7k49
5054h9r0L81O0j32Ok89k0J45j16K07P3j60J99m15J62N8R1K22m83J79J00l46J32
5077a25O4m6L73l74k27M15J3q8K45j59M3j22l55M16Q4l16L85k21j03n6R5m4j40
5100b43K50j79J79k5J10k3q0o4J70J16j85r5K2j48Q4K82k15k22J66Q2k26L47j86
5123h3Q5R4j00J10j13j04L2l8J51p4j04K4j74M41l81M20j59qj25p6K60k22N2J92
$$ plain form
4960 -100 -293 -57 -8 65 208 7 33 -86 106 -65 -75 88 117 -92 -17 -123 -121 -124 -3 -129 123 -64 -65 -54
4984 -54 -221 119 -74 -370 -115 80 209 -18 269 -126 -75 41 94 17 -133 -289 87 59 -99 -82 -266 -14
5006 -14 2 -65 86 138 -356 -130 29 -16 -106 -191 44 -10 9 100 -125 124 -11 -75 205 233 137 -133 5 -37 -103
5031 -103 -206 166 37 -16 90 -73 96 -49 213 161 157 272 117 -172 163 7 -48 157 87 95 207 160 -89
5054 -89 -179 202 262 130 136 -153 -173 -28 -144 63 136 -24 175 -240 -78 -20 71 293 -190 -11 89 -257 -125
5077 -125 -61 -107 266 -108 -335 80 93 5 250 91 134 12 -343 73 157 -159 226 5 -98 -154 -59 -103 -243
5100 -243 7 -172 7 -18 92 69 -11 -75 95 211 26 -69 -47 -195 -111 171 -44 -266 -100 -18 -244 103 -83
5123 -83 2 96 -4 106 -7 -111 -79 -117 34 -40 -144 -120 -294 147 -234 186 27 19 -106 -182 78 -144 -92 100
5147A00J2j51R8Q0P2k68J42M1j16nj80J73j65K4J22K02k41L3K9j05J26k1k5K24
5171B01j65j70J26m0k1K43l51J03j1k3J08j1L1l09M8K87k04Q8Q4p0Q7K47r4j76
5195HL30l20l4j63L00K04l49Ln1K81l55J89K12k41O3j38j4Pk29J14L85j02l33
5218b33K78j66j53J38L2J72N8k17k25N10j42M0j08k3qQ4j02M9N4l65M16j9j92
5241a22k1m1J59J10j49J30R4p1J60k45K01k79j1K35J74l04j72L75q1j69N2q0J24
$$ plain form
5147 100 112 -39 59 139 211 -57 85 126 10 5 -175 -2 -167 -143 -21 181 -60 -27 2 -103 23 2 -23 201
5171 201 36 -134 -8 -48 -69 174 -177 -74 -85 -108 0 -11 20 -289 -241 46 -158 -70 14 -56 31 278 184 8
5195 8 338 18 -16 -179 121 325 -24 -21 -72 209 -146 43 255 14 77 -61 -75 -68 -297 -183 202 100 -233
5218 -233 45 -121 -274 -136 -104 68 126 -91 -316 194 52 92 -16 -39 -47 37 -65 -16 38 -327 89 70 -122
5241 -122 -143 -184 -25 85 -64 66 160 89 249 4 205 -74 -85 150 324 20 -152 223 142 -27 25 -55 69
$$ [...]
8191b37
##END NTUPLES=NMR FID
##END=
