##TITLE=1H_Pr 5291-K
 200.13Hz, CDCl3.
 8 sc
 
 13.4.2026
##JCAMPDX= 6.0         $$ Bruker NMR JCAMP-DX V2.0
##DATA TYPE= NMR FID
##DATA CLASS= NTUPLES
##ORIGIN= UXNMR, Bruker Analytische Messtechnik GmbH
##OWNER= pz
$$ XWIN-NMR		Version 3.5
$$ Mon Apr 13 14:07:29 2026 Russian Standard Time (UT+4h)  she@DPX200
##.OBSERVE FREQUENCY= 200.1313
##.OBSERVE NUCLEUS= ^1H
##.DELAY= (6, 6)
##.ACQUISITION MODE= SIMULTANEOUS
##.ACQUISITION SCHEME= undefined
##.AVERAGES= 8
##.DIGITISER RES= 18
##SPECTROMETER/DATA SYSTEM= spect
##.PULSE SEQUENCE= zg30
##.SOLVENT NAME= CDCl3
##.SHIFT REFERENCE= (INTERNAL, CDCl3, 0, 14.3821)
##AUDIT TRAIL= $$ (NUMBER, WHEN, WHO, WHERE, WHAT)
$$ ##TITLE= Audit trail, XWIN-NMR		Version 3.5
$$ ##JCAMPDX= 5.01
$$ ##ORIGIN= Bruker BioSpin GmbH
$$ ##OWNER= she
$$ F:/spectra/data/she/nmr/H-C/1/audita.txt
$$ ##AUDIT TRAIL=  $$ (NUMBER, WHEN, WHO, WHERE, WHAT)
(   1,<2026-04-13 14:06:18.43 +0400>,<she>,<DPX200>,
      <created by zg, POWCHK disabled, PULCHK disabled
       configuration hash MD5:
       00 E9 B6 7A A2 85 ED C7 34 08 36 98 17 FE 4E 26
       data hash MD5: 16K
       AB 47 71 F3 12 CF 85 96 C6 3B 51 09 D0 B4 98 58>)
$$ ##END=
$$ 
$$ hash MD5
$$ 1D FA 3F 6B F3 11 D7 9C 9B CC AD 06 F8 01 9E 6A
##$RELAX= 
##$RELAX= 
##$RELAX= 
##$RELAX= 
##$RELAX= 
##$RELAX= 
$$ Bruker specific parameters
$$ --------------------------
##$DU= <F:/spectra>
##$EXPNO= 1
##$NAME= <H-C>
##$PROCNO= 1
##$TYPE= <nmr>
##$USER= <she>
##$AMP= (0..31)
100 100 100 100 100 100 100 100 100 100 100 100 100 100 100 100 100 100 
100 100 100 100 100 100 100 100 100 100 100 100 100 100 
##$AQSEQ= 0
##$AQ_mod= 1
##$AUNM= <au_zg>
##$AUTOPOS= <>
##$BF1= 200.13
##$BF2= 200.13
##$BF3= 200.13
##$BF4= 200.13
##$BF5= 200.13
##$BF6= 200.13
##$BF7= 200.13
##$BF8= 200.13
##$BYTORDA= 1
##$CFDGTYP= 0
##$CFRGTYP= 5
##$CHEMSTR= <none>
##$CNST= (0..31)
1 1 145 1 1 1 1 1 1 1 1 1 1 1 1 1 1 1 1 1 1 1 1 1 1 1 1 1 1 1 1 1 
##$CPDPRG= <>
##$CPDPRG1= <>
##$CPDPRG2= <>
##$CPDPRG3= <>
##$CPDPRG4= <mlev>
##$CPDPRG5= <mlev>
##$CPDPRG6= <mlev>
##$CPDPRG7= <mlev>
##$CPDPRG8= <mlev>
##$CPDPRGB= <>
##$CPDPRGT= <>
##$D= (0..31)
0 0.7 0 0 0 0 0 0 0 0 0 0.03 0 0 0 0 0 0 0 0 0 0 0 0 0 0 0 0 0 0 0 0 
##$DATE= 1776074777
##$DBL= (0..7)
120 120 120 120 120 120 120 120 
##$DBP= (0..7)
150 150 150 150 150 150 150 150 
##$DBP07= 0
##$DBPNAM0= <>
##$DBPNAM1= <>
##$DBPNAM2= <>
##$DBPNAM3= <>
##$DBPNAM4= <>
##$DBPNAM5= <>
##$DBPNAM6= <>
##$DBPNAM7= <>
##$DBPOAL= (0..7)
0.5 0.5 0.5 0.5 0.5 0.5 0.5 0.5 
##$DBPOFFS= (0..7)
0 0 0 0 0 0 0 0 
##$DE= 6
##$DECBNUC= <off>
##$DECIM= 32
##$DECNUC= <off>
##$DECSTAT= 4
##$DIGMOD= 1
##$DIGTYP= 9
##$DL= (0..7)
0 120 120 120 120 120 120 120 
##$DP= (0..7)
150 150 150 150 150 150 150 150 
##$DP07= 0
##$DPNAME0= <>
##$DPNAME1= <>
##$DPNAME2= <>
##$DPNAME3= <>
##$DPNAME4= <>
##$DPNAME5= <>
##$DPNAME6= <>
##$DPNAME7= <>
##$DPOAL= (0..7)
0.5 0.5 0.5 0.5 0.5 0.5 0.5 0.5 
##$DPOFFS= (0..7)
0 0 0 0 0 0 0 0 
##$DQDMODE= 0
##$DR= 18
##$DS= 0
##$DSLIST= <SSSSSSSSSSSSSSS>
$$ [...]
##$SUBNAM0= <"">
##$SUBNAM1= <"">
##$SUBNAM2= <"">
##$SUBNAM3= <"">
##$SUBNAM4= <"">
##$SUBNAM5= <"">
##$SUBNAM6= <"">
##$SUBNAM7= <"">
##$SUBNAM8= <"">
##$SUBNAM9= <"">
##$SW= 18.0517328524113
##$SWIBOX= (0..15)
0 0 2 0 0 0 0 0 0 0 0 0 0 0 0 0 
##$SW_h= 3612.71676300578
##$TD= 16384
##$TD0= 1
##$TE= 0
##$TE2= 300
##$TE3= 300
##$TEG= 300
##$TL= (0..7)
0 120 120 120 120 120 120 120 
##$TP= (0..7)
150 150 150 150 150 150 150 150 
##$TP07= 0
##$TPNAME0= <>
##$TPNAME1= <>
##$TPNAME2= <>
##$TPNAME3= <>
##$TPNAME4= <>
##$TPNAME5= <>
##$TPNAME6= <>
##$TPNAME7= <>
##$TPOAL= (0..7)
0.5 0.5 0.5 0.5 0.5 0.5 0.5 0.5 
##$TPOFFS= (0..7)
0 0 0 0 0 0 0 0 
##$TUNHIN= 0
##$TUNHOUT= 0
##$TUNXOUT= 0
##$USERA1= <user>
##$USERA2= <user>
##$USERA3= <user>
##$USERA4= <user>
##$USERA5= <user>
##$V9= 5
##$VALIST= <valist>
##$VCLIST= <CCCCCCCCCCCCCCC>
##$VD= 0
##$VDLIST= <DDDDDDDDDDDDDDD>
##$VPLIST= <PPPPPPPPPPPPPPP>
##$VTLIST= <TTTTTTTTTTTTTTT>
##$WBST= 1024
##$WBSW= 4
##$XGAIN= (0..3)
0 0 0 0 
##$XL= 0
##$YL= 0
##$YMAX_a= 928732
##$YMIN_a= -983970
##$ZGOPTNS= <>
##$ZL1= 120
##$ZL2= 120
##$ZL3= 120
##$ZL4= 120
##$ABSF1= 10
##$ABSF2= 0
##$ABSG= 5
##$ABSL= 3
##$ALPHA= 0
##$AQORDER= 0
##$ASSFAC= 0
##$ASSFACI= 0
##$ASSFACX= 0
##$ASSWID= 0
##$AUNMP= <proc_1d>
##$AZFE= 0.1
##$AZFW= 0.1
##$BCFW= 1
##$BC_mod= 2
##$BYTORDP= 1
##$COROFFS= 0
##$CY= -3
##$DATMOD= 1
##$DC= 2
##$DFILT= <>
##$DTYPP= 0
##$F1P= 0
##$F2P= 0
##$FCOR= 0.5
##$FTSIZE= 0
##$FT_mod= 4
##$GAMMA= 1
##$GB= 0.15
##$INTBC= 1
##$INTSCL= 1
##$ISEN= 128
##$LB= 0.25
##$LEV0= 0
##$LPBIN= 0
##$MAXI= 10000
##$MC2= 0
##$MEAN= 0
##$ME_mod= 0
##$MI= 1.114404
##$NCOEF= 0
##$NC_proc= 0
##$NLEV= 6
##$NOISF1= 3.799351
##$NOISF2= 2.8
##$NSP= 1
##$NTH_PI= 0
##$NZP= 0
##$OFFSET= 14.38212
##$PC= 1
##$PHC0= -3706.808
##$PHC1= 10.99231
##$PH_mod= 1
##$PKNL= yes
##$PPARMOD= 0
##$PSCAL= 0
##$PSIGN= 0
##$REVERSE= no
##$SF= 200.129724274929
##$SI= 16384
##$SIGF1= 3
##$SIGF2= 2
##$SINO= 400
##$SIOLD= 16384
##$SREGLST= <1H.CDCl3>
##$SSB= 0
##$STSI= 0
##$STSR= 0
##$SW_p= 3205.1282051282
##$SYMM= 0
##$S_DEV= 0
##$TDeff= 0
##$TDoff= 0
##$TI= <>
##$TILT= no
##$TM1= 0
##$TM2= 0
##$TOPLEV= 0
##$USERP1= <user>
##$USERP2= <user>
##$USERP3= <user>
##$USERP4= <user>
##$USERP5= <user>
##$WDW= 1
##$XDIM= 8192
##$YMAX_p= 0
##$YMIN_p= 0
$$ End of Bruker specific parameters
$$ ---------------------------------
##NTUPLES= NMR FID
##VAR_NAME=  TIME,          FID/REAL,        FID/IMAG
##SYMBOL=    X,             R,               I
##VAR_TYPE=  INDEPENDENT,   DEPENDENT,       DEPENDENT
##VAR_FORM=  AFFN,          ASDF,            ASDF
##VAR_DIM=   8192,          8192,            8192
##UNITS=     SECONDS,       ARBITRARY UNITS, ARBITRARY UNITS
##FACTOR=    0.0002768,     1,               1
##FIRST=     0,             0,               0
##LAST=      2.2672688,     0,               0
##MIN=       0,             -983970,         0
##MAX=       2.2672688,     928732,          0
$$ Real data points
##PAGE= N=1
##DATA TABLE= (X++(R..R)), XYDATA
$$ [...]
$$ plain form
2201 165 4327 -1072 -4563 838 2821 -2416 -2533 1500 -485 -2524 1749 2329 -2913 -1347 4540 1276
2217 1276 -3714 188 4359 -350 -2559 1384 1039 -2524 168 2308 -2302 -3348 2769 2128 -3677
2232 -3677 -2072 3383 1029 -2528 923 2274 -1188 -43 3310 -443 -3119 1762 3900 -2370 -3339
2247 -3339 2260 1512 -3027 -1259 1175 -1230 -1653 2037 638 -3199 542 4007 -270 -2915 1673
2262 1673 3250 -579 -1151 1769 210 -1666 1018 1681 -3183 -1666 2569 557 -3776 -493 2645
2277 2645 -218 -1984 1045 1362 -1045 867 2627 -847 -1994 2456 2420 -2401 -1951 2353 843 -2878
2293 -2878 -451 1165 -1276 -1312 1570 -221 -2952 630 3190 -1269 -2290 2024 2291 -1216 -523 1986
2309 1986 -85 -1143 1907 702 -2809 -628 2558 -830 -3664 228 2379 -1184 -1621 1411 323
$$ packed form
2201A65M162n399l491N401J983n237j17M033j985k039M273N80n242J566N887l264
2217A276m990L902M171m709k209L943l45l563K692K140m610j046O117o41n805
2232c677J605N455k354l557L451J351l462J145L353l753k676M881K138o270r69
2247c339N599p48m539J768K434k405m23L690j399l837L741L465m277k645M588
2262A673J577l829n72K920j559j876K684O63m864J517M235k012m333L283L138
2277B645k863j766L029L17k407J912J760l474j147M450l6m821M50M304j510l721
2293b878K427J616k441l6K882j791k731L582K560m459j021M314K67l507O93K509
2309A986k071j058L050j205l511K181L186l388k834L892K151l563m37L032j088
$$ plain form
2324 323 -1402 1479 1910 -1732 -972 3109 1284 -2422 -198 2549 -753 -2074 962 359 -2071 -458
2340 -458 1350 -1768 -2202 1545 1415 -1892 -827 2529 814 -1343 1149 1655 -697 167 2049 -316
2356 -316 -2141 733 2027 -1606 -2043 832 416 -2029 -644 842 -538 -993 1517 510 -1504 532
2372 532 2754 -89 -854 876 2339 -911 -717 924 -190 -1676 687 460 -1883 -1009 835 396
2388 396 -1987 110 1811 -304 -877 1490 1058 -888 622 2098 -430 -1399 1260 969 -1586 -947
2404 -947 1412 -178 -1879 77 688 -1216 -1024 1407 22 -1560 977 2120 -780 -815 1719 1196
2420 1196 -1426 260 1570 -879 -1386 1202 112 -2199 -774 1341 -1038 -1917 1058 1279 -1631 -457
2436 -457 2002 333 -1245 1620 1633 -1092 -470 2192 488 -1827 431 1206 -1452 -1558 1160 -141
$$ packed form
2324C23j725K881M31l642P60M081j825l706K224K747l302j321L036o03k430J613
2340d58J808l118m34L747j30l307J065L356j715k157K492N06k352Q64J882k365
2356c16j825K874J294l633m37K875m16k445J385J486j380m55K510j007k014K036
2372E32K222k843p65J730J463l250J94J641j114j486K363k27k343Q74J844m39
2388C96k383K097J701k115n73K367m32j946J510J476k528r69K659k91k555O39
2404i47K359j590j701J956O11j904J92K431j385j582K537J143k900l5K534n23
2420A196k622J686J310k449n07K588j090k311J425K115k379q79K975K21k910J174
2436d57K459j669j578K865J3k725O22K662j704k315K258P75k658j06K718j301
$$ plain form
2452 -141 -2254 -76 922 -1157 -1073 510 1211 -1576 -649 2918 -6 -1157 1825 1245 -814 -503 1428
2469 1428 -325 -1858 136 1004 -1655 -1356 949 -141 -1846 7 1564 -643 -853 1507 972 -1155
2485 -1155 199 1804 -190 -1083 981 1189 -1582 -932 978 -239 -1962 243 942 -1221 -997 1175
2501 1175 338 -1424 373 1876 -331 -689 1573 928 -1155 239 1509 -705 -1414 416 627 -1716
2517 -1716 -554 1083 -866 -1657 562 1003 -1066 -385 1783 458 -931 748 1803 -535 -699 1884
2533 1884 655 -1322 -14 1053 -1278 -1377 666 71 -1702 -487 1450 -646 -1305 1018 833 -902
2549 -902 337 1813 166 -464 1154 1245 -1106 -231 1304 -53 -1471 268 597 -1436 -786 771 -53
2566 -53 -1260 427 738 -727 -631 1469 749 -495 373 1359 -309 -586 476 379 -1350 -189 845 -840
$$ packed form
2452a41k113K178R98k079Q4J583P01k787R27L567k924j151K982n80k059L11J931
2469A428j753j533J994Q68k659K99K305j090j705J853J557k207k10K360n35k127
2485a155J354J605j994q93K064K08k771O50J910j217j723K205O99k163K24K172
2501A175q37j762J797J503k207l58K262o45k083J394J270k214p09J830K11k343
2517a716J162J637j949p91K219M41k069O81K168j325j389J679J055k338j64K583
2533A884j229j977J308J067k331r9K043n95j773J215J937k096o59K323j85j735
2549i02J239J476j647o30J618R1k351Q75J535j357j418J739L29k033O50J557q24
2566e3j207J687L11j465R6K100p20j244Q68R86j668k77J062r7j729J161J034j685
$$ plain form
2584 -840 -1449 111 568 -1099 -662 825 48 -748 485 1044 -169 -133 1399 500 -829 395 1314 -367
2602 -367 -910 548 198 -1263 -453 796 -749 -946 734 649 -1307 -276 1480 342 -967 869 1540
2619 1540 -487 -470 1374 -22 -1072 516 737 -1425 -1513 1035 410 -2045 -229 1099 -672 -772 1024
2636 1024 653 -1183 316 1863 -583 -1111 1543 1509 -1258 -450 1285 -51 -1290 264 432 -1540
2652 -1540 -768 1319 -421 -2029 467 1408 -680 -1066 1308 787 -937 466 1697 -428 -845 1411
2668 1411 458 -1870 -632 1441 -691 -1909 122 671 -1423 -690 905 -338 -1305 1110 1548 -713
2684 -713 -643 1845 1127 -1276 -251 1208 76 -950 567 317 -1557 -383 959 -923 -1719 611
2700 611 1255 -1132 -1094 1594 672 -867 604 1143 -491 -226 1648 374 -1888 3 1681 -540 -1828
$$ packed form
2584h40o09J560M57j667M37J487p77p96J233N59j213L6J532q99j329J224R19j681
2602c67n43J458l50j461Q10J249j545j97J680q5j956J031J756j138j309J836O71
2619A540k027J7J844j396j050J588K21k162q8K548o25k455J816J328j771j00J796
2636A024l71j836J499J547k446n28K654l4k767Q08J735j336j239J554J68j972
2652a540P72K087j740j608K496R41k088l86K374n21j724J403J231k125m17K256
2668A411r53k328J238K073k132j218K031N49k094P33J595j243r67K415M38k261
2684g13P0K488p18k403J025J459j132j026J517k50j874J174J342j882p96K330
2700F11O44k387L8K688r22j539J471N39j634K65J874j274k262J891J678k221j288
$$ plain form
2717 -1828 774 762 -1397 -822 670 -472 -935 1073 1339 -1426 -439 2166 825 -1388 444 1763
2733 1763 -513 -773 547 -49 -1350 220 828 -1442 -1974 1169 800 -1800 -573 1381 369 -936
2749 -936 746 570 -655 404 1561 -150 -1555 972 1369 -1337 -1255 737 247 -1351 -318 410 -1113
2766 -1113 -774 1070 203 -1468 167 1897 104 -1027 739 1133 -385 -33 900 1 -793 386 602
2783 602 -1329 -801 1231 -97 -1540 -170 1014 -131 -669 319 439 -477 532 1292 -451 -687 1079
2800 1079 858 -1275 -758 856 51 -1205 -212 74 -996 -701 439 -232 -1281 420 1190 -313 -846
2817 -846 1003 970 -521 52 793 -253 -378 694 273 -1055 -464 982 -204 -1577 173 870 -824
2834 -824 -574 519 133 -549 806 899 -311 -75 1698 645 -1000 192 1286 -120 -966 249 -412
$$ packed form
2717a828K602j2k159N75J492j142m63K008K66k765R87K605j341k213J832J319
2733A763k276k60J320n96j301J570O08k270n32L143l69k600J227J954j012j305
2749i36J682j76j225J059J157j711j405K527L97k706Q2J992m90j598J033P28j523
2766a113L39J844q67j671J635J730j793j131J766L94j518L52R33q99p94J179K16
2783F02j931N28K032j328j443J370J184j145n38R88J20r16J009P60j743k36J766
2800A079k21k133N17J614q05j256R93K86j070K95J140o71j049J701P70j503n33
2817h46J849l3j491N73P41j046j25J072m21j328N91J446j186j373J750O97j694
2834h24K50J093l86o82J355R3j210K36J773j053j645J192J094j406q46J215o61
$$ plain form
2851 -412 -1066 -272 420 -831 -558 569 726 -856 -231 1079 240 -377 441 543 -147 360 888 -255
2869 -255 -865 350 524 -879 -902 266 81 -861 -426 377 -202 -131 809 295 -234 314 1113 -17 -319
2888 -319 520 800 -261 -282 364 -514 -722 0 -11 -978 -520 454 -44 -857 94 1070 42 -19 634 591 -208
2909 -208 429 863 -45 -394 482 407 -1020 -496 332 -257 -887 -6 -41 -736 -110 756 -51 -657 572 860
2929 860 -526 -314 996 457 -696 104 809 -439 -806 476 -98 -1145 -117 766 -565 -865 275
2946 275 338 -706 -214 946 353 -245 756 630 -453 -60 1117 91 -711 148 344 -855 -685 505
2964 505 -205 -700 147 533 -423 -299 1015 592 -687 249 736 31 -346 711 606 -465 -151 255 -268
2983 -268 -986 -79 186 -764 -508 321 47 -759 283 648 -49 -21 966 462 -640 224 681 80 -526 592
$$ packed form
2851d12o54P94O92j251K73J127J57j582O25J310q39o17Q18J02o90N07N28j143
2869b55o10J215J74j403k3J168j85r42M35Q03n79P1R40n14n29N48P99j130l02
2888c19Q39K80j061k1O46q78k08P22j1r67M58R74m98q13R51R76j028o1O53m3p99
2909b08O37M34r08l49Q76p5j427N24Q28n89o30Q81l5o95O26Q66q07o06J229K88
2929H60j386K12J310n39j153Q00P05j248l67J282n74j047J028Q83j331l00J140
2946B75O3j044M92J160n93n98J001j26j083L93J177j026q02Q59J96j199J70J190
2964E05p10m95Q47L86r56J24J314m23j279R36M87p05l77J057j05j071L14M06n23
2983b68p18R07K65r50K56Q29k74q06J042L65o97K8R87n04j102Q64M57o01o06J118
$$ plain form
3003 592 377 -643 -245 379 -318 -908 -144 113 -633 -412 536 434 -446 300 696 -7 -117 928 573
3022 573 -430 -59 787 -581 -574 403 253 -1177 -739 357 -418 -784 265 424 -653 78 1071 494 -492
3041 -492 631 927 -519 -299 767 -66 -443 253 437 -857 -686 346 -75 -781 -98 636 -569 -385
3059 -385 728 260 -243 163 884 -18 -127 554 722 -469 -420 696 -101 -889 -69 353 -794 -198 188
3078 188 -166 -584 356 554 -164 -29 605 592 -109 465 509 7 -376 528 461 -272 -93 415 -377 -688 -186
3099 -186 -46 -529 -529 361 24 -413 184 764 -61 91 568 291 -392 183 584 -53 -385 197 4 -551 -629
3120 -629 109 -316 -541 473 280 -471 -148 855 236 -455 603 765 -14 12 624 -74 -846 137 475
3139 475 -734 -962 299 205 -976 -281 495 -288 -364 434 73 -429 416 941 -62 -413 501 654 -433
$$ packed form
3003E92k15j020L98O24o97n90P64K57p46K21R48j02q80P46L96p03j10J045l55
3022E73j003L71Q46j368PR77j50j430M38J096p75l66J049J59j077P31R93n77r86
3041d92J123K96j446K20J066q33l77O96J84j294J71J032m21p06O83P34j205J84
3059c85J113m68n03M06P21r02j09O81J68j191M9J116p97p88Q20M22j147N96L86
3078A88l54m18R40J98p18J35O34j3p01N74M4n02l83R04o7p33J79N08p92l11N02
3099a86J40m83%Q90l37m37N97N80q25J52M77k77o83N75M01o37l32N82j93n55p8
3120f29P38m25k25J014j93p51L23J003o19o91J058J62p79K6O12o98p72R83L38
3139D75j209k28J261r4j181O95P76p83p6P98l61n02Q45N25j003l51R14J53j087
$$ plain form
3158 -433 -85 514 154 -368 270 10 -537 -537 544 -177 -932 130 905 3 -246 485 532 -7 325 499
3178 499 -374 -265 863 373 -1097 -272 519 -326 -852 37 113 -307 187 336 -39 -343 428 562 -178 -324
3198 -324 909 184 -552 -52 228 -62 -380 96 3 -754 -15 270 -733 -988 45 700 -266 -413 479
3217 479 349 -34 392 357 -269 -30 735 170 -848 182 840 -390 -743 173 172 -724 -169 153 -352 -444
3237 -444 694 330 -699 -217 829 335 -738 275 672 11 -305 492 -98 -825 409 577 -911 -670
3255 -670 481 262 -679 -562 515 -215 3 535 468 -490 310 903 -8 -515 491 666 -616 -331 203
3274 203 -130 -518 -55 -19 -744 -407 491 -22 -612 98 985 -161 -473 531 473 3 27 300 -202 -582
3294 -582 505 45 -802 -309 542 -171 -717 -299 399 -520 -209 539 -146 -331 229 798 -162 -33 440 416
$$ packed form
3158d33L48N99l60n22O38k60n47%J081p21p55J062P75r02k49P31M7n39L32J74
3178D99q73J09J128m90j470Q25P91q45n26Q89P6m20M94J49l75l04P71J34p40j46
3198c24J233p25p36N00K80k90l18M76r3p57P39K85j003k55J033O55r66j47Q92
3217D79j30l83M26l5o26K39P65n65j018J030O58j230l53R16jq96N55L22n05r2
3237d44J138l64j029M82J046m94j073J013L97o61l16P97n90p27J234J68j488K41
3255f70J151k19r41J17J077p30K18N32o7r58Q00N93r11n07J006J75j282K85N34
3274B03l33l88M63L6p25L37Q98n13n90P10Q87j146l12J004n8m70K4K73n02l80
3294e82J087m60q47M93Q51p13n46M18O98r19L11P48o85j85N60N69r60J29M73k4
$$ plain form
3314 416 -352 -400 490 -267 -406 -62 -281 -818 42 275 -285 -899 235 740 -22 -94 876 477 -372 246
3334 246 504 -442 159 603 -110 -739 -11 496 -634 -828 -44 212 -563 -182 514 4 -220 639 448 -585
3354 -585 -94 894 189 -416 46 545 -217 -320 259 -295 -705 -16 481 -709 -544 488 369 -571 34
3373 34 773 132 -154 402 198 -113 435 338 -341 -384 73 157 -427 -690 -108 118 -566 -40 161 -420 94
3394 94 556 162 -242 222 664 78 -77 458 291 -84 -175 334 -152 -437 -6 0 -364 -286 557 174 -280 213
3416 213 399 117 -94 425 164 -195 326 118 -83 -424 308 320 -709 -309 254 -335 -428 136 37 -540 -168
3437 -168 582 -139 -351 366 563 -153 -141 358 -11 -220 210 336 -343 -192 218 166 -411 -56 340 -206 -409
3458 -409 381 234 -512 53 304 55 -34 723 330 67 -46 578 48 -308 207 129 -224 -384 68 -123 -516
$$ packed form
3314D16p68m8Q90p57j39L44k19n37Q60K33n60o14J134N05p62p2R70l99q49O18
3334B46K58r46O01M44p13o29P28N07j130j94P84K56p75L81O96n10k24Q59j91j033
3354e85M91R88p05o05M62M99p62j03N79n54m10O89M97j190J65J032j19r40O05
3373C4P39o41k86N56k04l11N48r7o79m3M57Q4n84k63N82K26o84N26K01n81N14
3394I4M62l94m04M64M42n86j55N35j67l75r1N09m86k85M31Ol64P8Q43l83m54M93
3416B13J86k82k11N19k61l59N21k08k01l41P32J2j029M00N63n89r3N64r9n77L72
3437a68P50p21k12P17J97p16J2M99l69k09M30J26o79J51M10n2n77L55L96n46k03
3458d09P90j47p46N65K51k49q9P57l93k63j13O24n30l56N15p8l53j60M52j91l93
$$ plain form
3479 -516 32 219 -252 -467 537 -130 -258 492 377 -69 66 404 130 14 -69 -83 -292 -428 97 -244
3499 -244 -540 -65 124 -37 -287 263 29 26 -153 10 460 -34 317 458 -100 95 294 31 -398 71 179
3520 179 -202 -641 -13 -240 -505 -119 82 -206 -495 390 645 -116 84 423 50 -155 385 433 -241 -55
3540 -55 252 165 -356 -108 272 -387 -239 120 361 -398 44 473 -146 -197 370 526 -118 -245 528 -22 -535
3561 -535 87 136 -150 -340 105 -179 -615 -94 169 -317 -219 95 113 -83 504 525 -85 -66 271 -18 -259 232
3583 232 145 -104 -335 135 98 -165 -161 181 -66 -157 -29 161 -297 84 169 103 201 350 347 -97 10 107 102 -456
3607 -456 -20 142 -152 -357 -206 27 -562 -166 -68 -124 40 326 387 -88 334 305 180 -198 56 412 -229
3628 -229 -285 -6 -33 -126 -79 116 -747 -392 152 33 -423 -167 328 171 -384 167 263 -32 22 158 -19 -287
$$ packed form
3479e16N48J87m71k15J004o67j28P50j15m46J35L38k74j16q3j4k09j36N25l41
3499b44k96M75J89j61k50N50k34lj79J63M50m94L51J41n58J95J99k63m29M69J08
3520A79l81m39O28k27k65L86K01k88k89Q85K55p61K00L39l73k05N40M8o74J86
3540e5L07q7n21K48L80o59J48L59K41p59M42M29o19n1N67J56o44j27P73n50n13
3561e35O22M9k86j90M45k84m36N21K63m86R8L14J8j96N87K1o10J9L37k89k41M91
3583B32q7k49k31M70l7k63ML42k47r1J28J90m58L81Q5o6R8J49lm44J07R7nn58
3607d56M36J62k94k05J51K33n89L96R8n6J64K86O1m75M22k9j25l78K54L56o41
3628b29n6K79k7r3M7J95q63L55N44j19m56K56M95j57n55N51R6k95N4J36j77k68
$$ plain form
3650 -287 217 263 -337 -316 189 -95 -504 -100 -153 -271 -56 78 59 -209 440 282 -210 -36 333 -14 -224
3671 -224 31 161 -59 -7 251 -169 -409 -141 304 -361 -543 75 -22 -58 -176 263 292 109 172 127 -82 -69
3693 -69 536 79 -239 283 380 -227 -386 -21 49 -357 -42 291 -300 -307 517 -46 -416 -36 757 484 -72 -294
3715 -294 464 -22 -114 235 1 -317 -132 257 -477 -333 0 151 -270 2 329 26 130 181 102 -51 94
3736 94 540 -230 -394 138 230 -10 -464 23 -171 -458 -203 -22 -273 -20 620 108 -252 -16 605 260 -73
3757 -73 193 372 259 59 267 -43 -309 57 47 -474 -210 120 136 -409 -28 21 -250 102 143 -71 -593 518
3779 518 87 -416 -188 233 88 -292 -198 231 -267 -337 89 -116 -532 38 272 -87 -507 79 348 -164 39
3800 39 -3 324 -53 513 -237 -64 143 225 -262 -497 199 238 -111 -355 19 -122 -230 -33 -66 47 414 426
$$ packed form
3650b87N04M6o00K1N05k84m09M04n3j18K15J34j9k68O49j58m92J74L69l47k10
3671b24K55J30k20N2K58m20k40K68M45o65j82O18r7l6j18M39K9j83O3m5k09J3
3693f9O05m57l18N22R7o07j59L65P0m06L15L33n91pQ24n63l70L80P93k73n56k22
3715b94P58m86r2L49k34l18J85L89p34J44L33J51m21K72L27l03J04N1p9j53J45
3736I4M46p70j64N32R2k40m54M87j94k87K55J81k51K53O40n12l60K36O21l45l33
3757g3K66J79j13k00K08l10k66L66j0n21K64L30J6n45L81M9k71L52M1k14n22J111
3779E18m31n03K28M21j45l80R4M29m98p0M26k05m16N70K34l59m20N86K69n12K03
3800C9m2L27l77N66p50J73K07Q2m87k35O96L9l49k44L74j41j08J97l3J13L67J2
$$ plain form
3822 426 155 -134 -45 385 159 -76 13 419 -115 -123 325 -278 -434 -23 258 -334 -356 399 444 -317 -95 405
3844 405 313 89 283 220 -199 101 472 -182 -490 -167 75 -215 -668 70 363 -220 60 -31 42 49 238 26
3866 26 -231 73 596 42 -306 297 146 -96 -16 108 -455 -399 18 -91 -156 -144 140 157 -66 75 432 -106
3888 -106 269 402 -146 -91 474 358 -163 -71 143 -110 -239 103 -142 -304 -154 -5 -479 -64 138 272 88
3909 88 -169 128 235 14 19 447 223 62 132 -18 -263 -91 248 -93 -353 -434 -306 7 -402 99 93 91 6
3932 6 168 57 -143 -63 122 -65 -21 326 -14 83 -182 275 185 -314 -10 -53 -193 16 121 297 -88 80
3954 80 363 36 155 215 144 -171 319 247 -13 207 53 -263 64 6 165 -161 -287 -1 -63 -7 -5 247 92
3977 92 63 274 331 -528 101 109 76 -210 221 66 -135 67 175 -102 -49 139 -241 -286 -42 11 81 -239 -117
$$ packed form
3822D26k71k89Q9M30k26k35Q9M06n34qM48o03j56M11K81n92k2P55M5p61K22N00
3844D05r2k24J94o3m19L00L71o54l08L23K42k90m53P38K93n83K80r1P3PJ89k12
3866B6k57L04N23n54l48O03j51k42Q0J24n63N6M17j09o5J2K84J7k23J41L57n38
3888a06L75J33n48N5N65j16n21R2K14k53j29L42k45j62J50J49m74M15K02J34j84
3909H8k57K97J07k21NM28k24j61P0j50k45J72L39l41k60q1J28L13m09N01okq5
3932FJ62j11k00Q0J85j87M4L47l40R7k65M57r0m99L04m3j40K09J05J76l85J68
3954H0K83l27J19O0p1l15M90p2k60K20j54l16L27n8J59l26j26K86o2N6KK52j55
3977I2k9K11N7q59O29Ql3k86M31j55k01K02J08k77N3J88l80m5K44N3P0l20J22
$$ plain form
4000 -117 317 93 -18 166 -67 216 7 -35 -166 -168 -18 48 -14 9 -331 -154 78 302 42 150 208 217 51
4023 51 88 7 503 -218 -52 88 152 15 130 33 -247 -262 -19 -233 -482 -67 -46 51 21 42 216 177 25 296
4047 296 168 75 96 93 -104 -178 33 -56 0 -201 -264 -157 -242 -138 16 88 -86 -9 -208 117 6 -155 -20 27
4071 27 287 -190 -66 308 85 -246 212 275 -296 -359 147 -129 -49 39 22 -20 63 300 74 34 -24 -95 -61 266
4095 266 -49 45 -282 179 148 -236 -238 -210 118 -37 17 169 3 -142 -1 448 48 144 -61 25 -292 -69 -119
4118 -119 -268 -2 4 208 -203 -74 -15 -84 -269 -93 233 38 305 102 -25 -73 246 -262 50 21 -190 274
4140 274 -134 -85 113 -63 2 -192 98 -80 -68 -20 -142 -54 -42 33 92 -119 278 55 166 -41 228 271 39
4163 39 103 115 -187 -101 157 -31 -56 -89 -117 -59 111 202 -4 -101 142 335 12 131 298 300 -35 81 -165 -299
$$ packed form
4000a17M34k24j11J84k33K83k09m2j31kJ50O6o2K3l40J77K32K24k60J08N8Rj66
4023E1L7q1M96p21J66J40O4j37J15r7k80j5K43k14k49M15K1R7l0K1J74l9j52K71
4047B96j28r3K1lj97p4K11q9N6k01o3J07q5J04J54P2j74P7j99L25j11j61J35M7
4071B7K60m77J24L74k23l31M58O3n71o3N06k76Q0Q8j7m2Q3K37k26m0n8p1L4L27
4095B66l15R4l27M61l1l84kK8L28j55N4J52j66j45J41M49m00R6k05Q6l17K23n0
4118a19j49K66OK04m11J29N9o9j85J76L26j95K67k03j27m8L19n08L12k9k11M64
4140B74m08M9J98j76O5j94K90j78J2M8j22Q8J2P5N9k11L97k23J11k07K69M3k32
4163C9O4J2l02Q6K58j88k5l3k8N8J70R1k06r7K43J93l23J19J67Kl35J16k46j34
$$ plain form
4187 -299 -118 16 -165 -245 27 161 -87 99 140 10 -119 -128 48 -294 -262 357 345 115 67 412 -29 -76 487
4210 487 -197 -296 -156 169 41 -68 50 -199 -75 303 376 -89 35 148 216 6 -238 157 144 144 92 -105
4232 -105 127 -95 -242 -40 -254 45 -248 95 -155 -40 86 -117 283 230 97 -204 -142 345 13 -165 -71
4253 -71 81 -163 -209 -41 -205 -40 -25 22 -344 -13 -5 -39 -22 88 252 -18 -65 325 23 -93 16 -21 -4 -6
4277 -6 302 83 -489 108 91 -102 -179 -42 -246 -36 202 119 -45 177 61 196 -302 -17 284 -247 -187 -12
4299 -12 131 18 211 -82 105 -188 82 91 -139 0 430 -87 -100 12 293 151 22 -32 -55 -31 -61 164 -379
4322 -379 -116 32 -40 -141 -27 174 223 -53 221 -117 19 7 -107 119 -18 -146 210 -119 -271 -309 -116
4343 -116 1 -73 -19 -112 -195 53 31 -122 -161 113 -174 -188 104 203 37 -28 -226 -61 -26 -15 -113 -405 -84 144
$$ packed form
4187b99J81J34j81q0K72J34k48J86M1j30j29rJ76l42L2O19j2k30m8L45m41m7N63
4210D87o84r9J40L25j28j09J18k49J24L78P3m65J24J13O8k10k44L95j3%n2j97
4232a05K32k22j47K02k14K99k93L43k50J15J26k03M00n3j33l01O2M87l32j78R4
4253g1J52k44m6J68j64J65J5M7l66L31Ql4J7J10J64k70m7L90l02j16J09l7J7k
4277fL08k19n72N97j7j93p7J37k04K10K38q3j64K22j16J35m98K85L01n31O0J75
4299a2J43j13J93k93J87k93K70Rk30J39M30n17j3J12K81j42j29n4k3K4l0K25n43
4322c79K63J48p2j01J14K01M9k76K74l38J36j2j14K26j37j28L56l29j52l8J93
4343a16J17p4N4r3q3K48k2j53l9K74k87j4K92R9j66o5j98J65L5J1r8k92L21K28
$$ plain form
4367 144 -34 -85 -275 -34 -191 -122 -54 37 -118 191 314 -165 135 75 104 -13 -135 427 130 98 -9 -143
4389 -143 -138 147 -102 -309 -150 248 123 -243 -240 95 -69 -213 144 -193 -147 454 -52 58 31 69 98 -58 16
4412 16 5 -62 -160 -29 290 -242 -22 -5 -84 53 -3 305 -92 38 -56 343 58 405 -33 64 130 134 8 82
4436 82 -273 20 70 -71 0 85 408 -26 -45 -7 308 97 -11 109 73 147 -132 -119 -50 -52 -126 110 18 -70 -243
4461 -243 -265 189 -84 -70 -3 153 209 302 144 449 -181 229 358 136 271 -157 20 -195 -103 115 -20 -329
4483 -329 -331 -115 -8 2 38 171 -351 25 61 -174 -220 232 -8 135 93 -3 -271 -132 80 45 -219 117 -71
4506 -71 -121 181 129 -5 114 -183 -118 14 -95 506 169 -32 19 -35 -100 -158 103 5 -204 15 -20 -144 109
4529 109 -82 9 26 -92 -16 318 -46 -8 -22 -149 190 -88 -128 -83 -370 -74 -53 -226 24 -75 -161 -265 -70
$$ packed form
4367A44j78n1j90K41j57O9O8R1j55L09J23m79L00o0K9j17j22N62k97l2j07j34
4389a43NK85k49k07J59L98j25l66LL35j64j44L57l37M6O01n06J10k7L8K9j56P4
4412A6j1o7r8J31L19n32K20J7p9J37n6L08l97J30r4L99k85L47m38R7O6Mj26P4
4436H2l55K93N0j41P1Q5L23m34j9L8L15k11j08J20l6P4k79J3O9kp4K36r2q8j73
4461b43k2M54k73J4O7J56N6R3j58L05o30M10J29k22J35m28J77k15R2K18j35l09
4483c29kK16J07J0L6J33n22L76L6k35m6M52k40J43m2r6k68J39K12l5k64L36j88
4506g1n0L02n2j34J19k97O5J32j09O01l37k01N1n4o5n8K61r8k09K19l5j24K53
4529A09j91R1J7j18P6L34l64L8j4j27L39k78m0M5k87K96K1j73K50r9q6j04J95
$$ plain form
4552 -70 29 17 -306 38 7 301 -103 -87 284 17 133 293 205 -123 -130 -75 -336 49 -296 -103 -3 -115 -15
4575 -15 12 402 7 -50 -118 -228 -196 -131 -68 14 81 -12 115 -117 -56 27 210 -188 -268 148 353 79 23 174 -169
4600 -169 -44 111 2 -40 -75 102 -164 -63 -19 217 32 -94 -44 -282 -18 -225 96 -379 -188 -24 -231
4621 -231 -219 -19 204 185 -16 113 -98 -239 -6 -83 232 61 66 38 -98 -116 103 100 -261 53 -187 138 180
4644 180 157 184 -74 -165 -28 203 76 193 -185 -154 297 6 18 -90 -28 -117 -23 -133 13 -150 11 -208 -59
4667 -59 -58 126 168 125 -296 70 230 -220 52 14 -135 44 25 39 265 121 -103 -186 -60 -121 86 230 348
4690 348 347 101 -50 238 155 -31 27 3 74 -52 288 26 -207 -76 115 -103 17 -288 159 76 -86 -15 229
4713 229 69 -6 98 -60 -90 77 -35 42 157 104 -152 -125 -4 -298 175 -130 -278 62 64 11 184 63 -14
$$ packed form
4552g0R9j2l23L44l1K94m04J6L71k67J16J60q8l28pN5k61L85l45J93J00j12J00
4575a5K7L90l95n7o8j10L2O5O3Q2O7r3J27k32O1Q3J83l98q0M16K05k74n6J51l43
4600a69J25J55j09m2l5J77k66J01M4K36j85j26N0k38K64k07L21m75J91J64k07
4621b31J2K00K23j9k01J29k11j41K33p7L15j71Nk8j36j8K19ll61L14k40L25M2
4644A80k3K7k58r1J37K31j27J17l78L1M51k91J2j08O2q9R4j10J46j63J61k19J49
4667e9JJ84M2m3m21L66J60m50K72l8j49J79j9J4K26j44k24q3J26o1K07J44J18
4690C48jk46j51K88q3j86N8k4P1j26L40k62k33J31J91k18J20l05M47q3j62P1K44
4713B29j60p5J04j58l0J67j12P7J15n3k56K7J21k94M73l05j48L40Kn3J73j21p7
$$ plain form
4736 -14 6 147 -71 87 70 49 227 -201 163 -344 46 -55 -98 -243 -84 -34 51 -45 261 214 7 176 -81
4759 -81 183 240 66 142 -113 -71 -224 -204 69 -226 43 -36 63 93 96 -152 -268 -123 1 -89 213 6 172 -152
4783 -152 138 184 -67 -184 442 -236 22 -5 46 -105 -220 -226 49 -73 -100 -2 -10 177 -1 114 -103 95 129
4806 129 212 0 332 154 -191 -128 101 -187 159 -51 -267 46 -68 68 -188 55 138 17 195 181 -167
4827 -167 -245 113 -148 -10 -51 -70 -213 28 41 -11 128 -45 -210 -106 -34 -67 230 -97 20 246 122 148 55
4850 55 343 63 101 180 -6 264 -197 114 -82 33 44 -59 -111 75 168 -62 48 -99 103 -103 263 109
4872 109 -59 -148 -90 -87 108 45 -127 -120 3 -178 149 -229 -122 -189 -162 256 185 120 210 -41 -247 137 222 -74
4896 -74 73 21 2 -55 334 -177 8 159 226 -245 107 -95 -100 55 -208 247 -65 -14 192 65 155 -3 125
$$ packed form
4736a4K0J41k18J58j7k1J78m28L64n07L90j01m3j45J59N0Q5r6L06m7k07J69k57
4759h1K64N7j74P6k55M2j53K0K73k95K69p9R9L0Lk48j16J45J24r0L02k07J66l24
4783a52K90M6k51j17O26o78K58k7N1j51j15oK75j22k7R8qJ87j78J15k17J98L4
4806A29Q3k12L32j78l45O3K29k88L46k10k16L13j14J36k56K43Q3j21J78j4l48
4827a67p8L58k61J38m1j9j43K41J3n2J39j73j65J04P2l3K97l27J17K26j24K6r3
4850E5K88k80L8P9j86K70m61L11j96J15J1j03n2J86R3k30J10j47K02k06L66j54
4872A09j68q9N8LJ95o3j72PJ23j81L27l78J07o7K7M18p1o5R0k51k06L84Q5k96
4896g4J47n2j9n7L89n11J85J51O7m71L52k02nJ55k63M55l12N1K06j27R0j58J28
$$ plain form
4919 125 66 -88 54 81 99 77 -159 -131 -244 -241 1 -118 -44 198 51 -53 169 90 199 137 90 4 224 -87
4943 -87 -206 57 6 -159 -193 -85 -96 -91 -87 91 103 -112 12 12 -143 228 42 22 274 -64 -153 4 3 49 -364
4968 -364 -220 -183 -61 98 -162 -201 25 101 -37 38 14 1 -217 -52 98 330 -78 202 139 265 54 434
4990 434 10 -96 96 -149 1 23 -333 -88 -64 -270 181 -139 -50 -12 -92 -230 -39 233 265 97 99 -163 -204
5013 -204 -65 49 -134 -65 69 51 -59 112 -144 -223 -21 -32 -199 230 261 -124 -49 -240 120 -11 345 32
5035 32 190 -45 -228 186 -215 -339 -52 -7 -75 -149 21 95 46 91 -171 61 -25 19 123 -120 120 -145 230
5058 230 -319 -8 -77 56 303 104 120 -140 37 -232 -144 40 48 158 251 -21 144 262 -37 -119 27 -26 -475
5081 -475 -62 -105 -230 -99 322 55 -32 45 -267 -255 5 127 -131 244 147 158 55 -96 58 257 -192 81
$$ packed form
4919A25n9j54J42K7J8k2k36K8j13LK42j19P4K42j47j04K22p9J09o2m7q6K20l11
4943h7j19K63n1j65l4J08j1NMJ78J2k15J24%j55L71j86k0K52l38q9J57jM6m13
4968c64J44L7J22J59k60l9K26P6j38P5k4j3k18J65J50K32m08K80o3J26k11L80
4990D34m24j06J92k45J50K2l56K45K4k06M51l20Q9L8q0j38J91K72L2j68Kk62m1
5013b04J39J14j83O9J34j8j10J71k56p9K02j1j67M29L1l85P5j91L60j31L56l13
5035C2J58k35j83M14m01j24K87M5o8p4J70P4m9M5k62K32q6M4J04k43K40k65L75
5058B30n49L11o9J33K47j99J6k60J77k69Q8J84QJ10R3k72J65J18k99q2J46n3m49
5081d75M13m3j25J31M21k67q7P7l12J2K60J22k58L75r7J1j03j51J54J99m49K73
$$ plain form
5103 81 114 219 -228 90 37 39 15 172 62 0 218 17 9 34 -93 145 -115 -60 26 -250 6 11 -42 -329 59
5128 59 -182 -85 5 -116 170 86 -20 214 -1 64 -121 -112 -187 475 -28 13 109 198 240 293 -112 -81 178 45 52
5153 52 133 -34 33 -182 -29 116 -41 141 -28 -243 -30 54 324 134 -29 -17 -157 18 100 216 -41 -66
5175 -66 83 -32 -74 -3 -101 -313 -37 -196 22 -210 169 -46 -48 36 110 -11 -3 218 -38 -22 24 -91 -139 -330
5199 -330 -39 -13 -195 71 196 5 43 131 65 234 -44 -38 1 35 -129 243 -34 197 40 -288 -68 -4 -29
5222 -29 -27 46 -27 -16 -45 183 270 189 95 126 204 169 25 519 68 -191 -30 -105 1 60 -108 -27 -68 125 222 169
5248 169 -71 115 -122 415 240 171 77 -180 31 -142 -184 -200 54 -333 21 61 148 -217 23 142 -108 294
5270 294 179 -69 74 127 85 -28 159 -180 -81 -17 -35 53 -187 25 -86 73 -65 21 -128 207 -365 1
$$ packed form
5103H1L3J05m47L18n3Kk4J57j10o2K18k01qK5j27K38k60N5Q6k76K56Nn3k87L88
5128E9k41R7R0j21K86q4j06K34k15O5j85Rp5O62n03M1R6Q9M2N3m05L1K59j33P
5153E2Q1j67O7k15J53J45j57J82j69k15K13Q4K70j90j63J2j40J75Q2J16k57k5
5175f6J49j15m2P1r8k12K76j59K18k32L79k15kQ4P4j21QK21k56J6M6j15m8j91
5199c30K91K6j82K66J25j91L8Q8o6J69k78OL9L4j64L72k77K31j57l28K20O4k5
5222b9KP3p3J1k9K28Q7q1r4L1P8l5j44M94m51k59J61p5J06N9j68Q1m1J93R7n3
5248A69k40J86k37N37j75o9r4k57K11j73m2j6K54l87L54M0Q7l65K40J19k50M02
5270B94j15k48J43N3m2j13J87l39R9O4j8Q8k40K12j11J59j38Q6j49L35n72L66
$$ plain form
5292 1 42 127 89 235 78 -145 137 -131 237 158 56 33 -82 67 14 -313 -39 67 -165 -186 -66 133 -16
5315 -16 -140 193 84 177 106 -45 220 207 -120 64 -80 74 -60 111 65 487 175 46 -100 295 118 31
5337 31 -33 -260 55 -103 -135 -116 73 63 115 -76 -26 289 202 44 5 -74 5 -26 10 -87 -131 116 93 -77 6 35
5363 35 113 357 144 -193 149 55 84 20 75 -185 -174 253 -144 48 -69 -148 -23 -122 122 -15 19 175 225 104
5387 104 -174 36 98 -96 -163 -69 -123 -220 -93 -2 60 291 -236 -99 147 -271 11 82 184 -127 -181 231 9
5410 9 29 40 -130 198 -350 -12 -73 88 115 -29 -142 -175 83 79 -195 57 351 -22 141 -141 109 11 4 -262
5434 -262 -20 -193 -109 160 -328 -115 0 -314 -163 161 -41 -81 59 -239 -12 254 146 -38 -74 107 195
5455 195 1 -46 -18 27 239 62 193 -62 -29 63 -102 -122 -78 14 17 42 30 8 -94 16 -162 -53 -145 193 95
$$ packed form
5292AM1Q5l8J46j57k23K82k68L68p9j02k3j15J49n3l27K74J06k32k1J20J99j49
5315a6j24L33j09R3p1j51K65j3l27J84j44J54j34J71m6M22l12j29j46L95j77q7
5337C1o4k27L15j58l2J9J89j0N2j91N0L15q7j58l9p9P9l1L6r7m4K47k3j70Q3K9
5363C5P8K44k13l37L42r4K9o4N5k60J1M27l97J92j17p9J25r9K44j37L4J56N0j21
5387A04k78K10O2j94o7R4n4r7J27R1O2K31n27J37K46m18K82P1J02l11n4M12k22
5410IK0J1j70L28n48L38o1J61K7j44j13l3K58mk74K52K94l73J63k82K50r8pk66
5434b62K42j73Q4K69m88K13J15l14J51L24k02m0J40k98K27K66j08j84l6J81Q8
5455A95j94m7K8M5K12j77J31k55L3R2j65k0M4R2LK5j2k2j02J10j78J09r2L38r8
$$ plain form
5480 95 114 28 -143 -136 -100 -181 -162 -383 270 -13 -271 -84 32 208 34 65 -254 -4 34 211 -268 106 -76
5503 -76 -104 1 126 -58 -70 -107 78 217 202 45 -317 -131 -46 374 104 -48 69 -269 -130 -143 74 -120
5525 -120 -226 31 -38 -56 -156 -214 -45 81 119 2 -19 -220 276 -24 140 113 224 -107 -6 206 23 -200
5547 -200 -209 25 -128 177 -118 119 37 -206 -91 -95 64 4 117 73 -154 -38 -22 -83 112 -23 -52 259 -164
5570 -164 -80 -38 189 173 58 129 -28 46 -200 -24 111 73 -138 -177 70 126 -230 170 139 -128 -75 102 -124
5593 -124 154 157 -258 62 -76 165 6 14 95 171 416 10 -136 -56 90 40 -19 129 136 159 -228 87 218 90
5617 90 -124 -115 -101 -285 -174 62 -25 -115 235 -42 54 40 240 27 188 -77 -150 260 -64 -120 -226 -109 -340
5640 -340 107 -56 -104 -16 -98 198 236 -158 205 -82 4 33 29 96 180 -295 154 -89 55 221 -106 87 54 -190
$$ packed form
5480I5J9q6j71PL6q1J9k21O53k83k58J87J16J76j74L1l19K50L8J77m79L74j82
5503g6k8J05J25j84j2l7J85J39j5j57l62J86Q5M20k70j52J17l38J39j3K17j94
5525a20j06K57o9j8j00n8J69J26L8j17k1k01M96l00J64k7J11l31J01K12j83k23
5547b00rK34j53L05k95K37q2k43J15mJ59o0J13m4k27J16J6o1J95j35k9L11m23
5570a64Q4M2K27j6j15P1j57P4k46J76J35l8k11l9K47N6l56M00l1k67N3J77k26
5593a24K78Lm15L20j38K41j59QQ1P6K45m06j46Q0J46n0n9J48PK3l87L15J31j28
5617I0k14RJ4j84J11K36q7r0L50k77R6j4K00k13J61k65p3M10l24n6j06J17k31
5640c40M47j63m8Q8q2K96L8l94L63k87Q6K9mO7Q4m75M49k43J44J66l27J93l3k44
$$ plain form
5664 -190 151 -66 228 -95 201 -273 -331 -202 13 -16 97 -56 168 5 -104 114 -183 -27 305 140 -43
5685 -43 45 195 21 -70 17 95 -69 -119 -219 70 95 -101 140 -68 0 169 7 -94 -121 144 -93 -54 111
5708 111 166 -18 86 -2 86 1 179 87 81 -5 -66 -214 92 -221 -79 107 197 141 302 -165 -102 255 -112 -19
5732 -19 -111 -197 -80 145 -67 101 -35 147 -25 31 -127 -225 32 226 -8 412 -261 75 -235 88 -184 190
5754 190 70 173 7 -139 -120 9 272 62 -76 66 -179 -134 -47 -149 -166 -130 -14 18 13 -291 76 -145 -165
5777 -165 40 12 -2 147 313 365 36 125 372 267 223 -103 -34 -27 197 272 255 163 -307 -178 -147 -276 121 -3
5801 -3 -121 -147 -70 -152 -189 -68 49 197 -142 -325 18 48 -69 -79 -118 -109 68 -139 414 -152 136 63 -110 -132
5825 -132 -144 297 -88 -14 180 21 -133 84 194 72 144 209 -82 74 140 336 -141 -221 58 -156 -74 -120 16
$$ packed form
5664a90L41k17K94l23K96m74n8J29K15k9J13j53K24j63j09K18k97J56L32j65j83
5685d3Q8J50j74r1Q7P8j64n0j00K89K5j96K41k08O8J69j62j01k7K65k37L9J65
5708A11N5j84J04q8Q8q5J78r2oq6o1j48L06l13J42J86R0n6J61m67O3L57l67R3
5732a9r2q6J17K25k12J68j36J82j72N6j58r8K57J94k34M20o73L36l10L23k72L74
5754A90j20J03j66j46J9J29K63k10j38J42k45M5Q7j02j7L6J16L2nl04L67k21k0
5777a65K05k8j4J49J66N2l29Q9K47j05m4l26O9PK24P5j7r2m70J29L1j29L97j24
5801cj18k6P7q2l7J21J17J48l39j83L43L0j17j0l9RJ77k07N53n66K88p3j73k2
5825a32j2M41l85P4J94j59j54K17J10j22P2O5k91J56O6J96m77q0K79k14Q2m6J36
$$ plain form
5848 16 -60 -48 80 -133 -121 30 207 69 -39 -142 147 -73 163 223 119 14 41 -54 37 -63 -203 24 156
5871 156 -32 -57 17 -60 84 -26 -1 134 113 213 224 109 108 152 -98 -71 114 -120 -202 -186 -52 -219 -15 -283
5895 -283 -59 -266 71 343 152 -183 345 196 -32 7 -182 96 100 -109 115 67 251 -200 37 320 -61
5916 -61 -32 -3 315 -309 354 29 121 120 -57 330 272 -132 -89 151 -373 -160 179 -219 -340 -278 20 179 -377
5939 -377 245 262 -205 -272 34 -101 -18 133 -43 -216 -52 -128 -323 227 -16 48 -208 93 -87 116 93 160
5961 160 148 59 91 -56 306 -47 -47 114 -207 165 -128 -38 76 -26 -145 13 86 -47 -128 -44 9 -126 -41 -20
5985 -20 -90 287 86 94 154 -232 196 18 117 -140 41 -48 211 178 108 -126 23 -58 17 -320 59 52 103 -126 -9
6010 -9 -190 131 28 -57 157 -132 49 -91 -96 -210 18 53 172 48 -28 -7 -94 24 -28 -99 -69 148 148 -112 72
$$ packed form
5848A6p6J2J28k13J2J51J77j38j08j03K89k20K36O0j04j05K7r5R1j00j40K27J32
5871A56j88k5P4p7J44j10K5J35k1J00J1j15jM4k50K7J85k34q2J6J34j67K04k68
5895b83K24k07L37K72j91l35N28j49k28L9j89K78Mk09K24m8J84m51K37K83l81
5916f1K9K9L18o24O63l25R2jj77L87n8m04M3K40n24K13L39l98j21O2K98J59n56
5939c77O22J7m67o7L06j35Q3J51j76j73J64p6j95N50k43O4k56L01j80K03k3O7
5961A60j2q9L2j47L62l53%J61l21L72k93R0J14j02j19J58P3j33q1Q4N3j35Q5K1
5985b0p0L77k01QO0l86M28j78R9k57J81q9K59l3p0k34J49q1P5l37L79pN1k29J17
6010ij81L21j03q5K14k89J81j40nj14K28L5J19j24p6K1q7J18n2p1L0K17%k60J84
$$ plain form
6035 72 -50 -17 364 -397 -223 586 -331 -45 85 137 -180 -380 322 -297 124 -267 559 35 172 270 221 -110
6057 -110 184 -184 -214 -132 -330 58 -168 478 501 245 -560 -167 144 -702 193 -338 -176 -141 1 -468 -388 -248
6079 -248 -370 264 -254 -29 179 272 170 116 -205 -177 376 83 180 172 519 -177 211 359 -71 131 213 -258
6101 -258 -41 -189 276 -254 -61 14 -167 168 43 -146 13 23 108 -94 -71 -279 -17 -109 -101 62 -70 195
6123 195 -97 3 -199 -13 -83 194 -57 -146 82 -19 24 15 19 -96 194 123 100 -10 -160 -52 129 110 54 59
6147 59 -20 -223 179 2 -8 196 -132 -30 -207 84 -194 -99 133 10 -44 -109 167 -7 3 8 -175 -18 10
6170 10 -180 -62 72 100 21 119 -142 -45 -126 19 122 -122 -102 -140 74 142 268 -55 -241 30 535 -59 -348
6193 -348 266 321 107 -690 -198 164 604 -133 -141 150 -405 -107 -128 82 203 68 -22 92 -178 180 -190 -180
$$ packed form
6035G2j22L3L81p61J74Q09r17K86J30N2l17k00P02o19M21l91Q26n24J37R8m9l31
6057a10K94l68l0Q2j98L88k26O46K3k56q05L93L11q46Q95n31J62L5J42m69Q0J40
6079b48j22O34n18K25K08R3j02n4l21K8N53k93R7qL47o96L88J48m30K02Q2m71
6101b58K17j48M65n30J93P5j81L35j25j89J59J0Q5k02K3k08K62r2QJ63j32K65
6123A95k92J00k02J86p0K77k51q9K28j01M3rMj15K90p1k3j10j50J08J81j9n6N
6147E9p9k03M02j77j0K04l28J02j77K91k78R5K32j23n4o5K76j74J0Nj83J57K8
6170A0j90J18J34K8p9R8k61R7q1J45J03k44K0l8K14O8J26l23j86K71N05n94k89
6193c48O14N5k14p97M92L62M40p37qK91n55K98k1K10J21j35r0J14k70L58l70J0
$$ plain form
6215 -180 -186 -59 38 -305 390 241 -292 -414 260 -317 117 -268 86 -411 131 -136 269 -141 -14 333 -284
6236 -284 279 -195 358 15 -386 -288 -534 -421 -44 -379 75 -274 13 586 -440 -247 -40 -805 -621 -68
6256 -68 -360 45 22 -487 288 -49 220 -127 -254 -103 501 62 -58 -78 -325 342 56 -247 -220 -643 -218
6277 -218 11 -382 -414 -418 24 -285 141 -246 -285 -196 137 274 -438 523 195 -436 115 -48 -769 695 144
6298 144 -409 -311 -334 496 -268 -306 130 -50 -546 -1186 307 -227 178 -1104 -57 86 123 565 -418 -781
6318 -781 -508 -511 192 513 -155 -284 -652 -688 328 -775 199 535 -430 -593 96 -596 1549 617 -37 -168
6338 -168 -123 -684 -774 709 -102 646 -123 -602 -248 208 449 -819 -213 369 308 -670 -402 -134 -493 206
6358 206 -35 -129 -280 -151 -70 463 -20 -887 -398 326 237 82 1713 130 -357 -282 -548 396 125 354 -591
$$ packed form
6215a80oJ27R7l43O95j49n33j22O74n77M34l85L54m97N42k67M05m10J27L47o17
6236b84N63m74N53l43m01R8k46J13L77l35M54l49K87N73j026J93K07p65J84N53
6256f8k92M05k3n09P75l37K69l47j27J51O04m39j20k0k47O67k86l03K7m23M25
6277b18K29l93l2mM42l09M26l87l9Q9L33J37p12R61l28o31N51j63p21J464n51
6298A44n53R8k3Q30p64l8M36j80m96o40J493n34M05j282J047J43L7M42r83l63
6318g81K73lP03L21o68j29l68l6J016j103R74L36r65j63O89o92K145r32o54j31
6338a68M5n61r0J483q11P48p69m79L54M56K41j268O06N82o1r78K68K68l59O99
6358B06k41r4j51J29Q1N33m83q67M89P24q9j55J631j583m87P5k66R44k71K29r45
$$ plain form
6379 -591 329 -339 -201 -381 -312 344 -220 340 220 -65 90 23 186 -51 -143 -10 559 -122 -75 76 -165
6400 -165 -18 73 -245 -362 -160 -24 231 -132 -175 -160 -309 81 -165 -835 -232 -139 368 160 -339 247 -466
6421 -466 -256 -628 194 -467 -222 278 222 108 -914 72 -401 131 57 926 -472 128 -409 63 -830 529
6441 529 -65 27 -359 428 -356 -579 -29 -718 -9 43 -680 221 482 -439 -458 23 -83 -159 117 -294 191
6462 191 -19 106 -227 9 -80 194 -280 156 -112 -292 -93 26 20 70 -53 69 -10 -28 46 213 -268 70
6484 70 112 106 -225 38 -82 136 -210 103 321 -284 -112 -139 177 -53 -186 69 62 -275 -117 113 -279 -478
6506 -478 -73 -60 85 -211 -51 142 -253 -91 -110 125 35 466 -182 167 20 88 137 -211 14 -9 64 24 46
6529 46 45 -97 75 -95 199 -18 -67 113 -145 113 38 -146 240 43 86 -36 -8 -12 -66 70 188 51 -257
$$ packed form
6379e91R20o68J38j80O9O56n64N60j20k85J55o7J63k37r2J33N69o81M7J51k41
6400a65J47R1l18j17K02J36K55l63m3J5j49L90k46o70O03R3N07k08m99N86p13
6421d66K10l72Q22o61K45N00n6j14j022R86m73N32p4Q69j398O00n37M72q93J359
6441E29n94R2l86P87p84k23N50o89P09N2p23R01K61r21j9M81j06p6K76m11M85
6462A91k10J25l33K36q9K74m74M36k68j80J99J19oN0j23J22p9j8P4J67m81L38
6484G0M2ol31K63j20K18l46L13K18o05J72k7L16k30j33K55pl37J58K30l92j99
6506d78M05J3J45k96J60J93l95J62j9K35r0M31o48L49j47O8M9l48K25k3P3m0K2
6529D6jj42J72j70K94k17m9J80k58K58p5j84L86j97M3j22K8mn4J36J18j37l08
$$ plain form
6552 -257 -280 57 -217 -30 -21 29 29 366 9 269 279 30 12 -165 -115 5 32 -37 69 290 35 -207 124 -174
6576 -174 2 -176 147 -162 80 241 -139 -107 -24 35 153 -338 303 -157 -5 -92 217 68 -28 3 26 -218
6598 -218 -97 -46 -200 -175 -360 280 -254 -31 -49 256 -128 -25 -17 -75 -246 59 -63 -116 -146 -162 -136 194 -174
6621 -174 24 127 56 -6 -65 -47 -143 238 117 4 -32 -187 -293 -18 -71 -112 -42 -63 58 -2 10 -74 -91 130 -131
6646 -131 166 -248 18 69 -123 -237 -293 -109 161 -198 85 -114 137 -160 -190 -15 -119 -6 126 -46 -225
6667 -225 -83 -198 96 9 -140 29 -48 122 116 -96 104 146 5 -115 -2 175 120 -154 -29 -107 195 -229
6689 -229 193 59 -5 -236 125 -122 175 -37 120 -152 -88 28 32 63 -89 -111 -109 70 -137 -203 73 69 71 216
6713 216 -23 4 221 -108 -46 179 170 97 -142 -210 -62 248 -82 -181 89 47 -31 -109 56 154 -137 -74 -2 391
$$ packed form
6552b57k3L37k74J87RN0%L37l57K60J0k49j8j77N0J20K7o9J06K21k55k42L31k98
6576a74J76j78L23l09K42J61l80L2Q3N9J18m91O41m60J52q7L09j49r6L1K3k44
6598b18J21N1j54K5j85O40n34K23j8L05l84J03Qn8j71L05j22n3l0j6K6L30l68
6621a74J98J03p1o2n9J8r6L81j21j13l6j55j06K75n3m1P0k1J21o0J2q4j7K21k61
6646a31K97m14K66N1j92j14n6J84K70l59K83j99K51k97l0J75j04J13J32j72j79
6667b25J42j15K94q7j49J69p7J70ok12K00M2j41j20J13J77n5k74J25p8L02m24
6689b29M22j34o4k31L61k47K97k12J57k72O4J16ML1j52k2KJ79k07o6K76mKJ45
6713B16k39K7K17l29O2K25rp3k39o8J48L10l30r9K70m2p8p8J65R8k91O3P2L93
$$ plain form
6737 391 253 -42 -14 133 -72 253 -151 -193 173 -215 47 78 10 -1 111 228 116 24 -3 63 56 -127 6
6760 6 88 50 0 -113 80 -155 318 -4 -153 3 279 241 -71 -23 201 185 -167 59 84 -149 199 -26 85
6783 85 -119 132 231 57 -154 -128 299 -74 23 252 -203 -356 373 -29 16 44 151 -81 -97 158 100 -70 -105
6806 -105 161 292 -79 37 -18 45 -29 12 147 -109 54 -95 46 -50 -25 34 -153 3 -13 -58 139 -70 -315
6829 -315 75 -88 82 92 -119 54 38 51 190 -3 217 133 -22 -68 47 82 117 25 183 215 25 71 29 114
6853 114 -103 35 90 -175 -100 -14 -31 95 104 -43 108 -220 43 292 -31 -34 -55 3 -13 50 -93 -193 -217 -75
6877 -75 -79 -364 -41 -40 -2 28 51 50 218 -22 124 352 45 20 -138 123 -111 111 -243 25 64 274 81 -90
6901 -90 126 -90 169 195 -151 163 -33 -35 -292 -133 61 130 338 96 -160 -36 17 -129 -341 30 -81 -155
$$ packed form
6737C91j38k95K8J47k05L25m04m2L66l88K62L1o8j1J12J17j12r2k7O6pj83J33
6760FQ2l8n0j13J93k35M73l22j49J56K76l8l12M8K24j6l52K26K5k33L48k25J11
6783H5k04K51R9j74k11K6M27l73R7K29m55j53P29m02M5K8J07k32j6K55n8j70l5
6806a05K66J31l71J16n5O3p4M1J35k56J63j49J41r6K5N9j87J56j6m5J97k09k45
6829c15L90j63J70J0k11J73j6J3J39j93K20q4j55m6J15L5L5r2J58L2j90M6m2Q5
6853A14k17J38N5k65P5Q6j7J26Rj47J51l28K63K49l23lk1N8j6O3j43j00k4J42
6877g5mk85L23JL8L0K3jJ68k40J46K28l07k5j58K61k34K22l54K68L9K10j93j71
6901i0K16k16K59K6l46L14j96kk57J59J94O9K08k42k56J24N3j46k12L71j11p4
$$ plain form
6923 -155 223 -100 32 -284 -92 130 -53 -172 510 48 -30 -92 -46 5 284 198 -151 -118 162 -270 -119 -40
6945 -40 -74 77 67 73 207 34 206 295 -261 -172 -45 -74 -128 12 -19 206 -12 48 -45 422 101 -413 53 -19
6969 -19 74 142 157 -66 -78 -250 -125 200 213 -306 253 322 200 -88 187 -22 -98 -278 -42 -94 -9 -130 -432
6992 -432 -171 -8 -23 -7 251 -169 -110 -256 -105 67 -207 -236 220 157 -103 146 173 -218 -106 -192 21 -210
7014 -210 115 -18 151 -55 173 -32 15 280 -35 -42 -201 228 -165 199 -57 509 -358 275 165 81 363
7035 363 -4 -20 -292 343 229 112 93 205 449 -104 -273 240 283 -393 -95 -135 315 -15 226 87 16 45
7057 45 247 184 50 485 159 -138 183 339 56 -30 174 -45 165 473 197 -34 -224 -288 -134 -40 -20 33
7079 33 -206 -1 -163 -120 -33 36 -135 249 -277 421 -192 178 -8 -32 134 -29 233 -40 500 8 -27 558
$$ packed form
6923a55L78l23J32l16J92K22j83j19O82m62p8o2M6N1K79q6l49L3K80m32J51P9
6945d0l4J51j0OJ34j73J72Q9n56Q9J27k9n4J40l1K25k18O0r3M67l21n14M66p2
6969a9R3O8J5k23j2j72J25L25J3n19N59O9j22k88K75k09p6j80K36n2Q5j21l02
6992d32K61J63j5J6K58m20N9j46J51J72k74k9M56o3k60K49K7l91J12q6K13k31
7014b10L25j33J69k06K28k05M7K65l15pj59M29l93L64k56N66q67O33j10q4K82
7035C63l67j6k72O35j14j17j9J12K44n53j69N13M3o76K98m0M50l30K41j39p1K9
7057D5K02o3j34M35l26k97L21J56k83q6K04k19K10L08k76k31j90o4J54R4K0N3
7079C3k39K05j62M3Q7O9j71L84n26O98o13L70j86k4J66j63K62k73N40m92l5N85
$$ plain form
7101 558 -326 210 -372 -178 -28 219 76 339 256 320 -432 -107 377 -39 -151 -73 45 187 -362 -119 230
7122 230 -46 16 -247 67 219 -154 -333 -55 201 -106 -29 76 -109 -75 341 -115 -25 -65 -75 24 -251 114
7144 114 134 -99 -262 -144 -339 -551 377 41 84 92 -393 419 -89 -114 115 131 106 -42 -15 168 13 247 -174
7167 -174 56 190 -658 -83 -477 403 -392 18 -258 358 329 -9 -89 160 -375 -202 -768 -156 924 138
7187 138 194 287 249 913 473 -1139 -272 -330 -633 -439 -462 280 -89 -736 -43 -356 -95 -950 -80 -1277 -198
7208 -198 202 -465 611 -319 396 -521 1058 86 196 -195 -207 832 -325 -712 352 463 1346 503 -462
7227 -462 -505 -108 7 124 -445 511 -339 -107 740 -993 745 44 748 -212 -23 -417 241 800 -28 -102
7247 -102 458 194 591 -103 -235 -84 -190 156 -159 -90 161 -67 672 -358 271 -144 107 -38 476 -512
$$ packed form
7101E58q84N36n82J94J50K47j43K63q3O4p52L25M84m16j12P8J18J42n49K43L49
7122B30k76O2k63L14J52l73j79K78K56l07P7J05j85L4M16m56R0m0j0R9k75L65
7144A14K0k33j63J18j95k12R28l36M3Qm85Q12n08k5K29J6k5j48K7J83j55K34m21
7167a74K30J34q48N75l94Q80p95M10k76O16k9l38q0K49n35J73n66O12J080p86
7187A38N6R3l8O64m40j612Q67n8l03J94k3P42l69o47O93l13K61q55Q70j197J079
7208a98M00o67J076r30P15r17J579r72J10l91j2J039j157l87J064J11Q83q43r65
7227d62m3L97J15J17n69R56q50K32Q47j733J738p01P04r60J89l94O58N59q28p4
7247a02N60k64L97o94j32J51j06L46l15O9K51k28P39j030O29m15K51j45N14r88
$$ plain form
7267 -512 172 297 277 -69 588 -45 149 -38 110 75 109 -102 -241 247 77 106 -225 222 61 436 239
7288 239 282 -278 434 232 163 -198 -41 -296 55 -149 28 -433 -209 167 466 -199 208 -64 29 195 132
7309 132 -143 -284 -259 526 514 453 -208 -124 -379 -222 -140 108 396 -171 -115 279 116 82 392 229 -257 -135
7331 -135 144 189 -278 -426 465 -2 433 274 -229 -304 233 -388 34 -181 367 -88 590 15 562 -713
7351 -713 -47 264 -225 -153 -92 -380 -405 -240 -629 99 555 -129 -97 167 -60 -201 -326 699 -393 586 419
7372 419 243 -151 115 82 252 -275 133 108 244 196 -79 421 40 -426 249 -27 -170 420 -515 288 6
7393 6 179 -115 5 261 -256 527 -243 -264 -459 206 19 371 17 102 -533 281 -435 247 8 -502 294
7414 294 -81 -41 -134 58 -205 -302 -310 222 -60 540 59 29 -658 50 188 -12 -4 695 40 -279 210 341 -320
$$ packed form
7267e12O84J25k0l46O57o33J94j87J48l5L4k11j39M88j70K9l31M47j61L75j97
7288B39M3n60P12k02o9l61J57k55L51k04J77m61K24L76K99o65M07k72R3J66o3
7309A32k75j41K5P85j2o1o61Q4k55J57Q2K48K88n67N6L94j63l4L10j63m86J22
7331a35K79M5m67j48Q91m67M35j59n03p5N37o21M22k15N48m55O78n75N47j275
7351g13O66L11m89P2O1k88k5J65l89P28M56o84L2K64k27j41j25J025j092R79j67
7372D19j76l94K66l3J70n27M08k5J36m8k75N00l81m66O75k76j43N90r35Q03k82
7393FJ73k94J20K56n17P83p70k1j95O65j87L52l54Q5o35Q14p16O82k39n10P96
7414B94l75M0r3J92k63r7qN32k82O00m81l0o87P08J38k00QO99o55l19M89J31o61
$$ plain form
7437 -320 -785 422 362 226 104 252 -26 63 19 -73 31 195 44 -155 -85 443 145 -50 147 -105 -58 -80
7459 -80 -17 -43 -307 69 -76 29 -95 8 -119 46 -150 63 243 -260 -205 -2 -240 309 -129 -93 170 -92
7481 -92 174 -51 248 -136 -64 316 87 -194 -40 62 145 60 153 121 -190 87 -137 118 -88 -43 249 141
7503 141 104 193 61 162 -21 -48 -305 93 35 -67 3 -103 -11 38 -104 21 -46 13 -132 -185 59 94 208 3
7527 3 221 -57 351 271 241 76 -172 183 -122 149 -90 -46 255 -93 171 178 -61 -58 251 -80 32 75 191
7550 191 -104 117 -82 -32 -87 -3 -9 -44 -152 -257 -213 -215 104 104 -50 -297 62 -99 8 351 -32 102 138 332
7574 332 -56 193 261 -155 224 -161 97 -104 -18 22 -6 -11 205 81 -107 -74 -106 122 -79 168 -221 -121 -60
7597 -60 97 32 -21 155 46 -124 -133 83 -4 -131 -166 133 -191 131 15 73 186 -82 -32 -26 64 -212 -111 134
$$ packed form
7437c20m65J207o0j36j22J48k78Q9m4r2J04J64j51j99P0N28k98j95J97k52M7k2
7459h0O3k6k64L76j45J05j24J03j27J65j96K13J80n03N5K03k38N49m38L6K63k62
7481i2K66k25K99l84P2L80k29k81J54J02Q3q5R3l2l11K77k24K55k06M5K92j08
7503A41l7Q9j32J01j83k7k57L98n8j02P0j06R2M9j42J25o7N9j45n3K44L5J14k05
7527CK18k78M08q0l0j65k48L55l05K71k39M4L01l48K64Pk39LL09l31J12M3J16
7550A91k95K21j99N0n5Q4ol5j08j05M4kL19%j54k47L59j61J07L43l83J34L6J94
7574C32l88K49O8m16L79l85K58k01Q6M0k8nK16j24j88L3l2K28k01K47l89J00O1
7597f0J57o5n3J76j09j70rK16q7j27l5K99l24L22j16N8J13k68N0OR0k76J01K45
$$ plain form
7621 134 -68 -25 -44 66 -90 68 -84 139 16 95 166 -207 -17 -62 106 -152 -242 -56 84 -1 174 -47
7643 -47 81 -86 80 68 46 -218 -206 462 43 -203 111 -93 167 272 -62 -187 -70 207 35 31 -77 -198
7665 -198 50 81 -81 212 86 -24 -46 75 124 -47 -26 44 38 83 -36 -13 125 263 -109 -23 -50 63 16 -144
7689 -144 -367 -167 -127 -160 -185 0 233 -164 34 -111 182 -85 -57 -21 -327 -85 -85 -214 -44 154 -21 94
7711 94 60 28 -175 -228 64 136 -102 -134 66 -13 135 103 271 -128 -49 90 -94 202 -29 77 -261 -281 -276 -1
7735 -1 381 8 -18 235 200 -187 72 191 170 74 -132 11 266 103 104 -157 103 171 -10 177 177 117 -32 94
7759 94 126 0 -135 68 -334 -51 -189 455 -93 132 270 -78 155 -400 57 359 -103 559 12 -148 321
7780 321 -6 -266 -470 -591 49 -123 -271 102 -369 -39 -582 215 496 411 46 151 -232 -2 -238 192
$$ packed form
7621A34k02M3j9J10j56J58j52K23j23P9P1l73J90m5J68k58r0J86J40q5J75k21
7643d7J28j67J66j2k2k64J2O68m19k46L14k04K60J05l34j25J17K77j72mj08j21
7665a98K48L1j62K93j26j10k2J21M9j71K1P0oM5j19K3J38J38l72Q6k7J13m7j60
7689a44k23K00M0l3k5J85K33l97J98j45K93k67K8L6l06K42%j29J70J98j75J15
7711I4l4l2k03n3K92P2k38l2K00p9J48l2J68l99P9J39j84K96k31J06l38k0NK75
7735aL82l73k6K53l5l87K59J19k1r6k06J43K55j63Jk61K60O8j81J87%o0j49J26
7759I4L2j26j35K03m02K83j38O44n48K25J38l48K33n55M57L02m62O62n47j60M69
7780C21l27k60k04j21O40j72j48L73m71L30n43P97K81q5l65J05l83K30k36M30
$$ plain form
7800 192 -304 -87 423 64 -174 -40 20 137 -49 -19 -191 34 60 61 -33 -32 59 163 -507 -184 626 -26 -48
7823 -48 -74 126 334 -577 408 256 232 -276 705 227 356 123 94 -143 -116 90 103 353 266 -433 -249 836
7845 836 -410 18 311 -418 -161 158 102 466 -121 -27 -56 35 48 234 99 142 -45 -402 235 53 -271 -90
7867 -90 -6 280 -133 -20 -20 -70 331 -113 265 189 -204 50 82 107 340 53 119 -228 -226 -33 281 -65 -180 -127
7891 -127 -87 69 168 -122 18 -197 -85 142 -16 62 -150 195 234 -354 -7 -54 -206 -57 -9 -319 39 69
7913 69 -11 1 137 72 -94 192 237 -70 549 -230 -222 -221 308 135 -150 90 91 -127 553 274 105 148 173 5
7937 5 -445 -12 -158 -419 329 -255 276 54 478 333 -214 356 291 -90 146 51 148 33 150 347 -8 90
7959 90 89 -45 85 -30 -132 -30 -383 109 -26 72 -77 -53 105 -60 -34 45 4 167 100 -237 -25 66 86 24
$$ packed form
7800A92m96K17N10l59k38J34O0J17j86L0j72K25K6Jr4JR1J04o70L23Q10o52k2
7823d8k6K00K08r11R85j52k4n08R81m78J29k33k9k37K7K06J3K50q7o99J84J085
7845H36j246M28K93p29K57L19n6L64n87R4k9R1J3J86j35M3j87l57O37j82l24J81
7867i0Q4K86m13J13%n0M01m44L78p6l93K54L2K5K33k87O6l47KJ93L14l46j15N3
7891a27M0J56R9k90J40k15J12K27j58P8k12L45L9n88L47m7j52J49M8l10L58L0
7913F9q0J2J36o5j66K86M5l07O19p79QJN29j73k85K40Jk18O80k79j69M3K5j68
7937Em50M33j46k61P48n84N31k22M24j45n47N70o5l81K36r5R7j15J17J97l55R8
7959I0jj34J30j15j02J02l53M92j35R8j49K4J58j65K6P9m1J63o7l37K12R1K0o2
$$ plain form
7983 24 22 -51 -11 53 125 72 75 -104 -147 -61 177 105 196 59 106 4 142 -36 -60 -40 -272 -218 28 -73 -200 -105
8009 -105 286 -509 -346 -353 39 178 -149 427 318 313 -406 444 -101 41 249 68 211 531 -424 107 102 -44
8031 -44 347 -536 -262 261 -382 420 162 25 -411 -272 888 -127 -400 -94 150 -442 669 -382 -429
8050 -429 335 293 563 65 322 -209 -710 -30 -21 417 -32 648 373 -68 105 -54 113 129 -941 1158 516
8071 516 898 102 -291 192 453 591 -442 -69 221 -128 56 390 -237 -5 -93 -76 51 -429 96 -247
8091 -247 25 50 -44 151 -97 155 149 -40 111 -114 52 51 63 -367 -175 145 100 185 -32 198 -126 -52 -190
8114 -190 101 -193 256 202 46 149 84 36 125 -185 98 -5 239 -144 -29 231 163 249 -170 24 -97 -180
8136 -180 -37 -26 73 -145 -46 -63 102 157 -76 13 31 -19 -23 66 -199 76 170 7 143 140 -47 -203 -111 -212 -182
$$ packed form
7983B4kp3M0O4P2n3Lj79m3Q6K38p2R1j37M7j02J38j78k4K0k32N4K46j01j27R5
8009a05L91p95J63pL92J39l27N76j09np19Q50n45J42K08j81J43L20r55N31nj46
8031d4L91q83K74N23o43Q02k58j37m36J39J160j015k73L06K44n92J111j051m7
8050d29P64m2K70m98K57n31n01O80RM38m49O80k75m41J73j59J67J6j070K099o42
8071E16L82p96l93M83K61J38j033L73K90l49J84L34o27K32q8J7J27m80N25l43
8091b47K72K5r4J95k48K52oj89J51k25J66jJ2m30J92L20m5Q5k17K30l24P4j38
8114a90K91k94M49n4j56J03o5m8Q9l10K83j03K44l83J15K60o8Q6m19J94j21q3
8136a80J43J1R9k18R9j7J65N5k33Q9J8n0mQ9k65K75R4j63J36lj87j56R2j01L0
$$ plain form
8161 -182 21 -67 -91 -181 -37 178 64 -372 144 64 -55 175 -137 132 -188 70 150 -178 58 -145 513 -99
8183 -99 43 -44 24 -197 17 -29 -37 74
$$ packed form
8161a82K03q8k4r0J44K15j14m36N16q0j19K30l12K69l20K58Q0l28K36k03O58o12
8183i9J42q7O8k21K14m6qJ11
8191G4
$$ Imaginary data points
##PAGE= N=2
##DATA TABLE= (X++(I..I)), XYDATA
$$ plain form
0 0 0 0 0 0 0 0 0 -8 8 -8 8 -16 24 -32 32 -48 57 -72 81 -104 127 -152 176 -207 241 -283 329 -377 439 -505
30 -505 578 -658 746 -845 956 -1077 1206 -1350 1513 -1689 1878 -2087 2315 -2564 2837 -3133
46 -3133 3456 -3812 4203 -4627 5099 -5616 6192 -6832 7547 -8357 9274 -10328 11553
59 11553 -12995 14725 -16846 19511 -22975 27691 -34504 45253 -64765 111312 -451441 -2219
71 -2219 928732 -366376 -519428 506395 265300 -613182 200946 643482 -504994 -681096
81 -681096 646583 453636 -679420 -153281 727337 -96946 -555031 379606 392453 -618835
91 -618835 -261245 589194 -19296 -554614 294396 466938 -462594 -283598 620819 124927
101 124927 -661857 -21307 524178 -137918 -302066 329577 118226 -426059 123753 529544
$$ packed form
0@%%%%%%%qJ6j6J6k4M0n6O4q0J05j29J53j85K31k79L28l83M48n24O12p06Q16r44
30e05J083j236J404j591J801k033K283k556K863l202L567l965M402m879N401n970
46c133O589p268Q015q830R726j0715J1808j3024J4379j5904J7631j9602K1881
59A1553k4548K7720l1571L6357m2486N0666o2195P9757j10018J76077n62753M49222
71b219R30951j295108j53052J025823k41095q78482Q14128M42536j148476j76102
81f81096J327679j92947j133056N26139Q80618q24283m58085R34637J2847j011288
91f18835L57590Q50439o08490n35318Q49010J72542r29532J78996R04417m95892
101A24927p86784O40550N45485o62096j64148O31643k11351n44285N49812M05791
$$ plain form
111 529544 -277367 -580908 284581 436298 -319591 -258244 309831 39289 -266120 213041
121 213041 258388 -388802 -242882 445938 156169 -439963 -23970 405492 -82089 -276576
131 -276576 244021 178136 -352844 -96262 343937 -62446 -331577 184285 252680 -297932
141 -297932 -137318 401861 43886 -435774 32026 366723 -124967 -231630 229082 83412
151 83412 -280346 118545 355179 -250400 -372308 302401 280172 -341576 -161450 301454
161 301454 -21375 -234964 215138 163092 -360220 -83331 418301 -23582 -400664 140994
171 140994 327222 -222387 -166576 319774 27133 -342361 107351 285316 -244995 -203226
181 -203226 315777 58331 -361488 82443 351340 -198606 -287034 261547 158659 -281596
$$ packed form
111E29544q06911l03541Q65489J51717p55889O1347N68075k70542l05409M79161
121B13041M5347o47190J45920O88820k89769n96132M15993M29462m87581j94487
131b76576N20597o5885n30980K56582M40199m06383k69131N15862O8395n50612
141b97932J60614N39179l57975m79660M67800L34697m91690j06663M60712j45670
151H3412l63758L98891K36634o05579j21908O74709k2229o21748J80126M62904
161C01454l22829k13589M50102n2046n23312K76889N01632m41883l77082N41658
171A40994J86228n49609N5811M86350k92641l69494M49712J77965n30311M1769
181b03226N19003k57446m19819M43931K68897n49946q8428N48581j02888m40255
$$ plain form
191 -281596 2905 266577 -151059 -193742 301511 135842 -362555 -48177 353500 -54208
201 -54208 -291576 133456 158236 -219559 -26589 261837 -103156 -270186 191622 219939
211 219939 -247712 -130769 266384 27330 -231785 100156 195038 -176046 -110481 230109
221 230109 17789 -245283 69048 209098 -162726 -164621 211531 86661 -235833 -13210
231 -13210 207080 -71246 -152022 145483 81636 -192556 7997 233095 -63051 -213421
241 -213421 122395 173059 -152702 -100908 160477 3812 -165850 74566 137880 -153842
251 -153842 -110261 190252 53662 -206927 7125 191808 -67000 -143790 133480 97982
261 97982 -161536 -19423 184938 -47331 -171673 114188 132048 -174348 -85411 196418
$$ packed form
191b81596K84501K63672m17636m2683M95253j65669m98397L14378M01677m07708
201e4208k37368M25032K4780l77795J92970K88426l64993j67030M61808K8317
211B19939m67651J16943L97153k39054k59115L31941R4882l71084O5565L40590
221B30109k12320k63072L14331J40050l71824j895L76152j24870l22494K22623
231a3210K20290k78326q0776K97505o3847k74192K00553K25098k96146j50370
241b13421L35816N0664l25761N1794K61385j56665j69662K40416O3314k91722
251a53842M3581L00513j36590k60589K14052J84683k58808p6790K77270l5498
261I7982k59518J42113K04361k32269j24342K85861J7860l06396Q8937K81829
$$ plain form
271 196418 9444 -207427 51286 170574 -122558 -117495 173842 42691 -200072 47258
281 47258 210617 -113781 -168791 182463 116378 -209054 -30858 212555 -63338 -189335
291 -189335 141884 125446 -214432 -58623 235454 -35994 -232831 115202 185656 -182019
301 -182019 -107295 228939 22997 -225150 82674 204695 -158107 -135049 221227 52417
311 52417 -246202 35294 225734 -127887 -184043 183753 95954 -227461 -7140 223748
321 223748 -89528 -189090 171748 131671 -214532 -41348 239152 -37214 -209524 124517
331 124517 160069 -183603 -83029 212605 -10464 -217481 87070 173873 -164910 -121608
341 -121608 200398 38789 -215146 42088 195683 -111540 -139191 174199 78120 -192808
$$ packed form
271A96418j86974k16871K58713J19288k93132N063K91337j31151k42763K47330
281D7258J63359l24398n5010L51254o6085l25432J78196K43413k75893j25997
291a89335L31219j6438l39878J55809K94077k71448j96837L48033P0454l67675
301a82019P4724L36234k05942k48147L07824J22021l62802K3058L56276j68810
311E2417k98619K81496J90440l53621n6156L67796q7799l23415K20321K30888
321B23748l13276r9562L60838m0077l46203J73184K80500k76366j72310L34041
331A24517L5552l43672J00574K95634k23069k07017L04551Q6803l38783M3302
341a21608L22006j61609k53935K57234J53595l07223k7651L13390r6079k70928
$$ plain form
351 -192808 9234 198574 -78300 -165462 140064 111008 -181937 -48800 185207 -32480
361 -32480 -177635 90624 129464 -147570 -76412 175241 11815 -176139 58283 162307
371 162307 -105189 -110505 152567 60701 -163886 7748 159708 -70983 -135912 117418 84917
382 84917 -160491 -38075 164895 -29684 -160477 81422 124974 -125895 -70989 158423
392 158423 16362 -157126 55510 149824 -103819 -106960 150021 55958 -169704 3698 160181
403 160181 -72205 -139173 116813 82116 -160776 -27376 168707 -40726 -157273 102233
413 102233 125328 -141003 -62902 171390 6169 -160459 66929 138259 -120223 -90143 158203
424 158203 25280 -178713 32600 158260 -99018 -127103 135195 63448 -161362 3377
$$ packed form
351a92808K02042J89340k76874q7162L05526k9056k92945J33137K34007k17687
361c2480j45155K68259L8840k77034P1158K51653j63426j87954K34422J04024
371A62307k67496n316K63072r1866k24587J71634J51960k30691o4929K53330l2501
382H4917k45408J22416K02970j94579j30793K41899M3552k50869N4906K29412
392A58423j42061j73488K12636R4314k53643l141K56981r4063k25662J73402J56483
403A60181k32386o6968K55986l4697k42892J33400J96083k09433j16547K59506
413A02233K3095k66331P8101K34292j65221j66628K27388P1330k58482L0080K48346
424A58203j32923k03993K11313J25660k57278k8085K62298p1747k24810J64739
$$ plain form
434 3377 160748 -68402 -130460 131664 92565 -159451 -25333 174125 -32516 -152037 92057
445 92057 108482 -139171 -54071 155082 -19064 -160577 74416 125538 -129758 -82756 156891
456 156891 23512 -158416 42757 143428 -89546 -92601 136038 42616 -149555 24414
466 24414 147085 -80673 -123961 117838 75219 -145141 -27995 135856 -38211 -120218 87944
477 87944 79794 -127188 -31238 151123 -11949 -139286 62815 119747 -90461 -70110 116049
488 116049 19138 -122577 34924 108848 -86218 -89846 111905 44590 -134533 -6735 126317
499 126317 -40501 -106550 80149 74615 -101877 -23052 120070 -20201 -108375 72834 94602
510 94602 -105941 -62936 124478 21464 -128278 15575 101281 -65597 -72997 96275 23337
$$ packed form
434C377J57371k29150o2058K62124l9099k52016J34118J99458k06641j19521K44094
445I2057J6425k47653Q5100K09153j74146j41513K34993N1122k55296M7002K39647
456A56891j33379j81928K01173J00671k32974l055K28639r3422j92171J73969
466B4414J22671k27758m3288K41799m2619k20360J17146J63851j74067q2007K08162
477H7944q150k06982R5950J82361j63072j27337K02101N6932k10208K0351J86159
488A16049r6911j41715J57501P3924j95066l628K01751o7315j79123J27798J33052
499A26317j66818o6049J86699n534j76492P8825J43122j40271q8174J81209K1768
510I4602k00543M3005J87414j03014j49742J43853Q5706j66878p400J69272p2938
$$ plain form
521 23337 -123574 20174 131105 -56829 -113039 92328 85618 -101070 -29205 111050 -19459
532 -19459 -97938 73165 75727 -113290 -46709 128526 463 -136178 35259 108514 -80104
543 -80104 -76255 105731 29572 -114351 25103 112237 -68853 -79996 114134 49895 -131513
554 -131513 -3752 136565 -36235 -115922 68754 69624 -100904 -21103 107793 -42806 -112727
565 -112727 87365 95350 -119072 -63189 130842 22851 -113363 34635 91068 -75693 -45364
576 -45364 115559 6680 -132006 34034 124646 -73948 -101291 93858 50472 -113335 -5654
587 -5654 105487 -46012 -87553 85726 56063 -108246 -9577 124935 -26821 -112439 67397
598 67397 94549 -85892 -55293 92462 5963 -89293 38862 67536 -89674 -52191 113680
$$ packed form
521B3337j46911J43748J10931j87934n6210K05367o710j86688P1865J40255j30509
532a9459p8479J71103K562j89017O6581J75235j28063j36641J71437P3255j88618
543h0104L849J81986p6159j43923J39454Q7134j81090j1143J94130o4239j81408
554a31513J27761J40317j72800p9687J84676Q70j70528P9801J28896j50599o9921
565a12727K00092P985k14422N5883J94031j07991j36214J47998N6433j66761L0329
576d5364J60923j08879j38686J66040R0612j98594k7343J95149m3386j63807J07681
587e654J11141j51499m1541J73279k9663j64309R8669J34512j51756q5618J79836
598F7397K7152j80441L0599J47755q6499r5256J28155K8674j57210L7483J65871
$$ plain form
609 113680 22108 -125617 3383 111219 -30027 -75218 61057 38119 -77408 12804 96379
620 96379 -45879 -91295 76702 75348 -93323 -47384 91942 3165 -90237 29692 66238
631 66238 -68106 -43009 88266 8673 -96069 30237 96000 -57203 -73601 86065 53728
642 53728 -88989 -15436 85555 -21876 -67189 58139 36450 -95240 -12572 107071 -20758
653 -20758 -111698 39423 88961 -58132 -52130 72108 9576 -73158 41766 76022 -73177
664 -73177 -57640 100097 36880 -104070 -5589 92582 -32423 -74144 58336 37152 -85857
675 -85857 -5888 89155 -34652 -83367 67433 64627 -87418 -31559 101873 4750 -88967
686 -88967 33976 70608 -59137 -34529 81178 -5675 -94222 38062 85728 -70391 -74951
$$ packed form
609A13680r1572j47725J29000J07836j41246m5191J36275k2938j15527R0212Q3575
620I6379j42258m5416J67997j354j68671M5939J39326q8777r3402J19929L6546
631F6238j34344K5097J31275p9593j04742J26306O5763j53203j6398J59666l2337
642E3728j42717P3553J00991j07431m5313J25328k1689j31690Q2668J19643j27829
653b0758r0940J51121M9538j47093O002J24238o2532q2734J14924L4256j49199
664g3177J5537J57737o3217j40950R8481R8171j25005m1721J32480k1184j23009
675h5857P9969R5043j23807m8715J50800k806j52045N5859J33432r7123r3717
686h8967J22943L6632j29745K4608J15707q6853q8547J32284M7666j56119m560
$$ plain form
697 -74951 79173 39725 -83279 -3016 71809 -36785 -50783 74612 31216 -90062 208
708 208 99713 -21027 -83926 46830 59414 -64661 -27642 69687 -12439 -73018 39003 55154
720 55154 -68215 -37840 80020 10259 -82404 18400 76259 -37418 -50941 59454 27330
731 27330 -62247 9702 65172 -38940 -56959 61326 38975 -78756 -23410 73479 -6894
742 -6894 -66805 28277 42585 -52231 -17522 69030 -5556 -70600 33550 69577 -46154 -47166
754 -47166 62140 24641 -63608 4891 57436 -35138 -48863 52350 24826 -71152 -6815 70125
766 70125 -20624 -65266 41204 49702 -53685 -22444 64683 -179 -57160 32069 50696 -52528
778 -52528 -31549 68455 9273 -75121 10119 62946 -36397 -50391 48439 20409 -63098 5213
$$ packed form
697g4951J54124l9448j23004Q0263P4825j08594j3998J25395m3396j21278R0270
708B08R9505j20740o2899J30756J2584j24075L7019R7329q2126o0579J12021J6151
720E5154j23369L0375J17860o9761r2663J00804N7859j13677j3523J10395l2124
731B7330q9577P1949N5470j04112j8019J18285k2351j17731N5346R6889q0373
742f894n9911R5082J4308r4816L4709Q6552p4586o5044J04150L6027j15731j012
754d7166J09306l7499q8249O8499N2545r2574j3725J01213k7524r5978O4337P6940
766G0125r0749m4642J06470Q498j03387L1241Q7127o4862n6981Q9229J8627j03224
778e2528K0979J00004n9182q4394Q5240N2827r9343j3994R8830k8030q3507O8311
$$ plain form
790 5213 63995 -31595 -54667 55719 41812 -63149 -13342 70757 -8953 -59136 36334 43664
802 43664 -56058 -22703 64455 -6869 -69894 26525 54898 -51842 -39733 61825 14092 -64846
814 -64846 13472 60720 -34244 -40790 57661 24176 -63549 4303 66588 -26501 -56241 44018
826 44018 35581 -59429 -16216 57992 -14068 -57954 33522 41547 -52958 -22942 63048 3262
838 3262 -59396 23446 54282 -37218 -32740 54359 14617 -57861 9330 53494 -32970 -45450
850 -45450 45268 23156 -59277 -6747 55757 -18221 -50737 36658 36647 -48387 -13894 58152 -3609
863 -3609 -51564 28815 46095 -41881 -27676 52834 7439 -57067 11196 47896 -34388 -39359
875 -39359 44117 16997 -54859 998 53208 -20807 -43627 39770 32643 -47119 -9102 55430
$$ packed form
790E213N8782r5590k3072J10386j3907j04961M9807Q4099p9710n0183R5470P330
802D3664r9722L3355Q7158p1324o3025R6419K8373j06740J2109J01558m7733p8938
814f4846P8318M7248r4964o546R8451l3485q7725O7852O2285r3089k9740J00259
826D4018q437r5010M3213P4208p2060m3886R1476Q025r4505L0016Q5990n9786
838C262o2658Q2842L0836r1500M478Q7099l9742p2478O7191M4164q6464j2480
850d5450R0718k2112q2433N2530O2504p3978l2516Q7395j1q5034L4493P2046o1761
863c609m7955Q0379J7280q7976J4205Q0510m5395o4506O8263L6700q2284m971
875c9359Q3476k7120p1856N5857N2210p4015k2820Q3397p127p9762L8017O4532
$$ plain form
887 55430 -6985 -47677 28749 38176 -43070 -23048 48879 347 -54078 15100 42760 -36272
899 -36272 -33007 45502 13580 -50619 7612 49926 -22870 -36225 42304 25383 -47127 -2382
911 -2382 51578 -14685 -45212 30635 30203 -45952 -16919 46910 -6445 -48835 21827 37176 -38424
924 -38424 -23355 47855 6916 -46652 15244 45054 -27261 -28874 42482 15543 -46232 3526
936 3526 44163 -22513 -38960 33163 21232 -45554 -8300 43537 -12429 -40486 27192 29752
948 29752 -37261 -12314 46429 -742 -40967 21324 37097 -30928 -21454 40275 5086 -43309
960 -43309 9693 35811 -28467 -30779 35873 12380 -44586 1318 41306 -16876 -32598 31819
972 31819 22832 -36912 -2738 43357 -9887 -36900 27164 28575 -37311 -15744 39540 -2743
$$ packed form
887E5430o2415m0692P6426R427q1246K0022P1927m8532n4425O9178K7660p9032
899c6272L265P8509l1922o4199N8231M2314p2796j3355P8529j6921p2510M4745
911b382N3960o6263l0527P5847m32p6155K9033O3829n3355m2390P0662J5349p5600
924c8424J5069P1210m0939n3568O1896K9810p2315j613P1356k6939o1775M9758
936C526M0637o6676j6447P2123j1931o6786L7254N1837n5966k8057O7678K560
948B9752o7013K4947N8743m7171m0225O2291J5773o8025R474O1729l5189m8395
960d3309N3002K6118o4278k312O6652k3493n6966M5904L9988n8182j5722O4417
972C1819q987n9744L4174M6095n3244k7013O4064J411o5886K1567N5284m2283
$$ plain form
984 -2743 -41741 14651 30251 -31309 -20771 38066 4236 -41630 11911 40084 -22595 -27465
996 -27465 36334 17865 -36848 1568 38577 -15903 -31694 29314 19182 -41173 -8510 40401
1008 40401 -10073 -40979 19559 28921 -31807 -15980 37878 882 -36006 18448 34981 -28689
1020 -28689 -21477 40865 11718 -42252 3680 38331 -19184 -31588 28102 14008 -39765 -1348
1032 -1348 39083 -17121 -37539 29034 28701 -36487 -13308 42378 1360 -36108 18683 31043
1044 31043 -29767 -16198 39746 1737 -44484 10895 38343 -26852 -33327 31831 15972 -38915
1056 -38915 -1481 36214 -15838 -29069 32333 21096 -39268 -4977 47138 -4729 -40829 20062
1068 20062 32500 -29012 -18177 33867 -2202 -38387 15690 31830 -33283 -26924 39751 13189
$$ packed form
984b743l8998N6392J5600o1560J0538N8837l3830m5866N3541K8173o2679m870
996b7465O3799j8469n4713L8416L7009n4480j5791O1008j0132o0355L2663M8911
1008D0401n0474l0906O0538R362o0728J5827N3858l6996l6888N4454J6533o3670
1020b8689P212O2342k9147n3970M5932L4651n7515j2404N9690j4094n3773L8417
1032a348M0431n6204k0418O6573l33o5188K3179N5686m1018l7468N4791J2360
1044C1043o0810J3569N5944l8009m6221N5379K7448o5195o475O5158j5859n4887
1056c8915L7434L7695n2052j3231O1402j1237o0364L4291N2115n1867l6100O0891
1068B0062J2438o1512J0835N2044l6069l6185N4077J6140o5113O359O6675k6562
$$ plain form
1080 13189 -42796 1208 40343 -13479 -27558 29624 17248 -34729 1450 40619 -14959 -37202
1092 -37202 27441 28399 -37904 -18941 37457 194 -37301 12041 26106 -27551 -15054 37800
1104 37800 2230 -40310 13182 41918 -20283 -30430 30386 20010 -31066 -2119 29814 -15432
1116 -15432 -26842 26941 16162 -39917 -10314 39940 -3640 -38857 13176 29076 -21486 -14104
1128 -14104 30269 2476 -29017 15786 30798 -24962 -22526 34193 13385 -37274 -3602 32060
1140 32060 -10948 -27494 17486 12731 -28212 -1699 31829 -12006 -31488 24197 29130 -27182
1152 -27182 -17267 32070 8410 -26604 7666 21522 -20159 -13087 29278 1854 -37542 4311
1164 4311 33728 -15878 -29974 19301 17355 -24001 -3222 25815 -8793 -20567 23643 18411
$$ packed form
1080A3189n5985M4004L9135n3822j4079N7182j2376n1977L6179L9169n5578k2243
1092c7202O4643R58o6303J8963N6398l7263l7495M9342J4065n3657J2497N2854
1104C7800l5570m2540N3492K8736o2201j0147O0816j0376n1076K8947L1933m5246
1116a5432j1410N3783j0779n6079K9603N0254m3580l5217N2033J5900n0562P382
1128a4104M4373k7793l1493M4803J5012n5760K436N6719k0808n0659L3672L5662
1140C2060m3008j6546M4980m755m0943K6513L3528m3835j9482N5685M933n6312
1152b7182R915M9337k3660l5014L4270J3856m1681P072M2365k7424l9396M1853
1164D311K9417m9606j4096M9275j946m1356K0779K9037l4608j1774M4210n232
$$ plain form
1176 18411 -28813 -7527 34536 -439 -32087 9084 24311 -18468 -16259 20631 35 -26051
1188 -26051 10222 22384 -23262 -18837 30351 12713 -30374 -1599 29826 -4686 -18183 17348
1200 17348 10284 -22705 2884 27065 -13670 -28277 18872 20280 -25715 -14806 23254 882
1212 882 -22186 9626 15763 -19235 -6630 27946 1061 -27014 10621 27477 -14606 -19231 19697
1225 19697 9944 -21873 -503 17878 -13193 -16335 19168 7055 -27441 -2215 27470 -5102
1237 -5102 -24051 12049 18982 -14026 -6030 19819 -2156 -17597 14881 17015 -21209 -13127 24140
1250 24140 5146 -26269 -308 18745 -10730 -14445 15492 4630 -20718 4429 23183 -10429
1262 -10429 -18543 19607 16590 -19830 -6156 22599 -944 -18953 9674 12439 -18547 -7354
$$ packed form
1176A8411m7224K1286M2063l4975l1648M1171J5227m2779K209L6890k0596k6086
1188b6051L6273J2162m5646M425M9188j7638m3087K8775L1425l4512j3497L5531
1200A7348p064l2989K5589K4181m0735j4607M7149J408m5995J0909L8060k2372
1212H82k3068L1812O137l4998J2605L4576k6885k8075L7635J6856m2083m625L8928
1225A9697r753l1817K1370J8381l1071l142L5503j2113l4496K5226K9685l2572
1237e102j8949L6100O933l3008P996K5849k1975j5441L2478K134l8224Q082L7267
1250B4140j8994l1415K5961J9053k9475l715K9937j0862k5348K5147J8754l3612
1262a0429q114L8150l017l6420J3674K8755k3543j8009K8627K765l0986J1193
$$ plain form
1274 -7354 20523 -3588 -25265 7888 21052 -15847 -16579 18840 8550 -18625 3088 18943
1286 18943 -10209 -12198 20705 8959 -23760 -1339 24711 -6084 -22184 10670 12981 -18669
1298 -18669 -6934 18082 -5130 -19859 12471 16337 -18622 -9673 23800 4702 -21284 6277
1310 6277 20203 -11025 -12084 17908 4590 -20982 3119 19013 -13174 -18555 16752 9983 -22036
1323 -22036 -4680 20386 -4254 -16700 12711 12611 -16384 -2938 22307 -1950 -19659 10949
1335 10949 18156 -15095 -11974 17383 2549 -19706 3349 14873 -13488 -13208 16850 5901 -20283
1348 -20283 794 20651 -6315 -15043 14345 12288 -15589 -2592 19023 -3467 -17091 10581
1360 10581 12657 -17084 -9052 18067 -87 -20596 4309 15538 -11983 -11438 16313 5332 -17288
$$ packed form
1274g354K7877k4111k1677L3153J3164l6899p32L5419j0290k7175K1713J5855
1286A8943k9152j989L2903j1746l2719K2421K6050l0795j6100L2854K311l1650
1298a8669J1735K5016k3212j4729L2330L866l4959Q949L3473j9098k5986K7561
1310F277J3926l1228j059K9992j3318k5572K4101J5894l2187n381L5307o769l2019
1323b2036J7356K5066k4640j2446K9411j00k8995J3446K5245k4257j7709L0608
1335A0949P207l3251L121K9357j4834k2255K3055J1524k8361K80L0058j0949k6184
1348b0283K1077J9857k6966q728K9388k057k7877J2997K1615k2490j3624K7672
1360A0581K076k9741Q032K7119j8154k0509K4905J1229k7521N45K7751j0981k2620
$$ plain form
1373 -17288 3737 19414 -7997 -13678 16123 10781 -17192 -2960 18052 -4455 -16930 9713
1385 9713 10644 -17188 -7207 17562 -1933 -19142 7299 15686 -12766 -9491 17947 4811 -16814
1398 -16814 4719 17982 -9309 -12255 15640 6764 -18195 -721 16976 -7647 -16743 10921
1410 10921 9263 -17014 -5052 16925 -2897 -15623 10230 13813 -13130 -6254 18394 2303
1422 2303 -16085 6250 15096 -10737 -10583 14081 3177 -17841 1164 14278 -9571 -13544 12232
1435 12232 7197 -15259 -1717 16528 -3241 -12700 11447 11080 -12425 -3427 16265 -887 -14806
1448 -14806 6682 11837 -12186 -9324 12911 1326 -15748 2492 12014 -9233 -10138 12554 5390
1461 5390 -13548 1268 15688 -4068 -10974 10568 8765 -12080 -2489 13649 -3400 -13630 6761
$$ packed form
1373a7288K1025J5677k7411n681K9801n342k7973J4232K1012k2507j2475K6643
1385I713R31k7832R981K4769j9495j7209K6441Q387k8452L275K7438j3136k1625
1398a6814K1533J3263k7291k946K7895q876k4959J7474J7697k4623r096K7664
1410A0921j658k6277J1962K1977j9822j2726K5853L583k6943O876K4648j6091
1422B303j8388K2335Q846k5833J54K4664j0904k1018J9005J3114k3849l973K5776
1435A2232n035k2456J3542J8245j9769r459K4147l67k3505Q998J9692j7152j3919
1448a4806K1488N155k4023K862K2235j1585j7074J8240R522k1247r05K2692p164
1461E390j8938J4816J4420j9756o906K1542j803k0845R591J6138j7049j0230K0391
$$ plain form
1474 6761 8749 -13306 -7080 12862 93 -14374 3705 11955 -8362 -7336 13081 3960 -12360
1487 -12360 3866 14200 -6546 -10014 11891 6722 -13905 -2197 12260 -5007 -12251 7385
1499 7385 6332 -13187 -3283 13554 -2501 -13276 7552 11795 -9480 -5577 13543 2308 -11243
1512 -11243 4885 10629 -9177 -7451 12386 1916 -15371 543 12089 -7175 -11262 8557
1524 8557 5577 -11584 -231 12015 -4378 -9178 10879 8413 -11724 -1984 14805 -688 -12574
1537 -12574 5267 8855 -9300 -5471 10040 -1829 -13041 4707 10227 -10843 -8685 12307 4560
1550 4560 -12031 848 12338 -3717 -7253 10323 4709 -11503 1103 13247 -5737 -13010 8057
1563 8057 8555 -12290 -6280 10560 -1212 -11129 5307 8171 -10397 -3970 14632 1583 -13708
$$ packed form
1474F761J988k2055O226J9942j2769j4467J8079Q250k0317J026K0417r121j6320
1487a2360J6226J0334k0746l468K1905n169k0627J1708J4457j7267p244J9636
1499G385j053j9519R904J6837j6055j0775K0828M243k1275L903J9120j1235j3551
1512a1243J6128N744j9806J726J9837j0470j7287J5914J1546j9264m087J9819
1524H557k980j7161J1353J2246j6393m800K0057k466k0137R740J6789j5493j1886
1537a2574J7841L588j8155L829J5511j1869j1212J7748N520k1070K158K0992p747
1550D560j6591J2879J1490j6055l536J7576n614j6212J2606J2144j8984p273K1067
1563H057M98k0845O010J6840j1772r917J6436K864j8568O427J8602j3049j5291
$$ plain form
1576 -13708 4607 14777 -6256 -9778 9854 5441 -11431 37 10512 -7618 -10695 10629
1588 10629 5928 -15832 -3912 15094 -1340 -13519 6030 10852 -8081 -3656 13014 -547
1600 -547 -12275 7952 12811 -11474 -10225 13566 5236 -15537 -1722 11836 -5888 -10094 9179
1613 9179 4261 -13784 1008 16147 -4751 -14019 10436 13078 -10695 -6161 13465 1607 -11381
1626 -11381 5328 8660 -11483 -6473 13767 706 -17636 1522 14674 -6590 -12370 9071
1638 9071 7101 -10063 102 12030 -4719 -9335 12047 8943 -13603 -4797 15419 956 -14760
1651 -14760 2318 10073 -7604 -6791 8738 -626 -12706 4663 12541 -8998 -10967 12676 8900
1664 8900 -11633 -2598 12632 -739 -8444 6904 5466 -10748 -2049 12950 -3222 -15022 4821
$$ packed form
1576a3708J8315J0170k1033l522J9632m413j6872J1468J0475j8130l077K1324
1588A0629m701k1760J1920J9006j6434j2179J9549M822j8933M425J6670j3561
1600e47j1728K0227M859k4285J249K3791q330k0773J3815J3558j7724m206J9273
1613I179m918j8045J4792J5139k0898r268K4455K642k3773M534J9626j1858j2988
1626a1381J6709L332k0143N010K0240j3061j8342J9158J3152k1264n780K1441
1638I071j970j7164J0165J1928j6749m616K1382l104k2546Q806K0216j4463j5716
1651a4760J7078P755j7677Q13J5529r364j2080J7369P878k1539j969K3643l776
1664H900k0533R035J5230j3371p705J5348j438j6214Q699J4999j6172j1800J9843
$$ plain form
1677 4821 11892 -8939 -10008 8989 4089 -9439 1840 9441 -5989 -5538 11984 4718 -13228
1690 -13228 -145 14924 -1942 -12437 4668 7721 -8255 -4027 7917 -3457 -9809 6574
1702 6574 8018 -11096 -6353 12923 4159 -11199 844 10623 -2827 -5011 7593 2171 -9233
1715 -9233 2643 10199 -7015 -10201 7679 6666 -10531 -5025 7791 -632 -7250 3883 4699 -7076
1729 -7076 -637 10672 -806 -9812 5433 10518 -5136 -6967 6366 3437 -6554 -127 4570 -6131
1743 -6131 -4987 7286 1293 -10488 -717 9869 -1230 -7798 3705 5736 -3740 -669 5934 -1906
1757 -1906 -4745 5917 5001 -7626 -3983 7678 1174 -8434 -870 5148 -3405 -3863 4275 -52 -5567
1772 -5567 2945 6699 -4340 -4884 7143 5245 -5981 -1912 6644 -224 -4540 3185 1804 -6234
$$ packed form
1677D821P071k0831j069J8997m900j3528J1279P601j5430M51J7522p266j7946
1690a3228J3083J5069j6866j0495J7105L053j5976M228J1944j1374o352J6383
1702F574J444j9114M743J9276q764j5358J2043R779j3450k184J2604n422j1404
1715i233J1876P556j7214l186J7880j013j7197N506J2816q423o618J1133Q16j1775
1729g076O439J1309j1478r006J5245N085j5654j831J3333k929r991O427M697j0701
1743f131J144J2273n993j1781R771J0586j1099o568J1503K031r476L071O603p840
1757a906k839J0662r16j2627L643J1661o504r608P564O018q553m58Q138m327n515
1772e567Q512L754j1039n44J2027j898j1226M069Q556o868m316P725j381q038
$$ plain form
1786 -6234 -791 6178 -3000 -8721 2992 6119 -4978 -4175 5593 1981 -4126 2818 4953 -3957 -1798
1801 -1798 7560 1070 -7390 1144 7099 -3313 -6628 3402 2216 -5955 -924 4175 -3585 -4868
1815 -4868 5280 3729 -6934 -1199 8288 499 -5903 3309 5337 -3713 -1561 5320 -1034 -6034
1829 -6034 3100 4380 -6315 -4915 5894 1284 -7161 112 5265 -2477 -3432 5160 2039 -5404 1775
1844 1775 7075 -2440 -4990 4940 4281 -5771 -2055 4972 -1156 -5540 2193 2878 -5840 -2386 6027
1859 6027 -248 -6312 2523 6035 -3221 -3488 5512 2888 -4747 1110 5381 -2682 -4205 4499 2623
1874 2623 -6596 -1532 5514 -1953 -6285 2393 3702 -4743 -2134 5337 -158 -5124 3074 6000 -3762
1889 -3762 -2797 6347 2356 -5848 564 5451 -3078 -4758 3968 1494 -6502 -778 5106 -2690 -5954
$$ packed form
1786f234N443O969r178n721J1713L127j1097Q03R768l612o107O944K135q910K159
1801a798R358o490q460Q534N955j0412l315J0030j186q171N031N099p760j283
1815d868J0148j551j0663N735R487p789o402R212K028r050K152O881o354n000
1829f034R134J280j0695J400J0809m610q445P273N153p742r55Q592l121p443P179
1844A775N300r515k550R930o59j0052L716P027o128m384P733O85q718L454Q413
1859F027o275o064Q835L512r256k67R000k624p635N857M271q063j523Q704j876
1874B623r219N064P046p467m332Q678J309q445K609P471n495m966Q198K926r762
1889c762R65R144l991q204O412M887q529j680Q726k474p996N724N884p796l264
$$ plain form
1904 -5954 4285 4396 -5182 -1524 6537 375 -4783 3403 5147 -4199 -2252 6193 472 -6827 1212
1919 1212 4903 -4498 -4858 4117 1414 -6171 44 5374 -2663 -4154 5232 3687 -5427 -68 6781
1934 6781 -876 -5068 3680 4341 -5038 -2229 4684 -575 -5796 1662 3590 -4747 -3474 4882 716
1949 716 -5710 1200 5462 -2177 -3001 4854 2837 -4117 453 5261 -1560 -4159 3002 2612 -5103 -2230
1965 -2230 4391 -1018 -5325 1519 3036 -3783 -2527 4650 1036 -4310 1789 5404 -1994 -2788 4441
1980 4441 2421 -4260 -28 4121 -1527 -4318 2386 2055 -4898 -1669 4357 -1047 -4763 1933 3417
1995 3417 -3058 -1540 4673 1096 -3515 2161 4632 -2410 -2483 4642 1378 -4829 -428 3903 -2550
2010 -2550 -4006 2236 1509 -4250 -758 4113 -1357 -3845 3091 3643 -3263 -898 4928 525 -3105
$$ packed form
1904e954J0239J11r578L658Q061o162n158Q186J744r346J947Q445n721p299Q039
1919A212L691r401l60Q975k703p585O215N330q037j491R386j545r114N359O849
1934F781p657m192Q748O61r379K809O913n259n221P458J928q337J273Q356m166
1949G16o426O910M262p639q24P855k017o954M570M808o821k599P161l90p715K873
1965b230O621n409m307O844J517o819J256P177l614n346O099L615p398p94P229
1980D441k020o681M232M149n648k791O704l31o953L229O026n404l716O696J484
1995C417o475J518O213l577m611N676K471p042p3P125l264o207M401M331o453
2010b550j456O242p27n759L492M871n470k488O936N52o906K365N826m403l630
$$ plain form
2025 -3105 1780 3178 -3049 -1838 3600 -550 -4881 820 3000 -3073 -3418 2795 1122 -3319 418
2040 418 3447 -1413 -2012 4266 2186 -3588 29 4179 -416 -3238 1819 1687 -3019 -1308 2531 -1395
2056 -1395 -3747 1563 2178 -3674 -1753 3569 1201 -3025 849 3540 -924 -1055 2886 935 -3028
2071 -3028 943 3367 -2078 -3866 2274 1372 -3704 -1666 2468 -954 -2681 1600 1569 -2864 -430 4354
2087 4354 -60 -3215 1856 3782 -1741 -2142 2394 803 -2868 419 1590 -3097 -2514 3433 589
2102 589 -4549 -743 3755 -643 -3264 2144 2361 -2089 591 3672 -781 -2515 3179 2995 -3775 -2205
2118 -2205 3910 305 -4469 -57 2205 -2336 -1989 2727 -243 -3943 1753 4522 -2249 -3142 3884
2133 3884 3273 -2768 -338 3389 -559 -2081 2349 687 -4105 -573 3728 -1451 -5167 1086 3126
$$ packed form
2025c105M885J398o227J211N438m150m331N701K180o073l45O213j673m441L737
2040D18L029m860n99O278k080n774L617M150m595k822N057j32m706J711L839l926
2056a395k352N310O15n852J921N322k368m226L874K691m464j31L941j951l963
2071c028L971K424n445j788O140r02n076K038M134l422j727M281l1m433K434M784
2087D354m414l155N071J926n523m01M536j591l671L287J171m687N83N947k844
2102E89n138L806M498m398k621N408K17m450K680L081m453j734N694j84o770J570
2118b205O115l605m774M412K262m541L47M716k970l700N696K769o771q93P026
2133C884o11o041K430L727l948j522M430j662m792L532M301n179l716O253K040
$$ plain form
2148 3126 -2629 -2434 2429 782 -2170 1806 2568 -2517 -1047 4729 1013 -4100 -2 3873 -851
2163 -851 -3283 1059 857 -2810 -446 1761 -2329 -2772 2800 2494 -3243 -1692 4303 1407 -2644 587
2179 587 2624 -557 -578 2703 -198 -3444 1143 3181 -2652 -3886 2198 2194 -3317 -1688 2162 -391
2195 -391 -1732 2156 1674 -2754 239 4650 140 -3620 1509 4206 -1694 -2721 1752 394 -2700
2210 -2700 -75 1446 -2977 -2301 3318 1200 -4539 -571 4451 130 -2715 1607 2217 -1237 274
2225 274 3034 -1158 -3174 2582 2546 -3822 -2815 3100 746 -3853 -655 1845 -1185 -1033 2275 17
2241 17 -2920 1356 3927 -1460 -2777 3045 2830 -2286 -1432 2403 -188 -2058 1416 469 -3689 -759
2257 -759 3442 -502 -3965 675 3171 -1024 -2104 1603 1382 -1134 1333 2054 -1628 -1356 3247 1052
$$ packed form
2148C126n755J95M863j647k952L976P62n085J470N776l716n113M098L875m724
2163h51k432M342k02l667K364K207m090m43N572l06n737J551N995k896m051L231
2179E87K037l181k1L281k901l246M587K038n833j234O084mn511J629L850k553
2195c91j341L888m82m428K993M411m510l760N129K697n900j027M473j358l094
2210b700K625J521m423O76N619k118n739L968N022m321k845M322O10l454J511
2225B74K760m192k016N756l6o368J007N915k354m599L198K500l030J52L308k258
2241A7k937M276K571n387j317N822k15n116Q54L835k591j870L474r47m158K930
2257g59M201l944l463M640K496m195j080L707k21k516K467P21l682K72M603k195
$$ plain form
2273 1052 -3504 -1101 2919 -138 -3159 -326 1040 -1390 -862 1609 -733 -2038 1900 2539 -1926
2288 -1926 -1495 3110 2083 -2041 -173 1921 -496 -1371 1214 2 -2562 -85 2525 -1602 -3246
2303 -3246 919 2209 -1633 -1653 1971 734 -1043 1434 1863 -1675 -137 3083 659 -2776 655 2733
2319 2733 -1144 -2318 688 400 -2008 -93 1290 -1508 -1360 2613 1421 -2599 -435 3146 515
2334 515 -1719 974 1527 -1066 -154 1591 -1068 -2054 1442 1225 -2769 -1822 2069 381 -2331 -201
2350 -201 1571 -807 -423 1990 239 -1176 1514 2751 -682 -1750 1550 1307 -1456 -781 1179 -542
2366 -542 -1505 470 -11 -2369 -486 1935 -130 -2052 1319 3045 -680 -577 1677 759 -433 981
2382 981 808 -1315 -59 2093 40 -1833 -667 1703 -1220 -2115 147 731 -1090 -265 1493 -325
$$ packed form
2273A052m556K403M020l057l021K833J366k430N28K471k342j305L938O39m465
2288a926M31M605j027m124J868K094k417q75K585j212k564K477K610m127j644
2303c246M165J290l842k0L624j237j777K477M29l538J538L220k424l435L431K078
2319B733l877j174L006k88k408J915J383k798J48L973j192m020K164L581k631
2334E15k234K693N53k593R12J745k659r86L496k17l994R47L891j688k712K130
2350b01J772k378L84K413j751j415K690J237l433j068L300k43k763O75J960j721
2366e42r63J975m81k358J883K421k065j922L371J726l725J03K254r18j192J414
2382I81j73k123J256K152k053j873J166K370k923q95K262N84j821Q25J758j818
$$ plain form
2398 -325 -1099 1557 1894 -1002 -601 2197 387 -1654 272 1378 -865 -1231 825 -160 -2210 -188
2414 -188 1368 -1078 -1663 1408 1022 -1588 -184 2101 59 -816 1357 1297 -1636 -560 1988 -391
2430 -391 -1995 621 1048 -1931 -1409 1324 15 -2092 338 1470 -1219 -995 2066 633 -1263 473
2446 473 1980 -877 -1025 1506 621 -1600 -222 1239 -775 -1654 575 578 -2413 -884 1706 43 -2062
2463 -2062 971 260 -1222 -317 2339 603 -1184 751 1485 -1081 -1014 1118 390 -1853 -437 1024
2479 1024 -1111 -1715 896 640 -1231 -512 1517 15 -1326 918 1600 -736 -291 1976 387 -1608
2495 -1608 316 1272 -791 -1522 884 250 -1745 -400 1116 -705 -1463 1154 855 -1076 116 1724
2511 1724 355 -781 857 1321 -739 -512 1609 204 -1569 219 782 -1447 -1340 1063 103 -1810
$$ packed form
2398c25p74K656L37k896M01K798j810k041J926J106k243l66K056r85k050K022
2414a88J556k446n85L071l86k610J404K285k042q75K173o0k933J076K548k379
2430c91j604K616M27k979N22K733j309k107K430J132k689K24L061j433j896J736
2446D73J507k857j48K531q85k221J378J461k014q79K229Lk991J529K590j663k105
2463b062L033p11j482R05K656j736j787J935P34k566O7K132p28k243J416J461
2479A024k135o04K611k56j871P19K029j502j341K244O82k336M45K267j589j995
2495a608J924R56k063p31K406o34j995J345J516j821p58K617k99j931J192J608
2511A724j369j136J638M64k060K27K121j405j773J788N63k229J07K403r60j913
$$ plain form
2527 -1810 80 1422 -831 -923 1119 1101 -997 321 1804 -254 -966 1352 871 -1205 -155 1164
2543 1164 -536 -1964 449 412 -1442 -825 1254 -373 -1243 711 1144 -515 -259 1745 674 -886
2559 -886 497 1467 -711 -692 1012 12 -1199 -124 917 -1115 -1434 813 313 -1279 -200 1132
2575 1132 13 -605 1042 1052 -663 81 1131 186 -826 636 852 -939 -604 697 -133 -1351 -213
2592 -213 447 -778 -782 890 684 -897 459 1709 -111 -617 883 1453 -369 -615 1030 -177 -965
2609 -965 586 518 -1541 -898 1003 54 -1819 191 1281 -626 -792 1112 527 -654 704 1541 -742
2626 -742 -537 1882 706 -1403 -467 1142 -617 -1554 281 439 -1657 -558 1355 -617 -1559 1151
2642 1151 1405 -803 -382 1679 775 -950 578 1241 -700 -497 1334 -45 -2053 -50 1272 -1037
$$ packed form
2527a810J890J342k253r2K042j8k098J318J483k058p12K318m81k076J050J319
2543A164j700j428K413l7j854O17K079j627q70J954M33j659K56K004j071j560
2559h86J383R70k178J9J704j000j211J075J041k032l19K247n00j592J079J332
2575A132j119o18J647J0j715P44J050r45j012J462K16j791L35J301q30j218J138
2592b13O60j225mJ672k06j581J356J250j820n06J500N70j822k46J645j207p88
2609i65J551o8k059O43J901r49j873K010J090j907j66J904n85j181J358Q37k283
2626g42K05K419j176k109R36J609j759r37J835J58k096J099J913j972r42K710
2642A151K54k208M21K061r04j725J528O63j941K03J831j379k008K003J322k309
$$ plain form
2658 -1037 -1991 712 694 -1309 -299 1330 -505 -667 1567 1245 -1142 127 2047 226 -1410 437
2674 437 1405 -838 -962 918 93 -1494 255 1024 -1401 -1380 1117 750 -1114 -95 1933 431 -580
2691 -580 891 1144 -959 -148 1205 -362 -1580 378 1097 -1170 -1644 740 667 -1283 -305 965 -788
2708 -788 -737 1427 692 -1302 466 2373 86 -1487 841 1520 -977 -698 839 -112 -1291 404 714
2725 714 -1514 -968 1572 615 -2138 -12 1898 -151 -979 1163 1172 -550 562 1591 -604 -1210 1221
2742 1221 978 -1696 -941 1452 -154 -1754 50 647 -1117 -444 1230 -7 -1060 869 1966 -363
2758 -363 -903 1455 1070 -1064 -170 984 -351 -861 693 69 -1795 -512 1248 -453 -1783 371
2774 371 1252 -151 -309 1073 380 -386 798 1135 -622 -302 1454 271 -1373 -525 1125 -373 -1377
$$ packed form
2658a037r54K703j8k003J010J629j835j62K234l22k387J269J920j821j636J847
2674D37R68k243j24J880q25j587J749P69k425K1K497l67j864J019K028j502j011
2691e80J471K53k103Q11J353j567j218J958P19k267m74K384p3j950R78J270j753
2708g88N1K164p35j994J768J907k287j573K328O79k497K79J537r51j179J695L10
2725G14k228N46K540r57k753K126J910k049q28K142Rj722J112J029k195o06K431
2742A221k43k674P55K393j606j600J804N97j764O73J674j237j053J929J097k329
2758c63n40K358l85k134Q94J154j335n10J554o24j864J283J760j701j330K154
2774C71Q81j403j58J382o93p66J184L37j757L20J756j183j644Q48J650j498j004
$$ plain form
2791 -1377 7 212 -880 -104 1047 -477 -1155 865 1167 -585 -592 1102 821 -580 72 596 -354 -611
2809 -611 627 -378 -1446 -227 957 -468 -1206 300 878 -905 -555 694 141 -135 857 966 -719
2826 -719 -232 1143 107 -1181 117 891 -731 -927 355 -57 -994 -96 598 -947 -560 1017 327
2843 327 -1145 -40 1363 -89 -706 675 747 -489 -105 684 -528 -847 528 401 -1316 -710 497
2860 497 -196 -960 142 400 -579 7 1027 75 -430 689 1228 -402 -580 672 364 -784 -165 442
2878 442 -359 -693 206 27 -1167 -393 797 -105 -727 467 662 -64 45 885 355 -293 352 414 -315
2897 -315 -221 325 122 -942 -469 381 -385 -769 198 372 -648 -291 798 11 -419 509 872 -214 -138
2916 -138 925 330 -445 259 378 -392 -499 445 -446 -1251 293 595 -508 -925 593 756 -463 298
$$ packed form
2791a377J384K05j092P76J151j524o78K020L02j752pJ694k81j401O52N24r50k57
2809f11J238j005j068J219J184j425p38J506N78j783L50J249n53k76R92J09j685
2826g19M87J375j036j288J298P74j622j96J282m12r37Q98O94j545L87J577o90
2843C27j472J105J403j452o17J381P2j236L84P89j212l19J375j27j717O06J207
2860D97o93p64J102K58r79N86J020r52n05J119N39j630j78J252l08j148O19O07
2878D42q01l34Q99j79j194P74J190r02o22J194J95p26J09Q40n30o48O45O2p29
2897c15R4N46k03j064M73Q50p66l84R67J74j020L57J089p87m30R28L63j086P6
2916a38J063n95p75P04J19p70j07R44q91q05J544L02j103m17J518J63j219P61
$$ plain form
2934 298 680 135 -201 738 521 -729 -12 838 -237 -1157 314 311 -1088 -842 506 -396 -911 528 235
2953 235 -409 -69 1088 280 -686 389 992 -32 -451 469 170 -640 -137 418 -393 -975 98 129 -652
2972 -652 -371 504 -137 -701 210 679 6 424 774 116 -215 582 656 -491 -463 415 26 -478 -108 213
2992 213 -632 -661 57 307 -420 33 669 -20 -279 416 887 -134 -240 906 388 -535 103 258 -488 -462
3012 -462 178 68 -511 -8 315 -434 -580 249 486 -681 184 782 125 -152 870 650 -350 -186 894
3031 894 -65 -479 160 0 -747 -799 347 -174 -589 45 749 -22 -442 837 508 -546 173 1106 -120
3050 -120 -405 709 528 -707 24 306 -435 -632 301 427 -909 -289 530 -132 -721 382 300 -170 18
3069 18 728 362 -309 169 520 -377 -410 295 35 -767 -284 395 -509 -526 375 295 -687 -60 525 229 -205
$$ packed form
2934B98L82n45l36R39k17j250P17Q50j075r20J471lj399K46J348r02n15J439k93
2953B35o44L40J157q08r66J075O03j024m19R20k99q10N03N55q11n82J073L1p81
2972f52K81Q75o41n64R11M69o73M18L50o58l31P97P4j147K8Q78l89n04L70L21
2992B13q45k9P18K50p27M53O36o89k59O95M71j021j06J146n18r23O38J55p46K6
3012d62O40j10n79N03L23p49j46Q29K37j167Q65N98o57k77J022k20j000J64J080
3031H94r59m14O39j60p47n2J146n21m15O34P04p71m20J279l29j054P19R33j226
3050a20k85J114j81j235P31K82p41j97R33J26j336O20Q19o62n89J103q2m70J88
3069A8P10l66o71M78L51q97l3P05k60q02M83O79r04j7R01q0r82O27N85k96m34
$$ plain form
3090 -205 408 493 -383 194 570 254 -607 266 461 -671 -817 64 -168 -535 -223 423 -112 -500 432 190
3110 190 -463 32 922 134 -455 430 513 -334 -62 770 135 -453 -85 440 -737 -575 327 -229 -643 -168
3130 -168 304 -183 -124 374 606 -1 306 988 -213 -409 794 668 -588 -398 417 -177 -802 85 252
3149 252 -669 -178 459 -307 -704 513 759 -384 -319 831 448 -233 330 290 -121 -494 487 -236 -875 -89
3169 -89 450 -477 -706 365 295 -629 -173 509 -108 -117 814 574 -458 136 767 344 -620 -62 152 -176 -449
3190 -449 142 -259 -732 136 333 -730 -478 715 442 -569 -110 844 -30 -118 469 274 -393 18 515
3209 515 -46 -630 171 631 -780 -724 245 -286 -370 77 289 -460 -96 553 184 -420 314 1069 55 -488
3229 -488 447 528 -203 -411 377 -278 -753 225 65 -723 -649 687 50 -449 56 832 35 -150 396 125
$$ packed form
3090b05O13Q5q76N77L76l16q61Q73J95j132j46Q81k32l67L12O46n35l88R32k42
3110A90o53M95Q90p88n89Q85Q3q47K72Q32o35n88L68N25j177J62R02n56m14M75
3130a68M72m87N9M98K32o07L07O82j201j96J203j26j256J90Q15n94o25Q87J67
3149B52r21M91O37p66l97J217K46j143O5J150l83o81N63m0m11l73R81p23o39P86
3169h9N39r27k29J071p0r24M56O82o17rR31k40j032N94O31m23r64N58K14l28k73
3190d49N91m01m73Q68J97j063K52J193k73j011M59R54q74q8N87j95o67M11M97
3209E15n61n84Q01M60j411N6R69n31q4M47K12p49L64O49l69o04P34P55j014n43
3229d88R35Q1p31k08P88o55m75R78j60p88P4J336o37m99N05P76p97j85N46k71
$$ plain form
3249 125 -341 250 874 -401 -702 562 392 -1207 -626 470 -237 -731 8 12 -457 29 767 -197 -618
3268 -618 500 565 -262 -440 623 380 -145 -36 209 -418 -443 473 -3 -965 -40 461 -414 -559 -75 274
3288 274 -290 -39 636 -6 213 848 486 -607 -153 829 70 -555 -45 463 -179 -484 -33 16 -543 321
3308 321 386 -442 -677 931 833 -473 -199 758 210 -209 221 401 -227 -104 361 -351 -894 56 628 -564
3328 -564 -641 197 239 -192 -145 660 11 -150 437 613 -520 -52 1058 230 -873 128 196 -225 -363 -3
3348 -3 3 -377 251 146 -929 -564 635 140 -409 166 806 57 -169 444 379 -412 224 515 -579 -511 271
3369 271 45 -528 -366 76 99 -291 58 280 86 140 393 166 -228 178 698 -219 -248 372 86 7 -277
3390 -277 176 -145 18 58 -11 -458 -151 317 -277 -491 465 453 -7 106 384 109 -354 300 -17 -372 -280
$$ packed form
3249A25m66N91O24j275l01J264j70j599N81J096p07m94P39Mm69M86P38r64m21
3268f18J118O5q27j78J063k43n25J09K45o27k5R16m76r62R25N01q75j45M84L49
3288B74n64K51O75o42K19O35l62j093M54R82p59o25N10N08o42l05M51M9n59Q64
3308C21O5q28k35J608r8j306K74R57n48m19M30J80o28J23M65p12n43R50N72j192
3328e64p7Q38M2m31M7Q05o49j61N87J76j133M68J110q28j103J001O8m21j38L60
3348cOl80O28j05j075L65J199m95n49N75O40p49k26O13o5p91O36K91j094O8P82
3369B71k26n73J62M42K3l90L49K22j94N4K53k27l94M06N20r17k9O20k86p9k84
3390b77M53l21J63M0o9m47L07M68n94k14R56j2m60J13K78k75m63O54l17l55R2
$$ plain form
3411 -280 476 -228 -671 -160 186 -544 -495 143 -29 -184 115 267 39 -446 320 525 -232 -38 514 150
3431 150 -309 -25 50 -235 -286 120 -269 -640 83 165 -167 -329 318 187 -366 104 112 83 -67 638 156 -257
3453 -257 53 487 -127 -738 219 -67 -579 91 89 -187 -211 244 253 -317 -95 423 203 -462 325 416 29 -149
3475 -149 220 -152 -287 -8 73 -505 -338 38 -15 -616 42 437 -137 -272 51 422 -164 279 488 326 124
3496 124 313 551 -176 -270 112 110 -70 -222 96 -390 -90 265 -73 -346 -46 182 -78 -25 338 167 -385
3517 -385 -84 217 -14 -78 131 212 -231 -349 239 -125 -330 -83 85 -356 -390 257 71 -339 175 567 -15
3538 -15 106 490 508 -402 44 226 -138 -266 -93 -19 -444 -404 42 -205 -334 117 55 -245 16 295 406 -34
3560 -34 100 462 49 -17 668 38 -258 181 222 -517 -277 -112 -38 -252 76 125 -136 -35 223 392 -386 8
$$ packed form
3411b80P56p04m43N11L46p30M9O38j72j55K99J52k28m85P66K05p57J94N52l64
3431A50m59K84P5k85n1M06l89l71P23Q2l32j62O47j31n53M70Qk9j50P05m82m13
3453b57L10M34o14o11R57k86n12O70kk76k4M55Rn70K22N18k20o65P87R1l87j78
3475a49L69l72j35K79Q1n78J67L76n3o01O58L95n74j35L23L71n86M43K09j62k02
3496A24J89K38p27r4L82kj80j52L18m86L00L55l38k73L00K28k60N3L63j71n52
3517c85L01L01k31o4K09Q1m43j18N88l64k05K47J68m41l4O47j86m10N14L92n82
3538a5J21L84J8r10M46J82l64j28J73P4m25M0M46k47j29M51o2l00K61K79J11m40
3560c4J34L62m13o6O85o30k96M39M1p39K40J65P4k14L28M9k61J01K58J69p78L94
$$ plain form
3582 8 407 159 -110 159 428 -257 -114 89 -51 -425 168 -15 -596 -267 132 125 -280 444 284 98 -30
3603 -30 294 197 51 174 158 119 -2 76 56 -107 -77 -13 -116 -360 5 -154 -228 -34 101 136 -216 105 334
3626 334 110 -274 132 217 -136 39 204 -204 -320 16 11 -442 -387 161 -87 -418 -150 230 -120 -153 359 263
3648 263 137 229 415 -116 -209 581 91 -390 -178 189 -227 -356 -23 -84 -395 92 275 -216 -16 156 156 -202
3670 -202 -149 428 -60 -32 -41 132 -364 -29 236 -73 -419 84 93 -404 -492 -9 -3 -161 137 358 10 40 274
3693 274 47 70 75 327 -131 96 304 287 65 -84 43 -502 -320 126 0 -268 -117 317 56 -284 47
3714 47 374 36 -6 28 205 -211 37 138 -324 -286 312 -33 -711 -482 216 36 -247 63 147 -153 82 593
3736 593 22 -496 206 648 199 -171 268 147 -47 -72 -158 -303 -266 430 250 -436 -65 464 -30 -65 222
$$ packed form
3582HL99k48k69K69K69o85J43K03j40l74N93j83n81L29L99pm05P24j60j86j28
3603c0L24r7j46J23j6l9j21P8k0j63L0O4j03k44L65j59p4J94J35L5l52L21K29
3626C34k24l84M06Q5l53J75J65m08j16L36nm53N5N48k48l31K68L80l50l3N12r6
3648B63j26R2J86n31r3P90m90m81K12L67m16j29L33o1l11M87J83m91K00J72%l58
3670b02N3N77m88K8rJ73m96L35K65l09l46N03Rm97q8M83Oj58K98K21l48L0K34
3693B74k27K3NK52m58K27K08j7k22j49J27n45J82M46j26k68J51M34k61l40L31
3714D7L27l38m2L4J77m16K48J01m62L8N98l45o78K29O98j80k83L10Q4l00K35N11
3736E93n71n18P02M42m49l70M39j21j94k5q6j45L7O96j80o86L71N29m94l5K87
$$ plain form
3757 222 96 -139 -67 167 84 45 162 328 -140 -121 330 -6 -435 36 339 -524 -209 230 -187 -633 202
3778 202 207 -244 -258 307 276 -302 -86 271 172 9 219 181 -320 151 313 -172 -591 -208 300 -603 -81 34
3800 34 -41 -196 -67 -60 21 1 451 152 -201 280 244 -111 -542 -138 114 -103 -64 -11 -144 -140 151 -88 -539 -282
3824 -282 342 292 -83 129 480 204 -338 42 90 36 -28 175 -320 -148 35 131 -219 -222 -49 427 -104 -422
3846 -422 301 -17 111 541 128 -455 301 325 -25 -355 263 123 -359 133 -154 -155 165 321 -37 -131 -135 243
3868 243 -4 -222 286 537 403 220 60 -39 -3 112 236 -365 -225 67 130 -319 -52 43 -133 -295 205
3889 205 -146 41 50 432 -15 42 265 281 142 172 134 -12 22 114 -179 21 76 185 -391 -258 177 37 -68
3912 -68 -96 -122 170 184 -36 357 47 111 -79 113 -347 205 106 -145 -344 -390 -244 150 -308 36 -51 10 -145
$$ packed form
3757B22j26k35P2K34q3l9J17J66m68J9M51l36m29M71L03q63L15M39m17m46Q35
3778B02Nm51j4N65l1n78K16L57r9j63K10l8n01M71J62m85m19L83N08r03N22J15
3800C4p5j55J29PQ1k0M50k99l53M81l6l55m31M04K52k17L9N3j33MK91k39m51K57
3824b82O24n0l75K12L51k76n42L80M8n4o4K03m95J72J83R6l50lJ73M76n31l18
3846d22P23l18J28M30m13n83P56K4l50l30O18j40m82M92k87jL20J56l58r4mL78
3868B43k47k18N08K51j34j83j60r9L6J15J24o01J40K92O3m49K67R5j76j62N00
3889B05l51J87RL82m47N7K23J6j39L0l8j46L4R2k93K00N5J09n76J33M35j40j05
3912f8k8k6K92J4k20L93l10O4j90J92m60N52r9k51j99m6J46L94m58L44q7O1j55
$$ plain form
3935 -145 -167 3 215 353 331 58 -9 441 287 -118 49 42 -132 38 147 -257 -402 120 69 42 -176 126
3957 126 119 -143 282 240 -31 333 540 71 190 -242 74 211 33 334 -82 -325 13 111 -201 15 54 211
3979 211 -67 91 125 -159 18 448 75 193 100 230 -269 -236 125 -254 -188 -413 178 10 -332 -237 -282 -26
4001 -26 180 -35 -92 129 67 60 45 77 153 182 -109 235 -5 -26 -172 -124 -124 -272 -589 -38 -214 -296 -122 121 -192
4026 -192 255 1 348 64 -198 211 124 138 203 -115 -115 4 -182 -133 -267 134 302 11 -142 -175 -72 8 4
4049 4 -132 -243 -39 380 77 -158 69 -12 -9 -30 10 -227 -171 -291 10 -91 -271 -213 -126 -463 -230 200 -51
4072 -51 83 50 118 -29 -113 330 -31 -212 79 138 -157 -92 70 158 -312 -99 -72 -26 63 235 12 -46 36 341
4096 341 -69 8 322 -30 -40 52 244 144 223 -30 -132 -147 105 201 16 -185 -209 -37 13 -131 116 215 -19
$$ packed form
3935a45k2J70K12J38k2k73o7M50j54m05J67pj74J70J09m04j45N22n1k7k18L02
3957A26pk62M25m2k71L64K07m69J19m32L16J37j78L01m16k43L38R8l12K16L9J57
3979B11k78J58L4k84J77M30l73J18r3J30m99L3L61l79O6k25N91j68l42R5m5K56
4001b6K06k15n7K21o2pj5L2P6K9k91L44k40k1j46M8%j48l17N51j76q2J74K43l13
4026a92M47k54L47k84k62M09q7J4O5l18%J19j86M9j34M01J68k91j53l3J03Q0m
4049Dj36j11K04M19l03k35K27q1Lk1M0k37N6j20L01j01j80N8Q7l37K33M30k51
4072e1J34l3O8j47q4M43l61j81K91N9k95O5J62Q8m70K13K7M6Q9J72k23n8Q2L05
4096C41m10P7L14l52j0R2J92j00P9k53j02j5K52R6j85k01k4J72N0j44K47R9k34
$$ plain form
4119 -19 145 464 227 124 -47 -168 -61 82 -126 -245 -64 43 -282 -138 -151 -209 4 -66 67 16 -69 320
4141 320 222 21 226 -76 420 -270 -215 -49 23 -307 71 -146 -159 178 35 64 -134 112 -81 -17 -61 349
4163 349 172 -145 107 255 75 -122 50 173 89 184 -86 -248 -74 7 -110 42 1 6 -7 -233 99 163 -63
4186 -63 110 133 1 -226 220 47 -192 120 -64 -62 -22 -66 -7 -216 -30 12 -210 -276 99 293 132 -4 186
4209 186 150 -124 270 160 -239 63 65 23 -307 -44 169 85 -35 76 16 -117 166 141 22 -138 1 263
4231 263 190 -41 34 136 -35 -183 61 -470 -257 169 -61 -278 -256 -68 95 -66 44 197 13 -43 277
4252 277 385 -281 -63 207 -84 -139 413 -125 -128 161 -49 -83 -438 25 52 -46 -63 172 -17 -186 -62 35 -109
4275 -109 20 226 54 -26 216 378 -26 -151 133 71 -224 -101 -185 -45 -128 103 290 -98 -104 81 249 -179
$$ packed form
4119a9J64L19k37j03j71j21J07J43k08j19J81J07l25J44j3n8K13p0J33n1q5L89
4141C20r8k01K05l02M96o90N5J66P2l30L78k17j3L37j43K9j98K46j93O4m4M10
4163C49j77l17K52J48j80j97J72J23q4R5k70j62J74Q1j17J52m1Nj3k26L32O4k26
4186f3J73K3j32k27M46j73k39L12j84KM0m4N9k09J86M2k22o6L75J94j61j36J90
4209A86l6k74L94j10l99L02Km2l30K63K13q4j20J11o0j33K83k5j19j60J39K62
4231B63p3k31P5J02j71j48K44n31K13M26k30k17K2J88J63j61J10J53j84n6L20
4252B77J08o66K18K70k91n5N52n38lK89k10l4l55M63K7r8j7K35j89j69J24R7j44
4275a09J29K06j72q0K42J62m04j25K84o2k95J23q4J40q3K31J87l88oJ85J68m28
$$ plain form
4297 -179 135 20 90 -109 249 -203 -109 -57 246 -156 20 206 -86 -38 -346 141 -67 -97 66 62 -448 128
4319 128 55 -89 4 214 101 77 -4 120 65 -48 98 13 -255 -175 -209 -188 39 -51 290 52 99 122 -30 -70
4343 -70 286 -38 86 35 -125 94 -30 -56 36 27 -140 -80 81 -143 -35 -181 41 -294 -118 303 202 -91
4365 -91 280 170 232 140 -10 48 91 -32 352 -183 -273 325 -26 -203 171 -96 -332 -13 48 -85 137 36
4387 36 213 43 304 353 -147 -80 41 10 -215 -73 -70 -257 -20 -70 53 159 17 218 58 180 19 262
4409 262 219 84 1 -188 -92 -114 195 -32 -194 24 -137 -67 -45 192 -5 127 125 25 72 -90 409 32 178
4432 178 201 -12 39 88 139 57 -105 89 -86 -273 4 -271 -168 -95 -41 -57 -25 25 -334 194 139 16 -39 276
4456 276 198 133 93 -250 -152 -2 -192 -212 63 -114 139 -184 -170 115 62 120 101 8 39 133 30 85 -58 132
$$ packed form
4297a79L14j15P0j99L58m52R4N2L03m02J76J86k92M8l08M87k08l0J63mn10N76
4319A28p3j44R3K10j13k4q1J24n5j13J46q5k68Q0l4K1K27r0L41k38M7K3j52m0
4343g0L56l24J24n1j60K19j24k6R2rj67O0J61k24J08j46K22l35J76M21j01k93
4365i1L71j10O2r2j50N8M3j23L84n35r0N98l51j77L74k67k36L19O1j33K22j01
4387C6J77j70K61M9n00O7J21l1k25J42Lj87K37n0J23J06j42K01j60J22j61K43
4409B62m3j35q3j89R6k2L09k27j62K18j61P0K2K37j97J32kj00M7j62M99l77J46
4432A78K3k13N1M9N1q2j62J94j75j87K77k75J03P3N4j6L2N0l59N28n5j23n5L15
4456B76p8o5m0l43R8J50j90k0K75j77K53l23J4K85n3N8j9r3L1R4j03N5j43J90
$$ plain form
4480 132 180 -134 43 -49 -236 39 106 -513 -54 -233 -73 -201 9 23 276 240 80 113 -51 -100 407 -99
4502 -99 140 28 -102 -167 -339 139 -87 -112 -158 111 73 82 -106 -13 102 -210 61 -107 -41 -15 59 13 -338 83
$$ packed form
4480A32M8l14J77r2j87K75O7o19M59j79J60j28K10J4K53l6j60L3j64m9N07n06
4502i9K39j12j30o5j72M78k26k5m6K69l8Rj88R3J15l12K71j68O6K6P4m6l51M21
$$ [...]
8191B9
##END NTUPLES=NMR FID
##END=
