##TITLE=1H_Pr 5290
 200.13MHz, CD3OD,
 8 sc
 
 27.1.2025
##JCAMPDX= 6.0         $$ Bruker NMR JCAMP-DX V2.0
##DATA TYPE= NMR FID
##DATA CLASS= NTUPLES
##ORIGIN= UXNMR, Bruker Analytische Messtechnik GmbH
##OWNER= pz
$$ XWIN-NMR		Version 3.5
$$ Mon Jan 27 14:44:51 2025 Russian Standard Time (UT+4h)  she@DPX200
##.OBSERVE FREQUENCY= 200.1313
##.OBSERVE NUCLEUS= ^1H
##.DELAY= (6, 6)
##.ACQUISITION MODE= SIMULTANEOUS
##.ACQUISITION SCHEME= undefined
##.AVERAGES= 8
##.DIGITISER RES= 18
##SPECTROMETER/DATA SYSTEM= spect
##.PULSE SEQUENCE= zg30
##.SOLVENT NAME= MeOD
##.SHIFT REFERENCE= (INTERNAL, MeOD, 0, 14.3821)
##AUDIT TRAIL= $$ (NUMBER, WHEN, WHO, WHERE, WHAT)
$$ ##TITLE= Audit trail, XWIN-NMR		Version 3.5
$$ ##JCAMPDX= 5.01
$$ ##ORIGIN= Bruker BioSpin GmbH
$$ ##OWNER= she
$$ F:/spectra/data/she/nmr/H-C/1/audita.txt
$$ ##AUDIT TRAIL=  $$ (NUMBER, WHEN, WHO, WHERE, WHAT)
(   1,<2025-01-27 14:43:33.81 +0400>,<she>,<DPX200>,
      <created by zg, POWCHK disabled, PULCHK disabled
       configuration hash MD5:
       00 E9 B6 7A A2 85 ED C7 34 08 36 98 17 FE 4E 26
       data hash MD5: 16K
       41 BF E4 18 88 92 2D 89 88 DA 7D 1E 2B 28 A8 9B>)
$$ ##END=
$$ 
$$ hash MD5
$$ 40 DC 74 C0 E1 4E 98 73 63 10 8C F3 69 13 A1 94
##$RELAX= 
##$RELAX= 
##$RELAX= 
##$RELAX= 
##$RELAX= 
##$RELAX= 
$$ Bruker specific parameters
$$ --------------------------
##$DU= <F:/spectra>
##$EXPNO= 1
##$NAME= <H-C>
##$PROCNO= 1
##$TYPE= <nmr>
##$USER= <she>
##$AMP= (0..31)
100 100 100 100 100 100 100 100 100 100 100 100 100 100 100 100 100 100 
100 100 100 100 100 100 100 100 100 100 100 100 100 100 
##$AQSEQ= 0
##$AQ_mod= 1
##$AUNM= <au_zg>
##$AUTOPOS= <>
##$BF1= 200.13
##$BF2= 200.13
##$BF3= 200.13
##$BF4= 200.13
##$BF5= 200.13
##$BF6= 200.13
##$BF7= 200.13
##$BF8= 200.13
##$BYTORDA= 1
##$CFDGTYP= 0
##$CFRGTYP= 5
##$CHEMSTR= <none>
##$CNST= (0..31)
1 1 145 1 1 1 1 1 1 1 1 1 1 1 1 1 1 1 1 1 1 1 1 1 1 1 1 1 1 1 1 1 
##$CPDPRG= <>
##$CPDPRG1= <>
##$CPDPRG2= <>
##$CPDPRG3= <>
##$CPDPRG4= <mlev>
##$CPDPRG5= <mlev>
##$CPDPRG6= <mlev>
##$CPDPRG7= <mlev>
##$CPDPRG8= <mlev>
##$CPDPRGB= <>
##$CPDPRGT= <>
##$D= (0..31)
0 0.7 0 0 0 0 0 0 0 0 0 0.03 0 0 0 0 0 0 0 0 0 0 0 0 0 0 0 0 0 0 0 0 
##$DATE= 1737974613
##$DBL= (0..7)
120 120 120 120 120 120 120 120 
##$DBP= (0..7)
150 150 150 150 150 150 150 150 
##$DBP07= 0
##$DBPNAM0= <>
##$DBPNAM1= <>
##$DBPNAM2= <>
##$DBPNAM3= <>
##$DBPNAM4= <>
##$DBPNAM5= <>
##$DBPNAM6= <>
##$DBPNAM7= <>
##$DBPOAL= (0..7)
0.5 0.5 0.5 0.5 0.5 0.5 0.5 0.5 
##$DBPOFFS= (0..7)
0 0 0 0 0 0 0 0 
##$DE= 6
##$DECBNUC= <off>
##$DECIM= 32
##$DECNUC= <off>
##$DECSTAT= 4
##$DIGMOD= 1
##$DIGTYP= 9
##$DL= (0..7)
0 120 120 120 120 120 120 120 
##$DP= (0..7)
150 150 150 150 150 150 150 150 
##$DP07= 0
##$DPNAME0= <>
##$DPNAME1= <>
##$DPNAME2= <>
##$DPNAME3= <>
##$DPNAME4= <>
##$DPNAME5= <>
##$DPNAME6= <>
##$DPNAME7= <>
##$DPOAL= (0..7)
0.5 0.5 0.5 0.5 0.5 0.5 0.5 0.5 
##$DPOFFS= (0..7)
0 0 0 0 0 0 0 0 
##$DQDMODE= 0
##$DR= 18
##$DS= 0
##$DSLIST= <SSSSSSSSSSSSSSS>
$$ [...]
##$SUBNAM0= <"">
##$SUBNAM1= <"">
##$SUBNAM2= <"">
##$SUBNAM3= <"">
##$SUBNAM4= <"">
##$SUBNAM5= <"">
##$SUBNAM6= <"">
##$SUBNAM7= <"">
##$SUBNAM8= <"">
##$SUBNAM9= <"">
##$SW= 18.0517328524113
##$SWIBOX= (0..15)
0 0 2 0 0 0 0 0 0 0 0 0 0 0 0 0 
##$SW_h= 3612.71676300578
##$TD= 16384
##$TD0= 1
##$TE= 0
##$TE2= 300
##$TE3= 300
##$TEG= 300
##$TL= (0..7)
0 120 120 120 120 120 120 120 
##$TP= (0..7)
150 150 150 150 150 150 150 150 
##$TP07= 0
##$TPNAME0= <>
##$TPNAME1= <>
##$TPNAME2= <>
##$TPNAME3= <>
##$TPNAME4= <>
##$TPNAME5= <>
##$TPNAME6= <>
##$TPNAME7= <>
##$TPOAL= (0..7)
0.5 0.5 0.5 0.5 0.5 0.5 0.5 0.5 
##$TPOFFS= (0..7)
0 0 0 0 0 0 0 0 
##$TUNHIN= 0
##$TUNHOUT= 0
##$TUNXOUT= 0
##$USERA1= <user>
##$USERA2= <user>
##$USERA3= <user>
##$USERA4= <user>
##$USERA5= <user>
##$V9= 5
##$VALIST= <valist>
##$VCLIST= <CCCCCCCCCCCCCCC>
##$VD= 0
##$VDLIST= <DDDDDDDDDDDDDDD>
##$VPLIST= <PPPPPPPPPPPPPPP>
##$VTLIST= <TTTTTTTTTTTTTTT>
##$WBST= 1024
##$WBSW= 4
##$XGAIN= (0..3)
0 0 0 0 
##$XL= 0
##$YL= 0
##$YMAX_a= 227492
##$YMIN_a= -351167
##$ZGOPTNS= <>
##$ZL1= 120
##$ZL2= 120
##$ZL3= 120
##$ZL4= 120
##$ABSF1= 10
##$ABSF2= 0
##$ABSG= 5
##$ABSL= 3
##$ALPHA= 0
##$AQORDER= 0
##$ASSFAC= 0
##$ASSFACI= 0
##$ASSFACX= 0
##$ASSWID= 0
##$AUNMP= <proc_1d>
##$AZFE= 0.1
##$AZFW= 0.1
##$BCFW= 1
##$BC_mod= 2
##$BYTORDP= 1
##$COROFFS= 0
##$CY= -3
##$DATMOD= 1
##$DC= 2
##$DFILT= <>
##$DTYPP= 0
##$F1P= 0
##$F2P= 0
##$FCOR= 0.5
##$FTSIZE= 0
##$FT_mod= 4
##$GAMMA= 1
##$GB= 0.15
##$INTBC= 1
##$INTSCL= 1
##$ISEN= 128
##$LB= 0.25
##$LEV0= 0
##$LPBIN= 0
##$MAXI= 10000
##$MC2= 0
##$MEAN= 0
##$ME_mod= 0
##$MI= 1.114404
##$NCOEF= 0
##$NC_proc= 0
##$NLEV= 6
##$NOISF1= 3.799351
##$NOISF2= 2.8
##$NSP= 1
##$NTH_PI= 0
##$NZP= 0
##$OFFSET= 14.38212
##$PC= 1
##$PHC0= 248.4549
##$PHC1= 10.59223
##$PH_mod= 1
##$PKNL= yes
##$PPARMOD= 0
##$PSCAL= 0
##$PSIGN= 0
##$REVERSE= no
##$SF= 200.129724274929
##$SI= 16384
##$SIGF1= 3
##$SIGF2= 2
##$SINO= 400
##$SIOLD= 16384
##$SREGLST= <1H.CDCl3>
##$SSB= 0
##$STSI= 0
##$STSR= 0
##$SW_p= 3205.1282051282
##$SYMM= 0
##$S_DEV= 0
##$TDeff= 0
##$TDoff= 0
##$TI= <>
##$TILT= no
##$TM1= 0
##$TM2= 0
##$TOPLEV= 0
##$USERP1= <user>
##$USERP2= <user>
##$USERP3= <user>
##$USERP4= <user>
##$USERP5= <user>
##$WDW= 1
##$XDIM= 8192
##$YMAX_p= 0
##$YMIN_p= 0
$$ End of Bruker specific parameters
$$ ---------------------------------
##NTUPLES= NMR FID
##VAR_NAME=  TIME,          FID/REAL,        FID/IMAG
##SYMBOL=    X,             R,               I
##VAR_TYPE=  INDEPENDENT,   DEPENDENT,       DEPENDENT
##VAR_FORM=  AFFN,          ASDF,            ASDF
##VAR_DIM=   8192,          8192,            8192
##UNITS=     SECONDS,       ARBITRARY UNITS, ARBITRARY UNITS
##FACTOR=    0.0002768,     1,               1
##FIRST=     0,             0,               0
##LAST=      2.2672688,     0,               0
##MIN=       0,             -351167,         0
##MAX=       2.2672688,     227492,          0
$$ Real data points
##PAGE= N=1
##DATA TABLE= (X++(R..R)), XYDATA
$$ [...]
1464d6l79O47M15l77l03j02k99P42J43o75%K3K01L99n52p7K11j47K31L03o49J08
1486a83J65j55O63k59l57m8j83O53J12o33L66q7j88J86L6k21n1j51L16K18j61
1507C8r0L2k49O52N3p02K43J87n6q4j04K15o7l96N7M71k47R6P1l50L82q9j28P7
1531A2l03L49K47o02K66J93k63J16N2KJ01o45K43P58m57J26N4o67L56J66j28j08
1553a32K01j0J0j69J32J71o51M12M18l60J9j42K6K62O7l03n9l42M36K09k48n6
1575a09L26m58J24K47j36j70l8J39N14o27R9K05n67L95L91l42j6O5q8j30J11K27
1597A62M0n47K65L13j87L7Q0k62K8J92j99m7Q4nL00j82j64J90n39L05K31pJ82
1620B70m0l79J94J38j42J01k98k29L54J49Mn7j60K38j32m3O8k73p1O98n3j79j67
$$ y = [-46, -425, 222, 637, 260, -43, -145, -444, 298, 441, -234, -234, -211, -10, 389, -163, -240, -29, -176, 55, 358, -291, -183, -18, -173, 490, 231, -126, -174, -357, 296, 408, -225, 141, 54, -134, 52, 88, -133, -184, -335, -19, 199, 38, -52, -20, -269, 383, 436, -266, -23, 164, 108, 24, -80, 135, 68, -328, -271, 200, -47, 49, 120, -230, 152, 63, -65, 12, -291, 58, 305, -297, -31, 162, -101, 15, 67, 69, 170, -475, -232, 526, 69, 195, 249, -418, -62, 104, -24, -132, 69, 59, 69, -100, 32, 203, -448, -36, 382, 22, 41, -101, -75, 187, 254, -49, -108, -450, -14, 195, -53, -109, 217, -241, -117, 130, -6, -176, -214, -75, 439, -188, -89, 116, -451, -56, 335, -7, -23, 42, -46, -176, -65, 162, 202, -345, -80, 233, 46, 83, 163, -99, -71, 121, -78, -125, -41, -46, 254, 72, -92, 98, -441, -136, 95, 88, 270, 230, -149, 45, 183, 41, 142, -156, -385, -31, 118, 122, 65, -95, 143, 11, -32, 36, -237, -308, 390, 337, 158, -9]
1643il37R7L01K97J50n22m37M45n2J27K30l29k59N01L7j80p0J3L19k55j19K40
1665A88n92J54N47J40k72k00l05q9M98K58P4l72k41L84M6k38K21l71lK16j06J37
1687G4m8k98M86j37J09o0n74m3P20o0J4J16o16Q1mM52K58l96l85M8K01M1L77k88
1711F8j26J03l3J47j48l56M32J46m1M1l84k46K40K59L64j71n05k48L23RN60k50
1733A84k68n9J4J87P5j0k35R4lN46n52m92J60L60K43J18l49m39k5M26N89q5o84
1756b05j44O3J44N07j28l29J85j51k6K94m11J7J71P7M27o37l63K62O4M33K52m78
1778B4m19n0J08O65Ll24j11j63O4K70p0qK19m65K68J99l91k06K14K11M82k25n70
1801b75j18L6L35O48k39n61m27J39N87L00n18J53k73%L79k75O2%l7K97J55n22
$$ y = [-9, -346, -249, 52, 349, 499, -23, -460, -15, -67, 60, 290, -39, -298, 203, 240, 60, -10, 3, 322, 67, -52, 188, -404, -250, 297, 437, 165, -35, -340, -429, 69, 327, 401, 29, -212, 172, 218, -20, 201, -170, -173, 43, -63, 74, 26, -272, 214, 77, 186, 126, -448, -491, 229, 169, 183, 299, -317, -236, -240, 212, 470, 74, -311, -263, -62, -21, 356, 68, -58, 45, 12, 159, 11, -345, 87, 233, 192, 233, -151, -397, -157, 102, 466, 295, -210, -458, -135, -126, 434, 184, -84, -143, -129, 58, 133, 123, -112, -18, -21, 525, -27, -519, -359, 1, 244, 362, 13, -426, -451, -25, 564, 479, -205, -349, -286, -142, 365, 237, -92, 93, -58, -84, 210, -201, -184, -13, 64, 491, -146, -509, -247, -183, 250, 502, 24, -395, -445, -337, 328, 331, 7, -104, -267, -203, 67, -3, -11, 208, -257, 11, 210, -181, -387, -173, 38, 520, 295, -275, -393, -357, -22, 626, 387, -174, -601, -462, 125, 425, -93, 60, -213, -213, 166, -109, -47, -47, -84, 213, 368, -154]
1823a54j42L1K38M63j12n05ll02K63Q02j90l95k34j44M42J94n8k10l2M4M3o8J40
1846A11l6l35L80L46m54l83N0K17M62O5m08j01m83L08N69l4j25k32k91L04J56
1867H6j1o2k11J16J78q3k16J17k71M70K30k93l15j6J45L03K2J78k83n52K82L45
1889A59N1J01k24k85K29K3oQ6k61M8M73k55j15p6J07p3L40j35j57l39j67N94R2
1912B10Nm7m16M4J45j30M40l0l90J57O6j91J75L0j04J36k68J57R5j87J84J58k76
1935c7J48k9l90L10J1K80J4m22j1J54k10K58nj44Q2j83N7J82j92J91J42m15J82
1958b7O4j70J89j1k21K20N4j44P7j33J83J1k7j08L6k19J31J21pJ93k90r9L44l46
1982a79J96P4j60LL9j40O2J74j61J76j76PJ80l57J77M9J6P9J56l99J97j09O7J68
$$ y = [-154, -296, -265, -27, 436, 324, -181, -184, -486, -223, 579, 389, -6, -240, -384, 58, 252, 194, -16, -48, -4, 39, -29, 111, 75, -260, 120, 466, 12, -371, -321, -104, 358, 423, 15, -86, -569, -261, 308, 274, 149, -83, -374, -70, 86, 75, 13, -198, -82, 96, 13, -203, -86, -357, 113, 343, 50, -265, -281, -136, 167, 189, 367, 84, -468, -186, 159, 210, 311, 87, -198, 31, 54, 48, 134, -127, -79, 394, 139, 24, -52, 55, -18, 322, 187, 30, -309, -476, 118, 210, 215, 168, -248, -204, -59, -189, 251, 221, -169, -12, 54, -137, 38, 68, -36, 100, -168, -11, 84, -103, 81, 239, -37, 111, 82, -308, 2, 13, 293, 307, -115, -126, 28, -182, 76, 71, -73, 9, -174, -117, 65, -127, 64, 206, -209, -27, 37, -133, 56, 45, -176, 44, 98, -46, 31, -102, 81, 92, 65, -43, -7, -226, -95, 26, 19, 212, -78, -177, 167, -179, 17, 91, -69, -66, -27, -167, -105, 69, -92, 84, -92, -85, 95, -262, -85, -36, -20, 59, 215, -184, 13, -96, -29, 139]
2006A39r0k87K37p5J71J89j26q3j75k5K46k95K19Mk53J59L25l83k0J60j73J13
2028b3Q7j0j26r4M3M78k93k72K53k78J05J34Q1O4k24Q5J04K2j27J37l86R7L88
2051B45k92l5J77j66M2m3N3K19l67L8L56j11qn6j35o4K84j16O8n8p9OL3J28O5
2076A84m11O1K48k26K35l9k44pL67m2J09k64q4Q6j5K05K4l42mJ45J45J82k57l81
2100c25L11k5M3N1j31j2J12k8J02k4k14J65j17K13K64l19k67J36rK18J15m43M7
2123a37k0J66K70J9l27j13jJ09J89l4j93j90J45L16j95j47J26j34j5M27l1l16
2145h6r8K02K6K70k41k00j55j9N56q7k70Q7k70J35L01N3l05ro2L30P9l14K17l13
2169a73k37P14o1j30o1k73K47J54lk10j39p0L38J69k5k23k43J53QJ32j38j4k94
$$ y = [139, 49, -238, -1, -76, 95, 284, 158, 75, -100, -125, 121, -174, 45, 49, -204, -45, 280, -103, -123, 37, -136, -23, 64, 54, -72, -166, -123, 355, 62, -210, 43, -235, -130, 4, 85, 149, -75, 10, 114, 136, 9, 146, -240, -143, 245, -47, -82, 95, -71, -29, -72, -19, 200, -167, -129, 227, 116, 108, 52, -83, -147, 137, 21, 89, 31, -48, -42, -9, 119, 184, -227, -166, 82, -144, 91, 52, -192, -199, 168, 126, 235, -29, -113, -27, -42, 163, 187, -155, -159, -14, 131, 313, 56, -325, -14, -39, 4, 55, -76, -88, 24, -4, 98, 74, -140, 25, -92, 121, 385, 66, -201, -65, -74, 144, 259, -184, -137, -157, 9, 279, 298, -29, -142, -143, -34, 155, 121, -72, -262, -117, 199, 4, -143, -17, -151, -166, 261, 230, -86, -184, 18, 44, 314, 73, -127, -282, -301, 255, 168, -102, -15, -285, -150, 151, 204, -101, -110, -172, 158, 237, -77, 140, -173, -410, 304, 243, 113, 52, -221, 26, 180, 177, -33, -172, -242, 96, 265, 240, 17, -226, -73, -65, 67, -71, -85, -379]
2192c79M07J94r7k21jj33M55n5j37J68n13J48L31l0q4P7m30K12K54O1j26l76K15
2215f0K88k88K10r7l13L48Q3n7l7k29Q8K80l65L67K3o05J76J44n0L78k65k65J90
2238e6P1J03K8k21l6K64l58K26R3l73K67j40L40l1k03j07j4j6K28J21m55J81P8
2261a0kK23J0k81n6L3k4L40l14L9Ok5O7J16l19K19o7R8J29l03l5K70l27L46n7
2286G6p2o6l5q1J93K6K2J16k43p7K58k37l3K14j05Q9j7p0l5j37K48J45j24j32
2310g7J17k54K49n9K8J27j11j24N2J69j75K28j46r4J11j03j26L02k70Q9J15n4
2332fLj11p8J30m1J22J31m90K73P1RJ62j40l8l8j00J82J11j84J90j72j77J22K70
2356B01k12J00k12K2J3R1j39K78k18K01j28p7j04R6RK2J37m4l6p4J3J61K6k03
$$ y = [-379, 28, 222, 125, -96, -97, -230, 225, 170, 33, 201, -312, -164, 167, 137, 53, 130, -300, -88, 166, 227, 101, -275, -60, 228, -60, 150, 53, -260, 88, 171, 114, 77, -152, -64, 216, -149, 218, 241, -364, -188, -44, -94, 284, 19, -246, -56, 15, 118, 146, -75, -111, 153, -205, 21, 114, -259, 8, -132, 208, 177, -26, -133, -147, -163, 65, 186, -269, -88, -10, -12, 211, 221, -60, -116, -83, -107, 233, -81, -42, -36, -61, 6, 122, -197, 22, -45, 53, 182, -121, -156, 114, -213, 133, 76, 4, -62, -97, -178, 15, 41, 63, 179, -64, -141, 117, -120, -153, 61, -44, 45, 28, -42, -77, -214, 34, 179, 55, -77, 40, -214, 35, -24, 4, 131, 20, -104, -52, 117, -58, 170, 24, -70, 41, -62, -188, 114, -156, -67, 48, -6, -3, -114, -192, -62, -103, 19, 150, -340, -67, 4, 13, 175, 35, -3, -41, -141, 41, 152, -32, 158, -14, -191, -69, 201, -11, 89, -123, -101, -88, 3, -136, 142, -76, 125, -3, -80, -184, -88, -79, -57, 80, 36, 0, -74, -61, 100, 126, -77]
2380g7R7m0j16J81k1j29J47j40J37k31M00k08K6j05K90j98q3L1k14M26j50l5J20
2403A08j92N7J26k1P8Q3k42j68J32m6K57k48O8P7q4k8J70l96K03J00K4P6k1k50
2427a37k4J25K53o7o2j20j8L7K9L0j27l1k3J41J63P8m64P7L1K20O3l84RK01j65
2452a65L86j72j88k35M92j96J63j31j32L2J6K29J57k86j55K4%K81p8o4P4o8l4
2475e0L28k73j29m5R0J63R1k30k0k5J19J05q9k19K15k63L00J07k11K23m2k52P4
2498c3M0o9j6j75L87j01l16K80j44O5K67j37j20o4Q1j86L96k2j17k87J44J43R5
2521A11k3m8l01o7L78n3p8J39q8J8J58j64J76l10L3Q9O1J2j50J41k25L14j78J90
2545A35j82j03J47J05r1R4m9j29J5Q7o3J1j61K00O3Q5p1k09J55j34J41L9J01k13
$$ y = [-77, 20, -20, -136, 45, 24, -105, 42, -98, 39, -192, 208, 0, 26, -79, 211, 13, -70, -39, -253, 173, 23, -12, 108, -84, -27, 99, 78, 156, 239, -3, -171, -39, -85, 172, -76, -8, 69, -15, -43, 127, -269, -66, 34, 58, 134, 113, -137, -161, -36, 217, 150, 88, -32, -50, -13, 16, 46, -81, -112, -135, 6, 169, 247, -217, -140, -109, 111, 174, -210, -201, 0, -165, 221, 49, -139, -374, 118, -78, 85, -46, -178, -146, -130, 99, 256, -30, -185, -161, -161, 120, 42, -22, 52, -16, -50, 278, 5, -124, -169, -79, 84, 175, -55, -75, -100, 19, 124, 35, -184, 31, -232, 68, 175, -36, 187, 145, -107, -33, 7, -62, -78, -253, 134, 33, -283, -3, -147, -82, 185, 48, -72, -136, -55, -241, 155, 133, 16, -271, -127, 16, 111, 88, 40, -261, -328, 50, -3, -81, 58, -30, -12, 146, -18, 158, -152, -119, -30, 31, 43, -107, 34, -191, 123, -55, 135, -47, -150, -3, 102, 11, 105, 56, -73, -58, 29, -34, -23, -184, 16, 79, 164, 93, -116, 39, -95, 46, 85, 186, -27]
2569b7r1J04LQ4J44j18j8j5j90K24r2k21J56J38q7R2j13k7qq2J17K3NL6j54Q9
2595b8P5M6k45J47J06J0j87l2J1J81j76L7R9o4m1RJ84r8l14L36K7kJ95k28l38
2620b90L58j47J20N6l8k5j40l38M00J45k26L14j56p8J09mq6m3N5p4N1L1m9l2j07
2645a94K57p6J6j08nR3J93L1l11J66m1j0m8q4K70j57L5j27Pm9J70k16K47rj39
2670h9p7K26J8Pj85K00m5k24K77M0k52K80mk82O8op8J22%Q5l0N6k7n0n0J43J62
2697B85k19J08j25l9o8J04j10L7N9R8Mk85k6J60j4j65K28j39J28J29k50J77j73
2720i6J22M9j46K41k20k2P3j09J42ol7J68k11J38J9K8j50P0o0mM6l2P4j78J82
2745H1J01n4p3Q8k03l2J70Q5k59R0mo9R9j38K35j83mJ00j38n6J65j9J40n7j08
$$ y = [-27, -118, -14, -11, 73, 217, 99, 81, 66, -124, 100, 8, -213, -57, 81, -6, 86, -27, -54, -62, -144, -27, -4, 1, 37, -117, -28, 47, 93, -152, -5, 101, 111, -76, -108, -97, 84, -92, -55, 44, -20, -61, -52, 132, 34, -280, 56, 83, 81, 276, 48, -290, 68, -79, 41, 97, 59, 34, -106, -444, -44, 101, -125, 189, 33, -45, 64, 60, -26, -69, -14, -88, -37, -6, -55, -87, -194, 63, -13, 3, -105, -110, -17, 176, 207, -104, 62, 21, 11, -37, -121, 149, -8, 27, -100, -93, -142, 28, -188, 59, 50, -89, -166, 60, 78, 85, -100, 100, 55, -169, 108, 148, -104, 176, 172, -110, -42, -48, -126, -4, -4, 81, 51, 107, 80, 30, -20, 123, 285, 66, 174, 49, 10, -58, 46, -64, -27, 32, 130, 134, -151, -177, -17, -31, -196, 32, -107, 21, 150, -100, 77, -96, 26, 75, -71, 170, -50, -72, 1, -108, 34, 28, -9, 159, -52, 86, 105, 133, -17, 53, -7, -11, 35, 3, 77, -101, 81, 182, 128, 55, 143, -60, -92, 78, 163, -96, -6, -10, -79, 20, -118, 117, -66, -70, 30, -108, -164, 1, -18, 122, 65, -43]
2770d3L3K0p1j04L05j85K1J07j77K10l2k47J79J23k61J89M8j33rN4j35J19j16
2793a05J56j76O3J94k24N2j5Q1K7Q5j86p3Q6K7j42K06r1J08J9j37K6J43j48J23
2817I9l03J78r1Q4Q9n4ML1L8p8J63j90J0J3L2N6p6n8P4k6k6J54k17k4R3K4j33
2844a34Q5L4o8R8J04m7j2r5J5m7J27pK7j47P0j14L41k25r9K78O3k42J15j28Nl0
2870c3n1J36L4p9k4Q6r2J53r1R3n3j87J58J8k76J85N4o2R3J15k29K4J15K1k62
2895a54J51K8m4KM2K8j34J27l5r7L19k35j00K31j55N3j81K01j6j69J26J9J37j08
2919C6o8P0M9j03N9j61M9j10J75J0j44lK26k7Nk1n7O1r2K6J05r1k5J3j08R4O4
2946C2j66K02L4n8L5j90nP9Q8p8K3j64J29J07j01O0j75JQ9K53k79K37l13L32l34
$$ y = [-43, -10, 10, -61, -165, 140, -45, -24, 83, -94, 116, 84, -163, 16, 139, -122, 67, 115, -18, -27, 27, -108, 11, -105, 51, -125, -62, 132, -92, -40, -55, 26, 53, 138, -48, -121, -35, -8, -150, 56, -35, 73, 92, -45, -19, 124, -24, 99, -204, -26, -117, -33, 56, 2, 6, 37, 75, -3, 160, -30, -20, -7, 25, 81, 5, -53, 21, -5, -31, 123, -94, -118, -25, -1, -134, -49, -15, -83, 15, 119, 72, 60, -35, -20, -67, 60, 53, 80, -67, 3, -111, 230, 5, -94, 184, 247, 5, 120, -8, -3, -33, -84, 52, 86, 7, -17, 69, -23, 130, 39, 132, 79, -108, 50, 68, -208, -23, 31, -31, 62, 177, -52, -28, 87, 108, -154, -3, 25, -19, -17, 25, 53, -81, 46, 11, -86, 233, -2, -102, 129, -26, 27, -154, 47, 31, -138, -12, 7, 144, 36, -32, 38, 87, -16, 43, -118, -69, -179, -4, 6, -138, -141, 85, 58, 63, 42, -15, 46, -46, -20, 85, -6, -31, -18, -126, -32, 32, -134, 68, 102, 44, 79, -111, -116, -37, 51, -27, -4, -168, -39, 68, -33, 27, -148, -147, -58, 195, -84, 153, -160, 172, -162]
2971a62K14n7J90l91J86j01J09K10k42P4N0k40K33r4j35J75k57K62n2nM7J3j38
2994a11Q9N1k43P8J32o8R5J6j54J02k9P2q7Ql5J38r7O1J10k09J01j50N6J43r7
3019b8M0P7k28M11l89J26J33k46J63p6Pj11J12O3N0R2l6j74O5j06R3J21k4k73
3043a38J76q2J31K8j56j3P4j7K72l60Q1l8j0R2j25J67l0k66J87R1j25jJ1J86k38
3068a03P3J4O1j67K46l0j12j3J99k20J25N3j43J23k23J13J1K0j0j03N1k5K61l10
3092a09P3J33j54J29r1j03o0K76j51K48l66K05jj84J99N0m0j52J21J03j89n1K79
3115A65r6o5j43L08m2n3k23R0K01j18j35K72k59J9NK04j81J89j1j7j67RJ86j62
3139b4l3J21l3k7R5j30m6J54k4J46P8m07K50j64j2MQ3k00K06n9K9L5N6k1p2N1
$$ y = [-162, 52, -5, 185, -206, -20, -121, -12, 198, -44, 30, 80, -160, 73, -21, -156, 19, -238, 24, -28, -33, 14, 27, -111, -22, 29, -214, -136, -4, -72, 23, 39, -115, -13, -42, 30, -57, -49, -84, 54, -43, 18, 128, -81, 20, -130, -74, 69, -28, 12, 89, -139, 272, -117, 9, 142, -104, 59, -17, -10, -121, -9, 54, 104, 196, 160, -14, 51, -55, 38, 159, 135, -138, 38, -44, 87, 115, -41, -54, 20, 3, 275, -85, -4, -42, -52, 40, -85, 82, 52, -214, -27, 64, -61, -62, -51, 135, -103, -30, -16, 45, -122, 124, 94, -18, -31, 168, -52, 73, 126, -17, 106, -117, -4, 7, 27, 17, -86, -35, -60, 201, -109, -36, 97, -57, 72, -19, -122, -182, 94, -57, 191, -175, 30, 29, -155, 44, 94, 54, -98, 23, 126, -63, -114, 165, 69, 4, -139, 169, 127, 74, -149, -59, 142, 24, -111, 161, -98, -79, -74, 130, -51, 138, 127, 110, -57, -48, 138, -24, -57, 64, 31, 4, 99, -31, -77, 77, 53, 199, 277, -130, 120, -44, -56, -52, 31, -169, 37, -22, 7, 42, 98, 77, 5, 56]
3165E6r2K8m5K62j13j41M6j29J61K06j00r5M0l95L09m0K2K40l97J61M2q8K14O6
3189B18m8q3kq1j28P1P8N0j4j29J09p0L3O2n2Oj31J66j00K0M1O5p3J19j16P9m7
3216D3k0M1J0j15%p6J67j0p4nj34J47p3J51j82o3J69R4k18K6J28kLq6J14Pn1j
3244a0N9M8k5O7q7m8P0p2Om2j11K17j46K4N4j15K25k67r9L41j70J27j39P2j64
3269a85J76P9j30N7R0j26J94o9N0j36j82J70j87K40j56R0L5j8K8Q1j75R3n0J21
3293I0O5k28J14Ok8p6J24j4j22q9J51q0PJ15K2j46J21j43J61l6KQ1o2J05j40O
3319Fj38J67j21J47N3j60N4Rp8J09q2p4J32o3J82o9j22M9j4Q1N1k82K60j37Q9
3344D9l7k2J8j25R5q4R5%j11K44j13m7O4LL2k0k1n4J02N2J2k29N0J56p7J13p7
$$ y = [56, -36, -8, -53, 209, 96, -45, 1, -128, 33, 239, 139, 44, 84, -311, -2, -42, -20, 220, -177, -16, 26, -62, 152, 218, 170, 87, 85, 4, -124, -53, 25, 75, 61, -68, 41, -29, 4, 66, 14, 20, -111, 55, -45, -25, 16, 81, 8, 127, 11, 90, 43, 23, 64, 74, -41, -41, -117, 50, 40, -34, -39, -173, -26, -99, 52, -130, -193, -24, 70, -148, -122, 6, 4, 7, -79, 35, 42, -9, -10, 49, 97, 72, 139, 52, 4, 74, 2, 8, -34, -145, 72, -74, -50, 4, -111, 114, -153, -252, 89, -81, 46, -93, -21, -185, -9, 70, -60, -3, 87, -39, 155, 86, 136, 0, -182, -12, -199, 41, -115, -25, 10, -8, 20, 101, -74, 19, -31, 90, 155, -73, 41, 47, 19, -57, 67, 53, -69, -158, -7, -87, -80, 35, 57, -89, 32, -111, 50, 14, 16, 97, 35, 140, 0, 6, -132, 35, -86, 61, 114, -46, 8, 17, -61, 48, -34, -108, 24, -39, 143, 74, -48, 1, -13, 68, 119, -163, 97, -40, 49, 12, -10, 8, -117, -22, -106, -11, -11, -122, 122, 9, -38, 26, 29, 61, 41, 20, -34, 68, 120, 132, -97, -47, 109, 32, 145, 68]
3371F8j22J81j84R3m2k0j58L59k17J10R2k98R7K0q1J63j11l6j11P9nR3k31J80
3395h1J46k43J76J41j58P6r8m2J66j59J05p0J94l28J02J27n0j79K56q9L3q5J26
3418F6m2k09L66k44N3O0j79J32j3j75J71l7j8J18L2K2m1p9m2J32K2nj32j34J44
3443c2J55j7k7r8j33J95l0J06r1p7JL8p1K4R6j88L36j59K6J85m28K22j02J57j22
3468c4l0J25j9m0L7r7J21j01J66k40N7o2J82K0j61q9J95m7r9J70j40P3o1q5J82
3493B3R2k84P6JN1L8J3L0k5l7q5J04j37J16J07j25J06m4jj4n4K07r7j90P0q4R0
3520e3J62j10p3K56l18Q6K9p0J49pJ8p7J2M3j02J23K7N2o6k15Q6K54k07K16j09
3545A06j67J02j18J31r6N8J17j59J3r7K03j80j51J59RO9o2oJ28k13p0K09K33k64
$$ y = [68, -54, 127, -57, 36, -6, -26, -184, 175, -42, 68, 160, -138, -41, -21, -102, 61, -50, -86, -197, -118, -123, -30, -261, -81, 65, -178, -2, 139, -19, 57, -41, -83, 83, -76, 29, -41, 153, -175, -73, 54, 4, -175, 81, -8, 25, -60, 66, 24, -185, 181, -63, -10, 50, -129, 3, -10, -185, -14, -51, -69, 49, 81, 103, 62, -17, -59, 73, 95, 90, -42, -176, -32, 123, 106, 79, -19, -152, 43, 13, 119, 28, -49, -48, -10, -81, -57, 39, -149, 187, 28, 54, 239, -189, 33, -69, 88, -34, -64, 61, 42, 2, 39, -58, 63, -38, 128, -112, -55, -117, 65, 85, -76, -165, 30, -17, -116, 54, -86, -13, -74, -159, 23, 115, -169, -93, -92, -41, -3, 10, 40, 15, -22, -107, -3, -140, -24, 83, -42, 64, 20, 19, 5, -49, 158, 61, -129, -59, -143, -53, 109, -1, -74, 182, -136, -50, -21, -91, 58, 51, 69, -8, 4, 47, -55, 68, 95, 147, 81, -134, -48, 206, -1, 215, 106, -61, 41, -77, 54, -42, 16, 133, -26, -13, -110, 93, -87, -238, -79, -70, -1, -63, -69, 59, -154, -224, -15, 218, -46]
3569d6J16k32J95o2m4J14L0k2r1J41j03j43J77j85J64r7K91j71J27j78m2J85j87
3592f3Q7k42P5N1O6O4%M1j61M4P7j59J34j11J27J3k33J64J06r2j4j33K29L1j57
3617e6m0K36j38J6O8k60K57j24J28j27P5j40L6M03m36J4l4K14j90Q1L9O5j75J30
3641D2j63R3J15Rj06r9J30p5M0j3M0L3m9N6P7j34Q0j72j33J85N4k4jN5J3J58k52
3668d1J00O5r5p9N7l3M4N5M8R6p4j28K3N9j24J78n4j09j86J99q4N4Q5RP3j38q5
3695h5N1R0J6p2j42L0M6p5N5O9j7n1J2J98k14O2m7p5K19n0M0j41J0L1OJ32l9q2
3723b3P3j11J91o4j32Q4M4q8Q7m6m6n9J63j90R0L7K2m7j19J76j3r6P4j18J26j37
3749a22K06k3r7RO3k39K0R5K11o0p9J54N4j15k02J70n6J26K6j68N2K9L0Rq4l6
$$ y = [-46, 70, -162, 33, -29, -73, 41, 71, 49, -42, 99, -4, -147, 30, -155, 9, -88, 203, 32, 159, -19, -61, 124, -63, 24, -218, -143, -92, -26, 38, 38, 79, -82, -38, 39, -120, 14, -97, 30, 43, -190, -26, 80, -12, -26, -159, 70, 101, -56, -96, 140, 2, 18, 86, -174, 83, -41, 87, -40, 35, -105, -69, 334, -102, -88, -122, 92, -98, -17, 22, 87, -88, 42, -121, -28, 87, 96, -10, -109, 21, -54, -14, -27, 13, 46, -3, 53, 130, -4, 76, -96, -229, -44, 10, -14, -15, 40, 53, 211, -41, 59, 124, 29, -50, 7, -26, 18, 73, 121, 217, 143, 15, 38, 97, -27, 151, 97, -12, -198, 1, -83, -29, 56, 65, 138, 0, -85, -34, 56, 72, 0, -142, -112, -66, -141, -86, -17, -34, -85, -73, 125, -89, -27, -74, -149, 70, 20, 60, -81, -71, -40, -34, 98, 59, -23, 50, -61, 130, 66, -66, 18, 62, -26, 61, 15, -31, -90, 73, -117, -27, 10, 32, -15, -134, 42, 29, -67, 7, -111, 15, -122, 84, 61, -36, -27, 36, -203, -183, -88, 123, 63, -16, 138, 192, 77, -125, 45, -11, 115, 141, -27, 25, 54, 84, 93, 9, -27]
3775b7J04k0L4l6m2J06j68J40r2J43j36J92k68j44K15j16M1M6J45j35J9j57j6
3798a72J94p7j00J52r6K47j86J00r4r5J06J10k1j54J78r4n7o2j5K9R3lj95K37
3822B5K4m8L2m2r3Q4P6n1p7O2J7M4j24J51L3j38j58J51k54K15j87K49j24J02Q6
3847E5k01J28j60J66Q1j83J97j33PM8J4j04M8jj26J57o1N9j29M7j61K65J7J5P
3872E2K9K8j34N1K3J8j41J99j54m8J21n6n2J18N1j7k54K48j99J95k41R9L2J5L5
3897A8l7j20%J87j05r1R9J33j24J56r0j66N1N7m9R7j09K1J78o5j64J72o4n3N5
3922a3p6K8O8j52K49r5P%Jp7J27K7j63J41n3n6j16L9L6lK71j84R9k01J26l2J27
3949A25j73P8j24J08n3J2m9R4M0q2K0j20J46oJ16k34P9N7m9j4J64r9j38O1K5m1
$$ y = [-27, 77, 57, 91, 55, 13, 119, -49, 91, -1, 142, 6, 198, -70, -214, 1, -115, -74, -28, 117, -18, 1, -156, -172, 22, -55, -155, -3, -99, 148, -38, 62, -32, -127, -21, 89, 68, -86, 92, -2, -59, -121, -136, -107, -14, -17, -212, 25, 49, 1, 33, -9, -102, -18, 58, 7, -70, -8, 9, 53, -71, 80, 113, -25, -183, -32, -286, -71, -258, -9, -133, -31, 55, -146, -18, -178, -12, 69, -114, 83, -50, -43, 5, 19, -85, -37, -38, -164, -7, -68, -9, -138, -91, -252, 13, 30, 45, 52, 81, 109, -25, 26, 49, 67, -74, 125, -29, -77, 44, -12, -64, 54, 105, 88, -166, 82, -117, 78, -163, -64, -32, -17, 18, -19, -139, -139, 48, -57, -148, -49, 84, -40, 116, 26, -140, -89, -32, -81, 16, -93, -72, 106, 41, -123, 49, -15, -68, -13, -89, -61, 7, -145, 104, 9, 16, 16, 17, -60, 67, 94, -69, 72, 19, -37, -153, -114, -78, -81, 190, 6, 105, -96, 30, -2, 125, -48, 30, -94, 14, -39, -27, -76, 18, 58, -24, -4, -124, 22, 16, 132, -102, -23, 34, -15, -29, 135, 36, -102, -41, -16, -57]
3975e7J14JO6j03L7mk5k3r8J60Q2k34l6Q8L4j21R2k02L14k57N9P9Q0K1L4j28R2
4002F5q7J72j99P7J2L5M1j61K09l11K55M5j65j52J38l1m9K13k30N9j9o8m1L9M6
4027a07O5K44l38J53L4n7p2J34k0p3J02r2n2j0J33q6O0n8N0P8q3j15J78nP6j47
4053ho6R2M0m8j39K66l05J17O4j5O8q2J03L9k25K08j34J09n4j16J84q3N1j41O
4078f9J26Q6l15J49n7rJ99j37N3Q0j24j6N3N9J7p6J9j62J50O8k28K20j62O2J3
4103ak2L0R7j71J67k73K20p5J10j96K08j51j31L03k21N5K20l22N1J13L5l1p9N8
4127fj13R8Q8N8k57j9M01k03rR4j46J33l6k48K70k44J54R2k52M4k7J08p5Q9M0
4152C4n3j33J55N1r9Q1q9On9J05j03P6j5J05k24K38j38J40r6kJ55m6k15J23n1
$$ y = [-57, 57, 58, 124, 21, 58, 54, 29, 6, -92, 68, 150, -84, -120, -32, 2, -119, -27, -229, 85, -172, -113, -34, 46, 67, 101, -27, 65, -22, 150, -49, 28, 40, 75, 116, -45, 164, -147, 108, 153, -12, -164, -26, -57, -106, 107, -123, -64, -83, -151, -192, -153, -107, -42, 202, -136, 17, 51, -6, -78, 56, 36, -37, 65, -27, -79, -89, 44, -42, 18, -40, 10, 88, 5, -110, 68, 63, 139, -8, -74, 18, 58, 10, -129, 137, -168, -51, 13, -2, 66, -16, 87, 126, -99, 109, -25, 84, 30, -86, 98, 15, 66, -75, -69, 57, 143, -172, -23, -80, -89, 110, -27, 26, 106, -18, -34, 19, 78, 95, 19, 38, -124, 26, 94, -134, 86, -76, -14, -1, -23, 7, 104, -67, 100, -173, 47, -28, 82, -114, 94, -57, -188, 115, -106, -51, 169, -153, -102, 11, 46, 15, -64, -6, -119, -21, 67, 125, -132, -151, 250, 47, 38, 132, -14, 119, 83, -165, 105, -139, 15, 107, -145, -101, -128, -20, -95, -6, 34, -19, -152, 3, 54, -45, 36, -53, -47, -106, -1, -104, -28, -43, 62, -162, 76, -62, 78, -18, -20, 135, 89, -126, -3, -54]
4177e4o8K47r3r0J79j23P1M9j05P4j75K11k60Q8J06l4j12K50p4m9N8k15Q8j61
4201a92L06j97K7K8Q1N1j55P9k21K90o9j04J9K36M6nr8j63J03j04J21j38J13r4
4225d0J15j87j60K78j12rR0K4j5R8J1Mk83J34J5j07L12k14K0q9J07K0j68P4J22
4250D0k28R7n1J50j16J38J62l02k5J39O4K3j27J25n4P4R7r0k21L6j34K00QM4j42
4275i3J05l1j31J47k45K98j67J95j7k15K02J5n8N5Pjj13J66j90%J3J89m6j82N9
4300c8J4J08n4mP4j63J81k91J84nlj19J24j38N1L4J5K03l43J10J67N0k40m8J07
4325b4o2J14j6j66J11J53r1kP3j21K4j39K89j03J3K5j68r0L62j82J13m7j05LP2
4350C6M1j78L6K00j69OM1K7N6j11J19k4n6Q2k40K65p5q5J52j68R4j15Q8Pj23o
$$ y = [-54, -122, 125, 32, -58, 121, -2, 69, 118, 13, 87, -88, 123, -137, -49, 57, 23, -89, 161, 87, 38, 96, -119, -31, -192, 114, -83, -56, -28, 53, 104, -51, 28, -193, 97, 28, -76, -57, 179, 225, 220, 122, -41, 62, -42, 79, -59, 54, -40, 75, -112, -272, 6, -106, -115, -25, -1, -16, 82, 93, 97, -186, -52, -37, -144, 168, -46, -26, -115, -8, 12, -156, -82, 40, -188, -91, -142, 8, -108, 30, 192, -110, -135, 4, 68, 91, -36, 89, 35, 109, 206, 116, -105, -69, -203, -3, 5, 49, -93, 12, -19, -150, -3, -248, 50, -117, 78, 61, -154, 48, 63, 5, 60, 67, 66, -47, 119, -71, -71, -58, 131, 85, -97, -38, -24, 84, 30, 26, 100, -63, 118, -173, 11, 6, 3, -116, 8, -130, -79, -45, -30, 173, -170, -60, 107, 157, -83, -131, -24, -86, 28, 12, -154, -43, 110, 19, 17, 90, -31, -7, -146, 143, 40, 53, 78, -90, -180, 182, 0, 113, 66, -39, -36, 36, 77, -101, -65, 135, -34, -28, 13, 40, 96, -15, 104, 80, 24, 106, -134, 131, 56, -29, 123, -45, 49, -66, 22, 29, -94, -100]
4376a00J22k5j10J90J40k25J4k8O9J68j64l6PK0J09j08l9rm6R0p3k01R3P9M3k6
4402d6n3J69J16j99R9k46P1K0O2K10j45kj32pJ05j69K15j57j9j4%K04j56j0j01
4427a85J18L2J9K13n7o6J5k07R2N5m1p9J00k0N7j98J42R5j04j29K37j29K61j39
4451H2j24P8p8l8K30j23j41J25l3J11j5K8r1k27K22J41k33K7J83j9P4j57O8j85
4475i5N7N6j5j21J40q6k5J55k19P1n6K77k46J65j41J57nj55R7N3k61J02J46j08
4499e7J34k02J12J55k44J25m5j01l7J98o9l4J6N0J54j53k0M5r6R6j9pl2J27k23
4524a27Q9r6P1J69j49j4J7K4j41O0J44j27j8J34r6J77j29j18J81k4NR8k64J96
4548F2p3K2J44l4k28k2M9J39j5jO3k05J31l7K6J26l11K21q7O6j10J62j51N3L6
$$ y = [-100, 22, -3, -113, 77, 217, -8, 6, -22, 47, 215, 51, 15, 22, 42, 151, 43, 4, -5, -51, 39, -34, -235, -142, -63, -20, -46, -99, 70, 186, -13, 86, -160, -89, -69, -7, 203, 58, 56, -76, -83, 22, -147, 68, -89, -108, -122, -122, 82, -74, -84, -185, -67, -35, -16, 197, 140, 74, 89, -118, -26, 29, -12, -91, 9, -11, 46, -152, -10, 85, -19, -148, 89, -40, 221, 82, -42, 36, -42, -80, 150, 27, -114, 11, -22, 89, 74, 102, 11, -216, 6, 147, -86, -59, 124, 105, 179, 22, 90, -95, -38, 18, 3, -118, 22, -64, -89, 66, -153, -82, -138, 139, -107, 58, -83, 74, 69, -86, 11, 64, -197, -95, 51, -57, 77, -125, -13, 142, -102, 23, -22, -123, -160, 38, -31, -65, -49, 1, 155, 2, -18, 27, -69, 27, 8, 1, -31, 96, -127, -38, -134, -63, 106, -43, -57, -40, -16, -157, -97, 47, -80, -98, 36, -60, 117, -12, -130, 51, 27, 32, 130, -134, 62, -11, 11, 155, 121, -107, -129, -80, 59, 44, 43, 106, -99, 32, -5, 21, 147, -164, 57, -30, 36, -74, 88, -63, -10, 26]
4573B6J2R9k33J04jJ3j75J88J0p8J9pm1J02q4L6J02j76p9J06K62j55j82K22j28
4598c8R1m3j85J26m2J05n7J29L4j24O1nj48k9J48l4Q4q7P0l6K8k15R4R7K4o5m
4625b1m1J51j69l0P3J96M2j34m2J5j17J82k1p3OJ38q9J14j91K02K5j25k12K9L6
4650e6o4J17k6K4O2j34k5K67j44j0j05Q6J4n0Q7q7nQ1j34P2K43k73q3J76j86K56
4676A03k50k9J48O5J30j50o2j00J59j21J34j00m6K41j19p4K2M5O9o8o9lJ79K2
4700A26m3j68J32o2K7LP2Oj61Q5n3q1R7k6J98p7m7j86Q9J76m5j08p4J24l8j62
4726a96K79j48J49Qk69J57N1k7k9N6L3q1NP5j70K94k47K8J8q0J27l3J14l9j23
4751d8J87o4j17J00N1j97M8J15j70J86L0k69R7k0J36J17j44r7Om6Ql3K72k11J33
$$ y = [26, 38, 137, -96, 8, 7, 20, -155, 33, 43, -35, -16, -23, -64, 38, -46, -10, 92, -84, -163, -57, 205, 50, -132, 90, -38, 53, 10, -175, -49, -91, 14, -43, 86, 120, -4, 57, 52, -96, -125, 23, -11, 73, -14, 56, 20, 48, -167, -73, 24, 48, -17, -21, -62, 89, -80, -110, -37, 159, 201, 67, 25, 40, -77, 105, 84, 11, 17, 155, 66, 180, -11, 191, 216, 91, -121, -92, -56, -120, -3, -29, -5, 57, -77, -102, 165, 21, 11, -94, -8, 6, -44, 43, -44, -49, 32, -102, -30, 213, -60, -143, 33, -153, 103, -147, -176, -28, 37, 167, 17, -45, -145, 14, -107, 27, -73, -119, 122, 3, -71, -49, -4, 65, -3, -72, -75, 104, 126, 83, -85, 47, -15, 12, 15, 87, 93, -68, 17, -36, -117, -20, -46, 152, 75, 28, -158, -69, 107, 62, -46, -120, 4, -34, -196, 83, -65, 84, 92, -177, -20, 31, 4, -25, 31, 64, -17, -12, 63, -107, 187, -60, -32, -14, -94, 33, 0, 114, 75, -48, 139, 75, -42, 58, 109, -88, -40, 75, -95, 91, 121, -148, -51, -71, 65, 182, 38, -59, -53, -99, -91, -124, 148, -63, 70]
4776G0Lp4p7K36k35JN5J20k20K9K27j22N4N9P1j79k01J60L3o1K7j69L58k53J77
4801H9j51K43j28kq6l2q2K53j75J69r1n2P0k8k3J62k81K20j38L6L6J22k33J32
4825C0j22o8J79j29J21j20m9J75l5j36K29j45J78j45J36kj18RQ3j40K3J46j30
4848c0J08O3l99K84M6K1k22J90p8j74K25ml1J18k3O0l49K68P7q3o5l3o1J18j06
4873h0K2J48O4j18n7k0R7q2J46Jj32r2J52M9n3q2m1P2j07o0K53p4Q8r4Q5o0lo5
4901d3J15o6o5K8m4K71j82L4j36N4l9m2M1J21r7J05J1r0R2j12K23k17o3P8p2O8
4927b7q0J39N5n6j06O9m1K9J0J14k34KM4P2K8l8j1j57J94J35j60q5J03J6O3o9
4953Ij40K71j54n2P7k33J47J10m6O6j11n4K45o4Rk12L2p4J72QO9j23J45p9j17
$$ y = [70, 73, -1, -78, 158, -77, -76, -21, 99, -121, -92, 135, 13, 67, 126, 197, 18, -183, -23, 10, -51, -24, -193, 165, -88, 89, -62, 181, 53, 51, -35, -67, -149, 104, -71, 98, 7, -45, 25, -3, -26, 136, -145, 75, -63, -27, 9, 131, -102, 30, -92, -160, 19, -110, 11, -109, -158, 17, -18, -154, 75, -70, 108, -37, 99, 97, -21, -12, 71, -69, -46, 100, -30, 78, 141, -258, 26, 72, 93, -129, 61, -17, -191, 34, 30, -1, 117, 94, 154, -195, 73, 150, 67, 2, -31, -92, 26, -80, -58, 90, 154, 36, -21, -41, 56, -26, 120, 121, -11, -103, 49, 98, 45, -37, -78, -6, -113, -173, 80, 6, 94, 0, 85, 25, 22, -43, 72, 6, -59, -31, -75, 196, 14, 48, -88, -34, -73, -115, -74, 47, -50, 55, 66, -24, 68, -44, 179, -38, -101, -23, -95, -27, -107, 32, 87, 31, -75, -6, -47, -18, -8, 106, -128, -126, -82, -10, 18, -20, -31, -188, 6, 141, -19, -104, -1, 15, 78, 9, -131, 140, -14, -66, 11, -222, -75, 35, -11, 55, -56, -110, 135, 71, 80, -132, -100, -174, -2, 6, 75, -48, 97, 18, -99]
4978i9P9R5q1mj8J1L9O7j10p3j38M48l69K09J9K6r8p4k8J59q0J70n7l9j02p3J56
5005C5Rl22J48J31M3K15k80J26j78J23J35j68n0q6K04j65p9K11j09M0k6j03J55
5028IM1L7N6j42q9J20K7M7J8k43J52J40j69N8j5r0J0Q1o2J47k45J68l3n5j1n4
5054i7J3QM7N8K06k33J50j17Ll9R2j21O0n3J53j04m9Q2L3j11l5J58j32J19n2O
5080D5l8p8K7M7J52qL4o9l8J23o7k67J89k05J59J39j99j1Q5J48j05j34O2P1L9
5105A01l4r1J36k60J67m0q8K12J18k05j05K34k17k0Q7N1j52K19j03PM7j08J61
5128A17m7o2J2j14k0R6r8Q0j10J83l6O0m0M0l5j23QK0J21j26j6j0P5k13K90j24
5154g2J95p0k08K41l4N3r6J17m3r2R5Ro8K1l3L3j1j53J16j13j1K47k37P1k3J09
$$ y = [-99, -20, 75, -6, -10, -28, -17, 22, 89, -21, -94, -232, 216, -153, 56, 75, 101, 3, -71, -99, 60, -20, 150, 93, 54, -48, -121, 35, 44, -278, -130, 1, 44, 259, -21, 105, -73, 50, 185, 17, -33, -119, 85, -80, -159, 52, -57, -17, -43, -146, 9, 50, 87, 143, 1, -88, 32, 59, 106, 124, -119, 33, 173, 4, 62, 47, -43, -33, 48, -14, 133, -112, 56, 23, -32, -43, -97, -84, -76, -29, 29, 235, 2, 152, 35, 38, -1, 91, -30, 30, -23, 130, 26, -23, 59, 92, -19, -54, 104, -28, 91, 39, 45, 7, -71, -44, 3, 155, 147, 181, 112, 74, 197, 130, -137, 52, -153, 6, 145, -54, -65, 20, 168, 63, -71, -9, 62, 101, 67, -24, 112, -148, 19, -21, -109, 103, 221, 16, -89, 145, -72, -92, -5, 46, -106, 113, 10, 17, 64, -44, 117, 70, 8, 20, -94, -114, -18, -116, -36, -146, 37, 1, 61, 21, 61, 26, -97, -89, -69, 52, -74, -90, -100, -25, -238, 52, -72, 123, 53, -155, 86, 52, 105, 9, 126, 83, -9, 86, 95, 27, 48, 15, 48, 37, -116, 0, -113, -124, 123, -114, -43, -66, 43]
5180D3m6J17j35k0k8j3J35k15J13r6J4n9L22j15J5J03p2K4r2J46j74Q4j17n0J10
5205fk7M2l1R0j02O5R2p2j57J12n3J76l43L41q9k4J16p7j7j1k6P2r3k7J24r6J34
5232A13j97J78O3j67k06L04j69J78J65k30q8Kj5K45j69N6j47K9n1J32J24j69m1
5255f0N2j35k7J79p6J35m0j7M0j0R3j65pN6q6J62J2Kj18Jj60J15m9J41j22L8o5
5282a11J56NK5j02Q9J22Nk50q8L10k53J34N3k37J90j88N9j40K93P2k18K90j82
5305C4nj2k4rm3K25l05K20j42J7P2q9J01J10k69J39n4j9j56J58M5N0J09k02J02
5330E3j48Q6l7k9L00lk11M1jk25J73J53l13K06R9j24p2l6O9j20J19N2m5J11p2
5355B6P6j46L2k3JR6J4mr0j36P4Q8P5K9r6J12r1j75K8OmJ11J43j79K00q1j55O8
$$ y = [43, -3, 114, -21, -41, -69, -82, 53, -162, -49, -145, -131, -190, 132, 17, 32, 135, 63, 87, -5, 141, -33, 51, -66, -116, -6, -33, 9, -22, 68, -34, 31, 123, 51, -106, 6, -47, 129, -214, 127, 38, 14, 130, 53, 36, 25, -1, 71, -22, -49, 75, -21, 113, -84, 94, 157, -10, -216, 88, -81, 97, 262, 32, -56, -54, -69, 176, 7, 63, -84, -55, -106, 26, 150, -19, -60, -8, -143, -170, 9, -67, 68, 28, 11, 51, 41, 134, -31, -38, 18, -68, 94, 106, 108, -10, -9, -169, -54, -103, 38, -84, -46, -111, 45, 50, 75, -27, 62, 184, 189, -61, -149, 161, -92, 42, 95, -142, 48, -140, -81, -221, 72, 144, -74, 216, 34, 29, 17, -7, -16, -59, 166, -139, 81, -61, -44, 28, -61, 40, 150, -119, 20, -34, -53, -209, -51, -6, 44, 153, -49, 53, -95, -9, -46, -75, 225, 222, 11, 52, 51, -174, -1, 152, -161, 45, 144, 20, -52, -88, -19, -139, -20, 32, -13, 98, 26, 102, -44, -12, -35, -34, 62, 76, 72, -18, -154, -80, 8, 83, 112, 16, 128, 37, -138, -110, -104, -108, 3, 146, -33, 167, 86, -69, -1]
5383al8j5l7K32r6o1J22j29k5r2R0O1Rk0J46q7R9j29n8Pp3K53j62J28Lj86J01
5410D2k0J8J65j33q2o2K53j40j54J66j15K14j39O7j05j4L8K5k6k22J22J06R3r3
5434DM0r3J18Q2q5R0j51j8j74K01J29j35Lj05J20n1k4R9j94K35j13J22k9p9l2
5459d0o4N1Q8k27K86j01Q8j32j3O5pQ9k86J32K2R8Pj54J35P3j52J30k18J45j68
5484a53N5M7M0qJ01J9k90J29J32k16J42O5j07Q7j90J30J76l30J11M7Kj37K05j52
5508i5P9j5R3o8%j28Q4R1K8j30jM5J2m8J05j52nP4N8l1O5m4K2J9K9j59Q4J27j83
5537d4j8n1J05K6j15MK92l07oJ61p4Q6r8l7K21k62M0J80j87n0J85j98J52J1L0
5562D6l5O0j20q1J76n0j11J78j57K4J03j42J09N3J0p5k0J25o1j0p7J03r8N1J18
$$ y = [-1, -39, -54, -91, 141, 45, -16, 106, -23, -48, -140, -50, 11, 20, 0, 146, 59, 158, 29, -29, -22, -95, 158, -4, 124, 127, -59, 42, 22, 40, 205, 72, -10, -72, 181, 41, -113, 53, -62, 152, 13, 80, -25, -39, -1, 24, -2, -224, -102, 4, 97, 4, 44, -49, 69, 151, 66, 156, 5, -13, -187, 14, 143, 8, 11, -94, 26, -25, -49, 50, -144, 91, -22, 100, 71, -8, -40, -104, -53, 35, -192, 94, -7, 81, -51, -64, 1, -6, 83, -203, -71, -49, 49, 56, -98, 37, 110, -42, 88, -130, 15, -153, -98, -51, -11, -19, 82, 101, -189, -60, 72, -144, -2, 63, -44, 43, -147, -17, 159, -171, -60, -13, -11, -148, 57, -95, -16, -31, 62, -6, -6, -134, -50, 41, 69, -61, -62, -17, -5, -53, 52, -100, -105, -31, 27, -4, 61, 17, 39, 58, 87, -72, 12, 139, -44, -62, -113, -8, 18, -97, -93, 199, -108, -114, 47, -27, 59, -39, -76, 145, -117, -77, 103, -84, -134, 51, -147, 5, 16, 46, 11, 71, -49, -130, 46, -4, -115, 63, -94, -70, 33, -109, 0, 53, 63, -12, -32, 93, 32, 22, -55, 48, -50, 1, 119]
5587A19o6j82J42%J42j57J07n4n2j23Q0J9k09K67k90K78k9k8O8L5j69O1mj38K63
5612H0Lo7j61J92j71J13j3n2J29j67N9K82l56L11k36O9p3P8K9q9O1r2L2O6j47
5637a20L6j37J8K27Q9j11j7j31K33l3j07J99j28J71l38J73J87ok30j22J87j03
5659f3loJ0j14J60R4k04J14J08j79j5M5P7j15Q8M5o9J70n3j25J52k15J10l9r1
5684a18J00J6k5J16m6K6j4M1j50r5J61r8L04k67K02j87O7n0M7O3Ll6m6Q0q3J3
5710B4K5j53P7n5J66j06j05J18n8R9l7L0K9m4O4j18l9J43p6J81j47Jj56K21k6
5735E8J2Rk22N4J3K37n3k50L1K00k7l6j54K34m9j03O6J27Jj75J77j78Q3Q2j79
5760d2j58K29o5L2k03K94j49J17j35P0j6P2l5j63J23J7K01k10j12J75l8q0K26
$$ y = [119, 53, -129, 13, 13, 155, -2, 105, 51, -1, -124, -44, -25, -234, 33, -257, 21, -8, -36, 32, 67, -102, -41, -45, -183, 80, 83, 16, -145, 47, -124, -11, -24, -76, 53, -114, -55, 227, -129, 182, -54, 15, -58, 20, 49, -40, 21, -71, -39, 27, -120, -84, -221, -203, 24, 113, 2, -15, -146, 87, 54, -53, 146, 18, 189, -149, 24, 211, 205, -25, -147, 40, -63, -66, -72, -62, -176, -16, 78, -126, -12, 96, -83, -98, -53, 24, -91, -3, 42, -27, 143, 90, -35, 117, -98, 12, -27, -118, -18, -2, -27, 89, 43, 69, 55, 96, -54, -149, 12, -86, 218, -49, 153, -34, 33, -17, 30, 93, 96, 60, 14, 94, 11, 24, 49, -104, -27, -82, 84, -22, -127, -9, -67, 32, -5, 25, 54, 10, 74, -44, -83, 60, -16, 165, 18, 19, -137, 84, 58, 70, 79, -143, -89, -76, 161, 108, -142, -111, 89, 62, 26, -128, 106, 57, -46, 20, 147, 148, -27, 150, -28, 55, 137, -42, -200, 29, -36, -4, -207, 87, -62, 55, -80, -10, -26, 46, 11, -152, -29, -12, 189, -21, -133, 42, 4, -76, 150]
5783A50j28n0k0o5J29J6r1n0Q1Q8K0k3j54R5Q8j73Q9j9ok2N0K36j80j75J25pJ05
5810A09p5L4n5m7Ko0ql6Q3J51j16M1L9k9J73q8j45j7L8J9J51k11N6P1q0r8m3K51
5838A10j04M9j08j19J53KL2j25J82N5j42L9k67M78k03Mr3J49j15O2R4l1k53R6
5862e5m4J32L5o4K2j86J11p6J64P7k08P8K31l18k7K33q1K9n3J40P0l27J82o0r0
5887h5M8J67K2k26J63l7o6n5L6j13L33j50Nn6j26K67k83P2K9m8l5K27m6n1p1M9
5913c0M4J21k58J25r4J72j09N4Oj49J70j38J86k34J65o4j3Q9o4o9j13RJ82Q9j53
5938g6l2J39n2Q4j39O7r2KN4j07J42Q2n0n2O7k3J38j65k1M5R3O8k01N8M1j64K39
5965A45k52J51Ok05K33J10k77Q6J4r0N7L9j8J12k68O2J28Lj56J00N9j04J49r4
$$ y = [150, 22, -28, -48, -113, 16, 32, -59, -109, -28, 60, 80, 57, -97, -2, 86, -87, 2, -17, -23, -45, 5, 241, 61, -114, 11, 4, 109, 34, 68, 13, -34, -32, -92, -100, -136, -53, 98, -18, 23, 62, 33, 206, 118, -27, -44, -6, 13, 164, -47, 9, 80, 0, -98, -141, 110, 6, 55, -53, -172, -19, -17, 15, -110, 72, 127, -15, 24, -243, 235, 32, 36, -57, 92, -23, 39, 133, 102, -151, -55, -99, 33, 68, 4, 26, -160, -49, -125, 39, 116, -92, -14, 217, -101, -128, 105, 24, 53, 0, 140, 210, -117, 65, 5, -85, -37, 130, 152, -74, 89, 52, -14, -69, -33, -146, 187, 37, 42, -14, -140, 127, -156, -84, -55, -103, -138, 89, 43, -8, -79, -30, 14, 135, -123, 2, -92, 80, -29, 25, 31, -118, 52, -86, 100, -134, 31, -33, -46, 43, -21, -90, -203, -194, -12, 77, -76, -108, 31, -21, 63, -76, -9, -101, -99, -45, -152, -10, 72, 22, -30, 37, 14, 152, -13, -34, 11, 104, 172, -29, 29, 70, -94, 145, -107, 44, 50, -155, 78, 188, -89, -3, 11, -79, -22, 17, -1, 111, -157, -95, 33, 36, -120, -20, 39, -65, 84, -10]
5989a0m1J27k1j57J67Ro0L6J09j98j11R3J8J38J0j18P9j39j8P6j22k7j0rK94l8
6015G7J4j36J64j01k10R5J65O9m3p6n3l9J02J07j06j26J30j4N7r6L1q5M8n1%N2
6041b5l5n7J87P0L0J3j23j02P5q8J99l4j32k5mJ14j34J03j07J02j25j7kR9J5J02
6067I9q6j73K42j62l4J13p7Q2r3J33k7j5o7N0J09k0o6K37r9j22J25j51o5J35k11
6092a43K98j23J49o3p5K01k95l7L1P2p8R9n4N0K2j49N7R0j14J37o4oK97k73L7
6117F6o1Q3L6j27o4j2J12j88J43J18j07N4o1j34K12k00K66j46o9L7K2j59Q4K3
6141g2n2J97K3r5p7J19L1m3K5j38J06l0J74j83p1J36q1J83j17o1J7J15j12j25
6165a31J43M0J22j18m1n6O5pq3L1J74oj45R8k25J62k71L43o4n1K08l29K1J86j76
$$ y = [-10, -51, 76, 55, -102, 65, 74, 14, 50, 159, -39, -150, -57, -39, 99, 109, -9, 70, -69, -87, -11, -133, -160, -170, -179, 115, 77, 91, -45, 119, 18, -192, -97, 68, 137, 94, 18, -35, -74, 28, 135, 29, -97, 33, 19, 76, -20, 11, -74, -26, -77, -77, -25, -60, -117, 70, 140, 170, 183, 60, -42, 33, -55, 144, 110, -22, -47, -51, 63, -71, 32, -75, 27, -98, -115, -117, -18, -3, 99, 13, -160, 82, -80, -114, -1, -78, 4, -89, 44, 17, 2, -65, -15, 94, 74, 8, 245, 146, 24, 149, -2, -67, 68, -143, 155, 32, 181, 118, 43, 244, -51, -88, -57, 15, -63, 36, -18, 32, 54, -95, -38, 52, -62, 75, 11, 5, 302, 29, 66, 5, 88, 124, -3, -67, -79, 33, -155, -12, 106, -1, 53, -8, -142, 70, -130, 136, -10, -79, -42, -20, -179, -95, -72, -124, 73, 96, 1, -76, 43, 74, 31, 56, -82, 24, -6, 168, -15, -86, 50, -31, 152, 35, -26, -9, 106, -6, -131, 12, 52, 174, 56, 15, -41, 24, 17, -66, -35, 139, 133, -12, 86, -139, 23, -248, 95, 31, -20, 188, -141, -120, 66, -110]
6190a10J62j76J07N7o8j95K55l7L3j88Q2M5j03J49n2k2k1J37r3J74q7J6l50L67
6214H2j0qr4k6J5m0m4j66L70l4n8L9k9K3l5k5l2P5j4J30k46K20R2j74j33O8K56
6241B02k29J8J61k33J30n2l7l15M24N1j14J9l7k3j58L15k17J07MM1N8n0l7j42
6265a14J77J2j14J12j2p0O9m7N3m2k64Q4J85J27j60J44nk78J95j70J92J01r4j54
6289g3Nk1J72n6j07OO5M7j39k9M4K3M8R0p0qM5K5k3J30k60J45K8r8jn0J03l8k23
6318b20K02rk38J10M3P6KJ16K2n5o3j02J39k9j41J95j87J59k7j2jJ53j28j22K59
6343A42k87K82q9J20k81N0L4j57N5J25k4O1N0J26l05M6p7J99j91J17Q1j59R2m4
6367c4L0L6o3m0J06j51J12KP7j44n5J08J32k26J10j5o2J63q9kj16O7N1J37j66
$$ y = [-110, 52, -124, -17, 40, -28, -223, 32, -5, 28, -160, -78, -33, -136, 13, -39, -61, -82, 55, -38, 136, 49, 65, -285, 82, 72, 64, -30, -56, -41, -81, -125, -291, 79, 45, -13, 26, -3, 20, -15, -40, -72, 3, -11, 119, -127, 93, 185, 11, -122, -54, 202, -27, -9, 152, -81, 49, -3, -40, -355, 69, 120, 6, 25, -12, -35, -193, 122, -95, 12, 16, 57, 115, 65, 28, -114, 63, 75, -39, 73, 61, -9, 60, 13, 66, 24, -240, -156, 29, 156, -4, 140, 135, -143, 52, -118, 74, 175, 81, -73, -68, -89, 83, 27, -80, -74, -9, 38, -101, -130, -86, -63, -15, 75, 5, -3, 42, 67, 44, 174, -86, 59, 87, -11, -12, -62, 41, 3, -220, -18, -27, -265, -155, -112, -36, -34, 82, 104, 49, -14, -116, 23, -6, -147, 48, -139, 20, -7, -19, -20, 133, 5, -117, 142, -145, 137, 48, 168, -113, -63, -29, -186, -131, -6, -30, 31, 81, 207, -98, -52, -129, 70, -121, -4, 77, -82, 10, -34, -4, 32, -31, -71, 35, -116, -4, -2, 75, -69, -124, -16, 116, -110, 0, -15, -77, 86, -3, -5, -121, -54, -3, 134, -32]
6392c2N4p9P1j20N4J61o4J18l43J83P9m6j09R7l1K4L1n7J5p6P7j08J99j21K4q4
6418h3N1L4l0Q8qMJ13j14L8q7o1j13R0J5J30K20k85L3J5n8j25K42k04j6j6J13
6444a4J5M2k1OO6k43L8M3J09qj13J4NJ1n1K14j33q0K09p8k4Jj15J67j81N9K06
6471A44r6k11J32J60n3j29J6n1J5M1J31j89l8l5K6K06J2j04J3j06jL4J91j43o9
6496a04r1L42j00n1O4o7pL7r6R9J04j12Q6k09R4J16j32N8J3k04R6M4J31n1r6j8
6522e4J23l9k4p2J92k47J41K5L4q7J25N3k48j23K02j01K7N2rJ19j33Q9m6j63J67
6547Ck19L27n3n9j10Jj0J10O9r0nJ49p8j66J82p9L6M4o4J42Po9j53J20j55N2J97
6574A29k15Q5j14Q7l2J22k10L0P4J46J4j14J79l99j4K98n9nL8j14K6J5J19n9q7
$$ y = [-32, 22, -57, 14, -106, -52, 109, 45, 163, -180, 3, 82, 36, -73, 24, -7, 17, 48, -9, 6, -70, 7, -101, 98, -23, 1, -83, -32, 2, -28, 60, 52, 56, 169, 55, 93, 6, -55, -168, -78, -63, 67, 287, 2, 35, 50, -8, -133, 109, -95, -111, -127, -14, 1, 43, 22, 28, 94, -149, -111, -68, 41, 33, -80, -66, -61, -50, -101, 113, -20, -100, 109, 31, 7, 8, -107, 60, -121, -62, 144, 48, -163, -31, 129, 76, -53, -37, -88, -73, -32, 99, -90, -128, -163, -137, 69, 81, -23, -10, -116, -117, -83, 108, -35, -104, -195, 147, 47, -4, 60, -7, -14, 23, -73, 26, 130, 18, 104, -105, -11, 105, -27, 31, 44, -160, -64, -20, 111, 60, -36, -54, 69, 30, 6, -66, 126, -121, 20, 45, 79, -8, 117, 170, -78, -201, 1, -100, -73, -21, -30, 89, -44, 45, -1, -164, 3, -216, 111, 58, -1, -111, -110, -120, -10, 59, -31, -36, 113, 35, -131, 51, -28, 8, 52, -12, 130, 137, 68, -85, 35, -120, -68, 129, -86, -1, -115, -28, -60, 62, -148, -118, -44, 102, 116, 2, 181, -218, -232, 66, 7, 2, 40, -74, -48, -33, 86, 27, -60]
6599f0N4L8j06P6K5j3p8o1J23m8j55K66J5p0k1o4N4KJ14n4p6o6J11o3ok5J14p2
6627d6OJ05n0n7M4j5r7L08k22o4J04j29J88l8jj72O9J09m1R8k3j14mq1K03k6j2
6654D2j09J81j99K18k40J66k6J60j54j45q2P4L22j42l9l7J7J0Qj36J47j04K69
6677B01k51J62j91O2m5J05j42L8J60j03o8j3O6L6j4N4M1P2k41p2R2R8k07J38J56
6702A34r1j73J56J05j52o6J3Q3k9j03J38O0k38K84k35K5j6J51J2j66O5M1j6j71
6726a89J35N2k9J88j16l0j31K0K27l8or8Q7j76R5j7R1k36J42R9p9k18K91k8k1
6751A5n8kLRJ25k47J38R0m4k9J15k44J51j04J85o0o8N9o9J17n1q3Q1M0pj37J36
6778F1m8o4nm3P1L4r3L1k01K84J0j52M8K3o8K19p5nl5J41p7r6K1j9K51k74K9j12
$$ y = [-60, -6, 32, -74, 2, 27, 14, -64, -125, -2, -50, -205, 61, 76, 6, -15, -79, -25, -23, 91, 37, -39, -105, 6, -57, -63, -88, 26, -46, -40, 65, 15, -42, 2, -13, -110, 198, -24, -88, 16, -113, 75, 37, 36, -136, -67, 42, 1, 99, 76, -38, -42, -123, 80, 54, 42, -67, 114, -85, 133, -107, 59, 33, 193, 39, -106, -188, -114, 208, 66, 27, -10, 7, 17, 25, -111, 36, -68, 201, -50, 112, -79, -17, -62, 43, -99, -61, 99, -4, -72, -85, -19, 17, 3, 57, 98, 170, -71, -143, -51, 47, -160, -22, 134, 43, -130, 26, 131, -21, -87, -74, 9, -20, -123, 15, 75, -163, 121, -114, -89, -105, 46, 58, -108, -43, -2, -18, -189, -54, -2, -31, 157, 41, 11, -120, -100, 127, 89, 83, -15, 72, -104, -9, -26, 65, -171, -29, 70, -9, -227, 64, 36, 15, -43, -45, -42, -33, 92, -155, -17, 73, 29, 0, 115, -129, 22, -82, 103, 43, -25, 34, -35, 82, 31, -52, 29, 69, 62, -75, 61, 13, -51, -56, -99, -28, 6, -87, -56, -257, 27, 37, -115, -67, -44, -112, 107, 32, 27, -8, 133, 56, -40, -19, -38, 213, -61, -32, -144]
6806a44K5J97j24l2k2N2l1O2K4K10j61j3J4j89M9K15k49J81k99K98n8j0O8j1M1
6831I3J0Ln4%j19l7Q8L6rj10P9j7J23p9j3R5j92J22p7NP8J26j05Qj30j99L05j01
6859g1P4Oj8j01J20j10Q8J14o5m2L4J00k6k96K42L2n4j93J55k31L17o8J34j39
6883Bn0J08Q0j73pR2r1R1J8j42P6L3k46L03j34J95k19N3J25q3j25J84j28j13K54
6908A03k31J74J57l54J22KO9n6r4j1q7K61j3j41J20K4j02L3k0J73m8l3J13k75
6932a14K6J20q5J70k6p8p7M2k07K26N4L8Ok3r8J89j57j60K55j45J83n7j09R1j43
6957g9oO6J05o9j75J31j26J36J20l3n4j48J65p4o3K36m1n9N0n6J0K8k74K11Mn6
6983e1L7j2L8k5o6J76k29J91j16O4k4J64j27r7J2Q9R5Rk5j12j16O2N6l3on0MK35
$$ y = [-144, -119, 78, -46, -78, -100, -48, -79, -17, 7, 217, 56, 43, 57, -132, -83, 132, -117, 64, -235, 63, 5, -5, 63, 52, 93, 103, 106, 52, 52, -67, -104, -16, 20, 11, -99, -20, -37, 86, 7, -6, 89, -103, 19, -58, -53, 25, 151, 46, 54, -76, -275, 30, -71, 3, 9, -9, -110, 10, -100, -12, 102, 37, -5, 29, 129, 103, -193, 49, 81, 27, -166, -11, -242, 75, 7, 141, 2, -48, 60, 140, -33, -40, 52, -39, 52, 70, -72, 4, 37, -209, 94, -40, 155, -64, -11, 114, 31, -94, 90, -38, -151, 103, -128, 46, 203, -151, -29, -27, 42, -14, -108, -119, -206, 55, 42, -99, 21, 45, -57, -24, -44, 129, 81, 48, 161, -114, -88, 32, -53, 117, 91, 13, -64, -22, -229, -3, 51, 89, 95, 72, -26, 163, 6, -154, 101, -44, 139, 82, -27, 64, -79, -85, -19, 86, 17, -158, -27, -153, -17, 103, 70, 16, -132, 33, -41, -104, 132, 91, 32, 82, 26, 36, 64, -210, 1, 5, -51, -14, -26, 12, -13, -79, 97, -132, 59, -57, 7, -17, 147, 20, -77, -65, 24, 119, 128, 103, -9, -125, -63, -7, -40, -46, -96, -92, 143]
7011A43p3k29J96j22K45j25R7j66R1m5j73K45m1r3J74j66J37j67Q0l3O0j61JK09
7035H4rk26K10p9M2j39o7K04J11n9j24J15j71M1J05n5k6J29q5p8J18mj89K09n9
7060bn4J33j01N7L7o5r2K09p3j29J40M0n5o3J37j15%q5rJ1O8P0R3o2r9o7k20L29
7088C3j22J84j7j85R9J61j60p5K06j91r7M6P7o3K11j40Q6r6%k2P3j25j00K48O2
7113I3j49L3j73J11N7r3K73n5j15J69q1r1R0j86J01NN1j35L3n6PL39j12m3m4j42
7139a13j3K72k37M1l5J36J12j02L8j44Q8pm2K05o6Jr8o9L2j2O9O1N7l00J34p8
7165g0L0L6m5J05O8j53J30o3j28K8R1L8qn0K9k2r5M8q8K4J98N6r7mo1J14j60J91
7193A42m6j50J99r6n5RJ92k25q3J69K8j88j0L3J51Q3r3j24M8J2RJ20j12J82k76
$$ y = [143, 70, -159, 37, -85, 160, 35, 132, -34, 57, 12, -161, 84, 43, -50, 124, -42, 95, -72, 8, -25, 35, -126, -125, 84, 75, -151, 59, -20, 22, -117, -184, 20, 131, 72, -52, 63, -108, -67, 38, -17, -43, 86, 1, -77, 41, 37, -152, 57, -2, -56, 77, -24, 33, 70, 5, -87, 122, 49, -80, 60, 100, 45, -18, 119, 4, 4, -81, -90, -79, -11, 59, 152, 90, -9, -76, -296, 33, -89, 95, 78, -107, -8, 153, -7, -82, 124, -67, -164, -118, -41, -104, 107, -33, 53, -43, -43, -65, 8, -117, -217, 31, 93, -56, -23, -196, -85, -28, -121, 152, 97, -18, 151, 70, -21, 69, -117, -16, -11, 40, -95, -62, -118, -111, 228, 116, 73, 29, -113, -126, 146, -91, -50, -85, 51, 163, 61, 99, -45, 43, 36, -6, 199, 133, 134, 36, -33, -1, -13, 56, 117, 174, -126, 8, -70, -40, -4, -49, 56, 124, -29, 101, 38, -90, -62, 29, 67, 59, 9, 38, 16, -79, -31, -119, -95, 103, 159, 62, 58, -3, 111, -49, 142, 96, -54, 145, 49, -6, 3, 195, -30, -113, 56, 84, -104, -114, -81, 70, 153, 60, -64, -16, -4, 5, 125, 13, 195, -81]
7218h1R6LJ07l61J59J06jN0l53M07l26K79kq9mJ88k01K4J04k01J21J66l39J18
7242c0j18J53Q6j44J30k5j35K5J96j62j8J64j2j91K7O6N6j28Q2N5n3m0K9m9P3
7267C7Om2Q7J8j83LJ33Nr0l8O9k9J0O5j22Q2j4O4J37l0j23j05J73jk79R0J25J02
7295A50j67j06P9J26j50R3l9q2J55q9J57j56Q7j36J17J9m4l8o0K26k28k2N4J29
7319G5j0P1J1r8P6j32J3j00J48p0K9L7O6o3r5pm4P5O9%O8Q0j93K3J13l02M1J78
7347E9q2L2l5p7K0K56k30o1J56pO8o6j32J60k00l7J99Oq3J01NK1J3j16mN4k55
7374b35K95j28L9j18J57j10kL4J09m2K9l6N6J1n6J54k49J39J1R4k93N5K78k43
7398e1Mj18J62nJ07q3M2j10n7K36k72Q3J29j79K89j64k17L03j63o7J19o1J6P7
$$ y = [-81, 15, 18, 125, -236, -77, 29, 28, 78, -275, 132, -194, 85, 83, -6, -10, 178, -23, 1, 105, -96, 25, 191, -148, -30, -148, 5, 91, -53, 77, 52, -83, -58, 138, -24, -42, 122, 110, -81, -54, 12, 68, -60, 22, 77, 24, -16, 13, -36, 37, 43, 1, 88, 106, -77, -74, 59, 64, -26, -64, 5, -24, -14, 51, -71, 11, -3, 61, 198, 168, 45, -60, 113, 112, -167, -77, 48, 150, -17, -123, -44, 82, -68, 25, -14, -96, 59, -30, 127, -29, 58, -78, 39, 58, 14, -24, -84, 142, -86, -108, -54, 75, 65, 136, 147, 49, 125, -7, 6, -94, 54, -16, 13, 50, 116, 53, -42, -49, -93, -18, 51, 51, 119, 199, 6, 29, 142, -160, -119, 59, -23, 9, -26, -103, -83, 173, -57, -118, 38, 31, 99, 33, -99, 61, -139, -176, 23, 29, -54, 47, 52, 73, 86, -30, -34, 20, -235, 60, -68, -29, -147, 10, -100, -102, -68, 41, -1, 28, -8, 48, 59, 3, 157, -92, 47, 58, 152, -141, -86, 192, -51, -47, -165, -3, -8, 99, 16, 58, -52, -109, 127, -145, -62, 67, -112, 177, 13, -204, 99, -64, -131, -12, -73, -57, 20]
7422B0j26n8J40O5K3M2l4J29k95l8J9L0J0j7K18m2k64K53j44J11O1k4K6j20J33
7447A18m8q8J57j92j02K97j49k8o9N7K34j82J46k79N5l0NJ08q9N1j87K67j03L2
7471a9p6o6K34J92k85J45j11L5J20j57k9K77j80j96J44q5O3N5kj39J82l5j35J23
7495E5p6J34k28J49L7j42J89k53J73K2j45j0r6j1K79R1k46kk9R4Q9p1j21JP3q2
7521a26K12N6Lj01K5j32J13j06j07J18Q5R7q5r2J57k06K06k73J20N0JM3Kp3n1
7546f4O7r5J36j17Q3j66J91k2j67q4J00M16k52Qk26P0J18q1K64l26K36j46K3R
7570b5n0O7Lk8J14K7n3J80k47O7j42J31Q4m8O2j93k8J62M1j71P9P1j23k78M37
7595A39j36l0j09L1KK5Q8k76L89j66m2qQ3mK3r7J23jJK6R1j34q7J70j09J4M1j5
$$ y = [20, -106, -164, -24, 41, 64, 106, 72, 201, -94, -132, -113, -83, -73, -90, 128, 86, -178, 75, -69, 42, 103, 79, 105, -15, 118, 70, -18, 139, -53, -155, 142, -7, -35, -104, -47, 187, 5, 151, -128, -73, -103, -98, 10, -79, -28, -215, 52, -51, -19, -95, -161, 73, 265, -20, 125, 14, 49, 169, 12, -17, 260, 80, -116, 28, -57, 6, 61, 59, -80, 102, 67, -68, 55, -21, 113, -115, 34, 71, -71, 118, -135, 38, 60, -85, -95, -191, -202, 77, 168, -78, -80, -109, -15, 74, 3, -118, -117, -44, -126, 86, 142, 145, 44, 69, -63, 50, -56, -163, -45, 40, 137, 52, -40, 117, -89, 117, -156, -36, 14, 15, 58, 60, -13, -64, 3, -92, 44, -73, 10, -156, 35, 13, -154, -238, -138, 278, 26, 34, -192, -122, -4, -85, 179, -147, 89, -57, -34, -25, -75, -8, -5, -33, 81, 108, 55, 235, -12, 55, -87, 44, 128, 80, 142, -51, -79, 83, 124, -47, 32, 103, -20, -298, 139, 3, -27, -136, -105, -103, -78, 10, -266, 123, -43, -85, -93, -10, -14, 9, -88, 35, 34, 35, 61, 152, 18, -69, 101, -8, 6, 47, 32]
7623C2k03L10p9j23J46r0K5p1m8J92j31J16J33k45P9j36L2K49k02lJ1k2J16l9
7647D9Pk56N4L8K01m5J42k88K31p0j86O8m9K21j09M5r9j00o0L84j96j18P6J18
7671E8Q7n2L0j90j22K97j81K9M2m9J02j56N7O7jQ0k7j19jJ50j9j22RQ1j20R1J10
7698A31m5r0M5j1j46Q6p3K0J63R3j77n1J45r0m3j0m5J54p7L5j9K22k80K44j26
7723E5P1L9k34J14j77K02k4K5q4L3j46J01j43J69M4o9m4M4pj25L16p4n3p4N4j29
7749a16J22O0J9l50K25k8J72j47nO4J66j16j54J79P5p6L9j28J02j63P6j54K37
7772I9j2j9J18l29J36%o3P9J00j23J2O0J23l20J30Q7n5J92k01n2m8K03p9l4P6
7797H0m2q1p9J35j16J35K4p1O6j87KPO2K62k92N2n9M0K3q0P7Kj78K33j15J86j46
$$ y = [32, -171, 139, 60, -63, 83, -7, 18, -53, -101, 91, -40, 76, 209, -36, 43, -93, -61, 188, -14, -17, -6, -28, 88, 49, 56, -200, -146, -108, 93, 48, 190, -98, 133, 63, -123, -55, -104, 117, 8, 53, -46, -146, -206, 178, -18, -136, -60, 58, 145, 93, 123, -67, -189, 108, -73, -44, -2, -51, 51, -105, -48, 19, 18, 98, 71, -48, -49, 101, 82, -40, -31, 50, -70, 21, 131, 86, -4, 41, 30, -116, -30, -103, -83, 80, 173, -4, -55, 90, 0, -43, -53, -98, 56, -21, 14, -5, 217, -63, 181, 55, 126, 165, -69, 45, -132, 70, 46, 71, -13, 20, -126, -25, -168, 1, 45, -24, -68, -24, -31, -156, 160, 86, 33, -41, 13, -116, 6, 66, 85, -265, -40, -68, 104, -43, -48, 16, 182, 66, -88, 91, 166, 90, 129, 1, 103, -60, 16, -138, 99, 87, 68, 186, -143, -7, -7, -70, 9, 109, -14, -2, 58, 181, -139, -9, 78, 23, 215, 14, -38, -86, 117, 38, 4, 80, 38, -43, -122, 13, -103, 32, 56, -15, 51, -136, -134, -127, -65, 197, -95, -43, -102, -62, -39, -119, -42, -40, -218, 15, -100, 86, -60]
7824f0J28Kj3j06o7K6J3K28k38J02j9K7J37k35J90J9j65J5k7r4K20j51n2L4R3
7849GJ72j54j50K52k11k2L5J85j91J9M2L4o4j18J37K7k0R5j25J40p7J16r2q6j47
7874a96L11j42j27J39j15P8P4n9R7p6J19o6j15K4j1j01J50M1j00J77j93K57l88
7897b22J79M2o1J3PJ73j03j6m5r5J89M7j5j13J02j82l5J69J17p8n8r1K6J5j77
7922b12K96j10j14J08J01r4K1J6j9J21j48J1K6M3l5j73N3J72k32J76J7K10l40
7945a06K22O4k62J10M1j11J25r6j3m7J86j65J63q5m2rk1L2q1K02o1k5l1J18n1
7970E7j63J56J48k53K4K3J03j83J55k00J71Rj41J0J06P1p5L8K7j93J11j15J50
7993C6N7k30K17j55J45J6k34j14L18j58LL6R4j32J64m3P0j63l6J70j87K69j22
$$ y = [-60, 68, 70, 57, -49, -116, -90, -77, 151, -87, 15, -4, 23, 160, -75, 115, 134, -31, -16, -43, -137, 83, -68, -120, -86, 7, 179, 25, -125, 127, -84, -106, -71, 114, -77, -58, -16, 18, -46, -164, -27, 0, -20, 75, -50, 90, 13, 129, 37, -49, -196, 115, -27, -154, -15, -130, -52, 22, -37, 60, -16, 103, 37, -78, -54, -65, -166, -16, 25, -75, 102, -91, 166, -222, -43, -1, -62, -49, -42, 131, 28, 12, -33, -128, 61, 108, 93, -20, 82, -100, -135, 34, 151, 73, 15, -76, -50, -35, -212, 84, -26, -140, -32, 69, -25, -4, 12, -7, 114, -34, -23, 3, 46, 11, -162, -109, 63, -169, 7, 24, 234, -106, 116, 180, -82, 28, 69, -42, 83, -13, -26, -73, 113, -52, 111, 26, -16, -25, -46, -14, -95, 107, 46, 21, -10, 108, 57, -106, 50, 198, -55, -31, -8, 95, -88, 67, -133, 38, 47, -94, -84, 22, 93, 18, 56, 83, -110, 1, -114, 36, 93, -137, 80, -75, 70, 86, -148, -262, 56, -102, -99, -63, 31, -101, 63, 20, 90, -73, -109, 61, -126, 143, 21]
8016B1j49J25L2k27J66jK4J53k25M2P7l0J39j40P8j09K9K3J29j79nO8j9j64J17
8041b5J43o8k74K19p1L0L8m9q6J14Q7o3L6j51K5L9J76k36P7O5j84K3LN7J39l9
8067B5J6Mjj01K0j00P5OJ36j17O5J32k28N4J8J43j93K0j2J47q3M1k58J55J32K1
8093A17n4J0P9j06l5Lk9N0o7k3K15k51PK59j97j13Q4L9L1j52K6Q4q2J47j8q2J
8120e7R4O5P0k34J11k1Q4K2o7j51p4K33k98J17J45p2O2qj02K37o7j16Q1m4Kj1
8146Aj31K09K04l13J58k01L8R6k06K66j13j38J18M9k12K99j68k07K58m4k1R6p1
8169c3L3L7J4k9j71K69j16ml8J6L2K58j8k35J62l06J18J09n7L5j22O0
$$ y = [21, -128, -3, 29, -198, -32, -33, -9, 144, -81, -39, 38, 8, 147, 7, 85, -24, 5, 28, 157, -22, -27, 41, 22, -142, -25, 118, 50, -224, -5, -76, -46, -8, -57, -143, -29, 58, -5, 31, -120, -95, -56, 120, -116, -39, 26, -158, -135, -132, -75, 64, 25, 41, 45, 44, -57, -37, -137, -62, -56, 80, -37, 28, 160, -68, -14, 4, 147, -46, -26, -38, 109, 26, 67, -191, -36, 96, 117, 63, 73, 152, 46, 11, 14, -15, 35, -32, -55, 160, -91, -84, 175, -22, -135, -51, -12, 19, -133, -107, -23, -105, 42, 24, -58, -57, 37, 102, 172, -62, 49, 28, 112, 134, 67, -84, -158, 75, -223, -106, 39, -33, 29, 21, -81, 156, 89, -27, 54, 10, 12, 1, -130, 79, 283, -30, 128, -73, -35, 61, -145, 121, 8, -130, -12, 37, -175, 124, -44, -251, 7, -37, -58, 38, -33, 0, 37, 51, 22, -149, 120, 4, 0, -38, -22, 10, 268, 250, 15, 177, -129, -11, 98, 41, 76, -46, 14]
8191A4
$$ Imaginary data points
##PAGE= N=2
##DATA TABLE= (X++(I..I)), XYDATA
0@%%%%%%%%%%Qj6J6j6J7k5L2m0N4o2P2q8J04j26J50j75K04k35K70l10L56m07M63
33B46n24N91o65P49q42R40j048J169j301J444j601J774j959K161k386K631k899
50a520L194l518L877m275M721n224N793o440P189q072R118j0389J1978j4018J6751
65I165k0631K6615l7151O1151k19272m596L73936m7970j24965k3797J28036K1692
77A42213m2906p8390r1207j16079K7123J26320O4958p7427k4054J39614J57327
88B27492m5898j51603r1810j5978o713J5933K9251m64l6028M1693J18980N3322
100A38177m4626k7515j1947p3321r5652N978P2897n593m5871P5694J31144K992
112A22357r8642k5751O4760l896j07369m9733M3772L472m0436M4757J27102N3668
$$ y = [0, 0, 0, 0, 0, 0, 0, 0, 0, 0, 0, 8, -8, 8, -8, 9, -16, 16, -24, 30, -32, 40, -48, 56, -70, 80, -95, 109, -126, 144, -166, 190, -217, 246, -278, 313, -352, 397, -445, 495, -553, 616, -685, 759, -842, 932, -1027, 1134, -1252, 1379, -1520, 1674, -1844, 2033, -2242, 2479, -2745, 3048, -3392, 3797, -4275, 4843, -5546, 6432, -7586, 9165, -11466, 15149, -22002, 39149, -180123, -184719, 189217, 141247, 16282, -7515, 120521, 142213, 99307, 20917, -70290, -186369, -159246, -32926, 32032, -45395, -69449, 70165, 227492, 181594, 29991, -61819, -77797, -84510, -68577, -39326, -39790, -75818, -34125, 84855, 138177, 93551, 66036, 54089, -19232, -114884, -108906, -36009, -41602, -87473, -11779, 119365, 122357, 23715, -2036, 62724, 58828, -48541, -98274, -54502, -51030, -91466, -46709, 80393, 134061]
124A34061o9665n4229J8872j3714n7453k990L5641k4326o9248K0278J29663P2891
136A19781n5691n9023J4308K9018j9462o2301n9096j6248N6846J04435L1366q5545
148a612o0454P0442J08949l094j16453q9494O422M0566L3585K1724j1555k2910
160b3884K7412P6477K5607q8800r0917L1010P4005j3697p4017k4367N0548N2261
172B1638K0396K0418j105n0984m2855J2461K7706j2042m0133l988L6180K1000
184H692N618J3460Q045q378j1710m090j1922l9877k4353L2582M2116O871q956
197H098O27J0729M008m543p26j5344l1758q553J5271P739j714J3172L6472J5368
211D8846l3731k7572J4165J4466j5772k7296o548J7013J1310M695J0540L529J082
$$ y = [134061, 64396, 10167, 29039, 15325, -42128, -45118, -9477, -33803, -103051, -82773, 46890, 119781, 64090, 5067, 19375, 48393, 28931, -33370, -92466, -108714, -51868, 52567, 83933, -1612, -62066, 8376, 117325, 114231, -2222, -91716, -85294, -44728, -11143, 10581, -974, -23884, 3528, 80005, 105612, 16812, -74105, -43095, 30910, 17213, -56804, -81171, -30623, 21638, 42034, 62452, 61347, 10363, -32492, -20031, 7675, -4367, -44500, -48488, -12308, 8692, 14310, 27770, 35815, 27437, 15727, 11637, -285, -40162, -64515, -31933, 10183, 17054, 8098, 8725, 19454, 23462, 18919, 18193, 2849, -28909, -37462, -22191, -14452, -16166, -2994, 33478, 48846, 15115, -12457, 1708, 16174, 402, -26894, -33442, -16429, -5119, -424, 10116, 13645, 14727]
224A4727J2330L890k4292l9475j2557L3657K7782j4962k1213O969K6055J8120
236C1031n029j4124j3413j2644L494P574j2549j2097J4024K9243J3998j5808j5556
249a856O532N111n397o620q743p139k487P764K0191R706p590j335N110l307j0767
264h27r530P20J576n595O121J2526k354l935Q363J2446j75j8874j4283L176K833
279g812k6L674J029J601N214O587N519p724j2305K257N068o774j0690k436J2871
294c947J2144k055o94L516l697k892k74k550n246n991L297Q805k328j317R154
309E925N873k208p336m728K559k348o511J647L250J616L690K668K381l77m267
324A834K120O40r127n533K856M428L080j285K160N394k309j767K763k465n202
$$ y = [14727, 27057, 30947, 6655, -32820, -45377, -11720, 16062, 1100, -20113, -13144, 12911, 31031, 26002, 11878, -1535, -14179, -10685, -3111, -15660, -27757, -13733, 15510, 29508, 13700, -1856, 4676, 9787, 4390, -2230, -10973, -18112, -20599, -12835, 7356, 17062, 9472, 8137, 13247, 9940, -827, -10357, -9637, -8061, -13656, -7535, 4991, 2637, -1298, 7065, 19511, 19336, 462, -13821, -10645, -7812, -7838, -4164, -3135, -1534, 3680, 10267, 15786, 8062, -4243, -1986, 3082, -3692, -14382, -16818, -3947, 8197, 6142, 5448, 8964, 5267, 2375, 2101, -449, -5695, -11686, -8389, 416, -1912, -3229, 5925, 11798, 9590, 2254, -2474, 85, -2263, -8774, -7127, -3877, -2261, 1429, 4097, 6478, 6101, 1834, 3954, 4594, -4533, -10066, -7210, -2782, 298, -987, 1173, 6567, 4258, 2491, 5254, 2789, -2413]
339b413m258o72N186J354j641L591K003J47K678m25l409n908m485N571M820m835
355b696k710K670N476N418j951m160k439l207K172L241m367l958J228N060O856
370F633j264m877N45L33l20L7k988k513l34L26N876L386l189p72P54J87M94k550
388b36j672m87l086K750M654n20l76J63k93K483l95k947j685l077M33M570J325
405A604o10j898j245M843K822l016j556l374k954K485K908K241j240n052K219
420a823O761J001l622n943j587O160K788l347l483k750K617P996L015l045p569
435b831n270O885P166j325o398o815K108J1006L600p004n920J145Q654K262p416
450a53n285j540L456Q481J423n498m645j670N787P572k024q191n378L414Q501
$$ y = [-2413, -6671, -7343, -2157, -803, -2444, 1147, 3150, 3297, 5975, 5550, 2141, -3767, -8252, -2681, 2139, -2696, -5406, -2736, 2740, 8158, 6207, 2047, -392, -3599, -1427, 1814, -2553, -6511, -5283, -223, 6633, 5369, 492, 1037, 1370, 1050, 1087, -1901, -4414, -4748, -4422, 1454, 4840, 1651, 879, 1633, 1820, 2314, -236, -1908, -2395, -5481, -2731, 1923, 1403, 1027, 1190, 897, 3380, 2985, 38, -1647, -4724, -4291, 279, 1604, 994, -904, -2149, 2694, 5516, 2500, 944, -2430, -5384, -2899, 9, 2250, 1010, -4042, -1823, 4938, 5939, 2317, -3626, -5213, 947, 3735, 388, -3095, -5845, -3228, 4768, 7783, 4738, -2831, -8101, -1216, 5950, 4625, -1773, -8588, -6480, 4526, 8126, 1122, -4798, -3653, 5001, 7263, -153, -5438, -6978, -3522, 4959, 6382, 884, -3761, -5431, 356, 7928, 5904, -2287, -7665, -4251, 4250]
465D250j382p091K451M932O15k305l902Q37K394r83O08Q41j840j366k349K045
481b245P395M70n686j770Q06L57j506K5N950Q16p798l153M764O643J281o436m011
498d098L978J493k118k042j0M464J021j760J883k159o541J76Q405P657m345j4333
514h329m124J0388J0292J766j0063r000N578Q482p56m619l120J243K977J721J601
529D037n573r031O089J4970L791j2371j6271P22J7706R167q702j1504j90R252
543B092K446n212L29J410k325J239K598j983n010j394P703P305m821q609l285
558g517L908Q483R02n656j588J077j271j735j21O060M937m193o335j708K317M372
574A932q18j400L443j729n824j2N581M339l673n502M025M050o352n899M186R971
$$ y = [4250, 2868, -4223, -1772, 3160, 3775, 1470, -2432, -1595, 799, -184, 424, 1265, -575, -1941, -4290, -2245, 5150, 5620, -66, -1836, -1030, -673, -2179, -2154, 3796, 4612, -3186, -6339, -1575, 5068, 6349, -87, -4098, -120, 1373, -745, -2787, -2797, 1667, 2688, 928, 2811, 652, -5889, -5713, 2692, 10349, 6004, -8329, -12453, -2065, 8227, 9993, -70, -9070, -3492, 4990, 4234, -385, -3505, -2262, 715, 2436, 4037, -1536, -10567, -4478, 10492, 14283, 1912, -14359, -13637, 4069, 13236, 4534, -6970, -7160, 2092, 4538, -674, -345, 1065, -1260, -21, 2577, 594, -4416, -5810, 1893, 9198, 4377, -4232, -7517, -3609, 4874, 5776, 120, -1468, -391, -1662, -3397, -3518, 2542, 7479, 3286, -3049, -4757, -2440, 1932, 1114, -286, 3157, 1428, -4396, -4408, 1173, 5512, 1839, -3663, 362, 4412, -1940, -7839, -3653, 6318]
590F318L173q530p191R10K180M532N775r10p358p326J855J0596L376p619n139
605e358K921P482J059r322n147N453Q230M054o383j1951j247R523R149N9q322
620B00n252M00J495N331L161m911l567L094L411k373o511P23R362K783n932o004
636d590q00N090K487j749K229J064n304l769K453M619J858j831K65j175o016l06
652e475O264L576l58l191l410J52P62J502K630j720j491J456k32j116j685m39
668b775M815K978k890l372l458n03M847N904K276o176j0397R06J0342M437l976
683B958n281p62L543N39r96p22k402K071O311L81o777o878J776J0100M564n343
699C082o515k804K912N878J602j355k713l456J302L117p49j245O97K341K66m065
$$ y = [6318, 9491, 961, -6230, -5320, -3140, 1392, 7167, 6257, -1101, -8427, -6572, 4024, 7400, -219, -5358, -2437, 5045, 6104, -3218, -8365, -2912, 5318, 9372, 2989, -8962, -10209, -686, 8463, 8522, 200, -5052, -4652, -3157, 2174, 5335, 424, -3143, -49, 3362, 989, -5522, -4799, 4563, 7346, 1414, -4590, -5390, -300, 2187, 438, 2667, 3731, -1573, -5342, -2889, 1730, 3588, 1757, 2022, 847, -5169, -5475, 789, 4365, 4007, 816, -2594, -2442, -1680, -178, 2452, 732, -759, 697, 465, -651, -2336, -2775, 2040, 5018, 2128, -1244, -4702, -5205, -358, 5546, 7822, 1646, -8751, -7845, 2497, 6934, 2958, -2323, -3085, 458, 997, 1, -721, -3123, -1052, 5259, 5640, -1137, -8015, -6239, 3861, 8425, 3082, -3433, -6237, -3325, 2553, 4155, 2800, 87, -3369, -2067, 1050, 301, -944, -247, 2094, 2360, -1705]
715a705j077K648m47K51L327J54l353l530l40M535K205j3l44l475l360K021L377
732H74L061r95m585q54J867K03N35M04K35P16j916k93J061j917k00L234J632r39
750B123l299k334J527J894K400K298l453n216m38L525N200m63m844j553J612J459
766D38J171j517j981J235J948J475j540n116l10N030L433o04m741l248K009L084
782G66J640L64l063k201J200J284J436o22j791J267P80j483j28k70m0J457L18
799I14M71n85l032J08K537Q04P86j313k133J41L38J204J938j355j804J57Q4J091
817C51K72j199J168K25j300L67m36J09R58m57M13K54j402k87O17P6J209M96r25
836E09r30j411P32K679k66j098p38q30J328J037r72J1n30k46J957p27j264r0N73
$$ y = [-1705, -2782, -134, -581, -330, 2997, 3151, -202, -3732, -4072, 463, 2668, 2655, 2311, -1164, -4524, -2503, 874, 3935, 2940, -1645, -2499, -632, -429, 106, 510, 745, 1461, -455, -748, 313, -1604, -1804, 1430, 3062, 2123, -1176, -3510, -1983, -89, 2311, 4609, 1156, -4060, -4498, -973, 4227, 3764, -1080, -2633, -1021, 438, 1609, 92, -1889, -654, 1294, 2769, 1229, -3887, -4197, 833, 4266, 3662, -1079, -4327, -2318, 766, 2406, 2770, -293, -2494, -1294, -10, 1426, 804, -987, 280, 1060, -423, -551, -821, -861, 596, 914, 1385, 800, -2232, -2124, 413, 1217, 2003, 690, -1443, -1302, -964, 240, 2178, 823, -981, -824, -740, 351, 623, -576, 592, 817, -483, -116, -552, -443, 515, 58, 471, 725, -677, -964, -347, -271, 938, 1434, 509, -421, -1832, -1100, 1579, 1313, 215, -523, -1353, -25, 1012, 40, 51, -479, -725, 1232, 505, -759, -849, -276]
855b76J115O66k017o34N90p2J553O5j198J06o29K95J181q49j09O25n36M8j57m45
875f78J193o0r03Q59o07j48N49n87Q16j3p86P07J20j013L54L07o0R09q77q43M12
896c49J89O91L06j135q0L2r3J366K5j553k37M32R77O34j542q40O76M50J481p67
916F63k101O02J228K71J30r62n38K59J23J354n2k080J75Q87M67P92j409j277J261
935b07R03N5p89j170R40Q23p91P88j33j119J45M53M39M39j094p05R67N65K71r01
955a21q34R13O20j015K29K35J51p6o41O60Q40j095p09N37L13R66p03q11N83l10
975b68q0O87k79J93p7j138Q90J307p93j057m59R02J552j001j247M42M13J060p9
994I68j725NN45k57J080M45p23j174q40K010J738k177j473J224J019N30q92j642
$$ y = [-276, 839, 1505, -512, -1146, -556, -628, 925, 990, -208, -102, -731, -436, 745, -104, -213, 412, -124, -76, -233, -678, 515, 455, -448, 411, -196, -344, 205, -382, 434, 421, -365, 342, 462, -551, -197, 110, 50, 959, 82, -761, -349, -160, 531, 837, -298, -378, -346, -439, 927, 952, -601, -838, -406, 571, 1205, -337, -1177, -501, -51, 1430, 663, -1438, -836, 392, 663, 793, -169, -707, -448, -325, 1029, 977, -1103, -928, -41, 426, 1218, -191, -1468, -207, 696, 751, -38, -1208, -268, 555, -236, 552, 419, -700, -555, -102, 337, 776, -318, -1023, -56, 509, 780, -121, -955, -42, 578, -437, -208, 27, 178, 102, -539, 121, 961, -134, -843, -306, 7, 973, 270, -541, 42, -268, -348, 339, 60, 253, 176, -962, -72, 1235, 442, -615, -1074, -172, 1380, 379, -868, -426, -13, 1047, 968, -757, -752, -207, -464, 616, 1061, 338, -836, -1676, 334, 2072, -105, -1578, -354, 665, 1195, 303, -1339]
1012a339R01N90L66k8r08j52L94k36J694M54k676q62J214J453M71j365j178J381
1030A74L62J26o59j563J203J497p15k33l79m94K57M76Q18K48j998q30J683J163
1048A136K04j285j573J227P77p54K27q0O75O6j058K74N00j097n3J222N32j06j582
1067g48n68J273K86n4N39r37p5J32m73Q70J002p12r88n94O17J321q78o90R42L1
1087B96K62l64j486J51J312Q23L59j099j119r3r8J967J624k321k224O73J756R04
1105A323o83j164N7K94L35M68j177m52J186O09M81l59k406p92J654K254N54k005
1123A77j639M16L05J563J017j870j281J000O56L25q33l16O10j08M95lj548p12
1141a746J661J507O61j849k111K22J457R04R80r81j529n6J22R80Q82r03p14L89
$$ y = [-1339, -438, 152, 518, 490, -418, -570, -176, -412, 1282, 1736, -940, -1802, -588, 865, 1336, -29, -1207, 174, 536, 662, 3, -1560, -357, 1140, 425, 192, -187, -681, -424, 52, 870, 1118, -880, -1710, -27, 1136, 1340, 55, -1518, -291, 486, -268, -41, -121, 554, 620, -438, -164, 336, -761, -814, 408, 940, 834, -748, -1316, -43, 243, 189, 728, -209, -284, -152, -625, 245, 1247, 535, -453, -1047, -430, 891, 13, -677, 265, 296, 558, 194, -1292, -1141, 171, 994, 1353, 254, -865, -958, -1056, 911, 2535, 214, -2010, -1337, 419, 1323, 640, -524, -467, -173, 162, 630, -547, -999, 187, 796, 1277, 918, -1488, -2280, -626, 1628, 2182, 177, -1462, -1046, -741, 822, 1839, -31, -1312, -312, 344, 669, -164, -480, 130, 22, 517, 514, -1034, -1746, -85, 1422, 2083, 234, -1877, -1655, -198, 706, 1686, 705, -824, -880, -758, 222, 1104, 201, -513, -124]
1159a24K0L30q33j32J271j37k76M62q97j012N78J228J237o68j879n69L9Q34K163
1178A635j38j583m76n30Q26J033m68m09j42K95O41q96p02O42K58Q62P40j604j705
1197a721O7J557K142l97k022q31l00P15K138n3j096q18l81J115M58q02k49N50
1215G2M35N11j058j062K17O22J249J141j723j979k19J558J735R0j472o19n42M37
1233f07J304n3n43j52k16P73l01j113J12R34N89K14p70j146p7M62J150J314j380
1252D94j290m18K12J487N12l77o22p80k61J337K0j3j88l77O42J04j147p8L85N50
1272A92R66l30j016p50l90J385J388m68j104p90j59J013Q36k82O8j093j63J193
1290D96l24k8l84P8O28M53j223l74k93O27J354Q6q71j193n45J313J432l81q49
$$ y = [-124, -104, 226, -607, -739, 532, 395, 119, 581, -316, -1328, -750, 478, 1715, 1047, -832, -1401, -1362, -528, 1635, 1497, -86, -562, -1092, -266, 767, 299, -110, -252, 43, 684, -212, -914, -272, -14, 848, 1588, -16, -1721, -1654, -97, 2045, 1648, -374, -1205, -1505, -790, 1348, 1295, 199, -619, -1000, 115, 573, -229, -478, 72, 507, 1018, -40, -1102, -885, -263, 986, 2127, 404, -1575, -1794, -236, 1499, 1589, 117, -502, -1044, -607, 697, 644, 101, -51, -267, 506, 205, -908, -796, 138, 727, 941, 171, -975, -1052, -590, 560, 1874, 494, -796, -1214, -1002, 485, 997, 620, -2, -782, -1043, 294, 314, 301, 113, -264, 378, 482, -665, -743, -358, 192, 1158, 828, -188, -938, -1328, 57, 1445, 977, -127, -917, -1076, -63, 773, 491, 559, -534, -697, 496, 172, 144, -240, -162, 466, 919, -304, -678, -971, -344, 1010, 1096, 225, -968, -1513, -200, 1232, 851, 2]
1309Bo41l64R83N22k83K02o86M8P28j35n68l52J96J203k6q73l77k87P9J438O4
1330H73m25p54j019Q97J079k23m9m63m99K74L54J3P5k76k56P86l63l04L5l49J030
1351D36K75m46m46m21j90J217K71k20k60j016K10P22J98K95n21p13M54M4O1K82
1371B32n03q4O06j01l5k58o43N62O90R4k72r85j53Q12M46J47l25r98K74P46j42
1392A10N35m14q09O28J97j28J21p86L89N73j04k06m12l90N72O83k31k2p52k9L35
1413a40J41M66j45p65K72K50k38M25j63m86M56q5r2K30m85J77L24J14N4j14o85
1434d89J48N52J71j36m14p6J19OL16K64p17O0P1O0M86j04n34J01J48J32K86p27
1456b77jL22R2K35l98l87M55q1J84N03n33l75M0J16L44K6o20J42J52QL03l56m4
$$ y = [2, -639, -1003, -20, 502, 219, 421, -265, -217, 511, 376, -192, -544, -348, 855, 829, -44, -421, -708, -629, 809, 873, 448, -306, -1325, -428, 651, 428, 379, -84, -583, -309, 45, 58, 133, -143, -399, 387, 24, -280, -245, -594, 436, 711, 265, -181, -602, -792, 425, 696, 476, 216, -800, -590, 132, 330, 625, 104, -609, -155, -111, -50, 232, -271, -355, 251, 150, 115, -143, -786, -224, 466, 560, 288, -697, -850, -38, 408, 555, 230, -768, -494, 252, 110, 645, 231, -578, 50, 247, 119, 240, -546, -157, 416, 312, 106, -306, -696, -124, 559, 328, 306, -446, -475, -140, 1, 467, 322, -443, -171, 79, -159, 266, 103, -383, 73, -12, -104, 126, -359, -182, 142, 256, 310, 196, -489, -341, 211, 382, 246, -168, -244, -125, -119, 197, 461, -256, -196, -125, -65, 421, 317, -217, -116, 32, 164, 450, -277, -278, 44, 136, 371, -27, -414, 41, -40, 144, 647, 114, -261, -221, -105, 239, 265, -355, -213, -61, -53, 250, -106, -150]
1479a50L10l19Q3N40p09j42M71o3M76j99n81J23Q8M87m9m93j26M02k88J0K85n65
1501d09N25p6j72K44j55l7K52l10K50K72n43n1O57l70oj29OJ72l68l1N31j89m2
1524B1Lj43L30k12l18J27K3J91M19n39j0L91k53j49K42k27l0k04J24N90k16k92
1546a32Q4k18K5N09k66j92L49k69L10k15k02L29k68Q1N82k31m35J93P5J43j36
1567A16k20o0j58L69L55n35n6M07l75O1L42j75j96J09KL21j91l75Q8R4j24N06
1589C05k59l51K83j1L1J63Oj21l08P9M14j45j01N5k00M1K94k13M9M6Q0j4j11k42
1613b30K73j53K1L46j71o7ml20K66M70l97m7j00k16M76n8k9J82l65J00J16j8L1
1636A06k22j47P17n0l35j14l17J85M85M2j20k88m54O68J48l38J25j78j42L34J07
$$ y = [-150, 160, -159, -76, 464, -245, -387, 84, 21, 497, 298, -283, -160, -72, 415, 366, -127, -253, 149, -139, -129, 156, -409, 116, 40, -132, 112, -43, -80, 172, -138, 112, 384, -159, -210, 447, 77, 71, -58, -52, 120, -248, -279, 252, 63, 21, 24, -119, 211, -1, -319, -192, -169, 22, 441, -98, -108, 283, 30, -119, 123, -104, -134, -338, -214, 376, 160, -132, -48, -266, -241, 268, 2, -190, 159, -110, 200, -15, -217, 112, -156, -75, 507, 276, -159, 34, 109, 252, 116, -104, -164, -322, 47, 402, -133, -189, 218, -157, -96, 246, 71, -125, -16, -14, 307, 116, -259, -171, -77, -201, 305, 46, -305, -22, -33, -2, 161, 167, 46, -262, -183, 231, 86, -15, 40, -160, -119, 175, -38, 11, 57, 137, 123, 12, -230, 43, -110, -89, 257, 86, 19, 15, -305, -39, 431, 34, -13, -113, -329, 147, 89, 60, 242, -123, -23, 93, 75, 106, -116, -263, 454, 404, 69, -45, -362, -177, 308, 350, 230, -58, -512, 156, 304, -34, 91, -87, -229, 105, 212]
1657B12K1k60j20K90M6k08O2k65l9N69om81l4om8K93J76O9l97j99L40P8n8L03
1681C38j93m03K96K0m8m8p9K13J53k32J46m20N9M42J32k01n3n28k9O17J10K02
1703D94m27l69K74j35J28K09j65k46L30p1P9j65j90K30L80k61j27j86j93L95K51
1724B35K60l83o62PN52J67J47j53n77J99Q5Q7L02k57k39L51l8J7O6n93N07L95
1746D75j94j47l96j00L15K43K19j91n16NK09J72L03k78l80K78m4J09l3j22j20
1767a93K38J49Q3l76l11J13O82j31J08l05l73K14K27L17O9q92M2K82K4J88j93
1788c8m8OLM6J12l54k21N20K67K02m68n90J01N51K11J34l91m08k48M09O61R9m68
1811H8m58K64M8J24R2k98J26mO5J25k93k74N44r9K60j42n30k32M4N05O06k45p01
$$ y = [212, 233, -27, -147, 143, 189, -19, 43, -222, -261, 308, 302, -179, -213, -219, -267, 26, 202, 271, -126, -325, 15, 93, 35, 338, 145, -258, 38, 58, 10, -38, -117, 96, 249, 17, 163, -257, -198, 244, 376, 175, 122, -406, -435, 182, 292, 494, 67, -302, -28, -163, -35, 174, 9, -237, 93, 22, 101, -64, -254, -24, 356, 95, -32, -218, -411, -16, 235, 495, 112, -550, -543, 9, 176, 323, 170, -407, -208, -123, -36, 266, 9, -230, 121, 83, 100, 166, -427, 80, 475, 281, 134, -262, -362, -47, 196, 415, 224, -292, -287, -78, 94, 397, 119, -261, 17, -27, 82, 49, -73, -193, 45, 194, 277, -99, -410, -297, 385, 254, 362, 57, -316, -102, 125, 442, 511, -381, -339, -57, -33, 155, -38, -86, -80, -77, -31, 81, -273, -494, 26, 293, 495, 27, -563, -462, 89, 300, 434, 43, -365, -613, -204, 457, 556, 88, -370, -106, -58, 66, 158, -140, -14, -18, 47, 172, -121, -395, 149, 50, 310, 168, -362, -594, -550, -45, 561, 316, -385]
1834c85o9K26N02R2l66j26m5K2K86l8m2k49L34p2K05l86l24K85K36L47k01l31
1856i9k01j30K22O29p7m73q3j9K67J31N1k64j38N4K64L7k29o9J06J80J17m12j91
1879c27K65J2L22K58n98N0k22L9L70J6j88P1m08L61M3L8M9r8rR4j86n9J03r3K93
1904A96L9k22n3j92q2M35L02m53Q2j93l30O03n4L7j28o6J5nR1J30l48J64L9kj30
1929a25Q9j55J59N34l81k52K12k97L66j24r7J29k80J34K58k18K3K84m25J90J29
1950A53k22jK3L8P9m2o8J22n9k9J86j49o1j1k35K01m3l3L37j55k40L10j94K16
1974A23m1l7m6l0m7O2J83j72Pj07j92L19j54k8J22J5lK53k97O5j18J67l7J19k34
1999a08j9J72j74Q1K32O2j15n43L84o7J02O4Q6l51O4J8J37K0j27J23J01k47K47
$$ y = [-385, -454, -228, 274, 366, 0, -126, -171, -149, 137, 99, 57, -192, 142, 70, 275, -111, -435, -150, 86, 433, 232, -99, -300, -430, -208, 421, 344, -129, -212, -231, 36, 167, 218, -46, -184, -130, 134, 171, -58, -127, -21, 159, 276, -136, -327, -62, -50, 272, 530, -68, -18, -240, -201, 169, 185, -3, 68, -340, 21, 64, 102, 151, 53, 44, 138, -48, -107, -4, -97, 196, 235, 13, -40, -232, -314, 121, 423, -30, 52, -141, -471, 132, 78, 115, -13, -79, -64, -69, 22, 152, -196, -32, 7, 5, -125, -36, -191, -32, 502, 121, -131, 81, -216, 150, 26, -71, 58, -222, -88, 170, -48, -25, 259, -166, 24, 153, -69, -70, -47, -9, 70, 28, -40, 82, 23, -6, 180, 31, -30, -41, -276, -75, -118, -151, 186, 31, -209, 101, -93, 123, 82, 45, -1, -31, -78, -16, 167, -5, 2, -105, -297, 22, -132, -160, -38, -23, -26, 227, -70, -5, -123, 44, 7, 126, -108, -127, 45, -129, -48, 184, 246, 131, -412, -28, -95, 7, 71, 157, -194, -130, -112, 25, 45, -82, 41, 142, -105, 142]
2022A42j21j45J60j78J52J2J36j53k13J56K91j23l65J85L9R2J23j99J29j63l10
2043c53N33j27o5J38p1k01M66j94k17N6L7qJ22j40Kj40l9L74j20j15K10j86j64
2066b02L82p5j17n3n5J00K00l81J95j71p9N56k27R3j56k08J54K41O8k64p0j82
2088b51L39Q8j14jj44p7K31krq0k99L6L67j1N5m05O5K29K4J8P2l46J73J77j04
2113C1J34l8l72K35K14Lk70Nk10L12r5J51l2l71K59N2j24J59L7k65J3K96Rp3l65
2138c05K14O5j35N87l76k67j9K58P7p2m7O4k22J45J43J62m19J43j23q4M79j48
2160A20k92PJ02J03K34m55M3o9KO63l34k70m0O7J52L00l03k34J91j18J77m0J32
2183A38j64j76k5M79j31j40L2k7pL37m70J80j55n4M09L2k21M2l60L08J26k76J70
$$ y = [142, 21, -124, 36, -142, 10, 22, 158, 5, -208, -52, 239, 116, -249, -64, -25, 67, 190, -9, 120, -43, -353, 180, 53, -12, 126, 55, -146, 320, 126, -91, -35, 2, -6, 116, -24, -22, -162, -201, 173, 53, -62, 148, -38, -202, 180, 105, -12, -65, -120, -20, 180, -201, -6, -177, -256, 300, 73, 166, 10, -198, -44, 197, 265, 1, -69, -251, 88, 176, 62, 61, -83, -160, 71, 69, 60, -20, -319, -283, 84, 73, 128, -277, -212, 17, 41, 59, 131, -215, -42, 135, 31, 165, 127, -245, -10, 204, 207, -63, -58, -268, 44, -51, 100, 68, -303, -44, 8, -116, 43, 80, -185, -172, 124, 133, 60, -305, -91, -26, -161, 426, 50, -217, -236, 22, 99, 27, -20, 44, -178, -33, 110, 272, -147, -4, -127, -211, 268, 120, -172, -165, -63, 40, 274, -181, -138, -207, -205, 458, 124, -146, -186, -119, 33, 333, 30, -204, -13, -131, 46, 6, 138, -26, -202, -227, 252, 121, -19, 13, -14, -21, 316, -154, 26, -129, -183, 226, 258, 37, 79, -281, 27, 153, -123, 47]
2206D7j02j61L1K82o7q5l2m7K49Q0q2j12m65M77K70l25j27O7j13K10K75q1o7l92
2230b70J0M48j5j19l3k11M4K59J9K8k22m5L12j70Q7j50k62J81L65j35Q3l11k87
2253c94M48j4O7Jl37J0L29m29M38j48j04o0J70qK22k27m7K88l12K00ok11J80O1
2277A17j18J37j96p2N8K64q6J33l08j6J24k47L00n9o2O6m5r9K40j41Q1K1j59R7
2301C0J10k13L7J92j27J48k53j49K33q3PJ81j12n3l5k2J8K59j48K6j02J10J3j60
2325i3j32L88j29o7K50l37K22j3j98n2J85L7n1j87L7J95j20J2Q4k57K98Q4j79
2348b3J97k12j34J31k09L01J01j84J7K1MQ6q6j52M34k57qJ06j27k26K06m9K55
2371A92k04K5k33O8k1L13Jj62nj94K2M20k8r2j40o0N6OK3r1J92j51K59q4l53J89
$$ y = [47, -55, -216, -185, 97, 30, -55, -87, -134, 115, 195, 113, 1, -464, 13, 283, -42, -169, -102, -215, -5, 270, 189, 122, -270, -260, 188, 173, 54, 21, -190, -146, 113, 132, 160, -62, -107, 205, 35, 122, -28, -290, -109, 256, 121, 204, -107, -394, 54, 40, 107, 108, -229, -219, 110, -319, 119, -29, -133, -193, -23, -31, 191, -36, -83, 205, -107, 93, 87, -124, 56, 117, -1, 136, -60, -132, -74, 190, 104, 237, -71, -87, 37, -210, 90, 31, -31, 35, -10, -109, 131, -10, 71, 92, -67, 30, 140, -73, -36, 156, 29, 177, -76, -225, 8, -75, -68, 113, 1, -52, -87, -109, -91, 168, 20, 46, -56, 54, 67, -93, -225, 163, 34, -33, 217, -120, 102, 89, -109, -161, 24, 61, 10, -177, -140, 55, -65, -53, 31, -226, 72, 156, -23, 174, -38, -172, -41, -250, 51, 152, -32, -15, 6, 10, 96, 10, -142, 292, 35, 27, 133, 6, -220, -14, -63, 192, -12, 13, -220, -152, -173, 140, 141, -21, -26, -220, -198, 222, 194, 102, -38, -98, -42, -36, -13, -104, 88, -63, 196, 112, -241, -52]
2397e2j51L30Q2k31n9P7j72K12J83j51p1j91J6L59q2qk10O6P5J02j54l0o0J2L60
2422B52k01J7j44q8J90N7k2O1m51J22L89Rj56J7k31M7k1L11kk01P2l2J05r8J56
2447A58k96mJ95m7J16n3l20n3K69M1J64k46j30J45J45Q1O6l96kR7j45N02j64j69
2471d6k04K48R4L6j16j70J17j30K65j9j01r8J52j8L19k98l17J17J43Q6J9n8j33
2494a12K6M7J50j23L4j84J64r6J01O6k3j64J54L4N2j41qR7k67J84L47l38j40J80
2518D0p7K20k59J38Q0m09L85Q5p7n7j82R1J95k23Q5R7l01K56k7j63J9mk5J34J80
2543B01j19j27Mn3L43j88Mj68m5QL50qj10k40N6O5L8K10k01o7J15L2j32o6n1K12
2569F3j03J50P0m2j81m5J73k2j23J20r8J00R7j63%k2m8J33j06P3Q8l24J40K90
$$ y = [-52, -203, 127, 209, -22, -81, -4, -176, 36, 219, 68, -3, -194, -178, 181, 99, 91, -119, -53, 22, 124, -30, -60, -120, -108, 252, 51, 68, -76, -164, 26, 83, 61, 122, -329, -207, 182, 191, 35, 52, -179, -132, -153, 158, 156, -45, 27, -5, 100, 2, 158, -138, -142, 53, 6, 122, 69, -251, -304, -35, 6, 170, -76, -206, -61, 84, 165, 231, -165, -167, -70, -215, 287, 123, -46, -250, -2, 92, 128, 12, -158, -41, -171, 94, 75, -26, -124, 28, 10, 329, 31, -286, -169, -26, 60, 79, 21, -112, -86, -39, 111, -12, 22, -162, 2, -94, 7, 73, 50, -114, 40, 74, 126, -15, -23, 74, -193, -9, 338, 0, -140, 40, -37, 183, -76, 62, 142, -267, 118, 203, 126, 69, -113, -22, 173, -50, 35, 132, -169, 87, 60, -103, -84, -88, -113, 21, 201, 82, -45, -41, -94, 249, 61, 65, -103, -148, -140, 210, 202, 92, -148, -92, -27, 11, 221, 20, -47, 68, 100, -32, -98, -149, 63, -40, 110, 180, 138, -43, -88, 85, 63, -60, 60, -38, 62, 159, -4, -4, -26, -74, 59, -47, 26, 114, -210, -70, 220]
2593B20k08P4K8k43J59j46J9J54k61J52K9j13K18o7o1J40j85J05O0j81p9L99k77
2616f4N6rj16O5M5J48k04Q9j69J57n0J21J46l52o5M42k84R2O9j79j36J32K09j09
2640C4r1j27J59j19K82p3j13Q1J5r0K2Q8j99kJ89j75L47k65R1P7k44J33j2N9J9
2665H6m2Lj42J70j53Q3n9J4Jl9K3L4J53n0q2m1M8j7k5j62J11K15r6j05J01J23
2691A52k05K13j57r9J99l9j00P0j50J88j53J23j34OJ66L5m4j02J41q8q2J16q0
2714b4N7M1jN2j4k29K86k52J60Q9k21k7J88q2P0m2j00O8j16n1K71j76R8kj21K5
2740e3J92j54J06o1j82Q2k1J01J00k52L75k79R8L2j62oO9M3q4L03k33j55K71j59
2764b9pJ8J43j85q0J45P3J6j12P5L2j88L9L1P0lj05m4L1K8R5J0j03J20J17j64
$$ y = [220, 12, 86, 114, -129, 30, -116, -97, 57, -204, -52, -23, -136, 82, 15, -46, 94, -91, 14, 74, -107, -186, 213, -64, -8, -17, -133, -68, -23, 125, -79, 10, -159, -2, -52, 69, 215, -137, -202, 240, -44, 48, 117, -62, -198, -66, 143, 34, -57, -184, -25, -144, 138, 65, -48, 33, 48, -42, -20, 68, -131, -133, 56, -119, 228, -37, 54, 131, -113, 20, 8, 67, 86, 44, 47, -95, 75, -78, 5, -54, -40, -39, -78, -55, -21, 132, 82, 0, -41, 7, -10, -35, -197, -86, 129, 33, -72, 29, 152, -53, 160, 3, -96, 103, 64, -36, 34, -116, 72, -81, 42, -92, -86, 80, 115, 71, -31, 110, 22, -60, 56, -24, 33, 74, 73, 125, 111, -118, 168, -84, 76, 165, -56, -83, 105, 23, 93, 51, -49, 19, -97, -148, 123, -53, 45, 43, -78, -53, 139, -15, 91, 30, -152, -70, -91, 10, 110, -142, 233, -46, 52, 84, -78, -84, -15, 28, -56, 247, 14, -141, 130, -29, -36, -18, 125, -60, -140, 5, 78, 94, -18, 57, 89, -99, -60, -29, 41, 38, -67, -111, -80, -52, 43, 53, -50, 70, 187, 23]
2790B3k29J65j48K37k19K33Oj65J23j10l5M22l27j18J92j17l8L00l07m7J13N7
2812A1M7p2j11J44L0j5R3m62M54j22k04K93j16p1J41j1j12K67j48m6l9l2P1O7
2836E7k03L24o7j17Q0K19k56q3N5m9J43j43J46p5p5J12m4r2N2J07j36K2J43r8
2860B2j9j43J45j31KM5J92j57Q5N8l4m6m3j03K73j71J03q4m1R6N0m6j41J23L7
2885G2j22R4M2j01o1R8Nj52J8J12LJ65k35J09M3k57J53q2P9N9j73J54O0jN1k12
2911g9j6k02L36r7M8J09k26J58or7LM2M8O1n7j16J28j61J57P3j54P2j9j9mj5J9
2938a4J01k26J89q8r3K46j64j53K48j65J49q2n4M9J57j26lR7j82J70j40J96m2
2961G0J22j58j39Q8P8j26L8O2J4j17J03P2j36M1P0n1j29K46l07L04Ok28K65l72
$$ y = [23, -206, -41, -189, 48, -171, 62, 68, -97, 26, -84, -119, 303, -24, -142, 50, -67, -105, 195, -112, -159, -46, 11, 58, -14, -125, 19, 49, 34, 127, -335, 119, -3, -207, 86, -30, -101, 40, 29, -83, 184, 36, -10, -49, -81, -10, 57, -146, 178, 111, -6, 74, 293, 37, -46, 9, -40, 103, -40, 106, 31, -44, 68, 24, -68, -16, 91, -45, -23, 120, 22, 3, -140, 5, -126, -124, -79, 113, -44, 41, 99, 65, 19, -24, -127, 146, -25, 78, -6, -47, 49, 99, 53, -88, 35, 72, -50, 44, 86, -15, -76, 22, 27, -125, -107, 5, 8, 173, -62, 47, 90, -167, -14, -96, -17, 42, -131, 23, 83, 82, 133, -79, -95, -297, 39, -58, -10, 99, -127, 31, 25, -72, -69, -27, 21, 82, 25, -91, 37, -124, 33, 106, -48, 24, 5, -14, -18, -33, -14, 87, -139, 50, -38, -131, 115, -49, -202, 46, -119, 30, -52, -106, -57, 100, -26, -29, 68, -114, 56, -84, 112, 70, 192, 34, -105, -17, 61, -65, -27, 35, 49, -68, 35, 107, -29, 12, 82, 31, -98, 148, -159, 145, 151, -77, 188, -184]
2985a84K71p1J25j85p2J3QK03k30J68k00R9J11j20K56j49n8n9L12k55J12r4N0
3008E1Q0j54lL8r2J40m9p6OJ7L6J41j44l6L20k06M0m3o9l5J81q9r0oj7J40k54
3035a73N4J15j21K64j35M4m4q8J23q5O3j6J45r6L7J35j24k25K53J5m4j92J4K5
3059e6r5K08M1M7j02lJ4p9P0j86o5K16l9J32j29J04o9l7k01M27n6p4r2K6J06r0
3085A8L3n2o3J3J22k22J44Oj52J24J69j19r1P1J00Jj10oJ44m8j89K40K2j98P3
3110C0m0j4q1J49k9MN6Q1j71n3J9K3P4p5J51j86K5m6J02l6p9L01j71q9K4L6M2
3137D7m4l5pp5J32R0q1j74K27k02J07k01J62J34j05J8m9J68p1j69J80l8J10L0
3161A54k54L0K5J2J1j6J16nl08K25M6K35m61K20m6m6J97k13P5j36K2J61K3j26
$$ y = [-184, 87, 16, 141, -44, -116, -103, -95, 108, -122, 46, -154, -55, 56, -64, 192, 43, -15, -74, 238, -17, 95, 1, 51, 131, -23, -26, 12, -80, 60, 11, -65, -59, -42, -6, 135, -9, -45, 275, 69, 109, 66, -3, -38, 143, 54, -36, -42, -59, 81, -173, -119, -4, -125, 139, 4, 48, 4, -84, 39, -46, 17, 1, 146, 50, 87, 222, 98, -127, 126, 141, 97, -95, -81, -56, -151, 57, 98, 145, 43, 40, 54, -25, 45, -141, -206, 10, -29, 103, -26, 78, 9, -28, -229, 198, 142, 68, -24, 2, 108, 18, 51, -1, -64, -51, 71, -151, -7, -1, -153, -29, 140, 21, -70, 1, 101, 102, -8, -14, 130, 82, -107, 133, 155, -43, 30, -10, -24, -105, 44, 15, 19, 75, 156, -15, -68, -49, -26, 48, -27, 124, -62, -37, -83, 19, -17, -96, 205, 34, -55, -31, 5, 47, 3, -32, -39, -114, 18, 108, 27, -147, 80, -122, -15, -216, -54, 80, -25, -7, -56, 112, 41, -128, 52, 14, 124, 154, -100, -70, -45, -33, -22, -38, 78, 73, -235, -10, 36, 271, -190, 30, -16, -62, 135, -78, -3, -139, -117, 44, 67, -59]
3185e9j00K44o9L0R6M0l39J75Q2n8K0j73M6K9J19j9M9p0j83qJ54j06J03j0J21
3210A14M5j92O1nn5J52k33K30q9k6k3R6K8q5l0q4J00l13L31p3L5OR4r1n7mjJ27
3238E8O9j95Q1J6jJ84l15K55m3M6j79o1j3j28K01J19k01J22M2l0Nn5j18J3R7J02
3264G1k92L29k9l20L29k16N6J10jJ91m18K16nN0m2j07Q3nR0n3m4J07o0q2L4N3
3290D5j03O4O4r1K06p9j78J17P0k8j19J38O9k16K0J8O9j25N6l7K1l8m1K79l1l6
3316A14j55j1j41Q9M0n0O7l3Q0L4Kj10k1J30J47k93Q7N6j06J10r4J08j19J0MN5
3342@K3O2k64K05r2k5J00K21l13L3K01k45K2L07k62J8m7O0k0Q8P4q5k8P1l3k5
3368D6j22J80l8J03k79P1L6K9L2j18k0O4J90k96J69j70K71j48l2j32K65j36L5
$$ y = [-59, -159, 85, 16, 46, 142, 182, -157, 18, 100, 42, 62, -111, -65, -36, 83, 64, 113, 43, -140, -148, 6, -100, 3, -7, 114, 159, -33, 28, 23, -32, 120, -113, 117, 28, 2, -21, 75, 103, 18, -12, -96, 4, -309, 22, -51, -16, -10, 84, -7, -64, -68, -69, 58, 127, -68, 13, 29, 28, 212, -103, 152, 109, 155, -24, -85, -98, -226, -25, 94, -107, 15, 57, 27, 32, -23, -141, -128, -31, 71, -221, 108, 79, -241, 88, -128, -72, 38, 37, 228, -190, 26, 21, 71, 29, -78, 5, 0, 90, 37, -7, 100, 40, -42, -8, 45, -58, 6, 70, -21, 185, 106, -72, 45, 115, 87, -32, 106, 175, -41, -21, -3, 66, -59, -3, -40, -19, -57, -98, 181, 150, 114, -41, -52, -193, -104, -64, -114, -47, -80, 0, 34, 36, -74, -95, 35, 182, -111, -24, 32, -74, 36, -58, 50, -69, -59, -55, 0, 23, 85, -179, 26, -66, -91, 9, 230, -83, -50, 151, -94, -72, 235, -27, -9, -56, 4, -16, 72, 146, 61, 33, 104, 71, 46, -76, 104, 66, 169, -110, -39, -3, 26, 58, -60, -80, -16, 174, -122, 47, -123, 148, 0, -32, -164, 101, -35, 0]
3391@J21j40N8q2P4j4N3j02L4Q9j70nJ95k76J58O9j43lO9j06K17J6k89K78N4j11
3417D4pl70L91K4K6j49J53J1j69m4R2j39K65j27r8J87j41n4L8M9r0J18p4P8m8
3442c4rlK27k38l3O5p4N5k2q7K22Lq7J11P1l04J14o1J61Qr9J24j65P2n1K9r4K45
3470A46j43o0J7j55K03NN9q0K00k76Q8l3L4K22j16p0m8L7q0R2j07O4m1joR1k5
3497A7j2n8k3K78k82Q4jj40J20m2k2J61j43KJ16J8j23k1OQ9J7J2j33J21L9j95
3523a15q1J66o7R0P0R5k46J32q5q9J81r9Q2JL1N2o0K9j45M6m6q7J64J13j44Q2
3549G0j05n3J92j28r1J86q9j4P6J3n1j22P9K5j47N5J79oL2Ok50J59Q4m8J8M4M
3576A18j46k53L38p7j17J44lM9j9N4r6J40j85K2L5J21j86O7j54Q3o5l0K28j10
$$ y = [0, 121, -19, 39, -43, 31, 17, 70, -32, 2, 91, -79, -84, 111, -165, -7, 62, -81, -84, -15, -121, 96, 112, -177, 101, 155, 44, 37, -333, 58, 82, 108, -41, 112, 123, -46, -90, 2, -137, 128, 1, -97, 90, -51, -105, -67, -18, -108, 10, -64, 14, -34, -43, -46, 181, -57, -90, -25, -99, -44, -66, -153, 69, 72, -15, 96, 167, -137, -23, -84, 77, 85, -14, 110, -55, 17, -34, -5, -99, 146, 3, -57, -40, -195, 8, 13, 72, -8, 192, -84, 4, -29, 5, 227, 111, 41, -7, 30, -50, 42, -65, -1, -42, -43, -49, 42, 17, 5, -53, -76, 202, -80, 4, 3, -137, -17, -59, -81, 80, -63, -61, 55, 73, -50, -71, -65, 24, 41, 53, -80, 41, 80, -115, -196, -30, -97, -7, 63, 158, -88, 44, -41, -130, 51, -48, 34, 35, 66, 118, 58, 87, -58, -12, -58, -145, 19, 132, -12, 70, -35, -88, 104, -24, -115, 71, -18, -32, 44, 57, 6, -116, -37, -12, -159, -104, 75, 69, 101, 107, -143, 16, 100, 52, 70, 114, 118, -28, -281, 57, -20, -137, 7, 4, 53, 34, 88, -8, 132, -53, -31, 4, 125, -61, 6, -148, -65, -130, -160, 68, -42]
3600d2K4J27k46l6K25j4Rk9j45L2J23K6oj9P0J01j65M9k40K07L8Nl4j41J26M8
3626I3L3k42n5K43kj25L02k89M5q6L44k38j07QM6j29J46K7m7q4O0L5o7J51l8j19
3652i5J04R0r8k6K26k01J1m1J06k42K10j11L6N9m9K58j90O3j16p7J15J25j25q7
3676e5%J85j14P7n9j21QJ14j40M0J67j54J65N5k51M1j31J89j11o9J83L5j37J08
3700B5j05M1o6R5nP8r1K15j06Mjm2l4J15j11n9J12j24O0L9qJ31k07jJ02j63K45
3727A39j11J00j07J54j87J%n2N6J50j07j41j01J69p2K27r1j07m2J32m9O2Q5m0
3751F8k35P5J87j10R5j06qQ4r7L4K5Kl0N0K1P2j84M1K2J30j68J07k5R6k7j96K50
3778A73j52j62R1P7J82l42J72M6j29k9R9n2q3R5p3J79M6j26J26k20%L4R6p9J38
$$ y = [-42, -18, 109, -137, -173, 52, 38, 47, 18, -127, -95, 28, 54, 48, 29, 99, 200, 35, 84, -156, 51, 89, 94, 60, -81, 45, 93, 126, -116, -171, 72, 70, -55, 247, -42, 3, -83, 261, 23, -84, -76, -30, -159, -13, 14, -33, -117, -57, -22, -89, 62, 24, -95, 9, 99, 1, -25, 201, 0, 11, -30, 76, -166, 44, -67, -31, 28, -21, 237, 47, 110, -6, -83, 32, 157, 32, -55, -55, 130, 16, 93, 34, -87, -79, 35, -105, -65, 102, -52, 113, 168, -83, -42, -173, 16, -95, -164, 19, 54, -83, 25, -80, -39, -105, -10, -15, 63, -28, 187, 81, 85, 84, 42, 8, 123, 12, -47, 65, -59, 1, 40, 32, 163, -44, -45, 57, -106, 139, 28, 128, 21, 175, -12, -11, -11, -63, -7, 143, 36, -105, -206, -37, -109, 118, 27, -80, -122, 10, -39, 23, 108, 68, -167, -92, 95, -15, 80, -26, -34, 50, -47, -13, 12, 14, -16, 34, 55, 127, -57, -16, 6, 136, -32, 75, 50, 146, 119, -77, 173, 21, -141, -50, 27, 209, -133, 39, 85, -44, -73, 26, -26, -109, -14, -87, 92, 138, 12, 138, -82, -82, -48, 48, -31, 107]
3803A07o3k00K20n3R4l0r5j1p0L62k55kr7Rk2K1J7J11j40j0J42j15Rm0R8j17O
3830a24J29R1j28J60j18K31k27k9R8k48J29o8J61j07M7J54k66K24n2r4J5j9J82
3853A41j80M1J00j98m2K06J19k78K07l0j9L7m6J39j28r2k6j7J61p7pj6j17K34
3877A12j88K19k57K24Jk0M0j21J36p9o8l6M5k5K2l2j76K10kj37R6o9J29j42J64
3902D6j28J29m4m0M6J4j08J29o7l4o4J07P2n4J0lk37L71k42J87k8j66J32j01M8
3927b5j56K44o1N2l3r3J68j59o4J27j55j1J63m7r3J05M7j22J69J04k04J75n3j14
3951c6J16j83J46M6j20j4m7j7K29j70P2l5J7J37o9O7j23j2J1j76R5L17k56oM8
3976C7K5O9j27j81J53K04k62Q0j43Q8J01l9J02q3r1p7N2J00K7m2J32j10lJ56l17
$$ y = [107, 44, -156, 64, 11, 105, 75, -20, -31, -101, 261, 6, 4, -93, -84, -106, -85, -68, 43, -97, -107, 35, -80, -71, -111, -13, -130, -124, 5, 96, -32, 128, 10, 241, 14, -15, 83, -165, -36, -104, 57, -50, -3, 151, -115, 109, 57, -37, -22, -41, 141, -39, 2, 102, -96, -138, 68, 187, -91, 116, 86, 67, 104, 58, 197, 69, -23, -49, -66, 95, 18, 11, -5, -122, 112, -76, 143, -114, 110, 111, 91, 131, 10, 146, 67, -1, -37, 8, -17, 5, -27, -203, 7, 5, -132, -36, -105, 24, -118, 46, -82, 47, 3, -37, 9, 23, -85, 44, -23, -57, -121, -14, 58, 4, 14, 11, -226, 145, -97, 90, 62, -104, 28, -73, -25, -181, 63, 2, 54, 21, -72, 96, -63, -127, 0, -155, -166, -3, -50, -143, -38, 9, -113, 56, 160, -44, 131, 78, -36, 80, -103, 43, 89, -31, -45, -92, -109, 120, -50, 22, -13, 4, 141, 72, 139, 16, 4, 15, -161, -66, 251, -5, -11, 37, 62, 131, 4, -177, -24, 180, -82, -2, -145, -57, 44, 5, 107, 24, -67, -144, -92, 8, 35, -7, 125, 15, 12, 168, -149]
4001a49J13m3J46l0Q4j04J15k60Q6J8M5r2M8j70K05k4N2j29j29K24L9J24q3k7
4025E9k0J43r5j00M5o0q3R1O1p4p5K3p4K10j70J33M8J24k47N9J26q3k0k6p3k6
4051a04P4l7j10K61j52J75j20mj99K18m7O2q5J43j02j26K34k08J62n7N8o4J27
4074I9k51K42j12j3N3J22j06mj33L6k5P7oK60j98m4R3j94j23J60J45M3p6j35j7
4099a07P4j62K82kr5o1R0j52P8j7OJ83k16J42q6N2j27L61l79K18m6p2Q7j38k3
4124a10J56j29K5j17K40N2k40J68m9J33j95J66j65J38q4q8J21J42j34m3M6j22
4146h9J79j79P2R4j80K57P6k03j89P8j4J35J03k01Q0o4N5L4k64L44q2n6J0l8J00
4171E8j62k7J32m7l0J04m6QL5m1J8mM0j2J14k72J18J84j38k38J38k0J64p2J23
$$ y = [-149, -36, -79, 67, 37, 121, 17, 132, -128, -42, -24, 21, -71, -23, -193, 12, -12, 40, -89, -218, 6, 45, 169, 86, 59, 39, 182, 87, -13, 32, -28, -111, -20, 41, -33, -108, -85, -159, 51, -119, 14, 62, 186, -61, -2, 124, 41, 21, -5, -78, -104, -30, -67, -177, 84, -68, 107, -13, -17, -216, 2, -45, 17, -68, 75, -27, -153, 81, -127, 35, -22, 36, -28, 99, -152, 90, -22, -35, 18, 140, 34, 30, -103, -67, -92, -15, -21, 239, 41, -3, 90, -104, -227, -67, 78, 121, 45, -90, -107, -33, -195, 87, 85, -10, -71, 19, -133, -55, -72, -66, 117, -99, 43, -43, 9, -118, 243, -136, 82, 36, -36, 51, -87, -110, 46, -83, -58, -175, 65, 117, -123, 45, -4, 129, -66, 100, -65, 73, -11, -99, 22, 164, 30, -13, 33, -89, 90, -89, -17, 77, -103, 154, 230, 27, -162, -84, -98, 37, 140, -61, 19, -45, 10, 44, -220, 124, 42, -14, -4, -42, 58, -104, -131, 1, -46, -76, 28, -18, -10, 25, -16, 2, -2, 38, 26, 140, -132, -14, 170, 32, -206, -68, -88, 76, 4, 127]
4196A27JL5j83Mk7mK22p2n2j10Pj40J21J64j41N9J5m8J23j25K6R0j90P7N5p0O9
4223C3J08k04J07k82J32J51j63J66o8o4K38j81J22P1j14N4J34k08L8j6r5K43k38
4246c6J00J09k35J07q6j48K32o1rJj10K61j25m5K14l4j37l3K8N2j18m5K71r6k1
4271C6J16k04oP5j6L1m8Q0j43J46L3j98J74p0l2M2N2k88K63k5L8Kk50K84l3O4
4297A23mQ4k69J35J5L7q6q9P1j11J39N7k69J21K0n6QL6j86L52O0k03K8K18j81
4322E0o0j71Q3J07o3N5Mj7M3J22k58J5m6p0K56q7K79k57kkl3J8k7m7J96j09J19
4349I8j32JN0q8O8J7Qj06K9J45j80J79j26k48M12j83R8Q8j53J85q4Rk64K58j10
4374b9N3l2J05Q4j67n3M3K3l1l3P3L8m1k20K90j10r0l5J57kJ6J04j76P8o5J39
$$ y = [127, 128, 163, -20, -16, -43, -47, 175, 103, 51, -59, -52, -192, -71, 93, -48, 11, 26, -22, 101, -24, 2, 92, -98, -21, 34, -36, 33, 141, -63, 44, -238, -106, 45, -118, 48, -20, -84, 154, -27, 95, 166, 52, 106, 240, 32, 70, 54, -41, 202, -36, 64, 173, -62, 45, -41, -189, 43, -18, -27, -26, -136, 125, 0, -45, 169, 135, -2, -35, -7, 45, -73, -118, 153, 57, 36, 152, -52, -58, 17, 1, 32, -16, 64, -79, 67, 100, -98, 76, 6, -26, 16, 68, -220, 43, 18, 56, 58, -192, 92, 59, 123, 119, 203, -66, 69, 84, 121, 35, -54, 17, -94, 45, 102, -167, -46, -26, -82, -74, -38, -224, 128, 188, -15, 13, 231, 50, -10, -181, -98, 9, -54, 1, 5, -12, 31, 153, -105, -90, -136, -206, 50, -37, 242, -15, -17, -19, -52, -34, -61, -108, 88, -21, 98, -34, -33, 17, -71, -3, 14, 22, -84, -55, 90, -90, 89, -37, -285, 127, -56, 42, 130, -23, 162, 78, 87, -177, 81, -29, 24, -8, 97, 181, 14, -39, 4, 27, -4, -37, 36, 74, 33, -187, 103, -7, -97, -132, 25, 23, 39, 143, -33, 45, -20, 119]
4400A19o1m2l7N0m2J17q3j6j49J39L1r2O9j05K6P6J4lOJ2n8p2j26L32r8k3M5j99
4428a70K83q6Nl3J54j20j65J14J07k7j05j3K0O3n2J06j12O6j42R9o3j14K69j85
4452a01R1j01R5k12J75J95n1j68M3l7k2J08J10p2r3J15k05L9l1J45k4j24P2n1
4476a04J55m0P8l00l7K47l0n7K75j35n6J57j03k22K69p2%j37mM5J3K36l03K21
4500I6N1j66j2J67j94J33jq6K9J0P6j29j19J74K7k4J75k56J34j23l7K10j38p8
4524h1o9L9J28J48j13l5j8KJJ12k46J47J57j71nm4J35q8j34J41L0l8P0k01J57
4549B4j8r6J31l8l9l8J56oo6K8L1j58PJ34Q7j70K49l24K13k97N1J45n5J8k3P1
4575A7j44R3r5J71P3o5k42J75J13J9r8j16J3l9P4Q2L3j68J55r1J71j04n4l1j1
$$ y = [119, 58, 16, -21, 29, -13, 104, 21, 5, -144, -5, 26, -66, 3, -102, -76, 0, 14, 11, 17, 29, -29, -101, -227, 105, 7, -16, 29, -170, 113, 27, 32, -1, 153, 33, -132, -18, 89, 62, -43, -56, -36, 27, -25, 81, -31, 35, -107, -8, -71, -185, 84, -101, -10, -111, -16, -228, -53, 142, 91, -77, -34, -71, -93, 15, 125, 53, -40, 75, -130, -91, -122, 23, -1, -125, -53, -104, 51, 11, 89, -211, -248, -1, -31, -88, 187, 52, -4, 153, 50, -172, 97, 25, 25, -112, -116, -71, -58, 178, -125, 96, 147, -19, -31, 136, -58, 75, 74, -12, 17, 27, 103, -26, -145, 29, 56, 32, 207, -49, 85, -38, -75, 135, -3, -81, -150, -111, 17, 165, 52, 17, -1, 1, 2, 114, -132, 15, 172, 1, -4, -48, 87, -1, -135, 6, 36, -2, 68, -133, 24, 6, -90, 41, 3, -36, -74, 82, 76, 10, 38, 69, -89, -82, 52, 139, -31, 218, -106, 107, -190, -139, 6, -49, -31, -54, 17, -127, -34, -129, 42, 115, 50, -192, -17, 96, 115, 17, -99, -86, -125, -51, 31, 64, -104, 51, -40, 131, 27, -27, -58, -69]
4600f9J84j17qK2l0J74p0O3j74l4l7N1q1K51k57J31L8j8M5j55J80J9m7L4j61J39
4626G3j01k1J61o4%j43O1L0P8l4K7J3L9k02N8J9pK30k90K62k63R5k13J44O3m3
4652b8L7n2Q1K4m2k2M1J18j30j56L27l29N1J96j88oJ30j98J6J91j05J2L4JO2j35
4678g0J0J63k26J77L9J11j66no4j4n0r2J23J34r5J44J2P0l89K61j37N7M2J2r8
4703e1K1Qm2m1K02j50J36n6n6R6k31J56k17J52m6r0K01o4Oj24K36j19j20N4J53
4728A4J00j67J03P6j17r7K5J28j27kJ25J08r7o1O5k14J09J77j09J01m3q4q2J36
4752F7K%j04K0K4O3p7m2K52j74kq4KJ1J67k8j83R0L4j30L30l64J23J26j32J76
4778A67j96l7K57j8n1j82N2l6M9P2o4j17M2J34j28J09M0r1J16j78J21j71J53p7
$$ y = [-69, 115, -2, -10, 12, -18, 156, 86, 149, -25, -59, -96, -45, -126, 125, -132, -1, 37, 19, 64, -91, 89, 108, 61, 95, -66, 73, -28, -49, 112, 48, 48, -95, -34, -4, 74, 40, 67, 80, 119, -83, -25, -6, -13, 217, -73, 189, -74, 21, -192, -48, 15, -28, 9, -43, 38, 62, 20, -2, 39, 157, 27, -129, 198, -131, -80, 116, -72, -78, 52, -146, -130, 61, -44, -32, 2, 3, 65, -70, -60, 103, -123, 54, 93, 204, 38, 33, -31, -45, -95, -187, -64, 70, -25, 119, 131, 201, -188, 73, -64, -7, 35, 47, -51, -30, -22, -64, -105, 97, -53, 83, 27, -29, 67, -164, -8, -225, -73, -119, -209, -8, -72, -66, -190, 46, -73, -193, -139, 14, 114, -53, 50, 126, 9, -88, -63, 65, -62, -64, 61, 169, 72, 11, 76, -138, -29, 148, 39, 140, 97, 13, -69, 67, 69, 69, -35, -15, 9, 72, -5, -47, 205, 31, 29, -55, -53, -42, 125, 97, -86, 4, 38, -92, 238, -126, -3, 123, -9, 167, -29, -66, 191, 173, 122, -60, -8, -44, 5, 77, 13, -104, -62, 72, -56, 53, 93, 2, 118, -60, 61, -110, 43, -34]
4802c4J48r8q6n5K87q1J40j15j59Q5q4J14k21J80k3j19P0J23N5j03p3n6J62r1
4826c4l3J06p3P3j12J64j34m0O3J50j54J99k22o6J92j2J42k15nj09J6J58j44J91
4850A01j37P2P2r4n9n3K77j90N6k4q9m1k3J44q4j8J06J61j50j0q2K07j57j53J4
4875a54J74K3k2j2K5q7O4J02j33j0j14J6jJ87m1j65J20J10k08P0n8K4R5r1L2K7
4901b7j49J03K42j13j2J17k14J62j50J8J40j36J8J01M5k97K01N8l40L25k75K67
4923H4j9r1J12j78J3P2nl7Q6l2J22p6J3j11k57L56L8n0j75M9P4p4J36J00j54j28
4949a32O0L26k71k3J11m8k5m6m9J22O5k05P1J7J10o5P7k0l1m2j20J55j15J20%
4974D2J23o6k20N1L8L6mL5M1m6l2j00j8K56j43J6j55J14j24L05j11J3L0j67O3
$$ y = [-34, 114, 16, -70, -125, 162, 81, 221, 106, -53, 32, -52, 62, -159, 21, -2, -121, -51, 72, 127, 24, -49, -105, 57, -34, -67, 39, -34, 39, -73, 91, -43, -83, -20, 130, -24, 175, -47, -113, 79, 67, 209, -6, -11, -120, -104, 54, -90, 101, -36, 36, 108, 14, -45, -98, 179, -11, 45, 21, -68, -109, -132, 12, -72, -90, 16, 177, 27, 17, -65, 142, -15, -168, -154, 20, 43, 21, 9, 34, -53, 11, 113, -20, -30, -144, -128, -129, 58, 17, -148, -28, 82, -126, -56, -114, -90, 5, -86, -54, -27, -176, -73, 169, 56, 44, 161, -53, 109, -41, -23, 117, -19, -1, 100, 145, -152, 49, 107, -233, 92, -183, 84, 65, -26, 86, -92, -79, -7, -12, -49, 37, 5, 127, 51, 64, -47, -304, 52, 90, 40, -135, -86, -12, -86, 50, 150, -4, -132, -72, 254, -17, -40, 71, 23, -2, -48, -97, 25, 90, -115, -44, -27, 83, 18, 95, 75, 44, 2, -118, 37, -78, 42, 42, 165, 99, -121, -70, -32, 4, 0, 35, 76, 30, -2, -102, -120, 136, -7, 9, -146, -32, -156, 149, 38, 51, 81, -86, -23]
4999b3K1j60O2J94l2j50M7J63j33k8M7J05l3j54L9o6J16L0l9j46O2M1Q7o2L4q1
5025e9J47k1p0J72q1m3j77K90j67J20j17J29q6q1P8L2M3o5p8J00k23N7K74q6j15
5050b7J27K5j77P2n3P3o6R4P0l4k7r1J24j52m4j08J08p8J93K4k32J68lO0m7L1
5076C0J05k53K09k10J73p2M3k03K36J77k69R4p3N4q3m7J45Nj91J86K8j3L5o5k25
5101a84K60j10J45j64K6Q8q9J54j27p4J28m1J4k5j8j08l3J07L1Q3j97J29L3j29
5125a01P4Q2Mm7O3j23P3j83J38J02m0j95k3J37j6RQ8j6nl9J24j47J61j24k8M8
5151A6J3kj04R2r1K4J02k02J70M4n4o5K1J90j76o3K24k3j59J88j16k2J25j71p4
5176a13J37m7K6L7l9K26j54J03l35J44O9L1Q8j70j08n2J21Jl0O5O7o8j6K11k47
$$ y = [-23, -2, -162, -100, 94, 62, -88, -41, 122, -11, -39, 8, 113, 80, -74, -35, -101, 15, 45, 6, -140, -78, -37, 50, -12, 22, -59, 88, 67, -3, 169, 88, 45, -132, 158, -9, 111, -6, 123, 37, -44, 34, 66, 109, 44, -34, 66, -157, -100, 174, 88, -27, 100, 125, -52, 20, -33, 40, -26, 68, 138, 104, 77, -14, 110, -42, -86, -194, -86, -164, 29, 53, -179, -11, -14, 46, -1, 30, 135, -118, 91, -119, 54, -18, 25, -178, 58, 235, -34, 60, -13, 41, -42, -89, 56, 61, -130, 56, 84, 71, 106, 41, -184, 76, -34, 111, -53, -27, 61, -28, 126, -1, -75, 53, 12, 26, 1, -17, -125, -158, -51, -20, 63, -134, -5, 28, -101, -27, 55, 59, 12, 75, -48, 25, -158, -20, 82, 42, -153, -176, -39, -55, -46, 42, 26, 21, -18, 106, -41, 120, -4, -32, 16, 29, 27, -77, 15, -76, -52, 50, -152, 18, 62, 8, -57, -36, 154, -22, -85, 139, 116, -43, 145, 29, 7, 132, -39, -113, 24, -23, 3, 40, 1, 227, 73, 176, -159, -15, 54, 85, 173, 3, -105, -157, -36, -35, -65, 0, 67, -1, -17, 194, -53]
5201e3J89k06Q0j07J37k6L4j07O8j1J17j7j40p8rJ55O7j14O9j03K2q7J68M5j00
5226gQ4j5j5m4k3P4j56J48j15J23j03M9r0J82l3l5l6o0K8L4k7q1Q2o4J4J93j26
5253a9n0K95k84M9r2J89k4k34K01j57K9J43j42J58l2J02J3n7n4l7P2k8O6j53J82
5278A36p5m1QJ03J09mn6j57J5k5j0K0j52J66o0l7O3Nj16J10M6o4L9J0o4J21p2
5305A8n2k08J96j3l0N2N0j33R2n2P8QN1m1l0M6J56j91J29l0j8n1r0J26j62O7j4
5332d6L9n1p3K48l9p7J21j45K9k51K65p3l4J35N9n1n4j8j0O9o0J27k79J35K7K9
5358B2K7o1n9L90l15j7Q6o7m8K5mn3J79m3k24K58j18M2m8J25j85J43L7L4j61k8
5384f3P5r4J0N0r9P0k3p2K18p4K2m2q8j8L33j13j71J99M8k25M1M9j12P7m7Q3k0
$$ y = [-53, 136, -70, 10, -97, 40, 14, 48, -59, 9, -2, 115, 98, -42, -120, -129, 26, 93, -21, 48, -55, -33, -120, 48, 93, -7, 77, 62, 47, 3, -20, 54, -102, 46, -69, 54, -49, 0, -90, 92, 59, 24, -12, -72, -44, -10, -37, -118, -36, -100, -86, 107, -19, -69, 226, -58, -9, -101, 88, 64, -170, 31, -126, -97, 46, -96, 62, 30, 132, 145, 88, 34, -3, 69, 41, 107, -46, 136, 61, 20, 28, 131, 240, 236, 180, 23, 38, 13, 3, 23, -129, 37, -23, -60, 3, 8, -108, 2, 48, -16, 23, 33, -31, 90, 18, -34, -242, -46, -59, -89, -37, 13, -120, -28, -80, -2, 6, 57, 16, -14, 32, 188, -3, 126, 96, 78, 27, -63, 63, -99, -32, -46, -7, -58, -131, 117, 78, 1, 122, -23, 6, -245, 20, -53, -87, 48, 107, 56, 2, -16, -26, 43, -17, 110, -169, -34, -7, 22, 49, -12, -71, 319, 4, -13, 73, 6, -42, -17, -21, -74, 105, 62, -162, 96, -22, 20, -28, 97, -88, 55, 92, 126, -35, -63, 12, -82, -72, -22, -121, -51, -74, -146, 72, -2, 20, -22, -110, -128, 205, 92, -79, 120, 168, -57, -16, 33, -79, -2, -49, 34, 14]
5411A4l5J30j52M2Kj8K9O5k7QJ7j56K44r6j7m0j46lJ18P5j7l2j68J29K45j31j46
5438f6P0J1q5j5L5J96R0k22M6Pj14R4q2J52k11k2N8n0K1J82K2p1J0P3j98J4N0
5465eo4J41k84J79K1lL5j5J45k01L5J82o8o9K4j58N9J92j24o5M1o5O9j18J12n7
5491f1N8J02j17n4K59j20l38L34rj38R6n7N7J47j61l6L1Q8o7j69J83L5r1Qr4K54
5517A40jk18J71j31k4OM4j00J14j56K70j62P1n6k0N2j2J12J35l00N3J50k19p2
5541a53J42M7j83J46J6J05Jp6p5M3Q0j64q2lJ80j41M0M6N6NJ41k10J17oL6L3Q8
5568B29k06M4j68J80J5o4j07J04J27j69J0l8n3K91k67O6p8O3K9j37R3Q4j05PJ86
5593A36j36Q7j84J38j63J70M1k01n0K74n0p4O7N8p5o5R8KO3k20K08j13%J44o3
$$ y = [14, -21, 109, -43, -1, 1, -17, 12, 77, 50, 58, 75, -81, 163, 67, 50, 10, -136, -139, -21, 54, 37, 5, -163, -34, 211, 80, -66, 4, 15, -70, -85, -50, 146, 236, 14, 60, 67, -47, 47, -35, 117, -94, -116, -58, -108, -87, 95, 117, 46, 56, 129, -69, -55, -5, -69, 72, -212, -33, -12, -15, 20, 5, 150, -51, -16, 166, 98, 29, 53, -105, -46, 146, 22, -43, -2, -67, 2, -116, -4, -61, -3, 99, -18, -72, 187, 67, -271, 63, 54, -84, 12, -45, 12, 159, -2, -38, -7, 81, 14, -155, 28, 63, -28, -20, -114, 140, 139, -79, 92, -39, -63, -57, -13, -113, 1, -155, 115, -47, 24, -32, -52, 0, -12, 100, 235, -65, -12, 138, -81, -153, -11, 36, -147, -1, 15, 120, 121, 45, -30, 13, 93, -71, -153, -156, 24, -117, -77, -31, 25, 30, 171, -39, 78, 72, 108, 141, 229, 23, 67, -101, 79, 94, 30, -77, 27, 154, -15, -5, -43, -96, 195, -72, -6, -84, -21, 8, -129, -36, 48, -57, -50, 136, 0, 87, -97, 41, -122, 48, 89, -112, -162, 112, 62, -12, 55, 113, 38, -27, 71, 73, 136, -84, 124, 11, 11, 155, 92]
5618I2j56m9J88j16k0K60k65P2j6n8J38n5o3J16q0l8M3k03J54P7q2%R5lm9J60
5644A42k16J85Kk5p3j7P7k52K71q7j21K61m5k0j3J4j29Q2Q4k35J75N0M5j27K0
5669D8j32k6L4L3OL1o1J3J41q9L0j2J09j17J3M1l0M5l42K74M8K7l9q5Mj5M3R9
5697I1j6p9L7m2L1K6p1J6j1j48K30M1k02K7L1j6J18j0J5r4K06k01K2n6M6k1J32
5724A02p1L4n8J27k47K13o1o0R1M9j42j03J8P4J91j41o7R2K51k41q3J0k1K37J4
5749B08k12J41L6j77QJ5o6l9J01N8q3j60K92n7K9k55K48k13K75q1n1K8k4R1j72
5774f0J57j84N3k2J12k59L63m4M1q4j79J22J9q2QJ13k52J89j48Q7l7J41j22J79
5798A11j44q7L73n10K33nJ46p3k04L9J29J31k3j33Q2r7j07K01m9J3N9oq4P8j41
$$ y = [92, -64, -113, 75, -41, -61, 199, -66, 6, -10, -68, 70, 15, -48, 68, -12, -50, -7, -210, -56, 21, -61, -61, 34, 31, -18, 142, -74, 111, 113, 88, 15, -2, 75, -177, 94, 7, -114, 147, 102, 82, 69, 83, -46, 36, 120, -115, 60, 110, 155, 28, 48, -84, -110, -76, -43, -37, -6, -67, -54, 87, -2, 28, 16, 125, 8, 21, 62, 32, 77, -265, 9, 57, 84, 45, -40, -36, -51, -8, 91, 75, -4, 33, -9, 22, 48, -23, -7, -18, -166, 64, 105, -97, -70, -39, -55, 63, 53, 68, -26, 180, -21, 1, -55, -9, -30, 102, 31, 65, 7, 134, -113, 100, 39, -21, 70, 119, -23, -126, -108, -34, 157, 16, -51, 41, 292, 51, -32, -22, -43, 194, 208, -4, 137, 173, -4, 4, 19, -47, -86, 15, 73, -10, -170, 122, 65, 94, -161, 87, -126, 149, 68, 17, 45, 21, 112, -60, 97, -87, -34, -56, 56, -203, 160, 116, 157, 73, -106, 16, 35, -47, -39, 74, -178, 11, -137, -50, -87, 54, -68, 111, -33, -120, 253, -257, -24, -29, 117, 44, -160, -121, 8, 139, 116, -17, 65, -32, -139, 62, 13, 26, 85, 79, -5, 73, -68]
5823f8J39q5R2k12J9J34M0J32j36n3l9J98p1M1j74kj04j3J24n0nQ1M2o5o3K59
5849A61m0r6J62q1m1K6j65p3J41l1%kP3L2P5o2M1j25K6m2R4j00L8k02K23k05m0
5876b13J19K47j37o9k9q1R8O3nO3p7l3K39k89l1K38j51j4J43k20J34o4q1J03q2
5901a29q3K14k6J58j45L8L2j06J65j86L5Q5K8n5j39J23J5j32Q1J78m2o9R9K0o
5926A53j01O0j72L9o2J48R3k43j9J85j82P3L4m9J18P8j88m7k0J26m0q2k8j5J25
5951a6P1j01l0r4J42P0K9N7p4r2J37j14J28j33l6K04k24KQ3%n0k8j7KR8j55J21
5978b0O2j38P4o5M2O7q8J23P3j10J7j2j47Q1O2K5N2j77Q9Kj6J98j81kP0l8Qo3
6006a2p6M1J3P4j75Q7j25P6K27k50J71q0J18j10Q0m5L0j20o3K04k26M2m4J61O9
$$ y = [-68, 71, -14, 78, -134, -115, 19, 59, 191, 55, 2, -37, 161, 90, 131, -43, -45, -149, -162, -38, -88, -93, -12, 30, -35, -98, 161, 121, 25, 187, 106, 65, 91, -74, -147, -6, -37, -37, -39, 34, 66, 141, 79, 120, -5, 21, -21, 73, -27, 11, -191, 32, -173, -213, -94, 153, 16, -53, -82, -163, -65, -2, -7, 56, -21, -54, 185, -104, -135, 103, -48, -62, 81, -139, -5, -69, -150, -47, -129, -212, 2, -24, 134, -11, 27, 59, -47, 118, -68, -33, 52, 80, 25, -114, 9, 24, -108, -27, 151, 109, 40, 139, 159, 153, 52, 112, -60, -21, -83, 65, 158, -85, -104, 81, -101, -28, 6, -43, 75, 153, -35, -82, -102, 24, -16, -98, -126, -141, -16, 55, -46, -76, -170, -28, 42, 71, 128, 54, -38, 99, -15, 113, -20, -56, 148, -76, -74, 9, 9, -41, -69, -86, -84, 14, -141, -20, 42, -96, -22, -87, -45, 22, -66, 57, 130, 20, 37, 25, -122, -41, 21, 46, 98, -79, 10, 12, -4, 194, 13, 11, 81, 43, 51, -12, -88, -47, -34, 40, -135, -48, -173, -97, 130, -120, 51, -29, 89, -21, 59, 14, 44, -76, -139, 65, -161, -119, -163, -2, 67]
6031F7N5k43k2J91j04L1J59m8N4j90J07o1l9O7Nk0j62J55k8J3k5r0J33j17Q1R9
6057F8O4j54L9k3R1J2j9j46on3L21j00q7R5j31j05L01p5j53o1r5K64j58P3Q9j06
6083e5J8o9J02J29K7j38k1k0j10J42m3J81j90Q1n0m6kM9R0k01L05k18N3rm2Qj1
6110d0m9J02Lj79J26J09j65N2k7MN1p7M7J38j83P2oJ32j21j23J97l6j0P6r0QO3
6137G4j51n1J34p0P6r7P4OR5k48K36J49l69O4J70o6Q8o1Jl0n8Jj23K67J30j19
6163A22Mj56j74k1K58j9k27L03j6j19L3k77K42J17j60J17R6j21r7J45LK09l77
6186a15J26j97Q2J11M6O7j26P4R1k61J43r0P9J42l20J98l93K46R7P9j12J22j52
6209f3JK03j63k70L42j2q9k8l0K47q0p6M2ll3R1r2Kn6K83j87K6l6Q8m8n8J17q0
$$ y = [67, 122, -121, -143, 48, -56, -25, 134, 86, 140, -50, 57, -4, -43, 24, 29, 9, -153, 2, -26, -13, -38, -128, 5, -112, -31, 68, 132, -22, 17, -6, 85, 97, 78, -68, -74, -127, 194, 94, 7, 102, -29, -134, 167, 92, -61, -122, -217, 47, -111, -38, 51, -55, -37, -106, -4, 125, 152, 14, -7, -27, -137, 5, -38, 143, -47, 34, -16, -62, -64, -15, 75, -126, 179, -39, 14, 5, -37, -29, -40, -89, 13, 16, -163, -37, 72, -93, -41, -68, -64, -13, -90, -43, 95, -88, -16, -22, 110, -11, -134, 63, 27, 17, 93, 3, 11, 74, -77, -128, 6, -64, 12, -85, -11, -5, 90, -158, 78, 227, -142, -78, 92, 26, 114, 53, 54, 24, -34, -33, -156, 111, 241, 122, 126, -30, -204, -225, 33, 14, -213, 90, 74, -45, -12, -289, -47, 70, -90, 27, 123, 2, -95, 50, 53, 262, -115, 11, -186, -104, 7, 53, 120, -6, 68, 159, -102, 41, -49, 30, 172, -148, 50, -343, -97, 0, 79, -33, 89, -63, -62, 141, -22, -292, 50, 38, -51, -79, -109, 138, 58, -18, 24, 21, -12, 79, -13, -11, -67, 216, 29, 55, 19, 107, 59, 1, 118, 38]
6237C8L3m0j05K8Q8j44J88j80K9J19q1n1p9K66n9m1r1K5Lj8K9J36l21J84O6k7
6263eP0K1n5Kk6j43M7K04j22p0J40j06J42j85N1O5J0k26K62l8n3m9k3J51j7j86
6289a39J66j26L4M1l9P7M5j5N4j94Q0p4O9J70o4J12Q5k94o9J40p0K6L1%l5M9k1
6316C9K4p3p0J16J35j24m9j07J86J10L8l51o2J47Q0J51k96L1j1J30Q0j21p6N7
6340a6j21r9J76J2J95l09J91j48J71o4m9J10m9j08O0M9j5nq4J13j7l4M9j58J46
6365dj7LK00k11k8j81L31j18Lk5n1m0J97p2M2j6J12j00o6N0J3O9j33M2j28p6K52
$$ y = [38, 71, 31, -74, -46, 42, -102, 86, -94, -65, 54, -27, -78, -157, 109, 50, 9, -82, -57, -54, -72, -43, 93, -228, -44, 22, -5, 65, 86, 31, 33, 7, -136, -89, 115, -7, -77, 63, -43, 99, -86, -35, 30, 40, -186, 76, 38, -15, -64, -87, 64, 47, -139, 27, -99, -65, -24, -63, 14, 59, 44, 98, -96, -16, -90, -21, 149, 85, 197, 282, -12, -81, 59, -11, 15, 46, 46, 11, 60, 39, 63, -10, -80, 36, 171, 47, -2, -109, 77, 187, 225, -126, -188, -41, 39, 190, -106, -75, -86, 44, 124, 3, -73, -16, -137, -236, -60, -48, 147, -162, 29, -119, 52, -12, -61, 49, 0, -108, -48, 1, -14, -19, -103, 10, -7, -41, 8, -150, -4, -21, -18, 182, -29, -57, -238, 93, -25, -22, -47, -98, -138, 59, -13, 29, 13, 125, 25, -41, 9, 22, 91, -42, 0, -128, -204, 48]
$$ [...]
8191H4
##END NTUPLES=NMR FID
##END=
