##TITLE=1H_Pr 5289
 200.13MHz,CDCl3,
 8 sc
 
 11.7.2025
##JCAMPDX= 6.0         $$ Bruker NMR JCAMP-DX V2.0
##DATA TYPE= NMR FID
##DATA CLASS= NTUPLES
##ORIGIN= UXNMR, Bruker Analytische Messtechnik GmbH
##OWNER= pz
$$ XWIN-NMR		Version 3.5
$$ Fri Jul 11 15:50:54 2025 Russian Standard Time (UT+4h)  she@DPX200
##.OBSERVE FREQUENCY= 200.1313
##.OBSERVE NUCLEUS= ^1H
##.DELAY= (6, 6)
##.ACQUISITION MODE= SIMULTANEOUS
##.ACQUISITION SCHEME= undefined
##.AVERAGES= 8
##.DIGITISER RES= 18
##SPECTROMETER/DATA SYSTEM= spect
##.PULSE SEQUENCE= zg30
##.SOLVENT NAME= CDCl3
##.SHIFT REFERENCE= (INTERNAL, CDCl3, 0, 14.3821)
##AUDIT TRAIL= $$ (NUMBER, WHEN, WHO, WHERE, WHAT)
$$ ##TITLE= Audit trail, XWIN-NMR		Version 3.5
$$ ##JCAMPDX= 5.01
$$ ##ORIGIN= Bruker BioSpin GmbH
$$ ##OWNER= she
$$ F:/spectra/data/she/nmr/H-C/1/audita.txt
$$ ##AUDIT TRAIL=  $$ (NUMBER, WHEN, WHO, WHERE, WHAT)
(   1,<2025-07-11 15:49:37.85 +0400>,<she>,<DPX200>,
      <created by zg, POWCHK disabled, PULCHK disabled
       configuration hash MD5:
       00 E9 B6 7A A2 85 ED C7 34 08 36 98 17 FE 4E 26
       data hash MD5: 16K
       83 48 3F 3C D1 25 00 71 45 0F 10 7F 2D DA D1 6C>)
$$ ##END=
$$ 
$$ hash MD5
$$ 75 2A 6A 3D 16 91 93 47 50 0D FA 2C 4C 08 11 8D
##$RELAX= 
##$RELAX= 
##$RELAX= 
##$RELAX= 
##$RELAX= 
##$RELAX= 
$$ Bruker specific parameters
$$ --------------------------
##$DU= <F:/spectra>
##$EXPNO= 1
##$NAME= <H-C>
##$PROCNO= 1
##$TYPE= <nmr>
##$USER= <she>
##$AMP= (0..31)
100 100 100 100 100 100 100 100 100 100 100 100 100 100 100 100 100 100 
100 100 100 100 100 100 100 100 100 100 100 100 100 100 
##$AQSEQ= 0
##$AQ_mod= 1
##$AUNM= <au_zg>
##$AUTOPOS= <>
##$BF1= 200.13
##$BF2= 200.13
##$BF3= 200.13
##$BF4= 200.13
##$BF5= 200.13
##$BF6= 200.13
##$BF7= 200.13
##$BF8= 200.13
##$BYTORDA= 1
##$CFDGTYP= 0
##$CFRGTYP= 5
##$CHEMSTR= <none>
##$CNST= (0..31)
1 1 145 1 1 1 1 1 1 1 1 1 1 1 1 1 1 1 1 1 1 1 1 1 1 1 1 1 1 1 1 1 
##$CPDPRG= <>
##$CPDPRG1= <>
##$CPDPRG2= <>
##$CPDPRG3= <>
##$CPDPRG4= <mlev>
##$CPDPRG5= <mlev>
##$CPDPRG6= <mlev>
##$CPDPRG7= <mlev>
##$CPDPRG8= <mlev>
##$CPDPRGB= <>
##$CPDPRGT= <>
##$D= (0..31)
0 0.7 0 0 0 0 0 0 0 0 0 0.03 0 0 0 0 0 0 0 0 0 0 0 0 0 0 0 0 0 0 0 0 
##$DATE= 1752234577
##$DBL= (0..7)
120 120 120 120 120 120 120 120 
##$DBP= (0..7)
150 150 150 150 150 150 150 150 
##$DBP07= 0
##$DBPNAM0= <>
##$DBPNAM1= <>
##$DBPNAM2= <>
##$DBPNAM3= <>
##$DBPNAM4= <>
##$DBPNAM5= <>
##$DBPNAM6= <>
##$DBPNAM7= <>
##$DBPOAL= (0..7)
0.5 0.5 0.5 0.5 0.5 0.5 0.5 0.5 
##$DBPOFFS= (0..7)
0 0 0 0 0 0 0 0 
##$DE= 6
##$DECBNUC= <off>
##$DECIM= 32
##$DECNUC= <off>
##$DECSTAT= 4
##$DIGMOD= 1
##$DIGTYP= 9
##$DL= (0..7)
0 120 120 120 120 120 120 120 
##$DP= (0..7)
150 150 150 150 150 150 150 150 
##$DP07= 0
##$DPNAME0= <>
##$DPNAME1= <>
##$DPNAME2= <>
##$DPNAME3= <>
##$DPNAME4= <>
##$DPNAME5= <>
##$DPNAME6= <>
##$DPNAME7= <>
##$DPOAL= (0..7)
0.5 0.5 0.5 0.5 0.5 0.5 0.5 0.5 
##$DPOFFS= (0..7)
0 0 0 0 0 0 0 0 
##$DQDMODE= 0
##$DR= 18
##$DS= 0
##$DSLIST= <SSSSSSSSSSSSSSS>
$$ [...]
##$SUBNAM0= <"">
##$SUBNAM1= <"">
##$SUBNAM2= <"">
##$SUBNAM3= <"">
##$SUBNAM4= <"">
##$SUBNAM5= <"">
##$SUBNAM6= <"">
##$SUBNAM7= <"">
##$SUBNAM8= <"">
##$SUBNAM9= <"">
##$SW= 18.0517328524113
##$SWIBOX= (0..15)
0 0 2 0 0 0 0 0 0 0 0 0 0 0 0 0 
##$SW_h= 3612.71676300578
##$TD= 16384
##$TD0= 1
##$TE= 0
##$TE2= 300
##$TE3= 300
##$TEG= 300
##$TL= (0..7)
0 120 120 120 120 120 120 120 
##$TP= (0..7)
150 150 150 150 150 150 150 150 
##$TP07= 0
##$TPNAME0= <>
##$TPNAME1= <>
##$TPNAME2= <>
##$TPNAME3= <>
##$TPNAME4= <>
##$TPNAME5= <>
##$TPNAME6= <>
##$TPNAME7= <>
##$TPOAL= (0..7)
0.5 0.5 0.5 0.5 0.5 0.5 0.5 0.5 
##$TPOFFS= (0..7)
0 0 0 0 0 0 0 0 
##$TUNHIN= 0
##$TUNHOUT= 0
##$TUNXOUT= 0
##$USERA1= <user>
##$USERA2= <user>
##$USERA3= <user>
##$USERA4= <user>
##$USERA5= <user>
##$V9= 5
##$VALIST= <valist>
##$VCLIST= <CCCCCCCCCCCCCCC>
##$VD= 0
##$VDLIST= <DDDDDDDDDDDDDDD>
##$VPLIST= <PPPPPPPPPPPPPPP>
##$VTLIST= <TTTTTTTTTTTTTTT>
##$WBST= 1024
##$WBSW= 4
##$XGAIN= (0..3)
0 0 0 0 
##$XL= 0
##$YL= 0
##$YMAX_a= 233693
##$YMIN_a= -296323
##$ZGOPTNS= <>
##$ZL1= 120
##$ZL2= 120
##$ZL3= 120
##$ZL4= 120
##$ABSF1= 10
##$ABSF2= 0
##$ABSG= 5
##$ABSL= 3
##$ALPHA= 0
##$AQORDER= 0
##$ASSFAC= 0
##$ASSFACI= 0
##$ASSFACX= 0
##$ASSWID= 0
##$AUNMP= <proc_1d>
##$AZFE= 0.1
##$AZFW= 0.1
##$BCFW= 1
##$BC_mod= 2
##$BYTORDP= 1
##$COROFFS= 0
##$CY= -3
##$DATMOD= 1
##$DC= 2
##$DFILT= <>
##$DTYPP= 0
##$F1P= 0
##$F2P= 0
##$FCOR= 0.5
##$FTSIZE= 0
##$FT_mod= 4
##$GAMMA= 1
##$GB= 0.15
##$INTBC= 1
##$INTSCL= 1
##$ISEN= 128
##$LB= 0.25
##$LEV0= 0
##$LPBIN= 0
##$MAXI= 10000
##$MC2= 0
##$MEAN= 0
##$ME_mod= 0
##$MI= 1.114404
##$NCOEF= 0
##$NC_proc= 0
##$NLEV= 6
##$NOISF1= 3.799351
##$NOISF2= 2.8
##$NSP= 1
##$NTH_PI= 0
##$NZP= 0
##$OFFSET= 14.38212
##$PC= 1
##$PHC0= -1205.165
##$PHC1= 17.59254
##$PH_mod= 1
##$PKNL= yes
##$PPARMOD= 0
##$PSCAL= 0
##$PSIGN= 0
##$REVERSE= no
##$SF= 200.129724274929
##$SI= 16384
##$SIGF1= 3
##$SIGF2= 2
##$SINO= 400
##$SIOLD= 16384
##$SREGLST= <1H.CDCl3>
##$SSB= 0
##$STSI= 0
##$STSR= 0
##$SW_p= 3205.1282051282
##$SYMM= 0
##$S_DEV= 0
##$TDeff= 0
##$TDoff= 0
##$TI= <>
##$TILT= no
##$TM1= 0
##$TM2= 0
##$TOPLEV= 0
##$USERP1= <user>
##$USERP2= <user>
##$USERP3= <user>
##$USERP4= <user>
##$USERP5= <user>
##$WDW= 1
##$XDIM= 8192
##$YMAX_p= 0
##$YMIN_p= 0
$$ End of Bruker specific parameters
$$ ---------------------------------
##NTUPLES= NMR FID
##VAR_NAME=  TIME,          FID/REAL,        FID/IMAG
##SYMBOL=    X,             R,               I
##VAR_TYPE=  INDEPENDENT,   DEPENDENT,       DEPENDENT
##VAR_FORM=  AFFN,          ASDF,            ASDF
##VAR_DIM=   8192,          8192,            8192
##UNITS=     SECONDS,       ARBITRARY UNITS, ARBITRARY UNITS
##FACTOR=    0.0002768,     1,               1
##FIRST=     0,             0,               0
##LAST=      2.2672688,     0,               0
##MIN=       0,             -296323,         0
##MAX=       2.2672688,     233693,          0
$$ Real data points
##PAGE= N=1
##DATA TABLE= (X++(R..R)), XYDATA
$$ [...]
1927a82J58J71m10oN54J89p9L54k88j45j51j6k9k92j33R2m4l63K12J53k01K41
1949b15k4K22K83j24L95j47k77J55%lk24o2k61K02o21L64J32j77j36O04l03L64
1971A47Q1j23K50j89L25p3j33K15j48n19K63k57r6J88l45R4k3k38K12L48n0p3
1993a44K41J79q3M2n0K17l45O5O1n29K6K26k67n4j55L64N64o28m1P18k25k59Q15
2016G38m11m61N84P6m27j95l8K04l62P5j2l41JK47P53n74n7L83K45j31m8J73k48
2039A74m0K67l02Mk49K97j01l49l4M49k37m21N98j92l8K49J79J07k93k6K93p0
2061B65l7l65Q5j03j17JJ99l68L38K13j42j86K34M41m47K22l19K79Jk63M32j86
2083A77l69K2j18J39j53O8J78L7n5M18k52r4K86M9k49l4J08k8k57o1L30k01q2
$$ y = [-182, -24, 147, -263, -269, 285, 474, 395, 749, 461, 316, 165, 149, 120, -172, -305, -213, -257, -620, -408, -255, -456, -215, -239, -17, 266, 142, 537, 390, 113, 268, 268, 265, 41, -21, -282, -80, -701, -337, -205, -382, -518, 86, -217, 147, 228, 105, 355, 166, 491, 418, 285, 500, 352, -167, 96, -161, -257, -69, -414, -320, -343, -581, -369, -21, -71, -144, 97, 276, 193, 235, 185, 402, 57, 122, 183, -346, -320, -94, -361, -415, -570, -206, 358, -270, -311, 407, 182, -77, 738, 327, -134, 450, 526, 99, -96, -134, 70, -292, -217, -229, -570, -569, -322, 431, -143, -200, 183, 428, 297, 249, 422, 174, 134, 401, 99, 103, -146, 151, 50, -299, -333, 116, -121, -542, 56, -136, -174, 75, 254, 361, 68, 42, 335, 265, 228, -137, -52, -155, -272, -271, -72, -440, -102, 111, -31, -217, 17, 458, 11, 233, -86, 193, 194, -69, 363, 177, -192, -170, -288, -149, -302, -234, -56, -19, -74, 344, 92, -2, 284, 333, 84, 50, 158, 130, -127, -188, 142, -59, -141]
2106a41Jo7p2J69p6K65j73K40K0L17k20J9K00n44J34J33k37k34J9j50P2J12q9
2129c02K59r6j79N42lr3K94p5k01L7k82K66k01j51Q5K41o12K41j34j08K11N6Q7
2152a18J15j08L42l7j80M88j25k12m7J20j39l13J41j71J85k58k18M25N8M5n9O9
2174CK37J66j87P8j92J90l4l81k32L61m9j91q6O8%j78N10n3p1J60l24J00L06k35
2198c4K12J82l50O5j29j07o8K5j3K41k09m44M11J80m7K67N8k87L34J5J22n6n18
2221a50K11m9qJ05l82J73j45P1j54K3L46j91K0O7K61j98J61L29n3j46l71K60k26
2244d6j42j0K40j02l61L87k38k33K45M29k80M87k14N8j89M2M9N2J36j49j96j09
2266a44K11l34k7K71p0j03R4k26J78K13p1P0J32n8j08N0K7J78k86j04j27J68j34
$$ y = [-141, -140, -207, -279, -110, -186, 79, -94, 146, 166, 483, 263, 282, 482, -62, 72, 205, -32, -266, -247, -397, -325, -213, -302, -43, -139, -318, 224, 221, 128, 422, 347, 146, 183, -99, 167, -34, -185, -100, 141, -471, -230, -364, -472, -261, -205, -118, -3, -111, 231, 194, 14, 502, 377, 165, 118, 238, 99, -214, -73, -244, -59, -317, -535, -110, -52, -7, -66, 3, 240, 406, 219, 297, 105, 295, 261, -120, -352, 9, -40, -231, -317, -249, -249, -427, 83, 30, -41, 119, -205, -105, 201, -34, 178, 360, 10, 75, -54, -161, -229, -204, -217, 24, -185, -629, -218, -38, -85, 182, 240, -47, 287, 302, 424, 368, -150, 61, 12, 4, 109, -273, -100, -245, -174, -328, -305, 41, -150, -130, -63, 198, 0, 161, 490, 437, 291, -80, 180, -46, -188, -198, 42, -60, -421, -34, -272, -505, -260, 169, -111, 376, 162, 220, 31, 73, 122, 174, 310, 161, -35, -144, 67, -267, -294, -23, -93, -196, -102, -328, -150, 63, -8, 62, 194, 136, 28, 78, 105, 283, -3, -107, -234, -66, -200]
2289b00L64l12R6L7Q7M1j53J42K99m40J76nO9j70O4k39K14m10J4J04oJ02J92k55
2313a89J72P4P6J38j23K16j19j05l64J93J9P9k06l01M56l57L38oN6j97L98Q3k69
2336F2n1L64n48M05j04M4k68K59J10m69K6R4p1J57j64L04k34K2R7R6J39j1k3J42
2360C78m80M5J60j81L5o3J91l19j00J7N1O0R8K12j85K7K68J08k76J82j14J67j72
2383A09o9R2j15j55j94L2M00n53K98k53J64L60k33J48J35j24r7L28k1K4r3j85
2405bj79j1N3M20o18K70J10l17L25J6j27L03r0L4j30j11R8K71m47J33J63k85K6
2428i5M8k10K42l33L9L33l18O7K68K8R5N4P2l38K93n5J67l36j22K39m47pK97l4
2452e3m6L5Kk16L45M1j00Q4O8j26J80J6k89m1j01J77j2J27j56P7j09l46J74L70
$$ y = [-200, 164, -148, -52, -15, 72, 113, -40, 102, 401, -39, 137, 132, 201, 31, 95, -144, 70, -340, -326, -222, -228, -126, 66, -189, -17, 57, 133, 271, 148, 364, 245, 140, -224, -31, -12, 67, -139, -440, 16, -341, -3, -9, 47, -150, 248, 331, 62, 11, 375, -173, 232, 128, 172, -96, 163, 273, -196, -170, -76, -147, 10, -154, 150, -84, -62, 35, 131, 270, 259, 236, 378, -102, -57, 103, -78, -43, -106, 85, -234, -334, -317, -266, -206, -108, 104, -81, -54, 214, 322, 46, 228, 114, 281, 109, 40, 132, 17, -138, -332, -300, 100, -453, -155, -408, -244, 116, -117, 31, 166, 42, -55, 273, 252, 276, 183, -2, -181, -192, -139, 281, -337, -67, 43, -274, 51, 67, -60, 243, 153, 187, 57, -54, 44, 315, -132, 1, 164, -121, -95, -47, -257, -15, -348, -309, 24, -294, -227, 41, 69, 164, 218, 290, -48, 245, 190, 357, 21, -101, 138, -309, -316, -19, -53, -99, -64, -62, -278, 67, 108, 8, 92, 160, 34, 214, 230, -59, -100, -201, -24, -36, 91, -65, 12, -97, -443, -269, 101]
2476A01j54J20JK97k00q7j35K81j12k67K15m0k57J98J74p5q4l87M08k35J53K70
2498A85Q0n04L59o7J15j58j09K79q9p1j9J16k31mm3n2K87j67O7l7j2K23J22l21
2522e1Q1J5k13L3J35j71J88k99M6L42l00L5n1j07M70j4k56K79m5j61K68j25j88
2545h9L43m05l2K85m06q7M53k06J01K66m6j37m8J87j1j47J90m08L76J57l84O8
2567B0J6j10N5j41N6J58k13K8r4J49m1J27J60m59M45L9j55K02p3j11l87o1L47
2590d3j05k52M07j13k2L1J19P9LJ28k6K74l78j27K17j15K5l92K51r2j86J07j71
2613c81K07J09L00n5k10K22j47J95j44J6K43J2l04N7j23m97L01J07O8P9j53j75
2635b73J87nM3j4j3J89N7k04M87l74L5n0j44L28k76j39l1j85M08r9Q8l12O29l70
$$ y = [101, -53, 67, 68, 365, 165, 78, -57, 224, 112, -155, 60, 20, -237, -39, 135, 60, -24, -411, -3, -238, -85, 185, 265, -239, 120, 53, 168, 10, -99, 180, 91, 20, 1, 117, -114, -118, -161, -213, 74, -93, -26, -63, -75, 148, 270, -51, 30, 45, -168, -135, 0, -171, 17, -282, -236, 106, -194, -159, -210, -317, 153, 139, -117, 162, 117, -44, 224, 99, -89, 254, -151, -183, 102, -304, -391, 62, -144, -43, 223, 177, 40, -8, 179, 168, 21, 211, -197, 179, 336, -48, 20, 36, -74, -19, -160, -104, 54, -159, -131, -225, -76, -117, 10, 170, -289, 156, 195, 40, 242, 169, 58, -329, -390, -43, -148, -400, 7, -106, -128, -97, 22, 101, 104, 232, 206, 480, 102, -25, 192, 77, 102, -290, -39, -131, -317, -210, -381, -174, -65, 235, 180, -30, 192, 45, 240, 96, 112, 355, 367, 63, 120, -3, -500, -199, -92, -24, 55, -98, -273, -86, -91, -48, -62, -75, 114, 171, -33, 454, 80, 115, 65, -79, 249, -27, -166, -197, -382, 26, -73, 15, -297, 332, -38]
2659c8r6N1KK96j33j64J65r1P6K0k70k6k1J78J90l80J37K0L32k66L0J36K61j96
2683B13j45MK16j51o9q4J67k08J98k77J97k84K66j21j93J78J75J71p7K75j71l32
2705e2J49n8nj7k27N9k27K93Q9j85mK38o3J5K19j15Q5l45L26J22j58J50m15Q3
2729d3j77K63Pk61Q2r5K51j48J96P3r5K16L7J8j40l19P7K20n2k41J66k62J29K81
2753A83kO1j47r3K25j48J0k64j77M08k6P1J33m1k55j05K0r7K19l04N1J09M6R7
2777b6K5l57N21r4l8L29j98j59L78l47j04K96m8n06K97k61l4J30L02j45R1J22
2799A74k00J8P7J24o3J53Oj66j16j0k1Qj40J61K1k83L1O2qP3J8J90P6m3L0K07
2825C79m18J21N4k50rj9R4j26k84M10j63O4J24J11L7k08j8L10p7n7K71l06k41
$$ y = [-38, -134, -83, -81, 215, 82, -82, 83, -8, 68, 88, -182, -208, -229, -51, 139, -241, -104, -84, 248, -18, 12, 148, 409, 213, 68, 72, 288, 137, 68, -16, 151, -57, 141, -136, 61, -223, 43, -78, -271, -93, 82, 253, 176, 451, 280, -52, 97, 39, 34, 17, -210, -151, -378, -85, 4, -181, -185, 53, -10, 5, 224, 109, 194, -151, 175, 297, 139, 289, -126, -43, -220, 43, 50, -211, -129, -224, 27, -121, 75, 148, 53, 269, 306, 324, 184, -135, -58, 162, 110, -131, 35, -227, -98, 183, 181, 242, 95, 2, 227, 79, 89, -175, -352, 56, 30, 101, 234, 193, -62, -167, -147, -244, -25, -329, -278, -169, -123, -26, -1, -358, 163, 69, 31, 360, 162, 3, 381, 34, -70, 226, 178, -328, -31, -292, -326, -196, 106, -39, 52, 174, -26, -8, 69, 193, 130, 283, 289, 123, 7, -3, -24, -16, -156, 5, 26, -257, -226, -164, -172, -99, -81, 109, 185, 142, 172, 379, -39, 82, 136, -114, -123, -142, -48, -174, -458, -48, -211, -147, -23, 88, 125, -83, -101, 209, 132, 75, 346, 40, -201]
2848b01K05K36l30P2j16j9M1k24K80K0m5J21R8P2j3p7K7K14k16j50J47k43k86
2871c87M60k31O2K6M1k94R3M33K4l86R0J20k0n7J20J06l41M57J6l74LL6Q1k50
2895a72K21j30j19r9N5M68k60J01J2kq7m1q4o6J49m1J6j41K81j54k13J79L1J66
2919G0k45J81P6Oo9P6k13K92j15q7m5j94r2K37O8j50N0M57l42K54k93K43r2N5
2943A28n6K93j68j36k35K22n5k05j27k9M08j99P1j31J07R4oo2K01R0K55l26j29
2966EJ07J46l01J15j06j17P7L4j62L48k70rJ39j43K2K27l47K72M64j51l36K00
2988B14L6J8k53l16L31l13J65j97K22N1j12m9L69j07L13O1l61L54l24l43M77k01
3010C5o8L2k39K27j58o9J07j26K41j94K74M2j08J40J30k88J01J38l81K7M9M1p7
$$ y = [-201, 4, 240, -90, -18, -134, -153, -112, -336, -56, -36, -81, 40, 138, 210, 197, 120, 147, 361, 145, -5, 142, -101, -387, 73, -158, -96, -70, -29, -323, -230, 203, 227, -159, -69, 51, 31, -26, 94, 200, -141, 316, 332, -42, -39, -3, 78, -172, 49, -81, -200, -299, -244, 224, -36, 65, 77, 75, -12, -53, -137, -203, -54, -95, -79, -220, 61, -93, -306, -127, -96, 70, -175, 6, 82, 88, 19, 95, -118, 174, 59, -28, -73, -267, -359, -122, -54, -204, -154, 303, -39, 215, -78, 165, 73, 128, 72, 365, 197, 61, -174, 48, -7, -212, -339, -368, 40, -159, -88, -219, -112, -18, -24, -86, 115, 205, 460, 134, 5, 112, 258, -43, 72, -34, -151, -74, -40, -202, 146, -124, -133, 6, -137, -115, 112, -235, 37, 501, 350, 14, 214, 250, 268, 15, -301, 30, -283, -118, -315, -93, -42, -154, -203, 166, 59, 372, 433, 72, 426, 102, -241, 236, 35, -33, -1, -240, -13, -171, -240, -133, -259, -18, -212, 62, 104, -4, 136, 266, -22, 79, 217, -164, -137, -88, -47, -124]
3033a24k9n3N0K76l70L66k68r1K45K54j44j64J18J34l82M70j11j88m7Q5m1j21
3055a35m0l3J37O2JJ0K67j20k62M45l76J65N9k28j2K68l62NK0k81N60j53K11l28
3079a20J91o3j32K4K59j06K2R5k61J47J47r0Pj78J94k53J3p9j32N56k53k2r6K12
3103H2j23K38k77L48k68M1M8k10K73O7l06o6L6r8J54J70p1o7j65M50j6m3j9p3
3127A05r6K26j55P4R9l83R1p9l96O26j98J65kj52L36N2l10M3K61l94L7K34j54
3150C0o6n1K02j08j35n8K73n16L75J3j00J19j63J36K58J33m21L38m20L99j85R3
3172A46l57K66l16J63k53J47K44k27K29o8k37K80K35r7J61l89J32l46J62N2j10
3193a83L47j9J9k10j28J6J69j26pJ58j49J16R9J02l6k28M54k48k47J4j12K25l15
$$ y = [-124, -153, -206, -156, 120, -250, 116, -152, -243, 2, 256, 112, -52, 66, 200, -182, 288, 177, -11, -58, 27, -14, -135, -175, -208, -71, -9, -8, 2, 269, 149, -113, 332, -44, 121, 180, -48, -60, 208, -154, -149, -129, -410, 150, -3, 208, -120, 71, 8, -124, -100, 159, 53, 75, 170, -91, 56, 203, 113, 120, -58, 136, -117, -104, -183, -315, 241, -12, -34, -130, 82, -41, 197, -80, 268, 0, 41, 89, -121, 152, 219, -87, -153, -117, -215, -61, 109, 38, -29, -194, 256, 240, 197, 178, 105, 9, 235, 80, 154, 253, -130, -39, -118, -514, 112, -86, 79, 77, -75, 261, 313, 3, 46, 307, -87, -50, 184, 30, -36, -87, 115, 7, -128, -186, 87, -429, -54, -41, -141, -22, -185, -49, 209, 342, -79, 259, -161, 238, 53, 146, -211, 55, -261, -98, -351, -204, 40, -187, 42, -26, -263, 17, 252, 155, 316, -73, 59, -287, -125, -73, -183, 164, 145, 164, -46, -174, -158, 11, -115, -122, 36, -113, 3, 102, 204, 168, -60, 394, 146, -101, -87, -199, 26, -289]
3216b89J15O0M5k04L50J25K9o9l38M27j05j75P1P0p4K29k03Mj10R1j36k0j33L1
3240b09j2O6M68l28J21j24L71l59K01k24k2M99l97j16O7R9r5p4J93Jm28L77k62
3263a87Q8MK50J38r1k14K31j24J52j30q5K3k47j38K05k3J40q2m4R9N4o6J18j84
3287a13R5J55Q7k86Oj07J45j24L27k30R8j20l2Q2O3Q1j31K8J37p0J65j77j29l4
3311h4l9n4K75o8m4%m08N80j62R9q5j03R0j57M05q3p7J0L1O4k70L7j28j8K15p6
3337e0J44j1l56J5J72R3K26k78K07l24Q8J72m3K1p5m2R1q0n7O6n0J08J08m13M04
3362A36l7p2J21m4q3K9J09o3K4k65p3P3K02l86J65J39j76lM14l30N2J1O4J6J05
3387A28j94O0j43K63q9J34nr0j00l92L61o5J36j18%k13K27J51k6PK26k97K04n7
$$ y = [-289, -174, -114, -69, -273, 77, 202, 231, 162, -176, 251, 146, -29, 42, 112, 38, 267, 64, 68, -42, 49, -87, -107, -240, -209, -221, -155, 313, -15, 106, -18, 353, -6, 195, -29, -51, 448, 51, -65, 2, 101, 6, -68, 125, 126, -302, 75, -187, -99, -95, 155, 293, 202, -12, 219, 95, 247, 117, 32, 55, -192, -330, -125, -148, -8, -90, -134, -35, 19, -47, 71, -113, -18, 137, 224, -62, -56, -163, -18, -142, 185, -45, 53, -67, -99, -17, 46, 127, -4, 24, 161, 91, 256, 79, -50, -84, -123, -177, 98, 30, -14, -14, -422, 158, -4, 95, 10, -93, -3, -160, 245, 162, 85, 95, 126, 190, -80, -43, -171, -189, 26, -50, 94, 83, -273, -258, -86, 7, 233, -45, 162, -162, -74, 98, 55, 76, 1, -41, 50, -30, -87, -21, -71, 37, 145, -268, 136, 99, 27, 148, 104, 21, 50, 159, 96, 120, -145, -218, -145, 57, -329, -164, -25, -201, -204, 210, -120, -68, -57, 7, 23, 128, -66, -6, -149, 114, 25, 159, 154, 64, -36, -428, -67, -132, 4, -114, -114, -327, -100, 51, 25, 32, 258, -39, 165, 108]
3411A08J29k97J32J47j40j22j03K28j99Lj74M13j20k3oL2m8L16l28L8J01J82L5
3434C04k55r4j20J79l19K10J5K54oj04j28J76j88j2M0J94o4O6j06j48J45j61p6
3457a98K89J11n02m6M81l48J82l4J70k36J45J02m5jnj03K25k40Q1l1r5jL50m35
3481a84K07j93k14L56L2mm7K98K9j20l34K07N8j96K36J7l60J30P6m07K52L57l98
3504b02M18Mk93L04J07l59J21j46J79j25p6J58j70J68o6l46K3L23L8k72J39J88
3526A15k76J21P1O4O1q7j64J7J79l18n0L20K36l24j54K01k84L68K4l84j03L57
3548a0r1j33L37L3l1j34L12k10p4j86J90Kj36k4L4p4J50m2L3N36m93J66m2l6n4
3573B3j02L98n21O1L25j38m2p8p7r6L55j22K11j87L2J62O5j41J0m35L93k0M8j90
$$ y = [108, 237, -60, 72, 219, 79, -43, -146, 82, -117, -114, -288, 125, 5, -18, -24, 8, -40, 276, -52, -14, 87, 269, 304, 49, -45, -165, 14, -305, -95, -80, 174, 168, 64, -64, 112, -76, -88, -48, 146, 82, 148, 42, -106, 39, -122, -198, 91, 202, -300, -346, 135, -213, -31, -65, 105, -131, 14, 116, 71, 70, 65, -38, 187, -53, 28, -3, -98, -99, 251, -184, 23, -170, -384, -28, 4, 0, -47, 251, 280, 160, -174, 33, 91, -105, 131, 148, -212, -82, -6, -413, -161, 196, -202, 216, 220, -73, 231, 338, -21, 100, -46, 133, 8, -68, 90, -80, 88, 22, -324, -301, 22, 60, -212, -73, 115, -161, -40, 31, 95, 156, 69, -95, -78, 101, -217, -267, 53, 289, -35, -189, 12, -272, 96, 120, -264, -367, -10, -101, -234, 103, 136, 105, -29, 283, 73, -1, -187, 3, 5, -131, -155, -121, -195, -45, -87, -54, 482, -11, 155, 113, 77, 23, -79, 319, -202, -141, 184, 46, 4, -74, -151, -247, 108, -14, 197, 10, 42, 204, 269, 128, 138, -297, 96, 76, 124, -66]
3597f6J18m0j6j32n5L04j51j03L87j90m2K02j1m7j05j81M29k54M5mk50J11r5j29
3621b75m5J88L7L75K4l37J8N3P1J77k63j83J16kK05l33k59M99k8m9j35K26m58
3644c78J64K92p4J72k63J60j4K20k78J67m3j52K7J15j57J58R7m27L89j46nj00
3666g6J44R7j47K81j71k2O8r2J16k23R0J74m08j6J04q1K57j88l3M5R3m26K92L23
3690B01j76O1J44j76K39q6n44M42j29j08L8K8J7l49l5J47M41k11p6q9Q5L68j16
3713A16n9j63J54r7j51J44L60m06j46M09l75J26O5o8K44j06k93L30R0k05L09p5
3735B03q7k27J72q8j07p1K44k31j09L02j55M20k45k3j74j23K46J58n1o5L12k91
3757A0N7J36k68J04k30K60q1K37j84o9rJ48j62L08k28J46m46N64k12m6L6j3j77
$$ y = [-66, 52, 12, -4, -136, -191, 113, -38, -141, 246, 56, 14, 216, 205, 158, 53, -128, 301, 47, 92, 88, -162, -51, -146, -275, -320, -132, -95, 280, 304, -33, -15, 38, 109, 286, 23, -160, -44, -46, 159, -174, -433, 66, 38, -11, -146, 80, -378, -214, 78, 4, 176, -87, 73, 59, 279, 1, 168, 125, -27, 0, 115, -42, 116, 213, -214, 175, 29, 24, -76, 68, 165, 18, 299, 128, 106, 174, 82, 198, -25, 65, 239, -169, -185, -81, -162, 95, -93, -126, -81, 12, -414, -122, 201, 25, 86, 230, 54, 293, 207, -337, 105, -24, -132, -94, -66, -49, -398, -433, -286, 155, -56, -132, -221, -136, 232, 116, 57, -106, 48, -49, -200, -56, 304, -102, -248, 161, -214, -88, -23, -91, 153, 47, -246, 84, 174, -31, 278, 203, 116, -111, 61, -27, -134, -205, 39, -192, -301, 1, -154, 266, 21, -2, -176, -299, -53, 105, 54, -11, 301, 10, 67, 203, -65, 39, -191, 69, -12, 225, 41, -28, -37, 111, -51, 257, 29, 175, -271, 293, 81, 35, 71, 58, -119]
3780a19j3K42l48K76j50J6Q4N3j54j7Q7J15j51K83j71k5K11k26J16k53N7Q1l7
3803d3k11K83k28L88j86j7J29j34L3K23j64k03r8M26j30K8l5j84J66k4k83J59
3825a05K35k79j53K62J2J43j17J80j12K87j42k93n5ll4K72m91J8K83M4k61Q5K18
3848fk41J76J88j10k61K05j3L4j76J80J54L1k17k8L6j71K43N7j26P6j18Q3K16
3871B12o8K1o5O9j24O3M9M6j43k21J35k5l7r5rJ59J3j75K23K6OP1R7j16o2k9k
3898A9O5l8J4j3j29l9J90M3J26j06k82N41j64k11J49p6k60M86k77O4K2l39O2Q9
3922f4N6l18n2N72k71N1k45L62j23J01N1k80K39j42L96m23J04j65m5K0J93J43
3944A60l1k7m2j67K55l60L7J30L7K11r7j51Q1J55k79J39o3L6k60L8N0J85j21j22
$$ y = [-119, -132, 110, -238, 38, -112, -96, -12, 41, -113, -130, -43, 72, -79, 204, 33, 8, 219, -7, 109, -144, -87, -6, -43, -254, 29, -199, 189, 3, -14, 115, -19, 14, 237, 73, -130, -228, 198, 68, 96, 61, -123, 43, 19, -264, -105, 130, -149, -302, -40, -28, 115, -2, 178, 66, 353, 211, -82, -137, -140, -174, 98, -393, -375, -92, -48, -309, -224, -6, -247, -71, 117, 7, -254, -49, -62, -28, -204, -24, 130, 161, -56, -84, -48, -219, 24, 81, -45, 31, -87, -4, 212, 144, 165, 100, 169, 45, 108, 157, 203, 60, -161, -26, -51, -88, -183, -192, -33, -20, -195, 28, 54, 60, 131, 228, 112, 50, 21, 19, 84, 46, 60, 47, -82, -121, 69, 112, 238, 132, -150, 391, 227, 16, 165, 89, -171, 315, 38, 102, 124, -215, -153, -64, -8, -326, -378, 194, -77, -26, -271, 91, -32, 69, 120, -160, 79, -63, 333, -90, 14, -151, -196, -176, 17, 160, 129, 102, 60, -107, 148, -212, -175, -45, -8, 203, 106, -45, 36, 191, -88, 51, -12, 24, -236, -198, -148, 37, -84, -206]
3968b06J42Q2O5j37lk08N84l73j06m8J85k78P3L80K7r3k34k01J47K22j86J05J92
3991A31k05K93j40J78j65O9n2j4J3l50K00k54J50j46K49j10j3J61J02L4q8J20
4013A63l3j36K46k30j75k4J12m1K69o6J28k38M8J12k25M5o4J99l23K21J21j06
4035CK90l81K72l89M78k26k10K24j01k8J57l13m0J99j84N49k77j31J38nJ3J74
4057B12k62R2k38n4J05O3K78j61j90Kj00J75O1j45L69j66q6r1rL51k98J24Kq3
4081d9K34j37l3k44L63m46L61P9l55J03L5NJ97K03j17l28K76j04j00J76j9j4j74
4104h8L93n82L87k8j52J78j82L6nj29K19mj49m8K81k63K2j33K10k20L57k39l6
4127a75O9k90K86Q1J83k92K44n2J21j17l4K86k8l67N0J57k54QL04j81m1j03J9
$$ y = [-206, -64, 18, 83, -54, -57, -265, 319, -54, -160, -208, -23, -301, -228, 152, 179, 86, -148, -349, -202, 20, -166, -61, 131, -74, 219, 79, 257, 92, 161, 109, 95, 108, -242, -42, -296, -146, -292, -43, -153, -166, -5, 97, 131, 43, 163, 130, -6, 240, 10, -165, -189, -77, -118, 151, 85, 213, -25, 23, 135, -90, -45, -109, 90, -233, -12, 109, 3, 293, -88, 184, -205, 273, 47, -163, 61, -40, -68, 89, -224, -264, -65, -249, 300, 23, -108, 30, 25, 38, 212, -50, 42, -196, -250, -145, -82, 196, 35, -155, -153, -253, -78, -17, -162, 207, 41, -45, -136, -145, 206, -92, 32, 34, -49, 185, 48, 15, -229, 134, -312, 49, 128, -227, -124, -89, -84, 113, 316, 199, -129, 147, 43, -57, 119, 100, 86, -88, 305, -277, 110, 82, -70, 108, -74, -38, -43, -172, 47, 43, -106, -154, 127, -136, -114, -247, -37, -257, 100, -139, -175, -106, -396, -110, -29, 154, -138, 106, 54, 175, 58, 24, 310, 282, -85, -35, 122, -132, -124, 180, -1, -42, -145, -126]
4150a26m7K82j20L04k63N3J00j67J06Q9n6j15j30K20j21m4j8M8j47nK27k58J51
4173c7k16K52j72J17J06J57k02j3K61j73J71j52k06K0j6KK83l91K94J5j16J36
4195A20k2k89K03J56m25M24o1k08K80j34j14l2J10k88J87j65K40L03j84m3J49
4216B07k0n0j15J31j30j5J4j30J45j46k4r0K55j51K40M6q4k68P6R5Q5m9k9J94
4240A87k51L21k49M5q1o3j39L65l58R6p8M87k83K98j04J53l89K26l84J55J33j09
4262b2k62L41k08L18l38J63Q0k31k3J36J27l0j99M85k32P4j1k53K01J38j31J17
4284B40p5l78J84j39J77k73L31j58J31k2j70j8K96k14J94N3j82J14j12J7n3l9
4306i6K35l52j08N37l62K03j10Q7l78K82K32p2j49J16J2M9j80m7K13k63K2J76
$$ y = [-126, -173, 109, -11, 293, 30, 83, 183, 16, 122, 211, 155, 40, -90, 130, 9, -35, -53, -5, -152, -157, 70, -188, -37, -253, -1, -173, -56, 50, 207, 5, -8, 253, 80, 251, 99, -107, -87, -103, -101, 182, -209, 85, 100, -16, 120, 98, -191, 12, 168, -257, 167, 106, -102, 178, 44, -70, -102, 8, -280, -93, -258, -18, 285, 101, 58, 207, 187, 137, 22, 153, 23, 8, 22, -108, 37, -109, -133, -223, 32, -119, 121, 167, 83, -185, -109, -14, 71, 22, -7, 187, -64, 257, 8, 53, -28, -91, -230, 135, -223, -127, -205, 282, -1, 297, 193, 346, -43, 183, -201, -46, 87, -22, -284, 57, -151, 167, -171, -8, 72, -159, -182, -46, 81, 51, -148, 337, 105, 179, 168, -85, 116, 254, 123, 240, 165, -213, -29, -168, 9, -264, 67, -91, 40, 18, -152, -170, 126, -88, 106, 159, -23, 91, -21, -4, -57, -96, 139, -213, -321, 216, -146, 57, -53, 34, -344, -62, 170, 98, -51, 65, 77, 126, -54, -101, 112, -151, -129, 47]
4328D7qq9J41l66J78J15j08J74J2o1J88k38MP3k1j33K8Pj56J4M5q0L57k21O6J04
4354G2k42J90L17l07%R0o6Pn7p2j99K12N6j2O7j46k86N04nj88r5J29jr4K62q5
4380E1J32%j51p9J09j09j05J57j11k8K39q8lnj12l1NJ11m4K02L7k83Q3j15J04
4405c4kL66m69M50k39k7j65j79J01K46r0J96k19j44K28J25r6L2O7k02R7k21K74
4428I5k75j9L5j44K80j1m3K6J51l46K60lj5J14j23J06k07Q5j13R7k0oq1q3J34
4453a06K0l3K41j31Q0q0j04kK45j51L3k81M59j29l1J64ok33m4L9LJ9N8j07J54
4478G7r5J37l02L22P6m62K38l9o2q7M8J31r7K61l0K2l30n4K72K46q9m44O01k35
4502A05k02K79k42k16J34k5J36n9Q2j6J04j89K5J10L8k21K32P8J2k29O0m0j7N4
$$ y = [47, 39, -50, 91, -275, -97, 18, -90, 84, 96, 35, 223, -15, -11, 62, 41, -92, -64, -57, -213, -199, -154, -234, 123, -98, -32, 72, -170, 20, 337, 30, 30, 120, 54, 61, 4, -68, -267, -55, 1, -11, 56, -90, -376, 128, 123, -65, -160, -31, -32, -126, 136, 51, 183, 183, 32, -47, 62, -47, -152, 5, -106, -134, 105, 17, 14, 9, -103, -134, -129, -18, -62, 140, 177, -106, -23, -138, -34, -36, 330, -139, 311, 72, 45, -120, -299, -198, 48, -42, 154, -65, -209, 19, 144, 48, 80, 147, -55, 42, -179, 95, -180, -199, -164, -308, -28, -39, -82, -56, 95, -251, 9, 6, -9, 105, -18, 88, -119, -34, -147, -50, -70, -76, -157, -240, -106, -86, -119, 122, -9, 71, -9, -113, -115, 130, -21, 12, -269, 190, 61, 30, 194, 188, -45, -89, -50, -47, -28, 30, -77, 77, -18, 119, -183, 139, 215, -247, -9, -48, -110, -197, -149, -18, -115, 146, 116, 138, -192, -246, 26, 272, 183, -261, 340, 105, -97, 182, -60, -276, -142, -167, -31, -90, -8, -24, 80, -109, -84, 26, 64, -157, 75, 153, 165, -64, -4, -44, -61, -7]
4526gj3k8j87p3M71p8k47Ol3j96N17O5k36N3k31Q1J99M8m4J06j54l7r9l56K11
4551b62j7J32J28J6j22m8j40M49r2K32j88r5j59K20J72l76J15o5R9q8J99p7l46
4574c13J70K28Lj41O2k4J38J52k65J1M3j28J70o4L9r4R7L7j19j23R7J16r7J96
4598A91j35j23j42L02k48L15l07K2oP9K36l73Q8o1L31o9l0j93J23K00k74O3j56
4621a67j7MO2K07l49N52k12m6j52J09J17k34J57J01j35j47J28N5j04K00j27L73
4643C75k38j91L10n88L45j32J74k07J15K6K0M5L2j51J35J17J25m96J98L70l77
4664GJ90j02j73K12j60j82J77J35j46N6q3o0J23k18L08m9M2O5j77J51j73J94N7
4687A94k14K02k39l2O3lR1k49J22j2j34N7P8J18M5N3K7l0k10K29m41L40R4K8j63
$$ y = [-7, -20, -48, -235, -308, 163, 85, -162, -156, -189, -385, 132, 197, -39, 14, -217, -136, 63, 111, 67, 173, 19, -18, -117, -473, -262, -279, -147, -19, -3, -125, -173, -313, 136, 44, 276, 88, -7, -166, 54, 226, -150, -35, -100, -1, -89, 110, 33, -313, -143, 85, 88, -53, 9, -15, 123, 275, 10, 21, 64, -64, 106, 42, 81, -13, 84, 121, 2, -121, -24, 92, -5, 191, 56, -67, -209, 93, -155, 160, -147, -125, -131, -52, 184, -189, -101, -162, 169, 100, 70, -123, 0, 200, -74, -11, -167, -184, -180, -118, 89, -260, 292, 80, 34, -118, -9, 108, -126, 31, 132, -3, -150, -22, 33, -71, 129, 2, 375, 137, -54, 256, -332, 13, -119, 55, -152, -37, -11, 9, 54, 86, -65, 70, 187, 312, -184, 14, 384, 7, 197, 95, -78, 134, -26, -208, -31, 104, -42, 14, -69, -129, -6, -224, 84, 35, 77, 142, -35, 116, -57, 137, 194, -20, 182, -57, -89, -26, -29, 62, -187, -65, -77, -211, -154, -76, 42, 87, 140, 167, 137, -73, 156, -285, 55, 149, 177, 14]
4712A4q9N1r0O4J95j06j07J8J83J03j37o6J27j57j17K46l31J60J79l56j31O5Q2
4735b00J01J65j24k17M35k49p0J92P2J53l42Q2J70p9l26J28J38n5RN2l23K36O0
4758HK84k54j20l4K18k03L69j89p0R2Lj23O9J9k79k5Q5J67R5l72J13R7p4M66l54
4783a2J3Kj69K99j13K77m52K34l3j24j37J73l1J74k04j02N18n20Q9M5J21J03M6
4806A97l10J17J50j70j34K7J11J1p6K94l38J63j14J73l32L33k6N9l6n18K60L66
4828B07n0J4p5j77O9L49m44K0r7J71m8K3N1M1m8O3J65l87K96k7m8K8o2k19M19
4853B34j51j15m8J62k60J39j17K0q6K77N1j44J03R8l29P0K6j56K28M1j04J06J32
4876A77k97M97l51q8lJ21P1J07j79J03m2l8M6j67p4p0K09l04J90K6J64n6r4l3
$$ y = [14, -75, -24, -114, -50, 145, 39, -68, -50, 133, 236, 99, 33, 160, 3, -114, 132, -199, -39, 140, -216, -347, -282, -200, -99, 66, -58, -275, 160, -89, -159, 33, 105, 258, -84, -2, 168, 89, -237, -109, 29, -26, -17, 35, -288, -52, 8, 292, 38, -82, -116, 102, -101, 268, 79, 9, 101, 104, -19, 50, 69, -210, -235, -150, 17, 112, -260, -147, -50, -124, 342, -12, 1, 3, -166, 133, 20, 297, -155, 79, 46, -78, -215, -42, -73, 101, -103, -205, 313, -207, -118, -73, 48, 151, 197, -113, 4, 154, -16, -150, -123, -12, -1, -77, 217, -121, 42, -72, 101, -231, 102, 76, 135, 99, -419, -159, 207, 157, 171, 96, -81, -12, 337, -107, -87, -184, -13, -61, -38, 13, 54, 6, 69, 234, -153, 143, 116, 68, 96, 34, -185, 234, 83, -32, -80, 82, -178, -39, -156, -136, -222, 55, 106, -38, 65, 163, -166, -96, -70, -226, 2, 43, -61, 45, 177, -120, 377, 26, -62, -65, 56, 127, 234, 55, 158, 116, 78, 124, -43, -117, -187, 22, -282, -92, -66, 98, 42, -52, -85]
4900h5j86L16L7j86m7L07m43L21P3J36j84j18l0k21J79j00J81j06J73j6j50K51
4922A02k74m9J59J24j6K35l58q7K10J39l5q8j74J26j23o0J11N4j62K28N9j56J6
4945a9K80k13O6k21M02l2k59k49K69o7j05OJ02K29o07J74L09j4k29L56j97nl7
4968f1K22j61j23j0Q3M5j97L91m45J61j01M77l78J43j21J27m8j96M91k36m8KJ56
4991A73j23j10j27k1K12K88l25k68K86K22k26j94K26j44J56J11M6k9N0k89k43
5012c29K55j89L45O8j3k38K52j29J08j19j62j00K65p4JO6J86k27q0P1J36j52j13
5035a72K1L28k97J26J42k01L1R6J15k31K32J87m25O4L8k62n8K55k5J27k1j41M7
5058b4M2j01N4K3J21J74l21j32J55R7j09k5j67J60rk20K93k37M82N0k37M4R2k21
$$ y = [-85, -271, 45, 82, -104, -151, 156, -287, 34, 107, 243, 59, -59, -89, -310, -131, -231, -50, -156, 17, 1, -149, 102, -172, -221, -62, 62, 46, 281, -77, -164, 46, 185, 150, 62, -112, 14, -109, -169, -58, -4, -166, 62, 121, -35, -19, 261, 48, 114, -107, 295, 263, 4, -245, 24, -43, -148, -142, -40, 189, -418, -244, 65, 51, -178, 178, -19, -24, -61, 161, 0, -123, -133, -50, -5, -202, 189, -256, -95, -196, 281, -97, 46, -75, 52, 4, -192, 299, 63, 15, 17, 173, 50, -60, -187, -208, 4, 292, -33, -301, -15, 207, -19, -213, 13, -131, 25, 136, 182, 153, 203, -86, -329, -74, -263, 82, 150, 137, -101, 151, 22, 130, 11, -151, -251, 14, -60, -59, 7, 193, -34, -114, -43, 93, -59, -172, -151, 177, -120, 6, 148, -53, -22, 74, 189, -42, 190, 377, -48, 16, 54, -208, -266, -11, -36, 91, 70, -71, -24, 18, -83, -29, -6, 115, 289, -32, -164, -9, 88, -21, -46, -213, -53, -62, -282, 11, -226, 256, 306, 69, 113, 205, -16]
5082a6l28J96N18n10k6J46M6j66J76q6J59l39K21N9j5K9k49L08j53k55J59J28
5104BQ8k13R0j8J54K9k6J26k27k08J9K94j04l8j98K76j06k6J06k7j11L48j52L3
5128A11P8l20j12Q6J69J22j21k7R9R0k18j14K86k06Q7K39k17M3k71L80J49l16
5150A7j95NJ98r2P9P4l71K27J34k96K05J0K37j32n5Rl16K85k25L94N8r2k13j4
5174f9k18L34j37j67M54m51K66j88L5K48q0p3J16J28k23J21n2J8L6k11J50O2o44
5197e45O84r9r6K83k44j89L14k40K28mj60K46j60J35l97M16k65R7j10P0P5k65
5219b26J72R1k38J07L09M8m72J07K83j61K11l22K65l50n1M2K25j07l8J58L36m49
5241f0K69n1l00J80J26j77J18q7k45L04o4J72j73kk2J4k0R8k82m2J90M4j08J06
$$ y = [-16, -344, -148, 370, -140, -166, -20, 26, -140, 36, -50, 109, -230, -9, 50, 35, 64, -185, 123, -30, -285, -126, 2, 90, -123, -33, -51, 103, 132, 106, 232, 5, -203, -184, 110, 6, -32, -230, 46, -60, -86, 20, -7, -118, 230, 78, 111, 189, -131, -243, -157, 12, 134, 13, -14, 85, 175, -43, -157, 129, -77, 10, 249, 32, 75, -196, 184, 333, 17, -178, -173, 25, -67, 12, 86, -285, -58, 76, -220, -15, -5, 232, 100, 45, 54, -262, 23, -202, 192, 250, 158, -55, -69, -287, 47, -90, -257, 197, -254, 12, -176, -141, 107, 27, -46, 70, 198, -25, 96, 44, 62, 98, -113, 37, 99, -545, 139, 40, -56, 227, -17, -206, 108, -132, 96, 92, -68, 178, 18, 153, -244, 172, -93, 4, -106, -36, 39, -226, -54, 37, -201, -94, 215, 263, -209, -102, 181, 20, 231, -91, 174, -176, -227, -185, 40, -67, -105, 53, 389, -60, 209, 158, -142, 38, 164, -13, 105, 18, -227, 77, 13, 185, 12, 10, -12, 2, -18, 80, -202, -244, -54, -10, -118, -12]
5265a2J38r6k2k87L32J12m38j45O24m53N1J58N7o9k54L62l18K89j18J01K02j84
5287C0ON0K40k51l47L99O1j67P2P1j89k7O9m1k15J54P7k5L5N6k04J56K67k74J
5312DM9J98k84Q1j22j59J27oL13m95L14n3j58J96j04K73l37l0L34l97P3K94k77
5335a66mp9L77r1j92M2r5N10m05K00J15k02j31K46J16j75j76J20j29J50k2j36
5357a27qO6k10K47j51j18J83J32j06j17J64j24J29J00j82R2m3J60q4k39m9K94
5379Ir9J08o1j76K92p2J2J03k70J69J75l30L8J08J29j51J44l3l0Q8j40R8j23K7
5403A5K27k17q8j15P8J41l30J03J32M3k73J73L2Q6oOJ43k49Nj46K19j19K72k33
5427a01j54K47KK66k27k6Q7o1j15L63l07QJ77j31o2J59k36p4K28K0mj28L3o4k6
$$ y = [-12, 126, 30, 8, -279, 53, 165, -273, -418, 206, -247, -196, -38, 19, -50, -304, 58, -260, 29, -89, 12, 214, 30, 36, 86, 326, 75, -272, 127, 188, 21, 93, 164, -25, -52, 17, -24, -239, -85, -8, -33, 2, 58, -146, 10, 277, 3, 4, 53, 251, -33, 48, -74, -233, -106, -112, 201, -294, 20, -33, -191, 5, -99, 174, -163, -193, 141, -256, -183, 111, -166, -170, -249, 128, 37, -155, -113, -208, 302, -103, 97, 212, 10, -121, 125, 241, 66, -110, 10, -119, 31, 9, -127, -135, -69, -279, -32, -183, -301, -118, 14, -92, -209, -45, -169, -40, 60, -122, -30, -73, 87, 3, -236, -285, 9, -90, 18, -43, -219, 73, 1, 13, 116, -154, 15, 190, -140, -102, 6, 135, -16, 128, 95, 65, 153, 13, 111, -12, 15, 242, 25, -63, -178, -100, 41, -289, -186, -54, -11, -284, -111, -79, 7, 1, 7, 150, -99, -94, -240, -21, -140, 132, -101, -255, -8, -6, 260, 33, 7, 94, 33, -82, 281, -26, -18, 159, 28, -34, 125, -111, -185, 43, 63, 59, -69, -36, -100, -126]
5452a26J23J34j83K78q5o4k60L26l7p1K33l58j28LK94P0J45l76j5LK89l93K24
5475B6j88J88j30N6J69n2J59j35j62k04K01p8K91J3k63L21j76r2r0M49k93k29
5497b19J01L3K24l83K20J12l91J26M18j06j12J22N0k32J29j89M9K28J25o9l48
5518a12O1J24j32K04m7j66J1K45l35J84L33l50j00l7J59J82l07n1R8K03m12L73
5540A28j05J32j74l2l32L14J69o5L06q0j00j57J8k39J94j16J29J61j30J62j94
5561a1Rk17L3J06K23j27Kk6L1J07j61J04J1oj71O8J68q4r7L0m9j95K26J74l8j13
5587cQj95M56l96nR1k01J58J30j70j19N6K60k08K93l46p0N34O3j94k39K82l17
5610a32K61l67O02m10O5J56j83K24k28j01K08j20J28l17J58M9mn9q8K69k32J4
$$ y = [-126, -3, 131, -52, 226, 141, 77, -183, 143, 106, 35, 268, -90, -218, -215, 79, 149, 294, -82, -97, -94, 195, -198, 26, -162, 26, -104, -48, 121, 69, 228, 93, -69, -273, -72, -150, 141, 154, -109, 212, 36, -56, -146, 303, 10, -219, -118, -85, 139, -244, -24, 88, -303, -177, 241, 135, 23, 145, 195, -37, 92, -97, -48, 180, 305, 236, -112, -51, 73, -59, 145, 98, -68, -57, 188, -147, 37, 370, 20, -80, -117, 42, 224, -83, -134, -36, 167, -245, 128, 23, 155, -19, -51, -383, -69, 100, 35, 341, 261, 161, 4, 22, -217, -23, -139, -10, 151, 21, 183, -11, -2, -219, -186, -80, 143, 16, 18, -8, 23, 130, -31, 73, 84, 78, -93, -25, 143, 59, -38, -8, -57, -252, -26, 148, 110, -3, 5, -190, 266, -130, -135, -44, -245, -87, 43, -127, -246, -190, 70, -138, 155, -191, -261, 273, 336, 142, -97, 185, -132, 129, -238, 364, -46, 19, 175, -8, 216, -12, -113, 95, -25, 103, -214, -56, -7, -11, -70, -158, 111, -121, -107]
5632a07R1q2J84R5m83K63N1J0r2J31K7k89J69P4n5O4KL8q6j77K85j01J91k57j6
5657g0l9JK37o9Q0P1l39L9m4K30r1k0%q5L25m20J33J39O0j58r0J51o8K8M2N3j02
5684fj69P8R0j78K79K36l23j7L7q9j32M03m32J09QJ94r8J0R0j70r8J98p6j03m7
5709b06K30R0K16n24K66j96J50J08j09J62m35M39k64L1N1J18J93m73M9L67l17
5730e4J18j54J78k4j25J12K23m47l6Q2K78n4j4j23j45q7K51J34j72k4J8k08M18
5753A45k62J88j21J26K2m5N7j31J97m3j02k54K29l1j37L35n3j0j84J76J68j67
5775A03J62l13J04J10j01J18l87L76j34r1n7K36k84mJ73J8j0j75J91j16K67l97
5797b11J53j33K32l89L84Q3k4j85J40k6k4k42L7K44r8n3K82j50p9K58L0j06j71
$$ y = [-107, -16, -98, 86, 181, -302, -39, 12, 22, -70, 61, 88, -201, -32, 42, -13, 51, 53, 91, 5, -172, 113, 12, 203, -54, -70, -109, -108, 129, 60, 140, 211, -128, -89, -133, 97, 6, -14, -14, -99, 226, -194, -61, 78, 138, -20, -110, 41, -27, 1, 43, 96, -6, -175, -97, -7, -185, 94, 330, 7, -10, 27, -62, -194, 209, -223, -114, -106, 88, -10, 0, 90, -80, -178, 20, -56, -159, -206, 24, 114, 330, -194, 72, -124, 26, 134, 25, 187, -248, 191, -73, -42, 9, 127, 320, -153, -104, 263, -54, 64, -90, 88, 64, -61, 51, 274, -173, -209, -127, 151, 97, 83, -40, -185, -272, -21, 113, -59, -83, -65, -273, 145, -117, 71, -50, 76, 98, 53, 110, -21, 176, 133, 31, -223, 6, -25, -162, 173, 120, 110, -74, 102, 270, 103, 265, -48, 56, 166, 65, 183, -204, 172, 38, -53, -110, 126, -158, -162, 11, 29, 19, -156, 35, -81, 186, -211, -58, -191, 41, -348, 36, 119, 95, -90, 50, 24, 0, -242, -205, 39, -59, -112, 170, 20, -59, 199, 229, 123, -48]
5820d8K01p1R8Kj70J12l42L37k38l5P4k4L73l38R8j03J97l66J96J02n7j12K10
5843I6j17P4l5L14l62J29J5n6j23Q7NQ4k14p5K34j85J30k69K22J9J59K4m13O9
5867a88J6Q9J7N3P9o5j46K50k99J69J0q2K07k20K57m34O34k41j67J24p0j20L00
5890A73n16L70L40j42p7Q2p9j8k39k4K9N25p84J69R8J46j01J96k14L2k8L5K10
5913A83j92p1k7L51l31K52k84R7Q6Q7J57l08p5J83k08K17j20j02Q9M2O7O9j44
5936A8l5N7p2j97K39J74Lk71Q7J84q3o1j29O6J10%m9J75k94K85j49k5l6j02j97
5961c02L13K9r8J86k28L11k33K04k54r1k07M55k25mJ63K06j8j99N8J59l36R8J38
5984A25j38j66N4P9kO6m6K46q8k28J88j78J54k10J99j03l03L91l3J99n57K82P0
$$ y = [-48, 153, 82, 180, 182, 12, 124, -218, 119, -119, -154, -80, -104, 269, -69, 29, -74, 123, -243, -47, 55, -2, -114, 96, -21, 53, 18, 332, -30, 99, 114, 58, -65, 22, 27, 111, -103, -178, 56, -129, 1, -268, -46, -27, 132, 156, -257, -188, -172, -83, -66, -13, 66, 1, -145, 105, -194, -25, -15, -97, 110, -110, 147, -287, 347, 106, -61, 63, -7, -127, 173, -343, 27, 367, 225, 148, 230, 151, 133, -106, -130, -101, 424, -360, -191, -93, 53, -48, 148, -66, -34, -62, -27, 183, -9, -80, -107, 244, -87, 165, -119, -22, 64, 151, 308, 0, -75, 108, -100, 117, -3, -105, -16, 26, 93, 162, 18, -17, 40, -32, -229, 10, 184, 187, -84, 3, 187, 104, 43, -86, -20, 90, 90, 41, 216, -78, 207, 58, 33, -3, -105, -302, 11, 40, -58, 128, -100, 211, -22, 182, -72, -163, -370, 85, -140, -144, 19, 225, 207, 8, 66, 225, -111, -13, 125, -13, -179, -125, -46, -48, 18, -28, 218, 130, -98, 90, -88, 66, -144, 55, -48, -351, 40, 7, 206, -351, -69, 1]
6007AJ72j57J24J66k88pK86k75j64L83l00j41K91j1R5q0k55J83j07J88n23N74
6029A55l6L0k21j47L57m7L0o6K11j92kj49p6K43M9j77j55J94k75N47l55K43m78
6052c17R7JK90j01P6j25K41k15J33R0k29J5j30K17L1J7J43l90J65N3k55J16q2
6075a59L56k8j05O7K8k46J04J36k76MK15j49K97l65K7K54k19J74r4J92j9j42k24
6098a72N45o1n01J79l6PO4r2K31j89O4k7K6j3J37k62k9L05l33n8L71l91K97o7
6122eJ39nk6k28L12l19M4P8K28o9n3p7O7j65J90J08l0j91O0l25K00O3J03j75J83
6147A07P7k83K26Q2J9p0n8j61J9Q4j83M91j43l32K57j28r1J38J4J27m95K53j60
6170b10J05N2o3J73k18L49j70J70j02O2m5q0o3J04J8k31LK16N7Q6j85Q3J3j8k40
$$ y = [1, 173, 16, 140, 306, 18, 11, 297, 22, -142, 241, -59, -200, 91, 80, 175, 95, -160, 23, -84, 104, -419, 155, 119, 149, -72, -219, 138, 91, 121, 55, 266, 74, 72, -77, -153, 90, 139, -38, -193, 1, -274, 273, -82, 161, -317, -220, -219, 71, -30, 46, -79, 162, -53, 80, 170, -59, -44, -174, 43, 74, 91, 234, -156, 9, 62, -193, -77, -159, 197, 169, 64, 131, 159, -87, 17, 153, -123, -119, 96, -53, 244, -121, -94, 160, -59, 115, 21, 213, 194, 52, -172, 373, 312, -189, -10, -46, -39, 25, -67, 164, -25, 39, 12, 38, 25, 162, -100, -129, 176, -157, -215, 156, -235, 62, -5, 134, 129, 103, -125, 187, -132, -88, -10, 218, 149, 96, 19, 86, -79, 111, 219, 189, -2, 58, -267, -67, -4, 99, -76, 107, 184, -99, 127, 209, 228, 158, 100, -61, -42, 42, -141, 350, 207, -125, 132, 4, -87, 51, 65, 192, -303, -50, -210, -105, -53, -116, 57, -161, 188, 18, 188, 86, 148, 103, 23, -40, 64, 82, -149, -146, 70, 127, 213, 28, 111, 124, 106, -134]
6195a34K89k51N07m14J47k96K25m6j38Q3Q2l03O11k10j59M87n61l5K59k7k60J37
6217gJ73N1j35r8K5J41k95L01m76O2K44K84l34R2M2m6K6P9M9j00n5J32j63L8K52
6242B82j12n3m37M68p2O7n13J83N2M1j84J33r4K20K00p4j74J02M9J16m3nR2k73
6266b9K4K09q5j36M03m88K07j50J7j07j9L35k51P0J34r9J14p3l6m8O1r9Q3p1P5
6291D1Kj34K28k34j4J54k69K95j46J68m1j15L4kJ86k17n9K28m1r3J25l14J63m1
6315i6q4N04l72K98k26n2J69k34K05j38K03j08j31J67l29L38k25l9J37j09J46
6336B4J48N3l66K18J34n1nJ82l29j70M2J08L5n3K72j52J20l7m98K54N8J74j63
6359bK28m74K97J92j86Jk79N5O5N1M0r3L06k16l30M20j9p3j63J33K59q7o7q4K10
$$ y = [-134, 155, -96, 411, -3, 144, -152, 73, 27, -111, -28, 54, -249, 362, 152, -7, 480, -81, -116, 143, 116, -144, -7, 166, 217, 82, -16, 9, 150, -145, 156, -320, -258, -14, 270, -64, 28, 70, 24, 50, 129, 178, 78, 23, 155, -8, 30, 282, 170, 117, -320, 148, 76, 143, -370, -187, -135, -94, -278, -145, -239, -19, 181, 107, -67, 35, 84, 200, 157, 152, 244, -29, -5, 204, 119, -17, 386, -102, 105, -45, -28, -135, -154, 181, -70, 0, 134, 35, 149, 76, 40, -8, 53, -46, 37, -34, 41, 43, -91, 137, -97, -111, 43, -226, 69, -77, 91, 50, -65, -31, -33, 153, -64, -123, 105, 64, -29, 96, -218, -55, -96, -180, 324, -48, 250, 24, -28, 141, -93, 112, -26, 177, 69, -62, 105, -224, 114, -111, -150, -13, -122, 24, 172, 225, -141, 77, 211, 160, 155, 337, 8, -162, -120, -12, 23, -30, 242, 90, 210, 173, -325, -71, -13, 161, -2, 226, -248, 49, 241, 55, 56, -223, -168, -103, -52, -12, -105, 201, -15, -345, 75, 56, -17, -180, -47, 212, 125, 58, -26, 184]
6384A84k40O8q1J57k14N2J75R0k0n0j89J06j74J98q7L55m08L7K26k18K16k45l
6407f5j67K78J15l28L21j97O2p4q5L2j54J1L61N8j16l38J79O6j59J71K05k83K6
6430h1L59m07J40j09O4L55l23k81L35Kj55Q9K82k90M5O1p6m0P9l6j72J19L0J0
6454@j09K29oj16k7L8q6k24o9L96J27j22J92l64k6j21L59J9q2n3J86k11p6L46
6478B00k10J26r2M0O8j07K78k62M06l22k67J90P9k32k5K22k84l3K03n4qQ2QQ3
6502H9n8J46j66L8j43O4k81K04L5k90L24j3J90m08L22J5k86K50J43k44j47J15
6524a01J61l03L12J3j34M2o0J75M3r8J16q4p8m4j8J12j07K7j28J35q0L36k22q6
6548g1L11o24N34j1k86L14m78L31J7O9r6p4M1j42K50N1o1k93K16J12J13k34J93
$$ y = [184, -56, 12, -69, 88, -126, -74, 101, 191, 171, 121, -68, 38, -136, 62, -25, 330, -78, -41, 185, -33, 183, -62, -65, -232, 46, 161, -167, 154, -43, 19, -55, -140, -108, -262, -251, 110, 168, 52, -286, -107, -41, -200, -29, 176, -107, -81, 278, -129, 11, -98, -34, 321, -2, -283, 52, 54, -101, -12, 270, -20, 25, 86, 10, -30, 49, 13, -159, -40, -10, 0, -109, 120, 114, -2, -29, 9, -77, -301, -370, 26, 153, 31, 223, -141, -167, -288, 71, 90, 8, -45, 141, -70, -146, 200, -10, 116, 24, 64, 132, 25, 303, 41, 447, 125, -142, 48, 127, -105, -130, 92, -192, -225, -22, -76, -84, -2, 6, 89, 31, 177, 11, 49, -94, -30, -311, -107, -72, -362, -38, -51, 139, -269, 53, 68, -218, 32, 175, -69, -216, -101, 60, -243, 69, 82, -52, -10, -70, 105, 148, 50, 166, 82, 4, -40, -58, 54, -53, -26, -154, -19, -99, 237, 15, -71, 240, -384, 150, 139, -147, 167, -311, 20, 37, 106, 10, -64, -23, -165, 85, 136, 75, -218, -2, 110, 223, -11, 182]
6571A82m78M52n1l14M39m13O7O6O1R5k07P6n0K70j18J12k41j36L74M7l99k1J6
6594a71K53L7O7n4j50K5l5q4L70m42K45j82J94K3N9o4r0P7L7l0j34m6J08K46q4
6619A75k8k05J99o0n0J45k01j25J7M0J85k43J70q3j18K89j30KJ79j71j69L18j83
6642d7j75J52L4J13j08R9l5j74J25Q8R4n6j2J76k35m0M5k77K97K13k74K01l96
6665a92M25l47l3L95k01k3Q1j65J18j76j76L57m6j35L23m49K15n6K22m6o1K29
6687B59m01K79l3j59l8O0j89L4K06j98K85o8J37o6j84K6o1K28j94R6J10r7N8j89
6711i9k43L91L7n1k30K06l0K04l21J72J07O4m11K51jj85J25k31M11m3j59j02K99
6734A61j93L9Oj44L45k22J36k01J69j05J82m35K14P3J0J45m6l52K86j04j04J37
$$ y = [182, -296, 156, 105, -209, 230, -183, -116, -50, 11, 106, -101, -25, -75, 195, 77, 189, -52, -188, 186, 233, -166, -187, -171, 82, 119, 186, 132, -18, 7, -28, -112, 258, -184, 61, -121, 73, 96, 155, 91, 1, 78, 115, 85, -49, -95, 13, 259, 175, 147, -58, 141, 81, 31, 176, -25, -150, -133, -93, 92, -151, 19, -64, -182, 107, -23, -21, 158, -13, -182, 136, -47, -222, -70, -36, 77, -31, 68, 33, -141, -16, 72, 166, 110, 98, 274, 39, -1, 44, -233, 64, 277, 3, 204, -192, 233, -114, -147, 248, 47, 24, 105, -60, 58, -118, -294, 63, 17, -118, 205, -244, -29, -85, 137, 91, 30, 259, -142, 137, 104, -55, -93, -33, -222, -188, 18, -180, 105, 37, 174, 108, -76, -50, -111, 117, -77, 19, 129, 32, 90, -99, -342, 49, 86, 35, -195, 11, -19, 185, -136, 36, 143, 207, -204, 47, 46, -139, -14, -245, 166, 123, -36, -138, 161, -32, 7, 13, -131, 214, -8, 128, -73, 96, -9, 173, -262, -48, 25, 35, 180, 134, -218, 68, -36, -140, -3]
6756cJ10l32K45K20p8L3j83p7L56j2l94K84k86K62ln6j09l6J00l1q8k8L2L20j36
6781A10l7K19k52k33PK07j43L6K15l45M67k16j85O1J25j26M8j02J57q7j5K8r4
6804a55O4K18j5m6k06J81r7J54r5j87K47k4J65o2r0k05J37r3J88rJ68q2o4J68
6828B60j65j25r8J30oJ43j75l8M2j0r5J24n9j18K77K19l29jk6J44j39n5K44n0
6852I4K0J91k84q3Mk7J5K11p6O1r3K02l15P5n5o5K27J06p2J04J03m45j3l6N27
6877C76j37j84m07J40L45R1j37J05m79J53K76j6n9L3M4pJ03m09J16J25J0mQ3j84
6901b3m7K37r8K8LK53j06l24N2j88N03j01rk25J05j42K00l45J03j17L48j3o5q8
6925e9j20K92k47j12J2L68M5j45M0l59K54K0M5n6j76N14m84J02J20k34K13l9K14
$$ y = [-3, 107, -225, 20, 240, 162, 195, 12, -65, 291, 279, -115, 169, -117, 145, 142, 86, -23, -59, 41, 10, -78, -106, -74, 246, 110, 73, 292, 40, -193, -186, 21, -122, -86, 129, -216, 251, 35, -150, -89, 36, -90, -42, -144, 13, -74, -89, -61, -155, -91, 127, 112, 66, -140, 41, -56, 98, 3, -184, 63, 39, 204, 142, 52, -153, -16, -109, 79, 70, 238, 156, 92, 260, 95, -30, -128, 2, -4, 139, -36, -74, -32, -42, -137, -13, -72, -190, 87, 306, -23, -24, -50, 94, -45, -100, 144, 94, 114, 305, 21, -62, -58, -85, -70, 141, 65, 126, 33, 235, -80, -5, -60, -125, 102, 208, 136, 240, 343, -102, -115, -151, 376, 239, 55, -352, -212, 133, 224, 87, 192, -287, -134, 142, 126, 67, 100, 144, 137, 240, -169, -53, 72, 82, 78, 161, -23, -70, 167, 69, 97, 100, 353, 247, -77, -25, -213, 290, 189, 180, -45, 60, -82, 118, -227, -124, -241, 107, 94, 29, -59, -179, 113, -134, -246, -234, 134, 179, 34, 74, -285, -31, -11, 34, -22, -198, 316, -168, -66, 54, -180, 33, -6, 208]
6948B08k41J26J11j86j19k38N35j71r9L5j89J11J82k16K25k3n3l42K6L79j73P9
6970c3n7J45J9p3R5j26p1J81J20J46l96j45K90k48L40k15K9m0K82k71K05p2Q5
6993A90k06M3J51k71q5L30k0r7k15J30q8J55Q4J3n5Mk83L76l0k31K6K50n59K59
7017a29K33j88m4p4L79l88L18J93m88J36K4k66N05k09r4K56j02R8N1ok26J67j25
7040B1j47J6K7q9P6J61Op3K22k27K06K1k34O6k40JJ88K8K9j09o8n7K03j22K33
7065A38oRj05K28j46k42K38j63J1K17k3j54J62k09J13n8K5N4j3P5j88O0J32Pm45
7090b83M07m6j09j01M02l81rJ21j3J10k0J41k35J76j85p1Q4J06j48J27j68J26
7112C1L09k46l7m28M50j44J6l05M20ok00Q5J30j03l4L20o6k18O8J38l68J97K07
$$ y = [208, -33, 93, 204, 18, -101, -339, 196, 25, -74, -39, -228, -117, 65, -151, 74, 51, -2, -344, -318, 61, -112, -33, -90, 55, 74, 1, 96, -30, -101, 80, 200, 346, -50, -195, 95, -153, 187, -28, 1, -39, 243, -28, 177, 105, 190, -16, 27, 178, -93, -178, 152, 132, 35, -180, -50, -138, 17, 101, 114, 59, 63, -220, 156, 126, -105, -79, 171, -388, -129, 104, -84, -128, -202, 177, -211, 107, 300, -188, -52, -28, -294, 211, 2, -92, 164, 62, 160, 211, 205, -21, 146, 21, -126, -110, -83, -172, -96, 65, 71, -2, 220, -7, 199, 220, -14, 52, -188, -187, 1, 29, 58, -51, -119, -176, 27, -95, 138, 132, 141, 36, 264, 118, -124, 114, -49, -38, 179, 156, 2, 164, -45, 68, 10, 35, 89, 76, 151, -37, 23, 155, 162, -283, 124, 78, -31, -132, 270, -111, -120, 1, -12, 98, 78, 219, -16, 160, -25, -96, -12, 94, -54, 73, -95, 31, 340, 94, 57, -371, 79, -65, -49, -354, 66, 60, -140, -55, 75, -28, -62, 258, 192, -26, 42, 180, -188, 9, 216]
7135B16k35j00P9Q3J87k84q6N18j13l34L76m60J68N5o0n6q7M84m56L0j25K25j33
7158a08j08M5P8M5j36L07j10j71J76j42o0L19k79K54M5k70K82Nk6j89K38k30P5
7181D0M9j26J7J25k27M4k6R1n6J09j82J20J1P4j96L01j36L7J98l61M2j95K10L27
7205B90j22J13j30l56J14K8K41p8k18K47l10K43j49o3K27j1Ml04L96k79N8J9j05
7228a45J5L16M4j37p0JR4o2l8m3j81K24j47O2J6K67L6j79Nk45K06k30M9r7K40
7253AK24k23K5Q2k15J89R8l30N1K79r5l23K01L5j09L4j1K43j53J69k28j54L99
7276A89K6j40rk72L84q9JN2J4k44J22k4J46j63j76K06K67l9m41K95o9j05J42j37
7300f4lL6m4L64k47k37M52m13J05Q4N2Q6j06R1k67J70lj38K37r4L8j80K12k37
$$ y = [216, -19, -119, -40, 43, 230, -54, -140, 378, 265, -69, 307, -153, 15, 70, 10, -46, -133, 351, -105, -75, -200, 25, -108, -216, -171, -93, -48, -184, 123, 13, -158, 18, -124, -184, 135, -144, 110, 155, -115, 167, 172, 146, -43, 195, -35, 40, 89, -37, -20, 105, -122, -78, -104, -13, -69, 40, -142, -22, -11, 63, -133, 168, 32, 69, 267, -94, -52, -247, -37, 290, 168, 281, 151, -205, -91, -63, 178, 100, -118, 129, -181, 62, -87, -150, 77, 66, 70, -234, 162, -117, -59, -40, -145, -130, 186, 230, 93, 23, 24, 118, 56, 18, -25, -206, 18, -129, -67, -51, 216, 252, 73, 78, -167, 39, -191, -142, -239, 1, 225, 2, 27, 109, -106, 83, 181, -149, -98, 181, 86, -237, -36, -1, -110, -76, -87, 156, 3, 172, -56, -210, 189, 215, 75, 66, -206, 178, 89, 90, 142, 156, -88, 34, 10, 156, -7, -183, 23, 290, 251, -190, 105, 36, -69, 73, -64, -67, -31, -75, 289, 42, -195, 257, -156, -51, 33, 85, 171, 65, 156, -111, 59, 56, -82, 155, 61, 99, -81, 131, -106]
7324a06J35J2N0k0m8L7l3j38J38L6l04L10J37j4k58L04l50K6K2j11J78K34k43
7347fL60m21J19k71J30j33J54Q8M2L3j70L7j87M22o4j09J42k6k32j19L27k45L39
7370B10n10J67J51K49k91O9o4j0K9o5j7j55J18j8J36J9N3j59K04j03J21k40J53
7393D7j35L20m05NJ57J78k78J64j06j19j25K60R1j56P9m2L08l69L36j88R0k1k34
7416a43K2L17j84j56J42L6k09L27k30J10K3J7p5J49k8j90J20J5K07j19j76J58
7438A33k42r9M26l28K38m61J14QK74k0o0j04l8L56k50m1j58K26J77k81K77J2J99
7461C58l39k52L21l9j18r5K75l41L42l03K23K1p7J04k67K20j60M1K05jok52L71
7484B31j30L0l18J79N2j27K8K73j22k37P8K75j14j57o6J22l3J78j76P5k1R2jj04
$$ y = [-106, 29, 41, 91, 71, 23, 60, 27, -111, 27, 63, -241, 69, 206, 192, -66, 238, -112, -86, -64, -175, 3, 237, -6, 354, -67, 52, -219, -89, -222, -68, 20, 62, 95, -75, -38, -225, 197, 133, 24, 166, 140, -92, -211, 116, -129, 210, -300, -133, 18, 267, -24, 45, -19, -29, 0, -65, -82, -237, -119, -137, -1, 18, 71, -88, 116, 13, 134, -106, 47, -88, 232, -173, -168, -11, 167, -111, 53, -53, -172, -297, -37, 54, -102, -23, -65, 243, -126, 210, 22, 112, 91, -143, -121, 196, 12, -144, -2, 34, -175, 152, -78, 32, 55, 72, -3, 146, 118, -72, 48, 63, 270, 151, -25, 133, -109, -208, 218, -110, 128, -333, -219, -211, 63, 43, -17, -121, -159, 197, -53, -94, -252, -26, 151, -130, 147, 159, 358, 19, -233, 88, 49, -69, -164, 111, -230, 112, -191, 32, 53, -24, 80, -187, 33, -127, -86, 119, 118, 112, -140, 231, 101, 131, -187, -8, 44, -83, -55, 218, 96, -141, -63, 212, 98, -59, -125, -3, -36, 142, -34, 41, 20, 112, 111, 7]
7508GoJ8j3q3K51k65K36j89J1J95j7j17n1r4J17o1k5ol26M01L0J79l01K49k80
7533a40J67n2p1K03k39l9P9L6q0K04k12J23k9j54J37N43l95j42K98j70j96J36
7555Gj24K67l45L56l52j09R4M2R6k03J48Q7Q3P4j30L7K12p7n8j04j7n6K77m50
7579b45K88qM5j16K7l2P6j0J86l64J51l4l0K38j43N2m11L36m4K6J9M7j11K9j12
7604a40K48k46N3P6oM0K52m93N4J58P2k35O9K19P8m16J25JJ03J47j74q0q3M50
7628B72j50j06J23L6j85l0o5q1J53M0k15J93k9o4L85m88k5J54j73K48M7l31K27
7651f4k5L42j43k58K51j53j67J92j02J90j50J52N0Q2k68m1L80k47p7k06L24L9
7673A01P8m28J41M5j55M00k07R7l19m0K26K23K0l9l14L96l45K16l21j43M15%j20
$$ y = [7, 1, 19, 6, -77, 174, -91, 145, -44, -33, 162, 145, 28, -23, -117, 0, -61, -86, -92, -418, -17, 13, 192, -109, 140, -140, 27, -25, -96, 107, -132, -171, -92, -56, -136, 68, -144, -21, -50, -204, -67, 476, 81, -61, 237, 67, -129, 7, -117, 150, -195, 161, -191, -300, -206, -164, -68, -271, -123, -36, 47, 121, -9, 28, 240, 163, 105, 1, -16, -72, 205, -245, 43, 35, 80, -36, -9, -41, 35, 25, 211, -153, -2, -36, -66, 172, 29, 81, -330, 6, -38, -12, 7, 54, -57, -28, -140, 108, -138, -85, -9, -15, 25, 277, -216, -162, -4, 68, -167, -98, 121, 199, -217, -92, -91, 12, 159, -15, -95, -178, 272, 122, 16, 139, 175, -10, -40, -105, -186, -33, 7, -208, -15, -44, -108, 277, -211, -236, -82, -255, -7, 40, -291, -64, -89, 253, 110, -148, 103, -50, -217, -25, -127, 63, -87, 65, 115, 197, -71, -112, 268, 21, -56, -262, 62, 101, 179, -249, -108, -63, -218, 182, -25, 72, -247, -287, -61, 162, 182, 143, -171, 225, -120, 96, -225, -368, 47, 47, -73]
7696g3L3r1J3K40k72J06L84j65j97P9k37K28L7p6n6K89m50L05l37L62m3L1K91
7719D01n09L66m68K74k77L65Ol56k8L46l5M9k13Q7j7P4k51L66j50k90M71l93M06
7742B24l64J77J03K07n00J19j21j52L11kk1j00J39Q7l3j02N7N7k56J76M0q8J77
7765A35n8j17P6J09J95m26J14j49K0K81n30L07K38k16J54j3k66J10j09K09J9k04
7787a21K78J3p9m51N08k94K11m8J7Q4k60N9J74k79N68n32m2P9L3J33j54j37J33
7810a07J82j3n0J28j48Q9L3j35J97K6k36Q6K51l67L37n43K41J62j97j96K73K7
7832D0J7l95K48K94k78J5K11k37O4j2M3K13m5k9k88J23J40p9j91p0J47J6O8j98
7856a83J15j8J23J7o2J2j85K78j40K36j14n3k12L65l91J50n8J04Q7J38l23J18
$$ y = [-73, -40, -131, -118, 122, -150, -44, 340, 175, -22, 57, -180, 48, 85, 9, -47, 242, -208, 97, -240, 122, 79, 110, 401, -108, 258, -210, 64, -213, 152, 158, -198, -226, 120, 85, 134, -79, 8, -9, 65, -186, 180, 30, -260, 211, -182, 224, -140, 37, 140, 347, -153, -34, -155, -307, 4, 2, -19, -119, 20, 107, 74, -28, 29, 86, -170, 6, 46, -42, 135, 77, -40, 36, 145, 340, -86, 28, -121, -101, 180, -350, -43, 195, -21, 133, 120, -146, -36, -145, 64, 83, -121, 157, 170, 91, -360, 148, -146, 65, 17, 34, 118, -142, -83, 91, -188, 380, -152, -194, -115, -82, 51, -103, -240, -107, 75, 62, 12, 140, -8, 81, 114, -21, 176, 202, -34, 52, 303, -64, 273, -270, -29, 133, -64, -260, 13, 40, 57, -338, -90, 204, -74, -59, 152, -85, -21, -33, 10, 223, 178, 149, -139, -16, 124, 45, -146, -216, -69, -53, 15, -183, -68, -86, 37, 54, -8, 4, -181, 97, -43, 193, 79, 26, -186, 179, -212, -62, -120, -16, 71, 209, -114, 4]
7878Dj2O5j61l3K59m68L89l02L51j71j92K63l8j02K70j58P5k46L13j16J37J72
7900B99l00J7J46k8k11K77j84j34K26r4K2l5k7L8J61l49J53k07K21K1N3j24J32
7923G3N6l27J45k23J60J13P0J44l77J55j8Q9p0J82n26N31p5n1l17M14k48Q0q5
7946a05j34M63r4l1j8j67L92j87j67K57k96Nj1O2L6L82k76m8M9k61J41k8j03J3
7970a26j0OK22j67L94j95k73L10k55L61l00K14l71j30K21kO9j8k1K43j94j23P1
7993g4J06R2p0j64Q0m3j00K22l74M11j55M0j90L03k6J9j18j96J05j1L5L3L88k30
8017H3j43J40k16R8j81M5J84j52L9p3M5O3q9K60k86J40q3J81j7q9m5Q9J52r9k79
8042b33r0M86n7L4j1K2r3o4m7j59L37J8j16j38R6q9L47l06q4K19j12k19J40J75
$$ y = [4, -8, 57, -104, -137, 122, -346, 43, -259, 92, -79, -271, -8, -46, -148, 122, -36, 39, -207, 106, -10, 127, 299, -1, 16, 162, 134, -77, 200, 16, -118, 108, 14, 36, 1, -26, 12, 173, -176, -23, -230, -9, 12, 65, -59, 73, 129, -198, -53, -276, -116, -3, 67, 211, -166, -11, -29, 60, -10, 172, -354, 177, 102, 51, -266, 148, -100, -20, -105, -239, 224, 130, 99, 81, -86, 306, 119, -48, 209, -87, -82, -93, -31, 5, 387, 111, 63, 112, -149, -8, -36, -139, -126, -136, -130, 92, -75, 319, 124, -149, 161, -94, 267, -33, 181, -190, -320, -99, -101, -32, -50, -71, 172, -22, -145, -74, 32, 124, 54, -110, -30, -73, -173, 49, -325, 86, -69, -29, -219, 84, 58, 77, -41, -237, -132, -143, -108, -75, 313, 83, -60, 80, -136, -38, -219, -174, 10, -142, -103, -176, -131, -68, -157, 103, -183, -43, -126, 55, 38, -51, -96, -7, 145, 46, -233, -323, 163, 106, 140, 129, 151, 58, -6, -53, -212, 125, 143, 27, -111, -15, -104, 243, -63, -147, 72, -40, -259, -119, 56]
8066E6m12M36k84N0J05K50l11K99m20J23J2J21J36k21O2P4L0n2j08P1M9j24J45
8089H7k84J67J8m6j54J45L66n13N38k56M5j83j05M2oJ14P3J79l51K91j80J87k00
8112b6R2j16j22L26j21N6l14P7O0K50j60KK2Q4n7j53K19j85M46m92J60o0J50n
8136A33r4m0M5j02K77k57J23M5kj01j6j87K98k17k25L05k2O5J34J0p0j34k21O04
8160C51m21K19Q9m51M10l78L59j83j29M4J64p3K0J4j99J63R3J60l47J12Q4j30
8182b9N0j83L44n46L34J84k20O0l29
$$ y = [56, -356, 80, -204, -154, -49, 201, -110, 189, -231, -108, -96, 25, 161, -60, 2, 76, 106, 54, -54, 17, 66, -58, 87, -197, -30, -12, -58, -212, -67, 299, -214, 324, 68, 113, -70, -175, -133, -139, -25, 48, 227, -124, 167, -13, 174, -26, 66, -50, -172, 154, 33, 89, -225, -148, -88, 162, 2, 4, 26, 110, 53, -100, 119, -66, 380, -112, 48, -12, 138, 133, 39, -1, 44, -58, 219, -38, 85, 130, 128, 27, 11, -176, 122, -95, -320, -15, -37, 28, 162, 172, 102, -32, -253, 351, -70, 149, 238, -213, 197, -181, 178, -5, -134, -90, 74, 1, 21, 35, -164, -1, 92, 252, -95, 17, 101, -29, 21, -162, 182, -364, -30, 154, -66, -6, -335]
8191c35
$$ Imaginary data points
##PAGE= N=2
##DATA TABLE= (X++(I..I)), XYDATA
0@%%%%%%%%%%%qJ6j6J6k4L2m0M8n6P2q8J04j20J36j60J90k17K49k86L28l76M27
33B27m84N48o18O94p78Q71r73J085j207J340j485J645j819K008k214K441k692
50a411K965l266L598l968M383m847N371n972O666p477Q441r609J1060j2920J5401
65H415j8894K4220l3424N3721j82046J14122K67579k74352q4878J29906K6945
76C1314q0457J23462M0675j68608m7385J84002O7j37156J0734P2699l4359N075
88F3K2432o3841l0556J16989L5212j21489k7767R5940k4145m7979P4564J4778
100D4201r0416L3959R2391n8582p3944Q4915M1586j12933j2948J02137n4881r6758
112a01273R8146Q1943j13773o4986J07832O4282n7639j5858K8310l4151j4560
$$ y = [0, 0, 0, 0, 0, 0, 0, 0, 0, 0, 0, 0, -8, 8, -8, 8, -16, 16, -24, 24, -32, 40, -48, 56, -64, 72, -88, 102, -115, 134, -152, 176, -200, 227, -257, 291, -327, 367, -411, 460, -513, 572, -635, 705, -780, 865, -954, 1054, -1160, 1281, -1411, 1554, -1712, 1886, -2082, 2301, -2546, 2825, -3147, 3519, -3958, 4483, -5126, 5934, -6986, 8415, -10479, 13741, -19683, 34038, -148008, -33886, 233693, -40659, -125537, 4369, 31314, -49143, 74319, 114994, -53614, -100999, 83003, 83070, -54086, -43352, 29347, -5012, 63, 22495, -41346, -71902, 45087, 80299, -41190, -68957, 26983, 2838, -45141, 29423, 44201, -46215, -12256, 80135, 21553, -52391, 32524, 74110, -38823, -51771, 50366, -4515, -101273, -3127, 78816, -34957, -99943, 7889, 72171, 14532, -1326, 26984, -7167, -21727]
123b1727N7824N925m7387j6375j1573O762N5553L437p7531m124R1734n085r6824
136e9391L2414R3792n5476o6906P0246K2955p3339K2052P8481m8665p3899O7713
148I977N2346r0222k8865Q6386m754o4973K6434K2075m8887J8568Q4513j9835
160D2763q9591J8786O9927j5140j9327J7395m0592l1758N8185K2173o1319n312
172c3810N4782j7784m5049M9685L7383o5195o701P6561k4815p4453M3454N8643
184E2701m9672m0685M7050J1618m9587J6722M4987l8616l0949M1669P661l0383
196a7484J3561J8061k1660j433L2124r517l4404K6525K9582l5966j3597K4614
208A0406k2460j6225M6017N670o1647n934O1579M446m0226K2964K2059m5873N456
$$ y = [-21727, 36097, 42022, -5365, -21740, -33313, -26551, 29002, 32439, -45092, -49216, 42518, 37433, -59391, -26977, 66815, 11339, -55567, 14679, 37634, -35705, -13653, 64828, 16163, -57736, 9977, 62323, -27899, -56764, 29622, 24868, -40105, -13671, 8404, -40483, -21915, 62598, 42763, -46828, -28042, 41885, 26745, 7418, 24813, -15779, -47537, 10648, 32821, -28498, -33810, 20972, 3188, -41861, 7824, 45207, -19988, -26689, 49872, 25057, -49396, -5942, 52701, 3029, -37656, 9394, 21012, -28575, -11853, 33134, -5482, -36431, 5238, 12899, -17484, -3923, 14138, -7522, -8955, 23169, 13652, -20752, 5773, 35355, -611, -14208, 10406, -12054, -28279, 17738, 23408, -38239, -44173, 17406, 21852, -18374, 4590, 26649, -19224, -13768]
221a3768O2140k3699n9230L1266M0270m2556k7723M2866L204m2824K1052L2066
233B3064m4592j0787N7843m135m8984K2167L6987l0790j8038M3344j811m9502
245b5234K4155L9724m9103k7441N4278M141n3623J0563M2318k7279k7795M7902
257A2606J8309n3432N378N3289k0770l3557L3824J4343m2191n319L7525j0067
269I938l6716J8134J9962k9799k207L1719j1581j9578K3902J2524k1012K71K3065
282A8622p240j7997J7327O226k7217N380K2588k1685j7680K2521M445k2988M165
295a3533K0991j0989j3182K4314P581k6272J0190K6264j8458j5224K1245M26k2133
308h780N898J6295j9793j6184K6027L853l0108J1921K6577k2143j1839L1382L279
$$ y = [-13768, 48372, 24673, -34557, -3291, 36979, -5577, -33300, 9566, 12770, -30054, -9002, 23064, -21528, -32315, 25528, 21393, -27591, -5424, 31563, 773, -17265, 26079, 24268, -25234, -1079, 38645, -10458, -37899, 16379, 20520, -33103, -22540, 19778, -7501, -35296, 12606, 30915, -22517, -17139, 36150, 15380, -18177, 15647, 29990, -12201, -17520, 20005, 9938, -26778, -8644, 11318, -18481, -20688, 11031, -550, -20128, 3774, 16298, -4714, -4443, 18622, 11382, -6615, 10712, 16938, -10279, -4899, 17689, -3996, -21676, 845, 5290, -17698, -13533, 7458, -3531, -16713, 7601, 15182, -11090, -900, 25364, 6906, -8318, 12927, 13353, -8780, -2882, 13413, -6380, -22564, 3463, 7316, -22792, -10871, 15706, -6437, -18276, 13106, 16385]
321A6385k8165R717K8091j9460k3543K9540R487l8615L604L2118k0547k5323K6714
334CJ3827l0233k843L3924p210k8121K3451K0982k9907m269L0795p832k5906J4420
348A081J6233k2564j0646K3977k635k5767J4095J8848k1957o040K4791j662j7768
361a0014J0686J4392j4055p991J9156r36k1948R073J4309j8038o213J5248l011
374F58j2383Q533R295j1051m049J6354K60j4248J0092Q974j5289O00J3565q443
388B868j1462R782N644j5148j563J5810o410j4448J6366R072j9797K652K0385
401A3751q305j4013J4126R519j9151m564K1787o287k2845J3933J3380k1013m201
414a3883K0812l881j7479J2233J6689j5965r866K2248K060k1372R725J5762j8543
$$ y = [16385, -11780, -2063, 26028, 6568, -16975, 12565, 22052, -16563, -12959, 19159, -1388, -26711, 3, 13830, -16403, -19246, 14678, 7468, -20653, 2798, 23780, -6127, -10396, 20399, 12567, -13339, 1081, 17314, -5250, -15896, 8081, 5446, -20321, -6226, 12622, -9335, -15375, 9416, 7754, -10014, 672, 15064, 1009, -6982, 12174, 11238, -10710, -1637, 12672, -5366, -11579, 3669, 658, -11725, -3192, 6103, -4948, -8997, 7357, 7617, -6631, 3461, 12435, -2854, -2254, 11311, 2868, -8594, 1188, 6832, -8316, -9879, 5931, -479, -14927, 1439, 10511, -9286, -6634, 13751, 5446, -8567, 5559, 15078, -4073, -8637, 13150, 6863, -15982, -2049, 11331, -9682, -13883, 6929, 3048, -14431, -2198, 14491, -1474, -11340, 10908, 12968, -8404, 1321, 17083, -1460]
427a460j0636J8932K022k0167J641J6384r286j2534J6474N864j8092N832J7119
440A2093q673j0086J2073O185j2035l83J2247q555j3926J2367O391j5417j497
453i216R963l815n196P076L242p057J519J1746k864o987O917J753q055N647M371
468I044j1868m177Q863L12j0448J131Q006o204l352J1623j107j0021R569R234
482A0605r391j996R357k730r178O789Q169j5004q223J6273j040j6669O850J1579
496E391j0844o077J4069M000j3169L235J5880p580j0446J3695L102j6283M010
509a017J2478j1331j2193J1685O642j5765k755J7406l885j4087J2495R811j2788
522c304k020J4217J68j1187L131P672q691l850J0545l921j2981P219P469j0052
$$ y = [-1460, -12096, 6836, 8858, -11309, -9668, 6716, -2570, -15104, 1370, 7234, -10858, -5026, 12093, 3420, -6666, 5407, 11592, -443, -826, 11421, 2866, -11060, 1307, 7698, -7719, -9216, 747, -3068, -8264, -1188, 2054, -5003, -3484, 8262, 5398, -1589, 5328, 7081, -974, 4673, 9044, -2824, -7001, 1862, 2174, -8274, -7143, 863, -5341, -8693, 2930, 1823, -8198, 1371, 10605, 1214, -782, 8575, 5845, -3333, 3456, 11625, -3379, -11602, 4671, 3631, -13038, -6188, 5391, -5453, -11530, 2539, 6539, -6630, -3395, 12485, 4905, -5541, 8154, 11256, -5027, -1017, 11461, 130, -12063, -378, 6264, -9501, -12256, 5150, 1265, -12822, -327, 9484, -3304, -5324, 8893, 9061, -2126, 1005, 8677, -14, -3864, 6681, 2760, -10221, -3002, 4467, -5585]
536e585l056R982k8q432L779J0670n185o503Q681K581o697J882L410n036j848
551a385K316n92l299M07J258m489P79P776l265n409O953L867m971R78M051k705
567B270k463M148L01p576L99O855n797n544Q871M58r832L803R386m932o483Q309
583B173O262j0482k411J1828j887r346N805K256q399o7Q164k521q613M279O413
598C454p769r40J1460l633r693Q524P968q035m875P567J400q832J477P847p675
613a755p094R672K029q178J558N548k538k679O414K685p414p0Q244k645n868M220
629B129J176n558k65K921j107k451J318O58k651J699M462k413j249M556j758k641
645a174N232J429n018k123L946N9n116P91L490n462j519O524j726m261M032L089
$$ y = [-5585, -8641, 1341, 1313, -7119, -3340, 7330, 2145, -4358, 4323, 6904, 207, 2089, 5499, 463, -1385, 931, 339, -2960, -2553, -1295, -5784, -5005, 2771, -494, -5903, 1050, 4917, -54, 924, 4975, 2270, -193, 3955, 4256, -3320, -2921, 3934, -1863, -7407, 1464, 1922, -7910, -4107, 5279, 347, -6136, 2173, 8435, -2047, -4458, 7370, 5483, -3863, 1942, 4198, -4201, -4268, 3896, 1375, -7238, -2959, 3454, -4315, -5255, 6205, 2572, -7121, 1403, 9371, 1336, -3539, 4028, 5428, -3404, -1927, 5920, -1755, -8849, 823, 2852, -5326, -3768, 1780, -758, -3437, 2977, 5662, -1752, -1822, 6422, 3777, -2091, 2129, 3305, -2253, -2518, 403, -704, -3155, -1837, -1179, -3830, -2131, 2331, -82, -1331, 3225, 1467, -1174, 4058, 5487, 469, -1654, 2292, 2351, -2765, -1974, 1516, -3946, -5465, 1059, -667, -4928, -896, 2193]
661B193k562j62N024m25n670L611N380o674l346N699k415n806M384K978o552l083
677g426O645K716o447K884O882n849l092R229J342p959J421N466l874o049N254
692A143L591q760k240P417k225n605M795L570m232j010O251J457n008J929M697
707E770l247k692M012j800m428J821J831l038k187J513R54k185J516L307k572
722a425r39L906L63n06J945J70k483l98J391j0k334m3l34k916J092K466k421o68
740c144K446k76m67K201J786j606j021L486N03m446K040K691n455j601M497j260
756C74m922J553L806k395k912M728K133n491J777O917l527l904M243J921m164
771A37r42M096j960o037L243L672m992j219N264j315m001L256L888k524k034L810
$$ y = [2193, -369, -531, 4493, 4068, -1602, 2009, 7389, 715, -2631, 3068, 653, -5153, -769, 2209, -4343, -7426, -781, 1935, -4512, -1628, 5254, -595, -3687, 5542, 6884, -1075, 346, 5812, 1938, -4111, 1143, 4734, -4026, -6266, 1151, -1074, -6679, -1884, 1686, -2546, -3556, 2695, 4152, -856, 1073, 5770, 2523, -169, 3843, 2043, -2385, -564, 1267, -1771, -3958, -2445, -1491, -3676, -2160, 1147, -1425, -2364, 1542, 1905, 1399, 3344, 3514, 1031, 633, 2024, 2014, -320, -363, -697, -3613, -2521, -55, -2476, -3144, -698, -974, -1441, 760, 2546, 940, -81, 3405, 3908, -538, 1502, 4193, -1262, -2863, 1634, 374, -4548, -2995, 811, -1584, -4496, 232, 2365, -3126, -1349, 5568, 2041, -1863, 2380, 4301, 137, -805, 3291, 1331, -4706, -1463, 2209, -2783, -4002, 1262, -53, -4054, -798, 3090, 566, -1468, 2342]
787B342J223m792J740M328m331l144L955j36l741O24K276j238k671K871K118l378
803a954P29L741j378j644K459L17k197q8J681k87k822P30R55k278O23J584j974
820a803P9J813m25J32J487K31q95n6J748p55k065J441N63l382L99K150k055j551
838b944J866J254j886m92L686l05k832K939K339l605r8L176j262l123J315J604
854A632k671k047L087q0m078K230L615k940p46L629P64k709O03L145j373l002
870i41K732J042m320j02K309j639k000J663O27j364p57K985N97k408J845K379
886B648j677j84J825m02j363J98O5r73j588O82P2j739O16N46r44J021Q40k07R82
905D18O85R1L72K41J95o14p70R84p83k269J200J73k601O83J262q06o61J315J458
$$ y = [2342, 3565, -1227, 513, 4841, 510, -2634, 1321, 1185, -2556, -1932, 344, -894, -3565, -694, 1424, -1954, -1225, 2516, 1138, -506, 1953, 2270, 73, -15, 1666, 1379, -1443, -713, 242, -2036, -1413, 171, -1803, -1724, 89, -336, -204, 1283, 1514, 619, 563, 2311, 1556, -509, 932, 1495, -1887, -1488, 662, -1393, -2944, -1078, 176, -1710, -2202, 1484, 1179, -1653, 1286, 3625, 20, -78, 3098, 1836, -1287, 28, 1632, -1039, -3086, 1, -79, -4157, -1927, 1688, -1252, -1998, 1631, 2395, -314, 289, 3434, 2061, -941, 1791, 2833, -1487, -1589, 720, -919, -2919, -1256, -629, -1993, -2750, 235, 832, -1576, 269, 2648, 971, 787, 2612, 2210, 847, 1045, 1110, 137, -1451, -769, -697, -2436, -1820, -1274, -2218, -1197, -357, -564, 418, 1103, 1194, 1566, 1807, 2002, 1388, 618, 1602, 819, -1450, -250, -77, -2678, -1995, -733, -1539, -2200, -885, 573]
924E73j086j29L244m86k583K336J451k756l74J654q17l009O36K162k304k296L295
941d89Q25l308J609L061j188j088K208J138k249k39L016j218l087J698J121l372
957a562o04K350o09k392J151K208r27j790K795J534k460P46K164j039j271J087
973A381L25j611r80J426o49j860R85M07j299O77R57p0N8J70J184l4q64J118K67
992A588r87M98m67q77M37o58p85O27k98m80N03M38N93q86O00J337l75o67J861
1011B002o07j174O14J05j364l20Q47n03j151l1K043j461r93K649N60j841N97J748
1029A720n89j316Q84J459k286j087K255n98k434J191J148j596l16J906r3j233
1045i85M09K399j011j297K234K49j813J51R90r32j567O76J031j861m09J486m00
$$ y = [573, -513, -642, 2602, 2116, -467, 1869, 3320, 564, 190, 1844, 1027, -1982, -1346, 816, -1488, -3784, -489, 336, -2972, -1363, 1698, 510, -578, 1630, 2768, 519, 280, 3296, 2078, -1009, 689, 1810, -1562, -2166, 184, -425, -2817, -1666, 542, -385, -2175, 620, 2154, -306, 440, 2604, 1565, 294, 1381, 1706, 95, -885, 541, -108, -1968, -983, -576, -1875, -1198, -241, -311, -253, -83, 1101, 1067, 203, 1321, 1588, 601, 1099, 632, -245, 192, -466, -1251, -624, -922, -1402, -899, -461, 132, -754, -154, 1183, 808, 141, 2002, 1395, 221, 835, 940, -424, -744, 103, -400, -1551, -1582, 461, -1000, -1993, 656, 1216, -625, -28, 1720, 1131, -185, 699, 2158, -128, -1215, 1040, 442, -1992, -801, 347, -1249, -1565, 341, 248, -985, -576, 1823, 812, -485, 1749, 1998, 185, 336, 1326, 394, -1173, -497, 534, -1327, -1736, -250, -650]
1062f50j013J428O32n11M80P32J68m94K37N04o83r42R47q17q48K22k15k85Q3l33
1082a358K58Q81P7K40o2O61Q69p36j5Q73r34p20J109o95j093n8O4m82o97O71Q21
1103c26j111M42K003r04n35J795M95q65k71J236l86k002L67J613k134j380J325
1120f38k02j466R42J099k33q68J402J362j310K2K340r80j175P06N98j526o35Q59
1138B97j54j798K89J264j049r77J837J00o66Q49J088l0m65M34O81r66o67J050
1156A117q33o91kL5q17R3J25K54l7j4O03J05j65J079q3L93J05o58P3M13q23l60
1178h8L06r38n56K64M63l97n67J123P72r21N34J020o03k75Q61L43p39n57K96M97
1198H38j581J77J124j579l61Q11J51n34K21J211N3j015J213P97j178m14J514n55
$$ y = [-650, -1663, -235, 397, -114, 366, 1098, 1266, 772, 1009, 1513, 830, -112, 835, 18, -830, -608, -823, -1108, -1025, -1358, -1100, -219, -142, 98, 36, 697, 1566, 830, 815, 1688, 754, 34, 1143, 448, -645, -703, -639, -1121, -1818, -1147, -326, -1437, -995, 1008, 104, -431, 1364, 1859, 994, 723, 1959, 1573, -429, -62, 1551, -583, -1963, -638, -840, -2306, -1364, -265, -498, -1366, 36, 1398, 88, 110, 2450, 1470, 295, 1001, 1599, 73, -562, 297, 143, -1655, -1366, -102, -1151, -2128, -291, -191, -857, -8, 1080, 1050, 585, 1019, 1700, 734, 67, 1117, 284, -407, -409, -374, -1191, -1098, -973, -719, -756, -770, -167, -62, -227, 852, 769, 1162, 1267, 609, 682, 1095, 272, -88, 218, -720, -1276, -1012, -549, -946, -1513, -390, 382, -539, -5, 1015, 412, 137, 998, 1341, 602, 45, 341, 838, -743, -566, 558, -1021, -1382, -571, -420, -954, -733, 478, 531, -484, 729, 1526, 348, -66, 1448, 893]
1216H93j265N92J84q48q99R79K32j335Q47J193j181o3J374J26n48m9J007m9j214
1235b4K70P38j372m09R02n61m80N24k97j78K37M41Q17n10k07Q62k39j24K96j99
1255D87k5N5q56J12q4q25O35j7Q9k00L0N22M49l65N29K90l81j31O66k19n06j43
1277A12J95m03j183R11J72j393N90R07n43j52J073L66n06Q7J172J79j289O20N24
1296A439j790K4O84m62r42nQ02l72q52J145P48r42N72J101n51j13M04L48m74o36
1316A28N01r9j321M2P16j042k72M46J99PPN18L49k51N09Q18l27pJ01k04j22k54
1338D42k40j47r03k12M85m38p7M50j45N60J48j03J149j46o05R57l00l08k7Pk92
1359B55l69l14M3k21q18R15j2r77R54Q00l45j4O99N15l78m65Q63k5j147K73M30
$$ y = [893, -372, 220, 404, -444, -1343, -364, -132, -1467, -620, 573, -608, -671, 703, 829, 281, 232, 1239, 1190, -24, 246, 984, -388, -797, 105, -456, -936, -412, -709, -887, -650, -209, 608, 98, -109, 753, 514, 390, 686, 487, 462, 517, -339, -227, -311, -1136, -501, -518, -429, -629, -599, -77, 372, 7, 536, 826, 445, 314, 980, 761, 255, 112, 307, -96, -1279, -368, -196, -1589, -999, -92, -635, -787, 286, 652, 146, 233, 1405, 1584, 295, 915, 1439, -351, -327, 357, -105, -1047, -1052, -250, -622, -1474, -329, 419, -523, 49, 1150, 599, 486, 890, 1238, 764, 128, 629, 530, -791, -749, -33, -1075, -1347, -901, -702, -695, -688, -170, 179, -72, 437, 1255, 928, 921, 1022, 818, 696, 442, 202, 55, -848, -1060, -575, -1013, -1090, -640, -785, -225, -77, -180, 969, 823, 218, 1175, 875, 567, 540, 547, 255, -114, -428, -385, -606, -1424, -509, -521, -1498, -544, 256, -89, -103, 596, 1111, 733, 268, 1131, 1106, -41, 232, 662]
1380F62j208j12M57po00l32J044m2j054R75R53q47K30R28o12j17L46K17k37j073
1400d29N86K08j531M07M72j59l33M48L37k85j83J228k63n25N31P72q41k05K37
1419D72k23l85k87J16j06k34M5M33l61m3O15K20j54J85j29Q38o03k01M37m75j81
1440b1l87Q9J5l01j66O50j64m11N75L83n31O33N68mq39L62K73o86j24P98q27l45
1462d60K51l8m31k65N78K77l87mR90l11k01O21K72n50k8J37P8p44O3K21n48n24
1484a003Q13k42m08O05L03L8J01k02P94j11m63M50j55m75J81J39m77k34o8K4l10
1505g00P7N4K85l20M74L73q4L19n5R6O9k28K53l71k58M6k02j77l75P3K21J26m51
1528g55L00M61j3j01P21j63K74l03J40N62p72l50L57o05n15M05l89l11N95L93
$$ y = [662, -546, -658, -201, -208, -808, -1140, -96, -138, -1192, -217, 736, -111, 119, 1047, 435, 318, 664, 881, 644, -429, 157, 365, -1166, -759, -287, -446, -779, -331, 6, -279, -462, 766, 503, -22, 509, 1281, 440, 235, 472, 249, -136, -423, -307, -413, -647, -602, -169, -530, -573, 42, 262, 108, 293, 164, 1002, 399, 198, 635, 160, -21, -408, -319, -304, -605, -771, -121, -285, -696, -121, 262, -269, 364, 932, 928, 89, 451, 724, 38, -86, 712, -115, -460, -209, -247, -678, -943, -365, -88, -475, -479, 511, 200, -1, 620, 892, 342, 314, 451, 529, -215, -152, 69, -479, -1003, -190, -432, -840, -235, 68, 106, 207, 5, 799, 688, 225, 675, 520, 45, 226, 365, -112, -346, -414, -390, -700, -623, -569, -284, -604, -130, 243, 159, 478, 423, 519, 588, 360, 613, 242, -16, 30, -172, -349, -724, -651, -430, -304, -755, -455, 6, -7, -108, 613, 450, 724, 421, 561, 1123, 351, 1, 358, -247, -762, -357, -746, -1057, -462, -69]
1548f9j36l14L79Q10o17l4Q18o2n09M86l0l61n50L61j47o31m63Q48n41m69Q74
1569c57L60m97K27O08M83o98K67M16m17J2K56n21n25K42j18p8l90N3nM6lN03J26
1592a0k39M72L43q5p2k80N71p16M0K29l74l06j7P2q3J01j51J87j13J85K62M17
1614D33k95K90k98L14j7l53M36M6r95M55q6n75P8K92k11P4K03L10r9j54K53L77
1636D78m34J94L33j82m30M2J62k94m08J52K26l37LO51m67K19N40l95J96l23N01
1657D27J47o38M53L02q47l0P3j10m48J29K47j47o4J64O59m93P3O18j43j72L63
1678E63P5m40j97j31L94p07Q5K7l0J38R8jj49N6K10P9K23k42O24L8m11K44m07
1701A39Q1l40k23J12k55k72N81K5l59L39J61M9o1K07M04M4l81J35K15q36M38j21
$$ y = [-69, -205, -519, -140, 670, 53, 19, 837, 775, 266, 752, 722, 361, -189, 172, 25, -606, -1069, -221, -762, -1231, -357, 3, -494, -267, 341, 824, 126, 393, 809, 392, 404, 660, 139, -386, -144, -262, -340, -730, -677, -682, -636, -639, -136, -10, -249, 223, 566, 481, 409, 129, 700, -16, 24, 253, -121, -427, -444, -372, -455, -354, -505, -318, -431, -246, 16, 433, 138, 428, 130, 444, 427, 74, 510, 556, -439, 16, -70, -645, -567, -275, -486, -412, -209, 101, 2, -152, 101, 478, 44, 238, 571, 389, -41, 1, 163, -131, -539, -387, -161, -498, -495, 156, -311, -92, 448, 53, 249, -74, 427, 574, -64, 389, 691, -156, -186, -113, -223, -671, -542, -295, -442, -506, -342, 317, -176, -103, 515, 372, 200, 563, 638, 198, 1, -130, 264, -443, -358, -331, -361, -223, -125, -126, -275, -219, -9, 70, 293, 51, 675, 713, 302, 546, 139, 220, -120, -343, -231, -486, -758, -177, -152, -511, -172, -11, 38, -23, 184, 588, 632, 251, 386, 601, -235, 203, 82]
1723H2m08n8n7J45j90k19L54M16k22l9N92m86J92L03L30j98l93O7M57q57O9K18
1745I8m79l01J72N7J24k35M32L96k10R1O52n63K68nj25l1J4k74J57o56Q8K27m58
1768e61JJ07J81j51M83j14L28j22kM09j75j56M86j64n03mJ24k8p14k2K79j1j83
1791e12N47j33j99K35qL66J66m89M22m8j56L43l73j89j21K27m03j35j37N2K56
1812b89q5L59M8j86L23K09lj26P2J79k36k74J25N5l47p7J93k02j01J28L34j56
1834e7l16L16L09k45J61K52j12M0k06P4l46j25L01k80o0l9L74m64j6L89J04p0
1856a6J19J59l3k2r6L09o29K5M59n81L25j47P9j8l63J69J21J21l5L48q2R1l5N2
1880C20R5j94k93M17l02l40J83N8l62K8J03J17o1Q5J96L27m27K99qJ0j22j5J92
$$ y = [82, -326, -384, -441, -296, -486, -705, -351, 65, -157, -196, 396, -90, 102, 405, 735, 537, 144, 211, 668, -189, -120, 98, -381, -682, -510, -453, -329, -564, -132, 264, 54, 145, 797, 234, 502, 497, 372, 341, 355, 81, 238, -418, -330, -103, -561, -560, -453, -272, -423, 60, -54, 274, 152, 150, 559, 384, 228, 714, 550, 47, 43, 167, 139, -575, -597, -318, -329, -512, 35, -98, -297, -62, -70, 296, 462, -27, 395, 347, 191, 534, 161, -28, -149, 78, -325, -460, -597, -545, -289, -374, -15, 33, -153, 170, 379, 376, 250, 322, 501, 265, -9, 116, 171, -176, -253, -60, -262, -363, -235, 99, -57, -373, -57, 252, 7, 168, 420, 308, 348, 142, 216, -130, -255, 46, -234, -294, -333, 41, -423, -439, -50, 54, -16, 103, 262, 229, 207, 111, 420, -209, -184, 275, -306, 19, -128, -49, -67, -430, -261, -140, -19, -54, 294, 212, 303, 268, 320, 415, 221, -72, 345, 43, -297, -114, -56, -418, -390, -287, -170, -231, -146, 50, 377, -50, 249, 241, 251, 129, 114, 306]
1903C06p8k35J05j14o04L71K0k57J93L51J7J5k1K95k05O0K60k23j52J08n2j18
1925D2k33k24N05n76P7K1K70k32J93P8J32K45j23j5K02N1k8J41l29j16K63o99
1947c55j64L72m2j65l9L23j72m4L08L42j56L06l78k00L56J71k65Q3m20q4K96m08
1969c35K00l75j2K34j29P9P00o8k04L86m51M00K15j34p7k64j38p9k39J03kj46
1991c36k78J08J45K94j13K29J24l14M87J73j70n09N48K8m41J11j1m32%l3L1l4
2013c93j24N56N5j67J90Q1J67l06K83L9j24k12J06Q6m10q1K7p2J58j03L1m0n8
2036c11L37M09n13L26n1J28R7j01l16j09J28M50q17N0J38p9p0q4J59K47K66l67
2058h3L58j64%J12J10m92J05N2n1j49m9m4L62l98o7J65oQ8L73m27J12J61J15N9
$$ y = [306, 228, -7, 98, -16, -620, -249, -229, -486, -293, 58, 75, 90, 69, 364, 159, 219, 479, 256, 104, 212, 160, 42, -191, -415, 90, -486, -409, -388, -118, -350, -157, -79, 53, 298, 175, 160, 362, 413, 385, 526, 197, 81, 344, -355, -519, -147, -189, -354, -393, -70, -242, -286, 22, 364, 208, 514, 136, -64, 292, 463, 198, 281, -139, -223, 73, -335, -135, -510, -522, -288, -417, -338, 362, 294, 90, 476, 25, 425, 640, 506, 429, 165, 27, -52, -291, -188, -190, -336, -614, -506, -361, -67, -180, 49, 173, -141, 346, 519, 349, -160, 388, 416, -25, 86, 75, -357, -357, -390, -359, -393, -517, 39, 94, -73, 117, 198, 365, 59, 342, 381, 257, 45, 151, 237, -173, -254, -227, -299, -141, -244, -213, -253, -311, 26, 435, -78, 248, 197, 325, 422, 321, 5, -104, 24, 474, -343, -293, -155, -234, -304, -388, -229, 18, 284, -83, 275, 111, 111, 223, 333, -159, -54, -2, -53, -202, -251, -295, 67, -331, -398, -233, -239, -151, 222, -205, -93, 68, 183, 242]
2082B42k31p4M64o24J29Q9J6l22L23p8J73k84n7J66O5l18M22J84k15m1M1K79l82
2105c3K37l1l33j06L49l57r1L27m02K81N0J09L78l41r7R7L89k95J79k97mN9l43
2128b75J74p0k16K99m26L60j4L8J75K80l16J85J56J2K29j01k15n2n1m17Q8j58
2150c15K52J06m98K97r9j4K38J25r2j9l2L46j2k44l8J85k87J72n0l71J18q8L86
2173F6l26j3J08J53J11o4J99M3q1K25L7P3m17j48J08j79Q3r4k7j43r9M2j9K04
2197a58K4j68K43J63M81m48R7L15o32L19j69j19r7j26j42K45j5k25O41n32L20
2218A7J81j02m3q6N7J65K01m71J73n4j14J02k35J75j82n7K86J68k24k48O7O29
2240D05n45M55m64P0M33j3l76j04k6J28r3p2K69k82k52L6L93J91l77L63k32J09
$$ y = [242, 11, -63, 401, -223, -94, -5, 11, -311, 12, -66, 107, -177, -234, -68, -3, -321, 101, 285, 70, 29, 70, 349, -33, 204, 173, -160, -266, 83, -274, -365, -38, -440, -159, -109, 0, 378, 37, -60, 37, 426, 131, 310, 13, 9, 68, -275, -101, -171, -387, -88, -514, -154, -168, -130, 45, 325, 9, 194, 350, 362, 591, 490, 275, 223, 172, -245, -157, -315, -63, 43, -455, -158, -257, -271, -33, 92, 0, -19, -51, 295, 283, 39, 1, 186, -101, 71, 21, -350, -232, -320, 66, -260, -273, -165, -12, 99, 35, 234, 277, 196, 421, 458, 531, 114, -34, 74, -105, -22, -116, -143, -286, -385, -343, -362, -158, -134, -302, -59, 104, 585, 137, 234, 549, -83, 236, 67, -52, -149, -275, -417, -172, -187, -412, 229, -303, 17, 198, 96, 53, -33, 24, 189, 390, -81, 92, 38, -76, 26, -209, -34, -216, -273, 13, 181, -43, -291, -224, 405, -140, 315, -149, -79, 354, 341, -35, -139, -165, -37, -130, -202, 67, -215, -467, -431, -38, 153, -224, 139, -93, 16]
2262A6O2K17J75l71L4k39J92k08R9R0n10J91J04K08l64L78N6p0Q8k61L43n3J01
2285B78RK5k06k7l13P3P4J99m58K16J1K80Q8j59O3J90k81j61L9K91j03j03J12
2308A37n36L93j5j74L56j45k92J03J9J77R8j93K76j30Q1p9N1n7o8J32p4J04m37
2331b73j98K79L3k16N54M4j49j24Q0K5M2q9M77k23k14M6J85m31J00j64J80k44
2353b80K6N07m85J28J86j95J24J21j04q3M24r6R0j79j55O3k08J02j85k4j63L19
2375f7l33L24j26J13J57J4K11J0K9p8K62m48J28j51k04j5J51k28j8J28J69l9k52
2398b63M89k06k80K26L81qMp5Jk25J21j16MK07n34O2j78L17n9k2J33j57P2o4M84
2423C14l12K96j44j66K30k44k6l0J11r8n5MJ40k69m2J26J59J32p3J36j00j08K53
$$ y = [16, 78, 295, 470, 99, 133, -106, 86, -122, -23, 67, -443, -252, -148, 60, -304, 74, 130, 60, 148, -113, 230, 177, 278, 287, 312, 106, 79, -234, -161, -87, 112, -346, -130, -119, 161, 249, 90, 153, 343, 62, -99, -60, 231, 128, 25, 137, -399, -6, -21, -195, 161, 16, -276, -173, -154, 23, 121, -72, 204, 74, 155, 76, 127, 70, 2, 134, 60, 164, -273, -471, -192, -159, -375, 179, 223, 74, -50, 30, 55, 97, 8, 485, 262, 48, 94, 279, -152, -52, -216, -36, -280, -254, 253, -232, -104, 82, -113, 11, 132, 28, -55, 369, 273, 363, 184, 29, 92, -116, -14, -199, -223, -386, -67, -400, -76, -202, -89, 68, 82, 293, 303, 332, 254, 516, 68, 196, 45, -159, -174, -23, -251, -269, -141, 28, -11, -263, 226, 20, -260, -34, 347, 339, 343, 268, 269, 44, 165, 49, 53, 260, -274, -212, -390, -73, -132, -154, -21, -178, -106, -170, 314, 2, 298, 154, -12, 218, -26, -52, -82, 29, -69, -124, -120, 20, -249, -291, -165, -6, 126, 53, 189, 89, -19, 234]
2446B34q8J97k53R8m2l77K0K3j81R5J50r4J41N3N5j18J5M73m8l21J0J45j66P8
2470I9o9Q2K6m21J13K61k59q9j13L10J21n7Q7O3Q5l88K77o4j07K14k05M0k18J11
2494a01J26m31N22k41r9J36j8K98l03L60k06J06Nj06o3K41j03k58J4R0m56M79
2516hq1K0j95K83j3R1M5Pn3J40k06J03k53J60k84NK71j14K1k00M48m04j14J30
2540b01J04J14J95j78K62k30q7K37k30N5j6k42K5M6L8j61O3r6O1J84n5J07Q5J39
2564B19k36k7M26l33p1q1J13k65P7J96l3j5j71K76r7n4p8J83j68M10j34l3R5l24
2588a25K13k0O3o2j7j75ON5j12QJ92m3K05l89L42l0jJ26j34K22l85J90l4P3r0
2613G8m57L34L4j01r6K4j44p0L01K18k85kM74j17k89L72j19R8l6l42J48k6J65
$$ y = [234, 146, 343, 90, 188, 146, -231, -211, -188, -369, -274, -124, -218, -77, -24, 31, -87, -72, 401, 353, 32, 42, 187, 21, 99, 30, 112, 138, -283, -170, 91, -168, -257, -370, -60, 61, 4, 91, 154, 239, -149, 128, 64, -43, 171, -34, 6, -212, -101, 25, -406, 116, -125, -224, -88, -106, 192, -111, 249, 43, 149, 154, 48, -15, 226, 123, -135, -121, -31, -487, -8, -89, -69, -264, 19, 6, 97, 142, 149, 96, 236, 30, 133, -120, 40, -244, -239, 32, -82, -61, -261, 187, -217, -331, -201, -97, 17, 212, 34, 296, 66, -21, 216, -14, 41, 25, -217, -192, -146, -108, -269, -206, -302, -241, -57, -112, -5, 80, 219, -17, -44, 382, 49, -22, -103, 10, -255, -178, 18, -15, -30, -201, 75, -22, -76, -154, 29, -139, 271, 137, 104, 199, -125, 88, 68, 131, 69, 52, -123, -117, -62, -174, -166, 26, -17, 188, -201, 141, 111, 110, 236, 102, 324, -61, 129, 95, 168, 78, -379, -45, -11, -112, -208, -184, -328, -398, -97, 121, -164, -166, 308, 191, -98, 274, 155, 253, 217, -125, 23, -3, 162]
2636A62k48K52l26M1L9j30M35q9j30K04j66L61j84l05K24K9k88j17j16J36pL1
2658a92J19q0J19R9J24j46q6K59j22R2j90R7J22j26j52R9n76P36n91K76O0m76
2680e35O53j71q4K28j11J82j26K91m15Q9J51j30Q1k71K20j91K42K02m77J53o5
2701h4j7L63l20r1K73R4k76Q7r1M1l7J27rk45J25j41J81k65L76n4k8J13L2j66
2725a2J05j74RJ87p8R1k36J52l92K36K7K22m19K77k37K81p3l7P9j22L88j76r3
2748EK1M0k7R1k67J66J78r4j32r9n7K23l8j79J77Q8K02k02K23j70M1k61J59Qj17
2773b1J30o6j21j74M8j14M7n1M33j11Q2n5n3J87J05p1j46r3mJ5nm6P3j43q5K70
2799C1j40n1K29j91J73J06N4j41K46m43L23n8j5K22p36J26J95n4j3J48k34r4n4
$$ y = [162, -86, 166, -160, -119, -80, -210, 225, 136, 6, 210, 44, 405, 221, -84, 140, 169, -119, -236, -352, -216, -223, -192, -73, -153, -34, 65, 189, 43, -43, 216, 94, 186, -4, 93, 215, 89, -63, 36, -540, 196, -395, -119, -59, -535, 118, -53, -137, 91, -20, 162, 36, 327, -88, 1, 152, 22, 103, -168, 52, -139, 103, 305, -172, -19, -84, -101, 262, -58, -149, 124, 218, -58, 29, -62, -21, -58, 69, 60, -185, -60, -201, -20, -285, 91, 37, 9, 122, 154, -12, 93, -81, -72, 115, 37, 128, -108, 44, -348, -112, -85, 137, -282, -5, -242, 39, -34, -71, 8, -114, 274, 98, 5, 26, 66, 39, 130, -137, 29, 207, 113, -19, -118, -175, 48, 10, -169, 8, 96, 298, 96, 319, 149, 190, -71, 88, 96, -21, 109, 43, -78, -252, -204, -318, -271, -322, 111, 0, 82, 27, -26, 161, 266, 195, 49, -44, -48, -33, -38, -84, -11, -154, -239, 31, -109, -160, 69, -122, 51, 157, 211, 70, 316, -127, 196, 138, 123, 345, -391, -265, -70, -124, -137, 11, -223, -317, -371]
2822c71K28K54M9k32L37O6l23K47q9J07M1k50J13l38oj63L04l72M35k51J98K71
2844B55j9J31k43lk2K13m4k01P2j52L3l0l37N60o94J89L09j60Q0l02K91L51j42
2867A35m3J09P0j55n3k37L79k84j21j79K90j64J62N1k53j1O8J27K01j19K35Kk69
2890e9L43j10P5m8k55K18l44q0O1M25m45K67p2j88J08P3J4M6jR1O2j15q4R7Q1
2915A60k3m6qj20j18L90k60p1QJ00k98M10k7n1J78k90J93N5m56oK03N5O5q3m5
2940h5K46o88L30K20j1L02o8k05j23M43j9l45M08m10r9J5j42J22J0Q3j81K94q8
2963IO5o6N3q8k26L42J2j33K59k38L28k47O8j64j48j0K41j84j79L33r1J48j91
2986a07J31j30L39j50j29J44q1r7j02O3K70k06K42k11pj94J24m8M9J78j55K10
$$ y = [-371, -143, 111, 160, -72, 265, 331, 8, 255, 166, 273, 314, 64, 177, -161, -167, -330, -26, -398, 37, -214, -16, 255, 236, 367, 124, 121, 99, 312, 268, 67, 139, -13, 20, -10, -347, 213, -481, -292, 17, -143, -63, -365, -74, 277, 135, 92, 201, 271, 116, 63, -174, 205, -79, -200, -379, -89, -253, -91, -40, -293, -304, -236, -109, 92, -27, 208, 210, -59, 284, 174, 249, 201, -54, 164, -180, -260, -199, 226, -219, 48, -24, -212, -104, -31, -17, 29, 28, 119, 181, 66, -18, 79, 160, 137, 91, 83, -37, -155, 235, -25, -96, -88, 12, -286, 124, 97, 46, 224, -66, 127, 182, -274, -280, -77, -22, 43, -40, -85, 161, -527, -197, 23, 12, 314, 246, 41, -82, 361, 342, -3, 405, -5, -104, -89, -231, -109, -99, -16, -197, 97, 9, 74, 8, 61, -27, -253, 89, 101, -32, 227, -11, 317, 70, 138, -26, -174, -184, 57, -127, -306, 27, -64, 84, -107, 24, -106, 233, 83, -46, 98, 17, -80, -182, -119, 151, -55, 187, -24, -31, -225, -101, -149, -100, 78, -77, 133]
3008A33k4P2J99k15J28k26K2J01m7M2Q7k16r8k26K68K93p2r3o8pk5J89j75K12
3032B54Q5m77oJ65o5m3J4lN2l4J22r5o9k1J77m3O2l4Q6L01k58j92K54j38l01K32
3058B5l6pj4l70L93j67N0J44L5L2N6m7j73Nmr7L08R9Q1k16j8Kj76j41R8nR0j7
3086g0J53n8M07l49l37L86r7L08j59K80l79j08n9L9K29j17j05k09J57j80Q1L58
3108A71j35J47j94J74k59N63m55J9o5o7k42K39o4L2j48Q3K54j6r6K72m8r7K49
3131C17l62K01J27l64N4M4j71NN4j51K02K56R9p8l24j38K78J46k37J20N0L60l18
3154A70k20r3K06M6M0l9l92L51j56k63L13M3K86k94j05J04K59j05j07RK35k18
3176G0k86k5Q7N8J08k70J27J56k5j26K15n8M0JL1q2L8p7m5J59O4Q9l76k0o9K79
$$ y = [133, 109, 181, 380, 165, 293, 67, 89, 190, 143, 185, 272, 56, -42, -268, 0, 293, 221, 128, 60, 53, 28, 217, 42, 254, 339, -138, -144, 21, -44, -87, -73, -76, -24, -58, 64, -31, -100, -121, 56, 13, 75, 41, 127, 428, 170, -22, 232, 94, -207, 25, -11, -18, -32, -402, -9, -176, -126, 18, 53, 85, 141, 94, -79, -74, -78, -175, 133, 232, 313, 97, 79, 81, -95, -236, -138, -143, -53, -70, 83, 25, 432, 83, -254, 132, 35, 343, 184, 464, 85, -23, -82, -43, 186, 69, -36, -245, -88, -268, -187, 171, 36, 183, -11, 163, -96, 467, 12, 31, -34, -101, -343, -104, -168, -136, -284, -201, 53, 37, -59, 213, 165, 68, 317, -45, 156, 283, -81, -27, 17, -154, -149, -95, -246, -44, 212, 311, 233, -91, -229, 49, 195, -42, 78, 128, 488, 170, -50, -143, 63, 109, 149, 110, -282, 69, -87, -350, -37, 6, 292, -2, -107, -3, 256, 151, 44, 53, 288, 70, -216, -241, -154, -96, 12, -258, -131, 25, 0, -126, 89, 31, 71, 72, 103, 21, 59, -18, -63, 96, 160, 249, -127, -147, -216, 63]
3202F3k26M1n4L32J9k34j35K16J1K61k69K22k05m2O5j10j02P7Q7J0k26J06j52
3225b45K28k9K99r8p7L7J84P1j83j99J62m2k02K4J99k74j11J41j04o9J34K92k33
3248i5K98j88n5K3K64q1l20K7M09k82j17O2P2mk18J91P6q8L7M3l11J54K1J37K0
3273G5j68K4L92l0m08J50r5L51m45N9j9J40K9K59l32j12K80n4kK32j52O9K4j30
3297A37j03Nj7j99J76J77k30QM9k9K99m82J78J1N8k4O9o7J62j81J64j97J15k17
3321a38J67k14J04K26k46K13j78K24L8j24k44K81j91L10j78j86j9rK00j04O5r7
3343a00k40K54q2J37L5JO6k23q7K94J62q0K7N9j63L6J4J08l28K11k51K11J3l43
3367b69J04J54N7K9k09J68lR6r5o5J19p3J01l86lJ42J22O6jj05J31r1Q3J44k54
$$ y = [63, -163, -122, -176, 156, 175, -59, -194, 22, 33, 294, 25, 247, 42, 0, 65, -45, -147, -70, 17, 27, -199, -93, -245, -17, -46, 253, 155, 78, 115, 299, 370, 187, -12, 150, 108, -94, -70, 129, -145, -256, -115, -219, -288, -154, 138, -95, 203, 15, -40, -17, 247, 166, -154, -127, 282, 0, -117, -55, 17, 13, -205, -14, 62, -26, 11, 54, -257, -103, -82, 55, 75, -93, -69, 323, 293, -115, 35, -60, 291, -154, -95, -114, 26, 55, 314, -18, -130, 150, 96, 94, 326, 174, 243, 267, 137, 34, 39, 22, -177, -1, 176, -54, -46, 3, -26, 273, -209, -31, -20, 38, 14, 83, 16, 178, -3, 161, -36, 79, -138, 29, -185, -81, 145, -101, 112, -66, 158, 196, 72, -172, 109, -82, 228, 50, -136, -155, -164, 36, -68, -3, -100, -340, -86, -168, -31, 4, 5, 71, -152, -239, 55, 217, 137, 164, 223, 60, 96, 110, 218, -110, 101, -150, 61, 74, -269, -165, -11, 46, 75, -134, 34, 31, 127, 32, -33, 86, 13, 114, -272, -275, -133, -11, 55, 54, -51, 80, -11, 72, 216, -38]
3392c8K05j12k50L15K0j55J8k36K27N7m0j07J48r0R6j93L11j67p0K05J8l6n3j22
3416d9J9l9j68J06K80k44J00l1j41Q3j5o5M9N8M4PJ41J60m4j15m1O3l05J79M1
3441G3J3P3l79J65P9j52K0j14L61j02J16J76k57k01L80j93r3J80j06j40J4J32
3463D5O4l07J58l63K30J44j49M58l23J66J0j12P4L4q6Oq7k35J66p2K1R1j13Q0
3487a00L5K15nj5j02j53L52j76J1j16K99J2m28L92l9l15J59Q5k79L2J20j62J57
3510b1n9K52k06%k8J51j70K64k17J29R7m54J66J14Q0j32K17k76J29L0l17K55J42
3533A46M3j86m4K56p9k93L90J4k51Q3R1m18N1J56j11J60J13j68J91k58K82j5O
3556A59j46O8M5P5l10j08J42R3k58J14J74k48J53l9q1J00J12NJ15k08K69k43K01
$$ y = [-38, 167, 55, -195, 120, 140, -15, 3, -233, -6, 51, 11, -96, 52, -38, 58, -135, 176, 9, -61, 144, 162, 126, 73, -49, -30, -69, -237, -131, 149, -95, 5, -26, -167, -84, -99, -164, -115, -57, -13, -6, 135, 295, 251, 136, 95, 158, -147, 32, 73, 86, 159, -220, -55, 24, -128, -108, -222, 139, 37, 153, 329, 72, -129, 251, 58, -35, 145, 39, -101, -87, 45, 109, -198, -40, -403, -173, -29, -178, 280, -43, 123, 133, 21, 95, 129, 43, 49, -38, -273, -107, -179, -158, -67, -180, -100, -65, 150, 145, 130, 28, -125, 227, 51, 62, -54, 245, 257, -171, 221, 182, -133, 26, 111, -168, -136, -16, -178, -21, -80, 172, -34, -34, -62, 89, -81, 183, -34, 95, 192, -262, -96, 18, 98, -34, 183, -93, 36, 66, -251, 4, 146, 189, 3, -41, 215, 136, -157, 233, 247, -4, 79, 170, -248, -197, -41, -152, 8, 121, -47, 144, -114, 168, 153, 159, 13, 81, 126, 201, -109, -217, -75, 18, -240, -126, 48, -200, -47, -86, -167, -67, 45, 50, 165, -43, 226, -17, 184]
3579A84K00l82N5J1k47J7n4M8K02J00k90K08J10l82L18k67N4Q4q5p5J76J72l01
3602a44J86kn3r8K52k13j33j61L33J54m0p5P7J76p9k21J39O1l04J60r4m3P1K08
3626A57j86j09j27L75k49L20m11K73P7q2n7k4j08J38J09j95OR0K31l61J31k80
3648b82L60j89M6M5M5Jm8M42m24J28N7n7l8l34M32o2j58J79l35K22j57q2J43M9
3672a7Q1J38k20k7P9J32P4j77J9J45l77m8J37K65k44J96k29k0q0J78PJ3J49l40
3696a66K09P1j09K71j95l6r4k8Q6J2p1l1J38k99o5K50j9Q5Ql3k02K13O0Q1J25
3721B61n29K37j4m4L57l37J58q2j22J58J46J02k69N8j63p8N3J83o1K35k35k65
3743b51L60l60Q5P1j24M17l80K73q8o3R1j16k09N15k61R9j0Q4L3l57K95j66K95
$$ y = [184, 384, 2, 57, 68, -179, -162, -216, -168, 34, 134, -156, 52, 162, -220, 98, -169, -115, -31, -116, -191, -15, 157, -144, 42, 40, -13, -111, 141, -72, -205, -366, -33, 121, 81, 6, 83, 259, 180, -41, 98, 159, -145, 15, -79, -122, -51, 157, -29, -138, -265, 110, -139, 181, -230, 43, 120, 38, -19, -43, -151, -13, 96, -99, -93, -3, 228, -133, -2, -282, 78, -111, -65, -20, 25, 26, -22, 420, -4, 124, 181, 124, 86, -248, 184, 122, -36, 143, -192, 30, -127, -209, -66, -17, 64, 202, -18, -45, 34, 166, 240, 63, 82, 227, -150, -198, -61, 204, -40, 156, -73, -93, -173, 5, 12, 25, 174, -166, 43, 114, 5, 276, 81, 45, -49, -77, 9, 21, -50, -81, 57, -242, -307, -57, -76, 9, 17, -16, -218, -5, 55, 136, 261, -268, -31, -45, -89, 268, -69, 89, 7, -115, 43, 189, 291, 22, 80, -83, -161, -108, 75, 14, 249, 14, -251, 109, -251, -166, -95, -219, 198, -182, 91, 3, -60, 31, -85, -294, 221, -40, 59, 49, 133, 166, -191, 104, -62, 233]
3766B33K6j41j66j19K01P6j06n6k16J95J89J69l55K01j35J44l7m5j25J04k17N
3788a75L41k79Q7J89j98j0j1j08L70l48J44j6L10k83j4J50Pj75k61J3K51j14n0
3811a80L45j79j01M1L58L7k40j25K39k46N0P4J43j23j9k82L64k25j34Q9K2m9K17
3834G6l45K81m1J44M5j62l7n2k9K28l24M72l30oJ08k74J52n0J1Q3q4L01l6l08
3858a77J14N8K05k28J69p9k6q7j5o0J29J53j67K35k40J41k45J07j09J82o4J35
3880A31K46k86J27l49o5J19k1J6m2P2l26L97l3j24K41j50P3K0K8K63p6j81k40
3903a60M71r5j60p1j53J63k57O6K27j35K07o2J48j54N6R3O2m20K97l2l78oK39
3926e4J04j22J90j09M5J6q9j08J05l9n1Q7j8KL54j95j5o1k17L43l30L8p0O5L0
$$ y = [233, 259, 118, -48, -167, 34, 110, 4, -52, -268, -73, 116, 285, -70, 131, -4, 140, 103, 58, -67, 37, -180, -175, 166, -113, -26, 163, -35, -45, -56, -164, 206, -142, 2, -14, 296, 13, -1, 149, 156, -19, -280, -267, -16, -130, -180, 165, -14, -115, -74, 284, 321, 81, -44, 195, -51, -1, 73, 216, 93, 74, -208, 156, -69, -203, -114, -92, -141, 76, -269, 12, -29, 115, 160, -2, -39, -91, -120, 108, -216, 256, -74, -80, 28, -246, -94, -144, -133, -50, -134, 167, 131, -177, -63, -5, 200, -28, 141, 62, 36, -51, -66, -126, 3, 156, -11, 224, -16, 125, -120, -13, -122, 60, -4, 131, 377, 91, 218, -131, -196, -77, -98, -82, -124, -52, -378, 19, -14, -138, 103, -47, 26, 46, 74, 337, 261, 80, -160, 311, 216, 56, -15, -168, -5, -262, -196, 31, -104, 103, 41, 189, 35, 91, 184, 246, -174, 123, 91, -287, -293, -54, 50, -72, 118, 9, 54, 70, -19, -127, -22, -61, -112, -25, -43, -41, 313, 118, 103, 42, -175, 168, -162, -124, -194, -129, -99]
3951i9j23K86j50j83M51j43M8M3j81J69J1j59J97l29KK57K41o31K45J44k16J16
3973dJ4q7R1jJ32N4k87q4L67L9k05r3K45n3Kk08m3J66p0j44J47K22k56j16K77
3998A05k10L50l28O2Q8r0L1j15p6L37j50J98n05L6J91n6K69j50M4Q6j66j68K61
4021D4m0N5J90k69J24k70oJ20j49K40k96M4K23O9NJ71k92q3K85J87l45J31q2j76
4045a20L8Q9L3j25j3K00k58J8L28k65K09k24R2j3m6n8M52m08K7L20j2j84l63Q6
4069a97K64j75K45l38J85O0k68L55j57K15p5Q8l7l9r8j95M22l43K30l44L23k93
4091a72pk2p3L87q3j16M20k55R2k99K04J15qk57J61j94M3O5k83K40Lj54l1L28
4115A04n47K86K46k67M30l74L4O8OL48l78k1J78p5l4k94J06mK00l1j14j07L96
$$ y = [-99, -222, 64, -86, -269, 182, 39, 87, 130, -51, 118, 129, -30, 167, -162, -160, 97, 338, -293, -48, 96, -120, -4, 10, -77, 14, 13, 145, 199, -88, -172, 195, 234, 29, -64, 181, 128, 130, -78, -121, 45, -25, -169, -22, 200, -56, -172, 105, -105, 245, -83, -21, 67, -23, 8, -107, -183, 154, 4, 202, -303, -267, -76, -132, 137, -13, 31, 117, -49, -217, 44, 4, 59, 249, -20, 104, -166, -172, -52, -201, 39, -257, -213, 10, 79, 84, 255, -37, -120, 165, 352, 7, 138, 56, -120, -82, 7, 40, -85, -98, 102, -156, -138, 190, -75, 134, -90, 2, -11, -57, -115, 337, -71, -44, 276, 264, 80, -283, -197, 67, -108, 137, -201, -16, 44, -224, 131, -26, 189, 114, 202, 165, 126, 28, -167, 255, -88, 142, -202, 121, -172, -179, -201, -274, 113, 30, -86, 334, 79, 171, -128, 76, 191, 183, -74, 87, -107, -64, 1, -282, -42, -39, -193, -224, 104, -443, -157, 89, -178, 252, -122, -88, -20, -14, 334, -44, -65, 113, 38, 4, -290, -184, -188, 12, -19, -133, -240, 156]
4138A56o7k17M31j75K43k13k8j30o1J14j17j86L30l04Q9K16j28J50o4L3r8j03
4160a29N3Q5J45O4p4j53J52k71K86m63K91j0O4j29L27l76j37L88j02l2L6P4Qq3
4184A4R1k66J33K16k04J08l25M25l65J57k03M31j81j05R1l19J43K45k67O3L16
4205A98k72Q9j6K69j82k84N2o7K5K76k29q5J43K8K60l07L81k90J00j34K3K00j68
4228A0j53O7K57j94k51K51J80j7n44K61j25K48j53r7P2L30k80K57j98j05P5j01
4250b10L75p1j99K96k40J26J36j67j26Pm9K37O1r4k2j81J30J20J10l88k8L99j48
4273G4l61L92l67K95K8J1l4J62p0pM3J26Q6m56J59k83L9L25L7k84J23k1kk96J14
4298a67p2LM93k18L8M4o2k3J40j19k14K07K97n61J58J08k93K13pk61L06l5J4J00
$$ y = [156, 89, -128, 303, 128, 371, 158, 130, 0, -61, 53, -64, -250, 80, -224, -135, 81, -47, 103, 39, 72, -26, -129, -76, 9, 154, 218, 144, -9, 143, -128, 158, -305, -14, -24, 40, -89, 238, -138, -275, 113, 11, -21, 15, 89, 97, 14, 105, -161, -28, 188, -16, 92, -233, 192, -173, -16, -219, 212, 31, -74, 17, -302, -159, 86, -181, -118, 198, -74, 15, -1, 268, 86, -198, -146, -213, -188, 88, -141, -226, -83, -55, 205, -102, 279, -11, 89, -45, -22, 178, 10, -143, -76, 181, -13, -264, -13, 167, 150, -394, -133, -258, -10, -163, -260, -188, 142, -138, 119, -79, -184, -109, -210, 165, 94, -105, 191, -49, 77, 213, 46, -80, -73, -122, 115, 176, 82, 60, -121, 9, 129, 239, -149, -177, 222, 74, -287, 105, -262, 33, 61, 72, 38, 200, 130, 123, 166, 292, 378, -78, 81, -202, -163, 162, 199, -85, 38, 17, 15, -281, -167, -239, -236, 257, 39, 77, 121, 59, 36, 176, 57, -157, 50, 347, -214, -56, 52, -241, -28, -35, -296, 10, -25, -11, 89]
4322H9J5m6N7P2l19K16j75l4L08j17l74K55k2J89m31L46q8N5p6J81k56J29j03
4345a29K53k72K24k56K58k06K34P6k66p2K55j68l91M66q5l9P8J08k13J32j35N6
4367i2K52J4N9k00k56J46j56J53J96j76J74L9k17M6O4P3k17K5K41j51J35j33l
4390A6J54k34J32K3j94j06K33K7mk35M57k95j93K62O7q6J38k87K96j72K4l65M02
4413F0l44M92m27J4q8J20K97Pk66J58N9k14K64K2L8m66N9j19L89J68j14m37J52
4436a76j25K77j15K26k05Q9r0K77j3k50K8M4J05M8j43L6J67k15j70j00K61K43
4458A99k40J43k40j1K65M8k37J10j12K08Q6l28j07L34j81K3M5M0N2k49j94L8K42
4481f6K0K13o5j42N6K92m65K55K5l22R9M52k67j13j21j11L28l67L05L5J79J31
$$ y = [89, 104, 58, 115, 187, -132, 84, -91, -125, 183, 66, -308, -53, -75, 114, -317, 29, -59, -4, -80, 101, -155, -26, -129, 124, -148, 76, -180, 78, -128, 106, 182, -84, -156, 99, -69, -460, 6, -79, -118, -40, 68, -145, -13, -148, -92, 160, 174, 233, 33, -223, -77, -233, -80, 116, -60, 114, 153, -64, -18, 46, 119, -98, -73, 168, 17, 152, 19, 16, 170, -64, 68, 91, -103, -209, 24, 51, 47, -188, 269, -26, -219, 43, 110, 24, 162, -125, 171, -1, 23, -342, 60, -284, 208, -219, -205, -293, -173, 124, 131, -135, 23, 82, -132, 132, 154, 192, -274, -215, -334, 55, 223, 109, -328, -176, -301, -24, -139, 87, -118, -29, -119, 158, 145, -105, -77, -33, 72, 120, -23, 13, 180, -35, -205, -305, -44, 199, -41, 102, -138, -149, 116, 164, -73, 37, -75, 133, 219, -109, -216, 118, -63, -40, 5, 45, 97, -152, -346, -308, -66, -46, 167, 102, -40, 16, 308, -157, 98, 123, -199, -100, 352, 85, -28, -149, -260, 68, -299, 6, 41, 220, 351]
4503C51j47m43O85l52kK49n59K39mJ9J26j22m6k5r0q5K02n6K68o6j04k30L13n1
4527G0k5j29K4K58M4j39Kj74L2O1m0K9J58m49J80j4L53j67j19K07l51M11j32k30
4551a40J59J86k15o7L52l95j5M66o85M9L63O2K11k98j95J26J86j59J31j78K46
4572A90N1l34J53j10m27J89K05l6L72j96L6K02n99K52J89K14k37j82j9R2j9K5
4594A1r7n3L10k56m8K28k65k06M74k51P1j25M40k22L9L0R8j44m1K84l19k8l1K31
4618A30M0k92l01N15l6J32m6k11K42r8j36K10k56j73N8Q6K3r1M4K16m12L36J59
4641A39j20N1q4K1J74j76L35k79k43P4j78K30J32L7j06j29Ol6L81k93M4J65j72
4664b7M27n10J49j62K63Op7J95k64l04K28O2j54N01m98j45M13k29L91k77j60J58
$$ y = [351, 204, -239, 446, 94, 92, 341, -218, 21, 17, 36, 162, 40, -6, -31, -121, -206, -4, -60, 208, 142, 38, -192, 121, 70, 45, -84, -60, 198, 242, 103, 105, -69, -37, 24, -16, 13, 171, -278, -98, -112, 241, 74, -45, 162, -189, 222, 90, -140, 19, 205, -10, -77, 275, -120, -135, 331, -354, -305, 58, 120, 331, 33, -162, -36, 150, -9, 122, -56, 190, 241, -93, 60, -50, -477, -288, -83, -119, 253, 57, 93, 295, -304, -52, 137, 351, 114, -68, -87, 5, -14, 11, -86, -139, 171, -85, -133, 95, -170, -376, 98, -153, -82, -207, 233, 11, 50, 80, 178, 34, -7, 277, -42, -70, -101, 130, 170, -122, -423, 92, 56, 188, 142, -69, 173, 75, -61, 149, -107, -280, -222, -136, -113, -204, -160, 56, -356, -20, 139, 19, 70, -14, 7, 181, 5, 340, 61, -182, -108, -286, -56, 76, 113, 7, -122, -116, -152, 229, -64, -20, 145, -27, 400, -110, 39, -123, 140, 146, 69, 264, 0, -304, -76, -14, -168, 333, -165, -310, 103, -126, 265, -12, -172, -14]
4686a4J08J87l59J9K60k69P1o7j05MJ76j08K36N3l80K72n7J5j8j7J41j15j8j36
4710a21J81jm9j77Q5L84l98J70pNj67O0K91j15qJ06k04j07K96k15K0j3P5k80l1
4735b20K50j61J45K41m38Nj28J7L35k05K89k47L53n0k29NK3j12N2j17J17P8j4
4758a1K55m85N3j38K84J99m0j48J12p5k4J0kJ37N9l54K11k34K29j65J6k05j7L12
4782b1K6j18l6pM7r0J48J04J20j29m4O3m32K90K05j9k42O7K83n29L65J7Mj56J04
4807B0M1j34J83j6j73J08M9L7j2j96J03k12kN4k2L90k57Qk16N0K05p2J44j50L12
4832B42j14J59n42K69J59l11l0K94j4j95j31p1M17k13K0J91L3no4j00K15k54J9
4855b6Q1k76k4L21l00K58q1r2m2K8L09N7j42l11J52K9K21j77m9p1N0R0J85j05
$$ y = [-14, 94, 281, -78, -59, 201, -68, 3, -64, -169, -165, 11, -97, 139, 192, -188, 84, 27, 42, 24, 7, 148, 33, 15, -121, 60, 59, 10, -167, -82, 302, -96, 74, 67, 72, -95, -35, 256, 141, 133, 239, 35, -72, 224, 9, 29, 16, 91, -189, -220, 30, -131, 14, 255, -183, -178, -306, -289, 46, -159, 130, -117, 236, 186, -43, -38, -15, -127, -75, -192, -75, 3, -11, 244, -241, -188, -326, -42, 157, 117, -31, 81, 6, -18, -8, -10, 127, 186, -168, 43, -191, 38, -127, -111, -316, -333, -21, 5, -113, -149, -156, -109, -199, -51, 53, 173, 44, 0, 63, -369, -79, 126, 107, -135, -68, 215, -314, 51, 68, 72, -84, 20, 61, -73, 110, 94, -79, 29, 78, 115, 103, -93, 10, -202, -204, -150, -172, 218, -39, -31, -247, -197, 8, -64, 80, -70, 242, 128, 287, -255, 14, 173, -138, -168, 126, 112, -83, -214, -285, 132, -81, -61, 130, 163, 158, 94, -6, 209, -45, -26, 55, -221, -245, 76, -224, 34, -47, -139, -181, -153, 156, 213, 71, -240, -88, -59, 162, -15, -64, -135, -85, 5, 190, 85]
4879H5n5m4K60j67m8l06L79J56k20o3j25M46j72r7J46k8Pj30k54l14M39j00l6
4902b41L72j20O4J38l0QO9j29l89K06m7O7J06l89K62n2P1rK31k56J44k19M9L05
4926B11j84Qj42K16k33K99m5j97l7L5l8K2K28k14j46J07J72%p5K09n9M7l80K07
4950A1K56j3k19J95j85R2o0k50J27j16OK12k6k47K58j24r1J01K16j76L0k8Q7k38
4974a82M11k84P7M5j16j50n0J33P3k2k35N11o31M34L9K68p4j90M2R4j51J56j48
4997E0J41k12m1K11l70L71l68K83j43M5j61r1J87K03R6k45J26j30J80Q6j61m33
5019c76M50OJ9l76L95j99Q2K2J68j81j61K94kM6j62K24l42K25j20r5J2J23J7k02
5043a33K24k09P6j24m8J80j73J49J96L8j08P1M3l9J95m73q1J78K35p1j26p7K27
$$ y = [85, 30, -14, 246, 79, 31, -275, 104, 260, 40, -23, -148, 298, 126, 29, 175, 147, 154, 24, -230, -544, -105, -205, -241, 131, 11, 75, 213, 183, 191, 260, 131, -258, -52, -99, -32, 74, -315, -53, -105, -34, -43, 188, -68, 76, -143, -94, 211, 27, 35, -107, 109, -124, 175, 130, -67, -104, -69, -107, -85, 143, -71, -217, -110, 62, 62, -13, 196, 137, 184, -196, 11, 267, 254, 35, 230, 45, 137, 77, -173, -46, -162, -156, 56, 30, -217, 41, -83, -174, -73, 143, -33, -3, -31, 56, -182, 229, -55, 22, 67, -49, -199, -249, -116, -43, -65, -300, 211, -420, 14, 53, 321, 247, 57, 99, 193, 42, 198, 50, 191, -21, -62, 149, -221, 150, -218, 65, -78, -33, -194, -285, -98, 105, 201, -44, 82, -48, 132, 218, 57, -376, 74, 80, 99, -277, 118, -81, 1, 23, 191, 10, -151, 143, 141, 187, 25, 249, -93, 132, 12, -83, -71, 52, 69, -133, 91, -118, -42, -166, -214, -34, -207, -58, 138, 176, 68, 139, 182, 143, 338, -135, -216, -38, 197, 126, 0, -77, 150]
5066A50k35j07j6J46J8J95j08J26J22j74m73R4K08R2q5N6o6j30L57j09o5p6J17
5089C7J98j94J12nj99nK20J30m06N9J92m77L39o4k94M82m01J00J98J03l8k22L30
5112A95L4m32J59J1K73k81j72K05j64J02K07k32j58J72k25K84J77j30r5kK3M0
5134ioJ27j56p2J77p0o9K39r0k88J13P4K25k00J24j51P4J25k62j47J56K78l06
5157a14R4q2K23r2K4j31Pj30o9L52j57J32J35r0j25j30K10Nj25J35k28O7qj02
5181a99K52j17k66M66j22l59L34j18K35m7l1J00K6m05J03K15O3K8P6j86l6n0M0
5204Bj38J06K0j30J77J60L2k97J26K2j41K17j48Q3n6K4j46J73j53mL28k56j21
5227a20J83k51J93j2k16p1J74j6K51K3j46K15j25l6N3k10L09q6j22P2j46j29P5
$$ y = [150, -85, -192, -208, -62, -44, 151, 43, 169, 291, 117, -356, -262, -54, 38, -47, 9, -57, -187, 170, 61, -4, -80, 37, 235, 41, 153, 148, -51, -56, 164, 294, -112, -53, 139, -338, 1, -63, -357, 125, -276, -176, 22, 125, 87, -135, 195, 229, -203, -44, -33, 240, -41, -213, -8, -172, -70, 137, -95, -253, -81, -306, -22, 155, 25, -70, -72, -49, -9, -15, 112, -44, -116, 61, -9, -78, 161, 71, -217, -104, -30, 195, -5, 119, -32, 42, 167, -95, -242, -86, 192, -114, -20, -102, 121, 29, 53, -78, -71, -201, -270, 82, -75, 57, 192, 102, -23, -153, 57, 62, -63, 72, -156, -89, -97, -199, 53, -64, -330, 136, 14, -345, -11, -129, 106, 59, 28, 128, 154, -251, -148, 67, 130, 158, 234, 48, 12, -38, 2, -136, -30, -10, -140, 37, 197, 229, -68, 58, 80, -61, 156, 8, 91, 35, 59, -87, 86, -67, -71, 257, 1, -120, 63, -188, 5, -7, -223, -294, -120, -136, 115, 138, -8, 207, 82, 46, 99, -111, 198, 112, -10, 62, -84, -213, -138]
5250a38k5K43l73J44L14R6k40mj20p4Q2J88j13J06r4L9j62j5KJ44k0J31N4p3k66
5275a74L39j90K6r3O1J89OMj06j89N4r2R0k02J85J91j46l7n2L04l38L29J68k43
5299H4k63l7K10n7J74qj02j63J26J73k16J8k0l5J27k18J34J00J67j04n5n2o2j3
5323i2J00j43J99j56J15k23P9N2J91k3j4k32K07k34J90p1L7J70j79J25n8j62K63
5346A41j54Q8pm5j65J28P0j07J42P0k14K02m5l5j40o0j1nJ37j14R2j00M4m2J83
5371E3j29L39j74l9q4K9J31j31Q7p4k80K78j14l3L02n8J14k44J32n6M11m52J33
5394A41J2k10L02r9L8m43J60n9R1k20K91%Q4Qjl6o0O6k58N40n54K45k5J63k93
5419a17j9K84n8L5k61P9j66J90P4p6K43j56j81J34N7O7J47k0k05k44M13r0j59
$$ y = [-138, -163, 80, -293, -149, 165, 261, 21, 17, -103, -177, -95, 93, -20, 86, -8, 31, -131, -146, -144, 0, -20, 111, 165, 92, -174, 165, -25, 1, -92, -31, 158, 164, 168, 62, -127, -73, -165, -75, -277, -92, 99, -47, -84, -136, 168, -170, 159, 327, 84, -179, -216, -6, -63, 111, 103, 1, -162, -36, 137, -79, -61, -81, -116, 11, -207, -73, 27, 194, 90, 35, -17, -79, -92, 8, -135, 64, -92, 23, -200, -121, -69, 122, 99, 85, -147, 60, -174, 16, -55, -18, 152, -27, 98, 40, -122, 141, -13, 75, 68, 23, -142, -14, 56, -51, 91, 161, -53, 149, 104, 69, -71, -131, -142, -147, -10, -124, -32, -132, -88, -130, 53, -76, 263, 89, 50, -34, -5, 126, -5, 82, 8, -272, 6, -108, -141, 161, 103, 217, -27, 105, 49, 460, 8, 141, 153, -57, 245, 146, 184, -259, -99, -158, -67, -287, 4, 4, 88, 96, 95, 59, -1, 65, -193, 347, -207, 38, 13, 176, -117, -136, 148, 90, 125, -136, -57, -223, -33, 41, -35, 208, 52, -129, 5, 62, 129, 276, 256, 51, -193, 220, 130, -29]
5442b9K25J7o3k11K35j31j02r6J70O6Q3m3j94J15n7l5N6k27O1J01j35R4J25n9
5466c4p1J94j0K8l44J6R7J00K94p0m41M0M56k68j13J21Q0j16K03k59K51r3j15
5489e4k74M31q7K66k90O2L18m48j8K25k76J68k99K75P8k8J0j46Q3jj56j4m6K69
5513D8lJ37p2j44L38j83j6R7l15J52R0m0m0J0l5J67M3k61J69J30k04N8k88K13
5537E1n5p6M66k63R0k53K11j88L2M7l3O1J6Mj92n3J84j4j47J08R2j75L6l8L58
5562B69k26m09R4N29n75K90J48k36L38l25J91j05K59l36K49l02L26k6MR7n47M19
5584A26j66J93m07P3J77K81l60M4L46k43R4r1j6m2K45k17k80L02l2N4o0j3J15
5607A23j97Kqk5j1k36N70k43r9J52k58L56J19j71j27P8q7OL32j96r0J69k6k99
$$ y = [-29, 196, 213, 150, -61, 174, 43, -59, -155, 15, 81, 164, 121, -73, 42, -15, -50, 6, -221, -160, -59, -194, -100, 25, -34, -105, 89, 79, 107, -237, -221, -124, -24, 270, 200, -241, -201, 255, -13, -126, -5, 75, -41, 162, -97, 154, 61, -54, -328, 103, 16, 282, -8, 54, 372, -76, -94, 131, -145, 23, -276, -1, 77, 49, 59, -87, -4, -5, -161, -175, -221, 48, 45, 182, 110, -34, 304, 121, 105, 202, -113, 39, 129, 89, 49, 59, 24, 191, 234, -27, 142, 272, 68, 126, -162, 51, -4, -80, 386, 123, 213, -40, 171, -17, 15, 62, 29, 90, 106, 110, -82, -135, 49, 35, -112, -4, 88, -87, -51, -89, 269, 43, -366, -272, 257, -318, -28, 120, -116, 222, -103, 88, -17, 242, -94, 155, -147, 179, 153, 157, 254, -293, 126, -40, 153, -254, -181, -4, 277, -83, -39, 307, 64, 158, 67, 51, 9, 254, 37, -243, 59, 27, 81, 21, 8, 123, -74, -72, -80, -105, -116, -352, 218, -25, -124, 28, -230, 126, 245, 74, -53, 25, -62, -56, 276, 80, -10, 159, 133, -166]
5631a66L28r3J42j62J09n2l00O3J89j5l10K53m7K0n0K46j94j35KK92j23P4j66
5654i5j10M87l40K40m04K44K66k91J35o4j95p4K07L2R5J9j31l42L77k21J9O5O3
5677a8K4J62J14l23r5J10n5j38L97k01K91k91J55j56j36J06K55l3j2k35K68j96
5699gK2K0K6q8P1k1q8q9J63J63k92J46l1P4M5j74L84m08K71j7k05L70m54M0k05
5724b84K3J05K45o0%j34J8j26K73j20K23l28L78r6K87k98j17O1J69k09J3J51k31
5747e7R6J16k10R5k30J57j07J50R2k59K17J02j3j43J01p0j61K22j75J40o7k73
5769b77L94o6L2j43j11LL95jl69J4J4K52j25n2m3K73k07N3k68J96j36L79O8k61
5793A4k04J52j51K12J3J14M3m7k45J91j63J02lk04J83k57M93l31J00k38J12j11
$$ y = [-166, 162, 69, 211, 49, 158, 106, -194, -131, 58, 43, -267, -14, -61, -41, -91, 155, -39, -174, -172, 120, -3, 71, -95, -205, 282, -58, 182, -222, 22, 288, -3, 132, 68, -127, -201, 6, 38, 133, 152, 21, -321, 56, -165, -146, -81, -18, 6, 168, 282, -41, -136, -26, -81, -219, 178, -23, 268, -23, 132, -24, -160, -54, 201, 168, 156, -79, 189, -7, 15, 35, 61, -27, 44, 23, -65, -154, 9, 172, -120, 26, -5, 69, 114, -60, 324, -84, 187, 170, -35, 335, -119, -79, -284, -261, -156, 89, 29, 29, -105, -87, -213, 60, -60, 163, -165, 213, 117, 404, 106, -11, 50, 219, 10, 23, 174, -57, 39, 155, -55, 40, -190, -33, -140, 10, 102, -157, 60, 162, 149, 6, 107, 37, -124, 98, -77, 63, -4, -277, 117, 51, 83, -60, -171, -168, 227, 226, -143, -129, -115, 137, 12, -40, -83, 190, -17, 36, -232, -36, -172, 207, 275, 14, -190, -38, -189, 23, 36, 150, 193, 146, -99, 92, -71, 31, 28, -176, 7, -250, 243, -88, 12, -226, -114, -225]
5815b25M98l49N9K0L2P1Q8Q9n70n5K54J57Q6k59j03P1J15O6k38K66k48L5J2J12
5839a6N6l7J8N3l2j12K59j56p3k00N36m29o8P7K6r6k0M62l57L4J53l50K48j24
5863a48K67k10N6K26k73j64O7P8K8J90j55m4K00m8J3k64J18j10K23q5r1J89j42
5886g9J37j94j82J22J93K30k90N8J5J0Rl03L48r8K25k40n3K85k33J23P4k07m5
5909i5L6j16J62k26j12N51k48L71k20j25k70K47J29K8N1l35L27j61R2j31k76N23
5931B02k7k34j11L56k22o4pL08k98J66j86Q7J0J41O8j80j6j09j15j39K61J36m2
5954a5q2K02j82J93j39l53M03j03K24N7k10p5oR3k22J61J03j92j01L36J12j84
5976B0l06M19m42K12N0j53M68k23j92K47O5j56J54k68J08J44K3m18L26j11o7L54
$$ y = [-225, 273, -76, -17, 3, 35, 106, 194, 283, -287, -342, -88, 69, 155, -104, -207, -136, -21, 45, -193, 73, -175, -140, -128, -16, 40, 3, 21, 74, 42, -70, 189, 33, -40, -240, 296, -133, -201, -124, -98, -194, -214, 248, -109, -75, 78, -272, -24, -148, 119, -91, -35, 191, -82, -246, -179, -101, -73, 117, -38, -82, 118, 70, 83, -181, -63, -173, 50, -35, -126, 63, -79, 58, -136, -318, -196, -3, 227, -63, -5, 10, 20, 29, -274, 74, -24, 201, -39, -92, 193, -40, 83, 157, -50, -95, -59, -175, -13, -239, -351, 200, -48, 323, 103, -22, -292, -45, 84, 112, 163, -172, 155, -6, 86, -45, -321, 202, 175, -59, -170, 186, -36, -100, -107, 201, -97, 69, -117, -30, -20, 121, 189, 9, -7, -116, -231, -370, -109, 27, -15, -97, 105, -77, 116, -23, -376, 27, -76, 148, 205, -5, -80, -86, 7, -215, -54, 49, -143, -244, 92, 204, 20, -286, 133, -309, -97, -47, -200, 268, 45, -147, 100, 165, 9, 163, -105, 3, 147, 170, -248, 78, -33, -100, 254]
5998B54j65m5K89m46L46j08j00J44P7j64k2nj95j77L02j72J47K33k24K7K11n01
$$ y = [254, 89, 44, 333, -113, 233, 125, 25, 169, 246, 82, 60, 55, -140, -317, -15, -187, -40, 193, -31, -4, 207, -294]
$$ [...]
8191A16
##END NTUPLES=NMR FID
##END=
