##TITLE=1H_Pr 5270
 200.13MHz, CDCl3,
 8 sc
 
 15.1.2025
##JCAMPDX= 6.0         $$ Bruker NMR JCAMP-DX V2.0
##DATA TYPE= NMR FID
##DATA CLASS= NTUPLES
##ORIGIN= UXNMR, Bruker Analytische Messtechnik GmbH
##OWNER= pz
$$ XWIN-NMR		Version 3.5
$$ Wed Jan 15 15:42:21 2025 Russian Standard Time (UT+4h)  she@DPX200
##.OBSERVE FREQUENCY= 200.1313
##.OBSERVE NUCLEUS= ^1H
##.DELAY= (6, 6)
##.ACQUISITION MODE= SIMULTANEOUS
##.ACQUISITION SCHEME= undefined
##.AVERAGES= 8
##.DIGITISER RES= 18
##SPECTROMETER/DATA SYSTEM= spect
##.PULSE SEQUENCE= zg30
##.SOLVENT NAME= DMSO
##.SHIFT REFERENCE= (INTERNAL, DMSO, 0, 14.3821)
##AUDIT TRAIL= $$ (NUMBER, WHEN, WHO, WHERE, WHAT)
$$ ##TITLE= Audit trail, XWIN-NMR		Version 3.5
$$ ##JCAMPDX= 5.01
$$ ##ORIGIN= Bruker BioSpin GmbH
$$ ##OWNER= she
$$ F:/spectra/data/she/nmr/H-C/1/audita.txt
$$ ##AUDIT TRAIL=  $$ (NUMBER, WHEN, WHO, WHERE, WHAT)
(   1,<2025-01-15 15:40:56.37 +0400>,<she>,<DPX200>,
      <created by zg, POWCHK disabled, PULCHK disabled
       configuration hash MD5:
       00 E9 B6 7A A2 85 ED C7 34 08 36 98 17 FE 4E 26
       data hash MD5: 16K
       5D CE 57 96 5C 9B FC FD 1F AB F0 3F 0E CE AA 9E>)
$$ ##END=
$$ 
$$ hash MD5
$$ 7F 58 9A 71 58 F6 BA 93 FD 14 10 C6 CE A9 0A 6D
##$RELAX= 
##$RELAX= 
##$RELAX= 
##$RELAX= 
##$RELAX= 
##$RELAX= 
$$ Bruker specific parameters
$$ --------------------------
##$DU= <F:/spectra>
##$EXPNO= 1
##$NAME= <H-C>
##$PROCNO= 1
##$TYPE= <nmr>
##$USER= <she>
##$AMP= (0..31)
100 100 100 100 100 100 100 100 100 100 100 100 100 100 100 100 100 100 
100 100 100 100 100 100 100 100 100 100 100 100 100 100 
##$AQSEQ= 0
##$AQ_mod= 1
##$AUNM= <au_zg>
##$AUTOPOS= <>
##$BF1= 200.13
##$BF2= 200.13
##$BF3= 200.13
##$BF4= 200.13
##$BF5= 200.13
##$BF6= 200.13
##$BF7= 200.13
##$BF8= 200.13
##$BYTORDA= 1
##$CFDGTYP= 0
##$CFRGTYP= 5
##$CHEMSTR= <none>
##$CNST= (0..31)
1 1 145 1 1 1 1 1 1 1 1 1 1 1 1 1 1 1 1 1 1 1 1 1 1 1 1 1 1 1 1 1 
##$CPDPRG= <>
##$CPDPRG1= <>
##$CPDPRG2= <>
##$CPDPRG3= <>
##$CPDPRG4= <mlev>
##$CPDPRG5= <mlev>
##$CPDPRG6= <mlev>
##$CPDPRG7= <mlev>
##$CPDPRG8= <mlev>
##$CPDPRGB= <>
##$CPDPRGT= <>
##$D= (0..31)
0 0.7 0 0 0 0 0 0 0 0 0 0.03 0 0 0 0 0 0 0 0 0 0 0 0 0 0 0 0 0 0 0 0 
##$DATE= 1736941255
##$DBL= (0..7)
120 120 120 120 120 120 120 120 
##$DBP= (0..7)
150 150 150 150 150 150 150 150 
##$DBP07= 0
##$DBPNAM0= <>
##$DBPNAM1= <>
##$DBPNAM2= <>
##$DBPNAM3= <>
##$DBPNAM4= <>
##$DBPNAM5= <>
##$DBPNAM6= <>
##$DBPNAM7= <>
##$DBPOAL= (0..7)
0.5 0.5 0.5 0.5 0.5 0.5 0.5 0.5 
##$DBPOFFS= (0..7)
0 0 0 0 0 0 0 0 
##$DE= 6
##$DECBNUC= <off>
##$DECIM= 32
##$DECNUC= <off>
##$DECSTAT= 4
##$DIGMOD= 1
##$DIGTYP= 9
##$DL= (0..7)
0 120 120 120 120 120 120 120 
##$DP= (0..7)
150 150 150 150 150 150 150 150 
##$DP07= 0
##$DPNAME0= <>
##$DPNAME1= <>
##$DPNAME2= <>
##$DPNAME3= <>
##$DPNAME4= <>
##$DPNAME5= <>
##$DPNAME6= <>
##$DPNAME7= <>
##$DPOAL= (0..7)
0.5 0.5 0.5 0.5 0.5 0.5 0.5 0.5 
##$DPOFFS= (0..7)
0 0 0 0 0 0 0 0 
##$DQDMODE= 0
##$DR= 18
##$DS= 0
##$DSLIST= <SSSSSSSSSSSSSSS>
$$ [...]
##$SUBNAM0= <"">
##$SUBNAM1= <"">
##$SUBNAM2= <"">
##$SUBNAM3= <"">
##$SUBNAM4= <"">
##$SUBNAM5= <"">
##$SUBNAM6= <"">
##$SUBNAM7= <"">
##$SUBNAM8= <"">
##$SUBNAM9= <"">
##$SW= 18.0517328524113
##$SWIBOX= (0..15)
0 0 2 0 0 0 0 0 0 0 0 0 0 0 0 0 
##$SW_h= 3612.71676300578
##$TD= 16384
##$TD0= 1
##$TE= 0
##$TE2= 300
##$TE3= 300
##$TEG= 300
##$TL= (0..7)
0 120 120 120 120 120 120 120 
##$TP= (0..7)
150 150 150 150 150 150 150 150 
##$TP07= 0
##$TPNAME0= <>
##$TPNAME1= <>
##$TPNAME2= <>
##$TPNAME3= <>
##$TPNAME4= <>
##$TPNAME5= <>
##$TPNAME6= <>
##$TPNAME7= <>
##$TPOAL= (0..7)
0.5 0.5 0.5 0.5 0.5 0.5 0.5 0.5 
##$TPOFFS= (0..7)
0 0 0 0 0 0 0 0 
##$TUNHIN= 0
##$TUNHOUT= 0
##$TUNXOUT= 0
##$USERA1= <user>
##$USERA2= <user>
##$USERA3= <user>
##$USERA4= <user>
##$USERA5= <user>
##$V9= 5
##$VALIST= <valist>
##$VCLIST= <CCCCCCCCCCCCCCC>
##$VD= 0
##$VDLIST= <DDDDDDDDDDDDDDD>
##$VPLIST= <PPPPPPPPPPPPPPP>
##$VTLIST= <TTTTTTTTTTTTTTT>
##$WBST= 1024
##$WBSW= 4
##$XGAIN= (0..3)
0 0 0 0 
##$XL= 0
##$YL= 0
##$YMAX_a= 105807
##$YMIN_a= -128096
##$ZGOPTNS= <>
##$ZL1= 120
##$ZL2= 120
##$ZL3= 120
##$ZL4= 120
##$ABSF1= 10
##$ABSF2= 0
##$ABSG= 5
##$ABSL= 3
##$ALPHA= 0
##$AQORDER= 0
##$ASSFAC= 0
##$ASSFACI= 0
##$ASSFACX= 0
##$ASSWID= 0
##$AUNMP= <proc_1d>
##$AZFE= 0.1
##$AZFW= 0.1
##$BCFW= 1
##$BC_mod= 2
##$BYTORDP= 1
##$COROFFS= 0
##$CY= -3
##$DATMOD= 1
##$DC= 2
##$DFILT= <>
##$DTYPP= 0
##$F1P= 0
##$F2P= 0
##$FCOR= 0.5
##$FTSIZE= 0
##$FT_mod= 4
##$GAMMA= 1
##$GB= 0.15
##$INTBC= 1
##$INTSCL= 1
##$ISEN= 128
##$LB= 0.25
##$LEV0= 0
##$LPBIN= 0
##$MAXI= 10000
##$MC2= 0
##$MEAN= 0
##$ME_mod= 0
##$MI= 1.114404
##$NCOEF= 0
##$NC_proc= 0
##$NLEV= 6
##$NOISF1= 3.799351
##$NOISF2= 2.8
##$NSP= 1
##$NTH_PI= 0
##$NZP= 0
##$OFFSET= 14.38212
##$PC= 1
##$PHC0= 254.245
##$PHC1= 8.9922
##$PH_mod= 1
##$PKNL= yes
##$PPARMOD= 0
##$PSCAL= 0
##$PSIGN= 0
##$REVERSE= no
##$SF= 200.129724274929
##$SI= 16384
##$SIGF1= 3
##$SIGF2= 2
##$SINO= 400
##$SIOLD= 16384
##$SREGLST= <1H.CDCl3>
##$SSB= 0
##$STSI= 0
##$STSR= 0
##$SW_p= 3205.1282051282
##$SYMM= 0
##$S_DEV= 0
##$TDeff= 0
##$TDoff= 0
##$TI= <>
##$TILT= no
##$TM1= 0
##$TM2= 0
##$TOPLEV= 0
##$USERP1= <user>
##$USERP2= <user>
##$USERP3= <user>
##$USERP4= <user>
##$USERP5= <user>
##$WDW= 1
##$XDIM= 8192
##$YMAX_p= 0
##$YMIN_p= 0
$$ End of Bruker specific parameters
$$ ---------------------------------
##NTUPLES= NMR FID
##VAR_NAME=  TIME,          FID/REAL,        FID/IMAG
##SYMBOL=    X,             R,               I
##VAR_TYPE=  INDEPENDENT,   DEPENDENT,       DEPENDENT
##VAR_FORM=  AFFN,          ASDF,            ASDF
##VAR_DIM=   8192,          8192,            8192
##UNITS=     SECONDS,       ARBITRARY UNITS, ARBITRARY UNITS
##FACTOR=    0.0002768,     1,               1
##FIRST=     0,             0,               0
##LAST=      2.2672688,     0,               0
##MIN=       0,             -128096,         0
##MAX=       2.2672688,     105807,          0
$$ Real data points
##PAGE= N=1
##DATA TABLE= (X++(R..R)), XYDATA
0 0 0 0 0 0 0 0 0 0 0 0 0 0 0 0 0 0 0 0 0 0 2 -5 8 -8 8 -8 8 -8 12 -16 16 -16 20 -24 25 -29 32 -36 40 -45 51 -55 62
43 62 -67 73 -81 90 -99 108 -122 133 -147 161 -179 198 -220 246 -275 308 -351 399 -462 543 -654
64 -654 807 -1041 1440 -2238 4422 -23665 -60828 9871 39887 56502 91500 103442 105807 56923
78 56923 1069 21424 -16157 -96179 -87273 -66967 -70126 -59343 -44385 -2574 -10537 -56974 -3308
91 -3308 42836 7973 31243 81859 82803 54443 18183 21539 -3547 -84815 -65172 -7878 -45725
104 -45725 -60243 -25937 -20283 -32736 -41461 -268 32765 -18001 -10625 59165 42332 16550 33706
117 33706 22221 -10554 -45502 -30130 16305 -14212 -34469 9536 -6985 -41094 -23391 -10124
129 -10124 -3092 -14680 -14639 29923 19840 -16534 10153 11644 -13398 -5906 2233 19806 17846 -5911
143 -5911 21815 27715 -18739 -19205 -10512 -23100 -18721 -14746 7531 15071 -26933 -20638 8712 -13628
157 -13628 -8877 22423 29819 30594 19231 30028 45580 -1221 -20072 5561 -17393 -33941 -11923
170 -11923 -2259 -3854 -24080 -23946 7106 -12962 -23132 26330 34196 20745 35897 40520 33859
183 33859 6571 -13651 9061 -6250 -36002 -8014 -2010 -23946 -18648 -13030 -5122 -7882 -18256
196 -18256 15741 31613 11577 32163 41908 17394 8512 -1257 -2014 -1922 -24140 -12728 2514 -22506
210 -22506 -19113 -4567 -12423 -7567 -5616 4675 26431 13080 14442 33669 11948 -1453 4146
223 4146 -5339 -5280 -12023 -15470 4086 -9079 -21965 337 -4786 -13566 1060 5082 14951 14384 4537
238 4537 21236 12502 -12136 1947 749 -13316 -5953 -6741 -1660 -904 -16333 -1620 3885 -15181
252 -15181 204 11757 3320 10468 7623 6762 9993 -9680 -5663 5230 -12858 -6635 4248 -4722
266 -4722 129 -2987 -6038 4701 -6298 -5572 12115 1542 1751 10752 154 1977 -1225 -9961
280 -9961 2501 -3081 -9115 7093 561 -3793 5019 -4088 -746 2864 -7382 5094 6390 -4666
294 -4666 6004 2390 -5560 1851 -6708 -4107 4575 -6246 1874 8576 -4092 3088 3500 -4939 4276
309 4276 -1755 -3371 7942 -3079 -3088 5253 -6968 -3632 -407 -7843 2913 1524 -4304 8723 1910
324 1910 -2763 6875 -1377 177 5381 -4536 3378 3794 -8256 1974 183 -8429 66 -4029 -3530
339 -3530 3977 -5059 1712 8403 -4598 2789 7115 -1859 4597 1513 -944 6443 -5528 -4986 5354
354 5354 -7272 -5149 2969 -4830 -638 -2239 -5143 7069 -253 -2921 11671 2074 -2600 6173
368 6173 438 2907 708 -7479 3085 -1769 -10580 4886 1710 -7287 -1111 -4375 -1198 2642 -4190
383 -4190 8714 9525 -4821 5515 7055 -4296 -542 -2654 -1177 2693 -8591 -178 6731 -9251
397 -9251 -3143 5048 -3614 -1182 -2050 1135 10780 494 2945 11817 -5606 -8927 897 -2510 651
412 651 -1449 -3317 5120 -5239 -6546 10747 2302 -5787 2766 1161 4146 3290 71 10037 -228
427 -228 -12866 2436 603 -8274 -714 270 2650 1034 -6279 6751 6277 -7600 6524 11697 -536
442 -536 307 -1117 -144 1262 -7882 2292 6242 -12865 -6112 5934 -468 1590 910 1248 3913 -5530
458 -5530 3758 18103 1232 -4625 2222 -6033 -6492 -4403 -1177 6580 -5338 -6878 9573 369
472 369 -7015 3445 777 336 751 748 11361 2253 -8717 5404 -70 -13176 -6536 -4550 -1450
487 -1450 1668 44 11755 6087 -12363 -1247 4423 -4128 1028 2682 1232 -1188 -9555 1243
501 1243 5519 -14033 -9679 -43 -6803 -927 6046 9142 8710 -5040 -1112 9042 -6460 -6467 5738
516 5738 -2097 -6050 -5259 -4168 -834 -12064 -10482 6265 -2143 -6182 7772 5896 2776 3942 4025
531 4025 9897 -1239 -9935 4648 149 -10010 -1638 -3645 -9069 -9702 -9001 4477 4217 -5659 6439
546 6439 8429 -2707 4561 8804 6606 4867 -2683 4264 5914 -9905 -4500 1049 -10857 -8381
560 -8381 -2665 188 3648 -3437 2629 11365 -2532 -1390 9770 3318 2510 6598 7348 8823 -3563
575 -3563 -6209 4723 -6435 -10235 3665 1339 -2272 250 858 6340 -1555 -6813 7397 3406
589 3406 -3818 9116 10309 4703 3148 -639 4815 235 -8154 5118 6157 -5098 1900 3534
603 3534 -2494 -3677 -7472 -626 2110 -6536 4070 10817 -256 2906 5722 2258 3163 -1448 3670
618 3670 10005 -2121 -554 6415 -5892 -8691 -5744 -6985 -3015 -6387 -3182 7808 -1197 -3623
632 -3623 7366 1901 -10 4984 4892 9477 3999 -868 6896 -1956 -11824 -3890 -6197 -9562 -5598
647 -5598 -5134 578 -1611 -7980 2698 2807 -5370 4949 8535 5321 7095 3341 5345 2498 -9651
662 -9651 -3413 -915 -11865 -5812 -1427 -5468 -3352 -6304 -3288 949 -6785 491 10199 2552 4634
677 4634 9111 3365 2201 -2513 -3528 2251 -6554 -6862 3389 -4381 -6794 -2286 -5745 -3283 -3805
692 -3805 -3504 6816 3173 -22 9839 5170 -239 2599 -967 588 370 -3820 3623 1199 -7803
707 -7803 -921 -2017 -7012 -1807 -2451 815 3501 -1851 4834 6801 -3078 1685 3526 -1670 2374
722 2374 1323 2306 4296 -4429 -2154 2181 -6633 -3561 1999 -1937 1350 816 486 4444 -2932 -2590
738 -2590 5600 -964 -428 5617 1595 2338 955 -1970 2977 -2794 -5632 3578 -295 -2521 3982 -173
754 -173 -967 -1004 -4586 2523 1418 -3116 5375 3552 -1323 3699 137 -1094 243 -4484 1437 3109
770 3109 -3575 2145 2131 -4976 -1011 -1872 -2148 2024 -2077 1787 6139 -1441 1806 3800 -3342 -797
786 -797 -622 -1904 3250 -1598 -1603 3218 -4076 -3604 1717 -3318 -499 1945 60 5609 1800 -1317 5013
803 5013 -959 -3501 2221 -2164 -1177 833 -3163 799 -1052 -5986 1005 -1249 -3869 3791 2457
818 2457 2143 5007 -134 2019 1835 -3983 1636 1444 -4186 599 -1178 -3915 -124 -4449 -2187 1545
834 1545 -4119 1646 5178 540 4929 4366 -64 2922 -1535 -1815 3066 -2834 -1415 2084 -5342 -2673
850 -2673 -1047 -4997 -54 -1036 -1659 5171 1524 1436 6748 425 826 2962 -2454 481 453 -3067 2024
867 2024 -1002 -4394 373 -3904 -4296 1593 -1801 1451 3817 -985 3148 2450 -1729 3846 1037 -2433
883 -2433 1639 -1780 -1023 2364 -2780 -470 -119 -5261 318 1126 -2284 3056 699 -1187 2913 -1486
899 -1486 -57 3284 -2636 996 2601 -2517 1574 602 -2640 1891 -1421 -1092 2466 -2830 -740 2837
915 2837 -2544 495 1012 -3171 771 -496 -1100 4451 -326 -1221 3196 -2223 -565 2480 -1599 1366
931 1366 260 -2682 2782 -675 -3245 2241 -2342 -2947 1384 -1563 1001 2088 -1799 2794 916
946 916 -3453 2623 325 -2031 2350 -421 330 1583 -3387 495 1366 -4382 1131 1516 -2574 1787
962 1787 425 298 3265 -2396 -146 2720 -3703 -116 2783 -1413 1245 -114 -1440 2638 -2096
977 -2096 -1100 3793 -2085 -819 3430 -875 1036 495 -1501 2385 -1709 -3010 3530 -931 -2175 3123
993 3123 -72 513 1101 -1737 2828 773 -3082 4246 1619 -2301 1756 -493 -902 41 -3401 974
1009 974 1646 -3886 2174 2649 -2803 1268 654 -20 1778 -2047 1466 4000 -3111 503 2976 -2377
1025 -2377 -776 -633 -1231 1623 -2485 -650 3961 -3097 -1917 2610 -2108 -880 223 -613 3126 -1054
1041 -1054 -1557 4536 -1247 -3070 2381 -622 -640 629 -1540 2544 -865 -4499 2026 -1132 -4778 522
1057 522 -4 -888 933 -1450 2382 1276 -4251 2130 2558 -2701 1467 1480 -460 262 -3668 -808 717
1074 717 -6483 -1180 2332 -3003 -678 795 -619 1257 -2219 268 4917 -2099 -375 5165 -530
1089 -530 -538 292 -1682 -261 -3705 -3068 3813 -2074 -3273 2590 -874 -1693 35 -455 2815 228 -1923
1106 -1923 4921 1668 -2758 2474 513 -1686 -325 -1692 2027 804 -4282 2159 1444 -4424 402
1121 402 823 -855 1160 -919 2621 3162 -3784 525 3437 -1946 613 2598 566 1296 -1750 491
1137 491 3714 -3465 -2043 2759 -2469 -1208 1654 370 1550 -2120 -1938 4133 -902 -1021 5498 1516
1153 1516 50 1916 492 2000 -1419 -3466 2828 -408 -3837 2296 310 -2557 -822 -1616 1366
1168 1366 675 -3080 4087 4013 -793 3907 2655 -1055 -723 -2684 638 2117 -3648 949 1788 -4677
1184 -4677 -1601 707 -1769 -202 -1850 907 4606 -797 1272 4671 -2193 -1827 557 -723 671
1199 671 -1467 -1194 3011 -2094 -2937 2166 -2405 -2853 436 -11 2330 678 -1247 3622 -359 -3469
1215 -3469 1988 -81 -2133 297 -1042 1518 702 -3239 1508 440 -4417 1255 2061 -713 1065
1230 1065 -1205 696 1261 -3401 441 1629 -3409 -203 1480 -765 968 -1220 -262 2036 -2677
1245 -2677 87 4076 -1296 -180 1661 -584 505 -1420 -1789 1847 -2304 -2032 3166 -910 -1490 1004
1261 1004 -1414 911 391 -903 3851 579 -1867 3148 81 -1928 750 -1648 19 633 -2437
1276 -2437 1967 711 -3947 593 -80 -2121 660 -603 951 2575 -1248 2142 3034 -2445 780
1291 780 1585 -929 1092 -119 -665 1770 -2764 -1604 1433 -2933 -1327 1052 -1242 1508 266 -565
1307 -565 2996 -421 -559 3558 -137 -95 2452 -700 798 -94 -2699 1083 -1402 -3138 1048 -955
1323 -955 -1776 1189 -1012 39 947 -1542 2312 2168 -1225 2852 1715 -357 1871 -897 -588 810
1339 810 -2830 -655 758 -2969 -362 -195 -2512 370 -963 -794 2601 -491 788 3454 -308 1313
1355 1313 2520 -710 1383 361 -1922 1562 -1216 -2343 382 -2653 -2077 -27 -2737 265 904
1370 904 -1122 2620 1354 -116 2866 1094 728 2605 -382 808 1216 -2538 -321 -785 -3752 -831
1386 -831 -1889 -2390 766 -1491 -16 2462 -344 1376 2796 -23 2235 2127 -229 2364 -514 -1700
1402 -1700 834 -2338 -2574 -474 -2517 -980 -13 -2223 1196 853 -1206 2718 862 226 2793 415
1418 415 969 1843 -1608 319 -3 -3022 -152 -713 -2390 643 -818 -654 1851 -1276 531 2304
1434 2304 -1309 1045 1762 -659 1028 -246 -702 1400 -1837 -1426 1594 -1235 -497 1326 -1144 557
1450 557 286 -1152 1491 -726 -1529 1937 -826 -1349 1021 -1179 138 335 -1522 1477 622 -1914
1466 -1914 2015 807 -868 1443 -471 -117 155 -2337 372 752 -3139 435 296 -1298 892 196
1482 196 534 1422 -1262 654 2587 -1107 592 1595 -1374 14 -1019 -1210 1345 -1912 -1232 1728
1498 1728 -1438 -851 1874 -430 503 119 -260 2171 -331 -1578 2256 -165 -1340 961 -1043 -117
1514 -117 -70 -1352 2075 628 -1560 1788 237 -1260 814 -243 86 -96 -2328 715 732 -2078 850
1531 850 1024 -1400 734 176 1077 2091 -983 1103 2664 -1925 -163 1266 -1646 -504 -1340 -1402 598
1548 598 -2316 -1454 2068 -1040 -147 2530 560 1319 1569 735 3203 91 -1367 1467 -1334 -2389
1564 -2389 362 -1141 -1558 -1796 -2843 636 -257 -1345 2657 1668 113 2506 1592 1752 1511 -1043 1147
1581 1147 463 -2802 208 98 -2814 -1266 -1716 -1315 274 -2109 314 2553 -800 1777 2881 -143
1597 -143 656 503 306 1757 -952 -775 1386 -2447 -1908 344 -1800 -1523 -1298 -1433 1506 -62 -180
1614 -180 3023 231 -1116 1504 359 786 800 -654 1513 -170 -2088 965 -362 -2715 -264 -1010
1630 -1010 -384 -91 -1257 916 1166 -1735 1315 1280 -1357 737 656 919 1458 -871 486 895 -2524
1647 -2524 -405 917 -1659 -682 -438 -1134 568 -1424 -124 1697 -1476 -436 2204 38 832 793
1663 793 -34 1683 -595 -762 2112 -907 -1948 709 -1222 -1008 -168 -1209 801 -191 -1581 2331
1679 2331 843 -1038 1519 443 69 1492 -588 1128 722 -2016 867 436 -2366 -246 -656 -792
1695 -792 588 -848 539 1670 -1327 645 1717 -736 1093 868 265 1433 -674 -389 1067 -1921
1711 -1921 -1212 772 -1638 -370 330 -745 1104 -270 -540 2277 -114 -447 2039 -180 17 610
1727 610 -572 306 -440 -2261 678 -518 -1996 783 -512 -504 877 -453 1118 1195 -1162 1419 1110
1744 1110 -801 1221 259 -920 -7 -1554 -439 405 -2145 -76 831 -1546 339 485 -210 1084
1760 1084 -21 392 1798 -636 322 1468 -1436 -574 306 -1402 163 -686 -1457 764 -995 -1040 926
1777 926 -740 -276 1398 -2 1057 620 -943 1430 350 -1126 987 -594 -755 621 -1141 -196
1793 -196 330 -1739 354 227 -1301 1012 365 -377 1231 -355 533 1048 -870 485 924 -927 563
1810 563 289 -1090 731 -671 -1099 1130 -1531 -478 918 -1351 158 586 -518 805 117 -376
1826 -376 1717 181 111 1749 -532 -8 762 -929 0 -407 -1416 307 -840 -1452 635 -786 -859
1843 -859 988 -390 362 1283 -60 1481 1223 -142 1669 174 -924 967 -1083 -993 -106 -2102 -632
1860 -632 -284 -1908 150 -254 -1005 1311 493 235 2146 791 1111 1688 -578 657 698 -1351 60
1877 60 -922 -2182 154 -1298 -1387 576 -1067 -257 1225 -569 906 1153 -13 1630 576 -304 1446
1894 1446 -265 -324 859 -1417 -866 -98 -1622 10 63 -1156 446 -432 -719 1523 -322 236 1505
1911 1505 -581 820 973 -529 888 252 -1059 843 -483 -986 635 -1008 -687 319 -1323 42
1927 42 209 -1531 649 484 -909 1402 135 4 1219 -511 897 1380 -784 741 703 -1170 695
1944 695 -431 -1570 127 -1337 -1352 604 -1123 151 1187 -652 533 997 24 1871 332 240 1783
1961 1783 -117 -343 970 -1488 -918 -620 -1956 -146 -600 -1317 751 -187 -600 1499 -266 -15 1548
1978 1548 262 1342 1354 -565 728 -166 -1586 323 -579 -1302 -32 -1463 -245 356 -1125 315
1994 315 568 -928 926 1002 11 1471 -272 -80 881 -888 -1 643 -1232 -329 151 -1193 508 -366
2012 -366 -849 809 -658 -343 1483 -538 182 920 -658 842 112 -843 1022 -152 -510 1287 -382
2029 -382 -772 438 -1027 77 383 -804 609 -45 -1374 739 33 -880 684 -511 -77 841 -1021
2046 -1021 1223 935 -838 495 108 -689 514 -701 -588 669 -1534 156 902 -1568 -335 62
2062 62 -1116 818 96 -294 1504 -397 139 1349 -893 -54 503 -830 211 37 -937 706 -920
2079 -920 -1094 835 -484 -587 1033 -276 295 594 -355 1096 278 -696 1237 30 -594 979 -572
2096 -572 262 -45 -989 537 292 -1495 611 -19 -827 606 -170 -19 615 -1017 394 1052 -977 489
2114 489 438 -696 576 -212 -436 877 -785 -314 1208 -899 -249 829 -1050 50 -321 -884 694
2131 694 -589 -732 1351 -378 -403 1044 -231 260 624 -361 1105 73 -680 1192 -199 -737 654
2148 654 -644 -231 42 -1065 382 314 -772 824 480 -559 1103 169 236 1087 -663 308 638 -1557
2166 -1557 336 311 -1345 -260 -333 -513 403 -918 -205 1462 -837 -71 1307 -371 268 505 -204 892
2184 892 -506 -831 1061 -781 -787 676 -980 -289 330 -496 672 93 -520 1166 176 -434 1163 82
2202 82 -120 569 -725 603 144 -1135 715 85 -1218 523 -173 -227 311 -789 291 733 -1065 586
2220 586 696 -636 388 339 -182 982 -434 -45 1138 -1000 -55 928 -1034 -264 52 -601 803 -318
2238 -318 -504 1237 -647 -387 675 -693 -52 684 -563 739 259 -793 965 -161 -865 751 -514
2255 -514 -258 308 -781 157 68 -840 544 158 -847 916 428 -228 927 -310 267 692 -1185 346
2273 346 457 -1203 299 -334 -622 541 -610 -134 783 -1056 164 807 -618 596 489 -220 593
2290 593 -288 -725 808 -673 -576 753 -782 -170 519 -565 813 191 -370 1032 -13 -398 1253
2307 1253 11 -267 493 -542 97 -89 -1452 549 -248 -929 529 54 -481 667 -15 356 1076 -582
2325 -582 373 609 -609 548 6 -775 299 -899 -601 476 -1039 15 659 -1017 242 541 -258
2342 -258 1115 411 -57 1158 -335 -163 534 -676 -180 186 -1097 -14 -59 -1054 719 -392 -779 995
2360 995 -227 -106 991 -437 670 617 -593 889 121 -1018 540 -115 -957 299 -821 -22 367
2377 367 -922 411 306 -846 465 175 -395 900 -64 16 781 -425 -4 762 -824 264 74 -635
2395 -635 350 -502 -680 309 -814 -245 682 -590 123 667 -538 395 342 -430 699 132 -386 686 -140
2414 -140 -451 548 -898 -248 19 -1143 205 -299 -836 405 -24 -2 892 -329 -106 1041 -111 518
2432 518 672 -632 820 -175 -550 365 -443 -501 222 -687 -661 484 -841 76 352 -709 781 301 -53
2451 -53 1326 189 78 895 -456 65 345 -767 247 -140 -892 112 -593 -749 481 -624 32 698
2469 698 -184 363 1012 -395 632 763 -208 785 -103 -337 764 -832 -340 548 -1218 -211 -78 -933
2487 -933 167 -263 -735 972 -38 -303 788 -393 103 744 -619 497 600 -738 601 -108 -786
2504 -786 309 -453 -387 258 -625 -263 282 -512 451 362 -786 956 106 -194 766 -220 258 853 -781
2523 -781 -116 645 -1154 98 64 -1041 102 -340 -669 482 -740 -60 601 -350 -57 606 -225 746
2541 746 22 -174 876 64 -168 403 -572 -363 293 -841 103 22 -1191 407 37 -697 775 -34 -429
2560 -429 579 31 540 774 -770 828 227 -458 473 -359 -818 522 -442 -587 204 -818 -8 535
2578 535 -640 536 273 -272 976 -128 -94 691 -408 81 837 -895 -137 149 -512 264 -126 -820
2596 -820 516 -748 -444 578 -332 -329 633 -467 369 471 -578 877 115 -267 824 -160 -471 294
2614 294 -508 -369 311 -703 118 58 -1031 145 153 -636 673 -168 70 685 -359 541 932 -471 89
2633 89 621 -354 124 -273 -493 379 -693 -271 529 -487 -338 193 -534 292 118 -46 772 94 -179 919
2653 919 -283 -274 756 -484 192 123 -809 402 -524 -796 458 -169 -361 402 -181 327 398 -182 685 271
2673 271 -573 505 148 -358 321 -242 -152 186 -955 -25 249 -875 -155 -144 -313 370 -10 -103 768 -379
2693 -379 107 967 -449 117 465 -549 318 50 -758 355 -457 -753 660 -631 -223 272 -276 198
2711 198 199 -358 757 241 -577 516 102 -199 655 -85 178 366 -739 -6 445 -747 637 79 -617
2730 -617 486 -214 -121 225 -667 122 632 -537 344 407 -416 326 167 -241 488 -382 81 458 -310 -52
2750 -52 228 -444 -185 -70 -305 548 -238 -380 719 -421 -95 755 -398 -68 308 -441 432 40 -363
2769 -363 680 -219 -260 472 -517 -256 360 -569 429 381 -310 317 255 -495 620 -228 -154 366 -532 51 774
2790 774 -430 257 437 -396 231 -277 -504 255 -230 28 675 -590 91 412 -603 84 132 -450 909
2809 909 -149 -369 728 -260 -39 740 -401 232 253 -278 136 -314 -697 301 -282 -499 403 -398 -97
2828 -97 337 -426 475 493 -338 407 329 -115 773 -150 -177 238 -442 -101 178 -623 97 67 -623 223 -163 -444
2850 -444 477 -162 122 521 -527 -37 630 -489 263 272 -550 183 -50 -343 472 -589 -554 466 -741
2869 -741 206 365 -521 197 258 -290 868 74 -319 503 -305 -145 242 -621 203 148 -769 311 -96 -395
2889 -395 366 -272 -228 440 -319 110 271 -377 402 103 -151 420 -76 -229 729 -469 -98 439 -550 100
2909 100 244 -394 241 54 -387 371 73 -325 264 -76 -210 320 -77 245 612 -262 177 339 -231 472
2929 472 -278 -436 320 -740 -123 263 -482 131 200 -484 182 -64 -334 216 10 -145 400 -119 295 686
2949 686 -432 138 310 -657 137 82 -586 241 -172 -508 420 -74 -234 188 -58 444 367 -123 708 87
2969 87 -152 622 -232 -50 449 -82 67 219 -783 231 -123 -546 86 -170 -235 616 -163 -8 535 -434
2989 -434 287 611 -547 356 149 -146 628 -10 -241 253 -487 -158 479 -679 -94 -179 -543 347 -104 -171
3009 -171 555 29 -134 645 -190 342 716 -368 510 135 -898 454 -202 -524 331 -510 -314 333 -431
3028 -431 164 167 -320 576 412 -247 613 165 188 657 -151 97 426 -456 -9 113 -810 -68 -331 -342 222
3049 222 -27 -398 537 -288 -80 728 -301 422 371 -217 596 -77 -339 457 -189 -348 8 -677 -71 -37
3069 -37 -374 245 177 -636 571 278 -45 429 320 270 692 19 106 269 -383 247 -126 -570 97 -147 -640
3090 -640 247 -251 -177 263 -478 37 588 -333 501 298 -337 517 196 -59 660 -274 -26 -55 -616 125 112
3111 112 -317 -6 -218 -478 417 -163 -68 793 124 289 544 -187 362 220 -382 450 68 -264 431 -276
3131 -276 -323 427 -379 -157 170 -846 72 -9 -456 432 277 34 551 14 247 441 -190 250 407 -420
3151 -420 86 -50 -512 112 -309 -288 248 -614 -57 254 -326 35 519 -17 248 145 213 471 -110 -544 560
3172 560 -378 -35 326 -709 16 -34 -193 295 59 -431 698 -156 -60 437 -367 206 361 -361 367 407
3192 407 -228 452 45 -590 53 -398 -181 298 -349 29 103 -530 120 518 -328 344 31 -37 549 -332 150
3213 150 527 -423 191 258 -238 204 -100 -372 90 -321 -215 538 -143 -43 508 -229 58 498 -91 490
3233 490 36 -161 139 -44 -277 241 -594 -194 244 -359 395 69 -525 115 -12 -564 297 -274 -123 397
3253 397 -412 266 273 -469 415 -32 -407 273 -74 -160 220 -458 135 451 -367 -1 241 -169 215 3 -252
3274 -252 452 -253 -191 422 -262 -210 326 -426 -224 -18 -429 402 149 -250 347 -190 -402 289 -255 -184 125
3295 125 -592 -82 248 -500 411 330 -335 620 -147 -71 563 -528 158 301 -533 305 -75 -218 551 -110
3315 -110 -351 301 -441 -315 542 -572 -34 255 -513 355 126 -273 364 -136 -47 730 -490 -86 314 -703
3335 -703 -31 268 -452 28 -162 -399 253 -32 -316 596 -261 13 264 74 358 408 -214 581 220 -529
3355 -529 221 -400 -255 230 -232 -64 190 -541 438 335 -334 411 129 -93 411 -148 165 338 -289 -31
3375 -31 306 -641 127 -180 -57 183 -317 -445 182 -305 -161 200 -490 170 476 -301 163 255 -139 593 141
3396 141 -82 189 -95 -368 35 -436 -112 -81 -411 160 -245 -619 197 -223 -48 426 -142 80 379 -271
3416 -271 404 188 -211 487 54 -84 179 -379 -150 407 -464 -90 59 -148 -45 533 -322 325 -30 -397
3436 -397 923 -141 -62 423 -196 243 379 -403 21 -230 -307 244 -98 -331 446 -186 -76 454 -255 103
3456 103 239 -9 458 189 -278 418 -183 -116 332 -475 3 491 -550 264 40 -315 140 -185 -370 291
3476 291 -182 -496 382 -236 300 551 -199 610 140 -344 201 -192 -279 300 -353 8 100 -495 144 284 -311
3497 -311 358 341 9 285 -50 -137 470 -11 -71 263 -302 255 98 -119 -14 92 -376 28 -608 -262 460
3518 460 -296 338 497 -274 240 184 -304 453 -150 -201 44 -12 -216 478 -297 138 -41 -438 46 5 -479
3539 -479 280 -147 -114 433 -196 160 209 -351 164 12 -181 334 36 -590 495 -60 -192 399 -356 -102
3559 -102 180 -388 -174 144 -433 318 62 -442 276 -142 -83 311 -157 -222 416 -250 -22 -132 -432 336 -59
3580 -59 -116 306 -8 -301 452 -130 67 106 -468 50 179 -225 232 -270 -482 228 188 -250 390 -541 14
3601 14 190 -418 0 -24 -568 236 -246 -471 83 -761 93 330 -408 -41 226 -205 73 519 0 172 -17
3622 -17 -106 368 -283 -149 18 -577 96 -31 -499 -16 -34 -287 570 64 -66 495 -56 114 457 -262 324
3643 324 171 -183 554 156 -489 29 -404 -328 3 -162 -204 96 -515 40 278 -232 442 307 -289 329 -97
3664 -97 -276 330 -416 139 79 -445 67 86 -446 198 48 -48 8 -274 -12 233 -7 261 180 -32 303 52
3686 52 -99 107 -403 -198 417 -296 -166 260 -401 71 85 -635 301 173 -188 467 -86 -80 538 -121 238
3707 238 370 -310 191 54 -369 18 -187 -334 21 -284 -152 392 -609 46 271 -34 352 350 -9 431
3727 431 29 6 492 -228 -40 135 -374 -218 64 -532 -89 111 -323 -61 -494 -115 674 -297 225 276 -191
3748 -191 483 146 -85 -134 -57 -463 252 71 -81 82 -38 -145 150 -373 279 91 -372 319 32 -46 396
3769 396 183 -41 368 -338 -65 35 -120 117 209 -323 246 -165 -425 8 -117 -107 355 -272 -62 323 -212
3790 -212 109 60 -144 198 186 -31 286 -114 107 204 -274 -78 19 -126 187 -49 -404 178 -138 -435 408
3811 408 173 -31 186 -112 221 215 -303 363 248 -298 460 -117 -22 157 -262 98 265 -212 238 186 -267
3832 -267 151 -89 1 472 125 -174 323 -112 -59 364 -220 394 289 -259 393 -35 -213 148 -19 -196 276
3853 276 -130 116 106 -228 171 153 -306 179 21 -154 359 -97 218 109 146 377 309 -232 187 -31 -16 293
3875 293 -415 -16 67 -305 -8 115 -409 356 48 -194 434 53 -170 109 -16 13 440 -456 190 64 -191
3896 -191 129 -68 -413 136 -256 93 499 22 -225 448 -278 18 249 -235 181 39 -157 179 -179 -18
3916 -18 438 -296 13 187 -505 221 114 -321 79 -136 -71 177 -249 -101 287 -434 187 271 44 280 91
3937 91 -72 227 217 -312 180 -217 -300 68 -297 423 32 42 391 28 -347 388 -49 64 324 27 192
3958 192 141 -321 42 -282 -255 -58 40 -174 138 -22 -143 289 -115 18 415 -106 271 -62 -110 137 -6
3979 -6 -121 159 -207 -218 29 -237 -171 -8 -205 212 14 -409 135 -20 -20 299 -71 -37 276 -90 -40 32 -316
4002 -316 -199 51 -133 13 -314 -140 -52 -376 -70 242 -298 199 -96 -235 289 338 -110 595 108 -202 341
4023 341 -133 56 332 -349 -68 6 -252 107 -202 -32 -76 70 -337 365 -73 -111 379 -177 288 -56 -186
4044 -186 197 25 -168 246 -253 -156 -47 -205 155 89 -129 119 128 -202 353 75 -100 309 -254 -89 572
4065 572 -27 -86 -84 -174 254 74 -416 -127 -62 -153 -136 -40 38 397 9 103 320 -6 113 206 -44 134 72 -225
4089 -225 70 -208 -2 -173 -40 86 21 -206 132 -74 -296 -92 -105 -337 253 -7 17 516 -92 185 -74
4110 -74 -334 244 -25 -104 211 -253 -456 256 -112 -94 -5 -4 110 -2 -168 141 -205 76 574 -128 -9 302
4132 302 -464 153 167 -120 214 -222 -117 -28 64 -14 225 -178 -110 63 -326 -75 260 -218 -13 20 -484 128
4154 128 24 -243 250 -184 82 157 -141 -26 59 -285 -94 71 8 179 -323 -96 380 -533 145 135 -150
4175 -150 197 222 -227 268 -113 -20 372 -398 -236 108 -485 -77 334 -525 -2 28 57 260 6 -17 300 -103
4197 -103 90 25 -76 305 306 -217 44 234 73 193 88 -339 146 -22 -236 134 -394 126 -69 -161 294
4218 294 35 -15 172 -38 -52 362 -252 198 239 109 170 -75 -292 -143 -173 -388 -49 15 -35 38 40 42 259 35
4242 35 197 15 -158 182 -71 -47 266 6 -96 292 -129 45 -10 -360 91 -191 -204 -216 -401 95 388 68
4264 68 241 226 -49 104 46 -333 342 -135 -513 4 -151 41 31 171 86 262 -209 249 259 -239 408 72
4286 72 58 411 -68 -164 224 -211 223 73 -607 84 8 -388 291 -76 69 -83 -317 9 53 -109 56 20
4308 20 -127 263 140 -48 324 94 -95 164 -308 -297 189 -161 -33 191 -198 275 76 -319 -10 5 -242
4329 -242 348 -79 -25 148 -61 305 115 -213 374 -333 -392 88 -344 -127 215 -175 -44 127 -319 -55 290
4350 290 216 193 116 -98 510 105 -142 46 28 -69 171 -227 353 -134 -99 162 -245 -244 329 -257 116 131 -253
4373 -253 133 385 -194 -69 -111 -52 214 -71 -183 233 -68 -55 -179 -323 -2 -306 -331 332 6 -255 286
4394 286 -197 -254 169 -91 73 372 70 116 87 -200 368 -28 -36 327 -118 290 -5 -151 -141 103 -122 136
4416 136 145 -261 422 -147 -163 335 -47 -94 308 -76 341 -29 -205 252 30 10 199 -155 -335 13 -131 -11
4438 -11 266 -76 153 48 -165 143 242 -100 -14 -172 -125 524 -62 65 212 -136 153 65 -15 20 -158 -198 234
4461 234 -138 23 174 11 176 110 -74 90 312 -8 109 -327 -115 83 -70 28 238 -391 40 30 -174
4482 -174 74 149 -278 269 101 -236 -79 -8 108 197 -415 -127 78 -247 349 -13 -126 -42 -230 -366 204
4503 204 -270 9 425 -262 181 207 -217 192 205 -120 94 -407 -132 62 -148 -51 -19 -207 -54 -153 -218 182
4525 182 -71 45 216 16 -82 272 -360 66 213 -104 151 314 -184 276 -124 -167 420 -301 1 100 -463
4546 -463 88 227 -240 178 366 -203 210 15 -39 240 299 172 156 -273 81 -74 -272 312 -200 29 80
4567 80 -146 -91 18 -218 84 284 -142 22 106 -107 239 -120 3 193 -110 -171 4 -339 27 221 -329
4588 -329 -228 209 -196 243 -28 -281 312 113 186 56 -407 -135 173 -161 -141 -10 57 315 18 -28 107
4609 107 77 -216 221 -138 152 10 -107 343 44 -142 181 -249 157 150 -278 -43 142 -125 -140 349 -177
4630 -177 28 -115 -142 246 -133 -162 122 139 191 513 -240 -135 -318 107 165 -49 -10 333 57 95 218 -140
4652 -140 -112 -88 -71 399 -330 -38 230 87 -365 25 -154 -10 178 -220 -105 28 150 172 -34 -52 -167 193
4674 193 -94 176 -89 -123 34 -174 60 -5 207 238 65 70 9 -161 66 -109 -157 80 102 -147 92 -191 24
4697 24 -13 14 224 372 -84 -2 -14 -82 -10 197 -147 35 146 -289 468 -147 -179 327 36 -59 243 -168 75
4720 75 96 -25 -59 -45 -125 -43 -10 -67 401 -190 200 85 -133 -94 210 -116 218 92 -120 217 -3 -148 277
4743 277 -139 -243 -102 -62 45 -155 -33 -103 49 -100 498 -106 1 328 -125 -84 26 -149 2 25 -12 283
4765 283 -78 -110 151 -301 -134 -122 -278 -69 240 -107 -94 -46 -143 67 -11 -29 1 -92 -81 143 -280 123 103 -12
4789 -12 -49 -171 -131 7 -151 -143 121 -258 -257 128 -348 -79 69 -140 -59 142 -57 235 -194 -260 253 -181 119
4812 119 176 -237 -162 -63 -134 -134 18 -46 259 33 -69 321 -109 -37 58 -329 15 151 65 82 37 -226 124 -227
4836 -227 -32 4 -321 -132 -105 -23 51 -60 -145 188 -141 -30 191 -140 -214 205 -112 117 -41 77 9 -51 -295
4859 -295 -84 -296 98 151 -387 -137 211 -109 383 34 34 40 -116 -141 323 199 -40 258 -317 28 122 -70
4881 -70 185 164 -435 111 -68 -13 199 -145 194 116 -170 13 53 137 184 52 164 -104 -70 -65 49 -248 32
4904 32 172 -297 96 255 -288 192 36 -192 352 136 226 107 -144 66 -20 -170 -29 -126 -78 -81 -122 -27 -25 -121
4928 -121 -141 238 -49 43 196 -185 211 116 24 395 -29 -12 166 -81 -147 233 3 -4 145 -140 185 -128 -148
4951 -148 166 -134 -63 390 130 243 396 -291 282 183 -5 154 -65 267 212 55 -72 -120 -280 -273 -241 1
4973 1 280 -100 -64 193 -1 -233 19 -158 29 209 59 225 106 -48 -104 -126 -373 -180 -133 -133 292 -110 5
4996 5 -49 -88 -161 61 236 69 -13 -186 149 -75 38 187 -455 -170 130 -160 118 168 -306 128 -155 -156 157
5019 157 121 -121 319 40 149 47 -10 52 -137 -57 269 80 -35 160 -213 -210 -126 -212 -142 -9 -374 -95 24
5042 24 -88 69 -186 -86 178 -120 11 203 7 23 179 -244 190 113 -333 -204 -302 -122 -3 -115 56
5063 56 24 -228 50 228 -145 124 50 -330 -69 38 -5 109 -322 -71 203 -97 -105 -126 -116 -147 207 -44 115
5086 115 -124 49 106 59 -52 22 142 99 40 -73 -115 129 90 112 -79 -174 167 -160 11 85 -359 308 -84
5109 -84 -206 629 -176 -273 187 -126 60 52 -135 38 72 158 164 -362 -68 99 127 -271 65 6 -159 264 -293
5132 -293 -66 195 -505 -109 -18 -44 -6 -8 66 95 175 -74 309 35 -24 80 -103 164 -174 -134 98 -2 -81 189
5156 189 -9 139 12 -2 255 -111 -36 -3 62 77 98 -69 -100 62 -220 -209 224 -29 135 124 -179 28 46
5179 46 -52 104 -41 -88 511 -34 283 58 -84 308 -45 -223 306 -178 -177 5 187 -66 -14 -115 223 -87
5201 -87 -193 274 39 120 139 42 0 205 -227 195 79 81 89 35 -194 272 -36 -84 274 -109 157 27 88 -50
5225 -50 168 -45 -20 157 -334 43 153 -272 -58 -44 -27 19 -248 26 126 -226 255 14 18 -57 41 -46 323
5248 323 -154 12 122 -210 -116 152 -1 -45 -92 33 148 5 27 233 -30 -113 154 -100 138 -123 -263 244
5270 244 315 -211 90 -140 -90 241 76 302 119 -221 -139 -10 -86 21 212 -162 -33 208 -197 317 -81
5291 -81 162 74 -289 165 100 -74 53 -176 -122 8 -114 147 2 34 333 -16 -280 118 -44 -162 15 57
5313 57 -239 141 55 232 47 -11 68 216 -131 479 141 65 -33 49 -139 74 -256 -14 131 -54 356 56
5335 56 -158 81 208 -95 281 -59 -73 114 -219 105 17 -107 6 -94 -206 -178 -22 -83 116 -164 -218 135
5357 135 -157 -43 7 -143 -100 14 36 36 -88 -87 27 -259 -243 -73 -189 114 7 -198 187 54 -199 88 -15
5380 -15 -269 44 -20 -65 371 -84 227 -37 -145 68 -196 -63 -16 106 -225 179 -196 -53 322 26 9 352
5402 352 -70 209 -55 -23 287 -71 -26 64 109 197 -6 -45 11 -220 -279 178 -356 -101 63 85 58 259 -11
5425 -11 -135 173 -312 341 140 192 129 25 115 -224 -176 -153 -79 -215 116 -23 -194 -222 -77 -121 125 -61 -115
5448 -115 267 -115 -116 161 14 -11 -180 51 168 -133 28 -52 -101 6 128 -366 -108 -82 102 -38 -518 -303
5470 -303 -37 120 -17 310 -168 -18 120 -283 92 -27 -8 295 -116 -504 -2 -36 -265 -49 -228 28 134
5491 134 -20 47 293 164 283 74 -69 83 -49 98 218 19 97 -131 -215 -73 -22 -207 -91 -19 -119 52
5513 52 -69 7 170 -94 -279 187 75 -4 104 -46 207 90 -172 427 -51 26 -32 -228 -264 -91 -167 -72 -72
5536 -72 50 124 315 1 -86 -223 2 220 -286 130 -92 -127 57 -38 52 8 62 115 259 94 105 130 -322 5
5560 5 29 27 231 -307 -168 289 202 101 94 -157 137 90 106 -231 -186 -110 27 2 -133 -16 -54 -60 135 -112 165
5585 165 -127 126 32 -108 -123 -193 -21 -198 -81 -204 -9 -140 3 179 71 50 214 48 169 270 139
5606 139 51 176 -169 -135 300 -68 132 0 -307 -75 -244 -61 43 89 -92 -114 -175 53 -73 86 -19 -14
5628 -14 6 56 42 -79 -224 -159 63 -69 9 -172 48 8 57 99 -99 48 19 124 28 -96 -39 219 -82 -257
5652 -257 116 -208 -119 61 9 150 -71 156 -7 -48 -71 254 -90 -83 346 -99 28 23 -6 152 -31 -318 -9
5675 -9 15 -200 195 -185 37 208 -7 194 34 -157 332 195 89 377 45 -178 8 -58 144 -3 -56 170
5697 170 -29 -158 199 -107 -7 108 -312 -17 -105 -189 -163 -24 -100 -148 99 -266 263 -227 -10 42 -128 264
5719 264 60 -184 107 143 25 -201 166 205 79 -226 31 193 -124 -107 190 -213 -34 -172 -163 -41 91 27
5741 27 -172 257 147 85 -8 -76 167 -115 68 -30 -142 15 -187 -200 70 -271 -171 -196 -20 161 250 -270 -136
5764 -136 -207 249 222 -168 -130 60 -181 -97 12 66 1 53 4 46 -204 12 124 -28 47 -67 -4 217 180 -336
5788 -336 -105 66 83 56 101 -82 -116 -150 -64 219 -155 -172 -57 -277 5 -44 -206 -12 11 294 61 -53 250
5811 250 21 -60 -34 -44 156 20 129 -469 115 -245 52 47 -289 117 295 139 -69 150 31 245 182 5
5833 5 212 -81 -108 45 -141 304 -5 -395 -216 -18 -209 -147 98 -29 112 117 -26 -13 -131 -175 224 -95 157
5856 157 -219 -300 -25 -260 -268 7 -81 67 -88 -210 180 -164 77 208 60 -206 -208 54 215 -18 -112 -47 127
5879 127 -25 98 114 -153 179 -188 73 290 61 -187 241 31 55 20 -132 -56 -103 -66 276 -101 -163 85
5901 85 -11 -84 29 -33 -61 20 -170 -129 53 -23 77 41 1 256 -177 84 16 -28 269 122 61 136 110 -318 -113
5926 -113 -154 132 20 27 -88 -145 -359 95 -140 -7 141 116 -228 -178 -264 67 146 -43 -72 77 8 274 176 -17
5950 -17 178 171 -203 213 -329 -167 -1 -147 -12 44 -66 -64 100 148 11 -9 71 93 -258 -235 75 -206 40 -42
5974 -42 -48 240 -128 -77 -102 93 45 -64 -317 94 52 -178 -150 -1 -227 96 82 -240 -111 -145 18 21 -364 34
5998 34 -107 -254 362 -57 -90 8 -200 -336 93 219 307 -6 61 261 171 -215 18 100 -249 172 -307 -61
6020 -61 118 78 -133 -2 -29 18 -28 26 261 19 -190 296 101 -18 255 6 -102 -108 184 50 259 -268 -85
6043 -85 142 -81 301 -135 29 52 -92 -133 226 -280 71 160 -164 186 277 -3 60 89 185 285 158 42 -223
6066 -223 -31 74 28 34 -117 29 93 -51 -127 152 201 51 22 -177 110 172 -32 -29 25 -72 -103 96 -90 -79 -46
6091 -46 66 -209 -185 229 179 -89 -155 -18 145 -71 254 -67 123 193 185 10 48 137 -140 166 93 8 48 46 219
6116 219 -205 1 280 -20 229 -42 -147 343 -144 -117 141 288 89 -361 -288 -194 -59 -320 -72 -91 19
6137 19 4 -18 -185 100 -35 352 -34 11 -296 22 -55 139 34 -169 405 -79 41 -12 -228 -273 -72 -75 1
6160 1 -181 42 68 -30 240 96 110 144 51 -131 -132 -258 77 -196 -239 -143 -54 -6 63 139 -123 -89 384 -18 90
6185 90 43 197 15 280 66 215 -157 -310 -211 -60 -1 -164 -298 -289 211 85 185 -203 -79 196 142 21
6207 21 116 51 71 -116 -176 -40 331 130 -153 2 -19 259 166 143 91 -79 190 139 -394 321 117 -53 120
6230 120 122 -59 222 -169 84 8 -24 304 119 52 143 -55 -127 -77 -244 -39 219 49 335 260 52 44 136 -14
6254 -14 155 -159 -79 21 121 -268 156 -117 19 82 -97 164 115 47 -211 141 -148 289 54 -19 -131 -349
6276 -349 -313 -17 7 -28 362 -221 13 118 142 320 -194 -40 157 -104 -136 195 16 18 -85 46 166 271
6298 271 -3 473 -160 -64 306 -176 20 50 -18 36 -14 167 270 86 -303 -48 171 -164 114 -155 31 105
6320 105 65 -46 -39 19 -34 53 92 316 84 122 142 -228 196 -66 27 -37 -404 -88 67 -178 -59 173 -243 24
6344 24 95 -268 7 382 -44 -3 -71 -140 -77 -290 -68 42 -285 10 -119 -57 -14 53 -304 217 -71 -62 -141 29
6368 29 75 12 -153 372 279 -245 -28 65 -25 -222 234 31 -159 -202 5 144 70 171 108 122 112 250 -204 283
6392 283 128 -104 278 -88 -11 179 7 175 -28 -75 0 86 -201 -34 -314 -152 216 -247 -229 27 -58 -81
6414 -81 281 160 251 -8 -296 -47 -129 34 229 -80 107 106 -197 -45 187 -314 87 81 57 208 -224 -92 312
6437 312 -251 193 12 -214 2 -42 65 380 -85 -52 -46 -173 -217 -162 74 168 87 -173 157 174 -74 51 91
6460 91 128 205 -47 -141 -74 116 191 -39 -76 245 169 -182 197 173 -406 70 -141 -103 54 73 159 37 -20 227
6484 227 -220 30 274 79 -245 19 -163 -41 85 -418 183 236 -244 162 -335 221 70 60 74 -85 -173
6505 -173 79 322 -87 -37 -32 -21 4 -215 -70 119 -25 126 193 -264 -157 199 -156 68 277 -185 79 129
6527 129 11 167 -112 -174 -95 -193 -50 -170 229 203 -79 -209 166 -180 -9 165 -90 -6 119 63 -165 45
6549 45 202 384 51 -136 -63 124 17 -95 -245 39 67 33 279 -49 -4 183 251 -92 246 53 -86 55
6571 55 74 -31 -9 253 132 9 141 179 -49 -283 -23 -59 -62 160 59 270 202 -220 108 -72 -181 223 -27
6594 -27 94 -7 -202 143 -85 8 31 37 245 -323 114 37 157 -170 188 67 -118 -25 127 112 228 162 -215
6617 -215 0 -210 -99 -228 -170 -167 -93 -47 184 281 -282 -153 -109 2 69 -166 103 29 -3 -2 -101 -157 -179 245 99
6642 99 90 214 -93 195 -180 68 0 -97 -124 -3 101 -39 135 -28 -66 41 -52 -99 -318 -41 255 -93 175
6665 175 247 223 -372 -57 -56 113 -86 -219 94 -213 25 -115 74 -127 49 -259 289 363 -183 56 -147 184
6687 184 -94 -232 106 150 -267 79 73 36 216 193 -110 14 -60 -173 233 -83 105 163 -35 166 5 -216
6709 -216 168 -172 -370 136 -26 -85 -56 -55 -51 179 -72 -99 72 -192 324 -79 -159 184 -103 324 226 -335 148
6732 148 -128 -410 -84 47 -180 -120 -130 -54 1 65 163 43 43 -89 -2 70 -171 142 193 235 27 -26 135 -26
6756 -26 -181 38 -387 -29 181 -410 -54 -111 35 -59 101 86 -109 -132 150 185 276 -251 -193 225 6 -153 -130
6779 -130 206 -75 -60 128 64 111 62 66 9 -177 55 324 -85 -101 -24 -1 -131 349 -298 120 -76 -112 218 -2
6803 -2 -139 -185 -12 106 -124 -59 -159 292 -131 16 91 -133 235 80 145 -18 -4 -103 113 33 7 -33 102 140
6827 140 161 -145 23 47 -119 299 227 17 -73 -255 92 -227 -122 -52 206 -32 -32 99 -320 -10 -251 24
6849 24 55 -130 169 -53 -235 131 -110 110 -49 186 19 -100 -128 11 127 -136 -73 49 149 326 -16
6870 -16 -258 -166 83 -27 101 -96 102 17 -195 121 -178 -221 -41 -26 146 -54 -24 14 179 311 68 94 -265
6893 -265 1 14 32 197 -34 83 416 -48 -31 -95 -232 138 -75 39 139 -2 -163 92 102 27 10 6 -44
6916 -44 -6 -222 91 33 -100 -4 93 86 -100 -163 -92 -90 87 -106 -208 -97 89 104 -402 4 -112 -58 76 39 -85
6941 -85 190 -120 -171 226 -75 22 203 27 -9 286 -34 183 53 -235 48 0 128 -78 -205 -91 17 -87
6963 -87 180 16 -140 75 -55 137 200 25 -22 241 -143 300 -148 -164 171 -198 82 -147 -7 -112 291
6984 291 -53 -169 -23 -230 -42 -19 -32 147 -63 34 -164 -274 206 244 -201 -5 136 -39 -66 -2 200 115
7006 115 -52 79 13 -249 -94 28 -186 -124 -160 -229 31 -171 -210 149 71 64 205 -252 150 13 -270 85 200
7029 200 86 60 -83 -85 -3 -41 83 141 104 167 140 -100 43 155 -176 178 40 -25 -12 -241 -70 10 -274 90
7053 90 402 -220 79 -87 -49 19 -65 94 252 111 45 231 -136 133 -25 -76 -12 319 -101 -85 -167 115 81
7076 81 71 141 -46 183 -28 156 -222 -435 37 -112 285 -384 72 46 -24 77 -113 -181 -216 63 -11 48 -31
7099 -31 -196 277 99 304 66 130 55 112 29 115 133 -126 -206 -15 216 29 39 75 -60 -150 -2 38 -183 5
7123 5 -64 -124 -10 -73 -61 39 61 -74 -88 -80 -95 204 -72 -12 -134 121 105 -57 -172 151 39 145 -38 142
7147 142 130 -17 158 40 91 39 218 -239 68 -2 -27 17 268 -152 86 -5 -73 -145 -140 -332 198 23 114 238
7171 238 -149 -336 5 139 178 90 -65 95 -216 -289 345 237 -164 -109 128 -65 -174 -132 95 90 -47 214
7193 214 -23 -37 145 111 252 170 100 249 333 -49 51 -361 -330 265 -201 -55 75 47 32 127 -37 -277 -28
7216 -28 -2 -35 100 161 -68 210 26 269 -210 108 -265 -226 40 -13 -13 65 -282 -183 -272 -2 130 -71 -14 164
7240 164 117 116 142 23 -251 -73 89 -23 245 23 -43 88 -63 -75 -192 93 122 -46 -6 175 -31 -54 -43
7263 -43 -255 -143 -10 261 -12 -129 -158 123 -191 -20 83 -209 150 168 -260 181 -46 -131 -93 -32 113 47
7285 47 71 -411 300 44 -212 10 -183 -49 99 91 -228 59 -59 -72 -132 -100 126 -520 -129 163 20 212
7307 212 -49 -233 64 -102 -14 -35 83 121 98 -46 97 231 52 -20 -1 14 -123 -47 128 106 -3 90 279
7330 279 5 -45 56 -63 373 29 -142 -31 -64 42 8 -204 0 -137 -152 55 -172 75 30 122 -39 28
7352 28 -284 278 96 -155 73 127 -122 78 -84 -63 21 19 -42 -76 -223 48 14 -282 231 50 -33 -71 219 -338
7376 -338 -228 306 -99 146 -39 35 -75 -12 103 -47 -411 55 56 17 -156 19 -264 -15 6 103 -23 -190
7398 -190 -270 -84 61 120 66 -128 -61 -29 30 68 -136 6 81 -368 76 93 105 -76 61 51 35 -240 -66 244
7422 244 -36 -147 36 95 -66 201 -105 122 -161 -53 -2 -284 46 283 -211 -43 112 -52 443 -13 293
7443 293 165 135 123 -14 -181 -103 172 -121 81 -309 64 -168 -116 -24 140 112 202 -20 -337 -56 -140 110 -41
7466 -41 34 34 -277 76 -343 -15 -146 -89 236 121 -221 -175 49 92 26 -177 454 -51 -173 105 -243 -22 -149
7489 -149 -282 106 -151 -230 -30 61 -276 133 -203 -11 43 -124 -245 83 -278 74 158 -102 -90 -1 -161 -211
7511 -211 -12 -66 95 -128 77 158 -324 122 232 25 174 -235 -160 52 -37 -158 72 -251 124 29 -64 172
7533 172 66 -121 -19 -71 -139 -80 -186 110 68 -245 -110 -6 -19 249 -49 95 9 -280 -140 199 -111 150
7555 150 -90 60 205 96 -122 8 -170 -169 -85 14 96 -37 -85 -26 181 32 258 158 -305 203 133 58 315
7578 315 121 -173 94 66 47 -141 -1 20 81 -170 68 -18 119 172 145 -131 158 52 76 140 39 94 -155
7601 -155 -271 262 -79 201 139 -10 122 76 -81 -282 190 -380 145 -224 -85 70 74 74 -55 -44 78 99 -111
7624 -111 -13 595 122 -12 -111 -233 -72 -185 121 -16 -192 -12 -18 -261 -52 -21 81 -120 34 -53 430 -197
7646 -197 -197 94 123 -111 183 -40 -41 -13 -70 64 -118 114 18 467 15 171 -46 79 94 -109 -23 95 -141
7669 -141 149 -289 -162 97 -76 -164 73 229 236 2 -43 -230 -64 -105 257 24 -211 190 -73 -164 174 -156
7691 -156 188 239 73 162 239 6 77 -26 -138 275 75 -104 -94 -79 143 86 80 -26 -17 42 2 -102 -27 37 -117
7716 -117 266 -71 -99 -114 105 -181 -3 -112 -168 -103 115 -280 75 -98 40 35 -95 99 193 -145 -247 1
7738 1 100 112 -82 240 89 -32 -2 -55 -69 198 -182 -67 -75 193 36 63 -290 -54 122 -210 281 160 -147
7761 -147 -228 -121 47 46 -447 -273 173 -37 -25 -15 10 171 100 -523 141 154 -37 2 -60 145 251 93 -273
7784 -273 -268 -139 2 -85 190 46 -134 95 9 -179 165 206 -43 189 -179 145 217 -103 -231 25 -45 23 253
7807 253 -76 111 4 -154 -94 252 -150 -99 169 27 -61 324 -26 -78 127 73 46 -91 52 76 31 92 153
7830 153 -251 337 27 -140 79 -67 -22 27 -150 -148 -264 -120 34 -73 16 -86 -72 -149 -131 -292 312 -122 -126
7853 -126 12 -190 -311 148 -69 -165 215 -176 67 13 99 52 -132 -394 7 62 -71 -223 26 -69 -45 33 -56
7876 -56 -33 -179 113 142 -203 -115 -218 -98 148 -217 -72 281 329 4 128 -55 177 209 -173 108 -135 182
7898 182 275 -192 101 33 -318 135 -409 -203 44 -94 165 -119 272 45 -278 6 -74 -27 -168 -163 81 -122
7920 -122 59 241 -66 29 110 113 130 91 185 -10 133 -113 -74 52 337 176 -161 193 85 -16 67 9 153
7943 153 -138 -66 -84 89 -4 104 21 -115 89 19 47 295 68 -11 -174 -76 161 -178 -38 147 57 -58 115
7966 115 -130 -15 -138 -9 334 -183 -91 56 -94 -157 -212 -144 185 -10 -88 306 336 -226 154 118 -38 118
7988 118 -80 -191 114 -191 67 166 -153 27 80 -143 223 18 3 -83 170 352 6 -96 76 288 -321
8009 -321 -231 366 84 198 69 64 285 142 139 -184 -88 69 -94 42 157 261 33 274 277 -5 57 -37 55 27
8033 27 73 103 -22 -18 -71 -47 -81 281 -192 -29 2 14 -275 174 -12 -17 -147 141 -223 4 122 -137 257 -25
8057 -25 16 -216 124 16 -202 -90 233 102 227 51 117 317 73 94 -46 -1 -2 -69 -111 23 43 -83 -146 -155
8081 -155 -99 324 -187 -42 15 -223 -73 -80 -51 318 219 -442 92 71 -306 103 -30 -27 263 180 -15 -65 -341 159
8105 159 68 88 -18 -284 81 -25 -123 112 202 -176 -165 71 -11 232 267 -316 -234 139 -69 -337 -109 134 85
8128 85 -205 -359 86 -286 152 -38 -292 -70 208 -188 112 -142 -121 26 -151 381 -51 -202 -141 -178 155
8149 155 416 -209 60 112 28 254 -88 -249 179 152 -217 -34 -211 -196 -131 312 59 164 -59 105 -50 95
8171 95 -137 193 40 -27 127 -38 163 436 -55 177 56 114 -48 -89 109 -125 -24 -111 -44 -242
8191b42
$$ Imaginary data points
##PAGE= N=2
##DATA TABLE= (X++(I..I)), XYDATA
0 0 0 0 0 0 0 0 0 0 0 0 0 0 0 -8 8 -8 8 -9 16 -16 24 -24 32 -32 40 -48 56 -64 72 -83 96 -109 124 -141 159
35 159 -178 200 -224 251 -280 311 -347 385 -426 471 -519 575 -633 697 -769 847 -932 1028
53 1028 -1134 1255 -1388 1542 -1717 1921 -2161 2449 -2806 3251 -3834 4632 -5792 7648 -11109
68 -11109 19826 -95088 -128096 -26397 -64706 -18849 19890 39657 7767 7552 72543 79903
80 79903 5787 48559 86716 34596 4631 1805 -28615 -76331 -126151 -83727 -42774 -74673
92 -74673 -39511 30428 18698 11709 21683 29716 35986 13384 35985 85612 41214 2868 10878
105 10878 -17406 -42216 -49092 -46360 -21599 -43118 -50357 14252 22186 -4434 11534 13009 8329
118 8329 4995 12877 60628 48103 -6523 14232 17815 -24901 -21669 -1836 7444 -3556 -21381
131 -21381 16937 23835 -33304 -17791 15123 -12020 -14556 9180 26573 20024 -9414 16339 38497
144 38497 -13105 -13332 30142 18304 10149 23513 29221 15273 -32019 -32371 923 -27745 -33522
157 -33522 8745 4562 -8435 -1057 9449 23128 1496 -4251 36527 28996 13098 39096 32355
170 32355 6434 -11492 -27643 -17015 -27275 -44481 -9544 1513 -17676 -1348 6477 3799
182 3799 5592 -643 26029 39616 12492 25774 34951 1940 -9510 -13836 -20580 -22857 -40641
195 -40641 -22369 4007 -18576 -13051 12681 -489 -3599 7438 18163 31207 13864 13293 33125
208 33125 1995 -18703 -2813 -15691 -26914 -22866 -16889 -367 -10972 -16679 12631 2641 -12451
221 -12451 12213 16757 12113 14901 10187 18488 4721 -19248 -3498 -6934 -27355 -10743 -4113
234 -4113 -6989 -1658 -8322 3149 7251 -10368 6279 18071 2078 10582 12758 3871 4036 -11127
248 -11127 -10664 -268 -17731 -11373 5946 -5365 -1035 2622 -2582 6354 -2327 -3738 15306 3667
262 3667 -78 13469 1533 -2816 -2572 -11561 -1209 -5182 -12067 7536 3425 -5946 6623 596
276 596 -2153 2770 -4745 5508 7651 -5452 7247 5900 -8936 63 -3519 -6534 2262 -4879
290 -4879 1833 9649 -4607 2299 6454 -6794 752 590 -4198 6536 -1688 -2908 7059 -5883
304 -5883 -4837 3410 -6377 1150 4155 -2689 8817 3670 -4357 6968 -1594 -5045 3845 -4678 -112
319 -112 3621 -7792 1306 1473 -9215 1772 624 -3300 6616 -344 1992 9312 -3694 1701 6847
334 6847 -5697 308 1660 -4682 2530 -3793 -5790 4404 -7013 -5973 5375 -3428 117 4462
348 4462 -712 6902 1779 -3121 9750 992 -4435 6696 -1185 -4292 -761 -7233 918 -154 -9149
363 -9149 4289 1329 -8556 3772 3296 630 5080 -1921 5293 7378 -4754 5542 6919 -8826
377 -8826 -3686 -2246 -4979 908 -5091 124 6636 -8455 -2330 7791 -3841 -96 4907 3066
391 3066 7988 -274 -374 9151 -6598 -8013 4573 -4909 -6517 -1521 -1311 6875 630 -4025 8352
406 8352 -2992 -9405 7829 6532 2605 3680 -2077 2807 -2329 -10074 5653 1101 -12556 -687
420 -687 2576 454 4294 281 5804 3477 -9864 4213 9286 -5452 1059 3514 -2181 -2004 -8440
435 -8440 -2193 3301 -10161 -901 10630 -3693 -2812 2963 1974 6405 291 2164 8824 -8753 -8720
450 -8720 6765 -1585 -6409 -3927 -6316 -1014 -4466 -1382 14605 992 -10379 3125 1399 -1673
464 -1673 4533 3818 6678 -3133 -11481 3736 -1414 -15278 -2709 937 -3879 556 1469 8379 4003
479 4003 -9155 3717 5868 -10445 -3194 4161 555 1957 -1709 846 -1256 -18060 -7081 7898
493 7898 -2099 1611 8357 3372 2407 -2064 2433 8353 -9986 -10489 4264 -3518 -3837 4293 517
508 517 -1658 -9020 -7065 8633 1200 -2177 13936 8716 1233 4690 2207 2819 -4913 -9786 4326
523 4326 -597 -12866 -136 1002 -5666 -804 569 6811 4303 -3798 11470 15655 546 5862
537 5862 7839 -1701 -2767 -3301 2879 2695 -13417 -6335 2464 -9667 -4175 7314 4476 4497 2933
552 2933 8240 14446 86 1180 12222 -298 -3319 5241 2009 -462 -6486 -6574 1854 -8756 -11084
567 -11084 5952 2392 -1279 7703 7340 6050 461 -3025 8595 3674 -4405 8573 6391 -3712
581 -3712 -1136 -2331 -1813 -5006 -11172 595 2800 -6943 3305 6791 -2608 -2374 -3047 798 3230
596 3230 -3981 5274 11491 -2417 -151 4925 -3024 -3899 -5390 -2217 3128 -6963 -4390 5075 -7548
611 -7548 -10222 -1737 -4646 -2827 -2310 1318 10382 1710 -1154 9689 722 -5617 2359 890 464
626 464 -1874 -4829 1525 -7089 -15552 -3289 -4919 -11005 -1323 2433 3438 3507 -409 7478 5209 -5071
642 -5071 5410 7574 -1075 2377 1393 -1913 -4221 -12745 -7398 -3174 -12709 -4282 3985 -1989 1514
657 1514 2672 2469 5872 -728 3488 12057 1941 2371 8223 -514 -3289 -5334 -8197 -3114 -8444
672 -8444 -7678 4326 -2144 -4655 3812 406 72 2075 1860 9833 6267 1306 10639 4560 -4261 89
688 89 -3059 -4560 -3129 -5893 1608 550 -7320 1713 1936 -6044 963 3093 3464 6805 2965 7303
704 7303 7453 -4196 522 3597 -5049 -1454 413 -1513 763 -4021 -1815 2735 -6369 -3257 4490
719 4490 -857 2206 5239 2353 4583 -585 -1820 4987 -1963 -2829 5657 -283 -1023 1188 -3120 -315
735 -315 -3554 -5979 3351 419 -3027 5020 1133 -1030 1809 -2094 2078 1328 -3561 4735 4311 -2700
751 -2700 2847 74 -4182 -1291 -4053 -17 2969 -4335 1284 3260 -4831 -255 786 -2520 1907
766 1907 -625 1762 6414 -1511 187 3721 -4671 -2390 157 -2853 1137 -1139 -1526 3880 -2849
781 -2849 -3452 3048 -2848 -1599 3712 904 4123 2178 -1879 3373 -1895 -5530 1841 -2141 -2983 1925
797 1925 -1754 403 504 -4377 1684 720 -3366 4603 2964 632 4796 283 -71 1081 -5387 -1078
813 -1078 107 -5640 1008 1405 -3543 711 -2114 -1762 3034 -1405 2597 6852 225 2912 3843 -1934
829 -1934 457 -1465 -3949 699 -4185 -3219 2619 -2878 -1920 1556 -2934 424 2061 225 6656 3587
845 3587 630 5566 -598 -2715 1432 -3767 -2244 -693 -4678 280 -831 -4614 1943 -1022 -3145
860 -3145 3439 378 1607 5675 932 3703 3507 -3053 646 -787 -4861 1118 -1118 -2221 1043
875 1043 -3694 -2044 1109 -2970 1689 2801 -2037 2784 2587 -61 4356 -102 -1192 1727 -3640
890 -3640 -801 2837 -2830 470 670 -3891 689 -846 -2084 3052 -826 -594 3551 -1991 -227 2305
906 2305 -2405 1345 947 -2228 2897 -452 -1816 3505 -1411 -1862 1973 -3017 -637 1295 -2110 2711
922 2711 -92 -3812 1817 -1129 -2260 3399 -90 156 2445 -1711 2189 2049 -3063 2099 603 -3319
938 -3319 1823 -75 -1181 1846 -2683 -382 1395 -4047 1295 2790 -2133 2637 2130 -668 2425
953 2425 -1436 -659 2878 -2946 -230 2960 -2537 121 1408 -1413 1777 -1377 -2413 3150 -1799
968 -1799 -961 4184 -736 -507 967 -1989 1475 -622 -2796 3441 -613 -2653 3832 58 -942 1702
984 1702 -1429 1162 496 -3381 2954 1064 -3833 2113 368 -2399 390 -2164 82 1869 -3211
999 -3211 2353 3168 -3258 1482 1515 -1447 1166 -1474 46 2542 -3711 -469 2814 -3753 -1615 782
1015 782 -2122 531 -1286 -562 4013 -2361 -1393 4170 -1856 -1681 1789 -747 1291 -581 -1900 3226
1031 3226 -1901 -4221 2714 -1479 -2787 1121 -728 842 -117 -3505 2850 -146 -4717 2498 1428
1046 1428 -1273 1964 163 1370 1156 -3922 1790 2006 -4361 1000 1676 -2116 -85 -1846 -911 838
1062 838 -4567 49 4023 -2171 678 3678 -243 1044 -561 350 3419 -2426 -763 4832 -1875
1077 -1875 -2468 1102 -2247 -1358 -2119 -1679 3577 -1144 -1937 5450 1078 -1038 2315 946 1419 815 -666
1094 -666 4912 944 -4266 2005 -73 -3994 -11 -622 730 340 -2876 3345 2759 -3712 1866 3225
1110 3225 -1277 1366 1294 2065 2555 -2873 843 3340 -3982 -728 2447 -1368 24 -191 81 1805
1126 1805 -3795 -1821 4084 -1636 -937 3435 97 220 -23 73 3921 -1219 -2366 4206 -58 -1989
1142 -1989 2542 -242 -1238 -2175 -3712 2074 -415 -3684 3323 908 -3307 994 585 674 1123 -1689
1158 -1689 3589 3699 -2703 2291 1667 -3768 -1666 -2001 -1293 -329 -4140 513 2923 -3931 -659 2049
1174 2049 -2637 -558 698 2373 4906 -624 130 3457 -3267 -2887 1417 -2335 -1993 -1248 -1388 2517
1190 2517 -1696 -2592 2742 -2169 -3084 2682 1675 1430 1609 -527 3145 -494 -3863 1690 -662 -3798
1206 -3798 1146 827 51 504 -2600 1237 295 -3596 1900 2477 -2109 1449 1043 797 1128 -2971 -368
1223 -368 1572 -4209 467 3200 -1126 243 218 -311 1774 -1589 -198 3395 -2173 -976 2796 -861
1239 -861 -773 -471 -1865 1437 -1630 -1474 4229 -713 -1992 2833 -64 154 814 -639 2576 643 -2048
1256 -2048 2876 78 -3842 258 -807 -875 419 -1897 1512 1486 -2932 1766 1609 -2042 1275 621
1272 621 995 2502 -725 1083 2108 -3508 -740 1482 -2400 -267 -117 -1156 1252 -2006 -1020 2178
1288 2178 -2507 -964 3153 -41 1493 1892 -204 2572 -453 -1690 2587 -884 -1799 1527 -1429
1303 -1429 -805 -130 -2619 230 -1034 -3012 2268 485 -1455 2598 717 583 1911 -798 1496 1672
1319 1672 -1934 1754 1156 -2372 83 -1285 -2412 -272 -2659 -937 1607 -2654 501 1928 -1272
1334 -1272 1447 1172 -376 2669 200 270 3381 -1021 -423 1401 -2106 -920 -603 -2502 640 -1189
1350 -1189 -2717 1379 -1283 -1350 1931 -692 1041 2536 10 2371 1823 -1002 2137 -23 -1993 1005
1366 1005 -1612 -1529 -4 -2999 -1062 -90 -3670 -109 390 -1261 2287 1227 787 3661 412 849
1382 849 3132 -685 656 975 -2025 239 -1231 -3110 -145 -2575 -2917 771 -1514 -262 2406 -9
1398 -9 2372 2411 66 3003 1484 -944 2121 -214 -1277 863 -2697 -1435 -592 -3753 -713 -12 -2249
1415 -2249 1287 1092 -161 2461 406 976 2736 -1047 818 2046 -1726 174 -61 -1690 383 -1980
1431 -1980 -2280 1476 -1688 -868 2092 -388 513 1144 -454 1429 210 -1096 2227 -486 -1533 1762
1447 1762 -927 -738 452 -1397 1094 410 -1666 1709 583 -1829 1282 -15 -875 520 -1626 199
1463 199 807 -2218 918 1679 -1606 1042 691 -633 1369 -443 595 1970 -1891 -358 1338 -1503
1479 -1503 -533 61 -1558 447 -1507 -1005 2351 -958 -711 2409 -79 180 1407 -81 1482 -237
1495 -237 -1352 2070 -678 -2321 1091 -718 -1075 260 -1256 1284 412 -1960 1995 1525 -1718 1179
1511 1179 303 -653 581 -648 643 1250 -2390 654 1271 -1724 1049 1113 -321 660 -985 684 1983
1528 1983 -2130 -566 1023 -2444 -1068 137 -596 999 -1087 -616 2418 -429 -84 3101 -30 0
1544 0 1294 -242 987 -833 -2304 876 -1270 -3222 595 -1272 -1611 212 -373 1711 1328 -745
1560 -745 2975 1891 -420 2527 1334 -931 -578 -2038 -452 -350 -3298 -947 -423 -3372 -593 794
1576 794 -56 1230 -275 1461 3360 71 1710 3139 -714 -368 368 -1210 -253 -1920 -1739 647
1592 647 -2397 -1895 897 -1611 -1172 1259 1017 2497 1171 210 3015 211 -892 2134 -324 -1500
1608 -1500 -647 -1339 340 -455 -2216 425 -673 -3240 952 770 17 1166 412 1634 1585 -1129 1575
1625 1575 1275 -1950 438 1203 -654 434 -1152 -257 550 -2646 -676 1496 -1675 61 1183 304
1641 304 1341 -258 9 1962 -1110 -109 2995 -195 -374 891 -427 210 -363 -1370 851 -1263
1657 -1263 -2300 1364 -332 -971 740 -332 768 698 -689 2583 1050 -1346 1631 839 -876 551
1673 551 -526 -90 -66 -2070 404 240 -2734 209 793 -526 1073 102 717 1722 -938 921 1846
1690 1846 -1373 83 933 -837 393 -767 -948 397 -2464 -1278 1413 -912 -329 1784 46 869
1706 869 510 -206 1980 -341 -946 1798 -232 -1014 745 -1010 -172 -529 -1624 589 -260 -1746 1316
1723 1316 664 -430 1419 234 490 767 -981 1023 1039 -1771 333 221 -1771 -122 -1190 -656 640
1740 640 -1733 372 1493 -1086 487 1526 -192 939 313 81 1551 -788 -535 1209 -1643 -1098
1756 -1098 360 -1541 -337 -287 -1019 1170 -301 -492 1949 -334 -196 1911 -248 646 687 -936 754
1773 754 -366 -1775 555 -250 -1494 524 -750 -175 611 -1239 765 1069 -904 1271 1058 -583
1789 -583 1198 -21 -122 619 -1488 -73 866 -1784 -42 269 -1321 359 40 -1105 860 -675
1805 -675 -93 1858 -579 484 1410 -525 604 514 -636 1261 -126 -963 900 -628 -947 545 -1313
1822 -1313 -547 427 -1251 556 -171 -1158 1444 177 -265 1524 110 211 1398 -499 764 817 -1213
1839 -1213 624 -193 -1840 180 -1344 -1235 381 -1372 -337 669 -1123 612 1261 -146 1875 1143
1855 1143 155 1799 -191 -265 879 -1449 -868 107 -1954 -561 -452 -1916 208 -514 -673 1364 347
1872 347 451 2173 68 1167 1667 -462 613 425 -1025 465 -895 -1760 7 -1677 -1328 280
1888 280 -1178 200 746 -553 1370 1312 -40 1707 191 23 1481 -770 -86 951 -1341 -196
1904 -196 9 -1663 388 -482 -1143 867 -585 -452 1169 -290 223 1256 -892 895 999 -493 1424
1921 1424 451 -473 975 -546 -741 918 -1140 -288 421 -1248 229 -142 -1455 702 -456 -346 1265
1938 1265 -334 256 1641 -180 779 1264 -974 671 310 -725 1170 -810 -1437 103 -1625 -1242
1954 -1242 74 -1184 111 -21 -786 1748 923 136 2302 321 47 1230 -179 102 722 -1521 -139
1971 -139 -383 -2118 -256 -632 -1561 369 -391 -9 1517 -439 1023 1595 -612 1115 1236 -413 641
1988 641 -117 -474 719 -997 -1140 92 -1974 -470 635 -780 297 296 -753 1119 242 -6 1706
2005 1706 -410 -63 1098 -520 35 94 -1329 639 -482 -1183 687 -93 -857 592 -443 140 879
2022 879 -1005 832 514 -918 1390 334 -1032 875 -273 100 1080 -157 602 646 -1259 431 465
2039 465 -1197 261 -366 -966 757 -537 -247 1079 -1078 -199 951 -637 939 715 -84 1256 -329
2056 -329 -426 1207 -986 -704 620 -1288 -198 8 -1098 426 -151 -875 1076 -160 -490 1491 132
2073 132 438 1110 -172 680 336 -1327 687 -314 -1417 592 -385 -722 295 -911 84 247 -1122
2090 -1122 672 781 -940 738 450 -348 778 -643 -275 797 -1314 205 1033 -675 324 96 -592
2107 -592 455 -477 -394 1231 -653 -328 866 -796 -14 428 -731 795 -38 -519 1255 -362 -637
2124 -637 1385 -276 -427 560 -472 648 -52 -1048 892 22 -1165 658 -438 -505 411 -533 833
2141 833 852 -783 938 907 -744 479 424 -819 710 -538 -218 530 -1551 -269 532 -1409 -18
2158 -18 248 -739 917 -108 -26 1398 -484 94 1691 -714 70 436 -754 291 -537 -1281 707 -897
2176 -897 -1330 1005 -515 -267 717 -206 781 653 -467 1194 211 -704 1118 -133 -585 450 -1089
2193 -1089 -74 -49 -1465 141 159 -1198 610 322 -515 833 -29 154 1110 -744 474 878 -1124
2210 -1124 225 320 -827 612 -221 -340 740 -1023 -244 1286 -571 -78 670 -525 700 -4 -230
2227 -230 978 -471 -465 1038 -655 -537 605 -810 211 198 -747 684 -156 -1165 820 -261 -564
2244 -564 344 -482 312 720 -827 897 646 -555 951 190 -401 594 -337 -294 1094 -1432 444 677
2262 677 -1197 -17 313 -671 272 -315 -320 1127 -566 51 1251 -624 196 806 -657 277 75 -772
2280 -772 458 -818 -700 841 -458 -200 777 -287 268 669 -488 753 17 -543 648 -322 -576
2297 -576 444 -773 -169 379 -824 498 321 -727 931 222 -760 1032 6 285 878 -480 319
2314 319 668 -931 40 -77 -1076 81 -557 -590 798 -520 45 1028 -607 570 1013 -222 401 549
2332 549 -380 997 -369 -819 448 -983 -893 278 -899 -90 229 -572 1003 124 -369 1231 122
2349 122 -363 1064 -237 -165 555 -1039 311 -178 -1170 194 -449 -1061 619 -231 -130 595 -686 -76
2367 -76 1167 -507 837 720 -326 674 128 -336 697 -443 -12 434 -1016 -88 395 -789 287
2384 287 293 -562 382 146 -126 1210 -76 312 759 -799 525 562 -606 584 136 -920 536 -442
2402 -442 -756 458 -958 -475 323 -888 187 583 -578 915 401 -401 1015 29 -48 984 -263
2419 -263 23 435 -1131 35 -96 -1079 22 -297 -833 553 -215 82 781 -365 472 846 -303 496
2437 496 879 -374 786 -45 -637 453 -648 -505 117 -797 -221 172 -1115 206 77 -588 579 66
2455 66 330 1316 -84 407 605 -405 181 432 -741 51 -90 -797 245 -826 -528 781 -854 -308
2473 -308 916 -822 612 806 -303 952 351 -179 928 -226 -266 692 -615 -38 148 -825 315
2490 315 -31 -893 311 251 -533 739 -318 -78 942 -396 568 527 -545 849 501 -643 465 -115
2508 -115 -470 667 -574 -332 289 -1031 -131 208 -841 498 160 -517 786 -237 188 834 -528
2525 -528 343 798 -489 217 101 -743 426 -240 -733 242 -538 -707 275 -559 -114 592 -737 424 469
2544 469 -365 828 170 -258 1026 346 33 235 -699 151 185 -1232 119 99 -930 69 -238 -95 366
2563 366 -162 -2 803 -374 309 742 -198 457 472 -224 279 -495 -575 507 -672 -474 116 -911 -45
2582 -45 431 -272 808 -207 -362 908 52 -139 908 -8 246 660 -453 617 92 -736 426 -207
2600 -207 -902 72 -410 -328 391 -910 300 414 -836 458 467 -250 487 45 60 520 -291 151 754 -1034
2620 -1034 -143 478 -806 108 -272 -460 349 -590 -231 486 -584 29 972 -225 535 751 -189 686 -20
2639 -20 -447 734 -237 -707 370 -600 -588 87 -680 15 -169 -700 749 43 -399 1026 -119 162 957
2658 957 -197 493 275 -727 486 271 -663 413 41 -780 14 -585 -217 303 -557 109 577 -624
2676 -624 581 424 -143 720 -167 -16 550 -555 -521 465 -562 -192 -17 -561 7 -433 -642 546 -140
2695 -140 -136 641 -70 196 320 -288 15 -151 -337 614 -150 -764 719 -246 -427 251 -462 31 -128 -507
2715 -507 405 490 -260 289 44 -223 455 -178 -91 822 -508 242 541 -694 203 127 -613 212 -211 -563
2735 -563 283 -634 148 478 -502 167 425 -375 665 15 -215 671 -300 -330 569 -76 -331 173 -577 227
2755 227 127 -796 746 -382 -506 587 -131 15 545 -389 253 262 -502 520 406 -648 642 292 -409
2774 -409 274 -242 128 498 -744 246 337 -707 316 132 -140 589 123 -175 534 -370 -81 453 -509
2793 -509 257 217 -140 360 -31 -480 589 -260 -313 792 -316 -82 349 -570 -20 124 -403 585 -335 -341
2813 -341 578 13 -118 738 -406 147 482 -468 402 12 -491 208 2 -414 255 -460 -51 637 -737
2832 -737 59 625 -549 425 206 -224 447 -15 -82 461 -33 -26 639 -619 97 169 -562 258 -229 -800 90
2853 90 -415 -117 634 -206 -107 478 -491 377 158 -303 460 154 -559 561 -355 -542 564 -676 -17 494
2873 494 -767 211 370 -460 467 125 -142 774 -262 96 536 -342 160 337 -614 450 53 -586 234
2892 234 -66 -261 237 -321 -345 549 -424 8 267 -607 206 163 -410 670 -110 -306 442 -278 -61 286
2912 286 -610 197 273 -415 106 -236 -375 320 -153 -352 168 -516 87 387 -310 399 412 -556 585 38
2932 38 -552 552 -106 -206 387 -579 128 202 -559 185 97 -424 226 197 -198 209 -248 31 499 -529 179
2953 179 377 -307 202 83 -566 437 -225 -527 240 -556 -233 304 -542 -80 511 -477 247 210 -166 530
2973 530 143 285 592 -133 45 415 -561 -192 236 -725 249 -139 -593 288 -339 -451 585 -814 165
2992 165 265 -247 402 593 -114 278 -6 -290 871 -209 38 602 -525 -344 203 -948 99 -25
3010 -25 -734 118 -57 -554 868 -22 126 646 -243 273 480 -266 536 -85 -300 273 -597 -606 276 -437 -208
3031 -208 368 -796 -169 76 -364 460 -27 -47 805 -49 155 840 -54 114 287 -574 -80 -118 -627 307
3051 307 -317 -580 436 -313 -129 351 -410 303 640 -145 514 122 -314 499 -61 -285 295 -344 -134 199
3071 199 -674 116 144 -836 139 28 -426 170 -151 -75 659 -181 96 461 -315 148 228 -341 73 197 -634
3092 -634 61 -501 -456 656 -427 -96 280 -606 412 238 -288 388 -18 -272 714 34 162 449 -261
3111 -261 -159 192 -507 23 -185 -818 155 -119 -444 472 -33 -70 309 -310 193 454 -333 606 54 -573
3131 -573 329 -56 -185 325 -344 -356 59 -849 -8 213 -505 243 26 -344 339 -173 177 310 -492 204
3151 204 456 -523 287 38 -398 56 -122 -590 349 -574 -374 396 -252 -139 150 -240 343 197 -279 609
3171 609 257 -462 583 -59 -163 418 -441 110 140 -685 106 107 -540 232 -362 -505 254 -210 -37 408 -313
3192 -313 173 263 -211 296 160 -501 476 -201 -92 388 -335 -387 169 -343 8 278 -536 400 150 -328 342
3213 342 -80 -126 625 -49 -113 334 -395 326 393 -566 85 -69 -505 294 -390 -330 116 -481 80 271 -488
3234 -488 386 267 -585 506 155 -10 193 -274 26 246 -461 73 530 -488 347 12 -389 206 -153
3253 -153 -396 687 -143 -35 387 -368 224 170 -62 310 159 -545 581 -366 -225 559 -385 261 349 -493
3273 -493 256 19 -743 574 171 -363 215 -238 -217 231 -237 62 310 -436 428 452 -577 252 -94 -237
3293 -237 219 -227 -313 238 -384 161 144 -340 415 -70 -384 254 -65 -60 294 -167 12 180 -211 184 238 -319
3315 -319 413 -303 -119 420 -184 -289 402 -399 56 145 -413 -15 275 -438 487 96 -39 449 114 111 545
3336 545 -267 -186 296 -470 407 170 -752 158 -152 -428 402 -154 -287 313 -519 292 509 -329 87 93 122
3357 122 438 -36 -382 492 -251 66 202 -571 -27 114 -618 298 21 -390 263 -138 -238 395 21 186
3377 186 357 114 407 124 -467 353 39 -549 370 -33 -215 169 -290 -116 171 -644 398 174 -300 596
3397 596 104 -123 662 -392 74 465 -256 10 19 -398 -139 -19 -646 114 -98 -207 134 -288 -21 396
3417 396 -20 203 243 -65 392 96 -220 511 64 -344 503 -285 12 325 -493 210 133 -357 226 309 -211
3438 -211 444 -41 -132 469 -341 146 315 -100 180 177 -565 134 -65 -576 68 -303 -26 12 -286 -17 158
3459 158 -365 546 77 -16 589 28 -248 525 4 -135 444 -233 104 40 -523 16 -308 -703 83 -297 -56
3480 -56 271 -340 -141 288 -135 228 409 -84 471 90 -401 488 -83 -91 270 -529 -66 108 -688 228 146
3501 146 -555 136 -354 -41 520 13 -50 469 -328 218 415 -227 282 412 -219 214 -292 -322 123 -255 -213
3522 -213 344 -490 -45 218 -404 148 -54 -519 496 -38 -238 552 -359 18 -38 -184 215 126 -380 419
3542 419 -180 -436 64 -155 -82 284 -257 79 239 -456 57 386 -169 261 139 -535 364 -208 -169 275 -132
3563 -132 -60 50 -556 11 0 -402 150 -207 19 172 -274 -155 447 -290 174 362 -142 390 201 -413 331
3584 331 90 -109 311 -232 -18 -125 -346 -215 76 -472 106 72 -266 415 91 135 218 -194 319 284 -413
3605 -413 449 160 -176 111 84 -201 242 -297 -252 344 -408 -116 225 -443 12 214 40 396 -143 -281 534
3626 534 56 -398 474 -466 53 3 -300 318 24 -564 257 -177 -378 378 -140 -53 399 -82 400 404 -190
3647 -190 196 307 -292 82 -18 63 278 -176 -57 187 -238 207 182 -190 271 129 -137 262 -244 -117 376
3668 376 -156 219 420 -189 117 -105 -387 119 -265 -461 433 -190 -194 190 -195 -48 229 -366 275 66 -169
3689 -169 353 27 -43 558 -212 -6 355 -329 -90 -116 -254 126 92 -636 100 163 -63 333 -99 73 451
3710 451 -96 222 363 116 232 97 -262 111 -219 -339 196 -398 0 93 -459 208 11 -175 69 -346
3730 -346 103 372 51 -1 277 -258 114 -2 -568 -252 -335 -367 28 -97 -619 345 -317 -58 225 -57 86
3751 86 508 -58 296 389 -258 421 -81 -63 228 -117 -167 21 -272 66 196 -266 -247 -238 -387 532 -241 -172 415
3774 415 -4 276 362 -135 62 293 -29 312 78 -197 191 -197 -278 26 -51 28 59 -452 104 152 -220 89
3796 89 119 -354 171 -90 123 230 -120 363 -59 -435 60 4 -317 -5 -79 -358 246 -164 -284 461 -302
3817 -302 -22 161 -350 178 -6 38 276 -69 -189 90 25 -8 -37 -332 76 92 -388 163 21 -330 202 181
3839 181 -111 435 2 154 161 -327 132 308 -106 346 8 -418 140 -79 -168 139 -193 66 543 -660 34
3860 34 -64 53 46 -295 -303 372 54 -43 259 -68 94 375 -186 248 298 -162 300 46 -187 207 -119 -56 311
3883 311 -225 146 29 -175 37 107 41 479 -81 183 390 -197 339 203 -91 108 10 -389 142 -234 -326
3904 -326 105 -296 19 180 -263 166 431 -135 292 353 -11 407 121 43 255 -99 -164 148 -357 -139 -90
3925 -90 -195 -112 -60 -403 -98 -69 -21 189 -300 139 464 -125 209 118 -240 368 -16 -47 -182 -121 -333 97 -261
3948 -261 -121 127 -40 9 201 -124 217 179 -61 325 -46 -203 300 -56 61 97 -185 216 -33 -328 -50
3969 -50 63 -539 54 -181 79 213 -68 -56 361 21 364 -17 -96 128 -256 -390 5 -121 -268 391 -294
3990 -294 -118 -317 -294 112 -67 -30 174 -39 -185 363 -70 170 478 77 57 -108 -396 160 36 -391 -10
4011 -10 -299 90 271 -182 -2 56 -232 100 184 -255 220 -183 -176 200 287 41 290 -235 -98 -132 -501 304
4033 304 -126 -93 197 -281 -339 66 -99 -170 147 -250 199 -9 -163 -29 -130 -379 25 7 138 -20 -133
4054 -133 5 105 -202 302 -28 -419 235 -202 -207 158 -162 -202 282 -178 30 395 -43 21 106 -235 500 -30
4076 -30 -215 127 -435 -41 -69 -509 355 34 -259 230 180 -402 167 71 -60 297 53 -204 245 -358 233
4097 233 43 -266 320 -64 -206 394 31 -79 314 -35 299 70 -50 36 117 -266 144 272 -25 326 -143
4118 -143 -179 349 -293 -385 231 -108 181 62 -336 353 40 -383 401 -368 191 121 -201 100 129 -6 110
4139 110 468 -124 131 -122 30 381 214 -96 153 -263 61 -21 -191 96 59 -189 191 94 -96 177 -176
4160 -176 158 57 -368 -26 33 -217 -16 41 57 -190 -17 -274 -58 -438 -251 -195 -219 226 107 -451 111 13
4182 13 1 220 15 118 257 -72 -39 97 -352 21 18 -97 300 -121 -156 282 -245 -82 284 -178 -197 474
4204 474 -212 588 -32 -125 249 10 -326 121 -313 -34 134 -175 -339 108 -386 507 -179 -206 155 -217 19
4225 19 386 -315 147 111 -274 -30 159 7 161 -9 -94 182 -187 -257 240 -296 151 317 -261 148 84 -295
4247 -295 297 118 -84 436 -86 44 500 -376 -141 155 -108 150 -131 -612 171 -163 -220 211 96 -41
4267 -41 44 -71 195 346 -149 189 394 -149 128 -29 -137 194 -296 -454 81 -413 -155 166 -95 147 -140
4288 -140 -38 261 77 293 215 88 174 60 -175 170 32 -149 -75 16 -334 5 -382 -255 3 -203 50
4309 50 88 -251 144 -74 -13 165 -365 -183 136 37 27 273 -91 -257 12 -465 230 77 -94 235 -10 206
4331 206 400 -166 11 343 -336 117 26 -466 46 188 -57 272 62 -19 -127 -35 -93 252 -195 347 2
4352 2 -86 110 -5 -102 342 84 10 290 -15 143 -102 -385 -7 -42 -99 353 -171 -267 179 29 -65 163 -128
4375 -128 -111 -101 -244 -22 -133 47 352 176 -78 327 71 -215 75 -309 -155 124 -424 141 -231 -306 11
4396 11 -114 -525 -33 -190 85 169 -216 -15 -37 -74 194 25 58 366 -49 -63 -20 -301 -290 366 -308 -164 -148
4419 -148 -255 46 -28 -132 19 4 -79 458 40 -320 58 -38 162 198 -280 396 -4 -250 2 -366 -228 274
4441 274 -237 -197 53 -81 252 61 -363 -52 11 -249 360 -307 -80 143 -200 211 -19 -135 6 -36 -261
4462 -261 -80 -146 147 -39 -445 88 326 -67 222 106 -241 260 189 126 88 23 136 405 -35 38 310 -224
4484 -224 -46 -220 42 -123 5 -294 323 194 -20 258 -296 106 -125 -92 95 40 -35 187 -148 -37 369
4505 369 -224 -155 15 -147 12 198 -196 -3 89 -97 218 334 168 287 91 165 268 60 -20 191 145 30
4527 30 40 -154 149 -66 -29 -26 41 141 59 -133 167 -96 -239 260 238 -371 362 57 -306 89 -180 149 -141
4550 -141 -123 288 211 -483 -2 -29 -84 308 67 -98 184 -93 -18 160 -167 -22 -130 -196 35 139 -94 160
4572 160 -152 -141 103 -15 49 139 141 465 244 -87 248 -44 -105 195 276 -32 188 -208 -52 280 -273 172
4594 172 -78 75 203 -210 -57 82 -171 131 78 -22 145 19 -334 -34 34 -75 -23 11 -90 180 -480
4615 -480 -65 -80 -171 66 123 -340 129 199 -86 -5 -151 -60 235 114 251 41 -189 337 -290 -260 -49 -108 -246
4638 -246 -21 7 -7 44 -170 236 336 -299 344 356 -245 -49 145 113 266 -101 178 441 -172 129 178 -153
4660 -153 407 -196 -14 115 -220 -388 168 144 194 -75 -45 43 136 50 62 -101 -176 135 129 -372 -27 -122 164 -5
4684 -5 -262 238 126 -149 5 4 -127 389 -117 115 266 178 287 127 -241 -111 56 -333 -80 -184 -211 113
4706 113 -244 -23 147 -244 91 -77 14 114 127 -80 172 -279 33 97 111 170 15 -92 -57 17 -152 154
4728 154 -275 -242 267 -50 22 41 39 -74 211 -382 169 372 -149 193 60 -3 372 -11 38 620 -267 -90
4750 -90 401 86 -127 81 -123 -268 -232 -209 103 -188 204 471 -85 180 74 -100 225 -182 -131 99 -85
4771 -85 -19 47 165 -279 -74 -234 49 -124 -238 151 106 191 134 21 -68 101 113 111 206 -258 1 -27 108 168
4795 168 15 32 405 23 115 -56 98 -168 -109 -303 319 10 17 456 -24 92 218 -36 15 257 -242 57
4817 57 -154 55 110 -182 -451 -94 -57 -115 27 -232 190 6 -92 -37 27 70 247 40 -202 355 -115 -47 92
4840 92 -8 -201 101 -94 -76 -155 -105 195 171 74 -2 -40 -47 247 105 -74 251 -263 17 -71 -107 341 -272 -24
4864 -24 201 -323 -174 218 -136 -68 230 -90 122 20 -239 302 171 28 491 -84 -269 244 -225 0 128
4885 128 -517 32 -94 -121 101 -30 -85 161 -87 126 143 260 258 147 -192 285 74 -170 -116 83 -61 -41
4907 -41 -77 -80 284 -162 -299 -46 -232 -4 -22 -138 8 92 -65 8 205 153 74 -170 28 226 -215 129 6
4930 6 -123 145 11 22 152 -170 -68 -52 54 221 217 -154 105 6 181 155 -316 17 98 -268 -31 -13 -268
4953 -268 -163 -300 -231 214 -40 212 138 -56 120 117 -62 -198 169 200 -80 -110 -90 -27 99 264 -15 -62 -138
4976 -138 169 -180 -215 -73 -199 196 -235 -137 128 67 39 243 -344 366 111 -32 57 145 -108 -44 -51 -197 169
4999 169 -57 199 -300 6 41 167 256 -136 25 -338 354 61 237 9 -158 106 37 -305 -254 -11 -304
5020 -304 102 57 -131 178 105 -64 287 -222 39 39 83 -18 49 -354 -125 -158 -172 131 -34 18 141 -70 -188
5043 -188 -149 -266 115 -50 126 109 -26 139 502 96 196 459 -203 107 84 -206 -86 -237 -158 123 56 258
5065 258 60 78 -228 44 17 18 149 -144 25 -36 -140 291 0 161 95 -85 -44 90 -52 108 202 -220 18
5088 18 1 -221 -36 -25 -9 267 109 123 -60 -343 170 -237 100 -59 -246 -71 346 -28 165 65 108 -92
5110 -92 -19 -167 206 106 365 219 97 69 281 -54 -77 191 97 281 -70 -181 81 71 51 56 -31 -179 -44
5133 -44 -89 -57 -177 -252 83 -72 -191 160 177 -203 296 -50 322 111 -36 96 -67 -201 -205 193 -76 -145 107
5156 107 -85 240 -25 170 261 -243 -186 150 -226 447 -43 38 106 -14 -229 18 -211 -61 298 -73 -132 68
5178 68 37 -63 -95 -118 370 2 -69 175 32 110 6 -62 87 81 22 5 136 -290 166 -18 -217 88 -245 -94
5202 -94 -178 -224 156 38 15 63 152 12 242 -45 230 -36 -261 -78 405 -95 39 55 62 6 38 65 415 -237
5226 -237 -160 27 116 134 323 -145 140 15 -72 458 -63 190 -18 -171 -8 -68 -134 147 60 5 157 -100 18
5249 18 -19 -397 -225 353 -140 -84 83 90 147 51 -404 -109 -58 -311 -2 -15 -318 85 -381 -95 106 -133 -10
5272 -10 11 -181 -73 13 217 -27 -4 -8 15 -73 -175 -9 -125 36 -215 -195 147 -255 20 40 52 63 43 -68
5296 -68 27 210 95 120 -50 -153 264 79 186 340 77 25 156 -231 12 222 -139 276 -50 -215 47
5317 47 10 283 158 -58 154 63 -196 25 346 -208 93 378 -167 -77 -244 -205 80 -131 178 -79 0 -122
5339 -122 -17 -20 7 -262 -25 216 -133 39 25 -142 291 11 -114 122 -282 -147 114 -138 -22 35 41 -106
5361 -106 -192 110 99 22 -215 231 8 -105 -93 10 -182 150 -2 66 208 -191 -132 347 -272 -54 -98 -19 323
5384 323 123 219 -51 56 41 136 -191 117 83 -102 198 -104 -211 -79 -149 -67 74 -422 95 84 -255 -101
5406 -101 12 -44 188 -78 93 232 -13 -178 180 -95 19 75 148 -129 272 83 3 -64 -366 -92 -116 -303
5428 -303 71 254 16 51 -148 395 134 -24 216 189 27 296 73 -175 56 -163 67 24 -8 310 -181
5449 -181 -97 337 -92 23 347 57 -12 227 -246 168 181 89 91 -18 -13 -124 -147 -95 77 -136 -66 79 0 -19
5473 -19 -173 -122 91 -18 -346 180 -145 -59 263 -239 163 -108 -79 98 85 -185 -15 8 -215 216 -503 -118
5495 -118 234 -259 -7 152 164 344 165 -125 312 -102 -24 242 -35 -112 -159 -55 248 234 -75 114 36 -106
5517 -106 77 -131 84 -19 -163 216 347 -40 138 197 -78 -18 77 134 -116 -45 -265 -297 -416 196 113 -190
5539 -190 -69 178 -216 274 26 -44 125 -11 4 -86 -15 29 201 -30 90 -257 -143 -241 -57 41 46 -334 -43
5562 -43 157 46 117 68 -113 181 144 -242 66 -160 198 37 -114 -95 228 -210 -131 -41 -75 313 -21 27 187
5585 187 240 232 202 -18 -30 43 142 122 72 -228 135 -344 -75 259 -190 -179 -67 -105 76 -62 -63 110 101 133 159 -41
5611 -41 30 120 -189 117 -46 -188 -64 2 -246 321 -145 -233 85 -351 -78 276 -62 -6 206 189 -20 -115 -111
5634 -111 162 81 138 -25 -242 96 -192 -368 -194 138 -177 -39 -2 -129 269 -101 182 89 -321 63 163
5655 163 -15 28 11 -317 -48 246 -10 240 10 -169 -60 60 -19 -172 -148 47 -43 127 -46 -234 -163 35
5677 35 63 82 196 111 250 -31 89 143 -85 -41 28 -191 18 61 -169 40 113 -73 -84 80 -113 180 -64
5700 -64 -169 277 -417 -183 332 -317 -144 249 29 39 -17 -32 14 -57 -45 297 -185 -124 333 6 -41 106 -180
5723 -180 345 49 -42 87 36 -35 47 -179 -4 306 -5 -61 -257 17 154 138 -154 -25 -151 -97 227 -204
5745 -204 -238 183 -41 55 -211 -39 114 281 -372 152 67 -178 70 74 -76 -131 -244 104 43 -98 118 -54
5767 -54 6 9 -271 -25 107 -7 -30 364 83 17 90 -74 -190 72 243 71 48 -107 105 69 -126 191 -173
5790 -173 188 -51 -57 -72 -45 75 230 197 -80 249 -346 155 253 -140 218 -180 59 74 8 33 104 -173 79
5813 79 284 243 93 84 -147 59 -64 -9 68 206 12 -184 -180 -46 -114 23 -111 -121 -266 239 54 -159 -28
5836 -28 -34 107 203 -12 10 155 147 -81 43 -282 30 481 -73 148 -50 -129 158 -70 -141 -11 -213 226 -102
5859 -102 -167 399 61 40 114 -53 33 233 -261 -216 -210 -3 -118 75 -66 118 86 -243 55 -164 201 224 -154
5882 -154 -137 59 33 148 -294 -243 111 -27 -150 -47 126 99 138 -48 208 3 -202 -242 -13 -151 152 96
5904 96 -108 143 -127 190 161 -135 -43 -31 20 24 -82 63 149 120 -134 153 -89 -368 103 -70 -200 233 281
5927 281 95 262 -211 402 -63 -195 42 13 46 45 -135 55 195 -145 247 -371 -73 284 -199 -157 372 -111
5949 -111 158 147 215 27 -4 -145 189 -154 86 -109 -48 -223 50 -465 -128 104 172 234 -72 162 319 68
5971 68 48 352 -192 317 167 -37 42 202 -187 372 189 49 279 201 134 -122 -132 19 2 -130 13 36 40
5994 40 438 -24 -217 203 0 -76 117 30 283 151 -137 -166 -45 79 -82 -122 31 80 -167 334 20 58
6016 58 -123 3 -59 163 -143 -110 10 -114 77 135 -77 43 32 -156 84 -74 220 106 -26 -32 13 147 69
6039 69 303 147 3 115 -117 3 73 -138 -195 271 -142 -161 -66 87 -22 -126 160 346 -19 220 163 -95
6061 -95 125 -52 -209 -5 -165 -176 29 -136 19 130 -79 -86 294 -42 239 54 114 154 166 30 256 -101
6083 -101 76 208 -139 26 -69 -187 154 -78 -33 -30 -46 -175 237 168 83 -9 31 149 129 82 39 -103 128 56
6107 56 38 134 -249 -152 165 26 308 -12 0 -97 68 -94 -105 184 -142 -143 117 -201 -241 -16 -319 -5 -161
6130 -161 389 128 -277 -35 -116 -173 151 41 -129 -245 -38 -11 -59 143 -149 121 74 -136 84 -38 201 240
6152 240 -13 54 10 5 245 -270 -265 174 133 -145 -84 -51 -125 92 -61 311 -8 -199 295 -39 158 34 -177
6175 -177 64 155 -360 -28 179 61 185 -43 116 -84 -144 43 -20 -76 461 145 349 343 -201 209 359 96
6197 96 -247 294 -5 167 69 -208 -104 -268 182 287 131 -337 -118 -73 -67 7 17 -244 373 240 113 -125
6219 -125 29 109 -193 137 -155 22 144 157 -170 -25 373 -114 55 408 18 128 -68 138 57 -75 -195
6240 -195 21 -222 27 -28 -223 33 -214 210 432 -109 -142 -15 240 -27 295 -214 111 256 -105 -187 -132
6261 -132 -32 370 -136 -160 -160 -293 -177 20 -119 195 121 -159 228 61 46 -46 -210 131 40 207 214 164 -134
6284 -134 172 -23 72 273 164 -134 221 -159 -40 144 -459 411 -32 17 -45 -69 -123 -109 91 -47 -162 -4
6306 -4 194 266 44 45 74 -69 171 -82 -104 -100 283 -141 101 84 162 128 -397 207 -80 -173 -72 19 24 139 48 155
6332 155 -39 -179 115 -233 -407 -41 130 184 361 -100 -29 35 -38 72 -32 262 27 202 -227 -41 -21 -60
6354 -60 -12 -16 -8 153 68 -139 -28 -246 -200 195 -272 37 -147 -157 -260 37 274 169 -118 44 72 -13 118 -73
6378 -73 -141 -133 -64 -281 -110 42 -240 335 -28 62 43 -23 46 -5 182 104 22 -220 149 16 67 158 -198 63 173
6403 173 45 118 209 23 108 -89 -115 148 -32 -33 0 -224 -146 31 -37 87 -40 -76 -100 -80 -68 272 20 30 133
6428 133 -192 107 121 -134 307 422 -289 4 -37 -112 -89 -31 544 119 19 -222 0 -143 -10 -219 -314 42
6450 42 -164 -18 -96 77 47 -61 -345 16 -51 -78 26 -84 -172 -4 216 -194 94 139 162 -18 -153 -268 -119
6473 -119 100 255 82 -82 178 173 27 36 -2 -22 95 -119 162 112 251 96 -173 34 181 43 63 -36 -132
6496 -132 -40 29 -48 288 0 17 56 -36 -7 -29 -25 76 54 -186 67 -41 -120 30 -134 4 -102 183 118 -55
6520 -55 -323 -81 -89 2 158 315 68 -324 -135 70 174 -24 91 358 -32 -16 203 -180 342 41 -94 175
6542 175 115 -178 -39 -34 -27 51 -135 -129 -119 -55 113 -135 14 67 -201 -138 175 69 -92 -13 166 129 106 -176 -173 -71
6568 -71 145 111 241 105 198 206 210 257 -136 131 81 45 34 5 73 -240 -10 23 97 -8 -79 -169 -292 18 -97 -151
6594 -151 -8 32 118 12 249 -170 109 32 57 -28 -150 47 159 70 11 -87 -86 -124 -58 -76 86 -270 207 38
6618 38 -49 302 64 -182 230 9 -19 -15 -197 61 252 6 179 -83 -65 154 -64 -177 73 -273 2 272
6640 272 -184 -1 -136 -48 -124 -118 -214 277 123 -134 -14 126 88 -9 -110 -216 1 -37 -3 39 73 289 -9 56
6664 56 96 -35 79 -79 -14 0 332 -185 290 57 -169 54 -206 -74 150 -103 24 203 -23 62 -83 32
6686 32 401 -28 201 252 -356 106 108 -97 -22 -1 -14 30 -17 -116 -6 140 -5 123 -340 -176 163 -153 -8
6709 -8 -68 -117 -2 205 -270 252 133 103 166 -303 -132 200 -119 -132 -73 -69 79 150 -49 -24 24 -204 161 6
6733 6 105 92 -152 44 111 54 31 128 -118 101 -23 -22 250 -228 103 250 -27 174 234 -104 205 5 -39 151
6757 151 -69 -39 226 -201 -74 -139 -362 182 53 -152 209 39 -77 40 -71 100 72 -289 236 159 -165
6778 -165 190 -46 -159 125 -223 -127 53 -35 -178 15 44 -188 -26 4 151 -219 92 157 223 -181 401 178
6800 178 498 178 48 59 -121 137 -61 -222 -82 -90 -185 -30 -107 -174 -87 -73 -220 420 -216 -207 46 -169 -35
6823 -35 133 19 -187 538 39 37 53 -67 194 -108 114 65 -242 -82 -108 -306 -26 82 58 137 37 116 74
6846 74 -20 -159 253 73 -201 -226 -118 -135 118 55 -49 -16 -3 133 121 123 295 11 -189 -19 -27 103 306 17
6870 17 241 -29 -234 433 -28 30 155 -217 -130 64 -78 -31 194 -223 115 121 -28 345 163 246 70 -263
6892 -263 154 -70 -125 -49 178 -16 244 10 -190 -94 54 42 130 135 -56 119 -234 33 -161 59 195 13
6914 13 -84 326 -108 -153 -149 -149 65 17 -32 226 38 120 40 -34 231 50 26 235 52 1 39 41 -196 66 -96 5
6940 5 -15 -97 -14 -305 -97 231 -13 -156 -53 236 24 58 -90 204 197 84 39 142 108 131 239 -31 143 -104
6964 -104 40 70 -202 -166 -78 44 -69 42 -37 213 127 -213 -89 -130 70 -158 168 49 -36 -13 -244 46 -71
6987 -71 -79 38 -42 94 -2 -329 253 -35 208 -41 19 112 33 -21 235 -55 -272 195 101 -8 -34 -9 4 86 -263
7012 -263 46 3 -147 -315 268 -321 156 137 -210 266 273 -390 326 123 92 59 61 -251 84 -77 196 50 36
7035 36 -211 -203 20 0 -1 -3 77 -23 183 13 42 -13 75 18 118 -3 -14 113 8 -92 379 -73 203 -102 42
7060 42 -224 -299 1 120 -157 -219 245 -344 -215 227 -50 -8 62 -47 147 -10 -20 158 -77 -162 447 -202
7082 -202 56 14 -166 231 69 -121 -90 -15 -124 11 -240 -8 28 -205 -34 -80 -228 -33 238 -22 -178 -104
7104 -104 -114 -31 113 243 23 -116 499 -60 -279 -3 144 76 306 -125 -163 -41 -315 -177 139 -50 282
7125 282 -79 -314 -33 -190 -251 123 42 -225 -152 -125 95 6 3 56 41 -239 220 20 -123 237 -370 -309 79
7148 79 428 182 204 55 -38 -131 -86 19 -172 105 123 36 188 57 -60 205 48 -130 -175 -74 -74 356 53
7171 53 -270 3 -185 -95 258 -264 137 105 145 -69 128 206 250 -229 -144 55 -293 -34 -85 -94 224 188 -390 7
7195 7 112 -191 -18 -245 77 110 -114 -120 -63 -153 322 253 -54 319 -199 -25 -152 14 75 40 -51 -33 115 -161
7219 -161 -78 155 21 21 -197 -143 -135 -203 148 -57 -72 -75 -11 -58 138 80 22 75 -120 47 -54 156 75 33 -6 -44
7245 -44 -41 -139 41 -44 -23 397 -102 -50 64 -71 -12 -170 -150 42 121 -168 226 107 83 -2 98 10 185 -453
7269 -453 33 -34 -202 -5 -101 207 168 -37 -100 332 -218 113 -95 -196 -156 81 15 172 -77 63 4 -509
7291 -509 -11 -12 -147 158 18 159 158 28 -82 11 12 -4 171 -229 313 22 202 126 -198 148 -31 -135 274
7314 274 383 -35 79 65 -24 25 126 -151 -212 1 -70 -106 -224 -201 118 -78 50 221 59 -58 155 -194
7336 -194 238 -40 77 12 97 -70 -14 91 -60 -103 -192 -26 -238 -63 -114 225 -200 -124 -129 171 145 54 20 35
7360 35 -40 -73 -71 130 249 27 144 39 -122 1 130 95 135 -109 -225 357 205 184 233 -113 -155 216 20
7383 20 80 341 -257 244 25 -68 162 42 -237 21 -14 86 250 95 -141 -146 -135 105 107 99 -78 91 -69 -4
7407 -4 -114 -200 213 -208 -31 123 -130 22 56 -387 -10 -136 282 26 -44 -9 59 -115 -63 137 -373 34 -84
7430 -84 -61 279 -59 -124 -74 31 -149 90 27 -170 24 -263 152 75 125 166 -121 -316 9 58 54 170 -171 45
7454 45 -176 85 -169 -182 -28 103 62 -192 -15 -86 51 -45 279 -275 129 65 -56 113 -35 -166 -111 -148 143
7477 143 -204 -383 75 97 -49 -88 -189 195 -74 -197 122 3 209 147 -83 -168 -172 -62 -279 -205 -374 -173
7499 -173 215 -197 -9 -144 -51 -6 -356 -361 7 -122 79 -215 101 -174 143 82 -64 -31 -77 89 -200 37
7521 37 -31 -114 -119 -62 -201 24 -133 -162 -104 -46 226 170 -79 176 216 -47 130 -242 -29 258 175 32 115 104 80
7546 80 27 -121 150 -92 -72 -240 317 33 225 -119 -6 91 0 186 97 -134 178 -10 -94 -50 213 105 -105
7569 -105 -86 81 22 -13 37 -163 -27 100 -89 -29 -13 -98 -334 159 -69 -1 102 10 -69 -2 -107 -58 212 -153
7593 -153 47 -4 106 95 -78 246 8 -325 -106 -128 186 21 162 134 228 9 153 18 -256 -114 324 -2
7615 -2 -96 98 176 -320 -170 36 155 -216 -97 -106 81 181 21 -174 111 -48 -99 191 -134 -170 83 -134 -104
7638 -104 202 -189 326 -194 2 -30 -40 47 106 149 -136 -40 -66 162 78 -93 241 -12 -374 436 32 -131 161
7661 161 172 -208 281 27 102 415 180 200 -125 20 -40 176 -46 142 -16 -218 332 -208 2 113 -119
7682 -119 -185 6 -108 -90 28 -488 -33 132 -260 -79 236 179 -115 76 70 27 -68 -38 -9 -198 134 -76 -143
7705 -143 180 124 246 157 16 94 41 -283 259 176 -3 3 183 -11 -44 15 -139 24 -246 478 5 -114 -167
7728 -167 -168 -272 85 102 212 66 -75 256 122 -145 107 -44 -365 83 -109 -226 349 88 -222 262 -1
7749 -1 -7 -177 -86 91 42 -40 84 160 53 106 224 100 182 -215 69 72 3 -71 98 80 -46 12 146 34 215
7774 215 -139 61 -125 14 -210 -197 127 -421 -257 190 -210 -95 69 -101 160 256 79 111 -35 -203 10
7795 10 -180 89 248 -42 -23 -184 -127 -182 -133 -35 -30 52 -75 62 -61 25 102 -14 362 -128 -77 96 95 -45 123
7820 123 -309 150 -163 -69 57 -65 -213 46 -34 -3 264 143 -71 157 -166 -10 50 65 49 -1 47 130 207
7843 207 -160 -183 -171 -48 30 172 -225 -44 150 166 39 67 151 -180 65 175 -95 -130 194 13 40 11 -234
7866 -234 169 -150 -93 320 218 -132 -12 37 -8 85 129 -65 236 121 -104 312 -35 -17 -95 128 1 -5 170
7889 170 94 46 13 75 -233 305 20 8 200 87 9 -11 -92 39 255 -121 -49 40 32 18 104 -227 -202 71 -24
7914 -24 96 58 -48 -153 111 -83 -151 106 -74 -44 76 313 20 69 -14 -347 28 -54 21 -27 -201 -236 154
7937 154 124 -197 27 -162 255 108 -155 64 3 -185 57 5 -147 83 42 -221 90 -37 -154 -62 114 155
7959 155 -7 317 -90 48 139 87 2 -60 -155 19 14 -69 223 -144 37 -131 17 60 120 -104 -46 11 -7 -11 252
7984 252 6 179 -47 -56 -203 67 278 68 334 122 -132 226 290 121 11 36 -91 -130 -108 -56 63 274
8006 274 -25 -114 62 28 -159 -3 -67 57 -141 103 -4 62 214 -297 -305 -52 59 69 -128 -17 -11 35 -56 42
8030 42 -36 115 10 -251 84 -61 31 -15 46 -120 83 12 -138 168 -161 81 -173 181 208 34 249 -230
8052 -230 -148 -73 -1 -105 -117 -66 -22 -61 285 -47 -104 -227 77 3 95 -127 -173 169 -18 148 -90 -134 -142 78 230
8077 230 -221 201 108 -207 195 82 -142 -312 -136 -242 73 57 -173 122 -66 -239 117 -84 -8 15 27 -118
8099 -118 -267 -101 114 52 53 132 -291 -49 119 83 106 258 69 86 -97 -31 -132 54 -145 163 -171 -27 -64
8122 -64 -32 54 -188 -156 49 -37 -186 22 181 -10 193 -264 -62 11 -158 274 41 -268 178 119 72 223 -32
8145 -32 -179 135 212 -6 -146 -37 -13 -114 -153 145 26 50 391 95 -120 119 90 110 -284 4 -43 79 -90
8168 -90 84 -150 218 -61 -187 2 -76 23 50 157 3 170 -91 67 231 -167 352 182 -221 -222 133 70
8190 70 -51
8191e1
##END NTUPLES=NMR FID
##END=
