##TITLE=1H_Pr 5269
 200.13MHz, CDCl3,
 8 sc
 
 15.1.2025
##JCAMPDX= 6.0         $$ Bruker NMR JCAMP-DX V2.0
##DATA TYPE= NMR FID
##DATA CLASS= NTUPLES
##ORIGIN= UXNMR, Bruker Analytische Messtechnik GmbH
##OWNER= pz
$$ XWIN-NMR		Version 3.5
$$ Wed Jan 15 14:59:37 2025 Russian Standard Time (UT+4h)  she@DPX200
##.OBSERVE FREQUENCY= 200.1313
##.OBSERVE NUCLEUS= ^1H
##.DELAY= (6, 6)
##.ACQUISITION MODE= SIMULTANEOUS
##.ACQUISITION SCHEME= undefined
##.AVERAGES= 8
##.DIGITISER RES= 18
##SPECTROMETER/DATA SYSTEM= spect
##.PULSE SEQUENCE= zg30
##.SOLVENT NAME= DMSO
##.SHIFT REFERENCE= (INTERNAL, DMSO, 0, 14.3821)
##AUDIT TRAIL= $$ (NUMBER, WHEN, WHO, WHERE, WHAT)
$$ ##TITLE= Audit trail, XWIN-NMR		Version 3.5
$$ ##JCAMPDX= 5.01
$$ ##ORIGIN= Bruker BioSpin GmbH
$$ ##OWNER= she
$$ F:/spectra/data/she/nmr/H-C/1/audita.txt
$$ ##AUDIT TRAIL=  $$ (NUMBER, WHEN, WHO, WHERE, WHAT)
(   1,<2025-01-15 14:58:16.48 +0400>,<she>,<DPX200>,
      <created by zg, POWCHK disabled, PULCHK disabled
       configuration hash MD5:
       00 E9 B6 7A A2 85 ED C7 34 08 36 98 17 FE 4E 26
       data hash MD5: 16K
       C4 65 7E A2 C6 24 A8 C3 54 AA 3E 9D F2 B7 F6 9C>)
$$ ##END=
$$ 
$$ hash MD5
$$ 27 A3 DE 5D 2A 6E B5 39 90 CC 9F 67 ED 7C 2A 04
##$RELAX= 
##$RELAX= 
##$RELAX= 
##$RELAX= 
##$RELAX= 
##$RELAX= 
$$ Bruker specific parameters
$$ --------------------------
##$DU= <F:/spectra>
##$EXPNO= 1
##$NAME= <H-C>
##$PROCNO= 1
##$TYPE= <nmr>
##$USER= <she>
##$AMP= (0..31)
100 100 100 100 100 100 100 100 100 100 100 100 100 100 100 100 100 100 
100 100 100 100 100 100 100 100 100 100 100 100 100 100 
##$AQSEQ= 0
##$AQ_mod= 1
##$AUNM= <au_zg>
##$AUTOPOS= <>
##$BF1= 200.13
##$BF2= 200.13
##$BF3= 200.13
##$BF4= 200.13
##$BF5= 200.13
##$BF6= 200.13
##$BF7= 200.13
##$BF8= 200.13
##$BYTORDA= 1
##$CFDGTYP= 0
##$CFRGTYP= 5
##$CHEMSTR= <none>
##$CNST= (0..31)
1 1 145 1 1 1 1 1 1 1 1 1 1 1 1 1 1 1 1 1 1 1 1 1 1 1 1 1 1 1 1 1 
##$CPDPRG= <>
##$CPDPRG1= <>
##$CPDPRG2= <>
##$CPDPRG3= <>
##$CPDPRG4= <mlev>
##$CPDPRG5= <mlev>
##$CPDPRG6= <mlev>
##$CPDPRG7= <mlev>
##$CPDPRG8= <mlev>
##$CPDPRGB= <>
##$CPDPRGT= <>
##$D= (0..31)
0 0.7 0 0 0 0 0 0 0 0 0 0.03 0 0 0 0 0 0 0 0 0 0 0 0 0 0 0 0 0 0 0 0 
##$DATE= 1736938695
##$DBL= (0..7)
120 120 120 120 120 120 120 120 
##$DBP= (0..7)
150 150 150 150 150 150 150 150 
##$DBP07= 0
##$DBPNAM0= <>
##$DBPNAM1= <>
##$DBPNAM2= <>
##$DBPNAM3= <>
##$DBPNAM4= <>
##$DBPNAM5= <>
##$DBPNAM6= <>
##$DBPNAM7= <>
##$DBPOAL= (0..7)
0.5 0.5 0.5 0.5 0.5 0.5 0.5 0.5 
##$DBPOFFS= (0..7)
0 0 0 0 0 0 0 0 
##$DE= 6
##$DECBNUC= <off>
##$DECIM= 32
##$DECNUC= <off>
##$DECSTAT= 4
##$DIGMOD= 1
##$DIGTYP= 9
##$DL= (0..7)
0 120 120 120 120 120 120 120 
##$DP= (0..7)
150 150 150 150 150 150 150 150 
##$DP07= 0
##$DPNAME0= <>
##$DPNAME1= <>
##$DPNAME2= <>
##$DPNAME3= <>
##$DPNAME4= <>
##$DPNAME5= <>
##$DPNAME6= <>
##$DPNAME7= <>
##$DPOAL= (0..7)
0.5 0.5 0.5 0.5 0.5 0.5 0.5 0.5 
##$DPOFFS= (0..7)
0 0 0 0 0 0 0 0 
##$DQDMODE= 0
##$DR= 18
##$DS= 0
##$DSLIST= <SSSSSSSSSSSSSSS>
$$ [...]
##$SUBNAM0= <"">
##$SUBNAM1= <"">
##$SUBNAM2= <"">
##$SUBNAM3= <"">
##$SUBNAM4= <"">
##$SUBNAM5= <"">
##$SUBNAM6= <"">
##$SUBNAM7= <"">
##$SUBNAM8= <"">
##$SUBNAM9= <"">
##$SW= 18.0517328524113
##$SWIBOX= (0..15)
0 0 2 0 0 0 0 0 0 0 0 0 0 0 0 0 
##$SW_h= 3612.71676300578
##$TD= 16384
##$TD0= 1
##$TE= 0
##$TE2= 300
##$TE3= 300
##$TEG= 300
##$TL= (0..7)
0 120 120 120 120 120 120 120 
##$TP= (0..7)
150 150 150 150 150 150 150 150 
##$TP07= 0
##$TPNAME0= <>
##$TPNAME1= <>
##$TPNAME2= <>
##$TPNAME3= <>
##$TPNAME4= <>
##$TPNAME5= <>
##$TPNAME6= <>
##$TPNAME7= <>
##$TPOAL= (0..7)
0.5 0.5 0.5 0.5 0.5 0.5 0.5 0.5 
##$TPOFFS= (0..7)
0 0 0 0 0 0 0 0 
##$TUNHIN= 0
##$TUNHOUT= 0
##$TUNXOUT= 0
##$USERA1= <user>
##$USERA2= <user>
##$USERA3= <user>
##$USERA4= <user>
##$USERA5= <user>
##$V9= 5
##$VALIST= <valist>
##$VCLIST= <CCCCCCCCCCCCCCC>
##$VD= 0
##$VDLIST= <DDDDDDDDDDDDDDD>
##$VPLIST= <PPPPPPPPPPPPPPP>
##$VTLIST= <TTTTTTTTTTTTTTT>
##$WBST= 1024
##$WBSW= 4
##$XGAIN= (0..3)
0 0 0 0 
##$XL= 0
##$YL= 0
##$YMAX_a= 72817
##$YMIN_a= -92837
##$ZGOPTNS= <>
##$ZL1= 120
##$ZL2= 120
##$ZL3= 120
##$ZL4= 120
##$ABSF1= 10
##$ABSF2= 0
##$ABSG= 5
##$ABSL= 3
##$ALPHA= 0
##$AQORDER= 0
##$ASSFAC= 0
##$ASSFACI= 0
##$ASSFACX= 0
##$ASSWID= 0
##$AUNMP= <proc_1d>
##$AZFE= 0.1
##$AZFW= 0.1
##$BCFW= 1
##$BC_mod= 2
##$BYTORDP= 1
##$COROFFS= 0
##$CY= -3
##$DATMOD= 1
##$DC= 2
##$DFILT= <>
##$DTYPP= 0
##$F1P= 0
##$F2P= 0
##$FCOR= 0.5
##$FTSIZE= 0
##$FT_mod= 4
##$GAMMA= 1
##$GB= 0.15
##$INTBC= 1
##$INTSCL= 1
##$ISEN= 128
##$LB= 0.25
##$LEV0= 0
##$LPBIN= 0
##$MAXI= 10000
##$MC2= 0
##$MEAN= 0
##$ME_mod= 0
##$MI= 1.114404
##$NCOEF= 0
##$NC_proc= 0
##$NLEV= 6
##$NOISF1= 3.799351
##$NOISF2= 2.8
##$NSP= 1
##$NTH_PI= 0
##$NZP= 0
##$OFFSET= 14.38212
##$PC= 1
##$PHC0= 251.7897
##$PHC1= 12.3922
##$PH_mod= 1
##$PKNL= yes
##$PPARMOD= 0
##$PSCAL= 0
##$PSIGN= 0
##$REVERSE= no
##$SF= 200.129724274929
##$SI= 16384
##$SIGF1= 3
##$SIGF2= 2
##$SINO= 400
##$SIOLD= 16384
##$SREGLST= <1H.CDCl3>
##$SSB= 0
##$STSI= 0
##$STSR= 0
##$SW_p= 3205.1282051282
##$SYMM= 0
##$S_DEV= 0
##$TDeff= 0
##$TDoff= 0
##$TI= <>
##$TILT= no
##$TM1= 0
##$TM2= 0
##$TOPLEV= 0
##$USERP1= <user>
##$USERP2= <user>
##$USERP3= <user>
##$USERP4= <user>
##$USERP5= <user>
##$WDW= 1
##$XDIM= 8192
##$YMAX_p= 0
##$YMIN_p= 0
$$ End of Bruker specific parameters
$$ ---------------------------------
##NTUPLES= NMR FID
##VAR_NAME=  TIME,          FID/REAL,        FID/IMAG
##SYMBOL=    X,             R,               I
##VAR_TYPE=  INDEPENDENT,   DEPENDENT,       DEPENDENT
##VAR_FORM=  AFFN,          ASDF,            ASDF
##VAR_DIM=   8192,          8192,            8192
##UNITS=     SECONDS,       ARBITRARY UNITS, ARBITRARY UNITS
##FACTOR=    0.0002768,     1,               1
##FIRST=     0,             0,               0
##LAST=      2.2672688,     0,               0
##MIN=       0,             -92837,          0
##MAX=       2.2672688,     72817,           0
$$ Real data points
##PAGE= N=1
##DATA TABLE= (X++(R..R)), XYDATA
$$ [...]
2053b84R73j794O93K62o74J483r59q19J981j129m15J485j096K79K31p14J425p27
2071B01j140K174l35j422J062j026M4R81j476J145L08k165J619N69j212J174l48
2088A53l23J067j319Q19J077k046O03J205j769Q49l62m70J242j818K23J917k472
2105a424N98J324r02N69k07k83J566j218l30K109j291r18J068p14L72j57j201
2122a039J328j03j816J589K94j321J092k35K23M23j112J523J96j827J185P27j852
2139g25J299l54l1M75j857M87J497j837M60J012j153Q93j84m19J753j583k22J872
2157A383j409j41J136j301L95K11r42J567j081j126K228r56j057J642j072N56
2173C3K10j219K126m73j621J755k9j357P77j20k46J001j696J091P08k072J025
$$ y = [-284, 689, -1105, -412, -150, -824, 659, -300, -1119, 862, -267, -682, 803, -293, -14, 217, -497, 928, 201, -939, 1235, 900, -522, 540, -486, -442, 539, -937, 208, 516, -1649, -30, 539, -673, 501, 153, -170, 897, -422, 397, 1474, -572, 31, 1236, -533, 316, -46, -516, 726, -1092, -869, 1048, -1424, -826, 498, -404, 165, -42, -325, 1241, 23, -307, 1802, 511, -407, 661, -53, 319, 162, -1039, 289, 186, -1630, -41, 253, -1068, 24, -211, 12, 435, -677, 846, 1042, -785, 400, 1127, -725, 574, 220, 189, 664, -1193, -706, 791, -1046, -586, 426, -727, 166, -18, -437, 1316, -267, -489, 1383, -26, -167, 969, -332, 63, 274, -668, 899, -182, -1308, 920, -36, -1093, 549, -523, 33, 243, -976, 1150, 677, -944, 811, 782, -575, 202, 82, -164, 837, -859, 232, 940, -1132, -107]
2190a07M14j198J054m84r6J206j550O77J407j837J97J220r32M90l54n43J307j168
2208b97l96J433j194l21J143j076P14R5j038J651p46j000J890q28m60J079q98
2225b49M87M02j430J292J54j657J114J31j257J422p13n4Q58j308Q39Q56j727O26
2243b14L17p44J328o94m53J436j452K53J203j421L02O86j200R00n4p10J241j009
2261b85n68J354q69j75J130j397P42O46j156J215l37q25J245o57r6P32r92n7R04
2280E54j457J145k9j042J041k00q53J450p40m58J540j208N54N51j302P57J54j137
2298f80J180o90o61J489r89l77J196j258N49P49j211Q24L09j205J233j93p38J437
2316I64j331K67J096j407O58N41j504R46J91j013J154p11q30J167q93K39J186
$$ y = [-107, 307, -891, 163, -321, -417, 789, -761, -84, 1323, -514, -317, 903, -29, 461, 107, -436, 871, -297, -693, 740, -454, -775, 368, -708, 6, 101, -937, 714, -32, -1032, 858, 30, -430, 649, -249, 238, 640, -790, 502, 656, -1001, 113, 244, -1013, 409, -304, -358, 500, -808, 31, 887, -840, -214, 103, -641, 687, -7, -460, 976, -476, -223, 980, -441, -139, 547, -653, 247, 193, -517, 724, -285, -853, 501, -368, -543, 587, -810, -68, 578, -578, 637, 300, -525, 720, 63, -33, 699, -293, -350, 554, -903, 242, 213, -829, 212, 12, -841, 609, -131, -589, 951, -257, 297, 848, -454, 303, 457, -680, 500, -190, -851, 638, -351, -728, 468, -790, -241, 508, -703, 121, 430, -775, 458, 265, -473, 964, -367, -100, 996, -411, 247, 788, -716, 230, 421, -592, 562, -149, -979, 188, -705, -466, 720]
2333G20j521O31P41j235J299m78n61J457j265J59R90j184oQ58j149N81K81j297
2351i79J443p90m98J388r35l34J064n64N13Q54j658R23K06j190J254m32j087J493
2369F71j303K86R65j429K05Q31r12O43K77r85J519n04n34J381j338l7J239q66
2387A09LL22j082J070o87r65K002j439j00J125r66K99P65q89O89K59j100J223
2405F38j23j039J366p72J3N78j039M1N87j145Q70K76j372J092k24m91J283o14
2423g5M2P53j210O16J017j197O05j39o91R59q19l24Q77j249N0J021j078L64M92
2442A4q54J033K45q59J240l39n77J228q56m35Q62j180R76j57j313J170l03p93
2460h98J197m66k96J054r21J36R13j048O99M80j154J351l87j271J160n13k97J234
$$ y = [720, -801, -170, 571, -664, 635, 157, -404, 1053, -212, -53, 937, -247, -253, 605, -544, 37, 318, -979, 464, -326, -824, 564, -371, -705, 359, -205, 308, 1162, -496, 427, 633, -557, 697, 265, -822, 671, -632, -346, 619, -810, -605, 226, -686, -43, 234, -751, 768, 264, -270, 1111, -227, -264, 975, 109, 112, 434, -648, 422, -265, -1230, 772, -667, -767, 358, -608, -309, 456, -433, 256, 515, -585, 638, 515, -524, 842, 70, 83, 661, -378, -337, 250, -895, -25, 251, -1121, -29, -253, -744, 539, -75, -33, 720, -490, 126, 1143, -54, 551, 412, -279, 680, -139, -463, 414, -835, -785, 236, -842, -478, 14, -840, 193, 438, -421, 819, 480, -97, 1131, 275, -160, 702, -478, 498, 341, -972, 198, -105, -898, 299, -167, -463, 591, -330, -194, 719, -329, 370, 850, -304, 1047, 660, -611, 549, 36, -261, 973]
2478I73j552K93N02r05L33M94q77J025l27l26J160q70j3J213j384L59O23j079
2496c58P92j70p09P90m65q00J461q75m8R57j036N51L18q94O78o1o84J128m67p25
2516f17J210n49o6N72q61N45J82j255J370l52q23J190o42k79Q14q87K77J021j336
2535d86Q41J72j024Q21k8q84J181r38J08J000j169Q5P25q36M85L12q31P46l20
2554d0n76J317j202J38J067q47J44M20o93O86l43n56J126p76m41J205q56m35J045
2573C83r84P26K09j048J022o7q91Q72k26k40O69q75N68K39q84O02M55j186J166
2592E10n90m87Q39o80q3J098j264J28R40j033O20M0k50P77p29j36J192j213K96
2611b5R27p52l51P03q47O27m49o41J202m15p28J108p69P1P92r03Q34J43j065J406
$$ y = [973, -579, -286, 216, -689, -356, 138, -739, 286, -41, -367, 793, -77, -90, 1123, -261, 98, 721, -358, 434, 264, -445, 345, -120, -920, 541, -334, -382, 575, -461, 90, 408, -486, 192, 131, -553, 575, 108, -617, 593, 44, -22, 550, -311, 234, 416, -839, 531, 179, -644, 546, -96, -375, 439, -448, -171, 850, -486, 355, 527, -497, 324, 296, -588, 593, -345, -237, 763, -406, -321, 404, -432, 53, 365, -466, 280, -40, -616, 701, -501, -363, 704, -143, 1, 421, -272, 414, 71, -485, 641, -135, -576, 629, -227, -662, 383, -601, 125, 334, -714, 308, 241, -650, 222, -4, -244, 425, -450, 118, 357, -527, 75, 530, -656, 510, -80, -567, 272, -408, -491, 607, -657, -529, 411, -622, -2, 38, -212, 565, -164, -300, 892, -321, -25, 902, 150, -201, 502, -345, 282, -167, -808, 394, -21, -749, 359, -410, -339, 453, -450, 384, 527, -538, 868]
2631H68k63r79J013o88k41Q23j124L75O07j350M38Q26j064Q23j23k40R43j256
2649f12M68J076j068PJ037q81K98L3o05Q00n85l98J108r54m92J071j010M15L26
2668C4n14R81m08n80J042j60n62P50jn86N03r93O14M61j571R12M76j383Q48l44
2688d81K12L50p23M23J254j574L67J082j135P19j33k30N36j044j10R96j033j80
2706g04R61o93k22M32l09R04n62k71J178o55m50J372r80K56J78p04O17Mj064J109
2726C97n12n68N64j59k74P24p53M84N97j100R75J67p47K70L28p60J183r45L19
2745A90K58r30L25N47q09J43q1l68J115m92j04Q69r01J5Q70q65M01M02r69O81
2765B97o2o57J128p80p03R90o65J88L10n95P42j75m77J002j50q48J001n71j49
$$ y = [868, 605, -374, 639, -49, -290, 533, -591, -216, 391, -959, -521, 305, -759, 64, -59, -299, 644, -612, -144, 932, -136, -129, 908, 27, 325, 358, -247, 553, -32, -430, 678, -276, -768, 303, -707, -292, 34, -480, 501, 93, -487, 555, 395, -167, 583, 582, -4, 499, -494, 120, 581, -990, -78, 398, -985, -137, -481, -269, 81, -642, -219, 1035, -539, -172, 910, -225, 494, 361, 131, 667, -377, -487, 509, -524, -704, 257, -436, -658, -226, -535, 369, -193, -464, 714, 59, -391, 981, 1, 257, 435, -269, 348, 352, -712, 397, -115, -683, -119, -278, -552, 172, -581, -97, 500, -600, 375, 542, -205, 65, 393, -367, 816, -129, 190, 448, -482, -157, 390, -419, -276, -357, -725, 390, -102, -206, 663, -238, -223, 647, -218, 183, 585, -384, 297, 235, -422, 706, -74, -777, 213, -452, -264, 46, -549, 193, 18, -459, 543, 393, -455, 546, -25, -174]
2784a74N89n44K46K79q79N96po69P91j52n79Q67m79q9O77p73K33N49p64M98K83
2805D99j014Q19j94p79J060o29P0P47r38M32J93q72R62n13j12K61O5m85Q51n97
2825a74l48R87q51L64M54n63M64M2q47Q42k69n08J025j204N28M61o46K26K73n80
2845c24M85l32m88J086q45J75K06j35K9N22p07P30p9m67O33l66n41P84n62j67
2865c63O38p87L75L98j100Q50O4o72J141n49p0P21m74l26P52r07N65J41o24L72
2885A45l39o27R74n62k00J254r57J03M68m79O01N8q67J054k25p56P22j62k05K77
2905B77n53J54L76r37R61j8r47Q47p7n62P57m64J62O62r68N84M42q89K92K59o85
2926c27Q06o55o4O48q35J0P92p84O7K64m48N29J87l17P79l54m55O41m39O1M36
$$ y = [-174, 415, -129, 117, 396, -483, 113, 106, -563, 228, 76, -503, 364, -115, -204, 473, -300, -67, 482, -282, 216, 499, -515, 304, 110, -669, 391, -238, -168, 579, -359, 73, 266, -606, 356, -157, -269, -8, 57, -428, 423, -174, -522, 465, -386, -22, 432, -131, 333, 375, -472, 370, 101, -407, 618, -586, -58, 403, -243, -17, 256, -324, 161, -171, -659, 427, -418, -243, -37, -172, -143, 379, -328, 402, 323, -144, 489, 123, -418, 366, -196, -363, 275, -512, -137, 261, -839, 11, 75, -597, 544, -5, -75, 646, 172, -154, 598, -309, 256, 397, -227, 145, -194, -821, 153, -409, -609, 645, -312, -209, 259, -220, 381, 439, -428, 626, 401, -355, 367, 205, 0, 277, -276, -122, 254, -683, 278, 260, -687, 160, 83, -479, 278, -186, -24, 638, -330, 254, 696, -193, 99, 358, -327, 479, -176, -240, 408, -427, -417, 375, -409, -342, -78, -526, 3, 190, -127, 652, 298, -157, 484, 45, 106, 542]
2947E42j003M66Jr42Q78R2p07O23l9m90J133j007M49O11j065R03j34n23P63m04
2967A47m47Q73r19j70Q75q94K97N33n23L5L12p84P70K6j79O46p20J62M82n88m3
2988a09O31p55M40L7p32O12k55m86P79l65J1M09n09K21J91m27N87l3m88L44j91
3009h8P6J57m73J87N81o98L02K44o82O14o5o29P51n74j29N53l20P4O88r02L62
3030B9L31o42K36K14l66O04m79j55P30q74J78N67q49N88n1n90Q57m88l70J106
3050E76m84k88N57o05L12L86q37O47j80k98M99k86l28O55o97J61M06p92O07K14
3070B25r26J032k57m31P46k58l93Q92p70J38N21r95K45M60p25N24q7l69M99l85
3090c14O0L99l41K07O04j100N45L82j55j48j09j91O74l61m79Q14r17M24M39p57
$$ y = [542, -461, 5, 6, -936, -58, 34, -673, -50, -89, -579, 554, -453, -4, 607, -458, 445, 311, -212, 551, 147, -300, 573, -346, -516, 359, -535, -238, 295, -228, -193, 119, -665, 105, 131, -48, 598, -122, 40, 522, -66, -109, 522, -233, 207, 244, -488, 124, -131, -617, 162, -203, -192, 217, -292, -71, 120, -307, 280, 247, -241, 103, -88, -12, 145, -328, -141, 440, -258, 44, 288, -394, 220, 155, -474, 277, -297, -426, 127, -193, -119, 569, -333, 29, 360, -282, -46, 168, -198, 406, -73, -228, 502, -372, -194, 373, -476, 112, 61, -529, 328, -160, -530, 576, 92, -196, 361, -244, 68, 454, -383, 264, 84, -214, 285, -1, -329, 326, -371, -210, 196, -596, 11, 225, -701, 331, 74, -357, 389, 131, -262, 630, -140, -2, 519, -476, -231, 229, -496, 28, -59, -428, 71, -314, -254, 145, -196, 11, 615, -485, 60, 442, 287, 139, 30, -161, 513, 152, -327, 487, -430, -6, 433, -324]
3110c24L25p9j34M13j04n43R93o98K4N04k74K58r5k97K52J53p76N37k30j92O81
3131C94o36j4P62p59K88K56p53N67Q6k49M29j52l03N91p63J28P23q38L08L50r17
3152e02L42P8l94P92m80o43J472j020J90K42l87M08j28k62R00o87l07O98l22p2
3172h2K37k69J36L3n71P18j93k34M60l16k10J62J48l27O55q26L66N05p48N88J17
3193C49n30M79l39l23P45p30p0N84n83K80K03n46P94k79l33Q15q45P2Q98o40p7
3214g6K93n32P26m8m21K47j44n12N67k55k55O60n26K96l4n58O77J51p37R64m66
3235A7l03Q41l57k38K28m93K63M10q49N89l09m27N96j75J61O65q65O4L05m63K71
3256f9L80n54K08L35m47Q44p73m1J14k36J22L04o98L74K70o57Q07l98k32Q13k83
$$ y = [-324, 1, -78, -212, 201, 97, -446, 547, -151, -127, 377, 103, 361, 266, -31, 221, 374, -402, 135, -95, -287, 394, -242, -256, 506, -253, 35, 291, -462, 105, 191, -58, 371, 219, -84, 507, -256, -128, 595, -243, 65, 415, -502, -160, -82, -476, 316, -164, -807, 665, -355, -165, 77, -310, 98, -30, -292, 608, -79, -386, 312, -10, -82, 155, -114, 22, 55, -516, 202, 9, -225, 235, -81, -291, -129, 19, -308, 347, -479, -113, 392, -356, 232, 349, -181, 298, -41, -364, 381, -349, -419, 165, -418, -138, 65, -481, 313, 34, -299, 516, -329, -257, 641, 1, -76, 217, -315, 411, 363, -58, 189, 45, -467, 100, -155, -410, 250, -276, 20, -14, -572, 105, 256, -481, 483, 17, -286, 555, 198, -40, 188, -305, -42, 368, -481, 108, -201, -628, -32, -207, -46, 619, -246, -182, 123, -340, -69, 311, -243, -35, 300, -147, 697, -76, -117, -3, -239, -117, 187, -511, -137, 133, -524, 283, -115, -347, 466, 183]
3277A83j65M57n89N3N94p20K80K16n24L14k80k8O24o67j12O39o03N10K89q91M47
3298B7O00q72O77m59j52K81l05K26N47o88M2J26n79O24J00q54M71L3q9M05l18
3319a57LK90n4L33J22n20K26k11m72P99l36m00Q83j063J03M21l49O08k76k91O72
3340C31n8n47P82l31k76N90p16K96P7j62J51K16q47Q08o07L6O29n40j16M00l42
3361b26K35K82q87Q75k95Q4M96m67k74M42k00j17M02n25J29j9m79P92np34Q74
3382C83o60j30O03k25q3K80l51L25J41m14N53m20KM11n78L3K06l04K6K35n60O71
3404A44q3n67Q54l42m39P89l54K6N65r73O38J31m63Q3J71l36J93k89j35M54j63
3425i6J34J73r82O09M36p12M10l5j58O41j75k12L70m48N5L63n51P9K79p3kk19
$$ y = [183, 18, 475, -114, -61, 533, -187, 93, 309, -215, 99, -181, -209, 415, -252, -364, 275, -328, 182, 471, -420, 27, 627, -245, 432, -27, -179, 102, -203, 23, 570, -118, -76, 50, -529, 95, 195, -659, -188, -155, -244, 161, -157, -154, 136, 82, 415, 537, 17, 243, 32, -440, 359, 23, -377, 506, -557, -454, -33, -382, 226, -50, -341, 331, 273, -274, 508, 177, -99, 491, -225, 71, 148, -14, 137, 353, -494, 314, -293, -257, 372, -168, -284, 116, -226, 9, 291, -596, 279, -16, 68, 564, 97, -177, 265, 65, -52, 350, -175, -46, -65, -544, 248, 243, -491, 383, -277, -407, 196, -29, -112, 168, -183, 142, 283, -131, 422, 2, 4, 415, -163, -130, 76, -228, -202, 33, -527, 144, 61, -506, 348, 6, -433, 356, 2, 28, 593, -380, 258, 389, -74, 9, 180, -156, 37, -252, -387, 67, -96, 38, 211, -771, -162, 274, -438, -28, -63, -221, 420, 245, 33, 403, -45, 10, 373, -178, -99, 180, 107, 105, -114]
3447a14n35Q76ol11L60l35J92P8m15M44Q6m42J95J67n54N88o5l49N15p98M30K14
3469B21p58N15J21n76N95k03J07K88n7k68O51q48K95J3k35M26k80j84L34k88k51
3490c82N60j45j43L97o53J00L19k17M05j2l43K58r1L5K83o00J60M76m92L9J56
3511A10k88M27m49j68L68j34m4K85j07J78k7o76N13M3l22N33k67j85N38m35j32
3532b39N13m88R3M10m46K36q9j36M05r1l81K83l19m3O75o09k9O58m50K52l17j52
3554b64P65n22j87N33m60J26K49n61M26j98l76P51n8k71J15l30k3O97p16L89M56
3575E41o16rL26o48M46k1m26O99n11J33L00l91j60O06n94M16j42l65P59kl41N05
3597E05l24m22M79n87L75J36l44l6K49l93P95l35k44M74j75j16M58m99m7N6l73
$$ y = [-114, -649, 227, 221, -90, 270, -65, 127, 205, -210, 234, 320, -122, 73, 240, -314, 274, 209, -140, 375, -423, 7, 221, -537, -22, 99, -477, 118, -85, 22, 310, 253, -15, 636, -212, 83, 96, -139, 287, 7, -177, 157, -131, -382, 178, 33, -110, 287, -366, -266, 53, -164, 241, 229, -114, 144, 53, 88, 371, -229, -69, 407, -85, -46, 110, -178, 249, -200, -368, 0, -134, -178, 107, 0, 178, 151, -525, -12, 31, -291, 242, -25, -210, 328, -107, -239, 274, -214, -121, 289, -157, 79, -10, -146, 259, 168, -213, 70, -249, -292, 383, -226, -255, 403, -47, 205, -112, -264, 501, -21, -208, 325, -135, -9, 240, -321, 105, -93, -469, 282, 224, -47, 68, -262, -285, 412, -304, 85, 541, -75, -84, 242, -406, 40, 19, -407, 292, -219, -86, 214, -177, -337, 269, -325, 91, -51, -416, 343, 341, 0, 505, 181, -241, 238, -349, 26, 162, -182, -218, 31, -362, 433, 98, -146, 328, 153, 37, 495, -4, -51, 5, -368]
3618c68O21q3k68K12q8l06M56j75l2L45o14K61Q9j24L15m9k54L12p7j9L04o90
3640b32M54J92n07j67M33k28J2n3k97L40j48Q6J71k87j55P49n25l1N30m16M61
3661C82m28m2K57l03j30M95l98q8M47k05j8K49l61N28m87j47L53r0K27m3k10L4
3683B2K37o30M83l1l02M65j69l82N93m15Q8M16q23K50L56m69N58k46q3M68m14
3704b8qN61q42K95P4k39J98pj73M45k95j57L15l72j3L26lj10J48j52J87m8l67
3727b65N04Ll51M04j48m78N47m70K86J12l39L24k05N1l4k9M3L22k79j02N06n52
3749a50O7N26o82L99n1k21L46l67j07N33p18L7P08p05N09j99O7J18j62l03N48
3770A93n9r5Q3o2K64j52l90K37J24m47L80j57l8K17j63n2J26l10L75Q0l95J11
$$ y = [-368, 253, 170, -98, 114, 26, -280, 176, 1, -31, 314, -300, -39, 50, -74, 241, 192, -62, 250, 173, 154, 458, -232, 222, 414, -93, -260, 173, -55, -43, -96, -393, -53, -201, -115, 56, -231, -386, 363, -162, -193, 337, -79, 382, -46, -88, 169, -134, -264, 231, -167, -255, 192, -13, -31, 218, -143, 385, -102, -249, 104, 14, 241, 198, -12, 22, 259, -371, 112, 81, -221, 244, 75, -307, 286, -129, -41, 375, -448, -198, 158, -311, 247, 1, -82, 386, -28, -36, 525, -317, -22, 52, -187, 11, 4, -169, 276, -19, -176, 139, -233, -246, 80, 77, -33, 115, -37, 150, 102, -265, 239, 242, -109, 295, 147, -331, 216, -254, 32, 144, -195, 129, -76, -25, -59, -88, -45, 277, -2, -104, 402, -150, -83, 443, -239, 160, 109, -112, 234, -133, -240, 293, -425, -388, 320, -385, 124, -75, -8, 110, -52, -355, 193, 134, 39, 122, 60, 324, 172, -218, 19, 143, -304, 76, -81, -119, 98, -65, -117, 9, -301, 74, 154, -241, -130]
3792a30P20q58L58j43LJ64l20l8M81m97K51L42m16J71N1k73J44r5k64Q35k89r3
3814A04J14m59K34K13l84M30l8j48K23m27j24K42r5P2l6m23N42J08n24P03m11
3835h4MN81m90oM11l41J8n7j37J29K03m16K25l7L9n1l21J94M90l37r2M44m62J93
3859A00j74m2K97j0l3K68l56j24K54k84K85k42NM7Q2o17O20l06M3L20j33j94N23
3882C29n18qj5K6M26q4p6K49l23k04K89k04k31N99m75J30k1j58N16N6o18M50j91
3905e6M14k31j79K5L27m02M7J61k85M24l86k3M92m46mO02n67k6L32k65K25j04
3927G5l6j8r1j02J81K15k95M75o24N81m24k10K56k66Q3m7Q6L5K88j86J39J92l22
3950a5Q1O4j96J56k98j46L51j93J9K83j54J9n3j45L50P7n24L53p9q0M16l83j16
$$ y = [-130, 590, -268, 90, -53, -50, 114, -206, -244, 237, -260, -9, 333, -83, 88, 139, -134, 10, -85, -349, 486, 197, 104, 218, -241, -7, 206, -178, 252, 214, 66, 289, -138, -262, -20, -115, -43, -79, -502, 40, 148, -376, 327, -84, -80, 501, 11, 5, 416, 75, 93, 36, -101, 28, 231, -185, 40, 3, 42, -9, -330, -136, 354, 17, -75, 369, -93, 100, -74, -116, 181, 171, 138, 406, 50, -74, 180, -104, 181, -61, -56, -9, 73, -544, 76, -230, -187, 133, 0, -194, 329, -189, -197, -212, -186, 240, 156, 80, 329, 6, -198, 91, -113, -344, 255, -220, -90, -111, -269, 247, 303, -315, 135, -56, 358, 127, -52, -27, 300, -102, -55, 106, -179, 245, -141, -164, 328, -118, -122, 480, -87, -113, 219, -46, 179, 75, 39, 21, -70, -172, 9, 224, -71, 404, -220, 361, -63, -273, -17, -283, -200, -247, -161, -126, 162, -24, 115, 307, -15, 66, 130, -66, 90, -208, -354, -3, -196, -177, 106, -48, -29, -82, -227, 123, 200, -324, 29, -50, -130, 286, -97, -213]
3973b13L85j64l13O67l29q5K7l52L70k77l6K19j76j72O91l73q6L82l48K75J54
3994B46m82N81m50j55M81l25j18K21q0j57N59m15L32j8n66N34k29n8J40j44K87
4015A84J70m41K26m4k13L34l28q3L09j23k5PK14NK36o68L28K49l98K77K06m55
4037c3J79k23K50l7j94J9L17n22J83K23m10M55j49k94R8J35m5L19j53R3J56o12
4059b45R1J65L6M1l22O9L44k35pJ55l68N17M0m15K56P1j79J57j68k78L05n0j24
4082a44K98j50R8O2n92M61K01k45N36n02k38L33k12j02M58l56K57j00l21M83m52
4103b27J39L25k16o9Q9m2rN8o8L04k11l78K98J5n00O71m89K21n9r6M21j07j19
4126d9L04k74j1L04k07j5J68m89L43n9j59L01j96J52k15K68k93L5n0n4K36k85
$$ y = [-213, 172, 8, -305, 362, 33, -52, -25, -377, -7, -284, -320, -101, -277, -449, 242, -131, -217, 165, -183, 92, 246, -236, 345, -105, -260, 221, -104, -222, -1, -81, -238, 321, -94, 238, 220, -346, 188, -41, -99, 41, -103, 184, 354, -87, 139, 95, -118, 216, -112, -195, 114, -9, -34, -27, 187, 192, 428, -240, 88, 337, -61, 216, 422, -33, 146, -77, 173, 136, -58, -39, 278, -244, -61, 162, -248, 207, 58, -236, -138, -3, -48, 271, 118, 211, 367, -245, -154, 11, 47, 88, -234, -165, 179, -56, -63, 92, -276, 241, 281, -134, 122, 193, 14, 171, 3, -275, 30, -20, -144, 154, 4, 102, 164, -428, 33, 234, -11, 525, 23, -215, 118, -94, -196, 262, -94, 163, 63, -258, 225, -227, -88, 237, 21, -48, 41, -1, -10, 48, -20, 284, 73, -305, -7, 8, -492, 179, -310, -89, -148, -244, 177, 70, -49, 255, -19, -30, 274, 67, 52, 220, -269, 74, 15, -144, 157, -39, 113, -102, 166, -127, -92, -142, -196, 40, -245]
4148b45j3L90l57N22j38m25N75k89LR3q9j73J82k61K8J53j29L33k56k25N02k68
4170h7k47N26k6Q5p7q7k12K36j42J96j89k14L87k72k9K62k12j44L99k44J3K23
4192A45k87J35L8K0J9K7k13M30k12k7N9l43J10K26m53L39k56q3N50k13R1qQ2n5
4216A21k2l18O86m40l97L94j45J83Jq5j48K23l27L56O4m19K91Jm4J72k1l31M97
4239B92l41J42M03m76J8Q9m30J72L69m00M55l37r2L13k49J90j93J40j61K09l95
4260b82M35k20RN2J63k37K75l49K31J21n18N38l59L3R8j81j98N03m08M27j26n7
4282e0J13O8L9j69J02m96Q29l55n20N89j06j40L79k68n1L03l17J34j82j32N29
4303B99l62K4p1j05J97J70m7M6p8l60M35R5k23J10j9o40O75j29MK09n17L26K12
$$ y = [-245, -258, 132, -225, 297, 159, -266, 309, 20, 23, 116, 27, -146, 36, -225, -197, -44, -173, 160, -96, -321, 181, -87, -334, 192, 166, 251, 174, 87, -125, 111, -31, 165, -24, -238, 149, -123, -152, 110, -102, -246, 153, -91, -78, 145, -142, -7, 31, 51, 70, 97, -116, 314, 102, 75, 134, -209, -99, 127, -326, 13, -243, -326, 224, 11, 102, 94, 176, 121, 99, -219, 467, 27, -370, 24, -121, 62, 63, -22, -170, 53, -274, 82, 146, -273, 18, 19, -25, 147, 126, -205, 292, -49, 93, 496, 20, 38, 127, -303, -131, 238, -162, 293, -44, -136, 177, -72, 118, -75, 65, -96, 113, -282, 153, -67, -58, -6, 157, -80, 195, -154, 77, 198, -320, 218, -141, -108, -10, -191, -389, 114, -294, 133, 7, -50, 63, 131, 170, 1, 103, -393, 436, 81, -439, 150, 44, -96, 283, 15, -36, 267, -50, 84, -98, -230, 299, -63, -39, -110, -215, -18, 152, 105, 151, 73, -287, 148, 243, 20, 130, 111, -529, 146, 17, 21, 230, -287, 39, 251]
4326B51o51N51o2k17P1J1ML42m01J76J52m71L78J91n39M14j85k05M49l43j06M45
4348B55k25K6k73NN23l28k7o8Q6j01M07r9m1Qj33r7l9k75L26j08k21P87n78J20
4372g0L29j59j80K17p5J75j01l12J14pJ31J27k27k12L02l51M13On63N36J66j33
4394A26j38M2m05M19j16nM27k48j1n9j82k8L97k32J01p8q2J5J3k58J83j96K45
4417g0PK29l37L25k14J64Q0l71M41k49J35k42J90p1J89k96L1L41k31L53n22p1
4439a89K63j69MnL1J93Rj84p6J38J49j76P4r5J35k23j98K81m3J2L12m37L96k43
4463d1m8L29j00m6K03l00m7j44J33q5J81k06L09k07m1K04p1qJ4j89LM29l16K42
4487A98k6k29M71k08k84J1j68J7J99l87K85J09M2K21k04j45L18k32k0K32l46J5
$$ y = [251, -400, 151, 89, -128, -57, -46, -42, 300, -101, 75, 227, -244, 134, 325, -214, 200, 15, -190, 259, -84, -190, 255, 30, 56, -217, -212, 311, -17, -44, -112, -26, -127, 280, 181, 140, 148, 15, -82, -121, -396, -70, -178, -399, 388, -190, -70, 259, 100, -80, 137, 62, 237, 136, -176, -62, -69, 62, 189, -38, -250, 52, -299, 114, 120, -443, 93, 259, 126, -12, 30, -375, 44, -72, -77, 350, 102, 91, 32, -150, -178, 219, -13, 88, 10, -72, -57, -44, -302, -119, -315, -70, -63, 166, -171, 154, -60, 104, 184, -187, 254, 5, 140, -102, 88, 17, 206, -90, -59, 282, 51, 404, -118, -189, 74, -95, -91, -96, -65, 128, 137, -47, -123, 15, 164, -12, 62, -33, 102, -121, -319, -38, -81, -69, 243, -194, 202, -41, -89, 240, 140, 94, 297, -3, -50, -194, -61, -146, 35, -171, 138, -69, -110, 94, 23, 15, 29, -160, -157, 272, -44, 198, 172, -57, 414, 206, -78, -67, -235, -218, -19, -406, -121, -12, 30, 251, 47, -98, 220, -12, -32, 200, -146, -131]
4509a31L56k68O2J58l92L43O4k29k76L77j49n2j49M42k90J09J57J24n47L13ok19
4531b03O23l91j12J35j73J4M02j06R8o1l88J29J26l33J89r0J93J4k24J94M4l54
4553b74K33K40k73J15j15QM48k81k82J84k26O6N7J55l12J78R3J03j66j40L70m14
4575b33J99L28l60K46Q0m54K05j12k60O38j49k95J91o5l5L49m60K48R9j63K80
4596B77j66m59P64m55l32P65l47o4J7L8l6J00n10O47p0l43O6j20K03L32j98p6
4618C3k40K10o3j06K19l1M9O1l13L43l18L30n7j50J26k88K78j34k71J37J59J7
4640iL10k45j2J50j62o5k07K06L33l59k06M91k53m88O23k42J67J62j12r2k18K83
4662E5K17m95R7L59l09K88j40j09Q3Q1k59K6K71l73L34k26l2K15k13J46K14l62
$$ y = [-131, 225, -43, 19, 177, -215, 128, 192, -37, -313, 64, -85, -137, -286, 156, -134, -25, 132, 256, -291, 22, 16, -203, 420, 29, -83, 52, -121, -107, 295, 189, 287, 226, -162, -33, 93, -240, -51, -141, 52, 66, -158, 36, 80, -274, -41, 199, -74, 41, -74, -66, 382, 101, -181, 3, -223, -157, -100, 55, -257, -79, 14, 117, -49, -189, 181, -233, -34, 294, -66, 180, 260, -194, 11, -101, -361, 277, 128, -167, 24, -41, -76, 273, -187, 61, 160, -3, 277, 111, -348, 416, -39, -371, 394, 47, -17, 0, 38, 2, 102, -408, 239, 169, -174, -108, -228, -25, 307, 109, 33, -207, 3, -60, -166, 53, 22, 71, 132, -181, 162, -156, 174, 117, -33, 93, -195, 83, -51, -322, -185, -26, -9, 301, 56, 44, 194, 32, -33, -240, -34, 299, -60, -266, 225, -28, -516, 107, -135, 32, 194, 82, -10, -228, 55, 272, -223, -126, 233, -76, 212, 72, -37, 46, 127, -132, -106, 165, -208, 126, -100, -132, 83, -130, 16, 230, -132]
4684a32Q8L24m92O3O1R7j59K39k11M42l29j78J71K15k75q2l9K32J40m14O45n85
4706a79j59J81J0K06J60l97K57k29J34J71j23j22P3J34j74L88l85j14O4k34N19
4727A81P2m37J36J11O0j91K06j03o1K67J6k21l0J4j78p5N46k99j53M58k24j6k7
4750E2oj3k70J94M0J2p4J67k20K6L73l21J50Pk63m5K68k82N8J10k89L57j0n5J74
4775A40k99L35j59k54J08qr8L71r5lQ2k05j3R5k83K94J58j93J81J63l76P4j71
4798a56n6L91m3j81K59j49J14%k58J40L5k30K27O3j96j39M41l72K0l49L47K37
4820A45j71K11j24l28L67oK4M7j54k18L02j31n6J4Q0%l0K28j90J24l66L19qJ61
4844B40l05J38N1r0J21Mj36j82L80k69J93j31r7j78K9K13K28m26m0L27M4k15J93
$$ y = [-132, -44, 280, -212, -149, -88, 9, -150, 89, -122, 320, -9, -187, -16, 199, -76, -158, -197, 35, 175, -239, 406, -179, -338, -157, -147, 59, 219, -178, 79, -150, -16, 155, 32, -90, -17, 117, -57, 331, -54, -168, -104, -338, 181, 253, -184, -48, 63, 123, -68, 138, 35, -26, 241, 257, 36, 6, 20, -158, -233, 313, 14, -139, 319, 95, 79, 52, 46, 33, -237, -43, -3, 9, -65, 102, -118, -92, 281, -40, 110, 117, -146, -191, 77, -205, -147, -37, -326, 31, 21, -34, 140, -159, 176, 17, -237, -129, -137, -235, 136, 41, 38, 120, -85, -98, -3, -286, 8, 166, -27, 154, 317, -59, 15, -156, -212, 179, 136, -45, 214, 65, 179, 179, -79, 61, 96, -134, 93, 156, -40, -179, 262, -110, -90, -439, -92, 145, -26, 185, 61, -267, 100, 94, 118, 165, 11, -207, 95, -36, -92, -78, 2, 2, -28, 200, 10, 134, -232, 87, 79, 240, -65, 73, 124, 34, 155, 159, 23, -159, 221, -48, 145, 14, -83, -261, -232, -19, 209, -217, -257, 70, 114, -101, 92]
4867I2q9k8R4j41j30K43k26M08jj22O8k06k57M53j63r1K40k44J32J22k45Q6r5
4890a00l2J17N1O0Qo2m9J65k07p1O3k14J46K95k09L65k34l0N13l92l50J47k71
4913b91N05j92k05K99j75O5K34n16J74K77o0p9L45j99N8j55k84M17m23J53L20
4934B68m88O6P8J73k16M7r0L01k97J99j49M6j05J64k45L92l3m89K65R1r8K82l53
4957a91K62J37m14K72j68Q9k4K12n9k27J73j47m4M12m31J07j10k4R5J06L8j64
4979a00M10k58J18r7r0Q2K4m9j71K23k00r7J33K60k30L23j99j73K14o8j24K42
5001A73j8j88N2j95J3K78m40L52l15K4L68j18j35K53k15K3R7j14J42lJ13m55K73
5024c5o5J10J01l13K39J6j8L01j96n0l4L6q4q8NJ91k28J28q9j79N02k60k57J75
$$ y = [92, 3, -25, 69, -72, -202, 41, -185, 223, 222, 100, 168, -38, -295, 158, -5, -96, 144, -100, 32, 154, -91, -5, -100, -132, -15, 36, 96, 104, 42, -7, 158, -49, -120, -57, -271, -125, 170, -39, 326, 92, 62, 575, 183, -167, -20, -291, 214, 22, -183, 116, -59, 6, 240, -276, -102, 175, 115, 36, 381, 182, 240, 85, -199, 218, -205, -52, 268, -220, -154, -76, 97, -119, -72, -162, 139, -158, 41, -108, -62, -167, -3, -248, 144, 111, -378, -113, -22, -120, 162, -191, 71, 208, -206, 66, -102, -13, -37, 175, 116, -111, 62, -85, -129, 283, -148, -41, -151, -175, -80, 26, 64, -100, 310, 52, 170, 73, -17, 65, 89, 40, -131, 92, -108, -205, -72, 188, -42, 281, 82, -91, 123, 55, -69, 173, 155, -33, 19, -176, -163, 115, -325, 27, -288, -264, 104, -14, -149, 104, -111, -88, 9, -105, 37, 34, 147, -308, -35, -100, 10, 111, -202, 37, 53, 35, 336, 140, 90, 56, 92, 8, -80, -75, 116, -112, 16, -73, -252, 250, -10, -267, -92]
5048i2K4m1J08k11J35J03n1k0K0j46o3L27j40j06L63k89J20J49j35OQ7r0O4j31
5072iq3Q8q5R2K00k94J94J7o61M92J42o8J40m88J76J53K11n94L43J48M2k67J4
5095i7L97k25J19k80O5p3P6k21L70l69%K95M8m10M92J60j92p3k70J91j50J03J71
5118A27j28k10L78j55o6K34l36J19L34l46o2J35j46K99j60M0j13K30m06K83P3
5139A24K9Jl51K61K11l03P4k18j1M67l81K2j6l9M17j97l49L70j69j5K84k00J21
5162A32J18l74J21Ol2J52O9j92Q1j99pK46m49K49K16J6J72m80J70p1j89K34K26
5185B15k42nK60j81q2P5j84R6j2J06l32M37q0p6j87K91J54k84k6k9ll9j41Q4K48
5210F3l40K85J59m70J11L01j65J12l01MK99j0k97J38j09L70qj79k00L89j3k86
$$ y = [-92, -68, -109, -1, -212, -77, 26, -25, -45, -25, -171, -234, 93, -47, -153, 210, -79, 41, 190, 55, 61, 148, 58, 122, -9, -92, -4, -89, 3, 203, -91, 103, 120, -541, -49, 93, 25, 165, -323, -147, 6, 217, -377, -34, 114, 156, -111, -97, 300, 75, 194, -86, -21, -94, -18, -239, 131, -238, -238, 57, 105, -305, 187, 347, 155, 82, -188, 3, -147, -44, 127, -1, -211, 167, 12, -54, 180, -156, -37, 297, -49, -111, 24, -122, 177, 17, 57, -56, 174, -232, 51, 124, 153, 154, -197, 64, 275, -28, 46, -172, -183, 284, -97, -75, -91, -130, 287, 90, -259, 111, -58, -73, 211, 11, 132, 250, -124, -3, 3, -29, 123, 192, 0, 81, -118, -125, 121, -328, -79, 137, 153, 325, -155, 15, -56, -245, -11, 215, -27, -32, 228, 47, -35, 40, -144, -48, -60, 46, -286, 151, 71, -5, -192, 99, 253, -31, -57, -86, -89, -128, -269, -185, 63, -277, 8, 167, -303, -192, 109, -56, 56, -245, -241, 58, 48, -249, -111, -220, 150, 142, -37, -237, 152, 139, -147]
5232a47L87k68K16r0l21L09j60j38J35J04k22L48o8j01J71j82KQ6j54J33Q8j53
5254b5m4j65P3L25k49K03n1k99K35L2q6L12k62k33K89K27k14l9r0K9R2k14L16
5277A62l09N2K30l8k30M42m34K17k1J09k55kk86N60L2j51J80q5K7n8k73P4J15
5300E8k58R5L60m63J43L31m16J81l16o8L90J9J74k89j45M52j68o2J42k83j06M24
5322A95l63K48l7j04J28mj87J33j81R1R9m09L00L63j73r9K2k35L02J5j91K98l30
5345a19l5L12j51j44K95k36k15M20l16K4M09m49M48o9r8l0K95l75J89p6P2j75
5367b4m2j24Q2k5J13J86k38K40k17J23j05j16J72L2JJ90m6j63j73J18k4K96j28
5390A28j58K35k48K62j92k26K55j20N0K58j42k03L14k89J71k01K17j24P7k13K99
$$ y = [-147, 240, -28, 188, 98, -223, 86, -74, -212, -77, 27, -195, 153, 85, -16, 155, -27, -25, 61, -93, 40, 128, -25, -69, -234, -161, 164, -85, 118, 67, -232, 3, 35, -51, 261, -1, -234, 55, 282, 68, 29, -61, -32, 60, -154, 162, -147, -95, 135, 97, -133, 309, -125, 92, 71, 180, -75, -77, -363, 197, 229, 78, 258, 173, 200, 142, -131, -57, 58, -200, -105, 255, -208, -65, 266, -150, 31, -285, -353, 37, 56, 230, -59, -204, 248, 80, 18, 160, -123, -229, 195, -168, 80, 43, -61, 67, 63, -124, 9, -172, -81, 18, -391, -91, 272, 99, 0, 22, -213, 89, 104, -87, 211, -119, -154, 158, 7, -137, 158, -78, -293, 127, -189, -165, 244, -205, 243, 174, 76, 46, 341, -34, 155, 79, 151, -24, -66, -190, -108, -133, -20, 166, -72, 168, -49, 74, -31, -147, 25, 57, 58, 248, 202, 39, -134, -16, -40, 256, 128, -30, 205, -43, 219, 27, -199, 56, -64, -14, 244, 102, -101, 213, -76, 95, -106, 111, -13, 64, -149, 150]
5411A50o4l38L24q7k35M63k44j16J80j68L58k07K8q9J11l7j94K71O8J06j60N2
5433A72q9%j21k32J18J62K15k95J64j43r7J78Q8j12j99L18k02J98k21L35j58j59
5455h0K14o5j01K82k72j85M47l41K3Rj69M25k72l6M2J38j19P6P5R0l6l14K1K49
5479A01o3j6k65K40J47k17N8j03J95o0L5k50M7J87j42K19n8J50j55q5OL7j43J28
5503gK81m34M2QJ43j53L60m18K73k76J1O4L70l74L24k98K12K5j47j39m9K91m2
5526F7k81J99Rk13K40N6k47J01K64m64N18j79j79j9j43K01R4l97N26j36J9j67
5548a31K27j15J07k40J96k8J42o0o5L2k85L39Q8n4J21j85K65l13l04O8K2L09J12
5571B48k94M2l7k01L02k58N03k51j59K70j78k60J87NM3K6q3K24r1J9k75K22r8
$$ y = [150, 86, -252, 72, -15, -250, 213, -31, -147, 33, -135, 223, 16, 44, -45, 66, 29, -165, 106, 174, 280, 120, 172, 83, 83, -38, -270, -152, 10, 225, -70, 94, -49, -146, 32, 120, 8, -191, 127, -75, 123, -98, 237, 79, -80, 134, 69, -32, 250, -22, -207, 240, -101, -78, -69, -238, 187, -85, -121, -79, 59, -60, 16, 91, 181, 145, -169, -148, 101, 38, 22, -243, -3, 144, -73, -15, -118, 77, 17, 52, -198, -151, 36, -106, 113, 55, 205, 50, -35, -29, 8, -135, -7, 274, -160, -118, -110, 33, -120, 240, -178, 95, -181, -170, -106, 264, -110, 214, -84, 128, 153, 6, -133, -182, 109, 67, -214, -15, -6, -219, 21, 77, -170, -69, 195, -269, 249, 70, -109, -128, -271, -70, 24, -373, 153, 17, 36, -131, 96, -19, 88, -152, 44, 16, 158, 98, 33, 65, -220, 119, 207, 153, 274, 89, 354, 41, -263, -195, -173, 136, 248, -46, -4, -41, -242, 60, -198, 305, 54, -105, 165, -13, -273, -86, -81, -38, -12, -95, 129, 38, 57, -218, 4, -94]
5594i4p1R9K02p1j76k6L48l9k04M05n28J14K17j95j2L12m26K17L9j23J77k46j31
5617b12L74j33r8K69j84J01j32O3O8j22j45J57N3J23p6k08J68K56m86K18p7J74
5639A51J17l01M5QN9k27J81R2J01j87k61L09K30l29j9K0N0J42j55k75N64l61j31
5662a77J13j58K05m58N80k51K20N5l32j61L86O0J15j20j13J69j15j64J85J54j86
5683Gj72J01Oj13K35j80J39L0LJ87m00n5L96j44K23K5m41K23M5N7j45J69m79M64
5707A81l5j53j20J90k16K40k9J57j17M6q9J06k36J45K41m28L5K65l52K1m6J95
5729AQ4l11K67N9J7k55j66M17J96l66j80M14l35K43j52J80l19L3j7N41m44J05
5751A2N6M4j46l4J23P4K01l46J72j97J43J66r4k12K97j14N8m8k46J36K61o06K83
$$ y = [-94, -165, -66, 136, 65, -111, -137, 211, 172, -32, 373, -155, -41, 176, -19, -31, 281, -145, 72, 111, -12, 165, -81, -212, 162, 29, -69, 200, 16, 117, -15, 48, 116, -6, -151, 6, 59, 182, 106, -102, 66, 322, -164, 54, -23, 151, 268, -33, 12, 20, 79, -148, 33, 125, 226, 39, -222, 87, 317, -12, -31, -11, 39, 181, 26, -249, 315, -46, -177, -64, -222, -17, -475, 105, -146, 74, 129, -203, -364, 22, 82, 197, 77, -36, 133, 18, -146, 39, 193, 7, -165, -64, -58, -171, 64, -116, 23, 53, 56, 243, -157, -212, 184, 40, 263, 288, -153, 70, 115, 172, 27, 196, -283, 181, 146, -7, -127, 63, -153, 87, 58, 215, 98, 144, 55, 161, -75, 70, 311, -117, -82, 183, -169, -148, -194, 1, 85, -226, 41, 100, 117, -138, -304, 113, 309, -57, -237, 177, -158, 85, -67, 113, -206, -173, -190, 351, -93, 12, 68, 112, -34, -68, 55, 129, 330, -16, 156, -41, 102, 268, 174, -38, 259, 145, 203, 155, -91, 45, 306, -300, -17]
5774a7k63j43J98L02r8q6O6k24M99L4l27J29r6k7K00m07K87l30l8M45l54L17j43
5797g6JN0j4l35K69m7j28L62j06N9l2J43l16j72L95q3j2MnJ06p9Mj03K37j6j77
5823g1J8J64J28mm5k82J12r2K98o2k13J5k7L18n88K79OL7j8m04K45L14j5j01j10
5848i8J03j12J47J58j89m01L55j04j79K60m6J23r3R8Q7j80j43K60k69L79M6l09
5870a07R0J58k12K3M47l63q8m6o4K03k25R8J38m2l2o8J19j13L23l25l7K09k20
5893a34Q9J68Rol30l3M37l37J05J71j73L6j6k30L09q4r6N7J26l63N09n16K48J42
5917H8j29P1j57n2N20l47o2J41qK05n8o2K7L3j12k17O9O1J94j37n5J14l67K79
5941C9J4n0Q3j74j9K5K9J18j31j66j8L30m05K50J13j15K7K65k26k03L18m54N76
$$ y = [-17, -280, -423, -225, 77, -21, -107, -41, -265, 234, 268, -59, 70, -26, -53, 147, -260, 27, -303, -341, 104, -250, 67, -76, -75, -25, -39, -374, -105, -152, -280, 82, -24, 35, 3, 146, -170, -342, 53, -30, -42, -38, -43, 63, -16, -12, -115, 122, 106, -71, -53, 111, 239, 235, 190, -92, 20, -72, 226, 164, -49, -34, -61, 257, -331, -52, -46, -9, -27, -431, -186, 128, 113, 12, -98, 5, -107, 40, 198, 9, -392, -37, -141, -320, -60, -106, 17, -76, 22, 109, -71, -214, 46, -223, 156, 202, -107, -17, 141, -71, -48, 399, 36, -52, -98, -162, 41, -184, -86, 52, 10, -22, -90, 29, -84, 239, -86, -123, 86, -134, -45, 123, 132, 126, -204, -237, 200, -137, -32, 139, -34, 2, -14, -244, 65, -19, -115, -58, 68, -295, 214, -302, -54, 88, -41, 30, -127, -179, 341, -6, -68, 73, 65, 270, 212, 150, 177, 210, 98, -119, -50, 11, 205, 68, 13, 127, -240, 39, 53, 3, 86, -88, -107, -82, -53, 65, -66, -232, -250, 80, -325, -75, 38, -77, -50, 215, -11, -214, 104, -350, 226]
5964B26m10J6K33j80K01o4p3N5m4k67L60L6K29l39l6K54k11k2o3J90k0KN5J16
5988B44L6r2l2k52J11k7J25q6o3j0J11L1j70j15K58k96L02j31L6o0pQ8L0O8j17
6013a8J59o6k56K83k56jP6q9J44m4J20J7J62m48K60j85k95L76O1J13j80J73l28
6036b22L23k33K78k37j54L01j00j35N24l27N9J20k4r1o9l17K58o2o3N4m0K3K77
6059A43j33m5ok1l5J70m8J91l50j0J35O5j44K94J61j76j52m58N20j20j47K75K43
6082C52n35J04l6M47j55j48M2j40K03k52K03k02K80J12k92P2k2n6K33j17k05K09
6104I7j67L11j86J91l87L38K41k63j86j23Q4j63L05k28K41r1K8l6J88j9k64N5
6126c4K81Lk39j4J01k21Q3L4J63k51p7R0j37J65j57J42J1j90J79j5J25K80m45
$$ y = [226, -184, -168, 65, -115, 86, 22, -51, 4, -40, -307, 53, 89, 318, -21, -57, 197, -14, -36, -99, 91, 71, 73, 128, 244, 280, 188, 156, -96, 15, -12, 113, 27, -36, -46, 65, 96, -74, -189, 69, -227, 75, -56, -20, -80, -87, 1, 31, 99, -18, 141, 75, -181, 102, -154, -155, -79, -168, -24, -68, 52, 69, 231, -217, 43, -142, -437, -61, 0, 113, -67, 106, -222, 101, -132, 146, -91, -245, 56, -44, -179, 345, 18, 77, 197, 173, 82, 13, -304, -46, -108, -171, -117, -157, -134, 143, 10, -35, -41, -62, -97, 73, 25, 216, -134, -144, -9, 56, -88, 206, 367, 191, 39, -419, 101, -19, -166, 109, 352, -183, -79, -115, 332, 177, 29, 71, -69, 134, -118, 85, -117, 163, 275, -17, 55, 33, -23, 210, 93, -112, 97, -70, 241, 55, 246, -141, 197, 438, 175, -11, -134, -50, -213, 92, -136, 105, 14, 42, 6, 194, 175, -89, -34, 247, 250, 11, -3, 98, -123, -40, -6, 157, -94, -171, -81, -218, -53, -210, -68, -57, -247, -68, -83, 42, 322, -123]
6149a23K16J11k05j71K44p7K0o9j77K03J66l29k01L58j12L54l09j14J92m1O3j75
6171a76K99J3j57k8L58j43m91J32J13Q0K35n40PN24n4j71P8k07M54l79R2R7k05
6194f9Q8k08L1K06Q0l13L17j98M0J28k32L35j4j95K12k91K52l4mj8j83K11Qj51
6218bJ86k16K19l60o0R6MK19k16M82m76j16K40l9k02K30Ln1O8k9j11L08j96J23
6242A04R8k58j19J95j38Q7K12j01k11K71l70K79j18J54N1m0o9K12j30k52J60l52
6264c35N21n1j60M0r7J22m2J6k08K43J5J05j81J27j66K33l13J72J10k47K38j84
6286d2K3P0j60j83J82J48M1j35j12K59m7q7j24L28j41J63l10P1m0O8J77K4j37
6309C6j46Q8q3L53n07M0J85K9l16K37N0Q6m8O0M44n72k4MN5j1M9j48j9J04j77
$$ y = [-123, 93, 204, -1, -172, 72, -5, 15, -54, -231, -28, 138, -191, -392, -34, -146, 208, -101, -215, -23, -64, -1, -176, 123, 136, -21, -49, 309, 166, -325, -193, -80, 0, 235, -305, -298, 226, 172, 1, 79, -128, 326, -53, 39, 136, -69, 19, -189, -158, 48, 128, -185, 132, -66, -26, 102, -130, 205, 191, -4, 208, -83, 169, 135, 131, 113, -70, 141, 149, -2, 184, -32, 187, -173, -233, -137, -133, 86, -130, 352, -124, -240, 0, -39, -241, -11, -8, -59, 9, -20, -131, 177, -19, 104, 202, -56, -175, 20, -118, -31, 181, 80, -131, 140, -230, 49, -69, 85, 136, 96, 27, 239, 109, -143, 17, -335, 186, 135, -25, 15, -82, 40, -2, 14, -194, 49, 64, 169, -12, 115, -51, 182, -131, 41, 151, -96, 142, -42, -19, 51, -109, -292, -110, 38, 79, -56, -168, 91, 44, -43, -167, 161, 20, 183, -127, -56, -96, -28, 149, 173, 36, -110, -22, -105, 248, -259, -219, -34, -5, -321, -84, -34, 52, 4, 64, 508, -64, -88, -84, -29, -40, 9, -139, -158, -54, -231]
6334b31J37K96l36K85k56J34K60n26M67j04j09R3j07N2J54p9k08J83q6q3N5L8
6356B9mj66J36o9J60j5j78n2j61M64k05j98N98l05J02k10j70K53J92m14M32m85
6378b66L55J01j31r0O4J50j13j66o4O5K58o8J14p2j56J32J07r6k69K89j84j2k22
6401b74L53o6j49K67j69K3o0k78K67L83m52K09q0M0J15k43J07J75j93M2J9j6k47
6424b27L53l27L54k89J32m5k03J44M00o65L21K74k98j16M61k46O5k09J2L35j13
6445A13l46K72k11J1J29R7k5J38L6k03j68L37j04K03J2l83J36O6r3jq6K0pN3o7
6470g1J60J0l36K38J60k32oM4pM5j37R0k0K67m32K19J44o4j9J15k47l6n9L04M4
6495A74k87J58J77m04L24j06OK11l08K67p9m9N4j65J43N4ok47O1j48J71k38M47
$$ y = [-231, -94, 202, -134, 151, -105, 29, 289, -237, 230, 126, 17, 110, 3, 55, 209, 130, -78, 105, 19, -64, -9, 29, 25, -141, -5, -74, 86, 71, -107, -159, -320, 144, -61, -259, 339, 34, 136, -74, -244, 9, 201, -213, 219, -266, 89, 190, 59, -31, 33, 183, 70, -96, -160, -95, 163, 95, 209, 137, -19, 113, 220, 124, -145, 144, -40, -52, -274, 79, 13, -136, 131, -38, -15, -75, -353, -86, 297, -155, 54, -26, 14, 129, -114, -7, 168, -25, 17, 36, 20, -227, 126, -201, 153, -136, -4, -49, -252, -108, 292, -373, -52, 222, -76, -192, 269, 23, 88, -121, -109, 226, 113, -233, 39, -172, -161, -32, 65, 40, 178, 214, 11, -157, 180, 76, 279, 291, -92, 44, 110, 17, 16, -70, -50, -57, -4, -71, 89, 99, -237, 1, 161, -71, -77, -33, -40, 5, -132, -42, -62, 205, -227, -8, 136, 72, 53, 168, -79, -115, -174, 130, 174, -113, 45, 222, -182, 142, 36, 42, 253, -55, 212, 133, 84, 138, -27, 116, 170, 164, -83, -22, -170, 1, -237, 210]
6518B10k70q2J52N1k03J67K92m02J97k6jR2l03J20J73k30j11M2K43K0j26O6K9
6541A00p8r1O7P0j02kp8L07k22O4o6L7k21J46L02l73jR0J46n9j52K20k9r3P3o
6567D9k4j59L53l07J58l1L6r2J56l51L37j54O9J52p0l93N92k14j23M70l95J3j61
6590h9M3K4J91l20J85N3k02K83o1k15P3J9r1J02l7p5J20j07L86m11J66J96n59
6613c26L65k9j3j20l3n0R4j3NR4j10L44r4mk25K27j49J76r3J24k07j14J53j22
6637a20J76k48J90r7K96k39j98O4L18P2P0l97L45k51j6j19N4K09jM8o55M64J68
6660A33J22k65Q0j4P1q4L1p3j1K23j84n1k38J04K14K4M1l36J70NJ13K53n64K91
6684E5J23kj90L53m73J19k30J5K31j60K06j27O0q6q4K76J38k34l3J53l69L25J92
$$ y = [210, -60, -142, 10, 61, -142, 25, 317, -85, 112, 86, 85, 177, -126, -6, 167, -63, -174, -132, 111, 131, 5, 71, 100, 22, -69, -2, 68, -34, -36, -114, 193, -29, 35, -31, 6, -215, -69, 233, -140, -141, -51, 95, 36, -116, 104, 75, -18, 55, 49, 25, -134, 219, -88, 70, 39, 75, -17, 139, -212, 125, -29, 40, 192, 122, -271, 321, 107, -16, 454, 59, 72, -89, -46, -22, 169, -151, 34, 87, -115, 168, 107, -108, -35, -16, -107, -5, -42, -117, 3, -104, 282, -129, 37, 233, -326, 39, 10, -3, -123, -156, -206, -112, -125, -120, -26, -136, 208, 114, 110, -115, 112, -37, 139, 46, 170, -37, -151, 2, -120, 56, -192, -2, -99, 197, -42, -240, -176, 142, 214, 284, -113, 232, -19, -35, -154, -100, 109, 108, 156, -499, -35, 133, 255, -10, 70, 56, 127, 43, 74, 1, -10, 213, 29, -22, -260, -156, 58, 82, 123, -213, -43, -38, 75, 328, -236, 55, 178, 176, -14, 339, -134, -15, -245, -230, 1, -159, 47, -80, -20, -106, -190, 86, 224, -10, -43, 110, -259, 66, 258]
6707B58n30L87k35L1M97n00p7J56q0j1R4L0M4K1k78L81r4k53L68k98l3K96q7j5
6731G2n5J17j10L0k13K59j13k22K4J54L12j48n6k45N05m58K31j84l01N88R1m13
6753a35J81n0P9j02n8J28J4j54J35L8L6q2q0o1J10j5o9N13l93J45j13j96K54Q
6777A33j61j15J32k33M02k75n6J86Q3P7l8j9m1qO1K59k36j15N3l1K4j77m4k4L49
6802A86j73O0j7l10M9J69R1K3k48R1K73m40J09J95k70K41J50q3kj54R7J68k38
6825c3N4N0k44O1L0j24L57K32k86n0k12J55K43k11j41K34k8j49n1L05l92K67j28
6848f1Q2P0j66K58k83j55L13M5j65op8J22o1J57K05m26L02N0mj89J85k52J30o3
6872A0K03o2j08j04J38l67K19J97j68j38R3k23L88m1R6L0k39K01J80k91J25j36
$$ y = [258, -272, 115, -120, -89, 408, -92, -169, -13, -93, -104, -10, 20, 64, 85, -193, 188, 94, -159, 209, -89, -122, 174, 87, 72, 17, 134, 24, 54, -159, 100, -13, -235, -211, -57, 255, 107, 51, -194, 311, -147, 84, -100, -401, 187, 278, -135, 46, -4, 75, -27, -85, 43, 57, -97, 38, 76, 112, 30, -50, -111, -1, -16, -85, 428, 35, 180, 67, -129, 125, 133, -28, -143, -11, -244, 158, -117, -173, 13, 96, 173, 135, 116, 75, 67, 128, 387, 151, 36, 89, 58, 82, -95, -139, -163, 186, 13, 73, 56, -254, -205, -36, 55, 78, -170, -79, 194, -246, -137, 58, -212, 29, 179, 96, 94, -60, 37, 205, -33, 21, 71, -173, -112, -82, -206, 151, 383, 97, 47, -165, -10, 233, 22, -119, 115, 87, -62, -113, 192, -200, 67, -61, 21, 91, -75, 183, -100, -255, 58, 103, -62, -68, -146, -24, -85, 72, 277, -149, 153, 203, 199, 10, 195, -57, 73, 10, 213, 151, 43, -61, 77, -290, -71, 126, -42, -180, -87, -310, 78, 37, 133, 163, -76, 125, 305, 14, 139, 3]
6894Cl08K66N0l3O6k09K46m1k4j79O2j38M10q4j79L29l79j67M00m55L10Mj0J25
6918F5j78l1J26L8q0R5l68N66j79R8k83K08l64L82k03j03L06k57j13K71J46l55
6940b13L84k74l1K37j70L6J08k9oJ05r9K20j86l1J3k11R3M79o09K42L6Pn4j29
6964h2J72k5l9p3R4l23K12K62l51L98m84M3M75l52k29O19n13J67K27l70J56j64
6986a80J09m0M14l48R6j43k0oK57k54J78L%j29j65L51kJ83m54R6J9R7rJ67k69
7011d9O6k8j6J96l5P9j88J69k87J78j36l00M97r6l56L69k9l95N42r3j80J90m24
7034c26M15j57K40k64K54n89M31Q7j19J96j98l8m4L19l75Q5k56M99O2l75lJ78
7056B2J53P1n93K37K08k8k40L00p8j1p8j03J54r9Q4r3j22n2M73q5j16L0oJ9K98
$$ y = [3, -305, -39, 11, -22, 44, -165, 81, 40, 16, -163, -101, -239, 171, 87, -92, 237, -142, -309, 91, -364, -54, -50, -60, 65, -113, -144, -18, 20, -60, 35, -333, 233, 54, 152, -131, 77, -287, 95, -108, -211, 95, -162, -275, -4, 142, -213, 171, -103, -134, 103, -67, -31, 77, 48, 42, 147, 48, 268, 82, 51, 64, -147, -54, 425, -184, 58, 94, 101, 47, -82, 90, 65, 26, -47, 47, -276, -64, 198, -153, 245, -239, -196, 279, -73, -302, 317, -196, -29, 198, -172, -16, -180, -71, -111, 303, -45, 51, -92, -112, -118, 139, -115, 63, 66, 66, -63, -228, 123, 121, 304, -150, -54, -35, 62, 53, 220, -49, 17, -11, -27, 169, 134, 213, 25, 194, -93, 85, -51, -351, 146, 50, -306, 63, 34, -361, 181, 88, -92, 98, -326, 89, -68, 172, -92, 162, -427, 4, 91, -28, 168, -30, -68, -112, 207, -168, -83, -339, 160, 222, -153, -156, 22, 175, 246, -347, -110, 98, 70, -170, 130, 52, 41, -37, -140, 14, -85, -1, -94, -216, -268, 205, 120, 4, 34, 28, 47, 345]
7081C45m41J19qP9K02k55j98M47k76J21k12L1K4N4m7L9O0l45J15K75J5j12r8m9
7105a15L22j77K7p7J61j39k29K41K64l39P0k1K2j00N40m19J47o6Oj35Mj31P9J38
7129G3J35j01O0l64N1K07k37J74l5L00l57l5K02N1j58J67k48L66l7l33M1K3J4
7152d1J39pj19J27o7j43JK57K5k21K33k57l2p6M78l68j21K63K31l58l6j02N7j2
7176a49J14Q1J71l30J75j41P1j04K00n2J8L3J26l05p6P2P6k70L27R9r2l0m2J70
7200A42k59L0K34l2k99p8J82Q7O9j40L37l35J47K17l87k73L52J15k94L01k2l66
7222b72L04j2k0J33j47L17nm87K80j51k36J64K05j82J54k49L91o7j64k88K96k31
7244b67L56m54K6L34r5L7J12k26K77k9j21O7j21Q2J22j34j84M63p7L2j51k43p9
$$ y = [345, -96, 23, 15, 94, 296, 41, -157, 290, 14, 135, -77, -46, -22, 32, -15, 24, 84, -261, -146, 129, 144, 32, -66, -115, 207, 30, 57, -20, 141, 2, -227, 14, 278, -61, 9, -12, 10, -90, 450, 31, 178, 112, 118, -17, -13, -144, -65, 73, 208, 107, 167, -197, -146, 61, -176, -2, -37, 263, -94, -129, 73, 124, -34, 133, -115, 251, 214, -119, -78, -55, -41, 98, 91, -28, 99, 32, -111, -110, 147, 172, -49, 184, -73, -105, -181, 297, -71, -192, 71, 302, -56, -92, -194, -137, -149, -35, 46, 217, -113, 62, -79, -8, -112, 88, 36, 54, 87, 213, -92, -168, -96, -20, -290, 37, 136, 44, 14, -28, 142, -117, -87, 147, 115, -184, -262, -80, 7, 76, -64, 273, -62, 85, 302, -85, -358, -6, 109, -185, 116, 94, -272, 32, 20, 0, 133, -14, 303, 298, -189, 91, -60, -296, -132, 73, -109, 45, -204, 187, 120, -44, -332, -36, -267, 89, -365, -339, -5, -100, -63, 49, -177, 100, 71, -50, 17, -104, -22, 100, -34, -218, 245, 168, 200, 49, -194, -273]
7267b73M66k73J08O2j88l0R4r1Q2r1l9J68j98J67K53k36J6j60K37j46J81j17J56
7290A48n4L5N8r1k01J96o0J34J6k02K09r3n36M21n4K93j69k71K82L4l38J67k15
7313b91J87L80k60M8n9j12J72J35j14j46q9M9J92m02L74mq7j39j01Q8J1L74j70
7336C6k7p1K1K02L9p4j95j12K86l75J43J16Q9j93K59j90j15O0j04K29K24n03L17
7359F2O5j82J23j61j61L39l52J69J07j8J18J27j57R9K59l78J32j16J44k22k57
7380b60J70j0K46k38K78l86L43k16j62J1N05k42o4q0K79q5m57M10k2k84L05j82
7402a41lL91l36J06j07K4k33O04m58J72k51K65J52o09M85J24j21%J05l76K78J27
7424A98j81j30K07j52k50K82J31K1l59m4L95pN5j89j59K80n4J54j78J0k01O0Q6
$$ y = [-273, 193, -80, 28, 90, -98, -128, -34, -125, -43, -134, -173, -5, -203, -36, 217, -19, -3, -163, 74, -72, 109, -8, 148, 94, 129, 187, 96, -105, 91, 31, 165, 181, -21, 188, 95, -441, -20, -74, 219, 50, -221, 61, 95, -243, -76, -291, -104, 276, 16, 64, 5, -107, 65, 200, 86, -60, -149, -100, 92, -310, 64, 60, -27, -166, -267, -179, -168, 206, 36, 9, -62, -41, 161, 200, 126, -69, -181, 105, -270, -127, -11, 78, -115, 144, -46, -161, -101, -205, 24, 248, -255, 62, 127, -55, 68, -93, -254, 85, -267, -98, 9, -9, 109, 236, 79, 178, 437, 59, 191, 75, 219, -3, -260, -90, -100, 146, -92, 186, -200, 143, -73, -235, -224, 281, 39, -25, -105, 174, 89, -368, 42, 20, -264, 41, -141, -144, 247, -89, 17, -90, -66, -299, 305, -153, 19, -232, 33, 185, -424, 61, 185, 64, 64, 169, -207, 71, 198, 17, -113, 94, -58, -308, -26, 105, 126, -233, -277, 118, 111, 166, -23, -182, 98, 44, 198, 20, 30, -171, -111, -25]
7447b5J81j40L0l0K86j92k42K41k60J37oj12p7K86q3m6k01M13j14k01j07K13L2
7470a7J89rk51J23j66j22N34m50j40L22k30J00P6k02L83j62Q4N4k23M2J05j66
7492a26J24j2j8k50M29k42J91l94J47J32j40K23%j27n3rJ16J46o2j30M60l82j23
7515a00J14k7Q3j7j5j63P3J41j75K52k86K17J08l05L97j68l34M77l72J41r2m5
7537i6K60k26P6Np3M38l04l62Q5L45m67M23j4j44K09j85M4L16l08k95O25k03j14
7560C5J45l39J8L52j72j89J24j16K75J08l05R8p4P0j19J63j51K24j39J38K9k14
7582c9M34m30n7m0n8K63N3k56K63k48k45M38P5k08K40k58OJ02M4o4k06KJ53o3
7606i9J10r9j27L12J50m01K90k61j73J11K03mJ57n7k06L19j4N6k28j99J08j9Q3
$$ y = [-25, 156, 16, 46, 16, 302, 110, -132, 109, -151, -14, -20, -132, -209, 77, -6, -52, -253, 160, 46, -155, -262, -49, -17, 172, 163, -88, 35, -131, -253, 281, -169, -309, 13, -217, -117, -41, -243, 140, -22, 62, 116, -107, -65, 40, -126, -2, -14, -32, -282, 147, -95, 96, -298, -151, -19, -159, 64, 64, -63, -116, -125, -9, 137, 75, -55, 405, 23, -100, 14, -13, 70, 53, 38, -125, -52, 89, -86, 166, -120, 97, 205, -100, 297, 129, -205, 272, -100, 41, -51, -96, 164, -62, 14, 19, -54, 384, 80, -282, -197, 148, -319, 104, 90, -54, 155, -30, 14, 330, 22, -273, 352, 149, 35, 180, -159, -141, 211, 39, -150, -26, -142, 133, 241, -64, 34, -40, 30, -89, 74, -77, 147, 8, 146, 175, -39, 395, -35, -92, -132, -190, 73, 126, -130, 133, -115, -360, 78, 153, -55, 185, -73, -67, 35, 79, 15, -191, -189, -36, -99, 11, -88, -215, 97, 247, -154, 136, -125, -298, -187, 16, 12, 169, 112, -94, 225, 211, 267, 39, -160, -52, -71, 12]
7629A2j46J93M6j17m3L36m42O4j19L18j92n2O0J15j37rj43J29J90Ok58J85J20
7652A16j86p5R7Jk18N62j64k09K37j91m3J82l14J79k8J6K73l03L10j74J08k08
7674c2K10l00RM18k34pj5l02K25J78n02K44K06k9k3j66J1J44n2LP3m06J95J15
7698c7m8L79m35J47j03j85K43J85k03M51j88l85L2M69n67M36J94l38R5o4%j41
7720f3J5j0R2J73k24L21m39M47j86o5r6o4j44L66j17Q5J43j89j4j3J9O6j00M1
7744D4P3m23K76J74j70j30L12j42N5J12l8n3l6P9M1l57N8P1N8J51l00J63R0j54
7768d6J3N5k30K21J06k97n7L72l53M77Rk88j51O4J00J52j94p5K17n7p3JN7p5P1
7793A9p5N5J88k20M06k97k13K38j74K62l4m17K00L0J23p2k93M60j72k59K2K08
$$ y = [12, -134, 59, 105, -12, -55, 281, -161, -97, -216, 102, -90, -142, -82, 33, -104, -113, -256, -127, 63, 69, -189, -4, 116, -70, -145, -48, -47, -265, 297, 133, -76, 161, -30, -73, 109, -205, -26, -54, -38, 235, -68, 242, 68, 176, -32, 178, -122, -113, 305, 71, 64, 49, -253, -28, 150, -352, -108, 98, 69, 46, -120, -109, 35, -17, -14, 59, -347, -152, -37, -85, 294, -141, 6, -97, -282, -39, 146, -57, 394, 206, -179, -147, 322, -245, 191, 385, 47, 142, 78, 78, -63, -48, -58, 34, 207, -17, 304, -135, 312, 126, 61, -35, -99, -243, 123, 6, 91, 234, 45, 31, 18, 37, 103, 3, 44, 117, -306, -30, 144, -26, -156, 156, 14, 69, 181, 143, 90, 54, 133, 174, -183, -125, -54, 4, 155, -145, 18, 108, -46, -33, 22, -208, 13, 119, -178, -235, 137, -216, 261, 270, -18, -169, -105, -5, 147, -47, -122, 95, 38, -35, -34, 23, -52, 19, -56, -1, 187, -33, 373, 76, -137, 101, -73, 189, 155, -262, -62, -32, 91, 19, -274, 186, 14, -245, -223, -15]
7815a5n4M2J12q9J74j10m9j69Q3J27l8j10K09q1j63L68l40J54j19K0J51l0N9k02
7839g0J90l9l32K20J13j89J75J34j55R1k86J24m2r8L96n03K06K65n74L76j29j16
7861b43L63k27J78K9j24n6L00K0k36J7j62K65O9j38J9R6k13J64l77K48K74j24
7883A42nj66k1M2J01r0K12j96P8m8J14j37J58l66K08L17k86J33l50J86J24p9j62
7906i1K42m25K16m8m09M42J78l2k5j7n6j25j6K73k95R5M9J28l16Q4P4m0J91k77
7930b00K21Q3J72l43J51k11RK66j56Q0k79L84J12l93N3K26l73K69L4n02N16k27
7952a08K44K4J79l14j68L19k13M9J09nP9n55M70L5m09K31Q5K4r9kj9m33N08J23
7976A54j04k8J69j53l18L37K8j70K49k26N7K59l61K83j18k66K52N2j81J97o6k10
$$ y = [-15, -69, -27, 85, -4, 170, 60, 11, -158, -75, 52, 14, -96, 113, 32, -131, 237, -103, 51, -68, -48, 103, 73, 132, -70, 120, 81, -251, -31, 82, -107, 68, 202, 47, 138, -148, -24, -66, -164, 232, -271, -65, 200, -374, 2, -127, -243, 120, -107, 71, 100, -24, -80, 220, 240, 4, 21, -141, 124, 193, 55, 74, 170, -43, 121, -256, -8, 266, 142, 137, -29, -50, -8, 93, 3, 215, 19, 97, 49, 163, 26, 184, -182, 26, 343, 57, 190, -160, 26, 150, 71, -91, 151, -274, -58, -106, -515, -73, 105, 73, 48, 31, -25, -150, -166, 107, -188, -93, -44, 84, -232, -148, -74, -114, 77, -200, 21, 104, 276, -67, 84, -127, -118, 148, -8, 72, -207, 177, 289, -104, -51, 175, -198, 71, 105, -397, 119, -108, 136, 160, 339, 25, -143, 176, -37, 12, 121, 116, 195, -360, 110, 145, -264, -33, 52, 76, -23, -25, -44, -477, 31, 154, 50, 22, 191, 38, -280, 57, 85, -85, 164, -62, -5, 254, -107, 176, 58, -208, 44, 96, -85, 112, 46, -164]
7998a64K49k47J81r2lN7j1o1L8r0L46J21k43p3J08n7J59J2l30R2N3k8K81l19P1
8023E0j85k2K90j29j94J76Q3l1J14l5j38rl4l7K7m2M20l26LJ29p7j11M26l46k17
8048b15J59j21M3J38RQ4J44q2k41J60o2r0J50l97K40J37N8j12nJ2J53k17J47k89
8072a97K05Q5m0k90L3Q4N0%j32K84qp4q6P7j06O7l07J04L5J9P7J51k37K09j61
8097a58J82P6k74K01j19K7j85M03n4k11K79N8j52L8j43J16k50M3L68j38P1k59
8119h1J21OL08n21J24K67l28N30l37j30p9J44q5n4K41l9r5J36N6j93Q5M1j86J58
8143H9K38l71k2k25N96l72K3Mj31L90j71Q9j34j42K55p1q4R8j15N8j11k43J91
8166a61J52l35L60m6j06L47q6J83k58o2J27j33J99j39mN0n6J24K45r8l97k8J22
$$ y = [-164, 85, -162, 19, -73, -76, -19, -30, -91, -53, -143, 203, 324, 81, 8, 116, 59, 218, 230, -100, -8, 45, 17, 298, -21, 50, -135, -157, 133, 4, -190, -14, 69, 38, 152, 117, -21, -30, -64, -101, -74, -116, 304, -22, -19, 110, 33, -78, 348, 2, -215, -56, -177, -134, 4, 13, 97, 241, 159, -82, 78, 16, -74, 76, -321, -81, 56, 114, 2, -3, 9, 162, -55, 92, -197, 8, 93, 53, -237, -204, -120, -70, -70, -202, 82, 74, 0, -86, -9, -115, -48, -355, -251, -216, -197, -120, 31, -206, 3, -158, 24, 100, -174, 27, -92, -65, -250, 153, 99, -112, 167, 225, 73, 111, -32, 84, -166, -123, 245, 107, 178, -81, 40, 46, 354, -167, -43, 224, -104, 426, 89, -41, -120, 24, -61, -115, 126, 87, -8, 128, 184, -9, 76, 117, -69, 89, 327, -44, -66, -291, 305, -67, -44, -40, -171, 219, 48, 137, 3, -139, 116, 45, -39, 59, -56, 2, -109, -352, -161, -9, -344, 16, -30, -136, 211, 125, 308, 50, -12, 115, -18, 181, 42, 38, 88, 32, 156, 401, 303, -94, -122, 0]
8189@j16L02
$$ y = [0, -116, 186]
8191A86
$$ Imaginary data points
##PAGE= N=2
##DATA TABLE= (X++(I..I)), XYDATA
0@%%%%%%%%%%%%%jRj6J6j6J6k4L2l6M4n2O0p2Q8r8J10j30J50j68J91k17K43k75
36a46L10l48L90m36M86n40N98o62P33q10Q96r90J091j200J320j456J606j772J957
55A027k165K399k666K978l345L779m304M959n800O929q528J0988j5315K5186r4444
70g8322j4515Q3471l9350K9014J5396J3541p92J7915M6264l992o5398K2959K3535
83D9726k5680j5138k2848k0143o234m4869J4312M0339l1314L934O4436J8466n923
96A9064r526J8055K0804l5394L562M3052m4750l4741K7399o323k2292k2166j3720
109e6976K2424j1043q898M9309J1385j2317K0366J1706O544j9679k6025L9595
121B6391Q490m1584J8625P745m0042o157J1507P158j6178l2787K7004K9209j6666
$$ y = [0, 0, 0, 0, 0, 0, 0, 0, 0, 0, 0, 0, 0, 0, -1, 8, -8, 8, -8, 8, -16, 16, -20, 24, -28, 32, -40, 48, -50, 60, -70, 80, -88, 103, -114, 129, -146, 164, -184, 206, -230, 256, -284, 314, -348, 385, -425, 471, -519, 572, -628, 692, -764, 842, -930, 1027, -1138, 1261, -1405, 1573, -1772, 2007, -2297, 2662, -3138, 3791, -4737, 6251, -9064, 16122, -78322, -92837, -9366, -48716, -19702, -4306, 9235, 8443, 26358, 72622, 68630, 3232, 26191, 49726, 24046, 8908, -13940, -34083, -40317, -85186, -70874, -30535, -61849, -57915, 6521, 24987, 19064, 9538, 27593, 48397, 13003, 16565, 59617, 14867, -19874, 7525, 1202, -21090, -43256, -56976, -34552, -45595, -54493, -5184, 6201, -6116, 14250, 25956, 32500, 12821, -13204, 26391, 34881, -6703, 11922, 19667, -20375, -26532, -15025, -7867, -24045, -56832, -29828, -619, -17285]
134a7285K4279K1335k4283n159m36J2162K0230k8679m613K8135k0816j2714J3657
147E813r507j3930j8754N055L0227j8886o469M1524o350j5549J8598k69k117m597
161D789l861K4748o039k3666J5222o044k0415o06q472O917K321j6811K7032J9103
175A4218k1965J3604J5289j2165j243l105R022P334k2592Q556J1435l1265m307
188a7184P352j2181M547k933K931K3171p612K276K4473j0380p549N440n909P301
202A3743p098r663J7170j4347j9464J6055p756j1302Q300j970J1851P808n297
215a970J9532K148j6164J0733k996q977N493j0502L144P656j9441M845P420j8021
229a7100L851N094j791J1052k819N557J5797j4101N7J0232j6092J47M184r062
$$ y = [-17285, 6994, 28329, 4046, -1113, -1549, 10613, 30843, 2164, -2449, 25686, 4870, -7844, 5813, -3694, -17624, -36378, -31323, -1096, -19982, -26451, 15073, 8723, -6826, 11772, 11503, 9386, 4789, 928, 25676, 19637, -4029, 11193, 5149, -15266, -15872, -24344, -17427, -15106, -31917, -4885, 14218, -7747, 5857, 21146, 8981, 7738, 4633, 13655, 20989, -1603, 6953, 18388, -12877, -17184, -9832, -22013, -17466, -20399, -17468, 5703, -1909, 367, 24840, 14460, 6911, 12351, 6442, 13743, 6645, -3018, 14152, -195, -19659, -3604, -11360, -22662, -14362, -16332, -4481, 3327, -1970, 17562, 19710, 3546, 14279, 11283, 2306, 7799, -2703, 441, 8097, -11344, -6499, 921, -17100, -13249, -8155, -9946, 1106, -1713, 3844, 19641, 5540, 5597, 15829, -263, -116, 4068, -4994]
243d994R316m615q483J3587q146p948J0516p555K358P759o258J2878J667j3245
257c163J2309k580j2458R543m996k130Q475q637O696N699j5076N868J974j0451
271h927R108k561k567J1785r146P1J1013j2561k38O389p474P412K37m612J2610
286A0539p074o530J1187r250l818O487q138N961K610r598J1195j697j1057J0504
300A321k320l704Q818n733M868O984j2309P248L564j3939O149K43o129P662p092
315d369p2R706j2109K073Q293j0466L852M216m711J0077l840l957J2129r401m174
330b753J0280q503k80L800p227P261k274r373J1405l904p824J0214m089j50P175
345C758o386O960L365j1745Q658J883q799P540l359l910O489r124K149P105j2635
$$ y = [-4994, 4322, -293, -8776, 4811, -3335, -11283, -767, -8322, -5964, 1795, -4463, 8415, 10082, -3163, 9146, 6566, -5892, 3651, -1345, -3475, 5000, -3637, 3059, 8758, -6318, -450, 1524, -8927, 181, -2380, -4947, 6838, -2308, -2237, 8776, -3785, -4023, 2366, -5108, 2304, 2541, -2071, 10539, 3465, -3065, 8122, -1128, -4946, 1541, -6597, -636, 1974, -7624, 3571, 1874, -9183, 1321, -999, -4703, 4115, -1618, 3250, 10234, -2075, 5173, 8737, -5202, 947, 1190, -4939, 2723, -4369, -4441, 5265, -6844, -4771, 3522, -6944, -3092, 1124, -3587, 6490, 2650, -1307, 10822, 1421, -2753, 7527, -976, -1256, 2544, -4683, 2578, 304, -9069, 2336, -1568, -9392, 822, -3267, -3417, 3758, -2628, 4332, 7697, -4048, 4610, 6493, -2306, 5234, 1875, -2035, 4454, -4670, -2521, 4584, -8051]
360h051L617N487q408O660Ml861R776n269j178J0050r271k61Q637p355L468%r603
377e558P486k346n668J0057o796n050P273n718M374N426r156P496K113p557R821
392F197r25n461P627o164p46N662j1617K724O483r122M254r83p613Q004j802m75
408c957J0629q207k066R740m428M130K423r493N285k642o836R917m435o422P243
423H81n019PL137q484P804N831p396Q463j81q205Q055q01oL640j3516R69Q210
440C389q134N895L710j0599K312j443Q26J0602q869j252J1132p329J11O435o670
455A16R94j925l786J0371p728p600J3343j560l360M874n891Q48l5m061J3744o22
471G722j3127P568P89n389M418l784J692P31r947J0197P669j1598M186M972o009
$$ y = [-8051, -4434, 1053, -7355, -695, -691, -4552, 5224, -45, -1223, 8827, -444, -705, 7932, 577, 4045, 4045, -5558, 1928, -418, -6086, 3971, -2825, -7875, -602, -6320, -1946, 3480, -5676, 1820, 3933, -3624, 6197, 5272, -189, 7438, 1274, 528, 6190, -5427, -2703, 3780, -5342, -1088, -2071, -9684, -1680, -3482, -3957, 6672, -1535, -3601, 6139, 1711, 5841, 8264, -1229, 4056, 1414, -5422, 4495, 60, -6362, 881, -4138, -4131, -994, -9478, -1674, 4157, -3239, 5224, 5043, -3162, 4893, 4092, 4086, 7726, -5790, -4821, 3389, -4745, 1150, 4860, -5739, -3427, -4870, -4044, 6558, -2311, -3563, 7569, 240, 351, 6786, 116, 1110, -815, -4601, 5770, -1958, -9558, 3785, 2225, -1135, 3739, -2152, -1304, -1339, -5400, 8344, 7722, -5405, 2163, 2952, -2437, 1981, -1803, -111, 620, -9327, 870, 8539, -3059, 1127, 6099, 90]
486I0O16m620L063P827j0213L684R769j3111k540P104j585K504n952j262J1537
501F911q081j729J3950o816q321K379j5N425m129m091J3002n164r639J2080l21
516E441q306J265r5O636j593r431J1671J890j3674N865M040o037o91k074R002
531C909N392j2520O336Q581j3235n61O422j925m10o544M669Q980j3473j024J2114
546F711r019m519N776J901M420n075O81J3745r488q959J1157k854o424J341N50
561e6N702o545p217J4007k145j3888P982M448l782J710J030R050j277j3033R945
576E931M847j3814K142M487k844m67m482P062M394j5065K255J0686q823r38O770
591B141K067K167p500K869J0631j2509m711J2043m824m619K895J493M635q005
$$ y = [90, 706, -3914, -851, 6976, -3237, 447, 10216, -2895, -5435, 1669, 84, 2588, -3364, -4626, 6911, -1170, -2899, 11051, 4235, -4086, -1707, -1722, 3703, -426, -4517, 8485, 3321, -6318, 5762, 5441, -2865, -1600, -1695, 4941, 3348, -6083, 5588, 7478, -6196, -331, 3709, -2328, -3019, -5093, 3909, 9301, -3219, 3117, 11698, -1537, -2098, 4324, 2399, 1989, -4555, 114, 9094, -4379, -5403, 6711, -2308, -6827, -1051, 850, 5270, 195, 876, 14621, 5133, -3826, 7331, 4477, -1947, -606, -56, 5646, -899, -8116, 5891, 3746, -10142, -2160, 2288, -1494, 216, 1246, 10296, 9019, -4014, 5931, 10778, -3036, -894, 3593, 749, 282, -4200, 2862, 7256, -7809, -5554, 5132, -3691, -4629, 2141, 4208, 6375, -1125, 1744, 12375, -134, -4845, 7198, 2374, -2245, 650, 2143, 6778, -1227]
605a227m753J1763o779r318J0554K099k839R38q33P831l718r579J1924J274j2146
620d809N837M742j598j274n051N566J00j3683O987P077j0121J812N504R40J939
635C968o553L668O741j1263J517J1768o191k810J107r5L555q598k726R055r034
650e891m528J1971J47k031J75j472O322l595n108J1533k825q442P901P82j690
665C249j397o446M475r04r248R100L857p861L736L051k3J385o288M483M887r835
681c779M341O922o928M59K44k223K404p978P64R115p023l58P858l831K69O52j864
698i56N179n369l830J0340l210m453O161l451j811J89l961O372j736o294Q612
713A782J374m784N100k862j045J813n383N404K900q451M303K822n118K800k026
$$ y = [-1227, -5980, 5783, -996, -10314, 240, 2339, -500, 438, -395, 7436, 3718, -5861, 6063, 7337, -4809, 1028, 5770, 4172, 2898, -2153, 3413, 3513, -10170, -3183, 3894, -6227, -4415, 1089, 2029, 3968, -2585, 1083, 7824, -3439, -1922, 9846, 3655, 845, 1952, 1857, 5412, -3186, -5912, 3143, -5891, -10419, 1552, 1699, -332, -157, -1629, 4693, 1098, -4010, 7523, 4698, -3744, 4157, 4939, 3249, 1852, -4594, -119, -1023, -10271, -1171, 2686, -5175, -1439, 1612, 1589, 2974, -3314, 1169, 6056, -3779, 562, 7484, 556, 1015, 1259, -964, 1440, -6538, -5774, 3341, -3682, -4040, 3818, -13, 256, 908, -956, 4223, -1146, -4976, 5364, 2154, -2299, 3862, 411, -1400, -1211, -5172, 1200, -536, -6830, 1782, 3156, -1628, 3472, 610, -435, 1378, -4005, 1399, 4299, -4152, 151, 2973, -2145, 655, -1371]
728a371j859L477n325L335P459o860J510L817m954K397r81l160N062m518j536
743c507P839n384j076L402m972K307M40l958O929q21l863P205k121k582L091m228
759a299J090K502o076M662J518o162M160n91m000M587l996N30N258n012K935M804
775D910n059K111R05m480M539k667k386N993m746j389M880n056N49J096m973M825
791i48K40l051O890j198l269N097k388Q1K555n970L485J174n438N278p82n542
807c786K868k325r65M895m493J435N031n051L482L541m745K761j025k477N134
822D280m577j077N197n593m30L082m859J818K93k653O611j520l405O457k331j214
838G9L980m303J298J241m830M823J47o158M289p41l127M082l275M19L610m291
$$ y = [-1371, -3230, 247, -5078, -1743, 5716, -1144, 366, 4183, -771, 1626, 645, -2515, 2547, -1971, -3507, 4332, -1052, -2128, 1274, -3698, -1391, -951, -4909, 2020, 1199, -2664, 4541, 2420, -162, 2929, -1299, -209, 2293, -3783, 879, 2397, -3765, 395, -196, -4196, 391, -3605, -3075, 2183, -2829, 106, 4910, -149, 1962, 2867, -1613, 2926, 259, -2127, 3866, -880, -2269, 2611, -2445, -1896, -800, -5773, -948, -708, -3759, 3131, 1933, -1336, 3761, 1373, 1454, 4009, -1961, 1524, 2698, -2740, 2538, 1756, -3786, -918, -3243, -4208, 687, -3806, -2371, 2660, -2391, 1091, 4632, -113, 2648, 1623, -854, 4280, -297, -1374, 3823, -1770, -2200, 882, -3977, -2159, -1866, -4519, 2092, 572, -2833, 3624, 1293, 79, 4059, -244, 1054, 2295, -2535, 2288, 2435, -3723, 566, -175, -3302, 780, -2495, -2076, 1534, -2757]
854b757M001K888o373L075J104l723M317k688j555L983n066J711N102n816M50
869a347K217l683M467n47k689M898l888j690N604l893r25K332l948L051Q46l982
885c177N117j370l294N986k599j533L517l582J754K793n809K752P35n065M533
900G58j118k888L858l469R45N100m494J158K456m506L946J218l288L712k887k558
916b057N140l250j182K822n407K128K271m108M014k42l510N330j386j347M073
931C289l834Q77M152m896K222R92n484L446Pl313L121l566j007N492l770O20L421
948A769m466K557K305k547M045k302k696N802l013k391L379m194N00J938l808
963c122K977j436m698O829K63l037L633k659N98L482k507L194L83p059L958J900
$$ y = [-2757, 1244, 4132, -2241, 834, 1938, -1785, 2532, -156, -1711, 2272, -2794, -1083, 4019, -1797, -1347, 870, -2813, 1654, 1107, -1582, 3316, -572, -2262, 3342, -551, -1476, 856, -3092, -41, 805, -3177, 1940, 570, -2724, 3262, 663, -870, 2647, -935, 819, 3612, -2197, 555, 1290, -3775, 758, -360, -3248, 610, -2859, -1914, 3186, -1308, -150, 2306, -2200, 1746, 2964, -324, 3388, 501, -2057, 3083, -167, -1349, 1473, -3934, -1806, 465, -3643, 371, 129, -3381, 1949, 563, -784, 3289, -545, 332, 4484, -412, 1810, 2802, -2682, 764, 771, -2542, 579, -2987, -3994, 1498, -2272, -1652, 1769, -2697, -140, 2165, -382, 3663, 1361, -1335, 4467, 1454, -937, 2442, -1752, -1252, 686, -3122, -145, -1581, -6279, 550, 813, -2224, 1409, -1250, -652, 2830, 323, 3517, 3900, -3159, 799, 2699]
979B699m068K551k147j600K373l571K004M123o262J939L981l350K291l16j172
994e25M397m231q81N137n339j201M640k344K87o17l098N026k323k589O458k389
1010D08l583M148r40J037j4l608M668l61n699N246M23m452L044q69M47J154n255
1027d206M296L135o403K922K496l920J281m72P35K751o097J265N517n583K71M236
1043B224l206R31j378j23M905m601j978P264l985k720L929j682P45j450k215N440
1059B100k462m927P090n33m178K613m82J809k19m003N964O28o823M324K049m597
1075a647Q98p11J215J268n875L457M104o867J832M309l323Q61p59J471L981n908
1091a694Q09O180n608j790L431j995J92k000r08N749m432k683P027k454k886L264
$$ y = [2699, -1369, 1182, -965, -2565, -192, -3763, -1759, 2364, -3898, -1959, 2022, -1328, 963, 647, -525, 3872, -359, -1240, 3897, -1442, -2643, 1997, -347, -60, -677, -3775, 1251, -1072, -3661, 2797, 408, -3175, 973, 33, 1070, 1056, -2552, 2116, 1755, -3944, 1302, 1725, -2727, 317, -552, -105, 1049, -4206, 90, 3225, -3178, -256, 2240, -1680, -399, -871, -136, 2615, -3482, -2217, 3300, -2283, -2012, 2224, -982, -51, -1429, -1552, 3353, -1248, -3226, 4038, 53, -2667, 1262, -420, 325, -1125, -3340, 2100, -362, -5289, 1801, 1268, -2910, -297, -779, 1030, 811, -3192, 2772, 3400, -3423, 901, 2950, -1647, -749, -1460, -245, 1023, -4852, -1395, 2709, -4158, -2326, 1983, -1340, -479, -1238, 233, 4214, -1694, -885, 5295, -313, -2103, 1328, -667, -475, -2475, -3383, 2366, -2066, -4749, 2278, -176, -3062, 202]
1107B02n5J504o45k860O064j583n998N507J60m703J507j164K328L40n556N140
1123A88J944o403L373K929k973J136r49K234K035n971K470M279o437O45L147k339
1139f92M39j961O37M690n294p65O059m283j096L115n44Q50j603j507N615k823
1155H37m016N806j866k578K279j189K054n20m209N610m85n899M644P02k735J889
1171C24j306J746J525n488L725K996o018K177K230k204J723k086N39L330n752
1186b539J039M369m488K15K383j683J833j875o00M494m113j530N181k785o73K076
1202A304j755K355p93l171M631j590l870M629r03j751K023k179J527P34m404L897
1218F84N66l971L085N85j389K540k787J401K568m698K107K354m457J751P29k588
$$ y = [202, 147, 1651, 1006, -1854, 4210, 2627, -3371, 2136, 2296, -2407, -900, -2064, 264, 604, -4952, 188, 2132, -4271, -898, 2031, -942, 194, -755, 1479, 3514, -2457, 13, 4292, -2145, -1500, 1647, -692, -253, -2214, -1577, 3113, -2181, -2946, 3113, -1170, -2266, 849, 305, 1155, -448, -1955, 3660, 837, -3179, 2627, 761, -1817, 462, -727, 1327, 807, -3402, 2208, 1723, -4176, 468, 1170, -1565, 324, -982, 764, 2289, -3199, 526, 3522, -2496, -319, 1911, -293, 1430, -656, -117, 3213, -2539, -1500, 2869, -1619, -1404, 979, -704, 1129, -746, -1346, 3148, -965, -2495, 2686, -99, -772, 1304, -451, 1904, 1111, -2060, 2571, 981, -2889, 1740, 837, -914, 1109, -1070, 457, 1191, -3213, 684, 1250, -2721, 364, 949, -440, 2100, -687, 714, 3282, -1416, 691, 3045, -1412, 339, 1068, -1520]
1234a520K579k389r28L659l527k15M000k872J018J715k152L167j024k132L971
1249C350k342k175L631k570k27J005l277K253Rl256L521m5k262L484p72n33K896
1266B690k738J235K137l914K206N11l446K489j196j250K441l518j29L262k912
1281b132Q75K497l621K672J082j678L360k179k037L831k064l26K350l721P48O92
1297C49l224L200l93l535L389p12m70K994k623P80K300k820K460J507l910J782
1313A074j74j457K614k767q56K471l463J002K846l399J479R82k071L266j165j653
1329a271L879k093o80K437k547P4J622k651K404r44l495L546j54j574L216k367
1345e98r90J767j750K871J057l975J867O53k384L237q20j923J769k547J432K716
$$ y = [-1520, 1059, -1330, -2258, 1401, -2126, -2341, 1659, -1213, -195, 1520, -632, 2535, 1511, -621, 3350, 1008, -1167, 2464, -106, -333, 672, -2605, -352, -343, -3599, -78, -123, -2385, 1099, 327, -206, 2690, -48, 1187, 3324, -590, 1616, 2127, -1319, 1170, -26, -1276, 1165, -2353, -2482, 780, -2132, -1257, 1240, -2381, 291, 1373, -305, 3055, 876, -1161, 2670, 606, 280, 2630, -1091, -343, 349, -2875, 325, -68, -3603, -214, -926, -1396, 1598, -1025, -245, 2055, -765, 1695, 3202, -708, 1074, 900, -557, 2057, -710, -1566, 905, -2558, -1556, 1290, -2109, -630, 352, -1719, 1547, 382, -1271, 2608, 515, -165, 2272, -275, -201, 1421, -1230, 1174, 230, -3265, 281, 127, -1447, 1769, -598, -1588, 179, -1571, 1300, 2357, -1618, 249, 902, -1482, 1755, 935, -988, 781, -1766, -334, 2382]
1361B382l912R84J284k549K317L66k030K109k029J7L756l016m23K015k459J279
1377I1J143k386K439j634j929L784j471r86K551k185lJ527k599K727L48l110K687
1394I94o46k157K801j058k65J959l285J070J658k468K298P89k814J789n82r14
1410h31K974k377l20J801k782J272J940k882J278j92k066L050j137p85K948k565
1426f74j58K774k265J201N75k629K019n9k153K586j878j453K679k095R74J741
1442A185k981J553Q63j828L281l95k211J923j672r6K746k369k0P91k899J965P37
1459E73k111K295j169j590L265j054k85J730k531J164J204k553K396j88k552K366
1475I60m51j511K220k025M3K354l391J468J322k295J273M97j796K019j412k09
$$ y = [2382, -1530, -546, 738, -1811, 506, 872, -1158, 951, -1078, -1061, 2695, -321, -744, 1271, -1188, 91, 1234, -1152, 1287, -347, -2276, 1508, 37, -949, 1602, -583, -586, 941, -1658, 1069, 1417, -1693, 994, 348, -1809, 992, -66, -331, 1628, -1657, -587, 1071, -1397, 901, 1690, -1124, 665, 83, -831, 2143, -234, -554, 1247, -1535, -263, 1677, -1205, 73, -119, -2185, 865, -272, -1057, 1891, -674, -832, 1942, -323, 878, 1453, -1176, 843, 784, -1369, 1217, -661, -2114, 565, -1530, -556, 1185, -1796, -243, 620, -1208, 2073, 1678, -533, 1390, -282, -378, 2368, -1, -21, 770, -2129, -164, 573, -1538, 757, -412, -2002, 1263, 209, -76, 1654, -877, 287, 1491, -1062, 1334, 1146, -1406, 960, 509, -1002, 1218, -807, -764, 1590, -1801, -333, 989, -1306, -33, 464, -1332, 687, -725, -934]
1491i34L155k861o3K656k284Q79R89j982J620r19j751K893j982j148K363k256
1507a625Q5J877j812J980j47k096L619m11k066K372q24l57J009k118J369M55m091
1524b781K413R57k879J762l47m36J723j666J221K319k937J056K339k510P25M40
1540A399j098J146k154p08L000l117l83K551j828N3Q77r38K634j376j516L973
1556B515j595j724K867r83n17K87j815J961l58l144L046J13k811J832k3j49P17
1573B19j812K247J040l230K097J560k230P77L20o71J215k517M94K666l628J29
1589a324K343k137M69K02n09K060k534O0L965k915q47L013j286j4L25r71K226
1606B126j747k505L603j045k467K031k51n21L71j371K679K78l091K916P97k542
$$ y = [-934, 2221, -640, -703, 1953, -331, 548, 1537, -445, 1175, 256, -1495, 1398, -584, -1732, 631, -1625, -1540, 337, -1475, 505, 358, -1738, 1881, 1470, -596, 1776, 952, 595, 1604, -514, 855, 1310, -2781, -368, 589, -2290, -528, -875, -1311, 412, -1254, -33, 2286, -651, 405, 2744, 234, 959, 1399, 301, 1447, -707, -1415, 1585, -1532, -1915, 636, -1192, -1139, -262, -1200, 1434, 58, -1458, 2515, 920, -804, 2063, 1080, 563, 850, -965, 996, 638, -2506, 540, 653, -2158, -326, -349, -498, 219, -1593, 654, 1694, -1536, 561, 2121, -109, 668, 988, 317, 1532, -985, -491, 2175, -1453, -1324, 1019, -1118, -649, -447, -956, 1104, -1430, -1370, 2595, -320, -1167, 1846, 560, 546, 871, -100, 2126, 379, -2126, 1477, 432, -2035, -4, -255, -776, -405, -1776, 903, 1181, -1910, 1006, 1803, -739]
1622g39J630k42J6N86k300J462J551m111J366J907k018L54K25k00J612k505N62
1639h44K993k602l03K519j815L51j8p87K188k178j145L444j809j357K425j310
1655b48L06k41j014K224m37k598L082m95k072J819o98M07O32k279K133R30l108
1672a657K160P48k036R65l77M95O30k246Q25J991l110R78J570j752N69j32j3J803
1690A411k116o5K659k395k41K004j609N63n81n54J964j370j374K711j123j046
1706a162J617r31M96L87j521K122k16k169K145k23j308J403q58L92P08k380J787
1723B89P23k286J177O86j377J471r07l16J502k013L91K186k476N24J334j601R82
1740B89j29j177K256j508o69K586j476l74J200j678P72L07j492J748r40j392K315
$$ y = [-739, 891, 649, 665, 1251, -1049, 413, 1964, -2147, -781, 1126, -892, -538, -313, -513, 1099, -1406, -844, 2149, -453, -756, 1763, -52, 299, 281, -506, 1682, -496, -1641, 1803, -6, -1363, 1062, -248, 58, -183, -1197, 1027, 590, -2008, 1074, 579, -1493, 326, -372, 35, 667, -1612, 521, 1451, -1657, 503, 1251, -785, 180, -197, 298, 928, -1318, -493, 1498, -1612, -634, 936, -816, -247, -379, -392, 1411, -705, -770, 1889, -506, -747, 1257, -352, 211, -370, -924, 1040, -330, -1704, 1007, -116, -1162, 455, -476, 20, 407, -1114, 1008, 792, -1377, 768, 545, -763, 640, -218, 174, 882, -1498, 289, 1012, -1274, -97, 589, -788, 683, -224, -540, 962, -1051, -660, 1526, -950, -426, 908, -693, 289, 160, -1017, 1239, -269, -938, 1648, 172, -202, 998, -680, 92, 399, -1093, 655, -285, -1677, 638]
1757F38o70q76J440j161Q01R77k142J745L94j878J902r5j975J550j412K32J078
1774E48k020O74R38j794J429L76j339J638m61l51K113j247o34J878j643L35N71
1791A011j878R94l77j494K085r95j193J800j015O84J127j289J246K73j519J864
1807A324l9j432J679j438l17J370k023L53J206k368J001O30j316J149K12j122
1823a131K368j212j04J706j579N35J014j900J149k50j741J655m84j803K046j089
1839h20n52J986j996J100O11j467K097P7j608J720k21p54J322j627N45P00k250
1856a137R36O54j848R97J78j309J512q04J0J755j155J18J751j858R03R80j751
1873f8J136o63j306J707j492l86J680j714r1J124j116J461J9j300J870j29j055
$$ y = [638, -32, -908, 532, -629, 172, 1149, -993, 752, 1146, -732, 1170, 1075, -900, 650, -762, -530, 548, -1472, -798, 140, -1654, -225, 151, -1188, 450, -11, -362, 1751, 504, -130, 1748, 105, 440, 1011, -867, 127, -250, -1744, 341, -654, -1847, -47, -1062, -378, 749, -540, 706, 979, -540, 1324, 1285, -147, 1532, 94, -223, 1147, -876, -523, 683, -1685, -684, -54, -1370, -221, -9, -1131, 1237, 25, -79, 1627, 48, 583, 1597, -303, 846, 596, -1145, 510, 26, -1777, 269, -820, -1372, 614, -1382, -282, 329, -1138, 959, 1036, -572, 1148, 927, 173, 1495, -132, 413, 1113, -1137, -201, 453, -1395, -398, -220, -1529, -17, -821, -811, 944, -211, -93, 1658, -200, 703, 1683, -68, 1068, 405, -901, 806, -686, -1072, 608, -1106, -1197, -73, -1189, 272, 291, -1009, 861, 732, -323]
1890c23J690r44p53J366j546J035K39j738J050N2j501J438j4j039J954j582N57
1907e9J353j811O62R65j951J397j98p86R38p54k50J439j791Q7J865j848P87O62
1925G07j309Q00O0j100K121j572n26J431j236N71J080k244J293L75j507J948k02
1942F90j508J834j091l21J691j723N63L78j530J334L07j659J427o08r70J855j064
1959c95j13J583j854P86J038j729J373J03j357J365l68r25J057j236K28J211k050
1976a283J162P52j663J375Mj250J709r09n70J729j327j65J569j367M42N97j538
1993g33J228o37r24K024j209r52J510j029l7J526j414R95l9j400J975k9j117J500
2011A238p86r27J024j286J217J89k065J023L76j478J644l0j051J344j362O77J489
$$ y = [-323, 1367, 423, -330, 1036, -510, 525, 764, -974, 76, 128, -1373, 65, 51, -988, 966, -616, -59, 1294, -517, 145, 1110, -841, 556, 358, -428, 510, -244, -494, 945, -846, -759, 1106, -742, 45, 707, -602, 198, 258, -842, 1279, -293, -819, 612, -624, -53, 1027, -1217, 76, 451, -1056, 892, 690, -818, 1016, -75, -396, 1295, -428, 135, 513, -1017, 317, 624, -1035, 392, -216, -1186, 669, -395, -508, 1075, -779, 7, 1045, -684, 689, 792, -565, 800, 432, -493, 564, -672, -444, 767, -1283, -121, 631, -1032, 343, 347, -903, 806, -103, -673, 1056, -271, -436, 1133, -234, 208, 805, -733, 495, -142, -1066, 958, -251, -1203, 307, -722, -759, 767, -647, 348, 309, -1091, 884, 855, -262, 1238, 452, -475, 549, -737, 480, 669, -1396, -373, 3, -1475, 169, 139, -912, 432, -930, -253, 1236]
2028A236j401P26Q98k051J072K85j411R46p87m54J835j654j81J685j770N40J052
2045E66j060J123p84r34K575r89q88J367r48N4O88j293J084j03j681J803l53j811
2063a584J738n22k88Q48r38P71L96j493J653N61j862J189J7p46J522j284K7P71
2081G76k120J280J006j769M37M42q78J070j047L99J468j934M50J846j309j09R54
2098I62j259J346o37j109J847j198j010J841r32n78P43j320J049K01j065J834
2114G15j30j593J447K01n30R05j174R14J51k101J125R72k316J015P63j210R33
2131H7r85K87J549j703K07J693j628P57K33p93J265j042m38J696j574o15K034
2148A030j490K4K76q92J404m40j059J707n76j062K123q43r3N28j029J218K54k078
$$ y = [1236, -165, 561, 1459, -592, 480, 765, -646, 300, -487, -941, 894, -760, -941, 744, -1026, -486, 566, -494, 629, -155, -1089, 1486, 497, -391, 976, 28, 82, 770, -523, 561, 458, -1223, 580, 227, -1584, 154, -368, -656, 192, -746, 25, 421, -1072, 581, 1142, -720, 469, 486, -260, 1262, -22, 5, 776, -1344, -64, 942, -827, -390, 52, -826, 244, -803, -404, 1064, -870, -420, 1426, 117, 8, 962, -297, 1049, 412, -697, 1150, -48, -1058, 783, -149, -727, 16, -1304, -255, -54, -1119, 715, 585, -1008, 439, 640, 110, 1015, -159, 755, 906, -1195, -70, 902, -1414, -399, 364, -846, 87, -898, -611, 938, -765, -558, 1135, -493, 264, 497, -296, 969, -73, -511, 1185, -389, -1004, 1030, -460, -436, -160, -1052, 352, -88, -1147, 560, -16, -1078, 1045, 202, 109, 637, -392, 826, 1080, -998]
2166i98J866l38j751J770o07m13O71p18K90J157k249J273R60j787J198R1o70Q81
2184F26r31L86J271j891K14J076j210K88N99j194J285q91n67J871j236o26J884
2201I54j246J0Q15j079J136j72r72J191j83j280J340n48k64P57j365J201O2j658
2219a301J708K03j541J299q4q03R28p80M63Q14j666P82Q57j576Q06j73o51J402
2237F87j080k74J496j394q7J226j368J074r8q34J367q27q25J831q47p51J692j232
2255b44L04N51r89P98m3j210J403k75j085J411q69p4R76j273K31J036j355Q59
2273A52N88j270J031k52q56K058j727nJ179j701Q85L49j280R20j51j007J560o31
2291a58p18J683j176K44R15j260P04J56n59P24m43q82J525q61k78R30j022K05
$$ y = [-998, 868, 530, -1221, 549, -58, -471, 200, -518, -228, 929, -1320, -47, 913, -874, 324, 415, -255, 626, -305, 81, 1352, -539, -325, 751, -459, -171, 428, -766, 519, -372, -939, 932, -304, -930, 954, -292, -282, 533, -546, 590, 418, -554, 637, 454, -826, 514, -34, -298, 459, -906, 295, 357, -1301, 407, 610, -931, 368, 284, -519, 409, -371, 92, 906, -760, 22, 879, -697, 109, -64, -715, 687, -393, -667, 829, -565, -652, 574, -794, 280, 182, -652, 715, -112, -937, 894, 47, -704, 988, -244, 60, 611, -378, 420, 377, -833, 570, 295, -790, 621, -248, -322, 654, -619, -388, 648, -707, 152, 740, -530, 501, 249, -607, 1451, -276, -281, 898, -803, 82, 431, -849, 71, -80, -1087, 473, -158, -876, 807, -369, -125, 790, -470, 234, 390, -169, 555, 112, -770, 755, -106, -384, 546, -476, -271]
2309b71P94j431P66P68j397Q82No23R02o06k94J358j355K79J289j595Q83J15j084
2328f15J183j58j088J331q44m24R94j125O54N51j053Q34k67o52J205k80p79J304
2346G71o26j60J034j503Q60L72j397P53l2j189J389o49k19R96j077N26P95j201
2364e57J000O28j500J044p9q90J245j012l18J250j493K19J037j403P16J80j126
2381a059J334o06o32J775q33j74J336j163K81N98j503J580j88j749J382l11r40
2398h72J068q27R0P51j005Q07M12j236Q96K83m83J027p67k09J010j132K02J153
2416A168j994O54N01r51Q38k37j071J057m09r3J051p15j35J042o92P46k45r22
2434d07J126k61r77J182q60m94J161j325N36O44j323P44K28r22J346n8n86J142
$$ y = [-271, 523, -908, -142, 626, -771, 111, 116, -507, 395, -211, -505, 853, -502, -223, 1066, -529, 354, 469, -615, 568, 410, -678, 653, -191, -615, 379, -746, -92, 459, -594, 240, -27, -679, 526, 246, -533, 771, 145, -15, 1019, -484, 376, 748, -649, 104, 72, -1117, 272, -377, -596, 400, -677, -151, 644, -557, 443, 1071, -429, 615, 536, -354, 891, -121, -439, 811, -682, -463, 574, -829, -113, 67, -1059, 275, -331, -963, 812, -21, -195, 1141, -22, 259, 857, -646, 934, 746, -1003, 379, 68, -872, 196, -631, -541, 210, -795, 12, 424, -812, 84, 367, -116, 911, 144, -65, 945, -187, 15, 1168, -826, -172, 329, -622, 216, -21, -1092, -35, -444, -537, 514, -201, -336, 706, 14, 760, 515, -407, 719, 458, -519, 663, -197, -691, 470, -855, -319, 325, -998, -254, -26, -948, 398, 340, -246, 896]
2452H96r72K71Q21j305O24M38j316O79L38j339P99j34o95J245q40j80J015q75
2470e30N86L98p27R00j30n25R87p76n37J000r70j37R80r86J41N69q31R41l28p82
2490g57Q56l87R7Q17r34L67O6q36R35M57j345J098l06q76J452p09m78Q82j009
2509f10M43O57j248Q00L15r98J281l03p96R72p62j18R67j029M13M17j057N31N82
2528D57r72R14l92o92R80p16J31R41j283O62O07j167P98l52l55J003n92m33J200
2547G39q05k20Q95q62Q7M29j176J459m46p14J386q84l79P96p75L71Q37j160Q09
2566C87j5r11P30Lk96N72p35J81N38r20L23O25j114O16N33q24L83k59l27J182
2586F72j145K7J348j035m4O41o84N58J4o56R93o21p31J216m61p45J221p72K34
$$ y = [896, -76, 195, 1016, -289, 335, 773, -543, 136, 474, -865, -66, -200, -895, 350, -490, -670, 345, -530, 56, 454, -273, 627, 497, -28, 959, 183, -354, 646, -324, -461, 519, -467, -326, 243, -588, 353, 25, -757, 99, -288, -191, 626, -308, 59, 125, -711, 224, 681, -664, 434, 128, -748, 704, -5, -483, 399, -610, -167, 490, -758, 42, 357, -641, 640, 337, -459, 513, -249, -367, 600, -429, -16, 401, -656, -125, 457, -515, 399, 7, -685, 295, -421, -290, 651, -632, 30, 637, -530, 268, -84, -439, 564, -28, -461, 739, -66, -286, 609, -253, -166, 263, -913, 546, 100, -614, 772, -112, -491, 305, -470, -99, 738, -422, 387, 372, -539, 191, 194, -102, 470, -265, -84, 454, -466, -143, 482, -632, -16, 517, -307, 76, -183, -510, 672, -473, -446, 902, -133, -177, 464, -220, 338, 352, -304, 689, 68, -663, 553, 92, -653, 568, -204, 30]
2605C0K87j011R70j45p67J212n0q59P90k92J14K90r86R43J44j363R79l71o28Q48
2625A35m58j4O10j070O56P56j307P08M96n62N20m67m06J140j042K8R57r16J4N97
2645C75r11N58j30m60J004o51m44J396q24k28Q26q00N57K44q02J017k22j196J350
2664F59k05j322R89l91K7P9q19R82K19j094J002L30o08N46m21P6J014j343M14
2683A34Q30j311L54N19j221P24l4o05J009j035l08J592r92j74J090n51M51r2p84
2702d04J027k46m39R41p19m66M16l88J98P5j048R48J82j017J220k24j79P37o47
2721c3M76O52j541R86k0j045N36J39l50O38m25p89R60q96K04J203j419N88P38
2740F02j230J241j95m72P01o70j40R56r45J71K91r41P22j48q31J026j84p28R88
$$ y = [30, 317, -694, 276, 131, -636, 576, 526, -333, 457, 165, 279, 569, -417, 526, 670, -693, 286, -85, -713, 135, -323, -337, 273, -797, -141, 615, -692, 16, 512, -50, 470, 3, -403, 737, -305, -277, 680, -236, -222, 375, -536, 22, -108, -568, 436, -215, -659, 737, -87, -315, 511, -289, 268, 512, -290, 727, 505, -691, 659, 454, -868, 121, -270, -243, -164, -983, -1, 218, -876, 126, 456, -152, 394, -27, 49, 1063, -280, 134, 964, -347, 7, 526, -695, 29, -5, -610, 399, -636, -944, 648, -344, -518, 572, 21, 472, 380, -404, 623, 377, -62, 879, 160, -306, 110, -278, -80, -5, -1053, -105, 77, -940, 280, 56, -123, 614, -33, 443, 1095, -446, 540, 520, -525, 11, 150, -200, 438, 13, -776, 184, -712, -508, 695, -724, -136, 602, -628, 613, 418, -54, 647, -23, -163, 793, -152, 19, 310, -631, 91, -57, -888, 138, -46, -774, 214]
2759B14k58l08R14p16K74M56p28N80j08j011Q86Jn94O62o61P2O46j053O71L31
2779B70p83N48l81j73J002n70j68P86p17K9P35o35J24L00o45Q21n85m84J085r35
2799c76k31R88p37P2P30p31K79L68r33N83K18o59P62m96j16R07r66L5Q05r13M38
2820B7J67m96N92j82n88P17k38n42J000q65L26J57n77Q56J8p12P87m87k92J018
2840F86p54j73O64p94M93L42r45M77M03j064J461j008l10J014j041J96R22q31
2858b62J72O57p15P62m09k47N46n20jK90q19L72N07r30M54j7m86O82j37m90Q81
2879B90l56j61P33o85N10M5l93M39r0q42J087o81n27O61o28P1N53m57N35K97j121
2900g20P93K36m43L92N0j25K09m89J23O07q95K92L81j047O44l27l33Q84l81l41
$$ y = [214, -44, -352, 562, -154, 120, 576, -152, 428, 320, -691, 195, 196, -398, 264, -397, -325, 321, -732, -61, 270, -513, 35, -346, -519, 483, -87, -255, 531, -186, -157, 578, -57, 67, 367, -278, 543, -42, -526, 559, -376, -607, 381, -356, -284, 446, -285, -6, 362, -571, 12, 230, -429, 333, -163, -279, 628, -338, -303, 502, -411, 27, 194, -302, 290, 108, -480, 237, -1, -543, 457, -408, -82, 75, -502, 354, 372, -340, 447, -40, -332, 686, -68, -241, 423, -371, 122, 464, -481, -4, 399, -665, 796, -212, -522, 492, -549, -353, 569, -262, -90, 567, -148, 614, 205, -42, 504, -16, -17, 273, -546, -174, 333, -597, -143, -160, -646, 36, -101, -591, 290, -66, -227, 506, -179, 331, 376, -17, 422, 332, -510, 577, -104, -631, 30, -598, -527, 26, -431, 104, 401, -720, 73, 309, -134, 258, 308, 183, 392, -97, 26, 633, -262, 30, 411, -636, 8, -319, -652, 232, -149, -490]
2920d90R05p58R3Q38o34K09J50o05J006k08j041J161r47O5N35o69K35L39o24L15
2940a25J17m67J003n66n34J257m20j0L17p35M35K17j042O59p3o73Q46l41k56P73
2960C82p11k1P07p04K66N37n64K16K46o87Q90m92m24R58p93K8N77o84P5K35o41
2981f04O90j05m87R85o91j06Q09m59j25M68l21J00L87q33O64k30k28J71J07l95
3001b03O26o04J78P5k69K34L74q45O00j8n58P43m60J99N52q52L81M74r05O62J06
3022D90p63M92n78L6L98n86L53L08o92O63L59r16O11n1n54R73l22m73N32m24n6
3043b00N52o11L01N3l66M68k70o15J084k88m89P73l86O0K23m75L58K35q63P25
3063B69R1p38P37n11r2O17q96R2P43n78M19J47o11N38j91j90R13r01m4O13p21
$$ y = [-490, 415, -343, -250, 588, -46, 163, 313, -292, 714, 506, -535, 626, -321, -256, 279, -390, -155, 184, -440, -125, -8, -475, 528, -38, -572, 685, 265, 255, 572, -163, 272, 489, -553, 106, 33, -640, 206, -135, -391, 382, -329, -350, 357, -347, -81, 456, -108, 108, 354, -333, 557, 65, -359, 599, -194, -166, 411, -273, -198, 37, -604, 86, -19, -506, 479, -212, -318, 491, 32, -93, 375, 54, 154, 541, -292, 372, 142, -86, 85, 192, -203, 423, -181, -3, 72, -197, 37, 411, -434, 166, 148, -410, 333, -127, 72, 624, -228, 153, 627, -278, 384, 490, -273, 219, -359, -323, 75, -511, -158, 150, -542, 121, 480, -436, 175, 124, -430, 543, 221, -252, 280, -144, -200, 352, -259, 42, 95, -271, 197, -73, -688, 396, 108, -381, 392, 6, 66, 289, -186, 172, 407, -456, 269, 360, -378, 359, -152, -244, 373, -523, -431, 312, -266, 153, 300, -311, 227, 36, -154, 759, -142, -186, 427, -294]
3084b94K31N30o96N45j73k74M09n60j26L54l28J04O61m47j49L78k09M87l52l62
3104b71Q20m32m33P34n85L45o6m77M73N3m52M26j68n93P47rk23K60k71Q1N31r18
3126d28M23M03l92J22p6n7K09n31P5L90m96J28Q47j108K60J69K0M45l48l44P45
3147D56m32k09N69o79M19J49p40Q95l81n53R18m38m07O49m57j24M18k91L28J9
3167A09p93R31p6m70P04k17L4K24m92kQ42j337O10J42n30L92k78j94O80n87QJ074
3189G74j080Q3O96n77J40K43q2L16k80m22Q55q32o1N32p14M94L6q23P09N7q36
3210g72J194o04p4O62n99M27M7m79J19L26r04Q57O6o22N10j92K1L46p56qQ77q67
3232d25M89J34l72N09m76K20O54r37P6P69q84J41N39o86N30m1m22N48l51l72P26
$$ y = [-294, -63, 467, -229, 316, 143, -131, 278, -282, -408, -54, -382, -278, 383, -64, -213, 165, -44, 443, 91, -271, 549, 117, -316, 418, -167, 178, 112, -365, 108, 161, -291, 135, -33, -626, 121, 112, -111, 149, -122, -41, 490, -428, -5, 398, 6, 128, 52, -5, 204, -327, -252, 138, -358, -230, 617, -491, -231, -62, -42, 403, 55, -289, 456, 24, -185, 384, -295, 124, 273, -467, 428, 47, -506, 412, -26, -433, 216, -241, -365, 53, -238, 90, 109, -684, 247, 171, -299, 405, 188, 222, 446, -46, -48, 794, -543, 67, 209, -321, 71, -207, -401, 279, -308, -300, 774, -306, -223, 473, -104, 36, 279, 197, 513, 233, -189, 666, -166, -227, 305, -409, 85, 121, -702, 7, 64, -772, 422, -182, -256, 406, -193, 234, 281, -198, -79, 247, -657, 200, 266, -356, 154, -38, -17, 329, -427, -435, 442, -425, 64, 198, -174, 335, -141, 79, 733, -204, -128, 641, -243, -102, 437, -249, 281, 240, -182, 366, 15, -357, 369]
3253C69k21m19L99l09OM44n55M73J13o14P60j91k54K43l38j20N85o44K39L02j108
3274h40Q43K03m40O22k44k02K82n02N05L36r43M18L92n21N29j98p78O83k23j78
3294b56O05p39J56N61o36L08K2n01O23L1m98O83l39j62P20n94J05K18n16M79j11
3315A59o05P24l7o53N06l52J87O71r26L67J95l93K76N04p13K85j69j78P45p84
3335a91K49K58q70N39K79r00O31rk91N25j25l38L99k65J85L16o65N34Q8o55O36
3356C30l71m68N36j82l04Q27n32J07J32m33K72J84k50M79l12j58L97j45k59M05
3376B55l69M5N22o11K80k29k10N50k09l01J30J35j72O7k11P0K46k09N71j15n34
3397b99O28p8n03O42n29j49N73n85L17Q5o35Q57j10n59O69l14k87O38n01m0O11
$$ y = [369, 148, -271, 128, -181, -175, 269, -286, 187, 300, -314, 446, 255, 1, 244, -94, -214, 371, -273, -34, 268, -840, 3, 206, -234, 388, 144, -58, 224, -278, 227, 563, -380, 38, 430, -91, 438, 240, -538, 145, -78, -256, 349, -390, -234, 327, -309, -1, 21, -480, 143, 174, -324, 359, 20, -142, 578, -16, 89, 307, -209, 270, 159, -446, 278, 241, -412, 94, -258, -71, 600, -326, 41, 236, -157, 119, 623, -90, 195, 26, -152, 593, -191, 58, 316, -554, -15, 264, -636, -5, -14, -305, 220, 95, -243, 156, -109, 76, 392, -273, 261, 349, -306, 330, -41, -509, 27, -155, -459, 368, -164, -57, 75, -358, -86, 98, -152, 327, 15, -143, 254, 109, -150, 255, -114, -69, 453, -158, 122, -107, -317, 233, 24, -277, -147, -12, -184, -117, -328, -258, -12, -221, 350, 235, -299, 329, 251, -252, 390, -139, -288, 285, -300, 17, 102, -533, 324, 214, -345, 324, 10, -277, 361, -140, -180, 431]
3418D31m92J43J76o17R52m10n16O51l80j15K82l28j13N87p37M14l3j92P33n18
3438h2l11O64l62P6J91l01n2L64k00K61P0n34M47l19m64Q27o51K25K94o41N02
3459DL79l90N5K35k87J96L2n08N47n04K52J76m61K85K32p81O48l59k43O76j83
3480Ao6K35j16L5N82n91K12j56k09M11k83j26M71o42j0M25o18M91M62n74%K54
3502A88o17P45K6o67O91o37J09L96m19K5L05l55N52p7n62O41n15l07Q08k99J48
3523A79p0j76J22M02p26M07L7j40N82o34m26J010m29m77Q83n60j35J59l30N26
3543B04l15k84L17J77k74L48p28N44N04r72O70j39k38N34j74o46O97k2k65J92
3563A30m87K83J20k79K23K73o38M79n3l94Q94m46j17M29k98k80L58l56K85j33
$$ y = [431, -61, 82, 258, -359, 593, 183, -333, 318, -62, -177, 105, -223, -336, 251, -486, -72, -105, -297, 436, -82, -393, 271, -91, -15, 176, -125, -177, 187, -13, 248, 318, -216, 231, -88, -552, 275, -376, -151, 143, -498, 4, 383, -7, 48, 283, -4, 192, 224, -284, 263, -241, 11, 187, -274, 11, 243, -538, 110, -249, -492, 184, 1, -65, 170, 54, 89, 671, 80, 292, 136, -73, 338, 55, -71, 400, -242, -252, 173, -445, 46, 508, -66, -66, 188, -429, 316, 342, -325, 366, -271, -162, 234, -185, -160, 145, -210, 342, 265, -297, 344, -171, -478, 330, 31, 179, 109, -67, 55, 457, -269, 138, 175, 35, 617, -17, -443, 567, 138, -339, 544, -16, -151, 8, -322, 204, -111, -395, -78, 99, -175, 173, -555, -11, 493, -479, 191, 52, -186, 348, 174, -472, 225, 203, -62, 130, -357, -74, 46, -233, -10, 263, -375, 104, 51, -343, 551, 105, -12, 417, 119, -161, 197, -159, 126, -7]
3583gJ35L17p57M3L76m66L10K51o34M69J77k61L83p6n15O24l97k50L36k18L58
3604A98J48n96L96K31p55O49k26n08L79K19l35L96m66L83K18l47j7N06o99M18
3624A92J19l20J89k32P5J92l57N1J22k84K74K25m32L24m5q1M72n60q8M08m97L73
3646A20N4m26M38j18m64O77m42k62Q04m64l18P60n20J40L38l55J81K81p03N39
3666B60M06o62K34l70J94K28q92L38L97n17N29L4m72M61l54J09M43l76K69K15
3686D74p00J86L40l83M71m67R9K38l30J36L9L9l39K37j54J38k4k67K82j04Q8K06
3708B05j45j46J82p9p9k3k01M78m4k69K01j16J0K84l62J05L5j44k2J44k90N09
3730B33j48k75J47j83L03K95o97L72J15j45J35n4j71J03p6o1M86n19j2L58j48
$$ y = [-7, 128, 445, -312, -269, 107, -359, -49, 202, -432, 37, 214, -47, 336, 260, -255, 369, -28, -278, 58, -160, 198, 346, -250, 146, 377, -378, 271, 45, -463, -84, 135, -200, 196, -270, 113, 331, -16, -33, 473, -226, 192, 311, -9, 180, -52, 23, 215, -142, -91, 31, -253, 21, 246, -186, 138, 93, 12, 484, -76, -164, 244, -253, 120, 174, -252, 186, 68, -396, 281, -161, -423, 381, -83, -401, 359, -161, -21, 317, -38, 143, 424, -279, 260, 666, 4, 238, -132, 62, 290, -602, -264, 133, -384, 145, 179, -293, 168, -186, -77, 366, -10, 259, 474, -226, -40, 300, -83, 388, -79, 20, 258, -72, 64, 103, 142, -197, 40, -114, 24, 0, -267, 15, -89, -1, 205, 60, -86, 96, 17, -62, -85, -286, 192, 148, -121, 80, -36, -26, 258, -104, 1, 36, -108, -130, 14, -276, 233, 85, -190, -43, -226, 77, 372, -325, 47, 162, 17, 152, 98, -73, 30, -46, -107, 379, -140, -152, 206, 58]
3751E8R9k45j13J86j97r8O48j0m91O65q60K37N34p06J62M55p58N46n4l90K96o2
3773i8J06Q1l00k7L09j70K79j76K7K88k15k25M34j50M5k31k12J82Q0l56K16J70
3795E7l09L65j7l74O31m97L96K1k26n9J04R2j08j8m18M63j03k50L02l26Q5M89
3817C00m18J07L80n22L69q2l60N00l10Q8J76k75J39m3l30M92Q6p35O08j55m0K91
3839B66m0m42N61j52l19K80k81K74l6k63K30R9l91K56m9k56N50m22L56j76k10
3860a65J36Q8m19M51J4k3L66l79n2K27l62N37k44n65L38q2j05J34M9k46M21m29
3882c10k2M16j51J7p6j05L01j32k11M82m65K62K97l04K5K31n41K34K59o28M08
3903a3RJ57N3k76m7N65n38k1L98n32L49j18j55K16j65r4L04j33N9J40k31K2j03
$$ y = [58, 157, -88, -201, -15, -212, -310, 338, 328, -163, 502, -358, -121, 413, -293, -131, 324, -434, 112, 58, -332, -36, -98, 8, 89, -211, -238, 71, -99, 180, 4, 31, 319, 104, -121, 313, 163, 208, -23, -235, -53, 27, -329, -113, 57, -252, 113, 96, -278, 353, -144, 252, 273, 47, -12, 92, 184, 76, 58, -360, 103, 0, -250, 52, -274, -189, 300, -118, -11, 369, -153, 216, 134, -226, 274, -36, 52, 228, -47, 92, 49, -281, 211, 297, -438, 170, 15, -25, 266, 226, -216, 345, 193, -126, 154, -127, 147, 111, -152, 78, 177, -214, 42, -7, -263, 287, -135, 221, 45, -165, -29, 59, -360, 91, 105, 82, 448, 69, 17, 244, -118, 419, 175, -390, -52, -134, -239, -105, -56, -302, 119, -310, -332, 84, -67, -50, -126, -231, 70, -62, -273, 209, -256, 6, 303, -1, 24, 255, -286, -52, 207, -421, -13, -4, 153, 206, -70, -117, 448, -90, -111, 287, -245, 104, -14, -169, 47, -118, -212, 92, -41, 18, 158, -73, -51, -154]
3926a54J0K12P3k04J80r8r2J74M5l08K07k08K93L1m53N01o3m15J67J49k84L35
3948I8l99J10K02j05p8L64l17J41L56n84M43J28n19O05n31J66J89l66L2R9k33
3969a99L23o8l69M01l42p3N41l35P0M23n42M98m12L8J62p1k54K29k94J53K17l36
3991b40L50J37l08O3M5R0J20j9k93K19j76M7P2k62M3K19j70K90j64l82K39l14
4013c94K26K51L5k08L10o09M33P9k73N35m80J9L82k74j91N17m27j85N10n11J43
4034a12J64j50K35J1j44J69j05l81M82j33J48j09m73N58M9k60K74j30p8J87m27
4055b25k59O41m56K92K47l63O2%R9K27j01m00J19J06r1N90m12n3L97p03K44K72
4077B33l00L58p2k90L07j64r0K97k10j99J70k6M00k68k31L50l75RK1O1jJ58l88
$$ y = [-154, -144, 68, 141, -63, 117, 19, -73, 101, 146, -162, 45, -163, 130, 161, -292, 209, 146, -269, -102, 47, -237, 98, -301, -191, 11, -94, -172, 192, -125, 16, 372, -212, 231, 359, -160, 445, -86, 80, 269, -97, -65, 34, -199, 124, 56, -313, 88, -254, -327, 214, -121, -51, 372, -170, 328, -84, -46, 116, 45, -209, 20, -274, -121, 96, -240, 110, 247, -61, 2, 47, 137, 257, 238, -55, 164, -12, 35, 107, -155, -112, 107, -63, 227, 63, -319, -80, -394, -168, 83, 118, -90, 220, -389, 44, 123, -150, 385, -95, -76, 306, 32, -159, 358, -69, -254, 256, -255, -112, 52, -98, 137, 148, 4, 173, 68, -313, 169, 36, 184, 75, -398, 160, 209, -51, 223, 93, 15, 202, -225, -484, 157, -299, -7, 240, -123, -61, -61, 38, 265, 164, -236, -117, -11, -102, 488, 76, 23, 420, -283, -39, 233, -67, 291, 219, -71, 236, 72, -18, 279, 69, -130, 40, 14, 414, 146, -85, 265, -110, -101, -80, -19, -20, 138, -250]
4100b50J72K26n34M54l7k53K56N0k40M6K4J10N7k23J28M3k32L69j94k20L26j40
4122f2N6L0k63K04L37l95M02j38l85L43l47M11j12k16P5L95k74r0R6k62M37j2
4144B30j96p6J47n97M99J06l18J39j37o2N28n83K71K49k45J48m9j42M58n78J93
4165a5K66o37L10l3p4K75j4k66J99j2l71Q24n15K52n3n2M8o4j88J27K1o3J78l47
4189b04J52K24j12K0n5m73M13K09j51J24k05J74K85m96o8K46j12J03M7l03J63
4210a9Q6k08O3K1j61J19J00J03R4n12J55M95o11J74M60n29K91j87j87M38n31O0
4232b86L34J45j92Q4k88K07l9j2J78k36J45J73j37K03J28k91P2O0k89K97n13n6
4254c13N09j53l6J11q7O6Q1p34O78K42n90M44k43NJ55k05j00L77m30K54J21l51
$$ y = [-250, -78, 148, -386, 68, 31, -222, 34, 84, -156, -110, -86, 24, 81, -142, -14, 29, -203, 166, -28, -248, 78, -62, -6, 24, -239, -35, 302, -93, 309, 171, -214, 129, -218, 193, 81, -135, -60, 335, 61, -29, 67, -195, 242, 230, 34, -42, 105, -492, 7, 113, -205, -66, -203, -265, 263, -320, -49, 200, -45, 103, 54, -88, 370, -208, -15, 251, -386, -76, -109, -183, 92, 78, -188, 11, -1, -372, 452, -63, 189, 136, 84, 132, 68, -120, 7, 28, -35, 143, -204, -52, 172, 60, 80, 25, -448, -35, 174, 23, 147, -58, 116, 401, -95, -163, 83, -29, 74, 121, -182, -19, 67, -141, -78, -57, -218, -99, 1, 104, 198, -314, -159, 336, -275, -101, 359, -170, 121, -66, -253, 185, -346, -286, 48, 193, 1, 85, -203, 4, -35, -47, 131, -105, 40, 213, 76, 279, 407, 116, 188, 248, -41, 256, -257, -313, 196, 43, 7, 118, 31, 97, 178, -556, 122, 364, -226, 218, -25, -20, 135, -70, -170, 207, -223, 31, 152, -199]
4276a99L82j24l7pl4k76L04p6k6J11l72L84K80m37M06P6p14O71k97L1K36l58j2
4299h8L18l57j59M00l34K35j06j16L13J20l27K83j07M5K76m80J4L49m39M49k11
4320G8j78L88j76k56K81n66L44k7j66L24J52Q6m73K07l42K95M1j06K47o5k55L13
4342A46m33M10r0j18n5N4k7L87k12l78O56l64K99j38k35L85J28n06J48k6m90P93
4364C34k28j68K18k26KJ6j07M13k82q4J58j63k4L40k63K45k06%J30K0m01M62k01
4387a5N0j69k1R9K24j53J27K1l79L41r5k63M87j82j47K28l80N23L6m32J26J2p7
4410c9K07j24l84L23K91m97J60j99k00O47k16Q5K58l87L31k1n25N57l76Q0L66
4431C37m11k40O61n04m3L43r4O0k23q7K22j10n4M91l95N2K19m24K22j27O0L32
$$ y = [-199, 183, 59, 22, 15, -19, -295, 9, -67, -93, 18, -354, 30, 310, -127, 279, 355, -359, 312, 15, 46, 282, -76, -88, 230, -127, -286, 114, -220, 15, -91, -207, 106, 226, -101, 182, 75, 120, 396, -84, -70, 279, -160, 289, 78, -100, 288, 112, -144, 137, -429, -85, -112, -278, 46, 198, 284, -189, 18, -324, -29, 12, -94, 153, 88, -167, 146, -287, 123, 33, -85, -140, -86, -113, 274, 62, -316, 340, -24, 275, 137, -98, 287, 415, -91, 57, 31, -459, 334, 106, -62, 156, -70, -68, -52, -159, 254, -28, -112, 46, -117, -141, 199, -64, 181, -25, -25, 105, 125, -276, 186, -15, 35, -134, -155, -56, 168, 15, 142, 163, -216, 125, 30, -233, 254, 72, -75, 153, -227, 296, 332, -100, 26, 38, -39, 168, 44, -340, -17, 274, -223, -63, -262, -462, 185, -31, 54, 312, -75, 256, 235, -290, 267, -109, -29, 337, -74, -314, 347, -157, -200, 143, 49, 109, -114, -201, 21, -89, -143, 348, -47, 5, 224, -200, 22, -105, -45, 287]
4453B87l55K85l45kN0L85k84k61J93k31K98j57j16L91K2Pj06K1k06Q7J41l77O31
4476C58n25L43P6o68N77j7m41N24m65K70O2j31N17l56j42L29k84O6Q8j71n7K9
4498a8N8n2L85l31k43K46k67qO9RK26m46N61J78j25l43L18m18O8L4k05K96m5l1
4522h4M52n19n9M19m65K19J50l27L92M8l35K70j7L0jp5p0k52J44PR6j59L07j17
4546E4j90J79j16J90rk44j3m1M9o3K83l51K74n8J25J79l27K81j13k51K09K24m92
4569b21K02J91n00L60k61J12K40l6l71O92o86L50P3k42J3J47k54M55k28o8M7l
4591A2L6N7k68R7J54j46L63Jk74j40l5K1L61j12J28K2n08K31K76o09N29r1l06
4614b01J33J59k47K40k47K68j90j92J15J83J76k59O2K0K1K5j02K44l79J32J36
$$ y = [287, -68, 217, -128, -130, -80, 305, 21, -240, -47, -278, 20, -137, -253, 138, 160, 167, 61, 82, -124, -37, 104, -273, 358, -167, 176, 252, -416, 161, 144, -297, 227, -238, 32, 94, -37, 480, 124, -18, 311, 27, 93, 181, 10, -47, -18, 40, -12, 373, 42, -201, 45, -222, -230, -161, -152, 74, -372, 189, 367, 242, -101, 217, -201, -133, -99, -304, -8, -53, -84, 368, -151, -210, 209, -256, -37, 113, -214, 178, 226, -109, 161, 144, 174, 173, 98, 28, -224, -80, -73, 23, -136, 171, 54, -136, 43, -73, 117, 108, -136, -149, -190, -141, -204, 79, -272, 2, -56, 69, 248, -79, 202, 89, -162, 47, 271, -221, -19, 172, -328, 32, -229, -117, 123, 87, -284, 408, -278, 72, 145, -97, -84, 63, -191, 264, 36, -32, 15, 12, 48, 105, -163, -66, 88, -58, 305, 306, 32, -108, -143, -122, 239, 127, 255, 277, -231, 0, 276, -333, 196, 105, -201, -68, 91, -156, 84, -163, 105, -85, -277, -162, 21, 197, -62, 0, 20, 41, 66, -36, 208, -171, -39, 97]
4635I7j04l30L18j55L44Kp%k20J80K37n32K04P7m74K33J30J41k2r1k02M12k41
4658cm7K18j12k51J45l30M23O7l81N47k35N9q8J09l14M21l84J77J72l95J08K86
4680A92j75n3q7k4O2r1L26k03j48L53J16j59K7k00LK09K7m59M58n9K4M2k65n4
4704a38L60l25j65n4M4J82j55K79J19k31j18L08k2Q6j21j05O18n21r3M2P0R1r2
4727E9J2j10J76o22O71m08K6J36k78M43L1J16j56K03m04K85j53n3L23l35P3J45
4749A80j38l04N55m07j18K85j03Q1R2k54O5K21j89L01o8l16J57k19K77O1j72M81
4771D68k25k09k9j54k7O3N0r1K93j60j51M30l74K51J52l21J99j90P1J46k67m2
4793a17j28K38j38J58k42L52k36k39M17k53N3K89l07j3L31j82k06M33j35N5l27
$$ y = [97, -7, -337, -19, -174, 170, 172, 165, 165, -55, 125, 362, -170, 34, 111, -363, -130, 0, 141, 119, 28, -174, 238, -3, -50, 168, 56, -195, -50, -380, 43, 110, -271, 276, 41, 100, 12, 121, -193, 228, -156, 21, 193, -202, -94, 192, 17, -36, -123, -147, -85, -176, 150, -53, -201, 152, 268, 109, 136, -64, -61, 148, 175, -284, 174, 115, 139, 181, -84, -138, 222, -103, -268, -322, -278, -96, -251, 28, 147, -84, -202, 106, 84, 170, 49, -56, 562, 41, -52, -10, 60, 151, 59, 71, -39, 137, -485, 186, -222, -196, -60, -338, 105, 136, 252, 96, 299, -105, 180, 27, -26, 297, -38, 35, 180, 42, -262, 293, -114, -232, 53, -50, 31, 123, -131, -66, 155, -34, 267, 199, -117, 40, -179, 98, 159, -13, 468, 243, 34, 5, -149, -176, -113, -63, -154, 139, -21, -172, 258, -116, 135, 287, -34, 165, -25, 46, 192, -75, -117, -245, -7, -145, 13, -229, 123, -113, -352, 65, -188, -135, 154, -153, -166, 165, -17, -223, 210, 75, 130, -197]
4814a97L61l52R0M7K41k96J46M01m92J85n3r8N4j03K49m6j7o8J27j22j16J06R7
4837A44j41oq2Q6p6l82M05p0rL40k53J08O8j51J71k60k36K70K55k74K13k96O7
4860a09J55J05j23R2m1P7j94j08K19j94n0L00j87N5K91k99K17p7j97L7J5J23n5
4883E2j41P1N5l80M11K27m11K05k6k79K05R4k42J52j91J88n6j41L16J30k30J6
4905B5K4RR1M2j90j13j06K81n1K2j40J04LJ07K02o32L42O4k52M89m23J24K07l09
4929h0q7K49j81J04R5k62L57k74J78K12o47L34J51j85p7K82j85L12k42j51r4K50
4951E9ok3R1j53nj45J03J31j47J23p7K87j07l59J26j09Q4K15j14J76J61l41K34
4974B04k60K2l49N76j16j75J30j59K95J4k00J01j5j89K89J7j44p6j02L19j91n2
$$ y = [-197, 164, -188, -98, -51, 190, -106, 40, 441, -51, 134, 81, -17, 37, -66, 183, 137, 120, 52, 179, 57, -59, 47, 144, 3, -3, -85, 1, -75, -457, -52, -122, -131, 209, -44, 64, 132, -19, 152, -108, -344, -74, 181, -93, 120, -176, -109, 46, 151, 28, 120, 79, 156, -38, -146, 73, -121, -171, 129, -58, -3, 288, -11, 206, 129, -68, -31, -16, 107, 52, -89, -18, 37, -343, 68, 295, -116, 89, 63, -216, -11, 83, -159, -7, -198, -10, -66, -207, 109, 239, 9, 25, 49, 58, 149, 191, 1, -112, -218, 63, 12, 34, -106, -2, 1, 108, 310, -322, 20, 84, -168, 321, -102, 22, 229, -80, -167, 82, -99, 5, 100, -162, 195, -79, 99, 311, -336, -2, 149, -36, -113, 169, -16, 296, 54, -97, -191, 59, 53, 30, 121, -32, -37, -182, -79, 52, -95, 28, -49, 238, 131, -228, -102, -211, -127, 88, -26, 150, 311, -30, 204, -56, -34, -383, 193, 77, -98, 32, -127, 168, 182, -18, 83, 68, -121, 168, 185, 41, -35, -137, 182, -9, -61]
4996f1N7J08mjj54o2J97j12Ko5q1K77r5J2P7J41l50K49k11J28M4j02j70J49l1
5021e8L8r8k5K66n0R1j08k58K1K54R3k40L01l36K26j62j65K42j80P2j6j20K88
5044G6J67m09K09J62p5J33k92q1M75m73m9n9L44j09K21n98M31O2r6k31L24j46
5066a4lq5K7K21n43J48O60j77k7k76r5K61Q0l35K25R9n07N69j82k30L21q2j84
5089a29%P3N1P0m1j10P8j21K14R5k42K25j37J9J14l62J91O4j69R1K04l73L76l11
5113a30K55k73N3r7K73p8k3J15m26M17k20K93qk86J43j5q8J62k62n3M00j06j91
5136a45J31n4J1J54l61J61J84j05o5j65K14J20p1j05K83j86j40O90o39o3L72m27
5158b06M88k00k49K51l1k50J97l1J35q4rj32J97j52J89jq0K27l0j74k46K08j42
$$ y = [-61, -4, 104, 100, 99, -55, -117, 80, -32, -30, -95, -176, 101, 6, 18, 95, 236, -114, 135, -76, 52, 96, -6, -176, -27, -58, -20, -118, -143, 123, 73, 164, 56, -202, -181, 73, 166, -74, 227, -109, 117, -45, -210, 32, -148, -76, -92, -212, 76, 243, -166, 43, 205, 130, 263, -29, -110, 365, -108, -157, -216, 128, 19, 240, -358, 73, 135, 39, -192, 132, -14, -17, -102, -75, 146, -397, -249, 411, 234, 207, -69, -164, 97, 177, -158, 67, 166, -341, 228, 46, -184, 137, 55, -129, -129, -56, -5, 65, 24, -86, -8, -129, 85, 180, -62, 163, 26, 45, 159, -203, -12, 52, -117, -26, 178, -195, 181, -130, 125, -148, -95, -192, 81, 3, -20, 95, -331, 86, -134, 159, 151, -135, 8, -7, -95, 67, -195, -248, 152, 46, -145, -14, -68, -57, 97, -264, -103, 81, -24, -89, -254, -40, 80, 9, -96, 187, 1, -139, 551, -88, -151, 221, -206, 282, 82, -167, 84, 53, -197, 0, -31, 104, 20, 11, -121, 76, -76, 113, 112, 32, 259, 229, 55, -191, 17, -125]
5181a25J36K69k17j09j0P5L3j37M2J69r8M0n1o8J75j74R9j77J48R9n8n3mo5K14
5206A53Q8q4k1p3k09K74m1L3m09M00l66L81j07k44K13j05JN3J77j05r6P4J90j72
5230Ej09L38l51J6J39L3O9r8l55J23K65m22M76j29j65K13M5j56K18k36K10J73
5252C02n29J57M6J37j3j72J10K82m77K48J20j77o0p3j93O72m8n29L07j48j63J34
5274f7k05J24O9j36K92Mj53M66l08l90M83j82j05K20j30P4q4Q8m3j76K06j21J91
5297A17o6r6j23J22L88n59R7L92m79j5M36k45j16K68j41N2j16K19l1k45L50k26
5319a7O4J94j43j71L5P3L5J68k81J63k57n3N3K72k29L54O9k50k11J34j13k7O9
5342f9l2K82n9N6j64k34J33l7J93m2j82M80m68J82m9j73L75j38N5n54N50j9l4
$$ y = [-125, 11, 280, 63, -46, -56, 19, 52, -85, -43, 126, 28, 68, 17, -51, 124, -50, 49, -128, 20, 119, 61, 8, 4, -61, 153, 241, 157, 136, 63, -146, 128, 87, 120, -289, 111, -255, 126, 19, -225, -12, -117, -116, -63, 114, 9, -87, -13, 177, 5, -104, 234, -117, -101, 38, 71, 140, 42, -313, -190, 75, -347, 129, 0, -165, 48, 93, -63, 155, -81, 129, 302, -227, -70, -24, 113, 100, -72, 38, 320, -157, 91, 211, 34, -26, -99, -292, 380, 332, -197, 110, -38, -201, -67, -272, -148, -79, -215, 77, 81, -72, 394, 86, -304, 179, -3, -108, 112, -18, 56, -28, 60, 17, -159, 47, -74, 117, 51, -45, -168, -46, 342, -217, -120, 272, -207, -222, 214, -31, -147, 121, -20, 32, -84, 135, 104, -141, 209, -17, 47, 241, 98, -73, -38, 35, 70, 238, -43, 120, -137, -190, -137, 135, -94, 260, 329, 79, -132, 2, -111, -138, -69, -101, 181, 122, 178, 14, -220, -87, -124, 69, 27, -155, 325, -143, 39, -10, -183, 192, 54, 109, -445, 105, 86, 52]
5365E2J71r7J8o6j42k2L62k79R1J52j48l9m1m2k38l8K82L48k93j83K38j57Q5q7
5389g3J06n8O8M9j2q7n9J40j50M26l09j06J46k35K59K59o44K35J45j17J36j31
5411a2q1L56j21J33k54k01m5M27q3q2J32l61j21K55n7J80n2j26N29l70K59j29
5433A76m3qo9J34j3j74k51r3N16l14L11j12k64K71L07k78K42l70K26j54k26M76
$$ y = [52, 223, 126, 144, 78, -64, -86, 276, -3, 88, 240, 92, 53, 12, -30, -268, -306, -24, 324, 31, -152, 86, -71, 14, -73, 33, -25, 43, 92, 80, -7, -66, 74, -76, 350, 41, -65, 81, -154, 105, 364, -280, -45, 100, -17, 119, -12, -93, 263, 142, 275, 21, -180, -225, 202, 119, 37, 169, -192, -313, -58, -115, 65, 13, -113, 416, 46, 305, 176, 133, 125, 56, 190, 177, 3, -248, -341, 175, -139, 172, 60, -204, 67, 374, 96, 338, -32, 194, 40, -186, 290]
$$ [...]
8191d8
##END NTUPLES=NMR FID
##END=
