##TITLE=1H_Pr 5263-3
 CDCl3
 8 sc, 
 25.10.2022
##JCAMPDX= 6.0         $$ Bruker NMR JCAMP-DX V2.0
##DATA TYPE= NMR FID
##DATA CLASS= NTUPLES
##ORIGIN= UXNMR, Bruker Analytische Messtechnik GmbH
##OWNER= root
$$ XWIN-NMR		Version 3.5
$$ Tue Oct 25 16:03:30 2022 Russian Standard Time (UT+4h)  she@DPX200
##.OBSERVE FREQUENCY= 200.1313499994
##.OBSERVE NUCLEUS= ^1H
##.DELAY= (6, 6)
##.ACQUISITION MODE= SIMULTANEOUS
##.ACQUISITION SCHEME= undefined
##.AVERAGES= 8
##.DIGITISER RES= 18
##SPECTROMETER/DATA SYSTEM= spect
##.PULSE SEQUENCE= zg30
##.SOLVENT NAME= CDCl3
##.SHIFT REFERENCE= (INTERNAL, CDCl3, 0, 15.7039)
##AUDIT TRAIL= $$ (NUMBER, WHEN, WHO, WHERE, WHAT)
$$ ##TITLE= Audit trail, XWIN-NMR		Version 3.5
$$ ##JCAMPDX= 5.01
$$ ##ORIGIN= Bruker BioSpin GmbH
$$ ##OWNER= she
$$ F:/spectra/data/she/nmr/H-F/1/audita.txt
$$ ##AUDIT TRAIL=  $$ (NUMBER, WHEN, WHO, WHERE, WHAT)
(   1,<2022-10-25 16:02:15.48 +0400>,<she>,<DPX200>,
      <created by zg, POWCHK disabled, PULCHK disabled
       configuration hash MD5:
       00 E9 B6 7A A2 85 ED C7 34 08 36 98 17 FE 4E 26
       data hash MD5: 16K
       88 8E 5E 98 25 A6 84 7A 71 B2 18 B6 63 BC 14 A9>)
$$ ##END=
$$ 
$$ hash MD5
$$ C0 16 FD 51 21 2F 3A 09 09 AF E7 7D 30 9C 65 91
##$RELAX= 
##$RELAX= 
##$RELAX= 
##$RELAX= 
##$RELAX= 
##$RELAX= 
$$ Bruker specific parameters
$$ --------------------------
##$DU= <F:/spectra>
##$EXPNO= 1
##$NAME= <H-F>
##$PROCNO= 1
##$TYPE= <nmr>
##$USER= <she>
##$AMP= (0..31)
100 100 100 100 100 100 100 100 100 100 100 100 100 100 100 100 100 100 
100 100 100 100 100 100 100 100 100 100 100 100 100 100 
##$AQSEQ= 0
##$AQ_mod= 1
##$AUNM= <au_zg>
##$AUTOPOS= <>
##$BF1= 200.13
##$BF2= 200.13
##$BF3= 200.13
##$BF4= 200.13
##$BF5= 200.13
##$BF6= 200.13
##$BF7= 200.13
##$BF8= 200.13
##$BYTORDA= 1
##$CFDGTYP= 0
##$CFRGTYP= 5
##$CHEMSTR= <none>
##$CNST= (0..31)
1 1 145 1 1 1 1 1 1 1 1 1 1 1 1 1 1 1 1 1 1 1 1 1 1 1 1 1 1 1 1 1 
##$CPDPRG= <>
##$CPDPRG1= <>
##$CPDPRG2= <>
##$CPDPRG3= <>
##$CPDPRG4= <mlev>
##$CPDPRG5= <mlev>
##$CPDPRG6= <mlev>
##$CPDPRG7= <mlev>
##$CPDPRG8= <mlev>
##$CPDPRGB= <>
##$CPDPRGT= <>
##$D= (0..31)
0 1.2 0 0 0 0 0 0 0 0.06 0 0.03 0 0 0 0 0.0002 0 0 0 0 0 0 0 0 0 0 0 0 
0 0 0 
##$DATE= 1666699334
##$DBL= (0..7)
120 120 120 120 120 120 120 120 
##$DBP= (0..7)
150 150 150 150 150 150 150 150 
##$DBP07= 0
##$DBPNAM0= <>
##$DBPNAM1= <>
##$DBPNAM2= <>
##$DBPNAM3= <>
##$DBPNAM4= <>
##$DBPNAM5= <>
##$DBPNAM6= <>
##$DBPNAM7= <>
##$DBPOAL= (0..7)
0.5 0.5 0.5 0.5 0.5 0.5 0.5 0.5 
##$DBPOFFS= (0..7)
0 0 0 0 0 0 0 0 
##$DE= 6
##$DECBNUC= <off>
##$DECIM= 32
##$DECNUC= <off>
##$DECSTAT= 4
##$DIGMOD= 1
##$DIGTYP= 9
##$DL= (0..7)
0 120 120 120 120 120 120 120 
##$DP= (0..7)
150 150 150 150 150 150 150 150 
##$DP07= 0
##$DPNAME0= <>
##$DPNAME1= <>
##$DPNAME2= <>
##$DPNAME3= <>
##$DPNAME4= <>
##$DPNAME5= <>
##$DPNAME6= <>
##$DPNAME7= <>
##$DPOAL= (0..7)
0.5 0.5 0.5 0.5 0.5 0.5 0.5 0.5 
##$DPOFFS= (0..7)
0 0 0 0 0 0 0 0 
##$DQDMODE= 0
##$DR= 18
##$DS= 0
##$DSLIST= <SSSSSSSSSSSSSSS>
$$ [...]
##$SUBNAM2= <"">
##$SUBNAM3= <"">
##$SUBNAM4= <"">
##$SUBNAM5= <"">
##$SUBNAM6= <"">
##$SUBNAM7= <"">
##$SUBNAM8= <"">
##$SUBNAM9= <"">
##$SW= 18.0517283424941
##$SWIBOX= (0..15)
0 0 2 0 0 0 0 0 0 0 0 0 0 0 0 0 
##$SW_h= 3612.71676300578
##$TD= 16384
##$TD0= 1
##$TE= 0
##$TE2= 300
##$TE3= 300
##$TEG= 300
##$TL= (0..7)
0 120 120 120 120 120 120 120 
##$TP= (0..7)
150 150 150 150 150 150 150 150 
##$TP07= 0
##$TPNAME0= <>
##$TPNAME1= <>
##$TPNAME2= <>
##$TPNAME3= <>
##$TPNAME4= <>
##$TPNAME5= <>
##$TPNAME6= <>
##$TPNAME7= <>
##$TPOAL= (0..7)
0.5 0.5 0.5 0.5 0.5 0.5 0.5 0.5 
##$TPOFFS= (0..7)
0 0 0 0 0 0 0 0 
##$TUNHIN= 0
##$TUNHOUT= 0
##$TUNXOUT= 0
##$USERA1= <user>
##$USERA2= <user>
##$USERA3= <user>
##$USERA4= <user>
##$USERA5= <user>
##$V9= 5
##$VALIST= <valist>
##$VCLIST= <CCCCCCCCCCCCCCC>
##$VD= 0
##$VDLIST= <DDDDDDDDDDDDDDD>
##$VPLIST= <PPPPPPPPPPPPPPP>
##$VTLIST= <TTTTTTTTTTTTTTT>
##$WBST= 1024
##$WBSW= 4
##$XGAIN= (0..3)
0 0 0 0 
##$XL= 0
##$YL= 0
##$YMAX_a= 312111
##$YMIN_a= -250331
##$ZGOPTNS= <>
##$ZL1= 120
##$ZL2= 120
##$ZL3= 120
##$ZL4= 120
##$ABSF1= 10
##$ABSF2= 0
##$ABSG= 5
##$ABSL= 3
##$ALPHA= 0
##$AQORDER= 0
##$ASSFAC= 0
##$ASSFACI= 0
##$ASSFACX= 0
##$ASSWID= 0
##$AUNMP= <proc_1d>
##$AZFE= 0.1
##$AZFW= 0.1
##$BCFW= 1
##$BC_mod= 2
##$BYTORDP= 1
##$COROFFS= 0
##$CY= 11.3945322036743
##$DATMOD= 1
##$DC= 2
##$DFILT= <>
##$DTYPP= 0
##$F1P= 2.36226072786647
##$F2P= -0.459571619588291
##$FCOR= 0.5
##$FTSIZE= 0
##$FT_mod= 4
##$GAMMA= 1
##$GB= 0.15
##$INTBC= 1
##$INTSCL= 1
##$ISEN= 128
##$LB= 0.24
##$LEV0= 0
##$LPBIN= 0
##$MAXI= 10000
##$MC2= 0
##$MEAN= 0
##$ME_mod= 0
##$MI= 1.114404
##$NCOEF= 0
##$NC_proc= 0
##$NLEV= 6
##$NOISF1= 3.799351
##$NOISF2= 2.8
##$NSP= 1
##$NTH_PI= 0
##$NZP= 0
##$OFFSET= 15.70392
##$PC= 1
##$PHC0= -18194.47
##$PHC1= 14.2007
##$PH_mod= 1
##$PKNL= yes
##$PPARMOD= 0
##$PSCAL= 0
##$PSIGN= 0
##$REVERSE= no
##$SF= 200.130013532006
##$SI= 16384
##$SIGF1= 3
##$SIGF2= 2
##$SINO= 400
##$SIOLD= 16384
##$SREGLST= <1H.CDCl3>
##$SSB= 0
##$STSI= 0
##$STSR= 0
##$SW_p= 3612.71676300578
##$SYMM= 0
##$S_DEV= 0
##$TDeff= 0
##$TDoff= 0
##$TI= <>
##$TILT= no
##$TM1= 0
##$TM2= 0
##$TOPLEV= 0
##$USERP1= <user>
##$USERP2= <user>
##$USERP3= <user>
##$USERP4= <user>
##$USERP5= <user>
##$WDW= 1
##$XDIM= 8192
##$YMAX_p= 0
##$YMIN_p= 0
$$ End of Bruker specific parameters
$$ ---------------------------------
##NTUPLES= NMR FID
##VAR_NAME=  TIME,          FID/REAL,        FID/IMAG
##SYMBOL=    X,             R,               I
##VAR_TYPE=  INDEPENDENT,   DEPENDENT,       DEPENDENT
##VAR_FORM=  AFFN,          ASDF,            ASDF
##VAR_DIM=   8192,          8192,            8192
##UNITS=     SECONDS,       ARBITRARY UNITS, ARBITRARY UNITS
##FACTOR=    0.0002768,     1,               1
##FIRST=     0,             0,               0
##LAST=      2.2672688,     0,               0
##MIN=       0,             -250331,         0
##MAX=       2.2672688,     312111,          0
$$ Real data points
##PAGE= N=1
##DATA TABLE= (X++(R..R)), XYDATA
$$ plain form
0 0 0 0 0 0 0 0 0 0 0 0 8 -8 8 -8 8 -16 16 -24 24 -32 40 -43 48 -64 72 -82 96 -112 128 -150 168 -192 219
33 219 -248 280 -317 355 -398 446 -496 551 -614 681 -754 833 -920 1016 -1120 1234 -1361
50 -1361 1499 -1652 1821 -2008 2219 -2457 2727 -3039 3399 -3825 4338 -4966 5758 -6792 8201
65 8201 -10252 13519 -19535 34252 -146664 -68950 306996 49666 -199182 -53765 153957
76 153957 16861 -96426 -26961 46857 29351 47341 -11816 -118077 -53348 140360 95537
87 95537 -105475 -91439 85636 61724 -75233 -46909 65133 44475 -20517 -30895 -38461 -23222
99 -23222 66431 74073 -54761 -88985 38946 66216 -45762 -47591 58697 43533 -49303 -38747
111 -38747 13233 4581 15675 45630 -11425 -69133 2392 61454 -11996 -42741 45140 41143
$$ packed form
0@%%%%%%%%%%Qj6J6j6J6k4L2m0M8n6P2q3R1j12J36j54J78k08K40k78L18l60M11
33B19m67N28n97O72p53Q44r42J047j165J295j435J587j753J936k136K354k595
50a361K860l151L473l829M227m676N184n766O438p224Q163r304J0724j2550J4993
65H201j8453K3771l3054N3787j80916P7714L75946k57330k48848J45417K07722
76A53957j37096j13287O9465P3818j7506J7990n9157j06261O4729J93708m4823
87I5537k01012J4036J77075k3912j36957K8324J12042k0658o4992j0378p566J5239
99b3222Q9653P642j28834l4224J27931K7270j11978j829J06288j5164r2836J0556
111c8747N1980q652J1094K9955n7055n7708P1525N9062p3450l0745Q7881l997
$$ plain form
123 41143 -69538 -45079 70857 28942 -66474 10353 81315 -44209 -109126 48495 116594
134 116594 -40853 -98136 40759 67850 -56674 -54285 61100 49469 -41119 -30178 14256
145 14256 -5989 -3130 38499 9373 -44390 -6428 36742 -12232 -33698 35256 44370 -37989
157 -37989 -45887 27173 26390 -23664 259 32993 -14837 -41916 11677 29621 -13143 -7746 25722
170 25722 -7028 -41122 4857 38424 -3147 -21349 14117 9000 -27898 -7925 29837 9754
182 9754 -13372 4770 -276 -26787 3139 41915 -316 -41148 8227 37694 -25694 -44065
194 -44065 36006 52682 -32541 -51490 21293 33420 -20540 -16468 24851 8865 -23732 -7881
206 -7881 9551 -420 6482 17084 -10457 -27257 7861 25121 -8334 -14452 20139 11892 -28642
$$ packed form
123D1143j10681K4459J15936m1915r5416P6827P0962j25524o4917J57621O8099
134A16594j57447n7283J38895K7091j24524K389J15385j1631r0588J0941M4434
145A4256k0245K859M1629k9126n3763L7962M3170m8974k1466O8954R114q2359
157c7989p898P3060p83n0054K3923L2734m7830k7079N3593J7944m2764N397L3468
170B5722l2750l4094M5979L3567m1571j8202L5466n117l6898J9973L7762k0083
182I754k3126J8142n046k6511K9926L8776m2231m0832M9375K9467o3388j8371
194d4065Q0071J6676q5223j8949P2783J2127n3960M072M1319j5986l2597J5851
206g881J7432r971O902J0602k7541j6800L5118J7260l3455o118L4591q247m0534
$$ plain form
219 -28642 -14291 26857 12722 -17333 33 12788 -15610 -17201 20078 17953 -17524 -10503 15427
232 15427 -2986 -22291 7032 26319 -3323 -20638 50 7271 -4387 2458 11498 -2788 -9114
245 -9114 4747 1254 -12153 5659 24405 -2606 -27758 -977 22550 -1832 -16282 9914
257 9914 15318 -14783 -17249 10099 11018 -6023 -249 6291 -9532 -12075 9514 11839 -6560 -4974
271 -4974 7331 -1645 -11368 2776 12723 774 -4743 1889 -2968 -8182 6826 14707 -4580 -12948
285 -12948 5744 8581 -11772 -8131 16600 10940 -15537 -12542 8428 6104 -5493 239 5469
298 5469 -3391 -6089 762 389 -440 7152 4821 -9897 -8655 8115 8333 -5024 -2285 7919 17
313 17 -10323 -561 9806 2188 -3930 1514 -273 -7661 -651 9653 1947 -7749 -1036 4011 -4465
$$ packed form
219b8642J4351M1148j4135l0055J7366J2755k8398j591L7279k125l5477P021K5930
232A5427j8413j9305K9323J9287k9642j7315K0688P221j1658O845R040j4286o326
245i114J3861l493j3407J7812J8746k7011k5152K6781K3527k4382j4450K6196
257I914N404l0101k466K7348R19j7041N774O540j5823k543K1589K325j8399J586
271d974J2305q976r723J4144R947j1949n517O632m857n214J5008P881j9287q368
285a2948J8692K837k0353L641K4731n660k6477K995K0970k324j1597N732N230
298E469q860k698O851l73q29P592k331j4718J242J6770K18j3357K739J0204p902
313A7j0340R762J0367p618o118N444j787p388P010J0304p706r696O713N047q476
$$ plain form
328 -4465 -5356 5894 6649 -3893 -5474 52 -69 -130 4541 3172 -3865 -3021 2589 302 -2364 4022
344 4022 6438 -3006 -7270 1112 5170 -792 -1312 3892 347 -6479 -2492 4327 2008 -1487 323
359 323 -677 -4464 -1550 3745 1726 -1729 176 671 -3176 -2304 3461 4213 -189 -1832 -885 -1207 375
376 375 3873 2453 -2550 -1788 2340 194 -4210 244 6448 1917 -6522 -5125 2441 4279 225 -2835
392 -2835 -1930 965 1417 -2380 -3512 2547 6373 -337 -7372 -2843 5614 4703 -1739 -2738 1017 1839
408 1839 -551 -1182 532 2273 2273 -480 -4021 -2841 3272 4866 -1102 -4651 -813 2058 -734 -1984
424 -1984 830 1781 -606 -1858 -1136 -574 465 2636 2247 -2038 -4086 288 4600 1963 -2823 -1193
440 -1193 3163 1541 -3036 -2123 2797 3825 -68 -3554 -3014 814 3755 1758 -3470 -4047 1877 4378
$$ packed form
328d465q91J1250P55j0542j581N526j21o1M671j369p037Q44N610k287k666O386
344D022K416r444m264Q382M058n962n20N204l545o826L987O819k319l495J810
359C23j000l787K914N295k019l455J905M95l847Q72N765P52m402j643R47l22J582
376C75L498j420n003P62M128k146m404M454O204m531q439J397P566J838m054l060
392b835R05K895M52l797j132O059L826o710p035M529Q457r11o442r99L755Q22
408A839k390o31J714J741%k753l541J180O113J594n968l549L838K871k792j250
424a984K814R51k387j252P22N62J039K171l89m285k048M374M312k637m786J630
440a193M356j622m577R13M920J028l893l486N40L828K941j997n228n77N924K501
$$ plain form
456 4378 -2532 -7033 1570 9572 334 -11680 -3896 11198 6448 -9033 -6694 7999 7195 -6521
470 -6521 -7160 5473 8379 -1722 -6547 -942 3522 2773 520 -2637 -3491 2080 5316 -2844 -8703
485 -8703 2040 11417 -702 -14135 -2971 13241 4921 -11605 -6070 9667 6186 -8153 -6398
498 -6398 6303 6939 -2427 -4725 -169 1807 2130 2659 -1236 -4689 870 6494 -383 -8161 -534 9673
514 9673 1942 -10736 -4628 9124 4873 -8142 -4468 6946 2145 -8046 -1091 8690 -77 -9159
528 -9159 1650 10034 -3030 -11177 4274 13597 -2641 -13504 1329 12660 567 -9511 -504
541 -504 6714 368 -3458 139 -1047 -1993 5262 4736 -9372 -9761 10058 13128 -9730 -16181 7138
556 7138 16904 -4833 -17141 1487 16051 2579 -12552 -5398 7908 7111 -1669 -5177 -2461 3103
$$ packed form
456D378o910m501Q603Q002r238j2014P784J5094m750j5481K339J4693q04j3716
470f521o39J2633K906j0101m825N605M464p49k253l157q54N571L236q160n859
485h703J0743R377j2119j3433J1164J6212q320j6526N535J5737l481j4339J755
498f398J2701O36r366k298M556J976L23N29l895l453N559N624o877p778P627J0207
514I673p731j2678O108J3752m251j3015L674J1414m801j0191O955R781q767r082
528i159J0809Q384j3064q147J5451R323j6238j0863J4833J1331j2093j0078R007
541e04P218o346l826L597j186r46P255n26j4108l89J9819L070k2858o451K3319
556G138R766k1737j2308J8628J4564j3472j5131P154J3306p97q780l508K716N564
$$ plain form
570 3103 6177 419 -8086 -3699 9216 7803 -8616 -11728 5711 13589 -2479 -14297 -1146 12480
584 12480 2310 -11455 -3518 9353 3177 -7681 -2365 5422 88 -3788 3303 4077 -5461 -4429
598 -4429 7207 5807 -6737 -5410 6905 5525 -5874 -4659 4526 3456 -2606 -1154 796 -2680
612 -2680 -723 5510 851 -8265 -2513 8762 3222 -9402 -4789 8363 5944 -6351 -6790 3363
626 3363 6716 469 -4579 -2742 2570 4649 497 -4727 -2447 5047 5135 -3525 -6869 1191 7559 1588
642 1588 -7086 -4528 4886 5792 -3628 -7335 1342 7392 -184 -7606 -1576 6237 2191 -4350 -1967
657 -1967 2569 1122 -744 586 385 -1172 775 2623 -745 -3050 1267 4008 -498 -3800 -92
672 -92 2756 110 -1724 -235 228 -569 251 155 -1757 -735 2312 670 -3067 -1329 2653 1316 -1893
$$ packed form
570C103L074n758q505M387J2915j413j6419l112J7439P878j6068j1818J3151J3626
584A2480j0170j3765P937J2871o176j0858N316P787n334l876P091P74r538J032
598d429J1636j400j2544J327J2315j380j1399J215R185j070o062J452J950l476
612b680J957O233m659r116N752J1275n540j2624M613J3152k419j2295m39J0153
626C363L353o247n048J837N312K079m152n224K280P494Q8q660l344Q060O368n971
642A588q674K558R414R06r420l707Q677O050p576p422O030P813m046o541K383
657a967M536j447j866J330k01j557J947J848l368k305M317K741m506l302L708
672i2K848k646j834J489M63p97Q20r6j912J022L047j642l737J738L982j337l209
$$ plain form
689 -1893 -763 1471 630 -652 211 713 -6 425 888 -423 -1066 884 1709 -492 -1629 232 1068
706 1068 -422 -878 -81 222 90 -270 -1202 -827 1147 1133 -1587 -1648 1494 1681 -1663 -1530 2018 1865 -1576
725 -1576 -1512 1513 1796 -520 -910 592 931 -12 -457 -270 291 720 1 -1367 -760 1130 591 -1447
743 -1447 -898 908 139 -1320 -317 870 -87 -599 395 289 -726 21 1375 460 -1044 -133 1389
760 1389 537 -793 -127 1032 593 -501 -545 -7 483 475 -385 -1141 -178 906 -144 -1388 -275 934
778 934 -73 -1127 -405 439 153 54 37 -361 -221 858 860 -541 -565 1107 1238 -744 -996 807 1437 -128
798 -128 -1120 -124 735 298 -446 -745 -240 594 173 -1322 -954 1028 998 -1325 -1451 915 1207 -855 -1011
817 -1011 784 1127 -314 -713 390 895 429 -68 -221 105 727 428 -529 -430 858 650 -1087 -1051 744
$$ packed form
689a893J130K234q41j282Q63N02p19M31M63j311o43J950Q25k201j137J861Q36
706A068j490m56P97L03j32l60r32L75J974j4k720o1L142J87l344J33L548j53l441
725a576O4L025K83k316l90J502L39r43m45J87N61M29p19j368O07J890n39k038
743a447N49J806p69j459J003J187r57n12R94j06j015P47J354r15j504R11J522
760A389q52j330O66J159m39j094m4N38M90qq60p56R63J084j050j244J113J209
778I34j007j054P22Q44k86r9j7l98J40J079Kj401k4J672J31j982k52J803O30j565
798a28r92R96Q59m37p44k99N05Q34m21j495L68J982l0k323j26K366K92k062j56
817a011J795L43j441l99J103N05m66m97j53L26O22k99r57R9J288k08j737L6J795
$$ plain form
836 744 829 -861 -1009 211 223 -489 -111 -42 -504 233 736 -395 -1065 499 1537 -123 -1270 250 1501
855 1501 302 -732 71 721 289 -59 -60 -443 -24 936 190 -1465 -712 1116 485 -1310 -849 632 330
874 330 -501 -332 -389 -203 841 634 -1203 -1041 1481 1687 -1112 -1555 1242 1819 -503 -1187 522 1093
892 1093 284 -130 -469 -678 666 1490 -745 -2384 343 2348 -535 -2768 28 2196 -236 -2026
908 -2026 -231 1028 111 -344 1 -298 -72 1066 535 -873 -277 1317 657 -791 -329 718 310 66
926 66 221 -465 -698 870 1023 -1300 -1499 1146 1171 -1558 -1313 1087 450 -1141 50 653 -1209 -517
944 -517 2158 458 -2947 -258 3747 520 -3801 -195 4156 559 -3478 -151 2996 59 -1840
959 -1840 475 812 -1066 184 1533 -1316 -2378 1632 2549 -2327 -3300 1970 3100 -1881 -3209 1123
$$ packed form
836G44Q5j690j48J220J2p12L78O9m62P37N03j131o70J564J038j660j147J520J251
855A501j199j034Q03O50m32l48jl83M19R60p46j655P53J828o31j795M61J481l02
874C30q31J69n7J86J044k07j837J62K522K06k799m43K797N77k322o84J709N71
892A093q09m14l39k09J344Q24k235j639K727K005k883k233K796K168k432j790
908b026J795J259r17m55L45k99K26J138n31j408N96J594o60j448M62J047m08k44
926F6J55o86k33J568J53k323j99K645K5k729K45K400o37j591J191O03j862O92
944e17K675j700l405K689M005l227m321L606M351l597m037L327L147k937j899
959a840K315L37j878J250J349k849j062M010R17m876r73N270J130m981j328M332
$$ plain form
975 1123 2710 -451 -2147 -89 1683 951 -880 -1005 641 1581 69 -1119 153 1101 -188 -581
991 -581 717 197 -1293 275 1725 -1111 -2557 1286 2563 -2164 -2982 2209 2416 -2949 -2021 3194
1007 3194 1048 -3704 -63 4026 -795 -4103 1995 4486 -2489 -4131 3331 4281 -3233 -3433 3422
1022 3422 2745 -3116 -1659 2737 308 -2500 846 1832 -2346 -1912 2977 1424 -3806 -1678 3715 1657
1038 1657 -3605 -1882 2892 2113 -1825 -2097 975 2346 408 -1835 -911 1946 1819 -1311 -1770 1222
1054 1222 1684 -949 -987 718 -55 -790 953 534 -2440 -890 3072 627 -4223 -782 4432 302
1070 302 -4767 15 4485 -608 -3913 1440 3381 -1956 -2303 2988 1683 -3297 -527 3929 -101
1085 -101 -3760 1016 3658 -1617 -3180 1975 2264 -2452 -1520 2464 284 -2797 163 2475 -1116 -2415
$$ packed form
975A123J587l161j696K058J772p32j831j25J646R40j512j188J272R48j289l93
991e81J298n20j490J568J450k836j446L843J277m727q18N191K07n365R28N215
1007C194k146m752L641M089m821l308O098K491o975j642P462R50p514k00O855
1022C422o77n861J457M396k429k808L346R86m178M34M889j553n230K128N393k058
1038A657n262J723M774p79l938k72L072J371j938k243R24K857j27l130m59K992
1054A222M62k633l8J705p73p35J743m19k974J550L962k445m850L441N214m130
1070C02n069M782M470n093l305N353J941n337l47N291j305m980K770M456m030
1085a01l659M776K642n275j563N155K89m716R32L984k180l081K960K312l591j299
$$ plain form
1101 -2415 1305 1927 -1481 -1547 1395 1042 -870 -206 536 -72 305 877 -658 -950 1435 1431 -1612 -1355
1119 -1355 1923 1078 -1926 -716 1696 -69 -1487 545 728 -1607 -368 1797 -454 -2426 873
1134 873 2535 -1479 -2473 1916 2167 -1980 -1381 2385 991 -2086 110 2168 -574 -1621 1522 1411
1150 1411 -1990 -771 2489 124 -2707 368 2512 -1123 -2474 1344 1736 -1961 -1446 1904 461
1165 461 -2068 69 1738 -802 -1370 1309 909 -1533 -165 1992 -145 -1647 940 1752 -1111 -1228
1181 -1228 1684 937 -1676 -387 1694 -260 -1646 666 1174 -1344 -983 1384 230 -1795 -6 1469
1197 1469 -657 -1457 941 975 -1234 -431 1458 -19 -1312 795 1493 -1018 -995 1675 918 -1631 -253
1214 -253 1879 -82 -1682 547 1395 -1074 -1112 1330 441 -1773 -179 1659 -560 -1841 707 1405
$$ packed form
1101b415L720O22l408o6K942l53j912O64P42o08L77N72j535k92K385ml043K57
1119a355L278q45l004J210K412j765j418K032J83k335J239K165k251j972L299
1134H73J662m014r94M389K51m147N99L766j394l077K196K058k742j047L143j11
1150A411l401J219L260k365k831L075K144l635j351L818L92l697N15L350j443
1165D61k529K137J669k540n68K679m00k442J368K157k137j502K587Q12k863j17
1181a228K912p47k613J289K081j954j386K312N08k518L61K367j154k025J789J475
1197A469k126q00K398L4k209Q03J889j477j293K107O98k511K3K670p57k549J378
1214b53K132j961j600K229Q48k469l8K442q89k214J594J838k219j281K548O98
$$ plain form
1230 1405 -1173 -1142 1246 642 -1261 -66 1341 -263 -997 981 1026 -1122 -400 1563 350 -1495 152
1247 152 1525 -426 -1332 698 842 -1078 -596 1057 -63 -1310 240 1083 -819 -1106 908 664 -1136
1264 -1136 -373 1092 17 -852 509 826 -645 -355 1220 321 -1140 224 1455 -368 -1215 649
1280 649 1038 -871 -813 859 331 -1013 -46 738 -533 -905 629 447 -1121 -395 1046 39 -1151
1297 -1151 217 1112 -397 -713 744 637 -642 -67 1031 38 -825 551 803 -626 -667 868 380
1314 380 -1068 -185 1006 -241 -1120 276 733 -665 -743 604 248 -805 -103 658 -215 -602 517 513
1332 513 -546 -196 895 227 -672 191 870 -139 -570 463 494 -480 -239 568 -31 -602 101 395 -533
1351 -533 -487 380 129 -658 -69 465 -236 -514 368 317 -539 -98 746 44 -648 306 887 -251 -556 536
$$ packed form
1230A405k578L1K388o04j903J195J407j604p34J978M5k148P22J963j213j845J647
1247A52J373j951r06K030J44j920M82J653j120j247J550Q43j902k87K014k44j800
1264a136P63J465j075q69J361L17j471K90J575q99j461J364J231j823q47J864
1280F49L89j909N8J672n28j344R67P84j271l72J534j82j568P26J441j007j190
1297a151J368Q95j509l16J457j07j279N75J098r93q63J376K52j429m1J535m88
1314C80j448Q83J191j247q79J396M57j398p8J347l56j053P02P61q73l87J119m
1332E13j059L50J091o68q99Q63O79j009m31J033L1r74K41Q07n99n71P03K94r28
1351e33M6Q67k51p87N89N34p01k78Q82n1q56M41Q44p02o92R54N81j138l05J092
$$ plain form
1371 536 705 -430 -334 619 201 -511 92 593 -377 -628 442 393 -688 -519 660 171 -772 -277 519
1390 519 -2 -450 92 235 -112 -40 364 38 -240 270 452 -119 -217 326 271 -112 10 202 10 -76 206
1411 206 -92 -376 107 383 -382 -522 206 298 -454 -389 395 73 -493 25 478 -224 -515 463 603 -395 -437
1432 -437 705 630 -536 -355 712 540 -564 -258 478 210 -431 -90 273 -202 -345 134 154 -503 -367
1451 -367 373 186 -460 -446 307 395 -300 -413 286 546 -67 -394 223 584 -1 -350 257 455 -120 -219 326
1472 326 254 -352 -175 483 54 -692 -165 685 -44 -918 -48 749 -169 -904 156 771 -310 -758 472
1491 472 679 -432 -463 703 580 -606 -309 866 387 -661 -184 834 190 -775 -164 732 62 -727
1509 -727 -47 539 -221 -655 81 374 -328 -562 235 391 -481 -441 492 487 -497 -422 637 563 -522 -345 711
$$ packed form
1371E36J69j135R6R53m18p12O03N01r70k51J070m9j081J69J179m89r43M95P96
1390E19n21m48N42J43l47P2M04l26k78N10J82n71r8N43n5l83J22J92j92q6K82
1411B06k98k84M83K76p65j40P28R2p52O5P84l22n66N18M53p02k91R78J40r98m2
1432d37J142p5j166J81J067j72j104L06P36k68o41L41L63m75j43M79K0o57J36
1451c67P40j87o46J4P53Q8o95j13O99K60o13l27O17L61n85l49O07J98n75r9N45
1472C26p2o06J77O58m29p46N27Q50p29q74Q70P97r18p35J060O15j081m48J230
1491D72K07j111l1J166j23j186K97J175m79j048M77J018o44r65O11Q96o70p89
1509g27O80N86p60m34P36K93p02k34P97J56q72M0R33nr84P5J059p4j085J77J056
$$ plain form
1530 711 545 -548 -275 709 321 -645 -174 645 16 -679 11 627 -257 -698 281 501 -596 -632 510
1549 510 479 -677 -497 659 379 -717 -220 778 233 -556 9 767 90 -516 176 583 -122 -453 283
1568 283 426 -185 -293 256 240 -387 -296 164 85 -328 -200 113 48 -306 -212 221 148 -309 -111 298 248 -244
1590 -244 -36 450 166 -322 83 512 61 -331 87 397 -62 -380 172 372 -269 -404 233 215 -479 -282
1610 -282 393 5 -572 -85 483 -130 -543 178 394 -177 -275 371 358 -208 -67 368 201 -197 19 301 -1
1631 -1 -236 59 148 -120 -144 93 70 -180 -146 37 -102 -127 -21 -36 -93 33 16 -69 22 131 -76 -123 197 197 -115
1656 -115 6 334 145 -177 61 303 11 -218 213 277 -200 -249 228 23 -351 -146 240 -36 -430 -22 262
1677 262 -155 -370 131 240 -269 -135 304 162 -196 24 327 16 -169 182 237 -48 -37 196 112 -86 -43
$$ packed form
1530G11j66j093K73R84l88r66M71Q19o29o95O90O16q84m41R79K20j097l6J142
1549E10l1j156J80J156k80j096M97R98n45p89N65P58o77o06O92M07p05l31P36
1568B83J43o11j08N49j6o27R1M60p9m13J28L13o5l54R4M33p3m57J98M09n0m92
1590b44K08M86k84m88M05M29m51l92M18L10m59l18N52K00o41j35O37j8o94J97
1610b82O75l88n77M87N68o13m13P21K16n71r8O46j3n66J41M35j67l98K16K82l02
1631ak35K95Q9k68k4K37k3k50L4J83j39k5J06j5n7J26j7q5R1J09k07m7L20%l12
1656a15J21L28j89l22K38K42k92k29M31O4m77m9M77k05l74K05L86k76l94M08K84
1677B62m17k15N01J09n09J34M39j42l58K20L03l11j85L51N5k85J1K33q4j98M3
$$ plain form
1698 -43 48 35 -35 -23 -47 -121 -23 14 -179 -95 102 -21 -199 -1 126 -109 -84 208 114 -174 -11 332 52 -180
1722 -180 171 328 -52 -178 232 269 -196 -156 249 115 -290 -97 217 -80 -329 48 191 -267 -298 143 129
1743 129 -254 -94 227 -13 -198 38 193 0 -9 197 94 -35 42 236 32 -115 104 199 -83 -40 69 -14
1765 -14 -140 36 -30 -184 -56 134 -88 -285 2 176 -126 -230 134 166 -122 -101 247 70 -145 103 318
1786 318 -74 -145 222 216 -193 -131 271 148 -228 -32 213 -77 -257 -9 103 -162 -164 99 -36 -246 -37 133
1808 133 -80 -111 59 137 -151 43 203 40 -105 104 139 -39 28 224 118 -177 19 219 -82 -164 125 98
1830 98 -215 -208 138 -65 -339 -24 191 -170 -267 139 235 -213 -191 243 197 -192 -11 360 82 -217 100 285
1852 285 -34 -116 218 192 -173 -15 234 63 -237 -17 104 -130 -215 25 88 -180 -81 36 -63 -101 -45 32 -65
$$ packed form
1698d3R1j3p0J2k4p4R8L7j93Q4J97j23j78J98J27k35K5K92r4k88J63L43k80k32
1722a80L51J57l80j26M10L7m65M0M05j34m05J93L14k97k49L77J43m58l1M41j4
1743A29l83J60L21k40j85K36J55j93rK06j03j29P7J94k04j47K19R5k82M3J09q3
1765a4j26J76o6j54J28J90k22j97K87J74l02j04L64L2k88K1L48j77k15K48K15
1786C18l92p1L67om09O2M02j23l76J96K45k90j80K48J12k65kK63j35k10K09J70
1808A33k13l1J70P8k88J94J60j63j45K09L5j78O7J96j06k95J96K00l01q2K89k7
1830I8l13PL46k03k74L15K15l61r7M06R6m48K2M34m6l89J81L71k78k99L17J85
1852B85l19q2L34k6l65J58K49j71l00K20J21k34q5K40O3k68R9J17r9l8N6P7r7
$$ plain form
1875 -65 4 53 -47 1 168 85 -99 34 213 -7 -134 93 216 -138 -164 287 96 -288 -95 211 -50 -373
1897 -373 -17 275 -233 -333 161 237 -239 -229 300 163 -292 -115 396 79 -204 85 362 12 -220 126 261
1918 261 -91 -220 183 180 -157 -137 126 43 -186 -145 116 -40 -159 -81 5 -39 -111 -56 26 82 -100 -86 133 157 -40
1943 -40 -91 192 196 -166 -59 212 169 -212 -84 254 69 -220 -112 243 -93 -359 6 212 -220 -352 150 178
1965 178 -298 -275 217 181 -336 -168 303 105 -297 47 368 18 -283 153 326 -54 -203 173 254 -107 -202
1986 -202 115 148 -172 -146 90 44 -185 -143 71 -1 -170 -99 51 5 -127 -136 104 104 -137 -37 156 84 -137 12
2010 12 211 113 -120 69 298 67 -160 47 203 -47 -230 106 208 -161 -265 128 134 -287 -208 202 106 -253
2032 -253 -77 239 80 -268 49 328 8 -213 150 280 -89 -118 176 187 -79 -105 138 191 -148 -106 114 24
$$ packed form
1875f5O9M9j00M8J67q3j84J33J79k20j27K27J23l54k6M51j91l84J93L06k61l23
1897c73L56K92n08j00M94P6m76J0N29j37m55J77N11l17k83K89K77l50k32L46J35
1918B61l52j29M03ll37K0K63q3k29M1K61j56j19P8Q6m4p2N5Q2N6j82J4K19K4j97
1943d0n1K83Ml62J07K71m3l81J28L38j85k89J08L55l36k66L65K06m32j32N02K8
1965A78m76K3M92l6n17J68M71j98m02L44L21l50l01M36J73l80j49L76Q1l61r5
1986b02L17L3l20K6K36m6k29M2K14p2j69P1J50m6j32rK40%k41J00J93p2k21J49
2010A2J99r8k33J89K29k31k27K07J56k50j83L36J02l69j04L93Om21P9M10r6l59
2032b53J76L16j59l48L17K79l20k21L63J30l69k9K94J1k66k6K43N3l39M2K20r0
$$ plain form
2054 24 -151 -33 49 -65 -172 -71 59 -30 -67 -18 70 -7 -69 -4 67 60 -29 21 109 58 -22 18 165 105 -138 9
2080 9 182 8 -194 -13 171 -120 -250 76 93 -189 -159 116 65 -269 -85 194 -3 -194 104 228 -72 -96
2102 -96 159 211 -76 -83 271 110 -75 22 150 43 -93 52 158 -18 -38 67 51 -94 -24 22 -100 -82 4 -61
2126 -61 -24 -17 -6 -50 1 101 3 -101 61 101 -71 -60 175 103 -115 -25 257 81 -134 14 238 -61 -195 140
2150 140 133 -205 -208 145 43 -243 -142 262 -41 -287 32 204 -58 -173 129 139 -91 -37 166 58 -74 54
2172 54 136 3 -57 70 85 -77 -45 1 2 -81 49 -1 -121 -19 51 -85 -134 69 16 -144 -13 85 -50 -81 87
2197 87 102 -55 -73 228 151 -146 -36 233 76 -153 89 235 -32 -196 130 176 -207 -125 170 50 -205 -67
2219 -67 140 -68 -234 32 104 -145 -126 139 69 -84 -18 143 11 -84 84 113 -7 -15 141 63 -74 74 110 -50
$$ packed form
2054B4j75J18Q2j14j07J01J30q9l7M9Q8p7o2O5P1pq9N0Q8n1q0M0J47o0k43J47
2080IJ73j74k02J81J84k91j30L26J7k82L0K75n1l34J84K79j97j91K98J24l00k4
2102i6K55N2k87pL54j61j85R7J28j07j36J45J06j76k0J05j6j45P0M6j22J8Q6o5
2126f1L7PJ1m4N1J00r8j04J62M0j72J1K35p2k18R0K82j76k15J48K24k99j34L35
2150A40pl38lL53j02k86J01M04l03k46L19J72k62j15L02J0k30N4K03j08j32J28
2172E4Q2j33o0J27J5j62L2M6Jq3J30n0j20J02P0j36m9K03n3j60J31R8j35l1J68
2197H7J5j57j8L01p7k97J10K69j57k29K42J46k67j64L26M6l83Q2K95j20k55J38
2219f7K07k08j66K66P2k49J9K65p0j53O6J61j32r5J68K9j20qJ56p8j37J48L6j60
$$ plain form
2243 -50 23 18 -39 -127 -44 73 -79 -139 76 1 -155 -109 70 -68 -187 64 86 -61 -54 185 106 -95 5 240 35
2268 35 -124 66 165 -59 -115 124 68 -122 -85 83 -41 -149 30 57 -120 -154 40 51 -115 -76 74 -58 -66 24
2292 24 67 -52 -21 106 86 -64 30 76 28 -74 79 105 -29 -25 99 16 -109 46 88 -65 -42 40 10 -99 -81
2317 -81 124 -98 -161 33 126 -98 -73 138 54 -117 5 128 -13 -101 94 133 -52 -32 133 118 -45 -25 119
2340 119 -8 -77 -19 53 -91 -104 -16 -37 -121 -26 29 -28 -108 8 73 -52 19 24 42 -12 49 98 -24 54 107 12 -12 95
2368 95 96 2 -68 95 -8 -115 -4 71 -88 -123 2 45 -100 -147 57 101 -138 -116 118 35 -134 9 177 -33
2392 -33 -80 120 142 -66 -5 140 79 -87 -14 200 -9 -119 -49 105 -22 -133 -33 22 -29 -14 -58 -32 -62 -9 -37
2417 -37 -22 -9 -64 -36 13 1 -28 0 103 122 -22 33 109 74 -95 20 139 -23 -99 44 25 -88 -112 119 34 -173
$$ packed form
2243e0P3nn7q8Q3J17j52o0K15p5j56M6J79j38j19K51K2j47PK39p9k01J00K35k05
2268C5j59J90R9k24n6K39n6j90L7J68j24j08J79K7j77l4J94J1j66L9J50j32qR0
2292B4M3j19L1J27k0j50R4M6m8j02J53K6j34MJ24q3j25J55M2j53K3Q2l0j09J8
2317h1K05k22o3J94R3k24K5K11q4j71J22J23j41q8J95L9j85K0J65j5j63K0J44
2340A19j27o9N8P2j44j3Q8k1q4R5N5n7q0J16O5j25P1NJ8n4O1M9j22P8N3r5k4J07
2368I5Jr4p0J63j03j07J11P5j59l5J25M3j45m7K04M4k39K2K34q3j69J43J68k10
2392c3m7K00K2k08O1J45o1j66P3K14k09j10P0J54j27j11J00N5n1J5m4K6l0N3k8
2417c7J5J3n5K8M9j2k9K8J03J9j44N5P6l5j69J15J19j62p6J43j9j13k4K31q5k07
$$ plain form
2443 -173 -122 89 10 -154 -68 148 -9 -172 38 129 -31 -63 123 103 -67 -68 161 110 -69 22 184 49 -17 1
2467 1 65 22 -77 22 85 -39 -53 -30 64 -82 -82 7 -31 -45 -46 -1 83 -6 -42 89 121 81 -15 23 107 44 -72 50 77
2496 77 -18 -55 87 65 -99 -64 92 35 -165 -60 106 -80 -156 -19 118 -70 -154 61 76 -83 -78 92 47 -62
2520 -62 13 138 35 -46 19 120 49 -56 12 76 21 -44 48 23 12 -29 -24 -26 -70 -46 6 -41 -22 -13 10 -7 5 5 11 34 -8
2551 -8 -33 2 66 71 -17 35 104 22 -34 31 111 16 -86 53 14 -82 -18 38 -48 -120 -63 47 -112 -55 29 30 -62 -54 -3 -3 6
2582 6 5 83 7 39 84 -30 31 9 43 55 -32 35 8 -33 -21 12 -17 -65 -15 -11 -91 -59 19 -32 -92 -55 56 17 -77 -6 101
2613 101 14 -29 78 140 7 -17 107 42 -7 9 88 30 12 25 90 92 -18 6 22 4 -71 -12 -8 -37 -60 -41 -56 -60 2
2642 2 16 -16 -41 -14 -1 42 36 4 88 87 51 -21 27 88 20 -65 7 119 23 -49 83 25 -92 -67 75 7 -165 -39 86
$$ packed form
2443a73N1K11p9j64Q6K16j57j63K10R1j60l2J86k0j70jK29n1j79R1J62j35o6J8
2467AO4m3r9R9O3j24j4K3R4j46%Q9l8j4jM5Q4q9l6J31L2m0r6L8Q4o3j16J22K7
2496G7r5l7J42k2j64L5J56n7k00J05J66j86p6J37J37j88q4K15J5j59NJ70m5j09
2520f2P5J25j03q1O5J01p1j05O8O4n5o5R2k5j1m1Nkm4K4N2m7J9RK3j7J2%OK3m2
2551hk5L5O4Nq8N2O9q2n6O5Q0r5j02J39l9r6O4N6q6p2N7J10j59N7Q4Jr2QN1%R
2582FjP8p6L2M5j14O1k2L4J2q7O7k7m1J2L3k9m8N0Mq0L2P8n1o0L7J11l9r4P1J07
2613A01q7m3J07O2j33k4J24o5m9J6P9n8j8J3O5Kj10K4J6j8p5N9Mk9k3J9j5mO2
2642BJ4l2k5K7J3M3ol2Q4jl6p2M8O1o8q5P2J12r6p2J32n8j17K5J42o8j72J26J25
$$ plain form
2671 86 -13 -162 26 78 -83 -94 79 45 -107 -57 48 40 -44 -40 108 54 -29 28 139 -44 -89 13 41 -8 -70 14
2697 14 18 2 -52 28 27 -40 -29 1 -16 -72 -75 1 -13 9 14 34 109 -41 -5 46 89 -29 -30 89 98 -18 -54 87 89 -83 -33
2728 -33 66 12 -108 -44 45 -112 -127 25 94 -77 -100 76 55 -96 -81 90 53 -46 -8 128 40 3 47 110 63 -20
2754 -20 89 63 -11 -55 71 21 -36 38 4 -42 -64 -84 -14 43 8 -34 17 10 44 -44 18 -2 -17 -7 -9 37 -21 27 69 111
2784 111 -27 -30 75 36 -64 -14 72 36 -71 35 74 7 -72 38 39 -145 -43 66 -19 -97 -2 26 -54 -114 17 85
2810 85 -25 -29 79 -15 15 16 61 6 16 38 30 22 -39 16 58 -24 -84 46 13 6 -52 3 -5 -23 -25 -3 26 41 64 -13 55 48 -15
2843 -15 38 40 36 -41 46 102 43 -55 41 101 -43 -38 31 -8 -154 -57 72 -23 -106 -31 50 37 -73 -9 28 -3 -68 22 34 -22
2873 -22 16 111 50 36 10 99 36 -20 -3 45 9 -13 -42 23 32 -50 -23 -16 -81 -49 -11 -1 -5 -60 -51 33 -31 -67 14 31 33 -63 50
$$ packed form
2671H6r9j49J88N2j61j1J73l4j52N0J05qq4MJ48n4q3N7J11j83m5J02K8m9o2Q4
2697A4Mj6n4Q0jo7J1L0j7n6lP6j4K2NK0P5j50L6N1M3j18jJ19Rj16l6J41Kj72N0
2728c3R9n4j20O4Q9j57j5J52O9j71k3J76k1j51J5J71l7r9L8J36q8l7M4O3m7q3
2754b0J09k6p4m4J26n0n7P4l4m6k2k0P0N7l5m2N1pL4q8O2k0j5J0kM6n8M8M2M2
2784A11j38lJ05l9j00N0Q6l6j07J06L9o7p9J10Jj84J02J09q5p8R5K8q0o0J31O8
2810H5j10mJ08r4L0JM5n5J0K2qqo1N5M2q2o0J30l3pn8N5qj8kK2K9J5K3p7O8po3
2843a5N3Kmp7Q7N6n9r8R6O0j44NO9l9j46R7J29r5q3P5Q1j3j10O4L7l1o5R0J2n6
2873b2L8R5o1j4k6Q9o3n6J7M8l6k2k9O5Rq2K7Po5L2L8J0mn5RQ4o4l6Q1J7Kr6J13
$$ plain form
2906 50 57 -10 -21 69 51 1 1 51 18 -51 -81 94 70 -85 -48 93 -31 -112 -37 82 -67 -103 42 49 -84 -80 61 41
2934 41 -72 -4 86 4 -66 31 82 71 -33 -4 112 7 -44 18 51 -18 -42 35 60 -48 -44 46 98 -26 -82 25 40
2961 40 -59 -10 90 59 -21 6 1 55 -48 11 82 62 -27 -25 82 1 -61 -32 73 -5 -119 -18 76 -42 -97 10 64
2988 64 -63 -91 -6 33 -77 -41 59 5 -61 -9 71 49 -39 42 127 45 -1 46 76 -19 -55 41 65 -21 -52 63 24 -65
3016 -65 -10 26 -36 8 -31 6 -1 -17 -36 -3 12 -51 -59 -20 8 -23 54 11 -11 14 23 -27 34 -8 54 106 25 5 -11 -9 -4 -9 48
3049 48 22 -4 -40 12 -2 -6 -11 58 -30 -93 -11 6 15 6 19 -49 -21 24 -25 -17 65 7 -12 -21 33 63 -17 13 45 17 21 -25 5 -4
3083 -4 -25 -41 -10 4 -19 -34 -41 26 -86 -22 -30 0 22 40 73 54 73 -13 45 28 58 2 -8 -21 50 57 -15 -34 -31 28 32 39 8
3116 8 -17 7 -8 -23 -35 -15 -6 -50 -1 47 -11 41 76 16 34 20 85 -19 -36 66 100 -1 -14 53 35 -57 -22 43 52 -51
$$ packed form
2906E0Po7j1R0j8n0%N0l3o9l0J75k4j55L7J41j24q1P5J19j49l6J45Pj33MJ41k0
2934D1j13O8R0q2p0R7N1j1j04K9J16j05n1O2L3o9k4P7K5j08MR0N2j24n6J07J5
2961D0r9M9J00l1q0K7nN4j03N9P1k0q9KJ07q1o2K9J05p8j14J01R4j18n5J07N4
2988F4j27k8Q5L9j10L6J00n4o6N2Q0k2q8Q1Q5q2m6M7L0r5l6R6K4q6l1J15l9q9
3016f5N5L6o2M4l9L7pj6j9L3J5o3qL9K8l1P7m3k2K5Rn0O1m2O2N2q1k0j6KNnN7
3049D8k6k6l6N2j4mnO9q8o3Q2J7RrJ3o8K8M5m9QQ2n8j9rN4L0q0L0L2k8Mm6L0r
3083dk1j6L1J4k3j5pO7j12O4qL0K2J8L3j9J9q6N8j7L0n6j0j3P1Pp2j9LN9MPl1
3116Hk5K4j5j5j2K0Rm4M9M8n8N2L5o0J8j4O5j04j7J02L4j01j3O7j8r2L5O5Rj03
$$ plain form
3146 -51 1 -8 -54 -76 -10 40 -39 -62 -7 -18 -53 16 2 -5 6 -10 20 38 8 -19 67 22 27 16 28 41 30 47 25 29 -36 -1
3178 -1 11 -27 -28 -40 4 -3 -10 -15 58 11 6 -10 -7 50 -87 40 20 17 -39 75 42 -48 9 83 16 -62 -33 98 49 -43 -39 69
3210 69 39 -101 45 -8 -5 -42 -23 31 -21 -25 -8 -3 -44 20 7 -31 20 49 60 -26 5 39 26 7 -26 40 15 -26 28 -33 -8
3241 -8 9 -5 -19 26 26 -23 -53 33 30 -52 8 40 -41 -3 1 -2 3 -23 6 -14 -3 0 38 -26 19 64 30 -1 -29 45 70 -22 -26 13
3275 13 -2 -63 -29 -28 18 -80 -35 41 -57 7 -39 41 3 -24 16 29 9 -2 20 16 25 45 34 12 6 30 -1 -3 98 24 -13 45
3307 45 -46 -10 -48 29 -24 -85 1 41 -45 -78 41 -7 18 -53 16 83 12 27 101 38 -19 73 34 -26 -7 78 10 -56 -33 24
3337 24 15 -64 -33 -5 -60 -109 6 -28 -74 -60 -13 -8 -21 23 26 5 -57 29 78 4 -49 36 21 14 21 35 -29 16 -27 -43 -7 1 27
3370 27 12 -33 -11 -36 -80 10 47 -61 24 86 33 -27 -10 42 -46 -5 61 59 -27 -39 32 84 -38 -22 81 50 -68 -24 56
$$ packed form
3146e1N2rm6k2O6N0p9k3N5j1l5O9j4pJ1j6L0J8l0k7Q6m5Nj1J2J3j1J7k2Mo5L5
3178aJ2l8jj2M4ppnP3m7nj6LN7j37J27k0ln6J14l3r0N7P4o7p8K9J31m9r2MJ08
3210F9l0j40J46n3Ll7J9N4n2mJ7Nm1O4j3l8N1K9J1q6L1L4j3j9l3O6k5m1N4o1K5
3241hJ7j4j4M5%m9l0Q6lq2O0L2q1L8MlNk6K9k0J1LL8o4M5M5l4l1k8P4K5r2mL9
3275A3j5o1L4JM6r8M5P6r8O4m6Q0l8k7M0J3k0j1K2mRK0j1k2oK4l1kJ01p4l7N8
3307D5r1L6l8P7n3o1Q6M0q6l3J19m8K5p1O9O7p1J5P4o3n7R2l9o0J9Q5o8o6K3N7
3337B4rp9L1K8n5m9J15l4m6J4M7Nj3M4Lk1o2Q6M9p4n3Q5j5pPJ4o4M5m3j6L6QK6
3370B7j5m5K2k5m4R0L7j08Q5O2n3o0J7N2q8M1O6kq6j2P1N2j22J6J03l1j18M4Q0
$$ plain form
3399 56 -1 -40 -35 48 10 -34 49 50 -38 18 53 -6 -34 13 28 31 -9 -11 77 -11 9 7 35 41 -8 17 23 74 -52 -4 4 13 35 19
3433 19 -10 -37 2 -62 50 44 -54 -11 12 -11 -55 -31 1 -40 -21 3 54 -26 -14 67 5 -9 -1 115 77 -47 37 63 -36 -59
3463 -59 39 39 -18 0 7 8 28 -53 5 -30 -43 34 53 -37 -36 -9 -19 -72 -50 -13 20 73 19 47 38 6 55 21 -36 -5 -38 -2 17
3496 17 31 -54 14 39 -46 -49 25 -6 -59 -85 26 -17 5 -61 23 10 -5 -5 35 18 -13 18 53 31 -23 -12 40 11 -23 27 21
3527 21 -2 -25 -6 -9 10 -20 -26 -70 -6 22 -17 26 -1 15 35 38 -30 4 49 -4 38 22 15 27 -38 15 8 -13 28 39 -11 -14 31
3560 31 -5 -15 -14 35 39 17 18 8 37 4 -66 -23 -14 32 -17 10 -43 3 22 -55 38 -3 17 22 35 12 -30 12 20 35 44 -6 17 19
3594 19 -43 -6 29 -7 -60 -8 -43 -9 32 -1 -9 21 34 19 32 5 74 32 -20 6 84 -16 -14 29 19 34 -16 30 20 2 -32
3625 -32 9 -37 -13 10 15 -15 -68 6 -7 -21 -27 6 -26 -30 2 17 12 -4 0 6 -11 70 5 15 3 15 40 19 33 53 -36 17 24 13
$$ packed form
3399E6n7l9NQ3l8m4Q3Jq8N6L5n9k8M7J5Lm0kQ8q8K0kK8Om9K5ON1j26M8QRK2j6
3433A9k9k7L9o4J12or8M3K3k3m4K4L2m1J9K4N1q0J2Q1o2j4QJ16l8j24Q4K6r9k3
3463e9R8%n7J8PJK0q1N8l5j3P7J9r0JK7j0n3K2L7L3N3n4K8rl2M9l4n7L1l3L6J9
3496A7J4q5O8K5q5lP4l1n3k6J11m3K2o6Q4j3j5%M0j7l1L1L5k2n4J1N2k9l4N0o
3527B1k3k3J9lJ9l0om4O4K8l9M3k7J6K0Lo8L4M5n3M2j6pJ2o5N3pk1M1J1n0lM5
3560C1l6j0JM9Mk2Jj0K9l3p0M3RM6m9K7n3M6J9p7R3m1K0NJ3k3m2M2QJ5Rn0K3K
3594A9o2L7L5l6n3N2l5L4M1l3qL0J3j5J3k7O9m2n2K6P8j00KM3j0J5n0M6j0j8l4
3625c2M1m6K4K3Nl0n3P4j3j4oL3l2mL2J5nj6MOj7Q1o5J0j2J2K5k1J4K0q9N3Pj1
$$ plain form
3659 13 0 -4 -7 -32 -7 -8 58 -5 -4 4 -42 -60 -20 39 -21 -73 26 43 -17 23 55 26 -12 31 23 57 18 -4 52 6 -7 -5 -42 -20
3693 -20 12 31 42 -14 -9 -2 3 3 -25 20 -38 -8 17 -10 50 32 -24 20 13 58 20 50 26 10 -29 11 68 16 23 27 0 -5 1 -27 -56
3728 -56 48 27 72 -25 -70 -19 54 33 -40 2 -3 -48 4 46 8 -27 -9 49 -26 11 49 -6 -16 5 60 -13 -50 -24 -14 -27
3758 -27 -67 -25 -19 -7 -37 -5 -13 11 -4 29 -3 -20 8 10 -9 25 33 19 -34 12 73 -67 1 68 41 45 21 -6 -34 -4 -11 5 -16
3791 -16 -44 -27 -16 -42 -39 0 -21 -5 -6 52 10 -20 33 35 14 93 80 4 52 25 41 15 11 29 34 36 -1 13 -11 -37 -25 39 16
3824 16 -37 58 78 5 -17 8 -7 3 58 -18 30 26 28 -19 25 10 7 4 -3 -39 73 34 62 90 -32 -19 -5 0 12 -35 -6 24
3856 24 35 0 13 -47 22 -22 -11 4 33 28 37 -14 -1 27 24 17 22 -3 -3 -4 32 -5 -14 -23 19 -21 -73 105 -14 -16 -51 3 -16 -41
3890 -41 12 -15 -54 -5 38 -35 27 69 -20 1 1 -2 52 57 38 -14 24 35 -14 -57 72 26 -36 -5 -23 -24 20 53 16 5 -18 -35
$$ packed form
3659A3j3mlk5K5jO6o3JQm6j8M0N9o0n2R9J7o0M0L2k9l8M3qL4l9k2N6m6j3Kl7K2
3693b0L2J9J1n6NPN%k8M5n8L0K5k7O0j8n6M4pM5l8L0k4j6l9M0N7n2PMk7nOk8k9
3728e6J04k1M5r7m5N1P3k1p3M2nm5N2M2l8l5J8N8p5L7L8n5j0K1N5p3l7K6J0j3
3758b7m0M2OJ2l0L2qK4j5L3l2j7K8Kj9L4Qj4n3M6O1j40O8O7k7Mk4k7k8L0pJ6k1
3791a6k8J7J1k6LL9k1J6jN8m2l0N3Kk1P9j3p6M8k7J6k6mJ8NKl7J4k4k6J2O4k3
3824A6n3R5K0p3k2K5j5J0N5p6M8mKm7M4j5llpl6J12l9K8K8j22J3J4NJ2m7K9L0
3856B4J1l5J3o0O9m4J1J5K9nRn1J3K8lpNk5%jL6l7rrM2m0n2J78j19kl5N4j9k5
3890d1N3k7l9M9M3p3O2M2q9K1%lN4Nj9n2L8J1m9m3J29m6o2L1j8jM4L3l7j1k3j7
$$ plain form
3922 -35 -88 -10 -33 -23 -21 21 -18 35 19 -8 -32 33 -22 21 66 26 34 45 -24 51 34 -14 -11 40 10 -22 -9 -3 -12 -26 8 15 0
3955 0 -23 -29 43 -11 5 35 2 3 12 9 6 5 14 -26 50 63 -34 35 41 30 -34 35 58 -10 25 -39 -8 -62 -35 22 -6 -10 -27 4 -2 58
3991 58 -43 -7 -4 -11 -8 11 7 33 20 45 -23 -46 21 11 -16 25 10 7 -15 7 53 -16 2 -21 11 -18 -21 -32 65 28 -29 -7 26
4024 26 -18 -2 39 34 55 -15 15 1 15 -6 43 2 20 -50 37 -8 -1 -3 32 -29 -14 18 13 -11 17 -14 19 12 0 30 29 39 8
4057 8 -38 54 -30 -42 14 43 30 -15 60 25 -14 36 11 14 34 12 10 48 -2 -3 10 -22 -33 27 -13 9 -27 -12 -13 -52 -9 -18 19
4090 19 32 3 -12 -21 32 8 28 -50 14 51 -18 20 -20 19 54 61 -5 7 3 6 -37 -7 62 3 -6 -32 1 17 -6 -53 -5 63 29
4123 29 -12 27 2 -38 4 15 31 52 30 -13 62 6 -28 -13 84 -43 -17 -5 -49 20 -18 25 -23 -11 -40 42 27 -34 -4 45
4153 45 11 -21 1 40 57 2 -23 58 -27 6 -26 -17 7 27 33 -26 48 41 29 6 -47 -26 -6 -46 10 -54 43 -34 -66 -36 -19 -17
$$ packed form
3922c5n3P8k3J0KM2l9N3j6k7k4O5n5M3M5m0QJ1o9P5j7m8LN1l0l2J3Orj4L4Pj5
3955@k3oP2n4J6L0l3JRlljRm0P6J3r7O9Oj1o4O9K3o8L5o4L1n4K7N7k8mj7L1oO0
3991E8j01L6LpLJ9mK6j3K5o8k3O7j0k7M1j5lk2K2M6o9J8k3L2k9lj1R7l7n7K2L3
4024B6m4J6M1nK1p0L0j4J4k1M9m1J8p0Q7m5PkL5o1J5L2nk4K8l1L3pj2L0jJ0l1
4057Hm6R2q4j2N6K9j3m5P5l5l9N0k5LK0k2kL8n0jJ3l2j1O0m0K2l6J5jl9M3rL7
4090A9J3k9j5rN3k4K0p8O4L7o9L8m0L9L5Po6J2mLm3L0O9n9rk6L3J6k3m7M8O8l4
4123B9m1L9k5m0M2J1J6K1k2m3P5n6l4J5R7j27K6J2m4O9l8M3m8J2k9Q2j5o1L0M9
4153D5l4l2K2L9J7n5k5Q1q5L3l2RK4K0On9P4pj2k3n3K1K0m0N6o4R7p7l2L0J7K
$$ plain form
4185 -17 18 35 4 -27 19 -6 -19 6 -3 15 28 58 -9 10 68 11 -6 24 58 -20 25 4 -11 -24 -18 -17 12 -30 27 13 0 18
4217 18 -28 1 -12 -7 5 -33 -9 32 37 13 24 35 1 30 24 -36 -6 -40 11 28 -23 -4 38 -9 9 -17 -5 -1 11 28 -8 51
4249 51 -22 29 -26 31 -57 12 22 -22 27 19 9 -42 -6 -15 -51 -17 -7 32 -44 -16 16 -21 -16 21 -24 -35 -41 -15 -29 13 64 4
4281 4 -28 34 27 -1 -3 -6 44 11 27 -8 4 -59 21 35 2 8 -46 -41 -19 0 -9 -8 -42 -31 -16 -30 44 0 8 -11 30 24 29 -29 47 17
4317 17 -22 -38 61 11 2 23 54 20 -18 -20 -28 -16 31 -2 46 -24 -10 9 -1 -12 26 0 -17 -32 -30 -23 -30 21 -31 -25 -41 44 3 -26
4351 -26 -26 -36 -28 19 11 35 13 -13 39 9 -13 8 3 28 4 14 -23 -42 -7 9 4 -7 7 66 -48 2 6 -3 19 -12 42 66 38
4384 38 36 44 -24 7 1 -12 -47 31 4 15 -6 -38 -22 -52 19 -23 9 -24 5 -28 14 -53 -20 -24 -20 -14 16 47 2 -12 2 45 -21
4417 -21 5 -19 -36 7 -8 20 -25 -8 -37 -52 -4 -13 6 10 33 -44 -24 -15 4 5 -17 -22 7 -13 -10 -14 21 -40 21 36 -12 -7 28 -8
$$ packed form
4185a7L5J7l1l1M6k5j3K5rJ8J3L0o7J9N8n7j7L0L4p8M5k1j5j3OJK9m2N7j4j3J8
4217A8m6K9j3NJ2l8K4M1Nk4J1J1l4K9oo0L0l4N1J7n1J9M2m7J8k6J2MJ2J7l6N9
4249E1p3N1n5N7q8O9J0m4M9qj0n1L6rl6L4J0L9p6K8L2l7NL7m5j1oK6j4M2N1o0
4281Dl2O2pk8klN0l3J6l5J2o3Q0J4l3On4NK2J9rJl4J1J5j4P4m4Qj9M1oNn8P6l0
4317A7l9j6R9n0rK1L1l4l8kqJ2M7l3M8p0J4J9j0j1L8k6j7j5KPpN1n2Oj6Q5m1k9
4351b6%j0QM7qK4k2k6N2l0k2K1nK5k4J0l7j9L5J6nj1J4N9j14N0MrK2l1N4K4k8
4384C8kQo8L1oj3l5P8k7J1k1l2J6l0P1m2L2l3K9l3M2o7L3mMOL0L1m5j4J4M3o6
4417b1K6k4j7M3j5K8m5J7k9j5M8rJ9MK3p7K0RJ9Jk2nK9k0LmL5o1O1J5m8NL5l6
$$ plain form
4451 -8 34 3 19 15 13 -6 27 8 -27 -18 -6 69 64 4 23 -27 10 15 -20 8 -44 25 43 -44 32 -21 -30 -38 -16 -27 31 40 12 -9 25
4486 25 22 -46 3 -2 6 -13 35 -8 7 -9 -5 29 -2 -42 29 38 16 -49 39 -46 -23 -26 49 29 5 -7 -13 0 38 -9 -42 13 -55 11
4520 11 -40 8 13 -49 -35 -66 -33 -2 -19 3 21 -20 -22 -2 40 -60 52 -29 27 28 63 30 54 13 17 14 -1 10 13 12 71 -6 37
4553 37 -22 -3 0 -12 26 -11 -46 16 27 -52 -18 -6 -11 -18 2 -17 16 4 0 35 4 24 -5 24 8 10 -69 19 13 39 0 -2 18 28
4587 28 -30 14 -11 -33 7 5 23 19 12 27 31 -32 -33 -16 4 -17 -11 -7 -46 68 38 -4 35 -7 -11 -12 -26 -36 -27 14 11 -12 -1 -10 2 -8
4623 -8 -10 -16 -42 4 -23 1 -13 -31 15 25 96 -9 -21 14 20 24 8 -3 32 19 9 -7 30 5 5 -9 -23 16 32 -33 -7 -9 -30
4656 -30 -36 -36 16 -40 21 -25 -2 12 23 -22 43 -49 -51 37 28 50 61 90 2 -24 16 13 -8 4 18 11 -26 27 -42 -36 18 3 23 -44
4690 -44 -18 16 2 10 7 -10 -5 -32 15 -19 -53 21 24 32 40 35 2 30 20 8 10 39 3 -9 17 -5 25 -2 17 -30 0 44 45 -40 -44
$$ packed form
4451hM2l1J6mkj9L3j9l5RJ2P5no0J9n0L7Nl5K8n2O9J8q7P6n3rqK2j1N8Rk8k1L4
4486B5lo8M9nQj9M8m3J5j6ML4l1m0P1Rk2o5Q8q5K3lP5k0k4j2oJ3L8m7l3N5o8O6
4520A1n1M8No2J4l1L3L1j7K2J8m1kK0M2j00J12q1N6JL5l3K4m1Mlj5J1LjN9p7M3
4553C7n9J9Lj2L8l7l5O2J1p9L4J2npK0j9L3j2mL5l1K0k9K9j6Kp9Q8oK6l9kK0J0
4587B8n8M4k5k2M0kJ8mpJ5Mo3jJ7K0k1OMl9J14l0m2L9m2mjj4j0RM1lk3J1rJ2j0
4623hkok6M6k7K4j4j8M6J0P1j05j2L5OMj6j1L5j3j0j6L7k5%j4j4L9J6o5K6kk1
4656c0o%N2n6O1m6K3J4J1m5O5r2kQ8rK2J1K9q8k6M0lk1J2J4pl7N3o9ON4j5K0o7
4690d4K6L4j4Qlj7Nk7M7l4l4P4LQQnl3K8j0j2KK9l6j2K6k2L0k7J9m7L0M4Jq5m
$$ plain form
4725 -44 0 2 24 -33 11 4 -11 2 2 -8 -20 11 8 -10 24 40 34 27 -2 -5 -8 8 57 -13 17 27 -36 44 11 10 36 57 -6 5 -17
4760 -17 38 -11 -29 27 8 -18 -6 37 -14 -22 6 14 9 73 -29 -33 12 -7 -33 67 20 -10 -48 -22 -40 19 8 -5 -44 -41 -37 3
4792 3 10 9 30 21 22 6 -2 0 23 -19 11 30 41 -4 65 66 -39 0 15 -33 32 -52 -3 2 -58 60 -2 7 -50 -20 -19 -27 45 27 -16
4827 -16 -28 11 37 33 -19 19 -27 76 -24 -29 23 16 -31 9 -3 -22 -6 -2 21 6 41 -15 62 3 17 -2 4 -8 0 -8 -16 -22 52 -19
4861 -19 -52 -20 -35 32 8 -3 -19 25 29 54 45 -11 44 -18 -8 -32 -3 27 0 -24 60 34 31 -70 13 -15 -46 11 47 -5 3 4
4893 4 5 17 24 -37 18 14 47 -1 27 44 7 -49 -12 25 -1 -62 11 17 -34 -13 2 -37 -5 -35 34 55 -14 2 19 45 -11 25 -3
4926 -3 2 44 39 -20 -4 32 -42 15 -1 5 10 -14 23 -2 -29 3 -41 -80 -2 -26 -17 0 -15 32 -5 96 -24 -6 14 21 -38 15 -7
4959 -7 12 51 7 15 8 20 43 18 -1 15 41 41 -19 -15 -2 21 -28 43 3 32 -10 25 38 -66 -23 -31 49 1 -7 10 60 41 41 -7
$$ packed form
4725d4M4KK2n7M4pj5J3%j0j2L1lj8L4J6opk9llJ6M9p0L0J0o3Q0l3jK6K1o3J1k2
4760a7N5m9j8N6j9k6J2M3n1qK8QnO4j02mM5j9k6J00m7l0l8K6j8N9j1j3l9LMM0
4792CPjK1rJj6qKK3m2L0J9J1m5O9Jj05L9J5m8O5q4M9No0J18o2Rn7L0JqP2j8m3
4827a6j2L9K6mn2L8m6J03j00nN2pm7M0j2j9J6MK3j5L5n6P7n9J4j9Oj2QqqoP4p1
4861a9l3L2j5O7k4j1j6M4MK5rn6N5o2J0k4K9L0k7k4Q4k6lj01Q3k8l1N7L6n2QJ
4893DJJ2Po1N5mL3m8K8J7l7n6L7L7k6o1P3On1K1J5l9L2l0O9K1o9J6J7K6n6L6k8
4926cNM2nn9J6L6p4N7j6ONk4L7k5k7L2m4l9P8k4RJ7j5M7l7J01j20J8K0Pn9N3k2
4959gJ9L9m4QpJ2K3k5j9J6K6%o0MJ3K3m9P1m0K9m2L5J3j04M3qQ0m8qJ7N0j9%m8
$$ plain form
4993 -7 6 12 -2 -12 18 23 22 -6 29 36 8 46 -3 -42 0 9 34 -16 -26 -20 28 68 8 -8 17 -19 -11 31 17 -31 5 6 13 -22 -38
5028 -38 29 18 10 28 58 -5 53 16 20 24 23 13 -24 5 -27 21 -24 35 -30 13 -25 6 -3 -16 -64 15 -47 -3 -10 35 19 15 11 47
5062 47 50 -34 -11 20 14 27 -10 -22 3 -31 35 -38 31 -5 0 -13 -4 -6 17 3 25 -21 19 2 -10 -21 23 -9 -27 26 -21 44 2
5095 2 17 18 10 14 28 36 -4 -19 -56 2 -3 -29 -12 -35 12 24 22 -5 26 -10 34 2 2 13 19 -18 26 -21 -37 18 12 -21 -15 -1 -43 42
5131 42 -17 -11 -14 53 9 20 6 -26 -15 -48 8 -2 -12 36 -7 -11 65 26 30 16 -17 20 51 37 -31 25 32 47 -20 -47 30 21 -5
5164 -5 -40 -34 -25 31 18 -8 -23 -26 -1 44 20 -13 18 -9 -33 27 -8 28 -4 27 -16 23 -22 -6 3 5 14 14 -7 -8 30 -17 -45 18 -2
5199 -2 -34 32 -10 23 -29 -4 -2 -14 -23 17 42 -20 15 -13 21 -21 4 21 24 48 -2 19 19 -92 15 8 31 -16 -31 1 31 71
5231 71 64 32 -35 -30 -48 -27 -32 33 14 12 -29 16 -61 9 8 21 14 -4 -27 19 14 16 -6 47 6 -33 -9 -30 17 7 50 56 41 -3 6
$$ packed form
4993gJ3Oj4j0L0Njk8L5Pk8L8m9l9M2RK5n0j0OM8M0o0j6K5l6QM2j4m8L6JPl5j6
5028c8O7j1qJ8L0o3N8l7MMjj0l7K9l2M8m5N9o5M3l8L1rj3m8P9o2M4pM5j6mmL6
5062D7Lq4K3L1oJ3l7j2K5l4O6p3O9l6Nj3RkK3j4K2m6M0j7j2j1M4l2j8N3m7O5m2
5095BJ5JqMJ4Qm0j5l7N8nk6J7k3M7J2kk7L1l6M4l2%J1Ol7M4m7j6N5ol3OJ4m2Q5
5131D2n9OlO7m4J1j4l2J1l3N6j0j0M8m3mP6l9Mj4l3L7L1j4o8N6PJ5o7k7P7rk6
5164el5ORN6j3k6j5lK5M5k4l3L1k7k4O0l5L6l2L1m3L9m5J6RKR%k1jL8m7k8O3k0
5199bl2O6m2L3n2K5Kj2rM0K5o2L5k8L4m2K5J7LK4n0K1%j11J07pK3m7j5L2L0M0
5231G1pl2o7Nj8K1nO5j9km1M5p7P0jJ3pj8k3M6nKk2N3m1l9K4k1M7j0M3Oj5m4R
$$ plain form
5266 6 -38 33 -34 27 -23 -25 -68 -4 -49 -27 -33 -32 -21 5 35 15 -3 3 -10 11 40 62 11 -40 -28 9 24 11 4 44 -27 -1 -7 3
5300 3 26 34 22 -24 32 -8 44 -8 -7 24 9 14 0 -1 -1 -6 5 56 -26 -2 49 39 21 -4 15 -12 -35 -24 -9 -37 40 -8 -24 51
5334 51 -10 -9 1 32 -4 6 6 -32 -9 53 48 9 -33 12 -6 83 59 -22 40 34 32 30 66 20 13 -22 -4 -18 -15 -60 -28 -12 -63 -32
5368 -32 -43 12 51 5 -54 -29 -7 -4 25 -8 49 -39 2 43 23 -25 -43 -15 46 -34 -25 60 20 -27 -8 14 5 11 -18 2 21 8
5400 8 -39 -11 16 -12 -21 6 45 -57 22 22 -13 -50 -1 -1 -30 17 4 -55 9 28 55 9 30 -11 -26 36 43 -30 39 8 8 -21 13
5433 13 -12 28 42 -2 29 -12 8 37 15 -47 19 -1 3 3 41 -70 -17 -40 -3 34 13 19 -3 -70 -24 1 31 -44 25 -29 -31 -9
5465 -9 -20 -24 -12 -15 -17 42 33 44 24 76 -8 8 -14 23 9 -28 17 -48 10 -3 -55 10 -8 -1 23 5 -43 20 -50 -6 7 14 0 -41
5499 -41 7 -26 -7 -8 -54 -1 3 -6 33 -16 -33 61 11 -25 45 -32 0 32 32 5 -3 -11 11 8 -22 -39 49 29 23 -35 14 -24 3 5 20
$$ packed form
5266Fm4P1o7O1n0km3O4m5K2oJJ1K6L0k0j8Oj3K1K9K2n1n1J2L7J5j3pM0p1K6oJ0
5300CK3Qj2m6N6m0N2n2JL1j5Nj4j%nJ1N1q2K4N1j0j8k5J9k7k3J1J5k8P7m8j6P5
5334E1o1JJ0L1l6J0%l8K3O2nl9m2M5j8Q9k4q1O2okkL6m6pl5J8j4Lm5L2J6n1L1
5368c2j1N5L9m6n9K5K2LK9l3N7q8M1M1k0m8j8K8O1q0RQ5m0m7J9K2rOk9K0J9j3
5400Hm7K8K7k8rK7L9j02P9%l5l7M9%k9M7j3n9O4J9K7m6K1m1j5O2Pp3O9l1%k9L4
5433A3k5M0J4m4L1m1K0K9k2o2O6k0M%L8j11N3k3L7L7k1Ok2o7M6K5L0p5O9n4kK2
5465ij1mJ2lkN9rJ1k0N2q4J6k2L7j4l7M5o5N8j3n2O5j8PK4j8m8O3p0M4J3Pj4m1
5499d1M8l3J9jm6N3MrL9m9j7R4n0l6P0p7L2L2%k7qqK2ll0j7Q8k0on8M9l8K7KJ5
$$ plain form
5534 20 32 12 72 11 23 -25 29 -10 21 -10 -6 33 -9 -53 2 4 47 34 20 -10 7 -33 12 30 12 11 -59 40 -21 50 20 35
5566 35 -30 11 -11 -19 -8 6 29 -39 21 -11 19 67 -9 28 -3 1 25 -17 -67 9 -28 -20 39 24 43 -8 -33 -23 31 7 15 1
5598 1 33 10 34 50 -35 13 -62 35 21 11 55 20 35 36 42 -44 24 -14 -65 -8 -18 3 4 -33 12 39 -15 -49 -6 -44 41 22
5630 22 -8 51 -43 -16 -51 10 38 52 -8 18 -24 15 -21 -18 13 14 -21 -6 -29 -17 11 26 13 13 -15 47 -24 -8 9 48 -4 9
5662 9 33 -9 13 -8 4 52 -28 21 -22 3 1 40 29 6 -11 21 -9 23 -31 38 36 -14 -27 0 21 -26 -5 41 31 8 -15 -12
5694 -12 -4 -14 47 10 9 -23 -30 20 1 13 -1 21 41 -12 -45 35 5 50 9 1 -36 -21 15 -19 -18 -1 -28 -35 -19 2 -11 50 3
5727 3 -45 14 15 44 63 24 29 26 68 30 0 28 -17 -41 2 21 -23 -17 -40 18 36 -15 4 -3 3 -10 22 -34 -30 12 -28 20 -8 33
5761 33 6 27 -48 -3 -8 -4 -7 -28 20 -8 35 7 11 34 -1 10 1 9 -49 -45 19 29 0 -40 4 47 13 11 -5 25 -7 2 -58 28 -7
$$ packed form
5534B0J2k0O0o1J2m8N4l9L1l1ML9m2m4N5KM3j3j4l0J7m0M5J8j8jp0R9o1P1l0J5
5566C5o5M1k2qJ1J4K3o8O0l2L0M8p6L7l1MK4m2n0P6l7QN9j5J9n1k5J0N4k4Qj4
5598AL2k3K4J6q5M8p5R7j4j0M4l5J5JOq6O8l8n1N7j0K1Jl7M5K7n4l4M3l8Q5j9
5630B2l0N9r4K7l5O1K8J4o0K6m2L9l6LL1Jl5J5k3J2K8J5j3%k8O2p1J6J7L9n2J3
5662IK4m2K2k1J2M8q0M9m3K5kL9j1k3j7L2l0L2n4O9kn0j3K7K1m7K1M6j0k3k3L
5694a2Qj0O1l7jl2pN0j9J2j4K2K0n3l3Q0l0M5m1ql7J5L6l4JJ7k7pJ6K1j3O1m7
5727Cm8N9JK9J9l9NlM2l8l0K8m5k4M3J9m4Ok3N8J8n1J9pOj3L2n6MM2m0M8k8M1
5761C3k7K1p5M5nMlk1M8k8M3k8MK3l5J1rQn8MO4J0k9m0M4M3l4kj6L0l2Ro0Q6l5
$$ plain form
5796 -7 -16 25 41 16 -29 -19 43 -3 -33 14 11 -11 31 4 -12 -47 -43 9 9 31 -35 -46 29 27 -34 -23 9 44 -7 -7 -37 30 30 28 47
5831 47 14 39 12 22 -16 -25 37 52 10 -14 33 0 15 4 6 32 -35 14 -15 -10 41 -24 63 -2 0 -17 29 -23 6 -11 59 -19
5863 -19 15 -28 52 16 32 20 26 27 3 11 -5 -21 -40 6 -26 28 6 22 16 -11 -23 -21 18 -15 6 -7 9 -13 -27 -11 -39 8 -28
5896 -28 26 60 38 27 -11 8 -39 -19 -41 -11 18 58 -25 -13 -51 -8 -28 6 7 14 -1 25 -3 30 15 -27 35 -7 1 24 -7 -21
5928 -21 -5 6 15 -6 -13 1 -3 -38 16 28 11 36 -16 10 -6 7 31 31 20 13 6 2 -14 12 -16 -3 31 -15 0 -28 23 45 -49 -14
5962 -14 -47 -20 11 1 14 -33 -3 -16 -14 -31 7 11 33 9 -13 3 16 82 25 51 47 -25 26 -18 -28 -19 1 22 -9 -38 43 9
5994 9 -36 17 1 -29 16 -33 -22 -40 16 29 45 4 14 1 8 -12 -11 7 3 8 27 -16 8 8 -58 28 53 -17 35 45 -46 46 -46
6027 -46 -12 43 -4 -42 -1 -12 17 7 20 46 -3 17 -8 56 -14 30 -18 43 -25 16 24 15 0 7 -5 -1 2 -71 23 -11 -5 16 -37
$$ packed form
5796grM1J6k5m5J0O2m6l0M7lk2M2k7j6l5MN2%K2o6j1P5ko1J1L2L5n1%l0O7%kJ9
5831D7l3K5k7J0l8rO2J5m2k4M7l3J5j1KK6o7M9k9NN1o5Q7o5Kj7M6n2K9j7P0p8
5863a9L4m3Q0l6J6j2OJk4Qj6j6j9M6l2N4k2J6ok7j2KL9l3K1j3J6k2j4J6k8M7l6
5896b8N4L4k2j1l8J9m7K0k2L0K9M0q3J2l8M3k0L4JPj5K6k8L3j5m2O2m2QK3l1j4
5928b1J6J1Rk1pJ4ml5N4J2j7K5n2K6j6J3K4%j1ppmj6K6k8J3L4m6J5k8N1K2r4L5
5962a4l3K7L1j0J3m7L0j3Kj7L8MK2k4k2J6J3O6n7K6mp2N1m4j0RK0K1l1k9Q1l4
5994Im5N3j6l0M5m9J1j8N6J3J6m1J0j3Pk0JJ8mNJ9m3K4%o6Q6K5p0N2J0r1R2r2
6027d6L4N5m7l8M1j1K9j0J3K6m9K0k5O4p0M4m8O1o8M1Qrj5Pj2MLp3R4l4OK1n3
$$ plain form
6060 -37 -66 -20 -59 -27 2 17 32 -69 40 8 44 4 -52 34 -45 60 18 8 -39 13 -17 -11 -19 -26 -2 -35 24 -27 33 0
6090 0 -43 -36 -10 -16 -37 -22 -5 3 22 -58 5 31 -2 26 43 -4 -5 -12 -37 29 0 9 10 -35 8 30 -18 -16 10 18 -12 -27 20 -1 29
6125 29 61 -1 -20 -1 -26 -14 24 15 -4 -18 32 -2 -41 -3 13 -11 23 13 -53 -15 5 16 -15 27 24 -56 3 7 8 11 10 37 24
6158 24 -24 -56 2 17 17 13 51 50 -14 -37 4 -9 -20 25 5 -57 22 33 -39 -31 38 25 14 6 -2 15 -12 -4 -4 3 -18 -8 -16 -14 42 -1
6194 -1 18 34 -2 -19 11 37 51 25 -34 -17 -1 -29 1 -25 -3 59 8 47 -17 25 -6 7 34 -18 15 -38 13 11 -44 8 2 -25
6226 -25 38 -19 -31 -44 13 -29 -20 24 17 24 45 -7 -6 25 36 -25 2 64 53 0 -11 59 -15 -38 5 31 -15 34 -1 9 33 15
6258 15 -17 32 -39 32 30 14 -10 40 5 -29 -63 14 -60 -26 39 33 -5 -12 14 -36 9 26 -44 54 2 -19 22 -2 8 30 17 27
6290 27 68 -56 27 -20 -3 -25 -6 15 7 21 9 26 -17 -47 14 -10 9 -54 -47 59 -1 1 15 -24 10 -31 17 -1 -39 1 -68
$$ packed form
6060c7k9M6l9L2K9J5J5j01J09l2L6m0n6Q6p9J05m2j0m7N2l0OqpK4l3N9n1O0l3
6090@m3PK6ok1J5J7QJ9q0O3K6l3K8J7m7jpk5O6k9RJm5M3K2m8KK6Ql0j5M7k1L0
6125B9L2o2j9J9k5J2L8rj9j4N0l4l9L8J6k4L4j0o6L8K0J1l1M2lq0N9MJLjK7j3
6158B4m8l2N8J5%mL8jo4k3M1j3j1M5k0o2P9J1p2QO9j3j1qqJ7k7Q%Pk1J0qKN6m3
6194aJ9J6l6j7L0K6J4k6n9J7J6k8L0k6K2O2n1L9o4M2l1J3K7n2L3n3N1kn5N2ok7
6226b5O3n7j2j3N7m2RM4pPK1n2JL1J1o1K7O2j1n3j1P0p4k3M3K6m6M9l5J0K4j8
6258A5l2M9p1P1kj6k4N0l5l4l4P7p4L4O5ol8pK6n0M5J7p0R8n2k1M1k4J0K2j3J0
6290B7M1j24Q3m7J7k2J9K1qJ4j2J7m3l0O1k4J9o3PJ06o0KJ4l9L4m1M8j8l8M0o9
$$ plain form
6321 -68 -24 -3 29 22 -7 49 10 18 -23 -24 19 2 -3 51 46 -11 -26 -13 3 45 18 12 14 49 11 -27 29 -2 25 4 -19 -34 32 -51
6355 -51 -22 -27 -16 24 15 -6 -2 29 1 7 22 13 -21 14 44 -16 -27 -34 -29 39 18 35 27 -9 -13 -11 31 -15 6 -18 6 -27 -1 -2 -8 17
6391 17 -10 -81 -13 1 -10 5 15 6 -22 -10 -23 24 -20 20 -20 -6 20 -52 8 21 14 -2 -18 10 22 31 -17 9 14 4 -32 -12
6423 -12 -69 -39 -17 -31 -5 -21 -24 -46 -27 14 -33 9 -44 -9 -11 -1 -5 2 -9 -2 30 1 22 47 51 -6 9 -33 10 38 -71 32
6455 32 72 -23 17 43 9 101 5 -17 -12 23 47 -12 21 55 3 10 -46 -3 -5 79 23 18 -42 6 -37 -10 9 -27 21 -58 11 41
6487 41 29 6 4 -11 72 -11 74 12 43 50 20 -16 -10 -9 83 -28 48 -22 -26 40 25 12 34 -11 -41 49 63 -2 1 21 4 19 -21
6520 -21 14 40 0 -16 -16 -2 39 29 -10 31 19 -58 53 -46 5 8 37 12 3 40 13 -3 -27 17 13 8 7 8 -64 3 -24 -14 16
6553 16 -5 18 -16 32 5 20 -21 -36 28 -25 -11 -17 12 8 -13 40 -17 6 10 -2 31 -6 -10 48 -5 0 23 -35 2 -11 15 -10 -6
$$ packed form
6321f8M4K1L2pk9N6l9Qm1jM3j7nN4nn7j5J3J6M2k7oKL5l8l8N6l1K7k1k3j5O6q3
6355e1K9nJ1M0rk1ML1k8OJ5rl4L5L0o0j1pNO8k1J7ql6mKM2m6K1k4K4l3K6joK5
6391A7k7p1O8J4j1J5J0rk8J2j3M7m4M0m0J4K6p2O0J3pj6j6K8J2Rm8K6Nj0l6K0
6423a2n7L0K2j4K6j6lk2J9M1m7M2n3L5kJ0mPj1PL2k9K1K5Mn7J5m2M3K8j09J03
6455C2M0r5M0K6l4R2r6k2NL5K4n9L3L4n2Pn6M3kQ4n6no0M8m3K7J9l6M8p9O9L0
6487D1j2k3kj5Q3q3Q5o2L1Pl0l6OJR2j11P6p0mO6j5j3K2m5l0R0J4o5LK0j7J5m0
6520b1L5K6m0j6%J4M1j0l9M1j2p7J11r9N1LK9k5rL7k7j6k4M4mnjJp2O7k7J0L0
6553A6k1K3l4M8k7J5m1j5O4n3J4oK9mk1N3n7K3Mj2L3l7mN8n3NK3n8L7j3K6k5M
$$ plain form
6586 -6 31 8 62 -29 30 23 -13 -10 -18 25 43 56 -27 16 -27 -5 -30 -1 9 3 -15 27 -7 10 17 9 10 -2 22 53 -4 -20 -31 -51
6620 -51 -2 7 2 2 -36 -3 33 70 -20 21 27 -15 81 13 15 17 -18 -2 -6 -36 18 6 -21 47 -5 -21 -4 15 44 -34 -7 3 8 19
6654 19 -8 6 19 11 -1 -38 -12 -30 37 40 -8 42 -10 2 31 7 6 32 47 -31 9 30 16 -19 41 -5 34 -27 -29 -4 16 -10
6686 -10 57 16 -14 39 31 28 20 35 -1 61 -33 55 -11 19 28 -5 8 59 42 -7 -6 -1 42 -19 43 -39 35 23 8 3 37 30 41 -5
6720 -5 -39 20 19 103 -35 -12 -12 40 -26 26 -19 20 16 -5 20 -23 -9 0 21 -29 57 3 13 17 -44 29 -12 -26 1 -5 13 20 0 3
6754 3 33 56 21 11 48 46 13 -23 37 7 26 30 -2 -32 15 -3 3 25 -5 20 -30 -24 41 -34 -18 -8 -26 22 40 14 3 19 -3
6787 -3 -47 -30 36 -4 -40 -26 -41 15 -8 53 16 53 8 7 3 20 39 -37 -47 -4 20 5 47 -43 -7 39 -35 31 -6 38 -2 -26
6819 -26 50 -17 -4 9 -69 -26 6 0 -33 -4 -6 -12 -5 -5 11 -25 45 -66 37 46 2 -31 23 26 2 -4 -18 -27 18 15 10 -5 24 49 -17
$$ packed form
6586fL7k3N4r1N9pl6LqM3J8J3q3M3m3K2k5K9J0oj8M2l4J7PqJj2K4L1n7j6j1k0
6620e1M9Rn%l8L3L6L7r0M1Om2R6o8KKl5J6ml0N4j2k7O8n2j6J7J9K9p8K7J0NJ1
6654A9k7J4J3qj2l7K6j8O7Lm8N0n2J2K9k4jK6J5p8M0K1j4l5O0m6L9o1kK5K0k6
6686a0O7m1l0N3qlqJ5l6O2r4Q8o6L0Rl3J3N1j7m9JNM3o1O2q2P4j2j5nL4pJ1m6
6720el4N9jQ4j38K3%N2o6N2m5L9mk1K5m3J4RK1n0Q6n4J0Mo1P3m1j4K7oJ8Pk0L
6754CL0K3l5j0L7kl3l6O0l0J9Ml2l0M7j8OK2l0K5n0OO5p5J6J0j8M8J8k6j1J6k2
6787cm4J7O6m0l6J4j5N6k3O1l7L7m5jmJ7J9p6j0M3K4j5M2r0L6M6p4O6l7M4m0k4
6819b6P6o7J3J3p8M3L2ol3K9koP%J6l6P0j11J03Rm4l3N4Lk4oj4rM5lnj5K9K5o6
$$ plain form
6854 -17 -23 16 19 7 64 -59 10 33 5 -13 -40 70 -24 6 44 44 9 -11 -21 6 25 -37 14 21 -62 4 -13 51 -22 -8 -33
6885 -33 28 30 42 42 2 -23 -2 14 -1 -50 -48 -2 -34 0 -16 -20 35 45 -17 -10 -70 -36 -19 7 -20 18 -17 50 -5 -19 -41 -7 -27
6918 -27 -1 28 69 -24 14 -3 -56 -15 -44 -60 19 13 52 30 -6 37 3 1 -2 28 -39 -53 0 -4 7 -14 11 -38 -46 4 51 34 -37
6951 -37 13 -53 21 -8 51 58 -5 59 -11 -1 -19 86 -44 -26 3 -26 11 8 -8 24 -28 25 -20 -1 20 5 24 27 -19 -5 -3
6982 -3 11 -3 27 50 -38 -17 5 -18 22 -13 29 16 5 -1 -65 -15 30 35 -38 25 18 15 -27 10 -31 37 -8 17 44 21 14 -7 14
7015 14 9 56 -31 -9 46 12 13 9 64 5 29 35 25 -30 -16 -1 21 39 13 -12 -22 34 -15 -39 5 -5 -13 14 -10 6 -4 5 40
7048 40 16 -39 31 -8 14 -16 10 24 4 19 24 10 -2 11 -10 -13 34 -9 -26 23 -1 13 17 4 27 -37 34 6 -3 -32 -25 26 26
7081 26 12 5 2 29 12 -12 20 -4 -25 -19 14 -16 3 33 0 49 12 11 -15 18 -7 -8 -21 9 -6 9 18 -42 46 -31 51 -30 23
$$ packed form
6854a7oL9Lj2N7j23O9K3k8j8k7J10r4L0L8%l5k0j0K7J9o2N1Pq3O6j7O4p3J4k5
6885c3O1KJ2%m0k5K1J6j5m9KM6l2L4j6mN5J0o2Po0L4J7K6k7L8l5O7n5j4k2L4k0
6918b7K6K9M1r3L8j7n3M1k9j6P9oL9k2l6M3l4klL0o7j4N3mJ1k1K5m9qN0M7j7p1
6951c7N0o6P4k9N9Po3O4p0J0j8J05j30J8K9k9L7lj6L2n2N3m5J9K1j5J9Lm6J4K
6982cJ4j4L0K3q8K1K2k3M0l5M2j3j1oo4N0M5Np3O3plm2L7m1O8m5K5K7k3pk1K1
7015A4nM7q7K2N5l4JmN5n9K4Oj0n5J4J5K2J8k6k5j0N6m9k4M4j0qK7k4J6j0RL5
7048D0k4n5P0l9K2l0K6J4k0J5Nj4j2J3k1lM7m3j7M9k4J4Mj3K3o4P1k8rk9PN1%
7081B6j4plK7j7k4L2k4k1OL3l0J9L0l3M9l7jk6L3k5jj3L0j5J5Ro0Q8p7Q2q1N3
$$ plain form
7114 23 39 15 -37 44 -33 -18 31 -2 -11 -5 -13 8 28 33 24 0 1 -5 3 2 26 13 -32 -30 -22 5 58 4 14 41 51 20 -21 -14 52 75
7150 75 -34 33 10 -11 -7 20 36 26 -23 -14 1 22 -28 7 21 10 48 24 -26 -8 1 -2 -38 13 9 8 -3 2 -17 16 -36 44 -69
7183 -69 20 20 21 -48 29 -10 -35 -2 42 17 -30 -12 15 33 -12 24 -19 -29 71 13 -51 27 27 -38 21 -14 12 -27 3 12 -24 -38
7215 -38 4 -23 -86 16 -22 46 90 37 -8 60 -4 -16 -12 12 24 -37 -10 26 7 0 8 39 10 2 25 5 26 8 -23 -6 -33 1
7247 1 -1 32 19 53 24 29 12 -27 27 -48 19 -26 -69 -40 39 33 10 25 -22 16 36 10 55 35 -28 -19 -12 16 3 -1 -19 -5 10 -3
7281 -3 3 -3 -5 12 -45 14 -16 -5 20 24 34 26 39 -6 -28 33 55 -19 -13 -24 -32 -19 28 9 -42 -13 15 58 -74 2 -14 -38 13 43
7315 43 12 25 -1 19 -8 4 -21 59 16 -14 -16 22 12 14 6 20 -15 -25 -12 -46 -9 -5 -9 18 24 12 5 9 -52 -32 52 17 -19 -17 40
7350 40 40 23 40 -34 60 -15 -60 -8 -37 40 1 9 46 20 21 23 31 24 -5 0 11 -4 17 33 28 56 10 -22 -22 -5 -12 43 17 -28 39
$$ packed form
7114B3J6k4n2Q1p7J5M9l3rOqK1K0Nrk4JoQjK4j3m5KQK7N3n4J0K7J0l1m1PO6K3
7150G5j09O7k3k1MK7J6j0m9RJ5K1n0L5J4j1L8k4n0J8Rll6N1mjj1Nj9L3n2Q0j13
7183f9Q9%Jo9P7l9k5L3M4k5m7J8K7J8m5L6m3j0J00n8o4P8%o5N9l5K6l9L0Rl6j4
7215c8M2k7o3J02l8O8M4n3m5O8o4j2MK4J2o1K7L6j9pQL1k9qK3k0K1j8l1J7k7L4
7247AkL3j3L4k9Nj7l9N4p5O7m5m3K9P9ok3J5m7L8K0k6M5k0o3RPK8j3mj8J4J5j3
7281cOokJ7n7N9l0J1K5MJ0qJ3m5k2O1K2p4Oj1qJ3M7j9n1K9K8M3j32P6j6k4N1L0
7315D3l1J3k6K0k7J2k5Q0m3l0kL8j0KqJ4l5j0J3l4L7MmK7Oj2pMo1K0Q4l5l6KN7
7350D0%j7J7p4R4p5m5N2k9P7l9QL7k6JKQpk9NJ1j5K1J6nK8m6l2%J7pN5k6m5O7
$$ plain form
7385 39 26 26 1 -38 31 -4 21 31 -57 -54 61 -40 -4 -9 5 -19 -6 -8 -9 -3 2 3 31 13 -1 0 4 -1 -2 -11 -52 -7 -4 12 -28 14
7421 14 -18 -34 10 -13 -53 -26 45 47 -1 -8 -43 11 6 -12 -54 30 -36 59 34 -3 6 60 -33 -11 10 15 -31 -54 -5 -51 53 43
7453 43 4 -33 18 44 47 14 21 18 24 24 4 38 40 -3 15 8 25 -26 19 44 42 24 -21 -3 24 -19 -12 10 0 -9 53 -24 -42 17 28
7488 28 54 -16 15 30 0 -29 -15 -11 -13 22 21 -40 -41 44 1 -27 10 21 45 -6 16 27 7 32 -22 43 -56 13 -15 -22 43 -8 -12
7521 -12 20 -41 -24 29 53 21 -45 -9 20 25 -44 0 0 -9 51 61 -25 55 -10 41 -4 -26 -3 -48 12 -15 33 45 18 13 -51 42
7553 42 -15 4 44 10 9 -33 -16 14 33 12 1 24 30 9 46 -23 -15 42 1 -2 -5 30 -12 2 21 47 -45 5 16 4 13 -15 51
7586 51 16 -23 -1 7 -28 8 -17 -59 -53 -24 3 -24 27 11 -34 4 4 89 -31 -51 10 -9 51 -9 -1 -3 48 1 70 3 9 22 32
7619 32 -6 -36 -21 27 53 -64 -8 -3 -38 34 34 -36 -1 27 57 -7 -24 40 -13 -17 11 -11 13 -5 82 -12 -55 -1 45 13 10 -1
$$ packed form
7385C9j3%k5l9O9l5K5J0q8LJ15j01L6nJ4k4J3kjONJK8j8j4JMnjrm1M5LJ6m0M2
7421A4l2j6M4k3m0K7P1Km8pl5N4nj8m2Q4o6R5k5l7RN4r3K2K1Nm6k3M9m6J04j0
7453D3l9l7N1K6Ll3PlO%k0L4Km3J8pJ7n1M5K5kj8m5J8K7m3PK2j0rO2p7j8N9J1
7488B8K6p0L1J5l0k9J4MkL5jo1jQ5m3k8L7J1K4n1K2J1k0K5n4O5r9O9k8pO5n1m
7521a2L2o1J7N3K4l2o6L6K9No9M4%rO0J0q6Q0o5N1m5k2K3m5O0k7M8J2k7no4R3
7553D2n7J9M0l4jm2J7L0J9k1j1K3Ok1L7o9QN7m1llL5m2J4J9K6r2N0J1j2Rk8O6
7586E1l5l9K2Ql5L6k5m2OK9K7k7N1j6m5L8%Q5j20k0O1j9O0o0QkN1m7O9o7OJ3J0
7619C2l8l0J5M8K6j17N6Nl5P2%p0L5K8L0o4j7O4n3mK8k2K4j8Q7r4m3N4M6l2lj1
$$ plain form
7651 -1 16 1 28 11 -10 -13 13 27 56 -7 24 -2 -13 3 -3 2 69 -5 -18 -12 -27 27 -25 -40 -37 8 46 4 -28 13 10 -11 26 -5
7685 -5 -7 22 13 21 -27 31 -14 -41 -20 -28 -43 0 17 18 3 -37 -18 -27 44 -11 23 8 -35 8 -35 5 -26 22 20 27 -32 9 -11 9 -30
7720 -30 -34 1 9 -47 21 -37 21 10 23 -26 -2 6 -27 51 17 -40 35 15 -36 -13 -14 -32 5 8 42 2 10 55 21 -18 33 -3 18
7753 18 15 42 69 -5 42 -15 -43 24 28 -1 -1 -47 56 24 23 4 -20 4 -15 -6 19 -3 -10 -55 29 28 -5 10 -32 -55 17 51 23
7786 23 33 -6 -36 0 -37 -6 -4 -24 -39 2 -28 -2 -17 -11 -40 25 17 -25 45 -4 3 -25 -32 -3 9 20 -64 5 -27 -42 -10 -24 71
7819 71 5 22 24 -31 25 16 11 -32 27 49 -9 -4 16 34 35 27 16 -5 21 9 -30 0 -49 -21 46 50 39 44 -23 -26 46 -40 -22 -8 62
7854 62 1 -2 -15 -7 -25 -15 -44 -24 -17 -27 51 26 11 32 8 -19 -11 28 18 49 -23 -79 28 -1 -1 -39 32 -39 52 9 -38 36
7886 36 46 19 -45 -33 -23 29 -2 9 4 -64 7 -29 -4 11 -43 31 -19 -4 -23 32 12 -5 29 17 23 -20 -14 51 23 19 17 63 -19
$$ packed form
7651aJ7j5K7j7k1lK6J4K9o3L1k6j1J6oNO7p4j3Oj5N4n2j5LM5L8m2l2M1lk1L7l1
7685ekK9rQm8N8m5k7K1qj5M3J7Jj5m0J9rP1n5L4j5m3M3m3M0l1M8kPn9M1k0K0l9
7720c0mL5Qn6O8n8N8j1J3m9K4Ql3P8l4n7P5k0n1K3jj8L7LL4m0QM5l4l9N1l6K1
7753A8lK7K7p4M7n7k8O7Mk9%m6J03l2jj9k4K4j9RK5k2pm5Q4jl3J5m2k3P2L4k8
7786B3J0l9l0L6l7L1Kk0j5M1l0K6j5Ok9O5qm2P0m9Pk8pK9J2J1q4O9l2j5L2j4R5
7819G1o6J7Kn5N6rnm3N9K2n8NK0J8Jqj1k1K6j2l9L0m9K8O7Mj1No7lP2q6J8J4P0
7854F2o1lj3Qj8J0k9K0Pj0P8k5j5K1k4k7QL9j0L1p2n6J07k9%l8P1p1R1m3m7P4
7886C6J0k7o4J2J0N2l1J1no8P1l6K5J5n4P4n0J5j9N5k0j7L4j2Om3OO5k8mkM6q2
$$ plain form
7919 -19 -14 -23 -24 -4 -2 26 47 -34 -26 -48 -16 -11 -28 15 -30 19 -21 -45 -20 11 8 -3 16 42 -23 -25 -26 21 -30 -12 -12 -15 34 36 2 -5 45
7956 45 11 19 -8 36 43 19 -16 -12 21 1 -16 -47 -36 -34 -46 58 12 19 2 31 -35 10 -28 11 -2 18 20 -22 12 -16 -51 -9 25
7989 25 2 19 11 19 -9 15 25 25 8 20 43 11 -22 -25 0 18 -21 -2 -26 14 -7 64 0 -20 -9 24 -44 20 -7 -8 17 30 32
8022 32 -21 -18 41 -27 16 4 3 28 35 -12 14 10 5 18 5 -9 -5 51 14 18 22 -37 26 23 15 16 17 -7 -34 -10 -3 29 16 -1 -11 17 14
8059 14 17 37 -2 -45 5 11 -22 15 32 6 28 38 1 -17 52 -38 23 1 -19 10 12 -32 -31 27 26 27 -13 50 -11 -13 -12 -9 7 8 14 9
8095 9 38 -25 -8 -27 -22 51 12 19 6 1 -42 -14 4 40 16 7 38 -33 40 64 17 50 15 -11 -32 -21 24 -45 -1 38 -25 -17 14
8128 14 42 12 18 30 31 3 0 47 12 -15 -12 -9 1 89 25 -99 5 -24 10 -20 -14 -13 -17 -55 -25 -32 -9 -24 -32 4 -22 15 0 9 -20
8163 -20 16 -32 18 -3 32 15 9 0 -2 -1 17 -18 3 -30 -30 1 -14 14 9 30 15 8 -9 2 -43 33 -34 -13
$$ packed form
7919a9NrjK0KK8K1q1Qk2L2Nj7M3m5M9m0k4K5L1lj1J9K6o5kjM7n1J8%lM9Kl4pN0
7956D5l4Qk7M4Pk4l5ML3k0j7l1J1Kj2J04m6Pj7K9o6M5l8L9j3K0Km2L4k8l5M2L4
7989B5k3J7qQk8K4J0%j7J2K3l2l3lK5J8l9J9k4M0k1P1o4k0J1L3o8O4k7jK5J3K
8022C2n3LN9o8M3j2jK5Pm7K6mnJ3j3j4MN6l7MMn9O3lqJJk4k7K4PL2j3j7j0K8l
8059A4LK0l9m3N0Ol3L7J7k6K2J0l7j8O9r0O1k2k0K9Km4JN8jJm0O3o1kJLJ6JOn
8095IK9o3J7j9NP3l9Pj3nm3K8J8L6k4rL1p1P3K4m7L3l5k6k1J1M5o9M4L9o3QL1
8128A4K8l0OJ2Jk8lM7l5k7LLJ0Q8o4j24J04k9L4l0OJml8L0pK3j5qL6k6L7j5Rk9
8163b0L6m8N0k1L5j7orkJJ8l5K1l3%L1j5K8nK1j5pj7J1m5P6o7K1
8191a3
$$ Imaginary data points
##PAGE= N=2
##DATA TABLE= (X++(I..I)), XYDATA
$$ plain form
0 0 0 0 0 0 0 0 0 0 0 0 0 0 0 0 0 0 0 0 0 0 0 0 -4 6 -8 8 -8 8 -8 8 -10 12 -12 14 -15 18 -20 20 -21 26 -27 31 -34 36
44 36 -39 45 -46 52 -58 64 -69 76 -85 94 -105 119 -134 155 -179 213 -254 312 -395 515 -708 1038
66 1038 -1684 3184 -8086 53454 312111 59378 -250331 -57744 173586 31358 -125460
77 -125460 -20696 74180 27913 -3107 -27963 -88402 -19174 137792 80238 -124761 -98632
88 -98632 93610 77407 -78313 -50825 73974 46011 -46112 -41103 -9019 8025 59216 52373
100 52373 -63445 -87346 44646 79331 -40294 -55681 52549 42871 -59087 -44533 32026
111 32026 24810 3944 20632 -17287 -62461 5380 68220 -3588 -50927 27876 40354 -59311
123 -59311 -43184 73707 41655 -66377 -9901 71739 -29551 -95158 50015 116716 -44792
$$ packed form
0@%%%%%%%%%%%%%%%%%%%%%%mJ0j4J6j6J6j6J6j8K2k4K6k9L3l8M0m1M7n3N8o5P0
44C6p5Q4r1R8j10J22j33J45j61J79j99K24k53K89l34L92m67N66p07R10j223J746
66A038k722M868j1270O1540K58657k52733l09709J92587K31330j42228j56818
77a25460J04764R4876m6267l1020k4856o0439O9228J56966n7554k04999K6129
88i8632J92242j6203j55720K7488J24799k7963r2123N009L2084J7044N1191o843
100E2373j15818k3901J31992L4685j19625j5387J08230r678j01958J4554P6559
111C2026p216k0866J6688l7919m5174O7841O2840p1808m7339P8803J2478r9665
123e9311J6127J16891l2052j08032N6476Q1640j01290o5607J45173O6701j61508
$$ plain form
134 -44792 -110447 38225 81844 -48658 -59298 61078 51437 -54666 -43519 25916 12579
145 12579 -6468 24142 5229 -44851 -10145 41139 -751 -32892 25627 39077 -38726 -46775
157 -46775 33710 39303 -22763 -11840 27839 -9510 -38782 14618 38414 -10994 -19044 17616
169 17616 -2285 -35252 6477 41579 -3611 -31380 6462 13048 -22227 -7681 30952 9795
181 9795 -22882 -4381 5532 -15319 3706 36847 -655 -42323 3186 39379 -15919 -38997
193 -38997 33086 49363 -35627 -54112 26595 43587 -19684 -24252 22208 10703 -26533 -9159
205 -9159 17196 4412 -1428 7764 -10582 -24193 9059 27693 -6820 -19624 13667 12276 -25069
218 -25069 -12450 29854 15419 -21521 -6827 14389 -7915 -13974 19763 18945 -19045 -15338 15469
$$ packed form
134d4792o5655J48672M3619j30502j0640J20376r641j06103J1147O9435j3337
145A2579j9047L0610j8913n0080L4706N1284m1890l2141N8519J3450p7803q049
157d6775Q0485N593o2066J0923L9679l7349k9272N3400K3796m9408q050L6660
169A7616j9901l2967M1729L5102m5190k7769L7842O586l5275J4546L8633k1157
181I795l2677J8501R913k0851J9025L3141l7502m1668M5509L6193n5298k3078
193c8997P2083J6277q4990j8485Q0707J6992o3271m568M6460j1505l7236J7374
205i159K6355j2784n840R192j8346j3611L3252J8634l4513j2804L3291j391l7345
218b5069J2619M2304j4435l6940J4694K1216k2304o059L3737q18l7990L707L0807
$$ plain form
231 15469 3298 -18551 5992 24801 -6378 -25525 260 13530 -1949 -1910 7978 -3669 -11895
244 -11895 2911 5483 -7458 3320 18879 -4633 -26996 856 26512 1254 -18264 6305
256 6305 15512 -12977 -16262 13501 15429 -7488 -6048 5133 -5825 -9641 10127 12497 -8443
269 -8443 -9608 5633 510 -9884 2645 12668 -1200 -9676 -417 608 -4572 6042 12493 -5431
283 -5431 -14128 4977 11245 -7839 -7062 15270 9800 -16685 -12155 12273 10070 -6347 -2761 4888
297 4888 -2974 -6675 1788 3404 -579 3052 1666 -9819 -7611 9005 9015 -6338 -5537 6002 686
312 686 -9180 440 11167 2246 -6531 -485 1902 -4151 775 9755 1816 -8931 -1887 5591 -1690
327 -1690 -4262 5585 5931 -5735 -7156 1247 2454 -76 2317 1190 -5177 -3933 2911 1773 -2077
$$ packed form
231A5469j2171k1849K4543J8809l1179j9147K5785J3270j5479L9R888j1647q226
244a1895J4806K572j2941J0778J5559k3512k2363K7852K5656k5258j9518K4569
256F305R207k8489l285K9763J928k2917J440J1181j0958l816J9768K370k0940
269h443j165J5241n123j0394J2529J0023j3868q476R259J025n180J0614O451j7924
283e431q697J9105O268j9084P77K2332n470k6485M530K4428k203j6417L586P649
297D888p862l701Q463J616l983L631j386j1485K208J6616J0j5353Q01J1539n316
312F86r866R620J0727q921q777O046K387o053M926Q980p939j0747P044P478p281
327a690k572R847L46j1666j421Q403J207k530K393j127o367J244O844j138l850
$$ plain form
342 -2077 2201 4370 -3853 -7059 2379 7077 -99 -2574 2638 864 -5071 -1022 6229 2980 -2723
357 -2723 -1116 -36 -2767 -514 4310 1624 -3227 -1579 322 -2356 -1746 3297 3161 -2292 -3653 -864
373 -864 162 1010 3084 1317 -3135 -2187 2581 1478 -2544 882 5883 1037 -6638 -3431 4926 5295
389 5295 -815 -3625 -1402 1410 1335 -1826 -2528 2295 4534 -2181 -7716 -1617 6496 3819 -3845 -4100
405 -4100 1017 2172 -585 -1144 1038 2101 1111 -1236 -2972 -681 4404 4562 -1835 -4734 100 3523
421 3523 403 -1795 813 1682 -1157 -2362 -754 409 733 1386 343 -3059 -3746 987 4413 868
437 868 -3823 -1760 2886 1419 -2839 -1375 3504 3453 -1218 -3623 -1176 2781 4026 854 -3544 -2874
453 -2874 2699 4168 -2194 -5630 1966 8005 -1203 -11241 -2495 11335 5000 -10512 -7052 8082
$$ packed form
342b077M278K169q223l206R438M698p176k475N212j774n935M049P251l249n703
357b723J607J080k731K253M824k686m851J648J901k678O10N043j36n453j361K789
373h64J026Q48K074j767m452R48M768j103m022L426N001m846p675L207Q357L69
389E295o110k810K223K812p5l161p02M823K239o715n535O099Q113k677p664k55
405d100N117J155k757n59K182J063r90k347j736K291N085J58o397k899M834L423
421C523l120k198K608Q69k839j205J608J163L24O53j043l402o87M733L426l545
437H68m691K063M646j467m258J464M879n1m671k405K447L957J245l172m398O70
453b874N573J469o362l436P596O039r208j0038Q746J3830o335j5512L460J5134
$$ plain form
467 8082 6678 -7400 -7153 6206 7988 -3661 -7593 502 5562 2504 -1117 -2423 -1755 2643 4675
482 4675 -2150 -6708 2773 10202 -1627 -13093 -1192 13728 3854 -12830 -6059 10233 5697 -9290
496 -9290 -6591 7099 6580 -4681 -6327 920 3428 1464 653 -1603 -3598 1325 5963 -231 -6934
511 -6934 459 9381 1398 -10170 -3132 10251 5053 -8626 -4971 7278 3062 -7656 -1833 8034
525 8034 158 -9378 461 9159 -2700 -10726 3680 12282 -3762 -13840 2002 13469 -48
538 -48 -10899 -333 8475 790 -4800 149 1684 -551 3475 3393 -7380 -7132 9980 11568 -10193
553 -10193 -15016 8264 16428 -6373 -17524 2915 16471 174 -14938 -4470 10200 6402 -4833
566 -4833 -6426 -530 4367 4646 -1149 -6963 -1711 9154 6094 -8802 -9532 7602 13222 -3872 -13966
$$ packed form
467H082j404j4078K47J3359J782j1649l932Q095N060l058l621j306O68M398K032
482D675o825m558R481P429j1829j1466J1901J4920r874j6684O771J6292m536j4987
496i290K699J3690n19j1261j646P247K508j964q11k256j995M923M638o194o703
511f934P393Q922p983j1568P038J3383n198j3679L655J2249m216j0718N823R867
525H034p876r536R839Q698j1859q026J4406Q602j6044j0078J5842J1467j3517
538d8j0851J0566Q808p685n590M949J535k235M026q2j0773K48J7112J588k1761
553a0193m823K3280Q164k2801j1151K0439J3556j6297j5112J0468J4670l798j1235
566d833j593N896M897K79n795n814N252J0865l060j4896p30J7134N620j7094j0094
$$ plain form
581 -13966 638 13493 1840 -12088 -3137 10210 3147 -8865 -3232 6201 1060 -4834 1291
594 1291 3508 -4736 -4346 6404 5210 -7057 -5612 7045 5778 -6214 -4919 5707 4524 -3287
608 -3287 -2134 1815 -467 -327 4300 747 -6952 -1657 8509 2729 -9378 -4277 8723 5117 -7863
623 -7863 -6859 4606 6664 -1625 -6041 -1870 3468 3740 -918 -4699 -1364 5254 4097 -4173 -5769
638 -5769 2840 7700 444 -7241 -2882 6212 5403 -4124 -6599 2405 7301 -970 -7794 -1005 6727
653 6727 1629 -5668 -2509 3054 1344 -1803 -466 404 -1037 181 1916 -668 -2675 1302 3868
668 3868 -634 -3729 499 3678 474 -1987 70 1136 -108 136 451 -1041 -556 1906 495 -3051
684 -3051 -1348 2597 1064 -2635 -1432 1434 439 -1294 -319 620 -106 -81 445 -381 -752 980 1681 -387
$$ packed form
581a3966J4604J2855j1653j3928Q951J3347p063j2012N633R433n141n894O125
594A291K217q244L90J0750j194j2267J445J2657j267j1992J295J0626j183p811
608c287J153L949k282J40M627l553p699N295J0166n780j2107N101J3000l606j2980
623g863J004J1465K058q289m416M171N338K72m658l781L335O618j157q270j596
638e769Q609M860p256p685M359R094q09r527k475R004M896q271o824O789P732
653F727n098p297L159N563j710l147J337Q70j441J218J735k584k007L977K566
668C868m502l095M228L179l204k461K057J066j244K44L15j492M85K462j411l546
684c051J703L945j533l699J203K866r95j733R75R39p26K5N26q26l71J732P01k068
$$ plain form
702 -387 -1420 644 1697 8 -754 320 731 109 -272 -642 -282 1080 845 -1626 -1709 1250 1374 -1929
720 -1929 -1848 1564 1453 -2005 -1940 1435 1681 -952 -1241 633 1043 -104 -374 173 658 780 104 -865 -161
739 -161 1473 916 -1174 -733 1174 420 -1244 -354 977 -91 -998 -28 97 -771 -315 864 -56 -1435
757 -1435 -412 1186 339 -1028 -178 1121 540 -549 -253 499 835 546 -209 -627 281 1185 162 -1080
775 -1080 -104 1174 12 -1215 -378 628 -4 -508 -362 -508 -427 447 341 -847 -800 769 888 -840
793 -840 -972 920 1451 -270 -1034 339 1225 451 -316 -340 351 782 230 -909 -513 1131 856 -1365 -1408
812 -1408 961 1075 -1120 -1401 546 835 -788 -1104 214 677 1 -503 -324 215 648 390 -428 -259
830 -259 920 811 -712 -626 1158 1099 -694 -864 530 587 -334 -242 70 -362 -89 351 -510 -1115 269 1104
$$ packed form
702c87j033K064J053j689p62J074M11o22l81l70L60J362k35k471q3K959J24l303
720a929Q1L412j11l458O5L375K46k633k89J874M10j147k70N47M85J22o76r69P04
739a61J634n57k090M41J907p54j664Q90J331j068r07R70J25q68M56J179r20j379
757a435J023J598q47j367Q50J299n81j089K96P52L36k89p55m18R08R04j023j242
775a080R76J278j162j227Q37J006o32n04J46j46Q1Q74j06j188M7J569J19j728
793h40j32J892N31j721p64J373Q86p74p67k4O91M31n52j139L96J644k75k221m3
812a408K369J14k195k81J947K89j623l16J318M63o76n04J79N39M33k58q18J69
830b59J179j09j523Q6J784n9j793j70J394N7r21R2L12m32K73M40q61o05J384Q35
$$ plain form
850 1104 -555 -1664 64 1316 -42 -1093 -29 843 235 -177 42 82 226 956 344 -988 -273 1515
868 1515 773 -1186 -643 984 528 -704 -451 -128 -84 311 183 -1289 -1105 1167 1238 -1531 -1768 1089
886 1089 1647 -905 -1516 575 1258 76 -457 -154 -90 838 1371 -538 -1756 736 2526 -373 -2550
903 -2550 296 2492 -172 -2256 -195 1400 2 -921 -323 -246 -226 473 150 -1074 -509 1097 479 -1049
921 -1049 -417 850 476 -107 81 -9 -315 911 1094 -889 -1105 1339 1514 -1355 -1295 1320 896 -1224
939 -1224 -438 680 -811 -716 1476 256 -2777 -547 3267 242 -3861 -394 3981 387 -3754 -225
955 -225 3468 289 -2230 371 1528 -495 -57 1471 -568 -1817 1600 2579 -1985 -2987 2164 3088
971 3088 -2100 -3335 1285 2773 -1086 -2634 36 1744 289 -1444 -1065 751 1215 -254 -1288 111
$$ packed form
850A104j659j109J728J252j358j051J064Q72o08m12K19M0J44P30o12j332P15J788
868A515p42j959N43J627m56j232K53L23M4L95j28j472J84K272P1k769k37K857
886A089N58k552o11K091O83j182n33L03O4R28N33j909j218K492J790k899k177
903b550K846K196k664k084K061J595j398r23N98P7K0O99l23j224N65J606o18j528
921a049O32J267l74n83J88r0l06J226J83j983k16K444J75k869O0K615m24k120
939a224P86J118j491R5K192j220l033K230L814l025m103L467M375l594m141L529
955b25L693l179k519K601J157k023M38J528k039j249L417R79m564j002N151R24
971C088n188j235M620J488l859j548K670J708j455j733L79J816M64j469j034J399
$$ plain form
987 111 1248 45 -673 601 651 -794 252 1681 -533 -2006 1320 2684 -1677 -2826 2110 2607
1003 2607 -2716 -2379 2820 1354 -3610 -785 3650 -563 -4200 1263 4161 -2303 -4334 3011 4304
1018 4304 -3261 -3802 3462 3284 -3080 -1986 3209 1174 -2478 426 2272 -1568 -1825 2782 1623 -3523
1034 -3523 -1695 3720 1498 -3932 -1924 3141 1803 -2625 -2212 1289 2075 -399 -2206 -686 1918
1049 1918 1509 -1565 -1696 1454 1916 -875 -1159 1040 704 -567 597 817 -1567 -707 2768 788 -3712
1066 -3712 -804 4229 399 -4780 -339 4440 -543 -4375 853 3534 -1791 -2922 2489 1957 -3129
1081 -3129 -1031 3716 265 -3740 741 3916 -1151 -3223 2054 2927 -2123 -1781 2571 971 -2618
1096 -2618 -39 2664 -723 -2535 1120 2018 -1621 -1917 1284 1132 -1297 -783 597 -76 -175 429 -484
$$ packed form
987A11J137j203p18J274N0j445J046J429k214j473L326J364m361j149M936M97
1003B607n323L37N199j466m964K825M435m213l637N463K898o464k031P345J293
1018D304p565n41P264j78o364J094N195k035l652K904J846l840k57M607j159n146
1034c523J828N415k222n430K008N065j338m428M13L501P86k474j807J520K604
1049A918m09l074j31L150M62k791k84K199l36j271J164K20k384Q60L475j980m500
1066c712K908N033l830n179M441M779m983l832N228K681n325j131N411n32n086
1081c129K098M747l451m005M481L175n067k072N277Q73n050L42M352j600l589
1096b618K579K703l387j812L655Q98l639k96L201j52k429N14J380o73r9O04r13
$$ plain form
1113 -484 -910 1122 1398 -1431 -1260 1934 1364 -1778 -749 1966 450 -1475 424 1152 -1073 -599 1675
1130 1675 -82 -2251 580 2349 -1373 -2695 1551 2198 -2131 -1927 2140 1109 -2305 -447 2174
1145 2174 -254 -1893 1217 1636 -1650 -908 2414 631 -2417 253 2733 -605 -2427 1341 2188 -1680
1161 -1680 -1583 1865 884 -2152 -334 1797 -619 -1701 881 1001 -1563 -608 1691 -69 -1889 528
1177 528 1786 -976 -1448 1587 1214 -1521 -479 1860 226 -1484 618 1507 -917 -968 1415 606 -1625
1194 -1625 -169 1642 -469 -1666 639 1073 -1247 -886 1268 97 -1559 247 1376 -900 -1269 1376
1210 1376 994 -1565 -475 1911 260 -1631 392 1777 -720 -1183 1328 861 -1494 -300 1798 -185
1226 -185 -1777 492 1546 -1055 -1422 987 714 -1402 -475 1204 -245 -1280 622 960 -1113 -732
$$ packed form
1113d84m26K032K76k829J71L194n70l142J029K715j516j925J899P28k225M74K274
1130A675j757k169K831J769l722j322M246O47m329K04M067j031l414J858K621
1145B174k428j639L110M19l286P42L322j783l048K670K480l338j822L768Q47l868
1161a680R7L448r81l036J818K131k416j082K582J20k564R55K299j760j820K417
1177E28J258k762m72L035l73k735J042K339j634j710K102Q89k424n1K383q09k231
1194a625J456J811k111j197K305M34k320L61K154j171j656J806J129k276l69K645
1210A376l82k559J090K386j651j891K023J385k497m63K511m67k355J194K098j983
1226a85j592K269J054k601l67K409k73k116R27J679j449j035J902L38k073L81
$$ plain form
1242 -732 1449 477 -1483 50 1701 -98 -1289 716 1260 -728 -630 1163 314 -1174 180 1173 -643
1259 -643 -1189 851 768 -1157 -736 917 74 -1141 158 788 -700 -643 950 354 -1166 47 1391
1276 1391 -137 -1223 627 1302 -584 -808 970 692 -816 -62 997 -176 -816 578 613 -936 -550
1293 -550 1021 106 -1241 -13 981 -480 -957 462 601 -819 -382 854 4 -878 322 992 -430
1310 -430 -628 932 695 -887 -187 1160 172 -963 324 974 -459 -749 635 450 -856 -306 675
1327 675 -196 -767 188 446 -708 -476 646 145 -831 -65 751 -118 -650 416 686 -306 -298 601 270 -428
1347 -428 278 667 -251 -373 499 256 -572 -119 588 -119 -592 217 261 -622 -348 553 -38 -803 54 754
1367 754 -286 -788 447 682 -447 -392 661 337 -473 122 749 -125 -485 566 609 -535 -369 716
$$ packed form
1242g32K181r72j960J533J651j799j191K005N44j988R8J793q49j488J354R93j816
1259f43n46K040q3j925M21J653q43j215J299O30j488N7J593n96j520J213J344
1276A391j528j086J850O75j886k24J778k78j508P54J059j173o40J394L5j549L86
1293e50J571r15j347J228R94j461m77J419J39j420M37J236q50q82J200O70j422
1310d30j98J560k37j582P00J347r88j135J287O50j433k90J384j85j306N50R81
1327F75q71n71R55K58j154K32J122n01r76P66Q16q69n32J066K70r92QQ99l31o98
1347d28P06L89r18j22Q72k43q28M53P07p07m73Q09M4q83K74R01n91p65Q57P00
1367G54j040n02J235K35j129N5J053l24q10N95O27q74l60J051M3j144J66J085
$$ plain form
1385 716 353 -747 -265 554 16 -566 -145 200 -263 -228 168 -97 -341 56 312 -226 -283 293 349 -133 -46
1406 -46 248 196 27 190 97 -117 242 413 -211 -352 335 461 -358 -427 304 158 -525 -150 364 -186 -558
1427 -558 223 489 -512 -561 567 513 -625 -488 709 533 -524 -291 621 364 -356 3 444 -21 -162
1446 -162 280 252 -280 -245 405 199 -523 -389 309 278 -526 -515 167 418 -289 -553 22 481 -121 -461 186
1467 186 412 -64 -259 306 391 -230 -116 546 256 -506 -35 700 102 -759 11 847 -94 -905 63 735
1487 735 -319 -886 238 588 -550 -660 498 474 -661 -402 725 354 -697 -232 840 267 -729 -137
1505 -137 849 185 -607 172 722 -5 -569 157 517 -282 -454 243 355 -432 -520 334 400 -570 -530 545 420
1526 420 -601 -544 606 460 -604 -409 672 393 -535 -68 738 209 -572 78 648 -46 -609 361 630
$$ packed form
1385G16l63j100M82Q19n38n82M21L45m63L5L96k65k44L97K56n38n7N76N6m82Q7
1406d6K94n2j69J63r3k14L59J71o24j41O87J26q19o9P31j46o83L75N14n50l72
1427e58P81K66j001m9J128n4j138J37J197j76j057K33R12k57p20L59M41m65j41
1446a62M42k8n32L5O50k06p22J34O98l1q04J1O82K51p07k64N75M59o02l40O47
1467A86K26m76j95N65Q5o21J14O62k90p62M71P35n98q61P70Q36r41q11R68O72
1487G35j054n67J124L50j138j10J158k4j135K59J127l71j051M65J072n73r96N92
1505a37R86o64p92P79N50p27n64P26L60p99j72O97J12p87q8Q54O6r70M0J075j25
1526D20j021N7J150j46j064J95J081k79r28M67Q06n29p81O50N70o94n63R70K69
$$ plain form
1545 630 -417 -593 546 542 -633 -558 567 389 -772 -377 598 138 -723 -186 628 38 -559 60 603
1564 603 -80 -437 272 524 -198 -245 389 436 -178 -191 365 211 -287 -150 242 93 -338 -198 215 40 -299
1585 -299 -238 185 71 -361 -210 287 33 -392 -74 408 72 -330 97 535 12 -302 233 477 -148 -292
1605 -292 346 385 -295 -245 467 183 -486 -135 474 -117 -569 54 360 -298 -466 157 238 -348 -273 305 130
1626 130 -293 -17 336 43 -174 161 290 -50 -49 200 170 -114 -25 173 42 -67 -36 37 -93 -19 -86 -119 -79
1649 -79 0 -89 -256 63 83 -196 -167 167 75 -226 33 270 33 -172 206 337 -104 -123 316 200 -219 -124 389
1672 389 72 -398 13 284 -110 -391 96 167 -264 -304 114 92 -334 -102 193 -15 -229 50 202 -86 -69
1693 -69 141 144 -46 38 173 112 26 70 52 11 83 100 -55 -32 97 -64 -227 -43 87 -137 -219 66 53 -226 -123
$$ packed form
1545F30j047j76J139mj175P5J125j78j161L95R75m60q61N37Q14n90n97O19N43
1564F03o83l57P09K52p22m7O34M7o14j3N56j54m98J37L92j49m31J40M13j75l39
1585b99O1M23j14m32J51M97k54m25L18M82l36m02M27M38n23l14N35K44o25j44
1605b92O38L9o80N0P12k84o69L51O09n91m52O23L06o58j68O23Q1n86P5N78j75
1626A30m23K76L53k93k17L35J29l40JK49l0k84Q9J98j31j09L1P3j30P4o7l3M0
1649g9P9q9j67L19K0k79K9L34r2l01K59K37k37k05L78J31m41j9M39j16m19R5N13
1672C89l17m70M11K71l94k81M87P1m31m0M18k2m26K32K95k08k14K79J52k88J7
1693f9K10Lj90Q4J35o1q6M4j8m1P2J7j55K3J29j61j63J84J30k24q2K85j3k79J03
$$ plain form
1718 -123 150 -59 -292 33 315 -59 -202 195 273 -126 -128 363 256 -205 10 308 36 -240 115 309 -107
1739 -107 -264 185 151 -286 -167 140 14 -243 -101 98 -171 -180 50 54 -177 16 140 23 -79 57 186 3
1761 3 7 94 131 9 108 115 -66 -24 135 -17 -176 61 173 -111 -264 57 160 -268 -154 165 0 -283 -25
1784 -25 161 -92 -189 165 205 -166 -119 296 202 -170 11 252 34 -189 120 247 -71 -106 168 53 -176 -71
1806 -71 136 -121 -233 23 100 -162 -119 83 -42 -170 29 177 -133 -92 207 112 -124 61 290 16 -129 133
1828 133 283 -132 -53 255 100 -239 -40 238 -85 -374 114 196 -222 -293 147 48 -328 -131 271 -26 -287
1849 -287 -8 205 -67 -243 160 249 -131 -44 275 169 -108 22 297 -2 -115 103 125 -126 -72 59 -36 -68
1871 -68 -1 -45 -115 -56 -42 -111 -95 38 90 -157 -60 189 -43 -192 165 298 -99 -64 236 156 -148 -51 299 84
$$ packed form
1718a23K73k09k33L25K82l74j43L97P8l99kM91j07m61K15K98k72k76L55J94m16
1739a07j57M49l4m37J19L07j26k57J42J99k69rK30Mk31J93J24j17j02J36J29j83
1761CMQ7L7j22R9Pj81M2J59j52j59K37J12k84j53L21J03m28J14L19j65k83K58
1784b5J86k53r7L54M0l71M7M15r4l72J81K41k18k23L09J27l18l5K74j15k29J05
1806g1K07k57j12K56P7k62M3K02j25j28J99J48l10M1K99r5k36J85K29k74j45K62
1828A33J50m15P9L08j55l39J99K78l23k89M88Q2m18p1M40r9l76J97M02k97k61
1849b87K79K13k72j76M03Q9l80Q7L19j06k77J30K75k99j13K18K2k51N4J31r5l2
1871f8O7m4p0N9J4o9J6J33N2k47R7K49k32j49L57J33l97L5L00q0l04R7L50k15
$$ plain form
1895 84 -268 47 355 -75 -346 115 256 -237 -308 204 195 -332 -251 293 20 -342 -30 284 -4 -326 96 281
1917 281 -80 -198 224 267 -118 -70 203 178 -65 2 187 38 -129 -9 137 28 -82 -75 17 41 -148 -124 37
1940 37 56 -159 -172 75 67 -150 -155 195 157 -174 -20 282 141 -221 20 347 89 -228 85 363 -137 -247 138
1963 138 286 -218 -238 169 111 -309 -202 298 48 -416 -113 279 -40 -322 -9 319 -85 -212 155 270 -83
1984 -83 -185 230 238 -98 -77 226 141 -88 -95 176 102 -109 -45 142 25 -164 -92 78 -38 -190 -86 79 68 -202
2008 -202 -106 152 58 -210 -13 241 32 -177 85 275 7 -204 112 272 -77 -154 207 207 -175 -140 259 56
2030 56 -254 -160 193 11 -306 -121 216 -77 -325 42 202 -120 -218 137 217 -91 -62 210 155 -145 -39 185
2052 185 86 -77 45 139 30 -106 46 83 4 -85 -52 65 -30 -120 -71 76 -26 -136 -78 34 35 -105 1 136
$$ packed form
1895H4l52L15L08m30k71M61J41m93p1N12rn27Q1N44k73l62L12L14k88l22M22J85
1917B81l61j18M22M3l85M8K73k5k43O7J85j49j67J20J46j09j10PR2K4j89K4J61
1940C7J9k15j3K47qk17nL50l8l31J54L02j41l62K41L27k58l17L13K78n00j10L85
1963A38J48n04k0M07n8m20J07N00k50m64L03L92l19k82L13L28m04j27L67J15l53
1984h3j02M15Ql36K1L03q5k29pK71p4k11O4J87j17j89P2J70j16j52J04J65j1k70
2008b02R6K58r4k68J97K54k09k09K62J90k68k11L16J60l49p7L61%l82L5L99k03
2030E6l10R4L53j82l17J85L37k93k48L67J60l22r8L55Q0l08K9K72n5l00J06K24
2052A85r9j63J22R4j09j36J52L7p9q9L3J17r5r0M9J47j02j10N8J12Jj40J06J35
$$ plain form
2076 136 48 -117 35 173 42 -67 63 204 40 -186 169 211 -130 -152 163 132 -230 -87 168 22 -281
2097 -281 -71 131 -82 -261 63 185 -161 -198 135 92 -139 -34 195 54 -109 38 189 104 -44 121 120 4
2119 4 19 99 54 -30 15 1 -100 -8 18 -60 -57 -33 -16 -136 10 65 -112 -162 108 112 -144 -74 208 105 -186 -20 252
2146 252 71 -127 168 291 -92 -106 187 169 -210 -49 272 22 -214 -26 152 -37 -206 50 133 -168 -117
2167 -117 69 63 -153 13 172 -9 -67 58 103 -21 -69 129 16 -1 97 51 -54 -40 91 -18 -104 75 22 -104
2191 -104 -49 87 -71 -164 9 97 -146 -168 127 81 -262 -101 231 9 -181 28 256 13 -181 143 252 -167
2213 -167 -81 203 166 -159 -5 191 28 -223 49 143 -62 -150 100 51 -229 -83 85 4 -106 -10 84 -74 -59
2236 -59 101 -11 -13 20 99 8 7 78 118 -36 63 157 -5 -66 123 87 -69 -64 122 -32 -181 12 45 -172 -185 115
$$ packed form
2076A36q8j65J52J38j31j09J30J41j64k26L55M2l41k2L15l1l62J43K55j46l03
2097b81K10K02k13j79L24J22l46l7L33m3k31J05K29j41j63J47J51q5j48J65jj16
2119DJ5Q0m5q4M5j4j01R2K6p8LK4J7j20J46N5j77n0K70Mk56P0K82j03k91J66K72
2146B52j81j98K95J23l83j4K93j8l79J61L21k50k36J88J78j89j69K56Q3l01N1
2167a17J86ok16J66J59j81n8J25M5j24m8J98j13j7R8m6j05J4J31j09q6J79n3j26
2191a04N5J36j58r3J73Q8k43k2K95m6l43J61L32k22j90K09K28k43j94L24J09m19
2213a67Q6K84l7l25J54J96j63k51K72R4k05q8K50m9k80J46J68q1j10R6R4j58J5
2236e9J60j12kL3P9r1jP1M0j54R9R4j62o1J89l6j56NJ86j54j49J93L3k17j3L00
$$ plain form
2262 115 -6 -147 -84 122 -28 -199 32 164 -101 -80 90 159 -42 14 88 72 -90 34 186 -18 -131 72
2284 72 107 -137 -84 48 6 -144 -11 103 -28 -110 14 -2 -111 -19 79 -51 -88 39 66 5 45 111 40 -125 83
2309 83 71 -5 -58 111 64 -120 -49 107 19 -107 19 71 -159 -95 68 44 -142 -25 99 -3 -169 62 84 -26
2333 -26 -51 108 104 -57 -25 164 81 -68 48 126 69 -45 93 -1 -71 -25 51 -7 -30 -18 8 -74 -55 34 11 -88 -9
2360 -9 7 -78 -28 77 7 -40 51 105 24 -4 130 50 -22 -12 179 2 -125 73 115 -80 -147 112 34 -120 -72 118
2386 118 -3 -153 -11 130 -23 -103 32 79 -51 -132 78 134 -78 -47 169 56 -45 17 140 47 -26 52 116
2409 116 -30 -16 65 5 3 -40 10 7 -13 -62 -53 -3 -50 -61 -88 29 15 -117 -49 126 39 -104 61 149 26 -93 115
2436 115 113 -41 -48 99 115 -124 -76 189 40 -171 -64 131 -12 -231 -79 88 -51 -133 33 70 -69 -84 121
$$ packed form
2262A15j21j41O3K06j50j71K31J32k65K1J70O9k01N6P4j6j62J24J52k04j13K03
2284G2L5k44N3J32m2j50J33J14j31q2J24j6j09R2R8j30l7J27K7o1M0O6p1j65K08
2309H3j2p6n3J69m7j84P1J56q8j26J26N2k30O4J63k4j86J17J24j02j66K31K2j10
2333b6k5J59mj61L2J89q3j49J16P8n7j14J38r4p0M6P6n8k3J2K6q2J9Q9k3r9P9
2360iJ6q5N0J05p0m7R1N4q1k8J34q0p2J0J91j77j27J98M2j95o7K59p8j54M8J90
2386A18j21j50J42J41j53q0J35M7j30q1K10N6k12L1K16j13j01O2J23r3p3P8O4
2409A16j46J4Q1o0km3N0lk0m9RN0m7j1k7J17j4j32O8J75q7j43J65Q8j23j19K08
2436A15kj54pJ47J6k39M8K65j49k11J07J95j43k19J52J67j39q2J66L7j39j5K05
$$ plain form
2459 121 65 -156 11 114 45 -83 -4 165 42 -66 81 131 15 9 23 87 -20 -13 6 15 -81 -42 -8 23 -69 -99
2485 -99 8 67 2 -131 40 48 -18 -110 17 81 -48 -78 101 137 28 -15 162 46 -69 -32 164 -5 -81 27
2509 27 106 -50 -114 -19 102 -80 -155 1 1 -133 -83 84 3 -111 3 74 -22 -56 43 61 12 -42 62 100 47 -54
2535 -54 33 -8 50 18 29 -27 1 -17 -6 -49 -60 -39 -48 50 -45 10 -66 41 -40 -51 -7 39 27 -111 74 55 55 8 64 38
2565 38 7 22 61 -43 14 16 68 -26 -78 -8 20 -11 -88 -13 -16 -100 -1 -21 -75 -39 -1 2 -46 13 43 23 2 61 38 20 -4
2596 -4 58 15 2 40 29 -23 -22 28 20 -24 -43 86 -27 -113 10 44 -30 -75 -15 19 -55 -74 -1 72 -43 -43 109 51 -8 28
2626 28 124 33 23 67 100 12 4 6 25 -2 -3 53 -19 -79 -69 -31 -91 18 -54 -20 5 -62 -56 -79 17 44 -39 -17 105 9 -63
2657 -63 31 121 -45 -70 57 70 -5 -61 56 51 -60 -12 122 -24 -148 38 50 -49 -112 28 47 -101 -79 23 18 -98
$$ packed form
2459A21n6k21J67J03o9j28P9J69j23j08J47N0j16oJ4O4j07PJ9Rr6L9L4L1r2l0
2485i9J07N9o5j33J71Qo6r2J27O4j29l0J79L6j09m3J77j16j15L7J96j69p6J08
2509B7P9j56o4R5J21j82p5J56%j34N0J67q1j14J14P1r6l4R9J8m9n4J04L8n3j01
2535e4Q7m1N8l2J1n6K8j8J1m3j1K1rR8r5N5p6J07q1j1M4M6j2j38J85j9%m7N6k6
2565C8l1J5L9j04N7KN2r4n2P0K8l1p7P5lq4R9k0n4L6L8Lm8N9L0k0k1N9k3j8k4
2596dO2m3j3L8j1n2JN0qm4j9J29j13q6J23L4p4m5O0L4p4j9P3P3j15%J52n8n9L6
2626B8R6r1j0M4L3q8qKJ9k7jN6p2o0J0L8o0J09p2L4K5o7Ok3R6K7q3K2J22r6p2
2657f3R4R0j66k5J27J3p5n6J17nj11M8J34j46j24J86J2r9o3J40J9j48K2J02nj16
$$ plain form
2683 -98 -3 63 49 -44 -5 60 3 -72 36 133 5 -95 12 34 51 -53 50 10 14 6 -24 16 -30 -14 -54 -64 -117 -97
2711 -97 -15 25 -33 -94 41 87 -6 -57 52 112 -56 -67 124 102 -27 -29 76 38 -116 25 119 17 -111 14 93
2736 93 -84 -51 21 66 -99 -57 27 29 -117 -29 85 26 -87 -46 93 19 -55 -6 56 15 -15 71 37 6 -6 87 71 -10
2764 -10 -7 16 -31 -12 -22 -27 37 -55 -52 -40 -17 -6 -21 -21 25 -54 -71 27 41 -61 -39 70 19 -59 -19 174 -18 -83 35 73
2794 73 25 -44 39 33 -25 -45 52 52 -97 -19 36 -36 -155 -51 18 18 -69 14 76 -21 -76 1 35 20 38 85 101 -6 17 43
2824 43 -19 -6 1 58 -19 -22 -14 -58 -8 -42 -72 -44 -12 2 -27 -14 -19 -89 -11 20 -19 -85 -33 25 53 -57 96 120 17 -46 95
2855 95 118 -13 -50 135 13 -119 -16 6 -12 -85 -22 73 -29 -113 -16 79 -84 -113 41 -14 -58 1 22 38 -35 2
2881 2 83 -18 -35 4 51 46 -14 39 43 15 -29 30 66 -3 -95 -31 -29 -30 -57 -17 14 -4 -64 -33 49 -60 -93 16 32 -28 -39
$$ packed form
2683i8R5O6j4r3L9O5n7p5J08R7j28j00J07K2J7j04J03m0Mql0M0m6J6m0j0n3K0
2711i7Q2M0n8o1J35M6r3n1J09O0j68j1J91k2j29kJ05l8j54J41R4j02j28J25P9
2736I3j77L3P2M5j65M2Q4Kj46Q8J14n9j13M1J39p4p4M9O2m1l0Q6l4l1j2R3j6q1
2764a0LK3m7J9j0nO4r2LJ2K3J1j5%M6p9j7R8J4j02K2J09n1p8M0J93j92o5J18L8
2794G3m8o9Q3on8k0R7%j49P8N5p2j19J04O9%q7Q3O2r7n5P7L4j5J8M7J6j07K3K6
2824D3o2J3PN7p7lQm4N0l4l0K8L2J4k9J3np0P8L1l9o6N2N8K8j10J53K4j03o3J41
2855I5K3j31l7J85j22j32J03K2j8p3O3R5j02q4R7R5j63k9J54n5m4N9K1J6p3L7
2881BQ1j01j7L9M7no0N3Mk8m4N9L6o9r2O4Kjk7M0L1j8o0L1Q2j09l3J09J6o0j1
$$ plain form
2912 -39 116 49 -56 3 108 77 -16 -56 115 -1 -49 43 113 -63 -88 4 48 -42 -85 36 41 -51 -81 28 -1 -92 -48
2939 -48 42 -8 -28 -31 103 37 -70 3 74 -8 -6 -17 60 10 -15 39 8 -38 -62 7 49 -38 -59 -24 -32 -57 -19 55 14 -45 -83
2970 -83 40 20 -138 -38 69 25 -108 27 77 62 -42 -21 95 -17 -50 70 104 -21 -57 31 40 -31 -38 97 7
2995 7 -83 -38 18 0 -129 -7 78 -6 -47 -67 103 13 -43 29 27 -20 -4 -8 29 68 20 39 19 24 -17 85 16 -25 -22 37 -12
3026 -12 -9 -27 -4 -39 -23 -33 -15 14 -70 24 11 -10 -8 -16 78 26 -19 -18 62 17 -13 47 13 -23 -10 25 -10 -4 21 24 -18 -14 23 -8
3060 -8 -64 -29 -6 -42 -71 -20 -47 -54 -39 38 44 10 30 13 -15 -38 28 71 -14 5 13 -9 -46 49 49 -35 -21 -20 -22 -56 -1 -33 -4 -27
3094 -27 -23 -44 -34 -56 -51 56 39 -20 -10 61 4 -31 27 -22 -14 21 20 5 2 -1 32 10 54 -61 -48 1 14 -13 -24 2 -66 -88
3126 -88 -20 -15 13 -31 -32 -4 -6 -39 -2 52 21 11 31 45 -42 4 81 46 -22 -2 112 13 -16 -11 58 23 -46 -27 47 -31 -13 -24
$$ packed form
2912c9J55o7j05N9J05l1r3m0J71j16m8R2P0j76k5R2M4r0m3J21Nr2l0J09k9r1M4
2939d8R0n0k0lJ34o6j07P3P1q2Kj1P7n0k5N4l1m6k4O9M2q7k1L5qk5L8P4m1n9l8
2970h3J23k0j58J00J07m4j33J35N0j5j04K1J16j12l3J20L4j25l6Q8Rp1pJ35r0
2995Gr0M5N6j8j29J22Q5q4m1k0J70r0n6P2km7J6mL7L9m8J9k0Nm1J02o9m1LN9m9
3026a2Lj8K3l5J6j0J8K9q4R4j3k1KqR4n2m5JQ0m5l0O0l4l6J3L5l5OK5Lm2ML7l1
3060hn6L5K3l6k9N1k7pJ5P7Ol4K0j7k8k3O6M3q5J9Qk2l7R5%q4J4Jkl4N5l2K9k3
3094b7Mk1J0k2NJ07j7n9J0P1n7l5N8m9QL5jj5llL3k2M4j15J3M9J3k7j1K6o8k2
3126h8O8NK8m4jK8kl3L7N4l1j0K0J4q7M6P7l5o8K0J14r9k9NO9l5o9J9P4p8J8j1
$$ plain form
3158 -24 20 -39 -38 3 -57 -78 -39 -57 35 2 43 53 1 -9 -4 -19 13 24 15 61 84 31 22 2 26 -30 -41 21 45 -33 -50 83
3190 83 22 -114 -23 39 12 -51 12 27 -30 -29 54 59 -26 -18 32 23 -73 27 59 26 -28 25 75 22 -44 27 -46 -14 -21 -1 -19 -15
3222 -15 -16 -7 -29 -19 -29 63 -19 -46 8 13 16 -30 13 12 -6 5 6 27 63 -29 7 -5 10 -17 2 0 49 -46 -11 -9 -58 -36 -39 -10 -15
3257 -15 -81 4 54 -65 -52 49 18 -24 -1 11 35 -25 15 89 21 -5 37 39 -28 -37 36 -17 -59 6 53 -83 -59 65 -42
3286 -42 -84 -76 44 -8 -16 0 30 19 -54 2 68 -26 34 9 2 -51 5 53 26 27 74 15 -1 37 -9 -7 -45 34 -24 -65 -10 30
3318 30 -7 -64 41 8 -2 -35 30 -16 -49 -32 42 -51 -53 58 29 -23 -47 12 47 -35 15 104 5 -10 10 0 -40 45 40 -32
3348 -32 -25 -36 27 6 -47 -2 41 6 -59 26 -11 -21 -7 -26 16 52 67 -30 -11 10 45 -9 5 19 6 23 67 68 -43 18 -30
3379 -30 -33 -83 0 19 -32 -64 13 33 -48 -69 17 66 2 -10 38 -17 -79 8 79 6 12 6 36 4 15 41 27 -30 -23 49 -5 -30
$$ packed form
3158b4M4n9JM1o0k1L9j8R2l3M1J0n2j0Nj5L2J1rM6K3n3rk0K4n6j1O2K4p8j7J33
3190H3o1j36R1O2k7o3O3J5n7JQ3Nq5QN0rr6J00L2l3n4N3N0n3o6P1p3L2pK0j8M
3222a5jRk2J0j0R2q2k7N4NLm6M3jj8J1JK1L6r2L6j2J5k7J9kM9r5L5Km9K2lK9n
3257a5o6Q5N0j19J3J01l1m2K3J2K4o0M0P4o8k6M2Ko7rP3n3m2O5M7j36K4J24j07
3286d2m2QJ20n2qJ6L0j1p3N6O6r4O0k5pn3N6M8k7JM7n9j6L8m6Kl8P9n8m1N5M0
3318C0l7n7J05l3j0l3O5m6l3J7P4r3kJ11k9n2k4N9L5q2N0Q9r9j5K0j0m0Q5np2
3348c2Pj1O3k1n3M5M3l5o5Q5l7j0J4j9M2L6J5r7J9K1L5n4J4J4j3J7M4Jj11O1m8
3379c0ln0Q3J9n1l2P7K0q1k1Q6M9o4j2M8n5o2Q7P1p3OoL0l2J1K6j4n7PP2n4k5
$$ plain form
3411 -30 19 -3 -24 -30 -5 9 -7 -5 16 4 -10 -4 5 73 31 35 40 28 37 41 6 20 37 2 74 42 18 -61 -36 48 20 -54 -24 19
3445 19 33 -47 -5 31 -68 -77 54 29 -93 -23 53 26 -24 -4 116 -38 -51 40 83 4 -19 5 41 2 0 61 69 6 -29 32
3475 32 41 -22 14 -11 9 -54 -19 71 5 -3 33 41 -19 -10 17 26 -19 -27 -35 6 -21 20 70 14 6 -38 -32 71 23 -75 -9 37 -16 -30
3509 -30 32 37 35 -10 -4 35 -56 -70 6 15 -28 -10 76 6 -32 12 49 0 12 -4 -21 17 -12 21 31 34 39 45 14 1 -48 -4 9 -21
3543 -21 -35 8 -86 -23 1 57 -49 11 2 10 24 9 -4 8 60 -5 -42 12 60 62 -8 26 36 21 -13 -2 14 -29 -3 -40 -43 -35
3575 -35 13 27 -15 -18 2 -46 -35 -19 8 -1 -31 15 68 -38 -26 -5 -12 -21 -45 64 -11 -12 -42 -9 -7 -16 50 25 -26 -25 48 -23 -4
3608 -4 -48 54 8 -9 -9 -30 -3 4 -12 -11 -6 33 -17 29 -18 35 38 -41 38 -18 28 9 33 43 -33 -23 -39 -1 5 54 57 17 -53 17
3642 17 -7 -68 10 -53 -41 51 7 -39 15 -23 22 48 38 -4 -4 38 -11 41 51 33 46 21 -10 -27 21 -55 -36 -72 5 76 -44
$$ packed form
3411c0M9k2k1oK5J4j6KK1j2j4ORO8m2MNj2RMl5J4J7l5P2l2k4p9K5Q4k8p4L0M3
3445A9J4q0M2L6r9rJ31k5j22P0P6k7n0K0J20j54j3R1M3p9k3K4L6l9kO1Qo3l5O1
3475C2Ro3L6k5K0o3L5R0o6qL6Qo0RK7Rm5qqM1k7M1N0n6qm4OJ03m8r8O6M6n3j4
3509c0O2Nkm5OL9r1j4P6Rm3J8Q6p0l8M4L7m9J2j6j7L8k9L3J0LNOl1j3m9M4J3l0
3543b1j4M3r4O3K4N6j06O0rQJ4j5j3J2N2o5l7N4M8Kp0L4J0j5l4J1J6m3K6l7lQ
3575c5M8J4m2lK0m8J1J6K7rl0M6N3j06J2K1prk4J09p5jl0L3KrO6k5n1JP3p1J9
3608dm4J02m6j7%k1K7Pj6JNL9n0M6m7N3Lp9P9n6M6j9K4J0p6J0j6L8OM9Lm0p0P0
3642A7k4o1P8o3J2R2m4m6N4l8M5K6j0m2%M2m9N2J0j8J3k5l1j7M8p6J9l6P7P1j20
$$ plain form
3673 -44 -32 0 20 21 -8 23 9 -45 -14 58 -2 31 80 88 -3 -48 30 36 -58 39 14 -5 28 43 43 12 -17 -9 44 -23 -51 -16 23
3706 23 12 -17 17 8 6 9 -28 -1 -10 -54 20 11 -21 2 -12 46 26 11 29 14 -2 9 5 23 7 -18 76 -35 -1 -57 12 -11 -29
3739 -29 19 -40 32 0 21 45 -20 25 60 13 23 38 3 28 -12 27 21 47 9 23 17 -30 -22 -17 0 -36 12 33 27 -23 -15 -20 -17 -12 6
3774 6 56 -39 30 -27 -24 0 -52 70 21 -26 29 56 65 7 7 20 -8 0 19 -25 -33 31 -5 -23 -35 30 -21 -28 -33 -27 17 5 -17 -14 -15
3809 -15 26 74 -19 15 4 -12 -6 10 6 36 -9 16 37 -57 8 35 4 -40 7 5 -5 -68 20 -39 -25 -40 1 2 7 -27 -23 -45 -26
3842 -26 -8 27 15 -18 23 4 11 48 -10 41 -5 23 48 29 17 38 -49 -12 -18 13 2 -46 29 23 20 -17 6 -33 6 26 -50 -8
3874 -8 -4 -17 -7 -14 12 28 14 -20 25 42 0 40 48 -45 -8 -24 16 -31 40 17 -37 -2 20 -8 -2 43 -25 -24 -12 -26 50 23 20 28
3908 28 -29 14 52 9 41 5 -12 -15 17 45 -36 -7 11 30 -20 -20 14 -24 4 -16 -4 -29 -33 -43 18 21 80 -4 3 58 -10 -18 45
$$ packed form
3673d4J2L2K0Jk9L1j4n4L1P2o0L3M9Qr1m5P8Or4R7k5j9L3J5%l1k9QN3o7k8L5L9
3706B3j1k9L4rkLl7K7rm4P4rl2K3j4N8k0j5J8j5j6J1mJ8j6k5R4j11L4n6O9k3j8
3739b9M8n9P2l2K1K4o5M5L5m7J0J5l5K5m0L9oK6l8J4om7QNJ7l6M8K1on0QnLNJ8
3774FN0r5O9n7LK4n2J22m9m7N5K7Rn8%J3k8QJ9m4qO4l6j8j2O5n1pnOM4j2k2Lj
3809a5M1M8r3L4j1j6OJ6mL0m5K5K1r4O5K7l1m4M7kj0o3Q8n9J4j5M1JNl4Mk2J9
3842b6J8L5j2l3M1j9PL7n8N1m6K8K5j9j2K1q7L7oL1j1m8P5oll7K3l9L9K0p6M2
3874hMj3J0pK6J6j4l4M5J7m2M0Qr3L7j6M0m7P1k3n4L5K2k8OM5o8JJ2j4P6k7lQ
3908B8n7M3L8m3L2l6j7lL2K8q1K9J8J9n0%L4l8K8k0J2k5mj0O1LN9q4PN5o8qO3
$$ plain form
3941 45 8 13 -5 28 18 3 8 -7 50 -47 -14 76 46 10 -8 37 29 -27 22 6 -40 -8 6 20 15 -35 -28 27 -7 -25 -30 46 68
3974 68 -9 -19 18 33 -45 -8 -29 -49 -45 -7 17 -26 2 14 -15 7 -12 27 3 -50 -41 27 17 -31 -18 71 3 18 10 25 -15 15
4006 15 13 22 27 -37 2 -7 -6 -9 17 16 -5 26 -2 -19 -47 -53 -21 -26 -22 -28 17 -2 -36 -4 -28 38 20 30 -3 -15 22 -4 27 -1 -11 -30
4042 -30 76 16 -46 62 40 -42 2 20 30 -26 -12 -7 5 16 -2 -21 -65 -11 21 11 -32 -20 14 14 44 -24 1 40 36 -50 8
4073 8 8 67 29 58 36 0 56 -19 1 -21 -33 5 -2 -22 -6 -35 12 -2 -15 -35 -28 33 -24 33 -26 28 46 17 36 -12 -7 32 49
4106 49 12 9 -23 31 -23 10 19 -22 -24 41 11 38 -6 6 -15 -12 -19 -67 52 34 -39 -29 -4 -24 -1 -20 27 24 7 -49 27 -35 67
4139 67 -40 43 -20 -20 36 40 13 8 59 5 7 -47 39 28 -26 11 -23 -29 -27 22 -18 -28 -2 -28 -35 -7 27 2 8 30 36 48 49 -25 -3
4174 -3 64 -12 -13 -15 -6 -13 -32 -37 -6 17 -45 -49 14 -20 -64 -1 33 -9 6 -7 23 -10 10 4 30 26 14 19 54 23 5 60 60 -26 0 40
$$ packed form
3941D5l7Nj8L3j0j5Nj5N7r7L3R0l0l6j8M5qn6M9j6m6L2J4J4nn0PN5l4j8nP6K2
3974F8p7j0L7J5p8L7k1k0ML8K4m3K8J2k9K2j9L9k4n3RO8j0m8J3Q9o8J5qJ5m0L0
4006A5kRNo4L9rJlK6jk1L1k8j7k8oL2nMoM5j9l4L2k4O6j8J0l3j2L7k6L1k8j0j9
4042c0J06o0o2J08k2q2M4J8J0n6J4NJ2J1j8j9m4N4L2j0m3J2L4%L0o8K5L9mq6N8
4073H%N9l8K9k2l6N6p5K0k2j2L8pk0J6k9M7j4j3k0PO1n7N7n9N4J8k9J9m8NL9J7
4106D9l7ll2N4n4L3Rm1kO5l0K7m4J2k1Lpm8J19j8p3J0K5k0K3j9M7lj7n6P6o2J02
4139F7j07Q3o3%N6Mk7nN1n4Kn4Q6j1n4L7l4oKM9m0j0K6k6pK8L4k5OK2OJ2Jp4K2
4174cO7p6jkRpj9nL1K3o2mO3l4m4O3L4m2J5j3L0l3K0oK6mj2NL5l1j8N5%q6K6M0
$$ plain form
4210 40 40 -14 -7 12 -5 -29 -28 -11 31 -6 2 -15 -37 -16 41 17 -13 18 35 6 16 43 43 -27 -17 6 13 25 -16 -1 4 31 29 -41
4244 -41 19 -36 35 28 -14 7 -60 6 -53 -2 -1 10 48 0 -24 18 -32 5 18 18 45 -16 -10 -35 21 4 5 15 25 14 40 63 33
4277 33 -27 38 10 16 26 -3 -7 37 -23 29 -31 5 59 -17 -13 -18 37 17 16 15 -9 -11 12 36 -7 -17 -18 11 -22 -42 1 -14 -70 -17
4311 -17 -24 -50 -10 16 -17 -28 -21 37 38 9 32 8 -46 15 34 28 -12 -3 46 106 -20 11 -2 22 29 -3 5 -19 5 -27 29 -12 18
4344 18 0 -8 4 25 -39 7 -34 -9 -18 31 -15 -18 8 55 -32 -5 37 26 -16 22 36 15 5 10 45 7 -20 -7 39 4 -1 -38 -10
4377 -10 44 -26 11 25 -63 6 14 6 -7 0 -9 15 16 10 23 17 -33 -12 19 13 -5 11 51 2 -29 -4 27 -17 -13 -29 -1 -2 3 -17 57 -1
4413 -1 47 -44 14 -8 -23 25 -9 -6 -14 15 39 -6 6 19 27 -23 7 39 -3 -28 -15 -44 49 -7 -14 2 -54 -19 9 69 -2 -34 18
4446 18 46 -57 -63 32 13 -17 -16 7 42 -17 65 -8 23 -22 30 30 21 1 -2 49 4 -28 -32 -24 -24 -15 -18 15 -15 34 -14 51 -15 14 49
$$ packed form
4210D0%n4PJ9j7k4JJ7M2l7Qj7k2K1N7k4l0L1J7k9J0K7%p0J0K3PJ2m1J5NK7kp0
4244d1O0n5P1pm2K1o7O6n9N1JJ1L8m8k4M2n0L7J3%K7o1Ok5N6j7JJ0J0j1K6K3l0
4277C3o0O5k8OJ0k9mM4o0N2o0L6N4p6MnN5k0jjk4kK3K4m3j0jK9l3k0M3j5n6N3
4311a7pk6M0K6l3j1PN8Jk9K3k4n4O1J9om0RM9O0j26L1j3K4Pl2Qk4K4l2N6m1L0
4344A8j8qJ2K1o4M6m1K5rM9m6lK6M7q7K7M2j1m2L8J4k1j0NL5l8k7J3M6l5nl7K8
4377a0N4p0L7J4q8O9Qqj3PrK4JoJ3on0K1L1oj8J6M0m9l1K5L1m4Mj6K8jNk0P4n8
4413aM8r1N8k2j5M8l4LqK9K4m5J2J3Qn0L0L2m2k5J3k9R3n6pJ6n6L5K8O0p1l2N2
4446A8K8j03oR5j9l0JK3L5n9Q2p3L1m5N2%rk0lN1m5l2mQ%RlL3l0M9m8O5o6K9L5
$$ plain form
4481 49 18 -52 2 -36 -14 5 -55 13 82 -4 27 48 5 23 8 29 17 11 -28 0 22 -1 8 -39 6 16 10 35 50 9 64 -41
4513 -41 0 -24 36 -18 -30 -21 17 -8 -33 16 -9 -39 10 -10 11 -42 3 45 -14 14 -65 -43 -49 28 -10 -9 -36 42 -18 49 -57
4544 -57 -3 21 63 23 -40 44 -14 -58 2 15 -8 20 -8 75 27 15 16 10 -6 -10 -2 -24 -39 57 -30 26 47 -2 -17 -33 -24 -16 -1
4577 -1 60 -22 46 22 0 2 -38 47 22 52 7 42 17 89 71 10 30 37 38 -8 30 14 5 55 -4 10 -2 61 16 49 18 42 21
4610 21 52 -1 -10 -6 20 9 -1 -1 -23 26 14 40 23 27 -27 -20 -32 -13 -27 1 34 -32 58 19 24 -38 42 -1 22 31 -5 22 -21 33
4644 33 8 29 -6 -10 9 -1 -13 -43 10 31 7 21 4 16 20 -1 6 25 -1 4 -6 20 -42 -28 6 27 15 -44 84 16 0 60
4676 60 37 62 49 -21 9 -18 36 -25 -64 35 -42 1 26 41 -31 30 15 -24 -18 -33 -41 -17 -43 -31 -55 -31 50 -3 36 51 35
4707 35 43 -20 -16 10 44 23 -3 6 -9 -5 50 30 43 50 48 100 23 14 -23 -16 66 22 -27 -15 0 -38 18 45 17 -7 36 -29 -20 8 -23
$$ packed form
4481D9l1p0N4l8K2J9o0O8O9q6L1K1m3J8j5K1j2ol9K8K2k3Rm7M5J0oK5J5m1N5j05
4513d1M1k4O0n4j2RL8k5k5M9k5l0M9k0K1n3M5M2n9K8p9K2oP7l8Jk7P8o0O7j06
4544e7N4K4M2m0o3Q4n8m4O0J3k3K8k8Q3m8j2Joj6mQk2j5R6q7N6K1m9j5j6RQJ5
4577aO1q2O8k4k2Km0Q5k5L0m5L5k5P2j8o1K0PJm6L8j6rN0n9J4j2O3m5L3l1K4k1
4610B1L1n3rMK6j1j0%k2M9j2K6j7Mn4Pj2J9j4K8L3o6R0l9No2Q0m3K3Rl6K7m3N4
4644C3k5K1l5mJ9j0j2l0N3K1k4J4j7J2Mk1PJ9k6Nj0K6o2J4L4K1j2n9J28o8j6O0
4676F0k3K5j3p0L0k7N4o1l9R9p7M3K5J5p2O1j5l9Oj5qK4k6J2k4K4Q1n3L9J5j6
4707C5Qo3MK6L4k1k6Rj5MN5k0J3PkN2p7rl7PQ2m4m9J2J5l8N6K7k8k4M3o5RK8l1
$$ plain form
4742 -23 59 -20 36 13 -17 -1 -2 -36 75 7 25 -3 25 41 -17 0 -11 -40 35 -13 44 22 -33 19 51 -18 -58 -30 15 30
4772 30 35 3 32 69 -24 28 14 19 12 -12 20 -6 18 -23 17 -3 8 -18 47 -27 7 35 -24 -41 70 11 -15 0 -36 28 5
4803 5 -45 -13 -6 -24 62 -13 -9 9 5 -41 -17 22 -19 48 4 -39 27 -15 -3 -21 5 -14 3 -1 28 -22 -29 -9 -1 8 34 30 -22 -43 -21
4838 -21 -42 14 -1 19 7 59 -5 8 -19 3 19 4 3 -19 -48 -19 8 41 -7 28 9 -7 -61 -7 -3 -5 4 -15 -30 -9 -27 9
4870 9 9 -9 0 23 41 -42 4 -32 -16 -4 19 13 -34 -23 -38 26 18 10 -10 -5 7 -56 -1 45 -20 25 18 -2 1 51 28 -3 42 6 35
4905 35 -25 33 -5 -47 62 3 -15 44 -8 -23 37 13 3 -60 -10 -25 1 -39 -16 43 -3 57 -24 -66 53 -23 33 -7 -16 -13
4935 -13 34 46 43 20 -37 -5 27 -3 -2 -17 -11 -64 -19 18 -22 2 -13 -51 -21 -49 -38 -76 -2 13 -20 37 -16 42 -5 60 -42
4966 -42 3 -5 -2 21 17 -28 42 -4 66 64 17 13 33 1 23 35 21 -22 14 -3 -4 42 -36 -24 -13 18 -24 13 -50 -5 18 43 74
$$ packed form
4742b3Q2p9N6k3l0J6jl4J11o8J8k8K8J6n8J7j1k9P5m8N7k2n5N2L2o9m0K8M5J5
4772C0Nl2K9L7r3N2j4Npk4L2k6K4m1M0k0J1k6O5p4L4K8n9j7J11n9k6J5l6O4k3
4803En0L2Pj8Q6p5MJ8mm6K4L9m1O7m4m3O6m2J2j8K6j9J7mK9n0pK0QRK6mn2k1K2
4838b1k1N6j5K0j2N2o4J3k7K2J6j5jk2k9K9K7L3m8L5j9j6n4N4MkRj9j5K1j8L6
4870I%j8RK3J8q3M6l6J6J2K3om7J1j5O4qqk0NJ2o3N5M6o5M5pk0LN0k3l1M5l6K9
4905C5o0N8l8m2J09n9j8N9n2j5O0k4j0o3N0j5K6m0K3N9m6O0q1m2J19p6N6m0rL
4935a3M7J2lk3n7L2L2l0Jj5On3M5L7m0K4j5l8L0k8J1l8P4J5l3N7n3N8m7O5j02
4966d2M5qLK3mm5P0m6P0km7mK0l2K2J2j4m3L6j7jM6p8J2J1L1m2L7o3M5K3K5L1
$$ plain form
4999 74 -30 -13 39 -20 -48 -10 -8 -24 -2 37 51 13 26 9 -36 -21 2 -12 -44 -25 -14 -20 2 8 -2 39 -4 -9 -17 41 -35 54
5031 54 -37 10 17 -55 11 32 -13 70 23 4 40 49 -34 -9 -12 -50 -11 18 2 10 46 48 31 16 6 -10 6 23 -33 19 5 32 23
5064 23 46 13 29 17 -17 45 -2 -53 23 -8 -42 27 -28 -50 -10 54 -7 23 11 -15 -49 -25 -51 -22 -10 23 -7 13 8 -1 54
5095 54 -4 4 7 -27 11 -35 -41 56 38 -32 -6 -38 -2 20 50 3 25 -17 -4 7 -9 -33 -45 21 2 14 3 32 -30 -87 -6 15
5127 15 17 -39 25 45 48 -31 31 -28 -2 1 4 -28 12 -59 4 7 -27 -22 7 -19 5 -29 -9 30 13 63 28 -17 25 36 -7 -8 -37 45
5161 45 -39 16 32 5 -26 -32 18 22 -49 -11 5 -32 43 -42 7 9 -11 -49 30 6 4 -77 -35 12 35 -15 7 14 11 15 -14 41 40 72
5195 72 34 -5 18 -32 17 0 16 -8 -28 5 50 -8 10 16 7 26 -17 -41 60 52 10 18 0 10 -30 -63 -34 60 23 50 6 2
5227 2 -55 12 0 23 56 37 22 33 -6 39 23 35 28 -11 -20 0 -8 -16 -17 -20 -32 29 10 -58 -32 -38 -58 10 23 31 43 10 17 31 -4
$$ packed form
4999G4j04J7N2n9k8L8Kj6K2L9J4l8J3j7m5J5K3j4l2J9J1oK2Oj0M1m3nqN8p6Q9
5031E4r1M7Pp2O6K1m5Q3m7j9L6Rq3K5ll8L9K9j6QL6Kj7j5j0j6J6J7n6N2j4K7r
5064B3K3l3J6j2l4O2m7n1P6l1l4O9n5k2M0O4o1L0j2k6l4K4k6K9J2L3l0K0nrN5
5095E4n8QLl4L8m6oR7j8p0K6l2L6K2L0m7K2m2J3J1j6k4j2O6j9J2j1K9o2n7Q1K1
5127A5Kn6O4K0Lp9O2n9K6LLl2M0p1O3Ll4NK9k6K4l4K0L9j7N0l5m5M2J1m3jk9Q2
5161D5q4N5J6k7l1oN0Mp1L8J6l7P5q5M9Kk0l8P9k4kq1M2M7K3n0K2PlMk9N5jL2
5195G2l8l9K3n0M9j7J6k4k0L3M5n8J8OrJ9m3k4J01qm2Qj8J0m0l3K9R4l7K7m4m
5227Bn7O7j2K3L3j9j5J1l9M5j6J2pl9rK0qqjlj2O1j9o8K6ok0O8J3QJ2l3PJ4l5
$$ plain form
5262 -4 17 20 27 -43 -10 -64 1 8 -27 -9 38 40 -41 -15 -4 61 12 3 37 26 -39 -21 27 -1 -50 -36 -22 -1 4 -1 -67 -25 14 18 -10
5297 -10 -54 -28 -32 -84 -1 -19 -26 -40 27 14 -17 -11 14 -1 -22 -5 53 -80 -31 16 16 -8 -18 10 7 51 36 -12 13 3 8 19 56
5330 56 20 -15 -29 6 -44 -21 -26 8 -6 -56 -8 -42 -17 -12 7 14 28 23 -31 -5 53 33 33 44 -27 -22 -8 -9 42 32 8 39 21 -17
5364 -17 -19 34 15 37 -32 -17 -22 -8 29 -43 -2 7 26 -47 -22 -25 3 -20 -67 11 27 16 20 55 32 8 26 27 19 8 19 16 -52 16
5398 16 9 37 36 52 -1 -22 -9 18 16 22 -61 -42 -5 -19 16 26 40 9 2 -13 40 -30 26 -23 -53 -4 10 31 29 -39 -12 18 7
5431 7 -24 -11 -31 -57 20 17 -45 14 46 -6 -55 55 19 25 26 54 50 0 -7 11 11 29 2 18 35 -6 69 21 -66 11 -50 -39 10
5464 10 23 -20 -7 -12 30 4 32 8 21 -4 -35 -4 12 8 -52 34 23 18 31 27 -24 22 -9 26 -1 31 -11 25 37 36 16 50 51
5497 51 2 -20 -7 -6 50 4 -20 38 16 21 -16 2 -20 38 -34 61 97 -38 -27 -25 14 29 20 23 -29 11 17 70 6 -34 21 -43 -42
$$ packed form
5262dK1LPp0L3n4O5Pl5J8M7Kq1K6J1O5m9rL4j1o5J8M8k8m9J4J4K1Nno6M2L9Mk8
5297a0m4K6mn2Q3j8pj4O7j3l1OK5j5k1J7N8j33M9M7%k4j0K8lM4j5m8K5j0NJ1L7
5330E6l6l5j4L5n0K3nL4j4n0M8l4K5NJ9PJ4nn4K6N8k0%J1p1NJ4jN1j0k4L1j8l8
5364a7kN3j9K2o9J5nJ4L7p2M1RJ9p3K5lK8k3m7P8J6j1ML5k3k4J8Jqj1J1lo8O8
5398A6pK8jJ6n3k1J3K7kOq3J9L7j4L5J0J4l1pj5N3p0N6m9l0M9J4K1ko8K7L0j1
5431Gl1J3k0k6P7lo2N9L2n2m9J10l6OJK8mn0pJ8%J8k7J6J7m1P5m8q7P7o1J1M9
5464A0J3m3J3nM2k6K8k4J3k5l1L1J6mo0Q6j1nJ3mn1M6l1L5k7L2m2L6J2jk0L4J
5497E1m9k2J3JN6m6k4N8k2Nl7J8k2N8p2R5L6j35J1KL9J5rLn2M0ON3o4m0N5o4J
$$ plain form
5530 -42 16 -40 -44 0 32 -14 43 -42 -17 -7 -15 -10 46 -12 -9 -15 -64 -7 22 28 -19 -18 6 -12 -22 15 34 -39 -56 17 -5 13 3 -14
5564 -14 29 54 4 -9 -43 9 20 -31 32 51 69 23 -20 20 -16 -66 9 32 -70 -4 7 15 -25 1 34 -19 5 20 1 35
5594 35 9 8 12 -17 -50 -15 -2 52 -4 -12 14 19 22 -1 -47 -58 45 -3 -2 0 74 32 -39 1 2 23 4 -40 36 14 12 -5 2 0 -45
5629 -45 -27 34 44 -17 -30 -27 12 18 29 -5 -20 -35 20 20 63 -26 13 59 42 54 -5 2 12 19 20 -22 4 0 -22 56 15 3 0 -16
$$ packed form
5530d2N8n6mM4L2m6N7q5K5J0qNN6n8Lom9N7K9Om7JK4j8j0L7J9p3j7P3k2J8j0j7
5564a4M3K5n0j3l4N2J1n1O3J9J8m6m3M0l6n0P5K3j02O6J1Qm0K6L3n3K4J5j9L4
5594C5k6jMk9l3L5J3N4n6qK6NLk3m6j1J03m8JKP4m2p1M0JK1j9m4P6k2kj7Pkm5
5629d5J8O1J0o1j3LL9OJ1l4j5j5N5%M3q9L9M6j7J2n9PJ0PJm2K6mk2P8m1j2lj6
$$ [...]
8191B
##END NTUPLES=NMR FID
##END=
