##TITLE=1H_Pr 5263-2
 CDCl3
 8 sc, 
 25.10.2022
##JCAMPDX= 6.0         $$ Bruker NMR JCAMP-DX V2.0
##DATA TYPE= NMR FID
##DATA CLASS= NTUPLES
##ORIGIN= UXNMR, Bruker Analytische Messtechnik GmbH
##OWNER= root
$$ XWIN-NMR		Version 3.5
$$ Tue Oct 25 14:36:38 2022 Russian Standard Time (UT+4h)  she@DPX200
##.OBSERVE FREQUENCY= 200.1313499994
##.OBSERVE NUCLEUS= ^1H
##.DELAY= (6, 6)
##.ACQUISITION MODE= SIMULTANEOUS
##.ACQUISITION SCHEME= undefined
##.AVERAGES= 8
##.DIGITISER RES= 18
##SPECTROMETER/DATA SYSTEM= spect
##.PULSE SEQUENCE= zg30
##.SOLVENT NAME= CDCl3
##.SHIFT REFERENCE= (INTERNAL, CDCl3, 0, 15.7039)
##AUDIT TRAIL= $$ (NUMBER, WHEN, WHO, WHERE, WHAT)
$$ ##TITLE= Audit trail, XWIN-NMR		Version 3.5
$$ ##JCAMPDX= 5.01
$$ ##ORIGIN= Bruker BioSpin GmbH
$$ ##OWNER= she
$$ F:/spectra/data/she/nmr/H-F/1/audita.txt
$$ ##AUDIT TRAIL=  $$ (NUMBER, WHEN, WHO, WHERE, WHAT)
(   1,<2022-10-25 14:35:20.43 +0400>,<she>,<DPX200>,
      <created by zg, POWCHK disabled, PULCHK disabled
       configuration hash MD5:
       00 E9 B6 7A A2 85 ED C7 34 08 36 98 17 FE 4E 26
       data hash MD5: 16K
       54 37 EB 25 BE FD 22 8C E2 24 47 B7 5E 58 C3 E4>)
$$ ##END=
$$ 
$$ hash MD5
$$ FE 7B 98 90 14 7D B4 E5 34 CA 92 0A 75 9D D4 F1
##$RELAX= 
##$RELAX= 
##$RELAX= 
##$RELAX= 
##$RELAX= 
##$RELAX= 
$$ Bruker specific parameters
$$ --------------------------
##$DU= <F:/spectra>
##$EXPNO= 1
##$NAME= <H-F>
##$PROCNO= 1
##$TYPE= <nmr>
##$USER= <she>
##$AMP= (0..31)
100 100 100 100 100 100 100 100 100 100 100 100 100 100 100 100 100 100 
100 100 100 100 100 100 100 100 100 100 100 100 100 100 
##$AQSEQ= 0
##$AQ_mod= 1
##$AUNM= <au_zg>
##$AUTOPOS= <>
##$BF1= 200.13
##$BF2= 200.13
##$BF3= 200.13
##$BF4= 200.13
##$BF5= 200.13
##$BF6= 200.13
##$BF7= 200.13
##$BF8= 200.13
##$BYTORDA= 1
##$CFDGTYP= 0
##$CFRGTYP= 5
##$CHEMSTR= <none>
##$CNST= (0..31)
1 1 145 1 1 1 1 1 1 1 1 1 1 1 1 1 1 1 1 1 1 1 1 1 1 1 1 1 1 1 1 1 
##$CPDPRG= <>
##$CPDPRG1= <>
##$CPDPRG2= <>
##$CPDPRG3= <>
##$CPDPRG4= <mlev>
##$CPDPRG5= <mlev>
##$CPDPRG6= <mlev>
##$CPDPRG7= <mlev>
##$CPDPRG8= <mlev>
##$CPDPRGB= <>
##$CPDPRGT= <>
##$D= (0..31)
0 1.2 0 0 0 0 0 0 0 0.06 0 0.03 0 0 0 0 0.0002 0 0 0 0 0 0 0 0 0 0 0 0 
0 0 0 
##$DATE= 1666694119
##$DBL= (0..7)
120 120 120 120 120 120 120 120 
##$DBP= (0..7)
150 150 150 150 150 150 150 150 
##$DBP07= 0
##$DBPNAM0= <>
##$DBPNAM1= <>
##$DBPNAM2= <>
##$DBPNAM3= <>
##$DBPNAM4= <>
##$DBPNAM5= <>
##$DBPNAM6= <>
##$DBPNAM7= <>
##$DBPOAL= (0..7)
0.5 0.5 0.5 0.5 0.5 0.5 0.5 0.5 
##$DBPOFFS= (0..7)
0 0 0 0 0 0 0 0 
##$DE= 6
##$DECBNUC= <off>
##$DECIM= 32
##$DECNUC= <off>
##$DECSTAT= 4
##$DIGMOD= 1
##$DIGTYP= 9
##$DL= (0..7)
0 120 120 120 120 120 120 120 
##$DP= (0..7)
150 150 150 150 150 150 150 150 
##$DP07= 0
##$DPNAME0= <>
##$DPNAME1= <>
##$DPNAME2= <>
##$DPNAME3= <>
##$DPNAME4= <>
##$DPNAME5= <>
##$DPNAME6= <>
##$DPNAME7= <>
##$DPOAL= (0..7)
0.5 0.5 0.5 0.5 0.5 0.5 0.5 0.5 
##$DPOFFS= (0..7)
0 0 0 0 0 0 0 0 
##$DQDMODE= 0
##$DR= 18
##$DS= 0
##$DSLIST= <SSSSSSSSSSSSSSS>
$$ [...]
##$SUBNAM2= <"">
##$SUBNAM3= <"">
##$SUBNAM4= <"">
##$SUBNAM5= <"">
##$SUBNAM6= <"">
##$SUBNAM7= <"">
##$SUBNAM8= <"">
##$SUBNAM9= <"">
##$SW= 18.0517283424941
##$SWIBOX= (0..15)
0 0 2 0 0 0 0 0 0 0 0 0 0 0 0 0 
##$SW_h= 3612.71676300578
##$TD= 16384
##$TD0= 1
##$TE= 0
##$TE2= 300
##$TE3= 300
##$TEG= 300
##$TL= (0..7)
0 120 120 120 120 120 120 120 
##$TP= (0..7)
150 150 150 150 150 150 150 150 
##$TP07= 0
##$TPNAME0= <>
##$TPNAME1= <>
##$TPNAME2= <>
##$TPNAME3= <>
##$TPNAME4= <>
##$TPNAME5= <>
##$TPNAME6= <>
##$TPNAME7= <>
##$TPOAL= (0..7)
0.5 0.5 0.5 0.5 0.5 0.5 0.5 0.5 
##$TPOFFS= (0..7)
0 0 0 0 0 0 0 0 
##$TUNHIN= 0
##$TUNHOUT= 0
##$TUNXOUT= 0
##$USERA1= <user>
##$USERA2= <user>
##$USERA3= <user>
##$USERA4= <user>
##$USERA5= <user>
##$V9= 5
##$VALIST= <valist>
##$VCLIST= <CCCCCCCCCCCCCCC>
##$VD= 0
##$VDLIST= <DDDDDDDDDDDDDDD>
##$VPLIST= <PPPPPPPPPPPPPPP>
##$VTLIST= <TTTTTTTTTTTTTTT>
##$WBST= 1024
##$WBSW= 4
##$XGAIN= (0..3)
0 0 0 0 
##$XL= 0
##$YL= 0
##$YMAX_a= 899895
##$YMIN_a= -1089878
##$ZGOPTNS= <>
##$ZL1= 120
##$ZL2= 120
##$ZL3= 120
##$ZL4= 120
##$ABSF1= 10
##$ABSF2= 0
##$ABSG= 5
##$ABSL= 3
##$ALPHA= 0
##$AQORDER= 0
##$ASSFAC= 0
##$ASSFACI= 0
##$ASSFACX= 0
##$ASSWID= 0
##$AUNMP= <proc_1d>
##$AZFE= 0.1
##$AZFW= 0.1
##$BCFW= 1
##$BC_mod= 2
##$BYTORDP= 1
##$COROFFS= 0
##$CY= 11.3945322036743
##$DATMOD= 1
##$DC= 2
##$DFILT= <>
##$DTYPP= 0
##$F1P= 2.36226072786647
##$F2P= -0.459571619588291
##$FCOR= 0.5
##$FTSIZE= 0
##$FT_mod= 4
##$GAMMA= 1
##$GB= 0.15
##$INTBC= 1
##$INTSCL= 1
##$ISEN= 128
##$LB= 0.24
##$LEV0= 0
##$LPBIN= 0
##$MAXI= 10000
##$MC2= 0
##$MEAN= 0
##$ME_mod= 0
##$MI= 1.114404
##$NCOEF= 0
##$NC_proc= 0
##$NLEV= 6
##$NOISF1= 3.799351
##$NOISF2= 2.8
##$NSP= 1
##$NTH_PI= 0
##$NZP= 0
##$OFFSET= 15.70392
##$PC= 1
##$PHC0= -18033.85
##$PHC1= 10.0007
##$PH_mod= 1
##$PKNL= yes
##$PPARMOD= 0
##$PSCAL= 0
##$PSIGN= 0
##$REVERSE= no
##$SF= 200.130013532006
##$SI= 16384
##$SIGF1= 3
##$SIGF2= 2
##$SINO= 400
##$SIOLD= 16384
##$SREGLST= <1H.CDCl3>
##$SSB= 0
##$STSI= 0
##$STSR= 0
##$SW_p= 3612.71676300578
##$SYMM= 0
##$S_DEV= 0
##$TDeff= 0
##$TDoff= 0
##$TI= <>
##$TILT= no
##$TM1= 0
##$TM2= 0
##$TOPLEV= 0
##$USERP1= <user>
##$USERP2= <user>
##$USERP3= <user>
##$USERP4= <user>
##$USERP5= <user>
##$WDW= 1
##$XDIM= 8192
##$YMAX_p= 0
##$YMIN_p= 0
$$ End of Bruker specific parameters
$$ ---------------------------------
##NTUPLES= NMR FID
##VAR_NAME=  TIME,          FID/REAL,        FID/IMAG
##SYMBOL=    X,             R,               I
##VAR_TYPE=  INDEPENDENT,   DEPENDENT,       DEPENDENT
##VAR_FORM=  AFFN,          ASDF,            ASDF
##VAR_DIM=   8192,          8192,            8192
##UNITS=     SECONDS,       ARBITRARY UNITS, ARBITRARY UNITS
##FACTOR=    0.0002768,     1,               1
##FIRST=     0,             0,               0
##LAST=      2.2672688,     0,               0
##MIN=       0,             -1089878,        0
##MAX=       2.2672688,     899895,          0
$$ Real data points
##PAGE= N=1
##DATA TABLE= (X++(R..R)), XYDATA
$$ [...]
1849B3K97m76n64Q60J88j315O1J131J9j366M57J003q87j78J167J03j287J13J825
1868A174o97j412P01J533q20j355J514J102j670r18J633J82j660L62J329r45j466
1885a413Q71J525j259j256J454R37j424o94J561K79j360K96J057m42q26Q83Q37
1902A026o51p48J002j8m40j91P27l45n19L84L33q12N4M97l29n99L46M14p34j18
1922g21O54n5q70Q19K56k42n95Q97O7m50J28O93N7r16L75R34p23o58P04M34r06
1943a18k22J126l07j015J6J156m05r80J61Q32p69l39L66R49j211L2R12J18r31
1962f29L54J039l21o21J62R41m83n57L21N43n36n84P62J82p77P2M87r8n99k01
1982e43M91Qn00J95K28j0l51MN04o7k91K72K24O4j01J26m0K24l23Q8K74J58k85
$$ y = [23, 320, -156, -720, 140, 328, -987, -926, 205, 224, -1142, -685, 318, -569, -747, 420, 523, -764, -651, 1174, 477, -935, -234, 1299, 479, -876, 638, 1740, 70, -848, 785, 967, -693, -331, 998, 53, -1413, -542, 983, -276, -1532, -78, 859, -565, -1259, 302, 581, -779, -483, 574, 132, -694, 189, 1026, 375, -373, 629, 611, 171, -20, 707, 362, -157, 227, 560, -252, -198, 299, -30, -629, -283, 131, -603, -721, -67, -122, -992, -173, 83, -159, -754, 143, 210, -240, -112, 581, 638, -278, 97, 1031, 308, -350, 354, 788, -118, -340, 786, 479, -536, -520, 636, 231, -749, -588, 244, -525, -864, -498, 451, -760, -728, 184, 302, -629, -275, 764, 443, -178, -16, 925, 442, -115, 206, 749, 213, -371, 391, 573, -204, -132, 355, 257, -342, -543, -52, -44, -544, -349, -121, -131, -482, -478, 26, -41, -332, -60, 164, 228, 127, 253, 213, 437, 114, 202, 476, 634, 349]
2005C49k16J08o7l99J2L88J99p87k10P51K3r98L29Q01n42o16L99Q53n25o20Q55
2026H7P96j053m59J314J68j214Q0J179m27p03L35P59n64q29O28L86o35m02P67
2045B13J36j007k18J088l99p67N83M63l82m91N19N29m44K7K16J6l39M05K10o1
2065B97j62K06k0k35J82L18r08M48M92l78p31K49O74o31o76Q03N51j205O6Q93
2085B33j62q74O33M87k56j067J427O59j343o15J540K42j541N58J270p45j287J033
2103A92P60j248m91J197J61j054j25J145n62j092O54O86q78j18Q57P2p36J62R61
2122E43m73m73N83O37j001J64O64P7j036N43O81q53m56J070J08j080m05J529p40
2141H2j206O82J294r86j161J194P52j626j67J678k17j679J190R86r58q15J443
$$ y = [349, 133, 241, 174, -225, -213, 175, 374, -413, -623, 128, 151, -847, -518, 283, -259, -875, -476, 377, -148, -768, 87, 883, -170, -629, 685, 853, -361, -281, 898, 471, -232, 103, 862, 298, -531, 97, 483, -152, -554, 213, 349, -658, -876, 212, -187, -954, -371, 92, -290, -781, -262, 267, -177, -150, 66, 82, -257, 148, 358, 297, 135, 341, 321, 86, 268, 586, -322, 126, 618, 240, -491, -242, 432, -199, -875, -72, 479, -726, -660, 233, 71, -803, -170, 317, 61, -1006, 421, 1080, -263, -878, 662, 904, -637, -79, 1191, 446, -841, 192, 952, -296, -787, 410, 571, -483, -608, 537, -25, -1117, -463, 223, -655, -773, 84, 156, -580, -418, 543, 70, -403, 180, 817, -184, -20, 644, 721, -315, 228, 909, 56, -400, 670, 778, -302, -707, 822, 82, -1124, -442, 852, -134, -1295, -101, 651, -975, -1142, 536, 319, -1360, -170, 816, -142, -957, 486]
2158D86M47j158m05J582j57q88J35O73k64r22P26J37m95m91Q63k70o54L24M99
2177A68l18o08P31J39r44K83J045n61q09J180N88j556J10J358k28j337O11J327
2195A179r18r24J087P33j574l05J468J19j712k5J823r30j505J193J259j472o44
2212a148J230L97j527L59J466k99j293O14J227r26o70J093K45r28PP69j0r27O60
2231C39J06o85O5N01k64o42J84J002q12p09J156j48o67J7J176p91p36Q74O61j061
2251d34n07J414K51j228M9J545l58j312N16J058p19q04Q94O28j180o12J473k9
2269F45j667M40J196p48r18J014L68r93J56P33j25m38K60M99n72j89O87L66j004
2288b90J96Q62k32q57O42M98q50l04R97j70r55L44Q95n73j184Q40O53j142k06
$$ y = [486, 933, -225, -630, 952, 795, -93, 42, 715, 451, -471, 255, 392, -103, -594, 269, -1, -655, -331, 168, -150, -758, -27, 112, -832, -549, 496, -65, -874, 306, 894, -662, -552, 806, 578, -759, -148, 1179, 261, -663, 424, 1157, -417, -722, 746, 865, -847, -872, 951, 21, -1484, -291, 968, -504, -1148, 82, 479, -1048, -689, 777, 478, -815, -201, 1026, 100, -570, 523, 768, -160, -153, 616, 606, -321, 339, 445, -240, -175, 326, 62, -580, -396, 606, -206, -915, 241, 93, -574, -557, 619, -172, -908, -34, 627, -434, -941, 473, 724, -504, -455, 1090, 732, -580, -64, 994, 275, -529, 365, 993, -187, -799, 674, 645, -1022, -582, 614, -134, -1052, -38, 330, -663, -507, 226, 101, -337, -77, 422, -150, -339, 348, 714, -290, -94, 768, 536, -321, 321, 819, -31, -335, 662, 492, -463, -119, 776, 203, -981, -141, 512, -630, -836]
2307h36R43K80j274J37J237n08o09M03R22p60m32J018L12q85k39R05j05q41M76
2326A44L85k25o27N13O2l60j98Q03o31l53M50K20p17Q2P89n12l68L47L46n65N8
2347c57R47l3r36M92P00n78p36Q02N28r86m67J169L42j334J67R05n60r11O20P86
2367E60p16q91R15M16o18k27N78M79r08j22R21k76m83O21M00p38l3M96K04p25
2387a47L55J91j41p0r5K21l63K07J31l08m55O83k11l67QN29j51o54M97J84j32
2408h8m12N06r5k48O2P35j49p11N40M17m13m70P01L18n00l27M53N0o15K77M83
2429E14o56k96N70k11l02k28R45k09n86O1N47j98l79P95k12l08j50P93r8n99K86
2450G9M55m69k26K55M61l31j46L96l01k50N1K16l23j52J97K76n26l1m9K86J8J14
$$ y = [-836, 107, 387, -887, -750, 487, -21, -630, -227, 695, -65, -497, 521, 833, -52, -291, 614, 509, -332, 144, 529, 304, -323, 190, 252, -108, -306, 497, -134, -487, -37, 183, -534, -452, 337, -175, -543, -196, 150, -415, -357, 590, 557, -379, 113, 813, 235, -501, 301, 829, -157, -624, 545, 887, -447, -280, 625, 65, -846, -226, 560, -156, -1047, -132, 284, -334, -561, 17, 496, -412, -534, 387, 111, -372, 249, 649, -89, -122, 374, 578, -147, 208, 399, 258, 188, 93, 314, -49, 158, 289, -19, -474, 209, -2, -369, -361, 168, 17, -637, -140, 44, -88, -500, 6, -89, -337, -275, 460, 311, -400, 140, 557, 144, -326, 375, 693, 193, -134, 319, 369, -246, 31, 514, -142, -438, 132, -79, -381, -609, 336, 127, -459, -398, 149, -49, -428, 367, 155, -153, -303, 490, 392, -207, 79, 534, 65, -161, 94, 555, 224, 78, 474, 173, -77, -26, 190, -133, -285, -88, 188, -338, -369, -418, -132, -114, 0]
2472@m55N5O65j43l45R4L01Lk77QL05K52l35j3M03n63m7O93m72n51J83O50k93
2495A18q08L02M84j59m41L04J62j21k09O83k11n51M61L85j69n98K56M99j1o21
2515b45L48L80k37k70K31J14l75J67L5j76k34J65N2J87l75M0L73o8k73k37M71
2536G3j64J67l64J8L70K07n50N70K7l44P4O1L42m80k26N42O3q03L15L13m0p58
2558e87N03K60j78o30L86N72o27l47P91O7n63J75L50J48m73K23K85k53m73N67
2578A96J09k16l52N69Ml83j0L35L7l40k2K53o0l68L23j56k59k11O23k84R7j19
2600b34P7N7N2K15l27K79O8R4m69N44j62%j13J67q2j33J4K79k78j68M26k17j46
2623e7j92K3M68n09j06L84j22j69O3K10J24l58J01L32l57K12L4K87m26J37J56
$$ y = [0, -455, -400, 265, 122, -223, -129, 172, 175, -102, -94, 211, 463, 128, 115, 518, -45, -92, 601, 129, -422, -239, 411, 118, -690, -388, 96, -63, -504, -200, -38, -159, -368, 315, 104, -447, 14, 399, 230, -368, -112, 387, 376, -245, 103, 483, 246, -24, 207, 321, -54, 113, 148, -28, -262, -97, -45, 142, -233, -193, 180, 112, -161, -398, 73, -91, 76, -288, -270, 100, 307, -243, 327, 354, 10, 84, 145, 487, 7, -219, 323, 386, -417, -102, 211, 171, -587, -84, 176, -2, -632, -246, 326, -301, -648, 143, 210, -353, -178, 172, 320, -153, 70, 355, 102, -371, 196, 305, 89, -263, 306, 310, -73, -83, 252, 289, -51, -73, 180, 120, -248, 75, -81, -340, -551, 72, -212, -115, -234, -157, -100, -48, 167, -160, 119, 187, 281, -188, 356, 194, 194, 81, 248, 166, 33, 47, 326, 48, -120, 306, 89, -57, -249, -226, 242, -267, -373, 11, -111, -280, -217, -7, 117, -241, -140, 192, -165, 47, 81, 368, -58, 79, 235]
2644B35j24j62J12J89J1m84J51K83j33j52K49k09j13j74K20o5k25J90K13l80J3
2665c55L67j70n4P7J94J5NK82j44l12M8L66J30k90O5j85j98K57L29l79j17K57
2687A88j20m73J35J16J70k84J33J69j1l40J09L79n40m2N65r5l55NO57K05p01K04
2709G4K72l35l03M12Q6Q9n71L92K27n04j01K45j7j01j5J50j48r3J69k54K55q8
2731a59J85L9L8q6K14p9q3q2K6J84J76l53k9P0K34k8p34O07l8k72k20N37r2l09
2755b54k3L65k53k66K45L40j75n03M69L61l99j76L68L22p15J26N41K87r23J69
2775i4M39k65j09L01J22j5p78M23O0l20k65N69k00q6j82r3M56Q6l00Q1j68K57
2797h1Q7j64J34oJ92j60J61J08k67M1K90j22j58k25M16q6o35N71J87m04l21M80
$$ y = [235, 111, -51, 61, 250, 261, -223, -72, 211, 78, -74, 175, -34, -147, -321, -101, -166, -391, -201, 12, -368, -355, 12, -158, -212, -135, 59, 74, 79, 361, 217, -95, -47, 319, 449, 159, 224, 39, -159, 98, 427, 48, -69, 188, 68, -405, -270, -154, 16, -268, -135, 34, 23, -317, -208, 171, -369, -411, 154, 59, -296, -291, 366, 571, -130, 74, 346, 11, -292, 120, 206, 295, -276, 116, 343, -161, -262, -17, -34, -135, -150, 0, -148, -241, -72, -326, -71, -159, 26, 65, 103, 17, 231, 152, 69, -13, 13, 197, 373, 20, -9, 61, 295, 267, -467, 140, 102, -170, -390, 147, 55, -254, -277, 88, -165, -431, -186, 154, -21, -524, -55, 306, -93, -269, 99, 421, -294, -168, 373, 660, -263, -94, 345, 80, -29, 272, 394, 379, -399, 24, 84, -236, -501, 68, -132, -218, -400, -493, -37, 49, -251, -170, -338, -81, 6, -158, -24, -30, 162, 2, 163, 271, 4, 45, 335, 213, 55, -170, 246, 160, -475, 96, 283, -121, -442, 38]
2819C8N15r63J00M63J37o25P2M87l54m6M38j2j2n54P40J08o72M1K51L54n58M06
2841C54j31n7m39K12L09l09M8p7K44j34ol01K41p9R2J29j21p4j7o3Q4K42k14m2
2865a09N99j84j41k91M04J9o32L92N25m57n2k23N46o19k53N87n4m62j58N70K78
2886B85n56K4N94j89o59L53L67l37L8K11P5j48k57M69P1m62k54N42%k50j08O8
2908a23J79k49K57j09J53k80J92j75k09J82N0K6l82J14L76j1jj84Q8N37j42l54
2930f5J51m2K8k19J84j9K43qp1J06n40J53K3J19l25l5L82K10m42r5L52qm41o8
2954d27N98m75J71K39L23n42J18J49j51k41K76K85j27j58o5L05J6n29L19k48J02
2975f2o5O6P6m14J27M18N9k91o9J48J10l73K10M7J8n1k31M30R5p8j71K1J77j02
$$ y = [38, 553, -410, -310, 153, 290, -335, -263, 224, -130, -176, 262, 250, 238, -316, 424, 532, -140, -99, 152, 506, -52, 354, 223, 166, -273, -61, 248, -61, -13, -90, 154, 20, 14, -287, -46, -125, -33, 96, -25, -99, -116, -179, -95, 147, -67, -109, 490, 306, 165, -126, 278, 297, -335, 57, 582, 125, 73, -150, 396, -223, -476, 111, 57, -405, -563, 7, 285, -271, -247, 347, 158, -501, -148, 219, -118, -80, 131, 206, 58, -199, 270, 341, -121, -375, 167, 167, -83, -191, -123, 56, -193, 64, -45, 108, -172, 20, -155, -364, -182, -132, -106, -488, -374, 2, -9, -10, -194, -106, 431, 289, -65, 86, 44, 72, -147, 37, 18, 261, 253, 182, 288, -252, -99, -76, 43, -282, -317, 65, 275, -167, -262, 90, 82, -359, -427, 171, -304, -133, 106, 429, -113, 5, 154, 3, -238, 38, 323, 196, 38, -27, 278, 294, -235, 84, -164, -62, -127, -61, 15, -399, -272, 146, 205, -86, -155, -7, 103, -270, -60, -13, 5, -46, -277, 153, 248, 170, -1, 20, 197, 95]
2999I5j94K14j61K3P4J18j43j60J7J21N6l95k3N58j13n75N08j42L5l77N21J79
3021B36l71J09L06k97k34L9O37j86l39K67J45q7j09K47j69k53l17L54J66k23j19
3042a98R2K41m19J00L76j47m80K72p2L29k73K36K27j54l59J09K94K8j31j08J56
3063A19j57J33j55L7k2KJ03J46j6l24k97M05p9j28J6L56n84M6M53o5k28J34O9
3086c6J88l17O4M2L00j91j61L11j35J08k10K41o7l9k18J23M5j41J38p9K52n10
3108b92K81J14k55k44K18Q6q3j68K89J49k89J69J33%l44M00k28J70%J26j87j77
3130a32J28Q5k66J52J07j83N9K1J14j06Q8o9p2R6j04P2l9k61K51Q2p3j9J98o5
3154F4Q6J11N4j49l07K52K42o23M41J60j15l09J53j42Q1L3jO9k79J8R2j26J55
$$ y = [95, -99, 115, -46, -23, 51, 169, 26, -134, -117, 4, 60, -335, -358, 200, 87, -488, 20, -122, -87, -464, 57, 236, -135, -26, 280, -17, -251, -212, 425, 239, -100, 167, 312, 225, 116, 363, 194, -59, -376, -22, 144, -79, -198, -106, 135, -284, -184, 192, 45, -435, -163, -235, 94, -179, 57, 284, 130, -229, -120, 174, 202, 71, -37, 119, -38, 95, -60, -23, -45, -43, 60, 206, 190, -134, -431, -26, -105, -233, -217, 139, -445, -399, 54, -11, -239, -105, -36, 152, -165, -101, -59, 241, 50, -111, 200, 65, 173, -37, 204, 137, 98, -120, 3, 48, -93, 45, -34, 218, -292, -11, 103, -152, -396, -178, -92, -175, -343, -54, 95, -194, -25, 108, 108, -236, 164, -64, 106, 106, 232, 45, -132, -4, 81, -185, -33, 74, -109, -50, -29, 85, -21, 67, -2, -74, 22, -82, -10, -49, -310, -59, 23, -50, -69, 129, 64, 150, 261, 315, 166, -141, 111, 353, -270, 171, 331, 216, -93, 60, -82, -1, 32, 31, 100, -179, -161, -69, -195, -40]
3177d0k58M00q0k26K45j70m1k06L01K82k57K02k0J54l05J31j00J69l15K24J74
3198B64l26j71K54J13q3q6j0j57l6M26k02j6j52L86j65l38J86J31J47l29K46j49
3220f7J04j61L24j23r7J4P0J03j57K58j77l50K18J92k3k86n5P5j43K00M5J06n21
3243d51L95K94k48l23L46L67l21j13J71lj03J21K6j26j84L21M7l53K20p4k1On1
3266e7K5j2j48N6K01j38K45j63M0Nn6J53j55k48O0M31j94N6R5j73J95j67K02k26
3290B7K23j78K5l04K25J54j88j32K61j64n21L70K54j24k19R1J92j43j51K23J60
3311H1j63L0Q3J53l1r6J94j77k5O7m7%j46M72k75j58o2J18J63r9k8J88l26p7K46
3336H5m28L8K89J36j85j68L19k76Q2L07k38K20j67J40r3O2q7J59k70L9J01p8j02
$$ y = [-40, -298, 102, 22, -204, 41, -129, -170, -376, -75, 207, -50, 152, 132, 286, -19, 112, 12, 181, -134, 90, 264, -62, -233, 21, 134, 51, -35, -45, -202, -238, 188, -14, -30, -182, 204, 39, -299, -113, 18, 165, -164, 82, -67, 37, -124, 200, 77, -20, -6, 64, 167, 10, 268, 91, -259, -41, 151, 128, -158, -213, -138, -281, -81, -36, 70, -451, -56, 238, -10, -333, 13, 380, 59, -54, 117, 114, 11, 132, 158, 32, -152, 169, 216, -137, 83, 9, -12, -6, -57, -32, -44, -192, -136, 65, -73, 172, 9, 49, 54, -2, 151, -4, -252, -192, 239, 45, 101, 196, 23, 218, 51, 253, 27, 250, 72, 97, -207, 18, 172, -16, -148, 113, -51, -572, -202, 52, -72, -291, -200, -8, -151, -302, -79, 81, -82, -52, 31, 184, 153, 57, 251, 74, 49, 116, 69, 69, -77, 395, 120, -38, -100, 18, 181, 82, 54, 242, -84, -161, 85, -343, -305, -16, 120, -65, -233, 86, -190, -108, 199, -39, 181, 14, 154, 61, 123, 36, 195, -75, -36, 65, -13, -115]
3359a15k63L83K52l06j60M48j54m22N7M79k35k42O8L54l51k22K75K84Q1j76Q2
3380A17J46k98J8K2j34K09k74K97j23k44L46J46j7l15jO6K07k50n0J33l1M0j89
3403a79K30J45j51J7o8n5O5L1k9R8j38J01J63j53k90K48M3j17J39n2J70k36k14
3426b32K29J57l40j20M98k26j57oK24J2k58l2N67j65k03K24m9k61m1M37m0l47
3448a29K10P5o9l49J78K53j3j46j60R5J1m5%J7J59j58J13k13K19j84m5L87l97
3471a91O6J86j3J19j50J3J68R7j23n4j20O6MM1k2j91K23j09ml3m3l8k0J2PQ4j05
3498a30q0Q1M14m16j3L94n8k03n0k4L27m2m37L27N4k55Q0J48L5m54L9M12k06J5
3522d2Q9J4k52J45J38l61K75j46oJ19Nk72J74K56k14n9J64P9j36o8J52J19KK9
$$ y = [-115, -378, 5, 257, -49, -209, 239, 85, -337, -280, 199, -36, -278, -210, 144, -207, -429, -154, 130, 211, 35, 117, 263, -35, -17, 5, -129, 80, -194, 103, -20, -264, 82, 228, 211, -104, -105, -39, 168, -82, -132, 1, -30, 10, -179, 51, 196, 45, 62, -6, -61, 4, 35, 6, 104, -34, 67, 230, 77, -213, 35, 78, -39, 100, 48, 218, -18, -232, -3, 154, -186, -306, 192, -34, -191, -197, 27, 39, -219, -251, 316, 151, -52, 172, 123, -138, -179, 258, 218, -129, 81, 156, 87, -262, -84, 169, 156, 10, -150, -55, -44, -89, -89, -72, 87, -71, 42, -171, 48, -136, -181, 206, -191, -125, 61, 48, 167, 17, 30, 198, 295, 172, 118, -2, 64, 68, 109, 87, -104, 119, 10, 6, -27, -70, -108, -128, -116, -109, -25, -130, -210, -129, 285, -131, -144, 250, 192, -11, -61, -85, 242, 200, -237, 90, 144, -111, -31, 117, 152, -302, -263, 149, -57, -42, 47, 61, -191, -46, 92, -269, 6, -140, -146, -27, -22, -294, -120, 136, -78, -137, 27, 106, -30, -98, 54, 173, 175, 204]
3546B04j2p5k66K60j13Q9m1j21P3R5j54kK03k32q1P8K37l99j9J94N4k4L9J34Q0
3571B01m97M4O03K8l60m5J61r6k92J16R9J84k37P4M9k08o4J85n6j21J42l7J48
3594B1k43n6J59M9r1Q0L16n5j36j02L0K7J82j45J78N4j91j33O2m6j43J29P6r9
3618g7m0o3K44J35l92Q9K58l71R1K7L5j85J03m4J99J22j44LJ6L0j1K58r9l5j18
3643C1K7J47q4q3l1k0Rr2l4o0L44j71K49j62k98L60j23k75L18j05R4r5J34n6n5
3668c1M7K4J49J5k45j21K69M1oj55MJ53k51J44K19l26j25p9J87J49k96J62L04
3691B32n15J02R1J90j92n1L02J5m51J52J35K27J5n9kj8l1J6j17K7J98k44o2j1
3715e1%J99k26K41m38K40R4j76m6j7J63r1K1kJ85k60J98K58k37P4k69J32K1L56
$$ y = [204, 192, 117, -149, 111, -2, 87, 46, -75, -2, 93, -61, -63, 140, -92, -173, -95, 142, -257, -276, -82, -28, -52, -13, 121, 201, -296, -252, 351, 379, 19, -26, 135, 39, -253, -137, -38, 146, -91, -17, 32, -176, -240, -55, -111, -232, -90, -127, 21, -222, -278, -119, -70, -161, -81, 235, 180, 44, -58, -28, -1, 181, 36, 214, 268, 77, -56, 6, -40, -183, -54, 22, -77, -117, -180, 64, 199, -193, -104, 154, -217, -126, -99, -64, -249, -146, -190, 9, 131, -13, -10, 6, 36, 25, 283, 184, 149, 31, 58, 205, 121, 38, 7, -13, -4, -96, -130, -190, 154, -17, 232, 70, -228, 132, 9, -266, 52, -53, 41, -54, 80, 24, -31, 16, 40, 189, 204, -41, -162, 107, 148, 142, -13, -9, 144, -107, 37, 256, -70, -195, -274, -87, 62, -234, -72, 232, -283, -181, -90, 100, -92, -143, 159, 174, -277, -125, 10, 237, 252, 193, 191, 173, 142, 158, 41, 68, 266, 22, -40, -51, -51, 148, -78, 163, -275, -35, 59, -117, -163, -180, -17, -108, -87, -89, 96, -164, 34, 292, 55, 129, -140, -8, 13, 369]
3739C69m22J35p1k06J81r5J54j91O5k07J78J30n8P2k99K46p5k6L27j42j17K29
3761A77J21m20J26K52j22k45J72N7J0l8K0O3j17O6o4o3K04o9N8k38j06J82K26
3784B52m41o2M34m26J88O4j4Q9l78L84k90K86J27j16N5J66j68ok64J86J95o3j53
3807D5l2K00r1k25P0R7j81j08J72j77J16K21j43L54j91k73K64l51J44K70o3j59
3829d1K25k42J25M5J1j55N1L47l62j44J47r8J44n1j26K62k64KJ36k41L21l14j5
3852b37K04m5r9j93M42j49J59J0j93J37J81k71K39q5j10M93l25j62j63K88P8N0
3874B49j37j2n9l55K60J53m5k31K22J39j27l7n2Mr9Q2k3O4J9L2k77J40J94k64
3898a60K00j4r5P5J52J60n09J64J7j10k28J90J88O1k59J8J34l20K93k12L58l40
$$ y = [369, -53, 82, 11, -195, -14, -109, 45, -146, -81, -288, -110, 20, -38, 34, -265, -19, -94, -120, 207, 65, -52, 177, 298, -122, 4, 256, 134, -111, 61, 118, 128, 90, 110, 173, 56, 122, 58, -5, 199, 130, 188, -50, -156, 26, 252, -189, -251, 183, -243, -55, 9, -5, 84, -294, 90, -200, 86, 213, 97, 152, 318, 150, 144, -120, 66, 261, 198, 45, 13, 213, 122, -103, -33, 64, -117, -225, -53, -230, -114, 107, -36, 318, 127, -146, 118, -233, -89, 181, 118, -41, 184, -58, 67, 112, 123, -32, 19, 366, 4, -140, 7, -91, 53, 2, -124, 138, -126, -124, 12, -229, 92, -222, -237, -33, -78, -177, -370, 72, -77, 82, 92, -101, 36, 217, -54, 185, 100, -10, 483, 158, -4, -167, 121, 199, 249, 112, 100, 41, -314, -54, 99, 54, -177, 45, 184, 57, 20, -32, -28, -127, -45, -68, -4, 15, 47, -230, -90, 104, -160, 40, 26, -69, 6, 158, 318, -191, -27, -10, -120, -348, -158, 30, 91, -168, -150, -16, -336, -43, -255, 103, -237]
3920b37J91P2Q7lK0k4j76M1PK89k38J02nq3J09k1j74J98J49l21j83K56q3j84N7
3945a54K93N0m90J63N4N0k0l03K74L45k69l44K84J39j12J47m4J4K06l27M00k40
3967A16l15K1K12K35l47k8K80l1m22J29L95k32lj98K32n8pM6K55l77R3J03k22
3990a23O6J73k24l1J91m7Q5L09l71J9J3N7K8j08Q9l18l4M5L02k59J17j6n8j69
4014b64J41j2K67l73r6L11o8K76n5l31K00j19J5P5J5J26j26Nl90K59J77J15k84
4037a36K15Kl91K03J72j36r7P6Q1j23N1R0Lr6l7o3M20j18j63K01k09R8K7r5l9
4062f4k7j70P2J54nLN3J17J1j85k5n6J17r5l7L2k40J86J39n1o9J85p1K22k2j39
4088C5K62m15L66l45J69J48j38j92L96l73J08R3j77N4j67J59j59R3q4J99J74j99
$$ y = [-237, -46, 26, 113, 110, 130, 106, -70, -29, -22, 267, 29, 131, 126, 43, 152, 131, -43, 155, 304, -17, -200, 56, -27, -211, -154, 139, 189, -301, -138, -84, -34, -54, -357, -83, 262, -7, -351, -67, 72, -40, 107, 63, 77, 283, -44, 356, 116, -199, -178, 34, 269, -78, -106, 174, 143, -279, -150, 245, 13, 10, -188, 44, -14, -21, 25, 280, -97, -4, 99, -123, -57, 116, -108, -139, 52, 5, 90, 399, 28, 47, 60, 117, 145, 37, 126, -192, -226, -181, 121, -138, -21, -37, -95, -264, -123, -135, 132, -241, -337, -26, -94, 182, 127, -204, -4, -123, -108, -33, -18, 108, -18, -13, -403, -144, 33, 148, -136, 79, 81, -310, -107, 65, -71, -168, -92, -11, -134, -83, 7, 10, -86, -123, -186, 234, 116, -47, 154, -55, 43, 70, -25, -64, -91, -261, -189, -35, -40, -37, 16, 133, 144, -41, -66, -122, -5, -100, -137, -105, -345, -159, -20, -71, -140, 45, -26, 196, 174, 35, 297, -118, 248, -97, 72, 220, 82, -110, 286, -87, 21, 114, -63, -9, -176, -17, -176, -83, -167, 32, 206, 7]
4110GK5oK29m11K03k2k17R6q6K09Q8k3J7J45j80J76k52q3K15k28J4J2J53o7j55
4135a41J18J71j13k9R4j20o0K03L8j83J54l39N65k56j70J62j58j43O6J33O8oJ5
4158F9l5J36j37j00N2j25L74k75J67l50K04J98j45l31K25K34k17k33J52N3J01
4179A7k3j17J82M7j72J44K29l74j5O2J34m1L1K8k86J98k41J48R0j91J2J47j04
4202i5N9p3J71K5k28J8J34J46k61K41m6k32L22k01R2J2p9K39k3j71o7K38K16j91
4226B46k87R4K5k31j65J57j74K43q8J05j7k34J27J14j02N5J58J9J2k66J72L99
4248C62l52J06l2J01q3r8K51l98J67K92k87k18L60j82j04l8K45j10j62lK19j39
4270a03K50l25J71k35J49K1K8M7r4N7J35j53J28J40j39j51J35J2j70J52l46L35
$$ y = [7, 32, 26, 255, -156, 47, 25, -192, -96, -182, 27, 115, 92, 109, 254, 74, 250, -2, -85, 130, -98, -84, -72, 81, 14, -141, -23, 148, 35, 6, 100, -20, -80, 123, 161, -22, 132, -207, 358, 102, -68, 94, -64, -207, -141, -8, 60, 54, 69, 34, 170, 33, -67, -15, -140, 234, -41, 126, -224, -20, 178, 33, -298, -73, 161, -56, -289, -137, -84, 17, -6, -123, 59, 106, -66, 78, 307, -67, -82, -20, 114, 73, 104, 132, -154, 44, -197, -49, 41, -150, -138, 9, -95, -36, -109, 62, 87, -141, -123, 11, 157, -104, 137, 91, -141, 181, -20, 72, 84, 5, 244, 221, 50, -17, 221, 437, 246, -41, 53, 78, -153, -318, -161, -335, -92, -180, -75, -92, -326, -199, -85, -187, -132, 26, 45, 57, -209, -37, 362, 10, 116, 84, 185, 102, 4, 255, -143, 24, 316, 29, -189, 171, -11, -115, -153, 92, -18, -180, -183, 36, -103, 147, -178, -7, -242, -93, -72, -44, 3, -91, -34, 101, -52, 76, 216, 77, -74, 61, 73, -97, 55, -291, 44]
4292D4l50K59J00j22q5O7J71j58r9P2Q0J50j63KR7J37l72K51Q2j71j8k63N64j30
4316A45l19K51L8k5j10q8pP2L6J04K60k22l52K72m1k8%j19K32k82J74r9J31Lp4
4341d8lK18m72K05L51l84K26r1J10j62J72J45m0k09J13m3o4o1R5l47K14N3k77
4364b99L96k39J53j40J0j16lO9M5l5L36k04K25n34L60J17j50P5j74pJ72J06j71
4387hK60j78l3J90k89J81k05j43L21l36M16k75m1J23J9J99k41J96j82L13O1m10
4409f2L6J67J65k92o5L31k49m3R3m5j4j15K02n4L38m93J01K87n97K54k22M33k65
4432a09n7K29l24K94O4k1n8K06k65j22J94j16Q1M7J55k41j1j14L85R4n69K23J99
4455A64j03k16j09J63n8L25q4j96K32m22L80j09k12K44J26k02q8R3K72r8p1j18
$$ y = [44, -306, -47, 53, -69, -154, -87, 84, -74, -173, -101, -21, 129, -34, -32, 65, 202, -170, 81, 163, -8, -26, -289, 275, 145, -174, 77, 115, 90, -20, -108, -115, -43, -7, 97, 357, 135, -217, 55, 14, -14, -14, -133, 99, -183, -9, -108, 23, 26, -48, -51, 167, -305, -100, 251, -133, 93, 2, 112, -50, 122, 267, 227, 18, 131, 88, 24, -37, 58, -289, -75, -22, -299, 97, -142, 11, -129, -119, -235, -238, -169, -124, -159, 177, -27, 198, -336, 24, 141, -9, 66, -108, -115, 57, 163, -8, 252, 74, 41, 231, -58, 123, -82, -225, 96, -240, 176, -99, -140, -17, 2, 201, -40, 156, -26, 287, 348, -62, -26, 141, 306, 14, -51, 280, 31, -12, 81, 36, 22, -93, 109, 55, 393, -100, 1, 288, -309, -55, -277, 156, -109, -166, 63, -261, 33, 97, 76, 18, 224, -41, -163, 31, -85, -4, 43, 198, -43, -54, -168, 217, 311, -258, -35, 164, 61, -155, -264, -101, -159, 166, 82, -114, 118, -304, 76, -33, -245, -1, 125, -77, -165, -72, 200, 102, 31, -87]
4477h7J41O6j44R4J9k07J03o8R6k83J41R3j37K00l50R5L32k53J63J28j48j23K55
4500A26j81n4R6l6K51k21m5J54j72j14L56k66K51K18m36K01l0j34J99k67J4J04
4522A4n8M7m3P3OJ48q8l25K29K1j24r1J45Q1rJ35m1j19j45J06J74m5k31m1J14
4547f7J20O1Q0j67j74q0K44J38k82J10J7j65J1J66k81L69j26P7r2m4J8jK6j48
4571a90L49l9j80L39l10J39j40L3r0J0J69m03K80j17J34N4R5p5rL6j0k22n9J93
4595a3J60j80L2j76K25k77L18O2P4NK00m30J00k9j7Qj79J93k73L50p7j98K95k8
4619A45k45m3J04r4J54k35K03R2P6k84K04J1J7q7M4J08k20O5O5j00J1j18K57j02
4643B8j55J0K80l06J03r1J56L7n13M96j52M8k78K93J54k30J4J42J72l26J1L33
$$ y = [-87, 54, 120, -24, 70, 89, -118, -15, -83, 13, -270, -129, -36, -173, 27, -323, -228, 104, -149, 14, 142, -6, -129, 126, -55, -109, -13, -49, 202, -19, -64, 90, -82, -196, 160, -106, 145, 363, -73, 128, 98, -36, 163, -104, -90, 14, -44, 3, -40, 33, 39, 187, 99, -226, 3, 24, -100, -191, -46, 35, 26, 161, 120, 1, -144, -38, 136, 91, -140, -181, -67, 53, 114, 194, 27, -147, -227, 17, 155, -127, -17, 0, -165, -154, 12, -269, 100, -26, 51, -41, -85, -67, -68, -42, -190, 159, 120, -60, 279, -31, 108, -32, 1, -89, -79, 90, -313, -33, -150, -16, 38, 133, 58, 49, 85, 75, -147, -206, -13, 147, -33, -1, -177, 48, -229, 89, 151, 225, 230, 430, 0, 100, 71, 54, 62, -117, 76, -197, 153, 76, -122, 173, 145, -100, -143, -39, -133, 21, -214, -11, 81, 157, -127, 77, 88, 105, 18, 62, 170, -50, 15, 80, -20, -9, -127, 130, 28, -127, -117, 163, -143, -40, -131, 25, 62, -451, 45, -107, -59, -337, -44, 110, -120, -106, 36, 208, -118, -107, 226]
4665B26j48l21J75J46j12l0k6N3J70l44K20M8j00M5J80l2j32r9P0K3P9k1L4j10
4689fJ87j37q0J1j16k9J26K19j41J34Q2q1l08j6O8K67k39k32M71p7p0o8l4J75
4713A06j92M6J19P8l05O1k5Q2k59J11J59j78J0L61k24M5k08K67L6M7r9jj23L14
4737B28Q1m26l0J98J01LL5j33J31l64K33l25L30N9k69K8m0K12k68K50j34r9J11
4760h8L27k24J27l33K45m9j2K0P9KJ56l36R8O8k7J39l88K51m45O32l30j67L68
4783A13j32q7j2j89K53j05L90l20J01m6J24K13j27N3m2k30J69J44m50K49M0j13
4805dj44P8M6j29k1J10M3j77l5O13m37j43K17r6L2j55O3K87p5M0j34K4L3n2k4
4830d0K44m0q0j03r6J61q1K73o9j60nl7j19P5o5rK04m1j06k66L60k9J32J13k17
$$ y = [226, 78, -243, -68, 78, -34, -64, -90, -37, 133, -211, 9, 57, -43, 2, 182, 150, 18, -81, -11, 12, 91, 70, 104, -6, 181, 44, -36, -25, -141, -170, -44, 175, 34, 168, 250, 169, -139, -155, -87, 180, -59, -291, 180, 103, 33, -35, -69, 106, -86, -40, 79, 157, -148, -87, -112, -30, -289, -178, -19, -197, -187, 174, -50, -5, -213, 54, 90, 137, 38, 37, -86, 228, 309, -117, -147, 51, 152, 155, 190, 57, 188, -176, 57, -268, 62, 121, -148, -120, -160, 52, -216, 34, -100, -199, -88, 239, 15, 142, -191, 54, 5, -7, 13, 92, 94, 250, -86, 12, 80, 53, 192, -196, 55, -390, 242, -88, -255, 113, -19, -106, -118, -307, -54, -159, 231, -89, 12, -34, 90, 303, 176, 229, 187, -43, 126, 270, -180, 69, 109, -4, -148, -70, -24, -153, -174, -64, -21, -198, -233, 380, -57, -200, 17, -79, -47, -202, -139, 148, 73, 113, -21, 3, 36, -16, -40, 204, 164, 84, -19, -115, 46, -35, 238, 169, 9, 4, -33, -152, -77, -142, -151, 53, 12, -94, -360, 0, -29, 103, 216, -1]
4855aJ40k14J31j32p7J69J3j52J6M9J57k38q6L56mr1l4pk4J28k98N7j42J83J26
4880B5L7n6j80O0J24P6k8k54L38p5O5j62N3n2J6j0J43j8p0J7lj13J19K9j01K4
4906Dj38P9O7n8J26o6j89ML5M2k6K15j37J20J6j38J37N6k25O8K65q4j42o3j45
4931a77J42J15k29N7R4o0O6Q0j33l9J0m5k9J86l6J19O6K5J40l90j76K97m7K0n5
4956AJ49j83L3p7R7K6k1L3m8J89j38J23n49M36j29Q1j40J12k37L39j18j78L86
4979A87j67k46K99l6j27O8K42l84J01J16J09L4l45K19j89L25l69M35m43K26J05
5000A60j39j98M19k02k37L85p2j99J26j80K79j09qj43J14L3K8q2N0j5r1L07k10
5023A6K5m9O8n6J3J60k62K99k17l05K87J1M8qrj29K38m7q3o4J79r4j40l6J76J62
$$ y = [-1, 139, -75, 56, -76, -153, 16, 29, -123, -107, -58, 99, -139, -225, 131, 127, 36, 2, -5, -29, 99, -199, -142, -284, -101, 25, 62, 6, -174, -114, 10, 86, 58, -196, 142, 67, 132, -30, 23, -29, -13, -23, 120, 102, 32, 49, 46, -67, 52, 81, -20, 4, -134, -55, 12, -46, 80, 14, -175, -171, -136, -94, -120, 95, -42, 78, 94, -44, 93, 149, -76, -8, 257, 173, 31, -32, -177, -35, 80, -149, -92, 2, -58, 8, 88, -45, -84, -74, -119, -148, 38, 2, 121, 187, 212, 352, -38, -214, 83, 36, 56, 1, 150, -33, 0, -77, 20, 46, 25, 58, 10, 199, 61, 184, -365, 71, -58, 23, -117, -5, -242, 97, -21, -199, 187, 20, -226, 73, 37, -90, -22, 220, -164, -63, 53, 162, 196, -149, 70, -119, 206, -163, 272, -171, 55, 160, 21, -177, 242, 40, -197, 188, 116, -83, 43, -137, 142, 33, 25, -118, -4, 29, 57, -25, 25, 10, -81, 226, 16, 41, -8, 60, 4, 17, 177, -85, 214, -3, -308, -21, -10, 38, 30, 21, -108, 130, 83, 0, -64, 115, 21, -119, -155, 21, 183]
5049A83r7j42K24ml86K61R5L2j83n7K99l70M8r3l1K74j67J8J23j20P1n9K95k19
5073ej0O7k9r5k99L76n3J20j50J82k28KJ82R3k19J35q1NQ8L5k54L12p9k19J57
5098C3P8k79J09K9k0L1J05j48Q7nl6n6K14k56J45j15J62J15M7j00j07j46o4L60
5122A83l26K49r0j06K23m69L72J10j79O6j29J98j06n5K08j66n5j8J52k64J95j76
5144a83Q1K1J38oj95K61j14j33M36k57J01n2Q8m6k13L5R4jl2J0L8n0j65k7j4L23
5170A38j66j45K38M7j08o6O0n5j05J86O9nk91L07K7k88m8J97k2J28O1p8o8L2j14
5195f9j33K13j30L77K0l74J02JK40l15j5k7rL29j06p1N8J6q1OO8N2k26R4Kj35
5221a13K29l0k26J71k44J78j29P4l4j8J59L6j60j03M3L02j62m7O9J43k47J16J03
$$ y = [183, 86, -56, 168, 164, -222, 39, 134, 166, -17, -74, 225, -145, -97, -190, -221, 53, -114, -96, 27, -93, -22, -81, 214, -5, -15, 52, 23, -72, -371, 5, -48, 72, -78, 104, -124, -122, 60, 153, -66, 69, -12, -7, 81, 116, -138, 174, 95, -124, 33, 111, -168, -59, -30, -50, -19, 86, -62, 25, 20, -16, -72, 142, -114, 31, -84, 78, 193, 240, 140, 33, -113, -177, 183, -143, 106, 16, -90, 133, -336, 36, 146, -33, 33, -96, 102, -4, -59, 149, -17, -72, -90, 62, -202, -7, -183, -102, -81, 57, 51, -144, 117, 3, -130, 306, 49, 150, 98, 186, 140, -73, -38, 56, 55, 23, 33, 71, 21, -144, -171, -185, 138, -28, -173, 65, 112, 4, -62, -2, -57, -162, 24, 93, 88, -203, 104, 131, -157, -205, -8, -30, 98, 159, 81, 13, 45, -69, -202, 11, -119, 258, 278, -96, 6, 7, 247, -68, -83, -110, -119, 210, 104, 33, 91, 107, 26, 32, 100, 152, -74, 20, 22, -113, 116, 86, -140, 31, -213, -35, -164, -90, -124, -142, 17, 53, -107, -210, -167, 135, -27, -74, -5, 138, -109, 7, 110]
5244A10k65K42O6k66K62J39q3j74m2j96L78q4o3J72k81J11J91m85L06p6K09j96
5266b5J24k26l4mJ07J90L5k16l5L53l7l66J65o9L1OJ21o0oM9j46J19p2J57j13
5291D8j87P3J68j59M7n6J98j34J52j17j02K14l33j8J21r5K44Q3N7j13k02K02P1
5314A62j36J00j19J20q0l2O7p5j8J0k38J86J23qm9j67K67n7k72J49p1K59j72o3
5338a14L14j73j45K51j55N4J86l81J15J76k16J36J75l87L21Mk36J62j44j29J27
5359e9j15J09P3L5P2j6j25l2J51Po1l5r2N3J1Kj32p5L26K62k88K4j07J77l67J90
5385a2J06j4j07m8l3Oj35L1L07N2k65n8N02m03j55J17L9O0J29j37N3M8j46J86
5409A23J0%l75J68K9k56L68rO0K0j15J23P4l33K10j31j39J42l9R3jo1k3L6M4K20
$$ y = [110, -155, 87, 153, -113, 149, 288, 205, 31, -11, -207, 171, 87, 24, 196, -85, 26, 217, -268, 38, -38, 171, -25, 99, -127, -161, -165, -58, 132, 167, -49, -84, 269, 232, -134, 31, -38, -7, -1, 120, 60, 54, 103, -43, 76, 4, 161, 48, -139, -66, 102, -57, -10, -66, 132, -2, 150, 33, -69, 145, -188, -206, -85, -180, 64, 147, 204, 91, -111, 91, 162, 26, 126, 7, 127, 47, 15, 82, 7, -11, -1, -239, -53, 70, 62, 13, -154, 113, 56, -216, -67, -138, 121, -51, -114, 200, 27, -118, 133, -22, 32, 218, -163, -48, 128, -88, 48, 223, -164, 157, 161, -75, 87, -57, -186, -59, -174, -65, 8, 43, 115, 99, -26, -58, 93, 100, 39, 4, -88, -35, -24, -22, -154, -229, 97, 359, 71, 95, -12, 165, -202, -12, 94, 80, -27, -75, -108, -102, -237, -206, 101, 153, -112, -170, 332, -71, -226, -109, -70, -10, 119, -18, 35, 83, -63, 123, 133, 133, -242, -74, -45, -301, 67, 58, 118, 138, 23, 146, 220, -113, 97, -34, -173, -31, -70, 23, 22, -39, -62, -26, 18, 238]
5435B38o6l8j91R6M4k51P6N5kP7k44J71j27K4Q5R4k9J4R3k12J67j31P3Rl4J91
5461A82k84J43r3lJ68j53J27j08L58l04J04p0q1Q0Q5k42J25q8M4j63j05J12J78
5484A2N1j56J11p4Nj5lr7o5J51J10k25nK09r6P6m9K17j70q4L9r1L30l01q7J92
5510a5J20j76R6J61j01n5j28j97K24M4j18K79j91j29K77P0k3r3j72J69J22o6J7
5533A15q5l4j13J99P1l55M23ro0m79K77K78p9p4n01M60j24k3J66j59J15r6j9K54
5557A48L9k88K18k76Q4%Q0j22J11kJN2J9m1J39k49J16J37j29k74J58J38L3l2j72
5582a12M0J66k0j24Pk06K91O5k38k6J78j05M24l34O3mj45K3R1j12J69N0Nk68L11
5607A89j45K67k90Q8k53M6L75l52K11l37J71J89J58l19j73M69l02k67K18J04l13
$$ y = [238, 172, 134, -57, 39, 83, -168, -92, -37, -39, 38, -206, -35, -162, -138, -53, 41, 12, 26, 119, -93, 74, -57, 16, 25, -9, 182, -102, 41, -52, -55, 113, -40, 87, -21, 337, 33, 137, 67, -14, 66, 151, -91, 34, -54, -10, -173, -278, -166, 12, 63, -93, 18, -56, -51, -66, -69, -166, -231, -80, 30, -195, -200, 9, -87, -11, -60, 157, -13, -97, -58, -149, 181, -120, -207, -15, 105, -71, 25, 186, 85, 30, -98, -295, -71, -27, -145, 134, -57, -186, 91, 161, 138, 45, -127, 42, 164, 98, 115, 30, -4, -117, 82, 153, -202, 221, 212, 152, -327, -50, 228, 149, 75, -426, 34, -90, -113, 53, -106, 9, -87, -106, 148, 187, -101, 117, -159, -75, -75, 5, -117, -6, -8, -7, 45, 64, 23, 162, -87, 29, 166, 37, -237, -79, 59, 92, 60, -112, -72, 94, 74, -50, -43, -249, 42, 107, -131, -157, 21, -84, 340, 6, 69, 65, -80, -57, 34, -78, 91, 141, 146, -122, 189, 44, 311, 21, 109, -144, -98, 277, -75, 136, -201, -30, 159, 317, -2, -175, 294, -8, -275, -57, 47, -266]
5628b66J68K15P3j50k3Lj88J13J19J20l13J03j0J40l1q2j19K69k69J00j65M30
5650B37n18K36K3j61K11o0l6J00L30l80n5L13k13R8K57l91j07j8K09k98Q7K77
5672A41m6o9J76k64j46M48l95K17l13L51r8j57k6J89q2J83J61j83l5Q5j77K85
5694B45j41J10j33L2J85n40K03K05k38o7O0m1J83k0j73Q7J37lK04j87K3k81J23
5717b7j94M9L9Q2L42l82k94J92J49k1r9J85k3K3K03j07P0m6qk77L76k79K40j37
5741E6k2J3J16o5Q9j29n8J15j42j5q3K0K93q1J10p2k26K28k73J15j95M68j2k92
5765d2l01L57O9j30N2j55J96L7Q2q6j32O9j83J02j05J10J45m7k74J60K18l98K74
5788A8N0l18M13j12J40k65Q9j7j5r9K72o2j22jJ13K18j83m37L41J59m6o8L9m4
$$ y = [-266, -98, 117, 190, 40, 17, 20, -168, -55, 64, 184, -129, -26, -36, 104, 73, -9, -128, 141, -128, -28, -193, 237, -281, -45, -22, -183, 28, -32, -68, 32, 362, -18, -73, 240, 27, 125, 382, -9, -116, -134, 75, -223, -136, 141, 95, 26, 202, -62, -208, 240, -155, 62, -251, 100, 2, -155, -181, 8, -74, 109, 270, 87, 52, 137, -40, 245, 104, 214, 81, 113, 298, -242, -39, 166, -72, -139, -79, -120, 63, 43, -130, -43, 94, 91, 295, 108, 131, -150, -27, -221, -172, -133, -51, 291, -91, -385, -193, -44, -65, -164, 21, -2, 21, 224, 117, 187, 141, 133, -144, 232, -47, 193, 56, 34, 47, 163, 98, 187, 58, 0, 115, -27, -42, -125, -105, 188, 107, 217, 145, -81, 147, -126, -11, -206, 262, 250, -42, -343, 14, 83, -47, 5, -150, 46, 83, 165, 79, -53, 16, -167, -65, -170, -60, 85, 38, -236, -76, 142, -256, 18, 68, -250, 163, 51, 191, -74, 15, -2, -17, -116, 156, 94, -28, -29, 84, 302, 119, -318, 23, 182, 136, 68, 107, 63]
5812F3l5j62J14J61j57J10p4P6k16J63J5Q1r0l43K32j50M37m39L00j29K06J8k54
5835g3Q7j41K1k7j57K39l7l9j85M04k14N2k4J87Q7l8k63J12J03K7j27J87k46K56
5859A91k63K60k33M7K11k87J22l7N2K43m04K13rj84K98m1j58J42k19r1K79j51
5881a9K79l52K16k98L2L65n58K49O3J23j47N3n2K1q7Q4J98n9j35j43J65J35k7
5904A06n0J70j51j34k12L66j23J41j13o0Q3j25j0n7K86oq5J68j48R2l3k00Rr1
5928a77K94k29K93j85P9j27J00JJ6K65k98o4J03r6p1K06r1k16J05O3k6J17Q3j51
5952fJ51q1j1j8k25K79k63K09j64J90P7j37L40p03M15j45Q4K35j71j0j56K31j20
5975Aq3J24J43q1j68J14R1r9K55j17k82K40m28L42k4J07k07J10J1j73J31J56q6
$$ y = [63, 28, -134, -20, 141, -16, 94, 20, 96, -120, 43, 58, 139, 49, -294, -62, -212, 225, -214, 86, -43, 163, 181, -73, 14, -127, -106, -133, -290, -51, -88, -127, -312, 92, -122, -70, -94, 93, 180, 142, -121, -9, 94, 121, -6, 181, -65, 191, -72, 188, -45, 2, 213, -74, 48, 11, 63, 306, -98, 115, 106, -78, 220, 179, 21, 163, -56, -147, 132, -19, 260, -92, 124, -174, -142, 223, -335, -86, -23, 100, -47, 6, -46, -25, -112, -28, 170, 111, -24, -167, -2, 133, 106, 56, 226, 75, -59, -271, 95, -28, 113, 0, -60, 23, -102, -112, -169, 117, 111, 26, 194, 46, 138, 105, -95, -86, -177, 117, -112, 181, -4, 75, -52, 48, 49, 65, 330, 32, -32, 71, -25, -96, 110, 19, -197, -92, -29, -55, 62, 145, -6, 145, 64, 53, 35, -190, 89, -174, 35, -129, 61, 138, 1, 341, -362, 53, -92, -8, 227, 56, 46, -110, 121, 1, -82, 42, 185, 104, -64, 50, 141, 42, 297, 180, -102, 138, -290, 52, 28, 135, -72, 38, 49, -124, 7, 163, 77]
5998G7j35n2J31Q1l08L14l8k95J79k96M60j25Q9O3p9M3l19L6L60q2j62K46q9j0
6022H9J70k54LQ0j49K99k06l7j41K25P1l11K22k16J42k99J39J69K7j65nJ49j18
6045a16J58R2k25K68k07J34n6m6o5m9L8K77j11n6M5N6j56qJ45j34N4q5j8J40k27
6070a52k1J41L06l37l2r7K1L61l79J39N0N1J55l14N3M1J40j84Q0l33L84m8j95
6093a70J48J67k50J19j33K08j11N4j1j49K26k29Q4j51J22m7n5n9K66K09r7K48
6115C89m06l1K46k92L9R8P5L5j66K38k53l4r1J56K15l36L13k02J13n3j51J56J94
6138B52m21O5K84j86J40l13K22P7l31L96K2k29P7K28k76KJ68Jj8j00r9kJ24l17
6162b34J75J66j45R5k59K11Nj01P7J01j81L1J45j08J20L7j64k09J52J12K7l04
$$ y = [77, -58, -110, 21, 102, -206, 108, 70, -225, -46, -342, 118, -7, 82, 145, 66, 109, -210, -174, 186, 104, -58, 188, 99, 89, 259, 5, 8, 88, -61, 238, 32, -5, -146, 79, 150, -161, 61, -155, -13, -312, -173, -4, 23, -142, -147, 2, -116, 42, 134, -91, 177, -30, 104, 48, 2, -63, -112, -74, 203, 92, 36, 81, 137, -19, -27, 118, -16, 38, -47, -65, 75, -152, -173, -32, 274, -63, -95, -192, -171, 190, -189, -50, 0, 51, 206, -108, -55, -14, 126, -58, 22, -311, 73, 25, -170, -22, 145, -105, 14, -119, 89, -22, 32, 21, -128, 98, -131, -47, -198, -76, -123, -178, -237, 29, 238, 141, 389, -17, -48, 198, -94, -55, 43, 118, 153, -13, 225, -28, -62, -153, 3, 218, -118, 195, -7, 106, 53, -98, 58, 252, -169, -104, 180, -6, 134, -179, 43, 120, -211, 185, 207, -22, 55, 283, 7, 9, 177, 178, 160, 60, -39, -41, 83, -234, -59, 107, -38, 57, -202, 9, 14, -87, -10, 91, -90, -59, 86, -22, 98, 135, -29, -238, -86, 26, 53, -251]
6184b51K37k33L80k88L23k02o1O0N0K7r9M7j09J15m1O7l5K10k65J0O6m1J1k6K41
6209A93k71J97J64k58q7p7J90r0N5j17K96j1o7J5n6k48K83k15o9L2J57J11j74
6232d7L25k59j31J73J04k70K17P0k71K78j25j36J19r7J94J9j44p7j57L37n9j36
6254g3l4J80l44M47k33J21q1L7k5J43j49oJ61j17m4P4P8k42J93k57K34j89j20
6277b46M07j77Q6J45j04k32qJ18M8O5l7qo2K7j44J73j22j0J96J32k9j25j33O3
6301B3J20n7l1L0l1J05k30l11L10p6j6J12K37p1R0n0l97M19l51j6L70l45J96N7
6325H7p0K60l50L5j05K26k15M8K04k41N5O3J05k82J24m3J10p6J31k10K43J41j87
6348E3r5K73m0k40P3M4j82K6K05p3K9Q8k12L00k73L8K51j91M9Q9j34J58l59k1
$$ y = [-251, -14, -247, 133, -155, 168, -34, -95, -35, 15, 42, -57, -10, -119, -4, -45, 22, -13, 197, -68, -58, 8, -33, -22, -48, 193, -78, 119, 283, 25, -62, -139, 51, -39, 16, -101, 195, 184, 117, 132, 76, -172, 111, -104, -173, -141, 16, 127, -47, 278, 19, -112, 61, 165, -105, 112, 182, -89, 189, 64, -72, 47, -50, 144, 163, 19, -58, -215, 122, 63, -73, -107, 73, -271, 176, -57, 64, -17, 20, -5, 138, -11, -17, 144, 27, -17, 57, 135, -107, 86, -171, 63, -126, -246, 161, -16, 70, 215, 111, -121, -129, -11, 37, 102, 65, 57, -5, 22, -122, 51, -71, -81, 115, 247, 218, 93, -40, 23, 143, 86, 55, 85, 54, 159, -71, -382, -72, -148, -164, -52, 185, 114, 204, 154, -243, 176, -175, -191, 179, -166, 30, 87, 17, 277, -73, -38, -143, 83, -132, -84, 120, -121, -66, -3, 102, -180, -56, -99, 11, -65, 66, -144, 99, 240, 53, -42, 231, 191, -49, 24, 68, -114, -88, 117, 44, 73, 161, -51, 249, -24, 14, 265, 74, 123, 212, 78, 236, -123, -144]
6372a44N3J82L0O6k29J05n1J90o3k37J15K2l4J00k85K31O4o0kj75J59k31N1L5
6396a08K3K25j06J24L9j39j10m3K97L0m45J66n3J70r6K47l71J06m1j9K63k36k6
6419a03k01J12J01J48n1n5K8N7l2q3k9J42J51k41n7Q1M5J95p4j91J47k35K89m61
6443c17K45M3j62M50l51P9N9ok40L51Q6j27n4o7J81p6p6M5nj30Q8r8J57L9n8k65
6469b09O0Q9K02K9j72Q1j47K40j94l9r9K76p1k89K61Q3L3j43m2jL9r7J13k1j86
6494b04Q2J54q3P6j5J29l23qN0R3j44K84k12J48j21K45r4r1J48n13L78j07m9Q7
6518i0j46N4K43j76M69j25m6K0l24PRL50m36l0L31j99l5k4J65j29K01k0k29K52
6542I2Mj15l7O9j0l54K47K25j36j28J12Pp3j25O4K52k63K29q4kJ92P6j0k08jJ73
$$ y = [-144, -91, 91, 121, 187, -42, 63, 12, 202, 139, -98, 17, 39, 5, 105, -180, 51, 115, 55, 53, -122, 37, -194, -143, -108, -85, 140, 34, 158, 197, 58, -52, -95, 202, 232, -213, -47, -100, 70, -26, 221, -150, -44, -85, -104, 159, -77, -103, -304, -192, -91, 57, 6, -49, -21, 36, 4, -79, -108, 34, 185, -56, -113, -32, 13, 208, 134, -57, 90, -145, 144, -317, -72, -29, -191, 259, -92, -13, 46, 40, -200, 151, 237, 110, 56, -11, 170, 94, 18, 63, 58, -72, 16, -82, 75, 114, 56, -209, -149, -60, 142, 171, -1, 80, -67, 173, -21, -60, -159, 117, 46, -243, 18, 101, 134, -9, -51, -52, -13, -110, 3, -18, -204, -122, 32, -51, 25, 10, 139, -184, -192, -142, -49, -193, 91, -121, 27, -94, 151, 57, -34, 114, -399, -21, -128, -177, -90, -236, -182, 61, -115, 354, 229, 183, 203, -121, -114, -105, 245, -191, -221, 110, -89, -124, -148, 17, -112, 89, 69, -160, 92, 96, -19, -56, 13, 3, -351, -104, 121, -15, -143, -31, -24, -97, -222, -158, 94, -169, 60, -24, -26, 166, 242, 232, 24, 23, 196]
6568A96j18R4l88M8K61o8o8L7p3R2J92m34L49k31j90L79j67PK33P4k64k1K94k95
6592f1J44K9J64l60L1K55J2k88J44j1j07j63K63j67J08J05J09k59J76k42L15K09
6614D06k93k01L9K30k09K81k40J37j50m1R5j69K88k63J53m9r8L56p7j35k52L15
6636A23q9K37m08L32J0l39R3L1J30j1L5J8J76m36N1R0r1K11M4r1k23N1l7J48n5
6661@j83K03J25k81K76k25Q5J58n4L9k0k5j09j53K32j62m0K60l34J59n5K57j34
6684A9pJ20l7j7k93J60j04J89n6J89l62m8K69R0K5o0j82K42j55M00m43R8M6k58
6708a75J63L85o00K04P9k09J60j10K13j94O0J04K4k35K92l06K3k32N11j96K24
6729A85k58K18r2n5L0L9K1O0j78j12K95k85L06k63L36k99J40R8l44J8Q4l3j60
$$ y = [196, 78, 172, -216, -168, 93, 25, -43, -6, -79, 13, 205, -229, 120, -111, -301, 78, -89, -82, 151, 225, -39, -60, 234, -61, 83, 112, 276, -84, -53, 202, 214, -74, 70, 59, -48, -211, 52, -115, -7, 98, 207, -52, 124, -118, 197, 406, 113, -88, -49, 181, -28, 253, 13, 150, 0, -41, 54, -115, 173, -90, 63, 14, -84, 272, 195, 60, -192, 123, 34, 271, -137, 195, 205, -134, -41, -10, 120, 109, 144, 162, 338, -98, -47, 43, -48, 163, 207, 116, -107, -56, -93, 55, 0, -183, 20, 145, -136, 140, -85, 0, 158, 104, 143, 123, 98, -11, -164, 68, -94, -134, 126, -208, -49, -104, 153, 19, 12, 132, 95, 78, -215, -55, -159, 30, -26, 163, -199, -247, 22, 112, 137, 77, -105, 137, -18, 382, -61, 37, 83, -175, -12, 373, -227, -23, 56, -153, 7, -103, 110, -84, -24, 80, 104, -131, 161, -145, -122, -354, 157, -39, 185, -73, 145, 53, -2, 28, 67, 88, 148, -30, -142, 153, -132, 174, -89, 247, -52, 88, 186, -158, -140, -56, -89, -249]
6752b49L86k92K06j14J15K3o5K94l66K2J19k34K51J4k14J55ON8n4p1J83k24K82
6775B31l36J94r6p2o4K06qj11n3J1L0M2o0Q1k4j45R5K34l9j16j5l7R7q9r6O0J18
6802C8J1K1j06j14J84k11J86P8m48N03k46J11M0M9j07o6K30k35r2L07j72P6n7
6825b0J50R5k56J05k04n4K91o4R0k81K31j76L86k18J12m08J26J89j52L2N3j11
6847h4m5J04r2J14l61N28j86J95j43k5J64m73K50J20n8L13l05j35J74m6Q9jl54
6870b57L78Rk04l4j44P3J14J61j07J97k64K01m2k34P8LJ34r9j5L62k03O2j16k47
6894a94K58j02kj04K78l9K66n43J00J18m8N4q9K25k0k16J6K05k88J31j22L74m53
6917a95J96J53J13rl35R1j8n1J9j58N5k6m4K34P4K13k06k86L14j45Mq8L77j37
$$ y = [-249, 137, -155, 51, -63, 52, 75, 10, 304, -62, -40, 79, -155, 96, 110, -104, 51, 57, 115, 61, -10, 173, -51, 231, -105, 89, -7, -79, -143, 63, 55, -56, -109, -98, -68, -26, -86, -5, -29, -174, -79, 155, 116, 0, -15, -52, 45, -44, -140, -80, 38, 49, 70, -36, -150, 34, -177, 9, 87, -361, 142, -104, 7, 47, 96, -11, -77, 153, -82, -174, 133, -39, 37, -20, 130, 225, -31, 74, -130, -184, 107, 43, 133, -148, 83, -93, 293, 75, 187, -221, -95, 94, -58, -26, 27, -84, -129, -25, -117, -3, -364, 164, -22, 173, 30, 5, 169, -304, -54, 66, 8, 321, 16, -119, 55, 9, 98, 97, -257, 121, 130, -74, -108, -252, -179, -65, 96, -11, 186, -78, 123, 81, -153, -75, -72, 62, -37, -52, 310, 107, 169, 53, -194, 64, -38, -40, -144, 134, 95, 361, -182, -82, 36, -12, 42, -47, 178, 158, -58, -42, 163, -125, 6, -116, 258, -195, 1, 154, 267, 258, -77, 14, -4, -55, -36, -194, -139, -165, -209, 25, 99, 312, 106, -180, 134, -11, -7, -95, 282, 145]
6941A45k66J54o3P1k18l9M5L2q0J40K71k21R3j0r0k02J91j90K51J70N0k63N7L38
6965C66l89j47J27J11R0k79rJ40J00j78N1o8j02L76j11k66L09R6l8j26K09j64
6987I8k88J73N8j90K86k56J38Kq3M6j06K87m58L44k11P0Q7j09K15M9k5n0k47J05
7011f5K88K6m63L31l0k14K57J51m20L33k14J8N0Q3j05N5J51l37J44l88L62k5n8
7034g0j20J80j90K37j30M1j26K54R1j64O3j58n8q5J43J96j71P2J4lP4q3p6NN1
7059a3J31j00j0q9L8K07k78K67J8j88K3l9Kl4J95k29J18rj9n1J75l41J25K00j05
7084fr5J69NK29l26J07L0k1M6N2j06K2K03l47Lj86K62K7k05N7N6M1K23k63j04
7109a27J22j89K18R4k30J59j74Nj24K50Q3k48L27q5m2J87k12j63M37k13j43R0
$$ y = [145, -121, 33, -30, 41, -177, -216, -171, -139, -219, -79, 192, -29, 64, 54, -36, -238, -47, -237, 14, 184, 234, -29, 28, 366, -23, -170, -43, 68, 158, -121, -130, 10, 110, -68, -17, -85, -187, 189, 78, -188, 121, 217, 179, 53, 262, 98, -190, -17, 41, -149, 137, -119, 19, 21, -62, -16, -122, 165, -293, 51, -160, -90, -3, -112, 103, 152, 127, 77, -170, -65, 223, 249, -214, 117, 87, -127, 130, 281, -139, 194, -20, -2, 48, 131, 26, 81, 232, -105, 39, -349, 13, -12, -70, -190, -10, -200, 37, -93, -52, -178, 76, 167, 3, 66, -92, -150, -235, -92, 104, -67, 5, 19, 16, 90, 7, -69, -64, -13, 118, 18, 8, -81, -43, 164, -114, 153, 171, -17, 6, -33, -31, -65, 130, -99, 19, 10, -9, -60, 115, -226, -101, 99, -6, -101, 68, 73, 302, -24, 83, 113, 92, 138, 190, 84, 106, 309, -38, -35, -221, 41, 68, -137, -80, -24, 17, 240, -23, -127, -5, -194, 24, 118, -112, 47, -127, -122, -246, 4, 87, -161, 166, 81, 39, 226, 14, -149, 288, 75, -68, 22]
7131B2J6k9l3J54k11J52o5j8J19k83K2K48j98K72k99Q1r2j16N51m09m1L80j33
7154I0J26l39K0J29k17J89q1K17k08J53m0K9l6R7k68K82k70M76k43O9k60k9K7
7177h7j82L75k91J30j56K68j34K40j83P0j84K44J67k63j40L40o2j44j56LK92j41
7199Fp8m3K13j35R9j04K68l65J34J99m1j95oNJ5M6j07J04k1R3k91l1J79P2n8K11
7225A69j00k5l2k52J75J31M2q8j33K71k67J94K00k62N0Q0J5l88M15k45j2K06m54
7248c10K24J46k12M43p7l30Q9j26J20N1jK02l23J00r9m2N4J96j04j92M74m14K60
7271A29J48m27L78j41q8pJ17JJ07l47Q0j19R1M1J79mk05K62j84O2j26P4P4l1p1
7296gk4j60L41j35L7m6j04J22j01K98m3r0k00K92k50J06MO8J24k68J79o5P2l59
$$ y = [22, 38, 9, -24, 130, -81, 71, 6, -12, 107, -176, -154, 94, -104, 168, -131, -50, -142, -258, 293, -116, -157, 223, 90, 216, -123, -103, 26, -191, -2, -83, 134, -74, 79, 39, 68, 32, 129, -139, 143, -127, 349, 106, 175, -85, -114, -87, -269, 106, -185, -55, -211, 57, -77, 163, -20, 50, -134, 110, 277, 14, -126, 214, 152, 8, -148, -145, 147, 6, -72, -115, 98, -37, 62, -42, 226, -139, -5, 194, 153, -42, -48, -43, -28, 18, -89, 15, -6, 87, -204, -235, -56, 16, -42, 169, 69, 44, 12, -240, -65, 66, 108, 20, -113, 158, -109, 85, 285, 23, 73, 153, 168, -220, 195, -50, -62, 144, -310, -86, 60, -152, 291, 214, -116, -27, -153, -33, 18, 17, 219, -104, -4, -103, -145, -91, 105, 1, -191, 283, -131, 129, 277, -150, 228, 87, -1, -8, 109, 110, 217, -130, -50, -169, -78, -37, 142, 138, -67, 195, 11, 73, -53, 21, 95, 64, -7, -31, -191, 150, 15, 52, 6, -98, 24, -77, 221, 178, 88, -112, 180, -70, 36, 40, 108, 232, -36, 143, 78, 150, -209]
7320b09K02r3K37k07m2M03j13j85N6Jj38l8J91K14q8k43R8j59j04K06j32K17L5
7343A09j39n8o5K12j03k9L49l39P9J32k64K10q2K09o3k05J86j68L8j95J98O7n0
7366B9q3K35q7k90K98j40M0Rj74K60l08J56R0j62l2L5K37k42J26q6K01j86M9Q7
7390F2q8j06J44Q1l1j30N7j02M7l5M6K46k39j2K05j49Rj18K56j06j16K91j90q3
7414f1%Q0J6n5k6J02q7K04Jn2o2m5o2J28R0k82K09J7r6O3Jl8m9j35P8R7J09o7
7442G8m17L04L60k43J00j93j67K36M1Q8J23j61m11L02n4o3M6J2j3l7r7J90j41
7465a17L3n0l4K22j54Q5K06j57j55J10L2nn4J34M1r9J70l28j23N71l87p8J98m02
7489c41M58j15j88L7J80m7J3J75j93J12o6K9P5k15J49m5q2J34l46L68k44J92l6
$$ y = [-209, -7, -100, 137, -70, -112, 291, 178, -7, 49, 50, -88, -126, 65, 279, 191, -52, 46, -113, -217, -11, -143, 74, 109, -30, -88, -153, 59, -44, -73, 276, -63, 16, 148, -116, 94, 12, 221, 158, -47, 139, -29, 9, -186, 12, 79, 29, -54, 181, 94, -196, 102, -38, 2, 11, -163, 97, -211, -55, 35, -127, -159, -124, 113, -129, -3, -89, 112, -74, -25, 62, -26, -132, 12, 93, 62, -68, -11, -113, -66, -101, -55, 191, -48, -60, 145, -4, 5, -113, 143, 37, -79, 212, 22, -61, -61, 19, 35, -20, -46, 56, -31, 173, 174, 122, 60, 15, -47, 81, 171, -111, 98, 115, 19, 82, 83, 45, -4, -139, -61, 36, 145, 78, -339, -35, 325, 82, 182, -11, -178, 58, 99, 187, 310, 149, -262, 40, -14, -77, -31, -19, -32, -69, -166, 24, -117, -84, -134, -168, 54, -100, -15, 191, 34, -121, -11, 21, 16, -38, 96, 137, 38, 208, -120, -243, 328, -59, -137, 61, -341, 117, 2, -186, -149, 31, -16, -3, 172, -21, 91, 25, 54, 129, -86, 63, 18, -64, 70, -276, 92, -152, 40, 4]
7512DJ43l23K50j25L03k70op1l5M47l26p5J33j81K88j86K24l13K77k41J2K91m90
7535b70K12J44o0j52p9L88j70j31J23j4P3l25L28J80k21k08j21N69k78J41m3k48
7557a62L35j93j69P1j54L16j23K53J09l36N1n3P6N7j49K07m8j84J50N6J41k09
7579D2j28O1J90k74k8N0J53j32J04k09kK36M0q8pj31J27J28o3ok6l7q5L16l08
7604g7L6L3M5k8J0P0j2K1j31J61k78L13l05N2M8j11J40Q6J3O7j89N6p0P3k40K86
7630F9q7J39j57J98j23j35L25k23J9m3j26j7M4O1q4K03J33j45LJ1k51J91ML2P2
7655A13o4j59r7L35Q7k25Q2j64J40j83L41Pj50K9J80k14J3nk63L7J67j6j20O3
7679f6L08j79j39L83m87K40j27J38j97L26l61L4O5k85K59K41k53R5j52J6j6K27
$$ y = [4, 147, -176, 74, -51, 252, -18, -24, -95, -130, 317, -9, -84, 49, -132, 156, -30, 194, -119, 158, -83, -71, 220, -270, -58, 86, 26, -126, -205, 183, 13, -118, 5, -9, 64, -261, 67, 247, 26, -182, -303, 266, -12, 129, 86, -162, 173, -20, -189, -118, -272, 44, -79, 174, 283, -53, -2, -55, 21, 78, -71, 136, 88, -96, 54, 110, 251, 42, -86, -25, 165, -109, -137, -87, 66, -66, 38, -171, -173, 63, 103, 15, 8, -123, 4, 132, 69, 63, 37, 0, -85, 231, -77, -41, -8, 37, 9, 19, 89, 77, 98, -33, 128, -150, 163, -142, -90, -42, -153, -13, 73, 86, 153, -36, 20, -50, 23, -217, 69, -18, 121, -36, 162, 39, -96, 229, 6, 25, -18, -144, -161, -117, -56, -140, 63, 196, 51, 54, 65, -186, 5, 9, 41, 113, 49, -110, -207, 128, 215, -10, 72, -92, 48, -135, 206, 213, 63, 92, 272, 58, 71, 66, -197, -160, 7, -9, -129, -66, 242, 63, -76, 307, -180, 60, -67, 71, -126, 200, -161, -127, -62, -347, -88, 153, -100, -5, -157, -141, -157, 70]
7701G0Kj89L83k54j38K79pj24j0j8J57o4J7j46k1r0O5J99k08L6O2j71o9L67j69
7726d1J8J10j05J1P3J90l73R6L4o3Q0J79j22r4L10l74M7K55j30k37N8p3L27l12
7750a36M5J21J34k28J10J4L9LJ45j01l25L10N5k70K1J04k18L05j29k47J02K13
7772F7j07J38%N7l40K87Pk12K99j54PJ91l93J67O1J78m5k8j17r4K9K98l06R3k11
7797a28J85l8J52J0k76J16j15L18k39J43p2n9k24K61j53J2J1Q1l4m3l0M9L45k48
7821B4K06l71L2K18j78k00L28k00K57r7r9J88j73K10k15k8J60j1j9j97K77k42
7843a30J32k2N8k0n3K17k32k24L59p5L4n4k05N63l48rJ0O5k21J95q2J2J49j58
7867c9p7J57ok8J04j16J22j74O8K15k62kK00j73J33j76J40m2O1j25j75J99p4J08
$$ y = [70, 72, -117, 266, 12, -126, 153, 146, 22, 12, -6, 151, 87, 104, -42, -63, -153, -88, 111, -97, -61, 1, -170, -239, 128, -41, -23, 87, -18, -7, 66, 256, -117, -21, 13, -50, 30, 209, 87, -7, 303, -71, -24, 231, 101, -136, -78, -151, 176, -136, -91, 30, 164, -64, 46, 60, 99, 102, 247, 146, -179, 131, 186, -84, -63, 41, -177, 128, -1, -248, -146, 67, -40, 98, 98, 155, -185, 102, 109, -103, 196, 42, 49, 240, -153, 14, 75, 253, 208, 180, 63, -31, -2, 296, -10, 83, -128, 57, 19, 171, 181, -95, 21, -94, 224, -15, 128, 56, -3, -227, 34, -119, -107, -96, -15, -49, -92, -122, -73, 272, 24, 230, -141, -109, 109, -69, -269, 59, -141, 116, 19, -80, 108, -65, 145, -70, -98, 62, 51, 32, -165, 112, -130, 2, -20, 38, 18, -35, 182, -50, -274, 85, 10, 44, -10, -215, 348, 0, -9, 1, 66, -155, 40, -42, -30, 119, -39, -116, 41, 35, 7, 111, -5, 117, -57, 11, 226, -36, -38, 162, -11, 122, -54, 86, 44, 105, -20, -195, 4, -70, 38]
7891C8Q9j74J03j70P6K88k34j08J69j84L03J47m50R2j27K99k40K20j61j7j04J61
7913A6J01k13J49RJ57k92K81k11L97l73N0p9J08r3L5J33j36L61m12k3j41L39N3
7936B16k85J91J4l44K52L4J21k33r9M30l08P6o8R5j4r2q2K31m4j00p0O8J95j60
7960B4m6J97k8j29l3K24M6k57J68k25lJ2r9K36k15J90l3J8j15l1M08j83rk71J08
7985d6J25M9p9j96L89k85J78j90Q8j14j75K64k40J62N0J81j11n9J3P7j16J25n
8008H5k62p6K32j4j58L9J6j57M06j38J1l8P2L0j2J11k3j55j28K49N2k00J94P1
8032B07k50P8j2J57j66J28k20K40k69J9K80j96K3L6nq2J81j1k75N0J23J1k13K36
8056G0j21oK4o1J57j79K41j95O0j74J57J11P9k96q6K42M1j0J4j64M8J18j36l4
$$ y = [38, 127, -47, 56, -114, -38, 250, 16, -92, 77, -107, 196, 343, -107, -15, -142, 157, -83, 137, -24, -41, -145, 16, 117, -96, 53, 62, 219, -73, 208, -3, 394, 21, 71, -8, 100, 7, 42, 175, 39, 400, -12, -35, -176, 163, 216, -69, 122, 136, -208, 44, 78, 199, -34, -133, 297, -11, 65, -3, 92, 78, -14, -96, 135, 91, -9, -79, -11, 184, 24, -22, 175, 147, 18, -15, 209, 255, -2, 166, -59, -62, -50, -149, 87, -128, 62, 29, 47, -68, -99, 309, 126, 117, -154, -46, 79, 128, 49, -147, 242, -43, 135, -55, 33, -81, -256, 8, -232, -70, -20, 161, 50, -9, 4, 81, -35, 90, 85, -177, -253, -21, -35, -193, -154, -138, -295, 111, -27, -16, -54, 18, 48, 36, 147, 124, -31, -159, 90, 142, -58, 136, 207, -43, 35, 23, 180, 14, 142, -78, 162, -107, -88, 192, -4, 19, 55, 50, -32, 149, 138, -137, -87, 36, 47, -166, 70, -51, -57, -33, -94, 63, -116, 125, -70, -10, -184, -27, 84, 163, -133, -219, 23, 64, 54, 68, -96, -48, 70, -66, -100]
8080a00J07K49k93J2J43l24J03K64m35J78K5K59M1k67K21r7r8q8r8K82q1J84Q1
8103B68j30j01M4k16K09j10j36L87j54J02k91J37k23Q9K98l33p2J54K9K55j6p4
8125A16o2k7l0L6J19k0O7l91K77j52K27j83R0kj7j61M0L35j86pK0k63K29m8M9
8150E6P2J49q2k82J51r1K5J27k22K05L6M2pj7j85o5O9qj69Q4J94j24O1l2j12m7
8176a72L18j93j57L88j98j47L55l40J08J36Q6j96K07k88J44
$$ y = [-100, 7, 256, -37, -25, 118, -206, -103, 161, -274, -96, -71, 188, 229, -38, 183, 86, -12, -100, -198, 84, 3, 187, 268, 138, 37, 81, -135, 74, -36, -172, 215, 61, 163, -128, 9, -214, -125, 173, -160, -232, -78, -49, 206, 190, 116, 54, 27, -3, 33, 152, 132, 199, -192, 85, -67, 160, -23, 67, 65, 48, -113, -73, 262, 76, 69, 89, -174, 55, 7, 56, 128, 277, 195, -87, 64, -27, -2, 125, -97, 108, 144, 186, 179, 162, -23, -88, -19, -27, -196, -112, 82, -42, 19, -13, -125, -172, 146, -47, -204, 184, -14, -161, 194, -146, -38, 98, 184, -12, 195, -93, 51]
8191E1
$$ Imaginary data points
##PAGE= N=2
##DATA TABLE= (X++(I..I)), XYDATA
0@%%%%%%Qq%qJ6j6J6k4L2l6M4n6O8q2J02j20J36j60J91k20K53k93L37l85M41n04
32b68N70o44P26q14R14j024J142j272J415j572J741j925K128k349K593k859L148
49A650l466L817m207M637n117N662o279O980p788Q733r859J1224j2912J5063j7913
64i775K1876k7757L7370n5673J02129m30184p20052J282085O99876r51883n98409
75f50397P08520L78861m41391k38578J85394N0781J32176J85124l45042n01890
85e36442L86937O95601k67069o97133J80241N56314j59907m32566J30609K96043
95A52628k9815r5940o4002j78283P4692M12387J2344m98802p3082M46122L5177
106A93426l73186N2317L24099q1558k28423P1235M9688r9076J42991J84173k55472
$$ y = [0, 0, 0, 0, 0, 0, 0, 8, 0, 0, -8, 8, -8, 8, -16, 16, -20, 24, -32, 36, -46, 56, -64, 72, -88, 103, -117, 136, -157, 180, -205, 236, -268, 302, -342, 384, -430, 484, -540, 602, -670, 745, -827, 914, -1011, 1117, -1232, 1361, -1498, 1650, -1816, 2001, -2206, 2431, -2686, 2976, -3303, 3677, -4111, 4622, -5237, 5987, -6925, 8138, -9775, 12101, -15656, 21714, -33959, 68170, -362014, -1082066, 200019, 899895, -51988, -650397, 58123, 436984, -4407, -242985, -57591, -6810, 125366, 310490, -34552, -536442, -149505, 546096, 279027, -418106, -237865, 318449, 158542, -274024, -143415, 152628, 122813, 26873, -37129, -215412, -140720, 271667, 284011, -214791, -287873, 158249, 193426, -179760, -127443, 196656, 115098, -113325, -42090, 7598, -91478, 51513, 235686, -19786]
117a9786k54365K71238K21981k77017j03214L32515j4600m00571Q9572L99861
127B45614j80041l44652L23342L09248m66537l22659N28903L33769m88330k72290
137c33633M15058J54823l66847n2365L20984M168k16994M2012P1449j28588L9859
148e0074K20168q2746k51974R4951K06261j37438j43469K00800J08566k28915
158f3870q5054J96375J7507j49292Q4524J33832j58135j29488J69969R0027j47660
169d1265k676J46135p7907j61787J11389J49669j10028q7903J21115J7461j48990
180h4787J8950J46696l5458r1639P3319J2351j47915L9255K13988o1022k37447
191a53709Q7264K28341j37041k25773J77966K34846j72429k16091J33128J51350
$$ y = [-19786, -274151, -2913, 219068, -57949, -161163, 171352, 156752, -243819, -154247, 245614, 65573, -279079, 44263, 353511, -113026, -435685, 93218, 426987, -61343, -333633, 81425, 236248, -130599, -182964, 138020, 142188, -74806, -32794, 38655, -89933, -50074, 170094, 87348, -164626, -69675, 136586, -852, -144321, 56479, 165045, -63870, -148924, 47451, 64958, -84334, 190, 134022, -24113, -153601, 16368, 106395, -41265, -43941, 102194, 24287, -137500, -26111, 123558, 13530, -74373, 46742, 64203, -84787, -65837, 80859, 45401, -46238, 27081, 39432, -108483, -69228, 144760, 83738, -153709, -66445, 161896, 24855, -200918, -22952, 211894, 39465, -176626, -43498, 107852]
201A07852j00148o3393R3602N8q2466L3613M3645o5849R553J13529l9994j51509
213a01507L9431J45821m2632j06884P0759O7977j09681n0000J21647K9180j06648
224d2537J6099R1447p2565r4686J05410R8491j02659p3533R3766K8451r6939Q174
236d1081J03099j6482q2875J8325L7532l5679N459O2256k7006p1538L8757N2746
248D3513o6396l3086J03896K8975j27218l4476J19283K2094r8790R172Q7717l6463
260A8221q1820M2420O2427l6489k1354M3154j6240n8782L3704O3881l3064m5220
272b9162L7669J9785n2490o549N9756K008m6750J0832K2145m0861j0668O8393
284C4108J0469p8836o782P3164j2201p0975L2682P6173l6192p2971K6086N1278
$$ y = [107852, 7704, -55689, 37913, 37971, -44495, -10882, 32763, -33086, -23533, 89996, 50002, -101507, -62076, 83745, 41113, -65771, 4988, 72965, -36716, -86716, 34931, 64111, -42537, -26438, 65009, -7556, -102242, 3168, 101659, -1000, -74533, 19233, 47684, -49255, -41081, 62018, 45536, -37339, -19014, 18518, -17161, -11702, 50554, 23548, -47990, -9233, 43513, -22883, -55969, 47927, 76902, -50316, -84792, 34491, 56585, -42205, -33033, 54684, 18221, -63599, -21179, 41248, 4759, -16595, 26559, 10319, -48463, -14759, 49122, 16058, -29162, 8507, 28292, -24198, -30747, 29009, 31017, -15733, -4901, 17244, -23617, -34285, 34108, 44577, -34259, -41041, 32123, 19922, -51053, -18371, 57802, 21610, -51361, -25275, 26003]
296B6003j7327j8262K1534l205k3913J2995J3313k2281O105M1713j5905o0919
308d0149J1487O3237p716n1749J5034L7970k8936l5111L2868K9377k6605j1512
320a1805K0522j4164k4719L0715L2037l1668k6966K8527J3240l0780l31L5913
332B0521J77k9771j530J3998n601J561J8825n874k6712M581K2044j1140j5489
345a4410K2532J5853l1786k1199K8057J8394k1270o602J9307m636k1455O387J9051
358H223l206n589O120p047j3802J2470J9452r176j4734P948Q583j2497n984J4269
372E030Q076q962n878p97o418K968J8937J856k6304p729K4389P586k3249o239
386a6734K4225R937k0896j6901P824K1005J0782j3855k3215M311K7341M061k6565
$$ y = [26003, 8676, -9586, 11948, 8743, -15170, -2175, 11138, -11143, -5038, 36675, 20770, -40149, -28662, 34575, 26859, -24890, -9856, 28114, -822, -35933, -3065, 26312, -293, -11805, 8717, -5447, -30166, 549, 32586, 918, -26048, 2479, 15719, -15061, -15392, 20521, 20698, -9073, -10603, 3395, -2206, -645, 18180, 12306, -14406, -9825, 12219, 1079, -14410, 8122, 23975, -7811, -29010, -953, 17441, -3829, -10431, 8876, 4240, -17215, -10828, 8223, 5017, -572, 5548, -1499, -15301, -2831, 16621, 7445, -7289, 659, 9242, -3255, -9239, 5030, 13106, 4144, -1734, -2531, -8949, -5981, 12956, 14812, -11492, -19221, 5168, 12754, -10495, -16734, 7491, 17428, -3468, -20369, -12545, 8460, 19242, 5387, -17828, -13517, 13824, 17885, -8680]
399h680p171K6968J3177k5711k1828J6331K6198j233k1636j1742P997J3881M383
412A0934j1913j2698J0338J7286j0286k3943N797K7643M037k2277j1685R784J2633
425E650L229n017q527j761R356P452q843j2465Q824J9697k925k6500q515K4555
439D210J9247j5435k3183J543J8723P081j2493j3212N262J7245L766j9073j7687
452b4006J4693L1410L04l8881j7737L9165L2417l3006m1103K8011M7427j9882
464A8812n1691R377N1010K938m2872j1684K9380J1927j7637p474P413J841K39
477A579K460j0781r774K0459J9579k5921k9631K6614L5341k6100l5770K6967L9179
490C4201k7089m2812K3785M6541j6023m3708R409L7358n662l0340L585K2197q65
$$ y = [-8680, -15851, 11117, 24294, -1417, -23245, -6914, 19284, 18051, -3585, -15327, -7330, 6551, 10934, -979, -13677, -3339, 13947, 3661, -20282, -14485, 13158, 17195, -5082, -16767, -6983, 5650, 8879, 3862, -4665, -6426, 2930, 10382, 1539, -10926, -2102, 17595, 14670, -11830, -20345, 4210, 23457, 8022, -15161, -13618, 5105, 12186, -307, -13519, -8257, 8988, 12754, -6319, -24006, -9313, 22097, 22401, -16480, -34217, 4948, 37365, 4359, -36744, -8733, 38694, 18812, -32879, -23502, 27508, 30446, -12426, -24110, 5270, 17197, -440, -7914, -501, 1340, 1579, 4039, -6742, -16516, 3943, 23522, -2399, -32030, -5416, 29925, 3825, -31945, -4978, 34201, 7112, -35700, -11915, 34626, 18603, -25105, -15696, 21662, 16000, -14340, -10755, 11442, 10577]
503A0577j2282j556j991j726J4845R354k3158k1539K4670L1964k3351m1453K1382
516a4264N0136j6603n8283J0232O2823k814n9493N10N3502k892m7233R285M4300
529B9206j5160m1757K0475L9267k6344l8335L1619L8010l4865l8356L2547L3114
541B9421k8604k2741K4900O756k4725R999K7317k6172l1522M0855L8633n0342
553f225m9273N4599O1744m7566p0124L4005P1939j7155o4710J526N2177J1015
565C1952l4026j9781J0863K0234J2654j1926l2536o305M2382K6692m2955m6931
577d9683L5150O2708k1551p4667N217P9795J3135p5842k6893O5436L3736n0680
589d139k9764L7609K0184k7545n997K0830q442j8495K2689K0292l5130k5726M0403
$$ y = [10577, -1705, -3261, -5252, -6978, 7867, 17221, -5937, -27476, -2806, 29158, 5807, -35646, -14264, 35872, 19269, -39014, -28782, 34041, 31227, -28266, -27756, 25746, 22854, -24379, -15094, 29206, 14046, -27711, -7236, 32031, 5687, -32648, -1029, 36981, 2116, -36240, -3693, 29421, 817, -21924, 2976, 9732, -14993, -4994, 22323, -3849, -35371, 5484, 44117, -6225, -55498, -899, 60845, 13279, -56845, -22840, 49099, 31944, -32766, -31240, 20937, 31952, -2074, -21855, -10992, 9242, 21896, 9970, -22566, -28871, 13511, 40203, -2752, -49683, -14533, 48175, 26624, -48043, -42826, 36969, 50104, -25738, -52631, 12805, 46541, -4139, -33903, 3706, 23890, -3655, -9652, 11178, 2736, -15759, 6930, 27222, -7908, -33634, 6769]
602F769L0652m0432l2253L4131K7618k7997j8537K1713O522j7238O820J5372j9727
615f587j7162L0761K3758l5090l1097L3185L7221k4159l7550J2538L4208r1k6470
628f535j0325J4230J7866m36k0060j4938J4772K5121m258l0164r192K7875K1304
641B5260k0712l2528R771M0681L680m4043j6781M1949K7468l3985l1478K4294
653f424L1241j4923k5145P524J7573k298p220m03l759r08J3224M219j9422r233
667a5954K0311J1912j9638j2711J6040J0761j1545p965N863L864o06K044l012
680f36o946M981J0898m401j1224L528J1389k657r739K632P627j270n419J361J739
695A863k468L44L508k254m041J941K267k108j070J691r98o51K508j389l517K998
$$ y = [6769, 37421, -3011, -35264, -1133, 26485, -1512, -20049, 1664, 8186, -9052, -2232, 13140, -6587, -23749, 7012, 30770, -4320, -35417, -2232, 34989, 10830, -26720, -14182, 20026, 19935, -6535, -16860, -2630, 15236, 14800, -5260, -20198, -5426, 19695, 15437, -14727, -23919, 3956, 25260, 4548, -27980, -18209, 22472, 26152, -17891, -34672, 7277, 34745, 760, -30718, -6424, 24817, 9894, -15251, -7727, 9846, 7548, 328, -75, -3834, -4742, 8482, 12701, -6721, -15954, 4357, 16269, -3369, -16080, -40, 10721, -824, -8789, -2926, 938, 332, 2376, -636, -7582, -2601, 8297, 3896, -7328, -3800, 7589, 4932, -4807, -2175, 5452, 4182, -1237, 124, 1863, -605, -261, 3247, 993, -3048, -1107, 1160, -948, -2018, -327, -1325, -1976, 532, -857, -4374, -1376]
711a376N526m051n752N155N524n433l742O948K897p635k222Q530J714q093j598
726c608P992Q93p666k042O315J992l634l353j01K560L319k421n737J902P949j777
742B583r333J473R924r7q211n03O494J352m083o56K834L56j878R73L39j707P39
759E99K330j073l324j57K821k07j835m78m70Q74J604j451k786J471M358j728m854
776d306K036M654j173k713J090J703r51PJ560p22j566J292K523k301l405K337
792F5L999k078n104J107M036r52k460o83Q79J007J295k782k759L170N153l650
808B43n900L339O913k024o888K011P002j029o114L81N398O21m011j184J889J200
824A847k88j395j802J630L072k539n262K181O184k115o469J186O143r74m387M10
$$ y = [-1376, 4150, 99, -5653, -498, 5026, -407, -4149, 2799, 5696, -1939, -4161, 4369, 6083, -2010, -3608, 4384, 5277, -2389, -4431, 1884, 3876, 242, -3111, -3212, -652, 2667, 246, -5491, -3589, 4360, 2583, -6750, -5277, 4647, 4550, -3661, -4164, 2330, 3682, -401, -1057, 1777, 2133, 255, 1228, 1567, -140, 599, 2929, 1856, -1468, -1625, 1196, 989, -846, -1324, -1794, -920, 684, -767, -3553, -2082, 2276, 548, -4306, -2270, 2384, 1211, -1502, -412, 1291, 340, 347, 1907, 1185, -381, 911, 3434, 1133, -2272, 65, 4064, 1986, -3118, -2011, 2025, 1073, -1387, -2070, -1191, -184, 1111, -1671, -4430, -1260, 3893, 243, -5657, -2318, 4595, 2571, -4317, -2306, 4696, 3667, -2447, -2066, 3332, 3953, -58, -1242, 647, 1847, 1559, 164, -1638, -8, 3064, 525, -4737, -2556, 3628, 1513, -4956, -3770, 2373, 1399, -2988, -2578]
840b578K990M37n56l97j468O97M286K58n678j408O718K895o811l414N777L520
856E268m946l163K044J951M66m00l149k522M532M518n903n554N291O217m369n408
872e127L316L622q36q83nk305J079N978k76q465p38J0293J953j0418k794R077
888C471L223p085k703K484L63J763K110o124n663Q577Q357r844j0824R630J1857
903I592p862j1181N460R445k349n024N61O91Q80M111p65p865O06R922O51j0478
919c605k015R255K180o988j153K027j076K309K796n870n660Q283P303r227q125
934i566Q810P296o685m508M214M68j381N312M30j0649J38J6240N0j9288j505K1160
950A0536K494k0397k972J6713K150j1373p21M528k959J372O784o677j1621J0385
$$ y = [-2578, 412, 849, 293, -104, -1572, -875, 3411, 3669, -2009, -3417, 3301, 6196, -615, -4029, 1748, 5268, 322, -2841, -797, 1154, 1620, 1220, -1929, -4451, 81, 4599, -1304, -6858, -1567, 4650, 281, -5127, -1811, 1811, 975, 92, 87, -2218, -1139, 4839, 4563, -3902, -4640, 5653, 7606, -2812, -5606, 3471, 6694, -391, -3094, -610, -247, 1516, 3626, -2498, -8161, 416, 8773, -1071, -11895, -2265, 9592, 1730, -9451, -3991, 5454, 3105, -1919, -1358, -667, 213, 4324, 3559, -4306, -3700, 6222, 6873, -3605, -5620, 3635, 5815, -1173, -2326, -299, -1375, 934, 3730, -2140, -7800, 483, 7786, -1441, -9566, -756, 6540, -145, -4653, -439, 29, -1352, 3960, 4390, -6259, -6121, 10119, 10169, -9119, -10624, 10536, 13030, -7367, -10339, 6374, 8524, -2849, -3570, 958, -2001, -629, 6155, -522, -12143, -1758]
964a758J5093j1631j7793J0794J9007q243j7282M722J4743r56r638j517L988M432
978C961P64m762n371N240P981n037q526M103O353m011k637L333k247l704O896
993B336L215j1472l251J5402J634j6741l54J7324j858j6372O139J4954j0314j2130
1007a1488J5230R667j9650o489K3757L835k5951k143K7153j035k5701L706K1674
1020A2565o705j7208R396J0825j2430n050J4675k52j6456M206J7485o560j7912
1033a3421Q029J7432p027j5560N638J2617j965r348q65N439M832j940p367j494
1047e000J0066K970j1931l652J2048K343j1231m76R528l539p292P781L553j2375
1061g207p1J6976m131j9775P727K2286j0867k2758J4168K2163j6345j9398J8574
$$ y = [-1758, 13335, 1704, -16089, -5295, 13712, 5469, -11813, -7091, 7652, 6696, -2942, -4459, -471, 3961, 4725, -37, -5408, -168, 7813, 2776, -5750, -1647, 4706, 695, -1942, 1391, -856, -4560, 2336, 5551, -5921, -9172, 6230, 7864, -8877, -9231, 8093, 6235, -10137, -3998, 10956, 642, -11488, 3742, 13409, -6241, -12730, 11027, 14862, -11089, -13232, 13921, 12886, -12815, -9109, 12565, 5860, -11348, -1952, 8873, -3557, -8607, 6068, 5816, -10640, -6434, 11051, 4491, -13421, -5392, 12040, 5013, -10547, -4909, 7708, 5743, -3605, -4470, 969, 5801, 3861, -3506, -5000, 5066, 8036, -3895, -7547, 4501, 6844, -4387, -4863, 4665, 1126, -6166, 1615, 5168, -7207, -7278, 9698, 5567, -14208, -6481, 15805, 4938, -17820, -3652, 18511, 2166, -17232, 1342]
1074A342J5502j9744j0365K0710M097k0276J691J9329p968j7592J3099J4123j6644
1087b696j1162J8290P055j8702l875J8048L55j6056K600J3405n268r773P219O409
1101E849p687k430P361k48n863L808K810n352M59O730m058p188P538O179j0819
1116b911m790J2216K277j3085P96J2163m546r905P261O982j0543l187J3283n18
1130E493j4887M530J5707p873j4906J1045J3892j3333j1095J5274O684j4942k168
1143f579J4368k686j3115P094J0925j1669q200J4168M720j6247j269J6321k433
1156E398j5277N566J2668p853r670J0074N568j0354j715J0840k293q965N734P871
1170G592q283n614J0710K425j1856P74J1603l716j0586O391Q332q932n396R593
$$ y = [1342, 16844, -2900, -13265, 7445, 11542, -8734, -7043, 12286, 4318, -13274, -175, 13948, -2696, -13858, 4432, 11487, -7215, -11090, 6958, 7313, -8743, -6143, 7262, 1994, -7779, -560, 5849, -1838, -4268, 3093, 2845, -3018, 790, 3600, -1752, -1293, 5437, 1379, -5809, 1729, 7908, -2911, -7701, 4515, 6792, -6293, -5497, 6666, 2120, -7785, -524, 6458, -4085, -7272, 6011, 5493, -9394, -4864, 10843, 2970, -11936, -891, 13001, -332, -11427, 3847, 10531, -4411, -6579, 7789, 5103, -8012, -918, 10007, -1662, -9862, 4306, 9026, -7221, -8490, 7831, 5398, -9879, -4313, 8355, 502, -9168, 906, 6474, -3880, -5595, 5245, 2952, -6013, -279, 7592, -691, -6305, 4405, 6830, -5026, -4252, 7351, 3635, -6951, -560, 7772, -1160, -6556, 3037]
1184C037J897j0107J188R555m757q194P220O070q804l575J0052P31j0130K775
1198c042R638n423p611Q140N466r957k488J1521j062j1164L793J0722o918r323
1212g708R283N979j0547l819J1097L37j1130K894R716n740q254Q093O218r555
1226c136l460J0533P12j0302K058R479l802p664O598N151p833k174Q556l74r160
1241d818L046Q419n821p118P343M728q108k847Q171j35p469K289O150m558m581
1256e309O486K436o932m51P816j723o879L607O037n242m033O882J936p507N68
1271b308P663k751p680M765O453o521m940P067K745p708l58O622j639o176L798
1286i68M513n252l036O633J553p509P21P551k175o470L592N961n053l591N816
$$ y = [3037, 4934, -5173, -3985, 5570, 813, -7381, -161, 5909, -2895, -6470, 3582, 4313, -5817, -3042, 6596, 1173, -6438, 1702, 7168, -2789, -5277, 6244, 5182, -5982, -2189, 8533, 1615, -7708, 1575, 7554, -2993, -6812, 4285, 4622, -6508, -3614, 6102, 362, -7892, 201, 6419, -3136, -6596, 3937, 4649, -5653, -3595, 5884, 2082, -5582, 1016, 6167, -1666, -3840, 4716, 4342, -4818, -1772, 6647, 826, -6292, 1051, 5779, -2329, -5176, 2995, 2860, -4609, -2320, 3830, -728, -5309, 1177, 3613, -3319, -3770, 4046, 2323, -4556, -949, 5088, -154, -4187, 2695, 4631, -2876, -2308, 5355, 2604, -5076, -311, 6142, -379, -5319, 1748, 4493, -3215, -3573, 3049, 1410, -4766, -968, 3545, -1707, -4743, 1890, 3443, -4066, -3345, 4206, 2031, -4439, -847, 5114, 61, -3530, 2286]
1301B286J750o217K27O440k501o085M190M684n289l825O039J865o131n40N517
1316B410j255m796K393L835l551k062L892J247m488O41M150j500l383L071K354
1331B958l360j350M175r5m166J125M122k799l075L212J903l660j066L985j014
1346H95l642J910K904l217k214L973J175m309N1M624q09m559K169M102k637k724
1362b308L716J725m103n70M270k47m573J285M044k190l336K762J943l436r43L172
1378A211k27l233J157K471j773k316K408J752k119j591K356P55j669M05J099m53
1394B33m41J375M2k009Q55K017r60k087O44J858j037j044O96L3n76O48K09j836
1412a380j35K153j91k353J90K375Q0k324M59K100o84j168J212R23j969R1K538
$$ y = [2286, 4036, -2181, -1954, 4486, 1985, -4100, 90, 4774, -515, -4340, 1699, 3564, -2567, -3107, 2410, 1155, -3641, -1248, 2587, -964, -3026, 866, 2113, -2375, -1734, 2416, 916, -2467, 604, 2958, -402, -1752, 2423, 2328, -1838, -713, 3409, 610, -2465, 747, 2650, -1010, -2076, 1909, 895, -2747, -837, 2067, -1150, -3364, 609, 1784, -2525, -2474, 2150, 1341, -3218, -1049, 3053, 416, -2308, 1408, 3133, -970, -1540, 2730, 2483, -2090, -805, 3239, 1049, -2287, 475, 2418, -1018, -1961, 1211, 984, -2249, -1092, 1379, -394, -2710, -302, 1450, -669, -2260, 96, 851, -818, -413, 686, 233, -208, 1167, 1209, -800, 55, 2072, 1112, -975, -331, 1527, 490, -554, 142, 175, -401, 247, 456, -1380, -1515, 638, 447, -1906, -1716, 659, 739, -1585, -1126, 974, 290, -878, 334, 1257, -712, -621, 1917]
1429A917m70k537P69K925r69k861O93K103l26k119O3J189m38k55Q3l82n78R94
1447a99Q67j260j113J078J444J0k357K29J959J088j843j351J668J604r43j793
1463i12O42J723Pj613J87O17n62Q1L71n82j363J004J866j606k797K006K457j108
1481D18k915J231K698p06k313N00K351n31j663J314P32j007n87J412P29k229j65
1498g31K172O47k564j243K225J232k331j419K149J394k397r73J751P20k045M26
1514i87J955q95k376J684K995k216k937K365L893k540l687K579L469k525k623
1529a846K223K204k139k174K513M65k345l54L118q38l103P19L412j180l557J642
1545a240L150j204l139J203K755j095k312J304J986r72j365R75J602j277j284
$$ y = [1917, 1447, -1090, -321, 2604, 1635, -1226, -533, 1570, 1244, -875, -812, 377, -61, -316, -233, -615, -1193, -199, 668, -592, -1705, -627, 817, 827, -1530, -1301, 658, 1746, -97, -1448, 220, 1824, 881, -912, -270, 1453, 1460, -153, 34, 651, 89, 170, 541, -41, -1404, -400, 1466, -140, -2937, -931, 1526, 418, -2497, -1266, 1432, 726, -1587, -1087, 1264, 733, -930, 384, 1116, 109, -478, 934, 1663, -566, -731, 1441, 2088, -476, -1719, 506, 1738, -593, -2012, 137, 1531, -866, -1839, -88, 632, -1413, -987, 968, 73, -2303, -619, 2376, 160, -2777, -412, 3481, 941, -2746, -167, 3302, 777, -1846, 377, 2581, 442, -1732, 781, 1246, -1099, -1453, 1665, 827, -2276, -1557, 1855, 675, -2882, -1240, 1910, 706, -2433, -1230, 1525, 430, -1882, -578, 1408, 436, -929, 46, 1648, 371, -913]
1560i13J738J086j814j119J747J151j926j475J372J653j953j548K170J201k243
1575h73j211K221R40k708k45L159k12l118Q86L609j253l697J955L508j662l189
1591a890K008K614k396j877K316J231k732o10K668l49k774N07K685j226k368J518
1607f75K055j748j633J734J007j671m9J283L97j167J42R09r2p76L71O11Kk12l19
1626A69L56K34m99l99r8M39M19j137m3P97j74r77K54J197r64j088J812O18j662
1645g46r64K729l3k023M24K383o45k319J146J927j125j891J984P88j744p49K007
1662A149k26k188O85J875j006j847J296J357j609r75J302P68j528LJ251m52o87
1679h32P86P83p36m36J020J47p93J97O69n42k39Q22k59j039N37J111j208r85J345
$$ y = [-913, 825, 1911, 97, -1022, 725, 1876, -50, -1525, -153, 1500, -453, -2001, 169, 1370, -873, -2084, 137, 1077, -1631, -1876, 1283, 1071, -2047, -1161, 2448, 1195, -2502, -547, 2961, 1299, -1890, 118, 2732, 336, -1541, 775, 2006, -726, -1336, 1332, 983, -1791, -1284, 1401, 175, -2193, -675, 1380, -368, -2001, -267, 740, -931, -980, 303, 700, -467, -325, 584, 492, -284, 87, 698, 700, 488, 169, 525, 759, 260, -139, -237, 202, 621, -516, -559, 238, 64, -913, -659, 538, -426, -1514, 298, 916, -746, -1710, 1019, 986, -1037, -613, 1770, 1125, -1194, -48, 1879, 754, -1137, 847, 1635, -109, -858, 1149, 923, -1265, -580, 1295, 289, -1558, -262, 1095, -514, -1489, -187, 581, -947, -944, 307, -145, -832, -46, 737, 1, -435, 585, 732, -61, 136, 805, 263, 24, 846, 587, -452, 85, 1196, -12, -997, 348]
1698C48N97j811m73K065m63j584L62J869j137j300J389R94j612m23K053M29k096
1715g93J19K035k75k257R66J975r08j559J400J155k128n11J542j93j685Q52J185
1732I20j110q92P45P98j158j34J185o14o71P13O50q46n51J469K74j249N96R58
1750A083o44p81R94P98j571n18J588q8j623L31J619j182j392J518J175j936p19
1767a348J856R0k040K57K099n45j600R21J220o02j263J138R07j238l46J528R6
1784A130j684Q23J039j050q54J176K98j250j98J115n45q14P92N32j284l2J104
1801B98k41j462R52J210r63j454J501J373j661n58J702K51j617K95J883o16j816
1818i23J532J098j640j264J680P69j981l56J859K55k422L06J853q30j265R97Q54
$$ y = [348, 945, -866, -1339, 726, 263, -1321, -959, 910, -227, -1527, -138, 856, -756, -1179, 874, 1303, -793, -674, 1361, 1086, -1171, -205, 1770, 862, -697, 703, 1858, -270, -781, 761, 568, -1117, -265, 920, -190, -1082, -337, 461, -697, -831, 354, -260, -931, -218, 432, -414, -965, 504, 778, -471, 125, 1083, 439, -342, 652, 1450, -121, -639, 949, 861, -762, -431, 1188, 6, -1386, 132, 1307, -629, -1348, 508, 598, -1442, -1185, 914, 369, -1231, -310, 910, 308, -955, 183, 1090, -148, -494, 1034, 1130, -554, 269, 1308, 258, -596, 580, 878, -372, -570, 545, 0, -814, -22, 510, -774, -806, 298, 57, -1405, -453, 757, -206, -1660, -159, 1214, -447, -1005, 697, 948, -669, -374, 1509, 893, -923, 609, 1707, 67, -1197, 483, 1252, -729, -1085, 774, 1029, -1393, -1087, 766, -64, -1329, -332, 522]
1835E22r23q42J426L17j418RJ479k02n95L32O85n90k75O32j28l62M58L43q33l41
1855c06J063j96j230N09O23o60j049J346L84j268m54J459R7j625P28J610p25j589
1873a283J329J327j356r05J608N96j805K45J623l11j991Q57J405j027j310J085
1889H7J171j698o01J493J68j521J15J160o74o64N23O68m19p43J143M39o74l50
1907c77O15q5m55N14L47l43j24O11k32p18M32J84m94p0N09j90m37L35L00p00l84
1928g62Q50j15q22L49N09k21p14R00Q0J6o59Q02N74q88j31Q50K61j222L45R80
1948I82l12q83L83P55q75q26Q58M41r07l11Q74Nj022L29O00k60r20O01R29o40
1968a99p11P53P85n37k83M69L37n02k38O33K67n24j39M71k98l86k5J84j35k8m5
$$ y = [522, -401, -1243, 183, 500, -918, -909, 570, 368, -227, 105, 790, 200, -75, 557, 429, 67, 525, 868, 35, -306, 757, 561, -669, -160, 463, -197, -1246, 100, 484, -784, -1238, 221, 318, -1307, -579, 1031, 306, -1283, 46, 1373, 17, -888, 720, 1316, -489, -244, 1379, 1068, -923, -66, 1339, 312, -998, 87, 1258, -440, -1041, 452, 620, -901, -786, 374, -300, -964, -441, 227, -192, -935, 208, 647, -27, -377, 238, 153, -302, 212, 559, 216, 92, 703, 471, -247, 185, 369, -125, -195, 314, 124, -313, 22, 322, -378, -762, 88, -27, -849, -500, 9, -212, -926, -26, 54, 70, -589, 213, 787, -101, -232, 618, 879, -343, 2, 982, 670, -213, 170, 925, 50, -776, 82, 523, -384, -695, 179, 184, -838, -509, 91, -169, -1089, -488, 441, -199, -910, -157, 628, 91, -192, 277, 614, 112, -126, 507, 774, 250, 111, 582, 284, -102, -127, 57, -78, -106, -151]
1989a51P4J98o95J78J00J17j24j60M8kJ76P1P5K35p1m2K13J38l32J87K30K88p01
2012E0j68O07j67m06MN59k73p17J34N94k58j056Q37O27j082n79J213P97j254k39
2032g77J350k66q95L11J230n68j091R97N19n53n52O89M57j082lP41L8r72K84P60
2052F17p60m03L90K13n43k62Q13k42m40M8L91k06R9N38k94r3K53N31q99J80P98
2073G29m07k70K9Q79o29q39N47M44p42l49J133p3r91J02R47m10j151J031P85j295
2093e30o68J389M11j481K80J396l28j127O21J028r07n25R82K98j042r2R59j3j250
2112e99M27Q84n19j037Q47K78p54m7Q88n75o37P77J96q99R5J101l39n18J86R24
2132F79o03n12R16K66r92j4J307k57j522N81J325j059j142J130O88j040p43J657
$$ y = [-151, -77, 121, -574, -396, -296, -179, -303, -463, -415, -417, -241, -170, -95, 140, 69, 27, 240, 378, 46, 233, 463, 751, 50, -118, 489, 322, -84, -80, 479, 206, -511, -377, 217, -41, -1097, -260, 367, -715, -1294, -81, 716, -538, -777, 573, 307, -588, -277, 953, 385, -706, 291, 810, 257, -295, 394, 851, -231, -234, 507, 545, -427, -143, 617, -143, -546, -156, 57, -486, -748, 65, -177, -617, -569, -178, -384, -285, 253, -41, -134, 119, 650, -249, -69, 729, 322, 52, 81, 960, 331, -508, 39, 483, -259, -608, 525, 452, -539, -437, 510, 100, -1051, -20, 765, -530, -1198, 191, 602, -879, -599, 797, 469, -658, -37, 991, 84, -441, 541, 839, -203, -295, 664, 651, -599, -172, 712, 193, -844, 3, 281, -473, -520, 368, -207, -844, -67, 129, -770, -675, 426, 87, -431, -245, 679, 76, -436, 480, 746, -246, -260, 1047, 790, -732, -151, 1174, 115, -1027, 103, 791, -249, -992, 665]
2150F65q6j704M22J410p41j323J222Q31j451k49J368L25j410J51J129l45p07Q30
2168C37N32p20k09Q78j74r53N16P06n99r28P40L00p80j55Q72p76o35Q83O86j223
2188g02m47J681K8j573O88J242j025o22P93R69j300l65J379L82j710K67J529m08
2206H06k029J209J386j353r18J028Q71j315o73J380K7j509N63J240o48j040P35
2223b40Q21j110j76J049J98q88K64P81p23K1N76L05j050K72P79q14m19P09L75
2242G30j095j74R39r5r72R20K47p79o69J081L67j412J31J291l35j165P35J054
2260G99q38q69J125P83j392j94J468j74j215M43J194m70j200M62P09p92l39R67
2278D67p3j036K51Q37q71l15O15M63r92n6R79l09n07M88M25o03j04R16j31j041
$$ y = [665, 579, -1125, -703, 707, -34, -1357, -135, 696, -755, -1004, 364, 689, -721, -570, 559, 214, -493, 337, 869, 149, -60, 818, 644, -309, 207, 913, 314, -614, 126, 426, -354, -509, 363, -413, -1048, -165, 521, -702, -1149, 532, 560, -1013, -325, 917, -108, -730, 63, 1032, -268, -633, 746, 1128, -582, -315, 1214, 806, -1223, -14, 1372, 19, -899, 129, 1000, -315, -988, 392, 419, -1090, -527, 713, 65, -975, -240, 581, -529, -705, 344, 542, -346, -82, 699, -24, -3, 573, 878, -172, 100, 879, 65, -354, 355, 730, -365, -539, 400, 305, -667, 253, 500, -279, -948, 133, 500, -912, -781, 510, 175, -990, -255, 799, -39, -908, 217, 1000, -392, -586, 882, 708, -507, -64, 1130, 660, -540, -78, 631, -161, -500, 467, 394, -642, -391, 446, -425, -740, -125, 338, -654, -710, 269, -40, -547, -59, 366, -237, -341, 575, 444, -597]
2298e97N12J142q43q87R00P09q72p13R75K18r83k50J108m20p89N88Q11q55p23
2317i69J242M2p76m66J317l02n94M25P55m47m74N36M8j77j69P51n74l13M83K68
2337F06o31l02Q10k74o56M43N07j038K9P57k47n71N4Q64m31o56M02J112j214k09
2357f45J050J68r97r4J019N7j065L15J189o71r19P24O60p96m74M96L11q04Q3O28
2377B35j87n88L9O55m81l02O17J06l22j6O86k21m78J61L66l23K18L48m20k20M32
2398C05K11o97J35R9K05m51J96K25l57l50M66J63o29m0P20j42q88O92O73n89n64
2419f17P44M08l98m06P25j07m72M21J71l67m99P84K19o36J58L29l2n92K83j79
2439f3k19m6K77L79o61k44N85j0l32j66Q02k55l25J82M81k64k77N84k36n49N29
$$ y = [-597, -85, 1057, 214, -673, 227, 936, 64, -649, 326, 544, -439, -689, 419, -1, -790, -202, 609, -246, -969, 273, 315, -461, -927, 390, 88, -506, -81, 674, 227, -247, 289, 337, 160, -9, 742, 168, -145, 338, 606, -25, -327, 483, 209, -447, -4, 503, -535, -506, 251, 4, -567, -513, 351, -80, -736, -334, 778, -436, -645, 405, 573, -424, -518, 501, 558, -507, -192, 997, 326, -593, 131, 791, -5, -479, 17, 328, -476, -393, 235, 48, -540, -501, 154, -327, -629, -12, 94, -228, -244, 442, 221, -257, -96, 270, -53, 165, 513, 93, -127, 305, 516, -181, -46, 53, 258, -193, 3, 228, -129, -479, -13, 150, -479, -519, 201, 59, -829, -137, 536, -53, -617, 127, 535, 137, -269, 456, 349, -123, 298, 469, 102, -397, 387, 606, -30, 128, 457, 425, -167, 116, -63, -282, -328, -51, 328, -333, -577, 8, -2, -334, -500, 302, 47, -278, -96, 385, 121, -156, 428, 192, -357, 172]
2460A72K52j34k69P9L59m80m6K23J6no9l82Q2k5K47l54j5JP9l35L92M83m78j59
2484c66N17J25m27p1L86K64n97r7P81k45m03o5O79m8o38N5O54p91j45N19K42o79
2506c50n0P83m08o30K41P03j63o12J93P95o07l19N85J04k51qK08K2Q0j78J11J5
2528B64k15p5P7J68j58l4o1K41j58n39J13M90k16k04K2J48L20m29L36O4m08K78
2550B4L12l8n47P7P76j05q25K85O23m16m37N18L96p13j51K64L30j016L22N19p1
2571A27n15k32R54o47n0J23K46k2k02L18J92k17r4J66N7m0L4J22j28j92N2K29
2593B81m5p2K0n9j75K3j96K6J99l4k00J06r8K37j88M5J75l22k25M17N56n52k6
2616a07L05r4j04J60M07k12m35K47L06l49j03R6Mj18k06L76k9m65M7L16k38k95
$$ y = [172, 424, 290, 21, 100, 459, -21, -67, 156, 172, 167, 98, -284, -202, -227, 20, -334, -349, -348, -269, -604, -212, 271, -207, -366, 151, 276, -151, -222, 164, 428, -169, -266, 515, 270, -133, -198, 481, 433, -205, -150, 504, -287, -432, 87, 329, -350, -400, 383, -25, -655, -414, 289, 126, -486, -293, 502, -105, -424, 161, 265, 14, 6, 214, 236, 316, 138, 249, 264, 49, -26, 51, 219, 61, 27, -34, 207, 49, -490, -377, 113, -103, -307, -285, -137, 183, -246, 90, 154, -254, 24, 336, 298, -249, -172, 604, 499, -326, -41, 582, 166, -271, 247, 643, -70, -221, 43, 373, -643, -321, 198, 127, -388, -620, 334, -313, -363, -240, 6, -16, -218, 100, 292, 75, -19, 147, 204, 164, 198, 320, 192, 0, 52, 281, 236, 164, 184, 125, -50, -27, -223, -197, 2, -32, -232, -126, -224, 13, -175, -130, 45, -277, -502, -85, 471, -81, -107, 198, 104, 0, 160, 567, 355, -80, 167, 473, 124, 21, 117, 121, 3, -203, 173, 144, -321, -274, 42, -196, -491]
2638d91M21L88o01J64K49J5l26J01M01j4m36J64M95p24L34J25p4l43R1M50J20
2659E09m89k27L20m5j80L4j05j31m6K29m7j08J02M8j00L7J37O5n8K60j21O8j58
2682fM15j91k28K67j87j80J68P5J50k18p7K31k23k81J71K40k97j79K08J16l37
2703c63Q7J51L41p01K90M74k22l38K48K19o0Q7J80Q1k43m23N57Pl00k73M14Lk60
2726d4n3J93k18J84l16K30j35J8l0K8k21J26k7j57M24k25K82j5J70j22j89J18
2748B1N32m77m8L63j60l90J30L27p2o17K98L20j69m73M24J81k19m59K05M96k77
2769f4k88O71q1o20J67N81k3k16oK79m17m18P38J24j10o41N34L46k96l96J18l9
2791e7j05q3K37j95p0J7J86Q6k67R1m2K47k49k9J05M45j46k32J67L58n02k42P32
$$ y = [-491, -70, 318, -283, -119, 130, 145, -181, -80, 321, 307, -129, 35, 530, -194, 140, 265, 191, -152, -61, 389, 509, 20, -207, 113, 68, -112, -78, -183, -314, -360, -131, -178, -286, -184, -136, -236, -199, -62, 3, -55, 205, 84, 152, -6, 409, 218, -10, 257, 70, -110, 58, 133, 283, 65, -12, 219, -4, -285, -114, 126, -171, -350, -142, -26, -363, -276, -125, 216, -485, -195, 279, 57, -281, -33, 186, 126, 213, 393, 474, 231, -192, 365, 372, 72, -201, 213, 216, -44, -97, 96, -122, 62, -254, -24, -159, -141, -171, -143, -364, -238, -265, -422, 2, -223, 59, 44, 214, 92, -97, 21, 553, 76, 28, 391, 231, -159, -29, 298, 226, -391, -93, 227, 58, -415, 9, 190, -29, -488, -283, 213, -64, -352, 319, 238, -382, -215, 366, 343, 127, 121, 400, -17, -435, 303, 427, 317, -324, 210, 556, 260, -136, -18, -57, -162, -245, -8, -203, -273, -256, -70, 16, -251, -160, -202, 45, -204, -233, -128, 317, 171, -61, 106, 464, -38, -280, 452]
2814D52L3l30k95L72K74n54m17P93k96j15j73M49l36l48M00L15l60m71N77J45
2834A15n13l7O22J48m72n3L26Q2r6r2L65k21j2p3r2P4lL8j18K80n22J79Nm5k45
2859c60J8L49m6j40j17M54J90m58j06L07J34m27K27J80P2m18K50K50k10k66L55
2880B38M05n25l52L61J15m92O5N29j60k73j30K92k29k46L41J41l68O3K87Q3l42
2901a97K6L12K43o05K51N9K82j80k96O09l08J64m58L2k54L95N4JL7n89L26R9k33
2924b30r9J95r8K35r7j77J90J14k36N0L36k13j47K54L28k87k7N4L24m35p7L42
2946B99j7l33PR8Q8l69k9L99l86K3L5J12o0rJ02J64m68J84L09j57j22K72J78k17
2970A03r1J19p6k40K86R8O6k77J26j21J78j10l39M06L9m78J43L0J27k60J65O0
$$ y = [452, 485, 155, -140, 232, 506, -48, -465, 328, 32, -83, -256, 193, -143, -491, -91, 224, -136, -607, -30, 115, -398, -435, 187, 335, -137, -190, 136, 218, 122, 30, 395, 174, 162, 89, -3, 71, 68, 106, -12, 268, -254, -75, -70, -115, -360, -342, 7, -39, -179, -296, 158, 348, -110, -216, 91, 225, -202, 25, 205, 277, -141, 109, 359, 149, -117, 238, 643, 118, -234, 127, 242, -250, -185, 344, 184, -89, -219, 73, -156, -402, -61, 80, -288, -225, 62, 145, -197, -171, 141, 384, -221, 30, 89, 371, 191, -105, 504, 196, 360, -98, -66, -320, 75, 129, 130, 167, -422, -96, 3, -230, -329, -134, -232, 3, -94, -271, -81, 33, -203, -153, 183, -30, -177, 77, 405, 118, 91, 145, 469, 34, -43, 299, 282, -51, -44, 54, 142, -227, -256, 143, -243, -220, -185, -73, -133, -142, -40, 124, -344, -160, 149, -8, -130, 142, 320, 103, 12, 131, 55, -185, 101, 199, 265, -12, 114, -7, 171, 61, -278, 128, 167, -311, -168, -138, -11, -271, -106, -46]
2992d6j6j21J02M4J28j44j43L51j05R2j71K37M6m07K5L92j36j65J60K87k92k16
3014i8K0K48j79j73K01J5k87o5L04No38M47K64K4k47m1Q0J24n19M38J35J64k28
3037fL04j35k64P5K42L0m7k24K00K0n21N18O5j18l50R9O7j58m8J81J41J04m90
3060c15K78J06N8k52J44k1K22n50L88P7j36j90K2N77k61r1J24j1l38N4R7n6k6
3083a00J68N3k4m04O0O5Q2J20j63J66K65m13N8L57l22J73k74L81j75ql9L75k5
3106C76j73j06j1K5j81J50p9j88K15Q7J12l83O9K00K02m94J39j62J85p4Jj84N96
3129C22n61L13l1K92j36j39J47J23j98j97j30L20j00k10L01k30N0r4J45J51k10
3150g2j19l2K38j55j5L72n6m56K95KL7J4P4l3Rk7L9K34k98K8M09m14J66k12K76
$$ y = [-46, -62, -183, -81, -37, 91, -53, -196, 155, 50, 142, -29, 208, 254, -153, -128, 264, 128, -37, 123, 410, 118, -98, -78, 170, -9, -182, 19, 34, -253, -318, -14, -9, -647, -200, 64, 88, -159, -200, -120, 4, -515, -77, 58, 222, -6, 298, 163, -101, -26, 216, 246, 199, -25, 175, 195, -326, 192, 257, 139, -211, -112, -45, -203, -251, -70, 71, 175, -315, -37, 69, 127, -125, 19, -2, 220, -330, 58, 135, -1, -191, -169, 408, 147, 56, 180, 169, -169, -115, -18, -74, -100, 68, 121, 97, -307, -247, -182, -100, 20, -143, 23, 288, -125, -67, 290, -32, 141, -133, 248, 73, 65, 26, 401, 376, 203, 97, 86, 111, -70, 80, 1, -187, 28, 115, 227, -156, -87, 113, 315, -179, -40, -202, -17, -91, -90, -274, 322, -239, 74, 43, 335, 199, 60, 207, 330, 132, -65, -195, 125, 25, -185, 116, -114, -64, -158, -13, 138, -72, -191, -223, 15, -140, -155, 217, 161, -295, 0, 2, 39, 53, 127, 94, 103, 76, 115, 349, 51, 79, 488, 74, 240, 28, 304]
3175C04l48j84j5J73q0M3J70l47K64q2l5k4R3K5Pr1J96J90m26J40L26O3m15j12
3199a65K63J8Oj24J88l4J28k91j34Q0L5J49l19J77L2q0k30Q8N7pM15k60j26J36
3223Bo9K22J32m5k05R8j4j71R4K85l06l2J25j81p7J81j4Jn3Q7j37k17L72j01J12
3248H9l48P8J54Q9l51M0J93L2j06K19K16l06l22N63j24p7J62K01m87O8J26M5m7
3271A07k54n7K27r8J07j17j79Q3l3J76j11M6K7j58L27j83L1K44l18P0j11L3L35
3294A94J68n06J31K08o1m2J02k95K19l62L10O0k6n68L92J48K8l01K08Q2k04J86
3316G1r8j62L6K26p7j92L0K58K22k63n8J8j57Q8k6K38r7p9J78k05j0J79j18j28
3340a26l3K2J24j32j04K89k2J43j15k37j00K26P1K77l72M03j31j74m01N31J38
$$ y = [304, -44, -228, -243, -70, -150, -107, 63, -284, -20, -102, -137, -161, -68, -43, -36, -127, 69, 259, -167, -27, 299, 362, -53, -165, 98, 116, 122, -2, 186, 152, 280, -11, -145, -65, -30, 119, -200, -23, 9, -71, -301, -213, -156, -163, 252, -8, -134, 2, -67, 155, 287, 242, 37, 135, 121, -50, 44, 329, 23, -9, 116, -65, -142, 39, 25, 26, -27, 60, -77, -294, 78, -23, 89, -259, -181, -27, 62, -289, -249, -56, -24, -130, 89, 305, -1, -323, 240, 116, 39, 201, 402, -85, -17, 109, 154, 107, -147, -204, 23, -75, 32, -85, -264, -181, -214, -38, -149, -103, -76, -234, 93, -90, -59, 185, -133, -63, -174, -141, 194, 362, -144, -13, 195, 134, 92, 194, -101, 118, -244, 66, 126, 100, -468, -76, 72, 100, -201, 7, 89, -115, 71, -27, -189, -153, 73, -4, -196, -166, 92, 314, 51, -7, 11, -146, -58, -84, 154, 57, -22, 156, -49, -59, 120, 2, -126, -159, -137, -13, -145, -249, 40, 18, 161, 46, -191, -291, -65, 6, 283, -89, 314, 183, 9, -392, 139, 277]
3361B77k34N1L01j12k85j84L51J6j91j98O62l91m33K14K18j79j10J29J18K9k03
3382a54J93K40l05J8j55M90m79Q6K46k12J18N2K18k50l4o7J06j04j7O0nJ58j46
3405E7l92J81J32Rj86Q3J70j46O8L9j56rM40m7n69K58K12K71n50j29M59R3k10
3428G8j28J34j25k76O4J51J0k04N53j30j66j15Q9L53n05K35JQ8l74O1L62o1m89
3451c94J97M97j58k31J2M96k38k79K93k40K53j82Q7k55p3K20J74o6m36L65O3l71
3473b66J13K1M3N7J33l27L65j27Q8l98J31L94k84o9J50J28k70O4PJ76R6l23M19
3496C21l67k35K41N8K00m08n5J96j6k36M8K00j8K58j79j54j62L60MJ51l08K1K63
3519A83J04n11L34J47k47j64M37o2m57J02J97j79Q2q9K18P9m68L07k63K49O3l45
$$ y = [277, 43, 94, 395, 283, -2, -186, 165, 181, -10, -208, 454, 63, -370, -156, 62, -117, -227, -98, 20, 49, -154, 39, 279, -26, -8, -163, 327, -152, -66, 180, -32, 86, 138, 356, 106, 72, 5, 111, 7, -10, 50, 45, 203, 57, -335, -154, -22, -13, -199, -116, 54, -92, -24, 15, -141, -150, 290, 243, -326, -68, 144, 415, -135, -264, 195, 288, 78, -50, 84, -41, -317, -253, -102, -92, -296, 257, 127, -39, -154, -65, 288, -217, 18, 19, 107, -267, -206, 156, 95, -394, -197, 300, 142, -89, -77, 419, 181, -98, 195, -45, 208, 26, 113, -142, -215, 5, 179, 113, -323, 42, 105, -266, -153, -132, -89, -32, 101, -226, 139, 12, 100, -298, -167, 227, -57, -126, 24, 152, -118, -54, -47, 129, 225, -98, 321, -46, -281, -40, 18, 218, -190, -245, -49, -65, -301, -253, -53, -71, 187, 8, -146, -308, 52, 56, 207, -101, -80, 183, 287, -224, 110, 257, 10, -154, 283, 221, -236, -134, 63, -116, -34, -123, 95, 174, -294, 13, -250, -1, 62, -283]
3541b83K05p4q6j00M67Q4k28N8L26j90k60J19J53Nj96k47K01J02j75r7L33k31
3563a14k25J85K87l6m45K80L6L52n05J79J16n2k68M43k38N2N1K54k51o8n2J83
3585A64O5k87k1L04j73k47R7J8j65J61O0J0k82J88K8j21J90n4Rn8N1o7Q8j76L99
3610A81o3J75k3j28j96L56J41n69K13K18j99j60n3J70j06l3oL8J9j44K36J10n09
3633c32J76J20L38k93j35n2M24k10j53K45j61R5j38J96P9n3q8L29m09J5N7J53
3655B03N4k58J34j07m65K74K69K28l73k45L64l29K67m2M8K07l88R3K43k22o0J34
3677B9P6K05l57l9J45K0j9kJ92k09Lr5M0L9q6J50l67J31J27RK7Rj44O4J85l1k23
3704a21K13J31k01l6J38m2L4J5q5J91p5L38j85l37j77K66o7j27k35P7K54p5l88
$$ y = [-283, -78, -152, -238, -338, 129, 213, -15, 43, 369, 179, -81, 38, 191, 196, 0, -247, -46, 56, -119, -216, 117, -114, -339, -154, 133, 97, -348, -68, -32, 320, -185, -6, 110, 58, -210, 233, -5, 47, 98, 352, 101, 33, -19, 164, 229, -58, -79, 225, 52, -195, -98, -80, -245, -84, -24, -14, -296, -108, -80, -201, -11, -65, -56, -114, -63, -130, -42, -218, 181, 118, 293, 270, 142, -54, 302, 443, -126, 87, 305, 106, -54, -107, 63, -43, -76, -82, -44, -25, -169, 67, 177, -332, -156, -36, 302, 9, -126, -178, 246, 36, -117, 128, -33, 62, -76, 120, 199, 146, 58, 387, -22, -7, 50, 203, 257, -1, 133, 26, -439, -165, 104, 332, -41, -286, 78, -251, 16, -26, 22, 229, -159, -66, 177, -45, -105, 29, 105, 310, -47, -86, 59, 79, 60, 58, 250, 41, 44, -51, -11, 28, -58, 92, -275, -144, -17, -8, 19, 28, -116, -52, 133, 102, -121, 92, 223, 22, -14, 124, 82, 116, 131, 46, 237, 162, 500, 315, -22, -199, 67, 0, -127, -362, -285, -31, -106, -494]
3727d94L15Mo7j80J97J03J61j70K26j07j00K20m8J26j48M8o7K33n86L05L22k27
3749F6J05j61m0P3p4r6rJ74P1m8j48Op3O7K41m10K13o7j7J65L4o5J03J28j59n2
3775B7l3r6j36L08k07M61l9k43R6j17K89k92o7J95l48L3l4O6J1j26K35N0p3j47
3799a87J90k03R2J29j8J4J57k36O1J61o5NM4l82J58J07N9n8l4J75j56J5ok12L89
3824A99k07P0K13l61L7j19M47m71K08j61j44L02k4J89n1j29n5K32J17k29J74k63
3846b6p5l5J52K95l33J09j84m9m9K36j2k05Q9q7J02N1j99J76L7j16L17k39P4J50
3870A79q0J04r9j5J78p6l31R3M6Kl8q2J67j58j73K33L3K83n07L15n3P0m20L00
3894b9j34j01L3J92L34k71L3q3K9K2K4J04J8j00j31j10L65P1m91K08K92j71k16
$$ y = [-494, -179, -175, -242, -422, -225, -122, 39, -131, 95, -12, -112, 108, 60, 186, 38, 86, 19, 252, -334, -29, 293, 66, 171, 10, -30, 43, -31, -127, -136, 38, 109, 61, -87, -81, -154, -87, 154, -256, -43, -110, -127, 38, 72, 7, 110, 238, 79, 27, -6, -102, -238, 70, -137, 324, 285, 42, 138, 21, 310, 18, -49, 146, -202, -169, -203, -137, -126, -252, -17, 33, -40, -187, 3, -200, -108, 21, 3, 17, 174, -62, -1, 160, 95, 100, 144, -238, -80, 27, 86, 28, -6, 169, 13, 28, 22, -190, 199, -8, 62, 275, -86, -49, -168, 279, -192, 16, -145, -289, 13, -11, 178, 127, -2, -57, 175, 292, 63, 237, -26, -101, -136, 16, 311, -22, 87, -97, -146, -195, 41, 29, -176, -87, -174, -72, -21, -220, -44, -7, -123, 194, -45, 29, 179, 99, 203, 104, 89, 267, 191, -140, -47, -1, 1, -37, -119, 48, -110, -283, -50, -17, 266, -241, 74, 21, 91, -329, -29, -163, -264, -231, -39, 295, 24, 57, -26, 3, 25, 49, 153, 171, 71, -60, -170, 195, 266, -225, -17, 275, 104, -112]
3917a12M2P4k28K66O8k70N2m6K9R8j94K73N7l06N5J33P5o2N7J04j68l9O7J02p9
3942D8l5O1j54K70l27J92r2Q8p6K2m8J46K8j61n0p2J18q6k11M40P1k95L20n3j08
3967C6R8j05%k31J41K63j45k6k6j18J73j13j73K09Q2J34l94J10q5J28KJ03o1j17
3991a15kJ95j06Q4j1j07K47j50M8l2m5L2r5K39q2k14J92Q9k71K49o6j57j79K03
4015e4k9K7k1r1KO5J42j34K97q2j9j30K08r1k00o6R7K42m5j07J29j67O9J24m12
4040b46N13j99j61O2J64r8r3L4o5N4K0j21J78k34K25k45J33J64l7Q3n3j1j02K13
4064A78J37k46l2N0r0K13j40q5K48j45K1k21N3L21n25L07OJ2l27L08k32K43k43
4087a89L20l48N21l83J27k4j92K10L5L5n32J73L99k66Q6O5K26l67K19R7r0k02
$$ y = [-112, -70, 4, -224, 42, 110, -160, -108, -154, -125, -27, -221, 52, 109, -197, -142, -9, 66, 4, 61, 165, -3, -42, 25, 127, 48, 13, 74, -80, 190, -137, 55, -37, 51, -25, -3, -51, 95, 123, -38, -88, -160, -42, -128, -339, 101, 172, -123, 197, 144, 36, 134, 29, 29, -202, -61, 202, 57, 31, 5, -113, 60, -53, -226, -17, 65, 199, -195, -85, -170, -42, -40, 63, 2, -115, -117, 78, -28, 56, 45, -62, 185, 35, 83, 51, 6, 38, -57, 182, 100, -114, 78, 167, -104, 145, 79, -78, -257, -54, -83, -56, -77, -168, -166, -101, 41, -93, 204, 122, 103, -27, 181, 90, -110, -176, -79, 163, 118, 11, 140, -27, 42, 166, -246, 267, 68, -93, -31, 133, 35, -58, -24, -89, -35, -15, -136, 42, -192, 33, -212, -79, 85, 48, 131, 78, 67, -35, 178, 315, 69, 37, 87, -3, 210, 70, -15, 233, 88, 109, -112, -59, 262, -263, 44, 50, 62, -265, 43, -189, 54, -189, 131, -217, 304, -79, 48, 24, -168, 42, 77, 112, -420, -247, 152, -114, -28, 37, 263, -104, 115, 212, 122, -80]
4109h0r1J36q5N0q8K82k16K78l29m1Q8rL6k9K33m0o9O1j35k69N33k29j05J93J52
4134B27j59j00J2P8L1J6k00K72j15j48J44M4P5m97J84K24K43k23j21q9L11j09
4156A00j56L55m35J82l2K13j83n1j95K83m7l19K60n4n1j9k8J87L3r9K02j02j0
4179C4n6rl37L87j33o3PK23k73M16q5r6m5r4N0O4L84k44j52j37L70j39J22j04
4203I0j37j93J25L01j15o9m6j54J41O5k31rL48k55O4l10Q93l40k64N8J46M7q0
4226G5q5J76j58O5K0k41L9K27p1j50J97o8j43J04p9j50K61m4K74l89J66l4J04
4249I6j05r0p4J55m4R6Q9qL0l38K07O0j57K0o9K35k1L3j48k7K4P9k1J18q4J38
4275A94k74P0Rj66K35k43K08R6j8j63M7%J83j23q3J8J93mJj62J97j61q4K7j54
$$ y = [-80, -171, -35, -120, -70, -158, 124, -92, 186, -143, -184, -96, -105, -69, -98, 135, 95, 26, 87, -48, -317, 216, -13, -118, 75, 227, 68, -32, -20, 58, 89, 105, -95, 177, 62, -86, 58, 102, 177, -320, -136, 88, 331, 108, -13, -102, 209, 100, -56, 299, -136, 46, 14, 227, 44, -7, -202, 81, 34, -285, -25, -79, -130, -149, -177, 10, 43, -56, 146, 44, 34, -22, -31, -368, 19, -114, -177, -170, 53, -220, 196, 111, 15, -30, -124, -74, -10, 374, 130, -22, -159, 211, 72, 194, 90, -47, -240, -115, 186, 71, 2, -44, -198, -57, 8, -223, -232, 116, -139, -75, -385, 508, 168, -96, -38, 108, 155, 75, -10, 166, 8, 73, 93, -148, -109, 118, 47, -103, 94, 26, -117, -13, -92, -242, 19, -25, 249, -140, 26, -8, 96, -9, -99, -173, -18, -62, 34, 123, 115, 145, -193, 14, 74, -83, -63, -132, 103, 82, 115, -33, -60, -36, 43, 22, 140, 56, 194, -80, -10, -1, -167, 68, -175, 33, 129, 111, -52, -5, -5, 178, 55, -28, -10, 183, 179, 180, 18, 215, 54, -30, -3, -157]
4300a57M3M1P1K00o2j85J95l32K74j49k75K81M3o4n4j28K03j14J09J91j96K28
4322A63Nn6pk68L05k23M5LL3Q7k89J9J63J63k35j50J25J36j62L6J92N0l11j62
4346c38L39O6m6K69j99j02n2p6M22k40j57J35K06r3n2J16l02K41k25j5j16J39
4368h0RJ37j18j91oM27k23j27R1M3L8Jj88J02j20M94l96o0L49n5j99Q6J84K4j52
4393G0o8J46j34K36l03j5K49j74J8Rl37L37O1m1k6K3k10J54j91K57k19K00j39
4416i7J48k8q7p9J97r0j7j76M63j12j6n1k06mL9N12l52k50o8K35M1O0l95J87M07
4441B61p22N55r5Q0j54m8J61j42K08L7j64j49J78l8n3K72j89q2J19j22K53l73
4463b07J83Q2k42K74j38J65k90O8J14J35j65m7K38k38J7K89j1j30j90P2L5pJ13
$$ y = [-157, -114, -73, -2, 198, 136, -49, 146, -186, 88, -61, -336, -55, -12, -76, -130, -258, -55, -169, -60, 131, -65, 163, 168, 112, 105, -163, 142, -81, -36, -33, 0, 87, -202, -183, -20, 143, -92, -242, -117, 19, -143, -107, 85, 135, -176, -338, 1, 67, 21, 290, 91, -11, -63, -139, 283, 43, -114, 21, 227, 134, 82, 198, -104, 137, -88, -103, -219, -80, -71, 66, -52, -243, -249, 178, -45, -172, -81, -38, 0, 1, -187, -85, -205, 289, -107, -167, 182, 127, -72, 14, 198, 222, 70, 2, 148, 14, 250, -53, -68, 181, 7, 25, 34, -303, 34, 95, 54, 28, 51, -159, -5, -196, 61, -158, 42, -97, 51, 23, -64, -143, 54, -36, -53, -229, 234, 122, 106, 55, -151, -155, -116, 396, 44, -206, -274, -39, 2, 62, -333, -146, 261, -461, 94, -1, 79, -75, -123, 38, -104, 104, 141, -23, -172, 6, -32, -85, 187, -2, -84, 35, -87, 166, -207, -24, 58, -184, 90, -48, 117, -173, -105, 9, 144, -21, -68, 170, -68, -51, 238, 227, 97, -93, -21, 14, 7, 120]
4486A20r3j10k0P0K05k05J0R7J0J89l54M4P0l5m7K8k35K58k46j7K09R5k39L29
4510A33q0N2k65P9O4M5O7k51K62l37R6K96k12o8K63K2k23j73O6n1K41K4L9j58
4534f9J44j13Q1r2l44M30J79N3l74L8J04j46K65j21L6R5l26M38k70N5l45N67k94
4557ik77M78k99N1n7J37q3j5pJ14J07j85j4J09M3O1m8j55K08j50L5j07K74k46
4581c5Q9JJ72l4k06Q1O1k36L88l79jK28j50j08J21j22P3K1r5l5K61j87J96j62
4605e8K6J01j38R8J04J42m06N43m18j06J0K6K42r1l16K45q0J46j43r2J72J24k83
4628a52j11J90J74j98J89k3l46K75k7K70j96m8K55r8m9n4J6Q4j98K19J6k82J10
4651A6K41l19L64m27J49nj97J5k05N17o4j25L4j10%J15J6L60m06p2J35J37j61
$$ y = [120, 27, -83, -103, -33, 172, -33, -23, 74, 84, 273, -81, -37, 33, -2, -49, -21, -256, 2, -244, -261, -52, 43, -196, 133, 53, 105, -160, -81, -17, 28, 95, -156, 106, -231, -135, 161, -51, -119, 144, 166, -57, -230, -164, -215, 26, 50, 89, -69, 75, -38, 43, -49, -393, 37, 216, 269, -105, -67, 37, -109, 156, 35, 71, 166, -160, 278, 8, 63, -282, 285, -9, -286, 192, -107, -56, -113, 24, -59, -74, -81, 33, 140, -45, -59, 50, 93, 154, 106, -49, 159, 9, 44, -63, 211, -35, 54, 55, 227, 193, -13, 68, 129, -107, 281, -98, -99, 129, -21, -129, -8, -130, -57, -36, -131, -166, 95, -92, 104, -58, -32, 69, -69, 29, 133, 275, -131, 412, -6, -112, -102, -76, 166, 75, -241, 4, -76, 70, -73, -165, 7, 131, -152, -263, -73, 101, -97, 92, 69, -277, -2, -29, 241, 45, -3, 252, 154, 105, 51, 67, 151, -47, 172, 188, -94, 16, 257, -62, 302, -125, 24, 19, -178, -163, -368, 149, 85, -40, -6, -116, -116, -1, 15, 375, -31, -103, 32, 169, 8]
4674Hn4j5K66j28k56M24k64O9j6o7K01k15p9O3K05k90j08O1K44J6j43J80J32j39
4698I5j50Q4O3j38K12o1k3k81M37O0j62k23J01K8J84k92L02j74j67J7K28k89J79
4721C0j13J60l11R0J68j29p5j88L85J34j46j98L45m6r7k3J78j01j42J96K5l7M9
4744A54o9M7j61M24j94k28j8m5J12l19K48N0j60K18lK52j89j96J77q0O1j67J05
4767A9K25m3l38L14k97K05m0j47K97k61J59j12N6J97l04N9J52j83O3J4j21L0l5
4790i1p6L7j07J81j18O5M6LRL3K7q7K75K52m17j10K28P6l21J33J10k09L0j32L66
4815B03j77P0l9k4R2k39J85n1Q2N8k40P2k5k4K39l40J37KP6j07J80j90M15l05
4839E0J36j51k63L29l46J01J14r6J39K84j97n9j36OJ27M6k49Q7K27l97J19K01
$$ y = [8, -46, -61, 205, 77, -179, 245, -19, 50, 34, -33, 168, -47, -126, -63, 142, -148, -256, -195, 49, 65, -78, 102, 234, 95, -55, 29, 92, -46, 166, 105, 82, -199, 238, 298, 136, -87, 14, 42, 226, -66, 236, 62, -105, -88, 140, -149, 30, -83, 77, -234, -144, 24, -105, -180, -368, 17, 151, 5, -193, 152, 106, 9, -14, 164, 63, -79, 117, 142, 105, 154, 85, 132, -29, 395, 201, -27, -45, -90, 22, -297, -49, 1, -159, 59, 56, 308, 119, -77, 100, 20, 81, -86, 19, 244, 201, -137, 177, -120, 85, 45, -102, 195, -66, 93, -19, 37, 234, -70, -11, 141, -42, 21, 35, -86, -56, -91, -167, -130, -237, -56, -174, -109, -63, -60, -51, -18, 9, -78, 197, 449, 32, -78, 150, 226, -95, 38, 148, -61, -31, -163, 203, 26, 96, 57, 33, 125, -114, 71, 20, 102, 160, -80, -8, -33, -57, 182, -158, -21, -19, 57, -50, 130, -60, 355, 50, 186, 35, -228, 101, -245, -144, -30, -126, 13, 297, 100, 41, -95, -89, 38, 84, -165, -78, 149, -248, -129, 72]
4861G2r2ml9K29j67n4J88k4j65j09L91k34J60o1j4r5J01J2r9N8L7l3J3O8j11j92
4887a64L22k53KK5P0J21j44l5j97K39nj0j54J48J48m1r7p9L7K49k63P8J37p2J4
4912G6j75q4J68m3P9J1j65k3J97L8J38j29O0l7k4j09j04N4m5Q9j50K6k1J08K10
4937A45K47k52r3Oo5j71L1J60J46l45K9L27k07k32K30J03k24L59k10O2J50k73
4959g7J36o9O9q7K42k77K8K60m1l85L49Qk22J91j62K63M9j54k45N8j21K21L0P1
4983A35l39L02O4J49k50j74J60r1q7J01q2K45k39J12N1l7L6k6J15p8k72M17l12
5006a00K72m9m2j32l4O7o9n2J97j38K22k56J15J53k46P3P0r4k8j71L55O8l20L20
5030A81k71K22Oj08lj5J68j17k57J62j00J15l3R9j82R9k3p9k80L25J08O6O0n1
$$ y = [72, -20, -24, -63, 166, -1, -55, 133, 109, -56, -165, 226, -8, 152, 91, 77, -18, 83, 95, -4, 54, 91, 58, 71, 139, 28, -164, 158, -95, -93, -68, 2, 123, -21, -56, -253, -14, -19, -29, -183, -35, 113, 72, -25, -104, -67, 182, -81, -3, 134, 62, 76, -99, -183, -15, -58, 21, 32, -133, -156, 41, 79, 217, 88, 148, 111, 87, -22, -126, -72, -117, -28, -178, -152, -173, -65, 145, 392, 140, 47, 53, -12, -183, -152, 8, 154, -191, -162, 165, -42, -274, -44, 59, -165, 194, -16, 46, 196, -77, 59, -10, 59, -28, 214, -63, -35, 225, 184, -201, 148, 156, -66, 125, -37, 226, 275, 121, -124, -66, -187, 34, 64, 135, -204, 98, 162, 311, 61, -113, 47, -44, -131, -30, -112, 133, -106, 6, 57, 20, 56, 30, 145, 67, -205, 212, -100, 172, 123, 81, -51, -85, -18, -87, -139, 58, -80, 142, -114, 1, 154, -92, -19, 51, -43, -71, -242, 113, 181, -139, 181, -90, 132, 138, 30, 27, 12, 180, 63, -194, -32, -132, -17, -50, 49, -133, -34, -57, -136, -416, -91, 17, 83, 143, 92]
5054I2r6R9Lj65J18Lj11J55J15j25r5J63k49K96j81j52L43k99r6J36K07J9j71
5077IO1j64q1K05j40J01k04K19N8P0k04N5rJ23O2J4j35j74K01j31k1J50m1r1K1
5102d6K0N9p8K44k20N4o3j27K31l35K43j8O1j02J98j83q2n1K45J33j27p3l3P6
5126B6O1l4J3J6J00m22L32n8l52M05l1O9j46j14J23q7j74K93k64J30K05o8l4j89
5150b00J65J88l36P7k06M93j27j65J72J2rj88J09P4j63K04j50j7O0R4P5l5j64
5173c7j36L98n2k52J2M9k5o0M5J06j12K11j55J77j84J1j52J74J21j28p3koL1J43
5198A04k55R2N2J04j79oK03k77O9q7K58j14j27K06k2m2j26J03N2l15L86l49M75
5221B05l94L68k08K25j59r5PK5J88p0qP2k8j91J77k90M7J29n0Q0J19j60j42k0
$$ y = [92, -4, 95, 98, -67, 51, 54, -57, 98, 213, 88, -7, 156, -93, 203, 22, -130, 213, -86, -182, -46, 161, 180, 9, 70, -94, -175, 30, -110, -9, -213, 6, 64, 134, -70, -15, -24, 99, 161, 175, 40, -134, 67, -64, -85, 65, 24, -67, -46, -26, 33, -45, 199, -21, 33, -30, -157, 74, -261, -18, -36, 25, -77, 121, -62, -144, -195, 50, 183, 56, -17, -50, 26, 87, 53, 66, 82, 182, -240, 92, 34, -318, 87, 56, 125, -21, -135, -12, -99, -273, 20, -244, -114, 91, 23, -11, -200, -35, 153, -183, -106, -312, 181, 54, -111, 61, 73, 64, -124, -15, 59, -104, 100, -50, -67, -7, 87, 162, 127, -37, -173, 225, 173, -79, -67, -18, -43, -103, -58, 48, -64, 147, -8, 169, -15, -4, -156, 18, 139, 11, -62, -64, -70, -39, 104, -151, -59, -7, 97, -82, -88, 115, -162, -93, -180, 78, -36, -163, 43, 21, -21, -147, -44, 8, -307, 79, -270, 205, -189, 179, -29, 196, 37, -58, -51, -26, 162, 92, 84, 156, 128, -63, 114, -176, -129, 0, -50, 30, 149, -11, -153, -173]
5245a73Q1J11j68J10K2J17P3kj76K49k96J24J07l66L54j32j37L4k2J09J02l9n7
5268B5j16k52N00J9l73K19o5J55j05J81l77L28k5k68J65J58k61j5J34J04j49M8
5290C0l2j57l8K82r8j3J02j10J05R4n8j65J02N7l14J94J8K5r7R2K02o8l95L70
5314A28k65J72m3L5J01k3p4R9j42l8L44k69p5M6K6N2Q6k90k14K74j47J75j59J01
5338a00O1K65l33K20O5k80K23j79J42k74J66J42j01o4o9K66k88J20m5J16j30j13
5360a90J44J17J27m85L83k07J94l06J02J55J70k28j07J35O3m9L5j55J96j30J35
5381I9l9j59K62j22l2K14j09O0k73N70l72r2J27j64O9j08L25j86nj86J56K5J23
5404A83N7n7L0m51M25k75Q5J81k11J55j78N0L25l14k2K9K12j91p0j83L30j5j55
$$ y = [-173, -92, 19, -149, -39, -17, 100, 173, 171, -5, 244, -52, 72, 179, -187, 167, 35, -102, -68, -90, 19, 121, 82, 25, -91, -343, 157, 176, -197, 22, -43, 112, 7, 188, -189, 139, 114, -154, 11, 169, -92, -107, 27, 131, -18, 30, -2, -159, -197, 85, -13, -26, 76, -34, 71, 165, 107, -58, 44, 101, -213, -19, -1, 24, -73, 19, 221, 153, -242, 128, -137, 35, -8, 27, 128, 105, 31, 130, -12, -50, 294, 25, -50, -4, 22, 74, 160, -130, -344, -70, -217, -42, -201, -100, -39, 226, -107, 113, 178, -102, 121, -58, 84, -190, -24, 118, 17, -47, -116, 150, -138, -18, -63, 53, -77, -190, -46, 71, 198, -287, 96, -111, 83, -223, -121, 34, 204, -24, -131, 4, 67, 18, 53, -102, 94, -36, 99, 60, -99, 163, 41, 9, 223, 114, 174, -99, 471, 99, 7, 134, -30, 39, -69, 256, 70, 65, -121, 35, 60, 183, 240, 183, 213, -238, 187, -88, -3, 178, -33, 122, -56, -6, 319, 5, -17, 12, 224, 33, -37, -220, 110, 95, -60]
5427f0q5L48j86k07O6R3j72J74k46L06J49o2k47L82k67j85M20np1j53j5P8j04
5450d9O9o9J59M4m3l17K91K02m32R6K39j66o0J11k63OK40m51M51p4O8k16K36m7
$$ y = [-60, -145, 203, 17, -190, -124, -31, -203, -29, -275, 31, 180, 118, -129, 253, -14, -199, 221, 216, 145, -8, -23, 55, -49, 20, -49, 110, 154, 111, -206, 85, 287, -145, -49, 190, 24, -36, 75, -188, -182, 58, -393, 58, -16, 52, -164, 72, 25]
$$ [...]
8191d
##END NTUPLES=NMR FID
##END=
