##TITLE=1H_Pr 5260
 200.13MHz, CDCl3,
 8 sc
 
 15.1.2025
##JCAMPDX= 6.0         $$ Bruker NMR JCAMP-DX V2.0
##DATA TYPE= NMR FID
##DATA CLASS= NTUPLES
##ORIGIN= UXNMR, Bruker Analytische Messtechnik GmbH
##OWNER= pz
$$ XWIN-NMR		Version 3.5
$$ Wed Jan 15 14:51:14 2025 Russian Standard Time (UT+4h)  she@DPX200
##.OBSERVE FREQUENCY= 200.1313
##.OBSERVE NUCLEUS= ^1H
##.DELAY= (6, 6)
##.ACQUISITION MODE= SIMULTANEOUS
##.ACQUISITION SCHEME= undefined
##.AVERAGES= 8
##.DIGITISER RES= 18
##SPECTROMETER/DATA SYSTEM= spect
##.PULSE SEQUENCE= zg30
##.SOLVENT NAME= DMSO
##.SHIFT REFERENCE= (INTERNAL, DMSO, 0, 14.3821)
##AUDIT TRAIL= $$ (NUMBER, WHEN, WHO, WHERE, WHAT)
$$ ##TITLE= Audit trail, XWIN-NMR		Version 3.5
$$ ##JCAMPDX= 5.01
$$ ##ORIGIN= Bruker BioSpin GmbH
$$ ##OWNER= she
$$ F:/spectra/data/she/nmr/H-C/1/audita.txt
$$ ##AUDIT TRAIL=  $$ (NUMBER, WHEN, WHO, WHERE, WHAT)
(   1,<2025-01-15 14:50:08.96 +0400>,<she>,<DPX200>,
      <created by zg, POWCHK disabled, PULCHK disabled
       configuration hash MD5:
       00 E9 B6 7A A2 85 ED C7 34 08 36 98 17 FE 4E 26
       data hash MD5: 16K
       B2 73 C1 70 DC E8 D1 DB 15 1C CB 69 18 E4 B3 07>)
$$ ##END=
$$ 
$$ hash MD5
$$ BE 80 49 62 CC 5A CF BD A6 98 84 C7 AD 49 CB 5B
##$RELAX= 
##$RELAX= 
##$RELAX= 
##$RELAX= 
##$RELAX= 
##$RELAX= 
$$ Bruker specific parameters
$$ --------------------------
##$DU= <F:/spectra>
##$EXPNO= 1
##$NAME= <H-C>
##$PROCNO= 1
##$TYPE= <nmr>
##$USER= <she>
##$AMP= (0..31)
100 100 100 100 100 100 100 100 100 100 100 100 100 100 100 100 100 100 
100 100 100 100 100 100 100 100 100 100 100 100 100 100 
##$AQSEQ= 0
##$AQ_mod= 1
##$AUNM= <au_zg>
##$AUTOPOS= <>
##$BF1= 200.13
##$BF2= 200.13
##$BF3= 200.13
##$BF4= 200.13
##$BF5= 200.13
##$BF6= 200.13
##$BF7= 200.13
##$BF8= 200.13
##$BYTORDA= 1
##$CFDGTYP= 0
##$CFRGTYP= 5
##$CHEMSTR= <none>
##$CNST= (0..31)
1 1 145 1 1 1 1 1 1 1 1 1 1 1 1 1 1 1 1 1 1 1 1 1 1 1 1 1 1 1 1 1 
##$CPDPRG= <>
##$CPDPRG1= <>
##$CPDPRG2= <>
##$CPDPRG3= <>
##$CPDPRG4= <mlev>
##$CPDPRG5= <mlev>
##$CPDPRG6= <mlev>
##$CPDPRG7= <mlev>
##$CPDPRG8= <mlev>
##$CPDPRGB= <>
##$CPDPRGT= <>
##$D= (0..31)
0 0.7 0 0 0 0 0 0 0 0 0 0.03 0 0 0 0 0 0 0 0 0 0 0 0 0 0 0 0 0 0 0 0 
##$DATE= 1736938208
##$DBL= (0..7)
120 120 120 120 120 120 120 120 
##$DBP= (0..7)
150 150 150 150 150 150 150 150 
##$DBP07= 0
##$DBPNAM0= <>
##$DBPNAM1= <>
##$DBPNAM2= <>
##$DBPNAM3= <>
##$DBPNAM4= <>
##$DBPNAM5= <>
##$DBPNAM6= <>
##$DBPNAM7= <>
##$DBPOAL= (0..7)
0.5 0.5 0.5 0.5 0.5 0.5 0.5 0.5 
##$DBPOFFS= (0..7)
0 0 0 0 0 0 0 0 
##$DE= 6
##$DECBNUC= <off>
##$DECIM= 32
##$DECNUC= <off>
##$DECSTAT= 4
##$DIGMOD= 1
##$DIGTYP= 9
##$DL= (0..7)
0 120 120 120 120 120 120 120 
##$DP= (0..7)
150 150 150 150 150 150 150 150 
##$DP07= 0
##$DPNAME0= <>
##$DPNAME1= <>
##$DPNAME2= <>
##$DPNAME3= <>
##$DPNAME4= <>
##$DPNAME5= <>
##$DPNAME6= <>
##$DPNAME7= <>
##$DPOAL= (0..7)
0.5 0.5 0.5 0.5 0.5 0.5 0.5 0.5 
##$DPOFFS= (0..7)
0 0 0 0 0 0 0 0 
##$DQDMODE= 0
##$DR= 18
##$DS= 0
##$DSLIST= <SSSSSSSSSSSSSSS>
$$ [...]
##$SUBNAM0= <"">
##$SUBNAM1= <"">
##$SUBNAM2= <"">
##$SUBNAM3= <"">
##$SUBNAM4= <"">
##$SUBNAM5= <"">
##$SUBNAM6= <"">
##$SUBNAM7= <"">
##$SUBNAM8= <"">
##$SUBNAM9= <"">
##$SW= 18.0517328524113
##$SWIBOX= (0..15)
0 0 2 0 0 0 0 0 0 0 0 0 0 0 0 0 
##$SW_h= 3612.71676300578
##$TD= 16384
##$TD0= 1
##$TE= 0
##$TE2= 300
##$TE3= 300
##$TEG= 300
##$TL= (0..7)
0 120 120 120 120 120 120 120 
##$TP= (0..7)
150 150 150 150 150 150 150 150 
##$TP07= 0
##$TPNAME0= <>
##$TPNAME1= <>
##$TPNAME2= <>
##$TPNAME3= <>
##$TPNAME4= <>
##$TPNAME5= <>
##$TPNAME6= <>
##$TPNAME7= <>
##$TPOAL= (0..7)
0.5 0.5 0.5 0.5 0.5 0.5 0.5 0.5 
##$TPOFFS= (0..7)
0 0 0 0 0 0 0 0 
##$TUNHIN= 0
##$TUNHOUT= 0
##$TUNXOUT= 0
##$USERA1= <user>
##$USERA2= <user>
##$USERA3= <user>
##$USERA4= <user>
##$USERA5= <user>
##$V9= 5
##$VALIST= <valist>
##$VCLIST= <CCCCCCCCCCCCCCC>
##$VD= 0
##$VDLIST= <DDDDDDDDDDDDDDD>
##$VPLIST= <PPPPPPPPPPPPPPP>
##$VTLIST= <TTTTTTTTTTTTTTT>
##$WBST= 1024
##$WBSW= 4
##$XGAIN= (0..3)
0 0 0 0 
##$XL= 0
##$YL= 0
##$YMAX_a= 233580
##$YMIN_a= -287150
##$ZGOPTNS= <>
##$ZL1= 120
##$ZL2= 120
##$ZL3= 120
##$ZL4= 120
##$ABSF1= 10
##$ABSF2= 0
##$ABSG= 5
##$ABSL= 3
##$ALPHA= 0
##$AQORDER= 0
##$ASSFAC= 0
##$ASSFACI= 0
##$ASSFACX= 0
##$ASSWID= 0
##$AUNMP= <proc_1d>
##$AZFE= 0.1
##$AZFW= 0.1
##$BCFW= 1
##$BC_mod= 2
##$BYTORDP= 1
##$COROFFS= 0
##$CY= -3
##$DATMOD= 1
##$DC= 2
##$DFILT= <>
##$DTYPP= 0
##$F1P= 0
##$F2P= 0
##$FCOR= 0.5
##$FTSIZE= 0
##$FT_mod= 4
##$GAMMA= 1
##$GB= 0.15
##$INTBC= 1
##$INTSCL= 1
##$ISEN= 128
##$LB= 0.25
##$LEV0= 0
##$LPBIN= 0
##$MAXI= 10000
##$MC2= 0
##$MEAN= 0
##$ME_mod= 0
##$MI= 1.114404
##$NCOEF= 0
##$NC_proc= 0
##$NLEV= 6
##$NOISF1= 3.799351
##$NOISF2= 2.8
##$NSP= 1
##$NTH_PI= 0
##$NZP= 0
##$OFFSET= 14.38212
##$PC= 1
##$PHC0= 253.9789
##$PHC1= 13.7922
##$PH_mod= 1
##$PKNL= yes
##$PPARMOD= 0
##$PSCAL= 0
##$PSIGN= 0
##$REVERSE= no
##$SF= 200.129724274929
##$SI= 16384
##$SIGF1= 3
##$SIGF2= 2
##$SINO= 400
##$SIOLD= 16384
##$SREGLST= <1H.CDCl3>
##$SSB= 0
##$STSI= 0
##$STSR= 0
##$SW_p= 3205.1282051282
##$SYMM= 0
##$S_DEV= 0
##$TDeff= 0
##$TDoff= 0
##$TI= <>
##$TILT= no
##$TM1= 0
##$TM2= 0
##$TOPLEV= 0
##$USERP1= <user>
##$USERP2= <user>
##$USERP3= <user>
##$USERP4= <user>
##$USERP5= <user>
##$WDW= 1
##$XDIM= 8192
##$YMAX_p= 0
##$YMIN_p= 0
$$ End of Bruker specific parameters
$$ ---------------------------------
##NTUPLES= NMR FID
##VAR_NAME=  TIME,          FID/REAL,        FID/IMAG
##SYMBOL=    X,             R,               I
##VAR_TYPE=  INDEPENDENT,   DEPENDENT,       DEPENDENT
##VAR_FORM=  AFFN,          ASDF,            ASDF
##VAR_DIM=   8192,          8192,            8192
##UNITS=     SECONDS,       ARBITRARY UNITS, ARBITRARY UNITS
##FACTOR=    0.0002768,     1,               1
##FIRST=     0,             0,               0
##LAST=      2.2672688,     0,               0
##MIN=       0,             -287150,         0
##MAX=       2.2672688,     233580,          0
$$ Real data points
##PAGE= N=1
##DATA TABLE= (X++(R..R)), XYDATA
0@%%%%%%%%%%%%%%%%%%Nj3J6j6J6j6J9k4K9l2L7m5M9n4O2p0Q2r2J01j16J31j45
40g6J60j76J95k17K40k64K92l23L55l91M30m73N23n78O38p07P86q77R81j104J257
61F71j443J674j979K402l022M018n875J0491m3616p6568O4752R0471J25261O6343
75B33580n8887o5017j7453M569K1769o6921j01833l3011k8895k6566J351l630
87a40944L4508J6818l5479K9990Q6259Q6660Q3199N262n1482n0096n4891K3825
99C3629P9856n662p1489p8388k9088N4808J6422n6840l9444k9656N941N1999L3824
112c4088L4398J4077l3376J2188M6279L2023M4784J4434j5993k7541q1073n7627
124e1515J6739J5573J420l3531n2032K4316N7463K7798J0476l6616l1602K7876
$$ y = [0, 0, 0, 0, 0, 0, 0, 0, 0, 0, 0, 0, 0, 0, 0, 0, 0, 0, 0, 5, -8, 8, -8, 8, -8, 11, -13, 16, -16, 21, -24, 25, -29, 33, -37, 45, -47, 54, -62, 69, -76, 84, -92, 103, -114, 126, -138, 154, -169, 186, -205, 225, -248, 275, -303, 335, -372, 414, -463, 518, -586, 671, -772, 902, -1077, 1325, -1697, 2321, -3554, 6937, -36679, -113247, -48495, 41976, 167237, 233580, 174693, 109676, 92223, 96792, 118561, 51640, -50193, -83204, -112099, -138665, -137314, -140944, -106436, -89618, -125097, -95107, -8848, 77812, 161011, 166273, 114791, 64695, 9804, 33629, 113485, 107823, 36334, -42054, -71142, -16334, 88, -56752, -96196, -125852, -119911, -67912, -34088, 310, 14387, -18989, -6801, 39478, 71501, 116285, 130719, 114726, 87185, 6112, -51515, -34776, -19203, -17783, -51314, -103346, -79030, -21567, 6231, 16707, -19909, -51511, -23635]
136b3635L4337M2432K0117m6733l5212q9J3185L8228M533k2813M280j8722l3212
149b3304j3553j2506J8297J6757k7451O50K9251K7215L6680n281l4451j5188j7997
162b0881J6564M3167j0629l9089l4448j1901M5711L2780q286O939p50j709J0965
175B8433j5758r046Qk6007l163J0313j909J8461P348q194J324k5201j4443K8842
189h992J6395P385r325l0325J2846L1639J2320J6641r583j7631R818q501j1938
202A0749r471l8162k0702J944k272K1756J2704j341K5501J0732l5J5122J427J2521
216D0473J4204k3745j3189r96q468R330n972k1154r61j3858q227J1057j4986j4208
230e0700q28k781K8796K6384M312K3390J6605P221J6234j0018j0130m52k6853
$$ y = [-23635, 10702, 53134, 73251, 26518, -8694, -8783, 4402, 42630, 47163, 24350, 28630, 9908, -23304, -36857, -49363, -31066, -14309, -41760, -41110, -11859, 15356, 52036, 46755, 12304, -2884, -20881, -4317, 38850, 28221, -10868, -45316, -57217, -11506, 21274, 12988, 19927, 19177, 17468, 28433, 12675, 3629, 3637, -22370, -25533, -15220, -17129, 1332, 8680, 486, 1810, -23391, -37834, -8992, 7403, 14788, 5463, -24862, -12016, 19623, 31943, 48584, 39001, 21370, 31188, 22687, 10749, 1278, -36884, -57586, -55642, -57914, -36158, -23454, -24795, 706, 11438, 11403, 26525, 27952, 40473, 54677, 30932, 17743, 16747, 8279, 17609, 11637, -9517, -10478, -24336, -32563, -21506, -36492, -50700, -51528, -54309, -25513, 871, 5183, 28573, 45178, 52399, 68633, 58615, 48485, 48033, 21180]
243B1180j9218j2567k7142n340k848q913J3373R44M29K3828P473Q552J2266o769
257E248J2287J7543j312J1702Q06r731P547j1587j6817p439k6913j7064o038j9244
271f1012O40N455j269K4304J9303J2163K6169Q247Q404J4990j0898o241k685j8860
285A8710m056q886j8572J731p560j0180O577q818m203O697p210R305J3265j075
299a4275J8272J4166N856J9902J426k833O161j6132j3415p910k4717r656p489
312c0644j4751P632K877M02J9756O054O439J5518m399N351P997q800N645P63j0344
327I496O460l480o858P077j0199p611K23j6359k972J567q972R447O090J749K0233
342E891P590N165J3396q055n194Q06j3941j090l000j5602R89l724m824J3629J840
$$ y = [21180, 1962, -10605, -37747, -43087, -45935, -54848, -41475, -40531, -40102, -16274, -8801, -249, 12017, 5248, 17535, 35078, 33766, 45468, 46274, 36543, 44090, 32503, 15686, 8247, -18666, -35730, -41768, -61012, -60372, -54917, -56186, -31882, -12579, -416, 25753, 34000, 42404, 57394, 46496, 40255, 37570, 18710, 14654, 5768, -12804, -11073, -18633, -28813, -22236, -31054, -35257, -28560, -35770, -26465, -13200, -14275, 3997, 18163, 24019, 43921, 45347, 42514, 48675, 32543, 19128, 11218, -13499, -23155, -30644, -45395, -37763, -34886, -34484, -14728, -8674, -2235, 13283, 8884, 14235, 22232, 13432, 19077, 19840, 9496, 15956, 12476, 5618, 12695, 2496, -5115, -4892, -21251, -24223, -22656, -31628, -22181, -16091, -14342, 5891, 13481, 18646, 32042, 23987, 18793, 19599, 5658, 4568, 1568, -14034, -13045, -16769, -21593, -7964, -6124]
357f124L729J1832o713J254M431j0435L296l53r038Q339J406O99J3618o233p583
372B125o29j3162K548O640p495L786k321o268J4584N643M184J2434n854j2L905
387B0108j3640m665p269j7530P42j994r88J7725N605L602Q286j0121R37J0821
401A1619m5R594j362j5903P04k437j925Q557r481o814M020o427L624k75j6634
416b3185k524o14K67K0387J2379R867J5959m609m247Q82j0021M226J158j6437
430C488q434j3910j1269J0043j048m028M716k799J4405K0088j064O64p170j0302
444f620J2673R836N799J1443o373p308k700j7211o678j282j0019Q39p071j2726
458c7398Q830O352P721J2648l866N980K1295J1447J3086n603k6633j1050n425
$$ y = [-6124, -2395, 9437, 2724, 3978, 8409, -2026, 1270, 917, -8121, 218, 1624, 2323, 15941, 9708, 2125, 1496, -11666, -9118, -2478, -9973, -6187, -8508, -14776, -192, 5451, 9635, 22069, 16215, 16203, 20108, 6468, 1803, -5466, -22996, -22254, -24248, -25236, -7511, -1906, 1696, 9982, -139, 798, 11619, 11574, 21168, 19806, 3903, 4607, 2170, 245, 8802, -679, -7493, -3473, -9900, -6276, -6551, -23185, -25709, -26323, -26056, -5669, 6710, 16577, 32536, 27927, 23680, 24562, 14541, 18767, 19925, 3488, -4946, -18856, -30125, -20082, -21130, -25158, -20442, -23241, -8836, 11252, 10188, 10852, 3682, -6620, 6053, 15889, 21688, 33131, 26758, 19450, 16750, -461, -7139, -8421, -18440, -17601, -24672, -37398, -28568, -22216, -14495, -1847, -5713, 267, 21562, 33009, 46095, 40492, 13859, 2809, -2616]
471b616l52J1742o546j0510j25q876k73K385q461N750O607j950R786L014M205
486C780J5183k444m323L599m79J3690R575j6937j9249k3506j4836J2862P433r74
500a6626K314p170P787J7413M84K466L27n082J0121M342l691N130p513p074o75
515B553j1353J357J2418K144K204j3190k4422n55P781J2347J3820p501l561J2661
529F703P541J0370j009j9340m545M14j14Q980p558j1494l93o895K532R985J930
544b893J2965P746j1792o601p717q81J5513N28q225j626m634J1743J3560q786
558H900r970j1154o482J6807R375l643k620j1623R10J3200Q68N530N702n226R51
573A1525p907j3539K417j448k149K448r187J776J5608P281Q204m475j6185L805
$$ y = [-2616, -2968, 8774, 2228, -8282, -8407, -17283, -17556, -15171, -23632, -17882, -11275, -13225, -3439, -425, 3780, 18963, 16519, 12196, 15795, 15316, 29006, 38581, 21644, 2395, -21111, -35947, -23085, -15652, -16626, -14312, -21482, -13695, 3718, 4202, 6668, 6995, 1913, 12034, 16376, 12685, 17815, 10302, 3228, 2553, -8800, -7443, 4975, 7119, 9323, -3867, -28289, -28844, -21063, -8716, 5104, -2397, -5958, 6703, 14244, 24614, 23605, 4265, -280, 134, 20, 9000, 1442, -10052, -10445, -17340, -14808, -4823, -2893, 10072, 17818, 6026, -575, -8292, -9173, 6340, 6868, -1357, -2983, -7617, 4126, 17686, 8900, -1070, -12224, -18706, -1899, 7476, 3833, 1213, -10410, -9500, 3700, 4568, 10098, 15800, 10574, 11525, 3618, -9921, -7504, -8952, -11101, -8653, -17840, -16064, -456, 6825, 15029, 10554, -5631, -1826]
587a826R767Q022O323j4696j4487K308N26O276K800j0608n93K68n056M110l969
602a0835m056P522o33K165R611K598J2430R418r540o227o486k760J0722n049j5443
617f563r074j0235N103J2790k428k10q9j481J3795P285k500K471m208R98Q923
632A4577k860Q02M378n195j217p280j3413J999m80m250j158j1178k275J2330O857
647h363J0599N271n438O849R041L188M773r588j1174J541m149j636K8j0342j22
662i522J300n946K859q32k128P970j551j643O551N49R723J1047k718L01j017l227
678A1716O747m377j2697n102r061j168M872o414l49K781j043R725N353j449N964
693E498o04o13N945m727n46N214k889K918j452q551K277r29n568O34p537m496
$$ y = [-1826, 7941, 15963, 22286, 7590, -6897, -4589, -4063, 2213, 5013, -5595, -6188, -5920, -10976, -6866, -10835, -14891, -7369, -8002, -5837, 3774, 6372, 18802, 28220, 18680, 12453, 5967, 3207, 13929, 8880, -6563, -15637, -25872, -20769, -7979, -10407, -10617, -10706, -12187, 1608, 8893, 6393, 8864, 4656, 5654, 14577, 11717, 12519, 16897, 11702, 10485, 3205, -10208, -8209, -8689, -12939, -14097, -25275, -27550, -15220, -8363, 2236, 7507, 2069, 8918, 17959, 21147, 25920, 16332, 5158, 6699, 2550, 914, 942, -9400, -9522, -8222, -14168, -11309, -12141, -14269, -6299, -7850, -9493, -2942, -2393, 7330, 18377, 15659, 15960, 14943, 11716, 18463, 14086, 1389, -3713, -12774, -13942, -9070, -15484, -15833, -13052, -14095, -4370, 983, -466, 5498, 4894, 4281, 10226, 5499, 4953, 10167, 7278, 10196, 8744, 193, 2470, 1541, -4027, -3393, -10930, -15426]
709a5426N748j501L408L499l394O622P189O14O250k664n262L890l942l394R94
724B631o765K129L200m796K664j58l944N107k604l662L906l793J370N242l791
739c264K756L042j113O987N41m804K243l903k310K775o336r88L013l048M306J637
755A534m098L710j617k053L618m001k077L077l890K496L583k694N970L112j711
770D959M181l218k823L390n496j861J326o148J567J932l916M030p92l026M662
785a233j106j147M173m299J589M528k114M838L615j940M149k393m635K136n646
800E15l614O38p174m53J495l844N320K088j525O544J059J401O642k563m74K582
816H637n705K557K566l541K587k519o457Q86n124k926K420n408J12L022k222N909
$$ y = [-15426, -9678, -11179, -7771, -4272, -7666, -1044, 6145, 6759, 13009, 10345, 5083, 8973, 5031, 1637, 2631, -4134, -2005, 1195, -3601, -937, -1095, -5039, 68, -2536, -6198, -2292, -6085, -4715, 527, -3264, -508, 2534, 1421, 8408, 8949, 4145, 6388, 2485, 175, 2950, -3386, -4374, -1361, -4409, -103, 1534, -2564, 1146, -471, -2524, 1094, -2907, -4984, -1907, -5797, -3301, 282, -2412, 3558, 6670, 4959, 9140, 5922, 3099, 6489, 993, -868, 458, -5690, -4123, -2191, -6107, -2077, -2869, -5895, -1233, -2339, -3486, 687, -3612, -2023, 2505, 391, 5229, 8844, 6904, 11053, 8660, 4025, 6161, 515, -3099, -2461, -9635, -10088, -8593, -12437, -7117, -5029, -6554, -10, 1049, 2450, 9092, 6529, 6055, 8637, 2932, 5489, 8055, 4514, 7101, 4582, -1875, -989, -6113, -9039, -6619, -12027, -11915, -8893, -11115, -5206]
832e206M292j97O676K096M89P296k000j553l01q992k771m31n045K637n09n586
848i105K179k420j894N431k009J606M984j797N846M746j014M420j029k987N005
863A1962j977j650L49r601n501k148n907L226K468k362M724M70J04O782M11J378
879B728M496l130K846L794k718K370k718o635J115l026q69M297n445m332j239
894h466o593L350M334n01O149J609K35P515M75k61K454m975n10K167l828J966
910E120j788p255k02k898j845O445q27L35J839o251P59L706m62N289R46k340N744
927F315J086N34K590o791l218J053l738K989P54n757O93k629k396N238oJ383M738
944B838l621M05J318l635L703J859l495L223K29J54N508l419l257j031n051K457
$$ y = [-5206, -914, -1111, 5565, 7661, 8150, 15446, 13446, 11893, 11592, 2600, -171, -602, -5647, -3010, -3519, -9105, -6926, -9346, -11240, -5809, -7818, -6212, -1228, -3025, 2821, 7567, 6553, 10973, 9944, 6957, 11962, 9985, 8335, 8684, -917, -6418, -8566, -14473, -11247, -8779, -11141, -6417, -5947, -5843, 939, 1350, 2728, 7224, 4094, 6940, 10734, 8016, 10386, 7668, 1033, 2148, -878, -1747, 2550, -2895, -7227, -8466, -15059, -11709, -7375, -7876, -1727, -118, 117, 7632, 8107, 7846, 10300, 5325, 4815, 6982, 3154, 5120, 3332, -3923, -4125, -7023, -8868, -2423, -3250, -2915, -1076, -7327, -6568, -2862, -3324, 1965, 2911, 571, 6315, 7401, 7935, 10525, 3734, 516, 1569, -2169, 820, 1574, -4183, -3490, -6119, -8515, -3277, -3283, -1900, 2838, -783, -378, 940, -2695, 1008, 2867, -628, 2595, 2824, 2978, 8486, 5067, 1810, 779, -4272, -1815]
960a815L375l898J200k448l965M835n07l19M632j839J476L063m171J686J143l427
976i79L425p24j505N152n45q65Q39o946j432K276k619K958j504n164K813O18K72
993c930M490j826O51M854r13J974L93m458K166j31k634K623k209j286L678m168
1009g26k501L3m331K986K116l253K127m89J59O545r5k29L436j794K216K749n024
1026C925n60j425l762K446k282l699K286j687O61K289m251P11K844n15M299L33
1042A613k347M479O29J057L225m061r70K439m126J10j973n384J678l73k683K004
1058d683k352P13N925r30J531J867k767M530K118k400J817k489j100M123k453
1073C450j822J31m469L67N73m023Q35o2j527M041q61p60M537J16L130K892l175
$$ y = [-1815, 1560, -2338, -1138, -3586, -7551, -2716, -3223, -3542, 1090, -749, 727, 3790, -381, 1305, 2448, -979, 2446, 1722, 217, 5369, 4824, 3959, 4798, -2148, -3580, -1304, -3923, -965, -2469, -7633, -4820, -4202, -3930, 560, -1266, -615, 4239, 3326, 5300, 5693, 1235, 3401, 3270, 636, 3259, 1050, -236, 3442, -726, -3227, -3194, -7525, -4539, -2423, -5676, -3549, -4038, -3879, 2666, 2571, 2342, 5778, 3984, 6200, 8949, 3925, 3365, 1940, -1822, 624, -1658, -5357, -3071, -4758, -4097, -1808, -6059, -5348, -2504, -3019, 1280, 1613, -734, 3745, 4374, 5431, 8656, 4595, 3625, 6064, 1938, 2048, 75, -5309, -3631, -4004, -6687, -4683, -7035, -6322, -397, -1327, 204, 2071, -696, 3834, 5952, 3552, 5369, 2880, 1780, 5903, 3450, 1628, 1759, -2710, -2343, -1770, -5793, -4958, -5020, -6547, -2506, -3367, -4127, 410, 526, 3656, 6548, 3373]
1090C373J023J332k435K319l017m750J933r27jK336n193j057J642k041L378M49
1106a636k665L458Q02k32L356j767P83L741k141M60M21l669J638p82m043K54k677
1123d699k28M790j666n01M89k889L285K614k081K393p06r66L920j285q91J763
1139C342k717J264J832l558P57m60l009J413k366k490L736k03J205K506l421Q59
1155a310K251j356L235n92k535K630m11k30K136l465o07K130k457J716L7l973
1171b801J555r22k177K267j524Q56L878j743R65J436k783L344O96k190K199j780
1187A276q01K940k228j154P69l140J370J454k617J271j053k075K698j352o55L613
1203C16p86J377K417k707J628J017j792J964r70k176J554j961q93J448l460O25
$$ y = [3373, 4396, 5728, 3293, 5612, 2595, -2155, -222, -1149, -1150, 1186, -4007, -5064, -3422, -5463, -2085, -1636, -4301, -843, -41, -273, 3083, 1316, 2099, 5840, 3699, 4159, 4580, 911, 2549, 1767, -2276, -2022, -4699, -4927, -137, -1803, -2304, -1815, -4704, -1419, 1195, -886, 1507, 801, -165, 3755, 2470, 1579, 3342, 625, 1889, 3721, 163, 920, 460, -2549, -1136, -3502, -5992, -2256, -2459, -1254, 1252, -2169, -1310, 941, -415, 2820, 2228, -307, 2323, 1912, 1682, 3818, 353, -254, 1876, -581, 1135, 1172, -2801, -1246, -2168, -4345, -2078, -3602, -2746, 1132, -611, 354, 1790, -993, 2351, 3047, 857, 3056, 1276, 475, 3415, 1187, 33, 802, -2338, -968, 486, -2131, -860, -1913, -3988, -1290, -2642, -3297, 316, -470, 907, 3324, 617, 2245, 3262, 1470, 3434, 2464, 288, 1842, -119, -1012, 436, -3024, -2399]
1219b399J347k108J968J90k204K594o72n69L039j047P90L139j747P56P56k927
1235I06J977o72k628J516k409j752J794k184j5J735k104K322J268j344K685j43
1251I52j064K599r43K55K677k256L52M98l235Q47m50k075J364j334j809J481k046
1268d187Q00K153j359K045J601j123K637N98j512J566j565m07K106j856j07L80
1284A770l375L82k91j796J813o52j330K249j465O9K552o89J240J909j532K300
1300C154Q79j863J108j666j601J079j537J1J467l011P5k44j694K400K72j258K153
1317b76m07n85K731j283N96K027k107J253J285j718J320j454k378Q54j837j29
1333b108J879j704O20J20k256K102P77j127K548l79p30K495j144K48J206k029
$$ y = [-2399, -1052, -3160, -1192, -1002, -3206, -612, -1284, -1853, 1186, 139, 929, 4068, 2321, 3077, 3833, 906, 2883, 2211, -417, 1099, -1310, -3062, -1268, -3452, -3467, -1732, -3836, -1514, -246, -1590, 1095, 952, -112, 2487, 1544, 1799, 4476, 2220, 2572, 3070, -165, 682, 232, -1843, -479, -1813, -3622, -2141, -4187, -3387, -1234, -2593, -548, 1053, -70, 2567, 3165, 1653, 3219, 1654, 1247, 3353, 1497, 1390, 1770, -1605, -1223, -1514, -3310, -1497, -2149, -3479, -1230, -2695, -2626, -74, -763, 477, 2386, 854, 3154, 4033, 2170, 3278, 1612, 11, 1090, -447, -436, 1031, -1980, -1905, -2149, -3843, -1443, -1171, -2429, -276, -683, -1268, 1463, 180, 776, 2803, 696, 1949, 3234, 1516, 2836, 1382, -996, -142, -1979, -2108, -229, -1933, -1313, -1193, -3449, -1347, -570, -1697, 851, 472, -258, 2237, 1093, 1341, 2547, 518]
1349E18P12P94j676J703n58k570O60j942p17J880j272J142J204k141J445R33j150
1366a035K229k1q82K224j069J00J597k528L42M24k355J766p7j915J066j849j366
1383c349K023j227N49J734j179J434J155r41J727j84r48J599p45n71J623k095
1399F05j9L31k449M69O84j625J540j194j254J709r70M98J926r37J127J809j199
1416A051J784j00j597J236j036j385J695k189l08M76k275P61K79j168J821k16
1432a171q07K138p25kJ926p03L30J536j260J021P53j830Q71j473j674J201j728
1449a597n44P43j603Q19J391j695J617N65q72K453k27k71J895j185J63O10j722
1466E40J036k86j460R01p45j738R08j551l33J443j395L52J903l97J487O28j061
$$ y = [518, 1230, 2024, 348, 2051, 1493, -1077, -417, -2359, -3076, -1196, -2468, -1326, -122, -2263, -818, 115, -1035, 1194, 1173, 291, 2515, 1446, 1546, 3143, 615, 957, 1381, -974, 792, 715, -1200, -134, -1983, -3349, -1326, -2553, -2004, -270, -1449, -15, 1140, 199, 1926, 1742, 794, 2393, 1648, 1077, 2700, 605, 586, 917, -1532, -1063, -379, -2004, -464, -1658, -2912, -1203, -2173, -1675, 251, -686, 441, 2250, 1051, 2835, 2735, 1138, 2374, 1338, -47, 1648, -541, -849, -373, -2648, -1887, -1608, -2776, -955, -1171, -1978, 160, -565, -567, 1359, 656, 986, 2522, 1262, 2283, 3036, 1206, 2077, 604, -1070, 131, -1597, -2141, -1398, -3001, -2182, -791, -2486, -869, -304, -1176, 1277, 1050, 779, 2674, 1489, 1652, 2262, 540, 1576, 1290, -170, 731, -14, -1752, -844, -2395, -2728, -1285, -2680, -2328, -425, -822, 665, 1293, 232]
1483B32J679l41j36J427j230q13R52j833J20N87k546J078Lj413J377p42k57Q95
1501i61r57N44J814o74J687J047j214R51n76j209J726j160r44N20j669O2O05j831
1519b239O01K67j035K003K87m60J200j090j31J264l74Q43R99j021Q52k34j647
1536H5O87p20p87P77j600OR35j052K94L31j207J779M81L22J805j246l04O91j328
1555e1M10J212j174O08j91r86Q91j268q06P29j113l0J082p22J030M75j356J067
1573a93L55l83K386k74n86M75j681o2Q19j465O49J62j355J630q20r00Q95j095
1591a443L2N59k10Q44J079j439J066M3m94J561lk72P55j725n27O43j580O14Jj046
1611a542Q02J56l38J185j133k33J143q69M61J523q67N88J15j192J099K56o89J278
$$ y = [232, 1911, 1570, 1434, 2861, 1631, 818, 1770, -63, 57, 644, -1902, -824, -821, -2234, -857, -1599, -1856, -961, -1918, -1374, 440, -234, 1453, 2500, 1286, 2237, 1661, 452, 2178, 1018, 74, 594, -1075, -1013, -408, -2239, -1638, -1371, -2406, -403, -116, -576, 624, -466, -597, 667, 293, 1136, 2135, 1114, 1966, 1732, 85, 772, 52, -735, 42, -1558, -1552, -617, -1669, -1375, -1044, -2251, -472, 9, 331, 2136, 890, 586, 1277, -51, 359, 1571, 397, 1005, 814, -172, 719, -549, -1355, -626, -1739, -1769, -687, -1409, -379, 96, -1260, -193, 162, -221, 2165, 1891, 1305, 1780, 99, 37, 856, -609, 40, 202, -1153, 477, -343, -1243, -348, -1443, -1411, -852, -1062, -218, 861, -578, 488, 531, 37, 1598, 1595, 1323, 2078, 353, -174, 469, -1111, -497, -496, -1542, -740, -584, -922, 263, -870, -1103, 40, -829, -368, 1155, 288, 876, 991, -201, 898, 1154, 465, 1743]
1629A743j087r77P25j678K59L54j313Q78L43m23J363L38p01J144j163K00J415
1646A420r50M60rr87M12L7r02J221o49m89L93j180N6O69j154R01L46p46J453N24
1666H26m33J128r60j55R13j090N31M89j677K84k99j065J333l18m20J009r08J32
1684f80N23r78M92O68l39P08K93k94J184m90l17O31j334J78N97j133P2r5j386
1703a700J127k73k99J317n11n5R53j012N89O44r36Q00J78o51Q80k93m37N60j088
1722b07r1P47j210N75j1j466P34P3n3J198j67L82O80p21j07O74j360P18J15r34
1742d31R12q6p79J171j151p15J271j044O39N19j140M91M6o25J231k54J58Q09l28
1761F94m0M27p89o0j02p80M02j96o1Q83r51J4O27p17J52O89m91K55J08q48Q00
$$ y = [1743, 656, -321, 404, -1274, -1015, -661, -1974, -1096, -753, -1176, 187, 525, -176, 968, -195, 5, 1420, 470, 930, 921, -66, 346, 383, -519, 702, 53, -436, -43, -1223, -1167, -498, -1652, -751, -405, -1151, 302, 826, 393, 1521, 561, 406, 1319, 229, 760, 1249, -428, -144, -443, -1508, -175, -493, -913, 96, -812, -680, -157, -1135, -643, 25, -314, 394, 687, 393, 1577, 1087, 770, 1401, 67, 245, 842, -291, -219, -314, -1700, -573, -846, -1145, 172, -339, -394, 559, -453, 136, 780, -156, 644, 822, 171, 1051, 758, 321, 881, -207, -298, 449, -761, -186, -197, -1663, -929, -856, -909, 289, 122, 504, 1184, 463, 356, 1030, -330, 388, 503, -431, 481, 395, -384, 787, -364, -1079, 192, -852, -213, 306, -834, -343, -297, -922, 309, 55, 213, 1022, 694, 654, 1081, 292, 232, 130, -650, -248, -444, -505, 378, -573, -559, 68, -649, -497, 192, -299, -44, 64, -784, 16]
1782A6k13o6R83l24l5P56p02q9K51j404L85p9l62J167o87L5N01o32N20M56q01
1803c24J027k92q95O16J66n18M56l25K24N18m19J84L63j175K74k42p20Q54o0k51
1823e39P03l63q5Q32m10M34j04o58O17k30n34L54j65m94J068o68O24N22r24M00
1843C80m92q01N76m8k82Q02o41K69Q55l30p2P51q55M81M6r64Q09n63n14N89n60
1864e64L73N01n01L92J77r68L78j29m05N93m36k8J282p51P27K02p53M91q6q69
1884c74Q15l26n57M43n49j23P84m93K56O75q91L77L22j024Q22o87l58R75o4K27
1904B50P19n97K94J53r95N98Ko71J88l85m38O99n92M49O61m54K5L20k25R21n26
1925C96j191R71l12J14P08l51J82M16j080M74J18j049R46p52n16R19o15k52R48
$$ y = [16, -197, -263, 720, 396, 361, 1117, 415, 326, 577, -827, -442, -521, -883, 284, -403, -368, 133, -499, 21, 477, -324, 703, 411, -484, 132, 298, -220, 236, -89, 135, 653, 234, 418, 781, -394, -120, -362, -1082, -228, -288, -539, 164, -199, -284, 548, 138, 572, 468, -190, 427, 197, -337, 17, -148, -642, 426, -242, 382, 904, -20, 380, -112, -913, -337, -385, -667, 135, -506, -237, 618, 288, 216, 967, 112, 593, 639, -325, 484, -79, -593, -4, -564, -191, 310, -191, 201, 378, -590, -212, -341, -746, -153, -589, -617, 665, -86, 641, 843, 90, 581, 495, -374, 441, 115, -442, 1, -548, -671, 113, -380, -124, 551, -340, 37, 359, -665, 157, -530, -888, 87, 23, 250, 969, 372, 666, 819, -176, 422, 424, -247, -59, -444, -882, -183, -775, -326, 335, -119, -94, 226, 1, 922, 396, -795, 176, -136, -22, 686, 335, 517, 933, -147, 327, 445, -604, 342, -410, -926, -7, -622, -874, 74]
1944G4m50M12K87k09O45L9m74l48j26j42O58k99K44L67n22j8M17o68J47k87m76
1965g29M34j68J20M29m96K62L06m50P11J25k19L05n94k21j4l77J33O27m49M23
1985A58M1p8R8j85q46M85l78K53J085r36M39P5m86Q20J28l08O13l99p11L31l61
2006a62l46K52k68J39L00k46L46L41m66L04l62l03P62k69j1L61m75Q4K79j3P33
2027I80k84j091N18k67m40N24p93M6N97k56M81K44r0L75m33l47M52j17l91R02
2047F10p10p9O29r46O66K8l26M50l82m58L23m06l42O89l16L48Q97o81M22K33n24
2068A25J56j11j18L39p97j3P58q04L76K89m30Q28o88k83J61n7k52L53m05K27M80
2089A34M2K40L08m51J94j55l06J87k86k06M94q06K64K04m58K71K42k89N26q6l26
$$ y = [74, -376, 36, 323, 114, 759, 798, 324, -24, -150, -292, 366, 67, 311, 678, 156, 138, 555, -113, 34, -253, -729, -295, -463, -343, 86, -410, -148, 158, -292, 419, 544, 325, 630, 36, -185, -199, -576, -443, 184, -265, 158, 199, 121, 219, 34, -812, -327, -705, -452, 633, -303, 136, 211, -275, 545, 673, 365, 978, 579, -132, 199, -162, -508, -256, -524, -385, -85, -331, 15, 356, -110, 194, -168, -471, 291, 22, 11, 372, -103, -19, 260, 247, 980, 696, -395, 123, -144, -584, -60, -853, -807, -210, -466, 15, 259, 169, 544, 111, -236, 216, 99, -292, 610, -100, -179, 450, -496, 170, 198, -128, 322, -60, -518, -195, -601, -943, -254, -570, -222, 675, -6, 416, 649, 125, 281, 170, 52, 391, -406, -419, 339, -465, -89, 200, -230, 598, -90, -373, -212, -269, -521, -168, -573, -346, 134, 176, 416, 724, 273, 467, 312, 6, 193, -93, -299, 195, -611, -347, -143, -601, -330, -88, -377, 149, 63, -263]
2110b63P45o04l09O04l84L01N36j40j9k03k67J96p5k99mn82N8L39m63O07L4J68
2132b4L21J7j18M71o69L2n9j51Q6L53k45K61J2m51K42j09m89N58k94k84N28p47
2154g59P61l9l9O40k7j12J9j33q2J03m82q4K32j91J08M4k78K31o1r3L57Om18L68
2178G1k66p3K85o3N36j43j39K50j23m02M88p72J17l6j37K31K49m12M04j94J1O5
2200e3K22j07K08k92L2J87k96R7M5o7K87j44mJ75n83j41K75l35M03k41L57J74
2222A99o7J47K9j30K1K58n57L9L07l02j6J39k92K47j26j01L67k07k7Q8j28j02
2244b14j8j11L37K57k96m1K33j99M65k5n24Q4l22M69k89m17M45P3J0K45j1m4K32
2267C39k09k48J79j99l76K76PM54l09J38M18l25j78K59k72j36K06o17N11J14q5
$$ y = [-263, 482, -122, -431, 173, -211, 90, 626, 486, 467, 264, -3, 193, 118, -181, -185, -767, -709, -370, -833, -226, -192, -24, 297, 314, 196, 667, -2, 30, -29, -180, -94, 259, 14, 275, 287, -164, 78, -31, -520, 38, -256, -540, -12, -759, 2, -37, -76, 564, 537, 425, 444, 311, 229, 332, -150, -234, -2, -193, -85, -41, -319, -88, -149, -242, 115, 121, -297, 71, -195, -268, 17, -46, 490, 347, 208, 458, 335, -67, 421, -351, -234, -270, -407, -176, 73, -339, 65, -129, -118, -53, 169, 62, 270, -22, 10, 197, -99, -2, 43, -24, 263, 119, 115, 290, -293, -434, -159, -494, -91, -332, 25, 199, 132, 279, 308, 178, 199, 457, -100, -61, 246, -56, -72, 67, -225, 22, -104, -205, 162, -45, -72, 16, -112, -214, -232, -343, -6, 251, -45, -86, 147, -52, 413, 388, -136, -52, -374, 95, -194, -611, -166, -93, -83, 162, 151, 107, 339, 130, -118, 61, -138, -514, -238, -231, 223, -86, 52, 470, 145, -33, 226, -46, -182, 24, -593, -82, 32, -53]
2288e3J18J13m3J98j66k58kn1M8k65q6J52K05j23M12J55l22L01l43J73j63R8n3
2311D5k9k53J30J67j75L25m67L40L3m2k56J73l77L58pj6P5J75L49j71j10J51j90
2334B28j58Q8j10k70J25J17m51M02P0j24k3J24m68R14m48j43r9j36L48P6L2J20
2356B14N7k81K28m54L25j53j60Q3J69n12K28J15k41M25o3l7K42J46k4r0l86J27
2378d2J92l02L74j35k28K80O4k10J22l27j75L76k98K6J41k88K87J87l9O43m45
2399B03o5Q6k46J24K05o23K21j06r7J96l4J59J56l08r8r6J73R6J32j98J55O6L
2422A04N1P6k0k70M16q2l14n0j38J8k19K3K15J11K32k84K36k27J12K6l25M07Q7
2445A85m10N51r2j43NJ83l1k56J76m01l0nR2p3k42J02M98PL4Q4j69Q4J37n27M07
$$ y = [-53, 65, 178, 135, 333, 167, -91, -93, -144, -96, -361, -447, -295, -90, -213, 199, 354, 32, 333, -10, 163, 0, 98, 45, 16, -237, -107, 60, -115, 210, -257, 83, 116, 74, -182, -9, -386, -28, -35, -51, 24, 199, 548, 377, 267, 418, 228, 70, 158, 48, -222, -97, 20, -431, -29, 41, -83, -106, 18, -450, 464, 16, -127, -226, -362, -14, 62, 94, 214, 271, -10, 218, -236, 89, -64, -224, -141, 28, -484, -256, -141, -382, 43, -20, -57, 185, 331, 307, 217, -169, -42, 150, -152, 222, 87, -141, 139, 203, -7, 115, -212, -387, -11, -309, -283, -142, -430, -143, 44, 5, 648, 203, 138, 224, -22, 102, 307, -316, -95, -201, -298, -102, -136, 23, 179, -129, -227, -323, -150, -54, 78, -120, 35, 101, 104, 155, 231, 211, -59, 357, 275, -39, -89, -227, -209, -428, -405, -190, -79, 153, -131, 105, -122, -10, 16, -309, 98, 185, -225, 326, 234, 91, 96, 279, 248, -8, 168, -233, -263, -268, -176, -249, -491, -389, 109, 116, 150, 234, 65, 149, 286, -241, 166]
2470A66k59J41K06k63m09N95l91l26K95k6J96l27k66M19N2R0K24p3j5L80q7K05
2492E27m41K87n9m11J2j2K21k97M6j95n6O3J20k13J01r6J65J30rQ9K64J94J21
2515E51l89M02k35k12j4o5k57m1K7k01J78j33O7K34p1K28J89Q9l52R7J44o8O5
2538B33l09m2K36K2r1m46N06o12L65k25J39k19Q9L4JL74j56nN18OO0j48K53l97
2562A86r8o0k50K58j97J94n4j3o06L43J38k8k44M56R3k37K71J91J98j35k5m6N1
2585C86K9k49J0k78j26k5j03j82J22L20j63J34j65L81j54K20J6J78J1L35n45q6
2607F6M65m66K70k13J17m02L25m01O2k84K11kk09K75J63q3k6L59k23L51k66J87
2629B76K66l54N6k66J62k21J35k36J31j15J85n66L12m17K52K09RK47k04L64q6
$$ y = [166, -93, 48, 254, -9, -418, 177, -214, -540, -245, -271, -75, -402, -668, -249, -197, -107, 117, 44, 29, 409, 322, 527, 86, 373, 314, -97, -85, -97, 124, -173, -127, -322, -378, -315, -195, -408, -307, -403, -238, -108, -117, -28, 236, 430, 551, 162, 564, 329, 117, 103, 38, -219, -260, -233, -434, -256, -389, -322, -88, -159, 69, 258, 347, -5, 92, 236, 168, 233, -76, -118, 118, 140, 49, -397, 109, -503, -138, -363, -224, -443, -354, -320, -319, 55, -101, -106, 412, 418, 478, 330, 583, 186, 88, 28, -222, 36, -161, 33, -21, -34, -640, -297, -159, -187, -431, 25, 118, -119, 152, 343, 541, 406, 381, 335, 386, 415, 166, 176, -102, -228, -253, -356, -538, -416, -96, -259, -125, -290, 91, -63, 157, 173, 351, 362, 697, 152, 66, 531, 65, 335, 122, 239, -163, 162, -239, -177, -461, -250, -252, -461, -186, -23, -106, -132, 227, 4, 355, 89, 276, 542, 188, 244, -22, 140, -81, 54, -182, -51, -166, 19, -547, -235, -652, -400, -191, -182, 65, -139, 225, 139]
2650A39L93k11J99j46n4k19O5j2k02j62K34j58j69J03q2QO6n0J19P3R8M86k47
2673B71j76K76K30l07P0p5j48l5m41K96j75l16R9J1j5J67J80P9J54l7j22L35l4
2696B87L22k99M0J8J21p4j92r2k22k58J67n08L45k61J09j71L90J93o0L11J38Q7
2718C91N8Qk40L86l79j68L08Pk87k44JJ67k31j56J05l23P6L11K32j33L8J37K40
2741C04L84l70j18K18j00m0R2l66nm08L53P8l16P6J3o6N6J54l04K42O5L26Q1l04
2765D5J46M25l45m7Q6l19K26j60j32k12K5l57K78K00n5M2J37o4J82j16M78l65
2787I8k53N46j39j65K95k75J51N1l43L96l32J3q7Rj81j45j79L19K83j44l7L31
2809B12j95L39k38J98K4j91j13J93r7K7O6l68J65j24k7j21Q9l96M05j51k1J14
$$ y = [139, 532, 321, 520, 374, 320, 101, 166, 154, -48, -210, 24, -134, -303, -200, -282, -274, -208, -258, -139, -66, 32, 518, 271, 95, 371, 601, 294, 364, 289, 141, 106, -335, -39, -214, -530, -431, -420, -435, -268, -88, -9, 145, 108, -14, 321, 287, 609, 310, 350, 368, 489, 415, 223, 131, -91, -349, -182, -690, -345, -606, -497, -668, -278, -85, -145, 166, 304, 391, 449, 457, 217, 603, 224, 56, 364, 371, 84, -160, -159, 8, -223, -379, -274, -597, -521, -210, 22, -111, -73, 64, 304, 688, 318, 200, 418, 318, 278, 370, 4, -1, -409, -56, 22, -294, -218, -205, -271, -215, -61, -365, -123, -58, 268, 349, 45, 191, 616, 271, 224, 310, -9, 217, 57, -75, -287, -262, -619, -341, -141, -196, -154, -17, -81, 101, -15, 463, 98, -155, 391, 252, 87, 382, 107, 258, 309, -34, 362, 30, 43, -44, -35, -216, -361, -540, -221, 62, -82, -119, 212, 17, 356, 118, 316, 340, 149, 36, 229, 132, 159, 225, -143, 22, -102, -129, -250, -161, -557, -152, -303, -324, -210]
2831b10JM66j36j81J38K66O6J90m62rL2j91j65K46j25J37j48k49K42k53j65M03
2853a07qPL40j88K55K53k45J74P9l16J86j29o42O12p03K05p6l29K51K62n5j26
2875c00N42k61J32j56J67M60m82J59K43l28K45l01J69k92J06l84K60l91k00M66
2895a46m94N77J09l17N23j68k81N34q5l60O76l64j8P9p8Ll9j19l8l25j59L86q3
2918a87p6K70o9m3J74k51N87k50J8J30p0j95M04l56l7j30j99M97m84K01j00J81
2940A5l68L78l26J60J50l79J01L25o7J92j27j53L69k3l45J06L5KmK3l60K71j26
2963a51n9N63l98J62k46P3L53k58k67N53n61K18M96l55k77M13j40J17n4k20Q3
2984D5j03N9K45j16m48J94k29J43K65j10K05o6k18K43l26K38k8K22P2q8l05N59
$$ y = [-210, -209, 257, 121, -60, 78, 344, 410, 600, 138, 129, 161, -30, -195, 51, -74, 63, -85, -334, -92, -345, -510, -107, -115, -108, 232, 44, 299, 552, 307, 481, 560, 244, 430, 301, -341, 271, -432, -227, -303, -632, -381, -119, -174, -300, 242, -19, 113, -43, 124, 584, 102, 261, 504, 176, 421, 120, 289, -3, 103, -281, -21, -412, -612, -146, -640, -63, 46, -271, 252, 84, -197, 337, 252, -108, 568, 204, 186, 265, 187, 190, 151, 32, -6, -331, -490, -104, -187, -263, 7, -62, -105, 69, -182, 405, 155, 173, 303, 233, 38, 442, 86, 49, -81, -280, 217, -267, -66, -166, 15, -353, 25, -301, -141, 9, -370, -269, 56, -11, 181, 54, -99, 270, 247, -98, 8, 43, 45, 41, 64, -296, -25, -151, -210, 353, -45, 117, -129, -56, 297, 39, -228, 325, -236, -18, 478, 123, -154, 259, 119, 236, 182, -38, 45, -58, 1, 246, 130, -318, -124, -353, -210, 55, -55, 150, 84, -134, 109, -217, 21, -7, 215, 287, 199, -106, 453]
3006D53l06j43L62m19K3O5m70r4L87l43N12o4k58K43K65k22L74k98r4L65K5j10
3028B53J6l53JK43l16N1k9l88N46l31R3l6L1k1L80j13L64Q6k03L28l35j55J99
3051C11k51P9R5n27J45l44P6L73k81j91N59l69K07J70M9K73N4j81K56J0m85M95
3073E23j69k49P9j51j78k4j52j88k2K52K45l28J38M71o0P4M3l65N11J3j99n5l4
3096A75j88Q8k26l02L77m69J74J71rR0k03P5Q2L26m29O64k73%K23j68M3k1k49
3119d9O9J28n17L28k5o0m3m5p0K77k37K27Jk37M83R4j52J37k7m31M87j89k50K12
3143A11n37K74J73k58J33m0j80M13m81K06N58n84K81R0%r0%l08J73mn8K58k68
3166a38J17M05m93M0L18o91K93K44k20m9J50m43N36j1KJ02l72J94L14l76L57J4
$$ y = [453, 147, 4, 366, -53, -30, 35, -435, -529, -142, -485, 27, -37, -295, -52, 213, -9, 365, 67, -27, 338, 363, 253, 269, -84, -83, 160, -156, -105, -134, -522, 24, -307, -214, -250, -219, -240, 140, 27, 391, 477, 274, 602, 267, 112, 311, 60, 139, 234, -293, -148, -492, -416, -43, -324, -515, 44, -325, -118, 52, 101, 374, 428, 247, 503, 513, 28, 523, 354, 105, 184, 33, -145, -169, -321, -509, -531, -279, -34, -362, -224, 247, 187, 261, 304, -61, 450, 463, 264, 209, 175, -13, 75, -151, -453, -76, -545, -371, -200, -209, -119, -322, -247, -165, 161, -268, 396, 123, 123, 346, 178, 221, 200, -49, 20, 148, -369, -41, -66, -126, -169, -214, -284, -7, -244, -17, -16, -253, 230, 324, 172, 309, 282, -149, 338, 149, -101, 111, -426, -152, 21, -237, -104, -144, -324, 89, -392, -186, 372, -212, 69, 159, 159, 69, 69, -239, -66, -70, -128, 130, -138, -21, 384, -109, -69, 249, -442, -149, 95, -125, -174, -24, -467, 69, 58, 60, 162, -210, -16, 298, -78, 279, 293]
3188B93l17L80n11J51L06m50K76r7m87M33k3j59J67L0m22O08k01k7M8J40j15K09
3210B32k88L08K7l20K94j79k90L60n1k45J33m81M0L82l05N04j58k63O12q1j71
3231F0N17l34J21K82q07N11m64n7L27k97n30L79k09K63K16j21LL68n18M59K04
3252C73j45L47k78J04L59m40j51J40o49K7L25m31J57J0l45K38L5m5N84k41J8N97
3274E89k05M1j05k57K08n4j95J10k22j73K69p44J80O10p80P42p8j88M85N5l57
3295f9L99q9J24J02k91M5J8k84M4M10o49j72J16K40j35l79J79L50m54O35j87O7
3317B0Q7K64l21M77m51K05M88m25m4k79l17P2J69l00J02J99k04N80l11lL77k86
3339I9l3K49j74j65M92o35N26m85K8L32m02k22L92l92L23J57m47N05m1l96M59
$$ y = [293, -24, 356, -155, -4, 302, -148, 128, 31, -456, -23, -46, -205, -38, -8, -430, 178, -23, -50, -2, 138, 23, 232, -56, 252, 279, -41, 253, 74, -216, 144, 93, -152, -19, -500, -460, -78, -383, 121, -37, -300, 312, 231, 60, 577, 243, 364, 646, -161, 350, -114, -171, 156, -141, -671, -292, -501, -238, -22, -143, -140, 228, -290, 169, 373, 228, 575, 297, 401, 760, 320, 169, 309, -340, -313, 12, -419, -262, -252, -597, -359, -324, -369, 215, -26, -8, 589, 384, 425, 320, 63, 271, 217, 22, 132, -90, -263, 6, -738, -558, 52, -728, 14, -64, -252, 233, 288, -69, 330, 241, 365, 467, 176, 221, 239, -45, -1, 409, -240, -412, -296, -56, -191, -570, -391, -41, -495, 140, -47, 20, 107, 371, 50, 527, 76, 281, 769, 344, 300, 21, -296, -224, -55, -355, -253, -54, -258, 322, 11, 8, 385, 99, 66, 315, 141, -24, 468, -167, 359, -126, -98, 234, -168, -390, 2, -390, -67, 90, -357, 148, 107, -289, 170]
3360A70l38J93o0j23L42k41j95K60J16l51L27k73L6M6rJ78J96o13N09Q4k62K39
3382B31k12l42L56k45p4M08l36L59p0l10K65J0k67M87q8m74O22n04K72L42n06
3403g6p5L20l89N11l23k45L58j68l56N58j70q3O35k95J4k6j6p0O8j04M56o14m18
3426e08O03l72l3j46j5L86J1p1L30l32p1O68k96m9M48m65K02Q9k92J3J69n35K75
3449Ij87m63Q22o03K00L50m39K01L38m4OP1j31L26k48k63L23k35l8n3m12L12%
3472a58l55N24k38l0N70n85P5M09l59K80M72n65L44j36j52K04J3o32N53o23K83
3493a06J15n99K46R5J76M8ml26P74k83M6K7k17K9L49m18J69J04n61L94k83k87
3515e12N79l57J29J12j49J4K45o5L20k56k42O60m83k1L05K9k63n8n2OK15q14O98
$$ y = [170, -168, 25, -35, -158, 184, -57, -252, 8, 124, -227, 100, -173, -137, -91, -100, 78, 274, -339, 170, 254, -8, 231, 19, -323, 33, -212, -286, 122, -214, 145, 75, -235, 30, 40, -227, 260, 172, -302, 320, -184, 88, 430, -76, -151, 169, -220, 291, -32, -277, 81, -87, -443, 115, -55, -138, 497, 202, 216, 190, 174, 104, 172, 68, 524, -90, -508, 95, -277, -310, -456, -471, -85, -74, -145, 185, -147, -218, 450, 154, 105, 553, 88, 290, 379, 87, 100, 269, -266, 9, -178, -641, 181, -422, -222, 128, -311, -110, 228, 184, 190, 261, 130, 456, 208, -55, 268, 33, -5, -58, -470, -158, -158, -513, 11, -227, -257, 313, -272, -197, 212, -147, 133, 605, 40, 384, 248, 96, 300, 313, -319, 234, -389, -106, 9, -590, -344, -249, -73, -25, -29, -355, 419, 136, 182, 209, -8, 21, 370, -48, 121, 225, -336, 58, -225, -512, 67, -290, -161, -49, -198, -184, 61, -4, 316, 60, -182, 478, -5, -26, 279, 308, 45, -13, -65, -59, 156, -658, 40]
3538D0j3k61L17k5l18M22k89L86J67k63l10L91l37K78J5l37K40j95k17K55L3J16
3560I5Q0n15M22j73nK99n6l82O00o26P1R9j90Q9K52k64J77P4p1J34j81k01L54
3583H2k78J39L19m94K97L7n06L78J41k42L91l15r4L53k58j97L25j49J60N6k62
3604a17N81l80n18P90j23j12o6l36q9L38j47J79k19J83L50n21n7N48r8k89N70
3625D67o56N07o6m10M39l60m13M71j83p8J89l40J00L60l98L22K8j81M18m4L3J9
3647B24l81M21J07k56K33k90k14m0K0k25M02l19j23K98r2Q0K99n38M88L55o34
3668a85N62Q7o32P43l64k08L7n93J21M93m01O5K56k44J37K8k30M08K2J82M77p60
3690AL62k46k11K49Q5l32J95k34j31L58l59j06K63j10K3L18m11L80Lk16N62k74
$$ y = [40, 27, -234, 83, 58, -260, 162, -127, 259, 426, 163, -147, 244, -93, 185, 200, -137, 103, -92, -309, -54, -21, 95, 175, -340, 82, -91, -96, 203, 147, -235, 365, -261, -190, -91, -281, -192, 60, -204, -27, 47, -24, 110, -71, -272, 82, -196, -57, 262, -232, 65, 102, -404, -26, 115, -127, 264, -51, -145, 208, -50, -247, 78, -71, 89, 145, -117, 464, 84, -434, 356, 233, 121, 55, -281, -370, -32, -179, 0, -219, -36, 314, -207, -264, 284, 186, -103, 467, -189, 318, 252, -158, 281, -79, -492, -21, -204, -282, -93, -433, -333, 27, -371, -49, -21, -202, 216, 172, 205, 224, -157, 264, 371, 115, 348, 58, -156, -196, -176, -401, 1, -318, -441, -143, -235, -155, 144, -394, 94, 449, -185, 377, 464, -168, 575, 211, 3, 40, -553, -432, 61, -340, -275, -19, -263, -126, -98, -328, 80, 102, 284, 761, 1, 363, 117, -94, 155, 240, -92, 103, -131, -262, 96, -263, -369, -106, -216, -193, 125, -286, 94, 97, -119, 443, 169]
3712A69j82M25n85M94q7mr7N0j88p8M9m25M83j34k32N88m67K89P8m41J78K90j74
3735aM64q6l75K07l36J63K23j93J13q4m33N01n8m24L77O1k84N77o36K00K21m77
3757b80J60Q5K34k11R9k96O68l28l54K30m2j47K35J6J33l09p3J92j3m57M09K85
3779B36l91M13o79M87j92P2L01j97NL34k87m35N83m21o2L52l70K61k8j91M07j53
3801D5l86K28N2K4J55m53N38j5l02M03J39m45K42k09o5Q7j48o9J86j78k15L65
3823b1k93J08J18QK35K3k42O23m95k4M22p15L50r1j26J35j34l24M84k52m4L91
3845A36m96L19N9l82L80L30n99P07k48l32O29o85L00J31n45J39J27k13M3K95o38
3866e43M09N1K55l0m94L65K73j53RN1k50K12K02o7j57m10L1L68n90K99p3k04O67
$$ y = [169, -13, 412, -173, 321, 234, 230, 133, 183, -5, -83, -34, -459, 24, -110, -342, 246, -221, 68, 146, -295, -117, 173, -1, 463, 377, 2, 209, -127, 36, 259, 66, 179, 95, -338, 163, 105, -319, 58, 119, -165, 412, -224, -24, 197, -280, -120, -35, 199, -12, 87, -209, 459, 131, -223, 7, -35, -182, 53, 69, 202, -107, -180, 12, -1, -458, -49, 236, -155, 258, -421, 66, -126, -54, 247, 50, 55, 389, 102, -333, 250, -171, -233, 119, -251, 10, -18, -209, 198, 45, -341, -113, -61, -37, 118, -335, 203, 188, -114, 289, 428, -17, 225, 16, -49, 38, -110, -179, 7, -171, -386, -21, -314, -206, -88, -80, 155, 178, -64, 559, 64, 40, 462, -253, 97, 6, -120, 15, -119, -443, 41, -211, -255, 136, -360, -41, 18, -364, 16, 346, -253, 454, 206, -126, 503, -182, 118, 249, -296, -157, -30, -243, -200, 95, -543, -134, -83, 172, 142, -352, 13, 286, 133, 142, 193, -57, 155, 357, 290, 133, -277, -246, 122, -468, -169, -242, -446, 221]
3889B21k44k06L52l20R4K12o9p5L97k77K2K22m09K07k25k26L68j47j67J67Q6j10
3911a27J97k57O4J30k19K24P1l07M85j87j76M85l30M2R6m19K47o8j30L18l40j48
3933c49O38o20r0Q65o26L60J71m67K11K4j67J96k85J87k4k87J33N10k66j57J09
3954F6n17O17k64j31L54o8j56L61p30O26J08m40p7L92l29J60J7k04J8%J44pk77
3977c37L47k48LK50K10m29L20j57l6K48P0k28L45m10q7K30k16N10j79k72J16J13
3999A63m74N89l05k11L04l48L31J08n18L66P3l75L49j9k1j1q9L8K41l33M18j24
4021A52k47N43m85j88J80J73n81N08m54O73l17k80M95ml77M29k73k18N62l19L79
4042C51j16k43J05j14k28K51J25l10K45l16L81R8l61N31m8m34J68K77m54N05k71
$$ y = [221, -23, -229, 123, -197, -103, 109, 40, -35, 362, 85, 107, 329, -80, 127, -98, -324, 44, -103, -270, -103, -17, -127, 70, -187, -123, 7, -212, 12, 83, -224, 261, 74, -102, 383, 53, 95, 191, -228, 19, -49, -179, 139, -201, -349, 289, -331, -421, 444, -182, 178, 349, -118, 93, 117, -50, 146, -139, 48, 24, -263, -130, 380, 114, -43, 66, -451, 166, -98, -229, 125, 57, -99, 262, -468, 158, 266, -174, -251, 141, -188, -28, -11, -215, -197, -197, -53, -60, -337, 10, -238, -235, 15, 225, -204, 116, -41, -77, 171, 241, 13, 358, -52, -139, 91, -125, 385, 206, -66, 50, 163, -311, 278, -27, -238, 66, -282, 49, 157, -361, 5, 78, -297, 52, 33, 12, 1, -88, -50, 191, -142, 276, 152, -95, 448, -37, -225, -45, 128, -453, 55, -399, 274, -43, -323, 172, 168, -209, 220, -53, -271, 291, -28, 351, 235, -8, 97, -17, -245, 6, 131, -179, 66, -250, 131, 229, -132, 399, 351, -83, 85, 362, -92, 413, 142]
4063A42q3K90k81k14M34o24K45J98m35L75R7m25J90J91j09p3rJ66m8j56o9L14
4085A16m0L2k15J16K18l26j14l2j13M00J9m95N05j01m5P5Lq2L9O2q6K73l89R4
4109h6k0J19Q0p5k47M80j80j80K59k98K74j88n9J70r2J68K39m16R1J22j55l7J
4132c0l94L23L79o60M79J18k13K76k77j38Q5kJ15rj96L77j77m20L37J89l35J21
4154e2k34L05Nk79L52K9j77J14n0o4R0j16J36K9k4k90L17n70L54K16j72K78o4
4177A33m80M27j64K18j92r7J04K78l17Q0Q8m31M51M7l73L31J13l80K71j10r2K62
4199A67m03K95r2N8K72l60M0M29o07J73M2j61M15l25j12J74j22M1K94l35M03J8
4221C04l81K29q7k37n2J94Lk38J71K4L80l61l77L78pP3j24J66Q7j6K9q4q5J28
$$ y = [142, 59, 349, 68, -146, 288, -336, -91, 107, -328, 47, 144, -281, -91, 100, -9, -82, -91, 75, 27, -129, -198, 116, 76, 108, -107, 9, 227, -99, -213, -245, -358, 42, 61, -434, 71, -30, -75, 0, 3, -79, -40, 22, -64, 209, -180, -86, -106, 13, 93, 18, -229, 251, 71, -109, 150, -148, 126, -62, -121, 49, -43, 125, 364, -52, 39, 161, 6, -31, -30, -424, -101, 278, -382, 97, 215, 2, 278, 1, -137, -52, -54, 61, 52, -144, 233, 56, -364, -27, 162, -173, -52, -286, 19, 24, -255, 97, 126, -51, 63, 13, -51, 39, -77, 59, 88, 64, -226, 91, -479, -125, 91, -81, 197, 133, -347, 80, -84, 134, -58, -155, -51, 227, -90, -10, 78, -353, 98, 145, -228, 103, 216, -164, 107, -3, -95, 167, -236, 59, -33, 25, 297, -63, -23, 406, -201, -28, 14, -147, 268, -57, -169, 5, -117, -76, 218, -117, 286, 304, -77, 152, 65, -172, -224, -30, -27, -265, -94, -70, 310, -51, -428, -50, -57, 16, -108, 58, 145, 129, 158, 74, -11, 117]
4245A17j07J95l09K32j50NL1k99K24ok62L77j31R7J95j67O7m2K16j55r9k58L37
4268A08k4j48J94k57R6N7O5J15j32k71j9J49p0L16j45j18J65l61L9L57m79N58
4290A95j19l8M25l97r7K00L2j55or5N4L6l89L63j19j43K94j17J17J8j40P3o1L4
4314c5O0Pk7n4K05k28K31j09k58L88k22J9J85k16j30M95l56K4m4K71j15k1PJ24
4338B01k12l78N33j78R4K60l47J2J69M3k58j4L6J66k16R5K19j88J9j51O3J32j63
4361f3N8M15k87l95M04k09J07J72k19J21Q5k75R7l69J44J88k67K62L68l11l4K28
4383B20l44P1q5l2M41k43P6j06l62L17j9J49Jj41N5L0O6j50m6K08K9N1j80M7L8
4408I1J58j4j2k97R6qK0Oj71k04K95j59J61R9k74L76k53J81K46l42k1J74j54k73
$$ y = [117, 10, 205, -104, 128, -22, -17, 14, -285, -61, -67, -329, 48, -83, 14, 209, 42, 109, 67, 283, 128, 29, -229, 108, 84, -64, 130, -127, -31, 26, 91, 206, 74, -197, -216, -67, -137, 179, 34, -84, 81, -280, -241, 116, -363, 195, 76, 38, 463, 66, -31, 169, 201, 46, 40, -55, -1, 35, -354, 9, -110, -253, 41, -76, 41, 59, -81, -8, -69, -35, 25, 32, 5, -49, 156, -72, 159, 50, -208, 180, -42, -23, 162, -54, -184, 311, -45, -21, -65, 206, 91, 70, 77, 201, -11, -389, 144, -34, 60, 320, -27, -15, 154, 197, -61, -75, -39, 127, -89, 6, 225, 37, 56, -95, -32, 100, -63, -5, 410, 123, -272, 132, -77, 30, 202, -17, 104, 189, -86, 11, -358, -214, -26, -293, -31, 337, 26, -8, 220, -124, -53, -138, -170, 271, 28, 104, -2, -364, -47, -66, 83, 84, -57, -2, 28, 94, -56, -102, 106, 135, 186, 6, 53, 91, 249, 235, 223, -74, 22, 14, 34, 40, -131, -335, -40, -199, -38, 61, -213, 163, -90, 91, 337, -5, -26, 148, -6, -279]
4432b79O35n86J86K71m41J52J98m98M54J08m27K38K2j14j6j36M18k50m3K64r0
4453F6NQ1n23L64j16K63j5k30r3j02K07q7K3P3P3L7j37K8J78k19M13k58p8k10
4477b57J91R2J88j71r1K37l39m8N9n8J49L1j47J31J02K9J39m50L5L57j79J58j5
4500A43p1j1P3j99R4p1k09J59J5J37j72k26L43o3m2j4P3j31J34Q7j1Q3p3m4l5
4525c1M8J41n5j24j7j88K35j15J6L8J27J6j09K54k41J53k18J90Lj23p3R0j31L71
4549B57K7k37k82J85m0J12N6l57L67j83J62j82J93l51K56m8P4L09l11K36Pk59
4571iJ46j19r2M27o55L57K6m15L82l0j73J94k5K2R0o9l28M87q3J1j95k3L72l95
4595i7J68n0k36j03M19l52L39l0k97J61j93N0K02k6P2J55k36P0R5J08j86J22k81
$$ y = [-279, 356, -230, -44, 227, -214, -62, 136, -362, 92, 200, -227, 11, 33, -81, -97, -233, 185, -65, -108, 156, 66, 71, 152, -371, -7, -123, 140, 125, -105, -198, -300, -93, -180, -157, -84, -11, 26, -111, -83, 95, -124, 289, 31, -47, -257, -66, 26, 214, 43, -48, 189, -150, -198, -139, -197, -48, -17, -164, -33, 69, 98, 237, -213, -178, 179, 0, 158, 143, 72, 61, 134, -65, 29, -42, -251, -92, -77, 60, -112, -338, 5, -58, -100, -114, -41, -172, -38, 49, 38, 121, 48, 4, -31, 17, 158, 103, -21, -38, -226, 9, -106, -90, -52, 75, 91, -18, 236, -5, 148, -70, 120, 123, 0, -73, 17, -114, 257, 284, 47, -235, -50, -90, 22, 78, -279, 88, -95, 67, -115, 78, -273, -17, -65, 9, 318, 7, 243, 250, -9, 137, 18, -74, 353, -302, 55, 81, -334, 48, 18, -155, 39, 14, 36, 126, 57, -271, 216, 133, 144, -51, -74, 298, -97, 71, 21, -215, -318, 101, -251, 88, 58, -239, -78, -271, -221, -19, -45, 27, 182, -54, 16, 111, 219, 33, 155, -126]
4618a26Q3j91N6L97l25K20Qk61J30k4o6K41J92j63J14k30r8L94j11k44n8K84l25
4641a03N2N9j31Q6j43K40k10K29N9l11J50m5K10j09L22l77M3j44J49j07K22l30
4663a89K74l4m56K65J77j56L05m92J69J91j65Q3J30K01j40k50k4mNJ89l0l58N00
4686A91k39o0r2J16Q4K12j71L1p1Q3q1r4K86L5k56j7mJ66l70L76k17K05K02m02
4710h7Q3k58K51r9j64K06J03p9q1R7O9o3J70q2K23k17J83j11p4k60L87o6k39L42
4734B34l62L47j5K7m61L88j34K74l81J38K08j78PKj9L05k37k64J55m8m7j91K58
4757Fk16J11o0J22J72l46L52k57J31K84k16K44l95L02l38M5K8j35K20J01m7k5
4779H3l83L35q4n1J99o9n3R6k30J89j9N3K74n22J95K62n10J09K31j67J66k82O1
$$ y = [-126, -43, -234, -178, 219, -106, 114, 122, -139, -9, -33, -99, 142, 334, 171, 285, 55, -43, 351, 240, -4, -62, 222, -103, -51, 8, -123, -37, -180, 60, -150, 79, 138, -173, -23, -68, 142, 33, 355, -22, 21, -123, 26, -81, 141, -189, 85, 51, -405, -140, 37, -119, 186, -306, -137, 54, -111, -28, 102, 303, 163, -87, -111, -115, -110, 79, 49, -309, 191, -48, -108, -200, -84, 0, 212, 41, 72, 1, 84, 3, -91, 195, 230, -26, -43, -47, 119, -251, 125, -92, 113, 315, -87, -4, -262, -11, -110, -274, -68, 35, -44, -125, -28, 41, -22, 148, 66, 289, 72, 255, 144, 70, -190, 197, 131, -108, 234, -128, 219, 204, 231, -230, 158, 24, 298, -83, 55, 263, 85, 92, 94, 75, 380, 143, -121, 34, -14, -61, -252, 6, -210, -99, -159, -37, 135, -211, 141, -116, 15, 299, 83, 327, -68, 234, -104, -59, -31, -166, 54, 155, 108, 83, -300, 35, -49, -100, 99, 30, -23, 73, -157, 32, 13, 66, 340, -182, 13, 275, -235, -126, 105, -62, 104, -178, -117]
4802a17J88j58l43L25k52J13J73o2L11j73j2j45L91o36O29j75J03j22j5R4N5L0
4824B02k78L2j86K37r6K33l0j64L10k34q5N4n4J32m8J14N6l9j60j21J95k95J02
4847a23J4j8j31K76j07J44k44K89K02k50J12r6k81L37m8k74M0L41l16K56p1P7
4869A29r4J99k42N5k49J01L59n12M79l69R7K55j52n4P9p9k85K04j2j3J10l2P5
4892D9k16M57n90J70j19M52j17k04N97n83M51k56j35OJ86k88M46k83K49l75J26
4913B3j64L20l29L1L09n01K15r8J9K93L0n0k51J52J11p0k76J40K08J49j30N7m7
4936A41k67J76K04k93p0J9j37qp0M52k20J8L41m82L25p5k5K04j49j17R0j42K52
4959A67r5k46L11l42RK39m45J28K42n2M60k38l62p5J57K62J52k78R8L5r4j8K12
$$ y = [-117, 71, -87, -430, -105, -357, -244, -71, -133, 178, 5, -7, -152, 239, -397, 232, 57, 160, 38, 23, 117, 172, 202, -76, -44, -230, 7, -89, 144, 114, -50, 260, 26, -59, -5, -59, 73, 25, 139, 195, 156, -4, -125, 70, -225, -123, -109, -127, -258, 18, -89, 55, -189, 100, 302, 52, 164, 68, -213, 124, 76, -198, -158, 183, -133, 123, 52, 129, 35, 234, -8, 47, -202, -101, 258, -254, 225, -144, -47, 208, 56, 2, 81, 2, -283, -79, -91, -104, 6, -26, 49, -167, 290, -300, -130, -249, 203, 86, -118, 479, -104, 347, 91, -44, -38, 148, -140, 306, 23, 272, -103, 23, -141, 179, -150, -119, 190, -311, -96, -194, -175, 118, 148, 98, -153, -1, 110, 40, -236, -96, 112, 261, 131, 188, 141, -126, 50, 254, -39, -109, -90, -227, -235, -305, 147, -73, -55, 286, -196, 129, 54, 29, 233, 84, -33, 57, -85, 167, 72, -174, 137, -205, -196, 43, -402, -274, -32, -84, 376, 138, -224, -299, -142, 120, 272, -6, 92, 127, 33, 15, 227]
4982B27m16J62j1p5K88l10J44%K12J04l25NR1O0k31J10L30l04J12K8j85Jj70P8
5006g5J40k52J99K69m16L07j58K51p3J23j85j35kJ20j9j65R0J50j4k64o6j9J73
5029b1j0j6L63k19J9k80M9L65MN5l60K63k65J88j44j60J85J66k40L24l79M85m30
5052e8j75K42j36N1L8QJ75N1n51K64J06O9J6j90N5J72k07j32N21l15N4J97j48
5075A07k91K91J57j5R9m93K65M3j36J62j51J10j25k62K52k22J32L07l08Q5k7M9
5097B9o3n9K21l06M38l91J10o0K01J03m22J81K91l31q9K13Rm1R0k65J73L5m6q9
5121f8K90k71mJ74o0N6j64j63%K44O0j66m6q7K80m6K14l39l3K90l6j37k0O8o1
5146b5m4J9P1j65J12J9q8J56l12P5L54j31J57j39k4j6o3j20J67j78J1L29j26j13
$$ y = [227, -189, -27, -38, -113, 175, -135, 9, 9, 221, 325, 0, 5, 96, 156, -75, 35, 365, 61, 173, 201, 16, 17, -153, -75, 65, -187, 12, 281, -135, 172, 14, 265, 192, 315, 130, -5, -7, 113, 94, -71, 19, 169, 155, -109, -175, -194, -21, -31, -47, 316, 97, 116, -164, -115, 250, 254, 309, -51, 212, -53, 135, -9, -169, 16, 182, -58, 266, -113, 372, -58, -233, 9, -127, -76, -38, -30, 145, 196, -355, -91, 15, 84, 100, -90, -35, 137, -70, -202, 319, 4, 58, 255, 107, -184, 107, 264, 249, 348, -145, 120, 163, 27, 189, 38, 148, 23, -239, 13, -209, -77, 230, -78, 7, -20, 29, -34, -93, 128, -178, 260, -131, -21, -81, 120, 223, -199, -18, 273, -58, -147, 66, 75, 34, 124, -141, 32, 67, 21, -68, 222, -49, -53, 121, 61, 117, -47, -210, -210, 34, 94, -72, -118, -205, 75, 29, 243, -96, -129, 161, 125, -12, -32, 36, -25, -69, -50, 21, -144, -32, -13, -101, 55, -257, -182, 172, 41, 198, 59, 35, 19, -44, -164, 3, -175, -164, 165, 39, -74]
5170g4OK41k13J22k88J79OL2L27j38k44qLm5K2J55j06L78k83q2J46j39J12m51
5194c42L40N9o0J66l05J16r9K18k07J26J11q7m41M57l0K09l98L03k28P3nJ9L31
5217C26k25J33m49P9K42k61N8J61J92m41J46J43k16J8K58J10k32k33L48k25k1
5238h9m9K18O1k21j15L13k20L62l54J91J09n99M7K75M0J27j39k8K29k72M5J14
5260D5%J26J2k63K21L2k66K46k03L7j51J51p3J88J12m48J85J76p5J8k2J56k79
5283g5J73q9J0p8J56k66J17J32j59QJ44r3j03j05p2K15J44k55K43L17l60Q1J52
5306B37j47j82K99j90J1j53K31j82J51j83k7O5J34K27j68J1k47j91N46l13J69
5327I8Lj98O6l23L97P2j27k7M00o20L73j65k0J18k51K97J32l87qM4L24k8k22M7
$$ y = [-74, -68, 173, -40, 82, -206, -27, -21, 11, 338, 200, -44, -52, -49, -94, -72, 83, -23, 355, 72, -10, 136, -3, 109, -342, -2, 57, -3, 163, -142, -26, -125, 93, -114, 12, 123, 36, -405, 52, 22, 231, -167, 136, -92, -19, -24, -5, 326, 101, 234, -215, -136, 106, -155, -97, 64, 256, -185, -39, 104, -112, -94, 164, 274, 42, -191, 157, -68, -89, -138, 80, 141, -80, -195, 118, -102, 260, -94, 97, 206, -393, -346, -71, -31, 96, -43, -71, 158, -114, -69, 45, 45, 171, 183, -80, 141, 173, -93, 153, -50, -13, -164, -13, -86, 102, 214, -234, -49, 127, 52, 70, 48, 204, -75, 98, 9, 19, -59, 97, -169, -52, 80, -79, -71, 73, -20, -123, -228, -300, -85, 59, -196, 47, 364, 4, 85, 237, 90, -92, 207, 17, 28, -125, 106, -76, 75, -108, -135, -70, 64, 291, 123, 134, -113, -304, 242, -71, 98, 101, -97, -31, -354, 43, 115, -12, -39, 361, -259, 114, -51, -71, 47, -204, 93, 225, -162, -170, -126, 198, 170, -52, -5]
5351eM5p7k49R7J83J40l84L33j47K17k26J33L46m18ONm0Q0r8K31k03j3J20M3l1
5376H8j53Q9j5L2M04p29N7M4rj04M72k60K55m0m78K14K20R8k71K14o1J21m87L90
5400I1l47J67M64n47K89k9j64N3o6j38J31p7K71N1l14J60J02j38P3j14K99m82
5422b65L21O6J26o45N73j27j33L08k11n9K33q9j36l8P4K3J30j99j58L49l7k29
5444a23N7L7L19m76K13j91j68K58n2J98j78p4QP8J46j58L68l46K62J28m48J18
5466b4K1l04J13J95j63J63j05j06J95lL2j30Q1j26K96m17L18J18o9k33L22j58
5488A6J08k1j2j64K52k81K34k14J03M70p04o0J27n2L30k08l32M00M4J57k38k4
5510f9O7J03p1j25j02K79l6NM3j53J93P5m34J57K15r6j49J57k6p6K37j01J35j46
$$ y = [-5, 40, -37, -286, -189, -6, 134, -250, 83, -64, 153, -73, 60, 406, -12, -6, -1, -41, 39, -59, 172, -31, -44, 76, 119, 88, -65, 24, 9, 41, 445, -284, -227, -183, -192, -296, 176, -84, 171, 131, -347, -133, 87, 185, -86, 128, 67, 188, -299, 91, -256, -89, 375, -172, 117, 88, -76, -23, -89, -227, -96, -173, 98, 149, -165, -5, 97, -41, 32, -82, 217, -265, 56, 122, 248, -397, 176, 49, -84, 224, 13, -46, 187, 98, -38, -76, -2, 21, 151, -48, -206, 143, 106, -123, -66, -29, 290, -186, 27, -164, -332, -74, -126, 72, -106, -180, -172, -94, 52, -106, 262, -84, 178, 306, -142, -24, -3, -307, -194, 1, -162, 1, -104, -210, -15, -18, 14, -116, -35, -161, 135, -282, 36, 154, 85, -148, 174, 16, 124, 103, 91, -73, 179, -102, 132, -82, 21, 491, -213, -273, -146, -198, 132, -76, -408, -8, 36, 193, -45, -69, -2, 101, 30, -95, -197, 82, 46, 51, 94, -59, 134, 209, -225, -68, 147, 51, -98, 59, 33, -43, 194, 93, 228, 82]
5534H2J89j61k00J24Q4M0k46r4L72j54N3o6Po8l8J85l4q7j89L80m48L85j75K30
5558A71L2k96K29j94k8j58P2K29l45K24K3k30N10l42J67l64M06J57n6o5k71K84
5580A55j89p1J27N8j56J60l08J16P5O6k03L06j08j86J4L59m78L84r3j41L01q4
5602A04q8J2j23J18k57K89o0j44K06K7j4J14j85P0J46j72jJ76K9j45L44q74N18
5625I0j64j45MK40k24J50O9N3l52J05J50K05k70P7P0j31%K22n11M91l7N1M4j92
5649eJ39k13j43J44NK33k36J21j58K03j83oL00l24J99n4j92J80j49L0J85j36J0
5672e0J61j57N9j93j89N69o4j28j17J74k00J30j15J34j8k8K05j28j16L17k02J74
5694B18q6j68m2K47k9k41N2J03k17K22K9q5M6o8j0r2J9LM5o9J26L5m3j61J09J51
$$ y = [82, 271, 110, -90, 34, 118, 158, -88, -182, 190, 36, 89, 23, 30, -38, -76, 109, 75, -12, -201, 179, -269, 116, -59, 171, 203, -93, 136, -58, -86, -244, -172, 57, -288, -64, -41, -271, 239, -103, 64, -300, 106, 263, 207, 142, -129, 155, -34, -105, 22, 80, -76, 84, -224, -108, -33, 33, -170, 136, 28, -158, -144, 215, -263, 121, 28, -113, 188, 104, 16, 28, -95, 23, -234, 55, -5, -149, 57, 84, 70, 184, -1, 69, 215, 43, 42, 218, 247, 102, 446, -428, 90, -74, -219, -215, 25, -199, -49, 20, 73, -279, -174, -24, 181, -89, -12, 58, -73, -73, 149, -362, 129, 92, 143, 187, -5, 134, -79, -222, -78, -73, 160, -76, 45, -113, 90, -93, -99, 201, -123, 76, 22, -170, 10, -139, -109, 76, -60, -50, 111, -46, 13, -180, -369, 200, 136, 8, -109, 65, -135, -5, -120, 14, -4, -32, 173, 45, -71, 246, 44, 218, 132, -36, -78, 169, 140, -101, -49, 54, -163, 59, 88, 3, 49, -19, -29, -121, -102, -99, -54, -123, 3, 38, -5, -166, -57, 94]
5720I4Mk13L39j08l06K39j9q9K41k38j37K87k01J00J08l64N58k91J37K47m51M31
5742C68j9m08k5Q7j09j2K37r6O9j11J0J73N0l33J52j47L38j97k08J67m8k7K73
5765A84k55j51L16P8m3j69j7N3K55k79K06k24p7R9o1K81l42MR2K45k19R7j61K16
5789A28j74r4L97m18J66j28Q9l87N91l52N6M96l44p5Q8j18k18N14k02J45m01L51
5811A10j15j58P6K15j05j86K4L6O4M3o2K48j80l7N7j86M65l85K04M2r4j96L41
5834B21j93j05j80O30l45J35k67J23K40l82j6J05l5J44MK0j61Q8J05L9l43k90
5856d63M82K35j60o5n7l4J70p3J49l01K85L7m02K15J08k88L74m0k83K8j14K45
5878D8q7q3J22N9q4k3K7n3J6lj19J64O9m8K5m9N5j22J26K3L0M0p5N5J26k95p3
$$ y = [94, 98, -115, 224, 116, -190, 49, 30, -59, 182, -56, -193, 94, -107, -7, 101, -263, 295, 4, 141, 388, -63, 368, 349, -59, -84, 3, -106, -118, 119, 23, 92, -19, -9, 164, 214, -119, 33, -114, 224, 27, -181, -14, -62, -89, 184, -71, -222, 94, 172, 129, -40, -57, -4, 251, -28, 178, -46, -123, -24, -85, 196, -146, -142, -50, 195, -24, 73, -88, 128, -46, -140, 257, -161, 5, -123, -34, -421, 170, -182, -126, 370, 26, -49, 39, -79, -297, 217, 15, 160, -241, 110, -5, -163, -87, 128, 23, -163, -139, -103, -39, 4, -58, 190, 10, -27, 30, -156, 309, -76, 128, 170, 76, -120, 221, 28, -77, -257, 373, 28, 163, -104, 19, 259, -123, -139, -34, -69, 75, 79, 99, -62, 26, 131, 170, -173, -463, 19, 254, 94, 29, -28, -62, 108, 35, 184, -117, 168, 205, -197, 18, 126, -162, 212, 172, -111, -83, -197, 48, -39, -122, 0, 59, -25, -48, -21, -74, -58, -61, -180, -16, 53, 5, 30, -19, 36, -86, 40, 63, 93, 133, 58, 113, 239, -56, -129]
5905a29jn5K93j71m2L19j54j35K93j7k04j63O16l94j61J03o8n9J54p8J72r5k75
5928b51L23k71M5q2J03O2K65p1l50J21J92N3j40l5K59j00j53j62N09l17K9L1M8
5951A08k5j31P4J84k47q6K68k66Q8J12m3n4J10j91j37L87m81O40k97lj32K10p5
5974A3j08p9K32j59L38n8l70pK17j10n1n9J80J54J0j23J5l6n8L03j75l3L5j59
5998h8K1J71j35J38l34K92k10M6J29r8J56K27j43k96J76m3l24M36J49n36K92p9
6020e3K7N7j71J65P5OL98q25rL48l02K16j83R9R4L50m35K30J9j94K33qk26j03
6044a92K33j04R6k53J02R0k3P3j28K72j81k62K83Q5l94L59Kj30K1P0n3M23k94
6067I5j62j70J10K39l09K1K68k04l4K09j86J78q5J15k18J84k33M55j12j72J47
$$ y = [-129, -130, -185, 108, -63, -105, 214, 60, -75, 218, 201, -3, -166, 450, 56, -105, -2, -70, -129, 25, -53, 119, 24, -251, 72, -199, -154, -236, -133, -71, 194, 123, -227, -106, 86, 139, -1, -36, 223, 123, -30, -192, 317, 0, 29, 60, 108, 83, -48, 26, 210, -37, -123, 145, -121, -33, 79, 36, -18, 92, -99, -236, 151, -330, 310, 13, 10, -122, 88, 13, -95, -174, 58, -101, 237, 179, -191, -198, 19, -91, -142, -201, -21, 133, 143, 20, 35, -1, -59, 244, 69, 36, 71, -88, -67, 104, -31, 107, -227, 65, -145, -99, 30, -68, 88, 315, 172, -124, 52, 9, -315, 121, 270, -266, 26, -53, -26, 31, -140, 25, 100, 106, 504, -321, -330, 18, -284, -68, -251, -152, -58, 292, -143, 87, 106, -88, 145, 137, -89, -192, 41, -63, 33, -220, -118, -28, -51, 22, -106, 166, -15, -277, 6, 91, -303, 56, 58, -72, -51, 19, -34, 389, 95, -67, -237, -127, 112, -197, -176, 92, -112, -146, 63, -123, 55, -30, 85, -133, 51, -182, 273, 161, -11, 136]
6088A36p4j45J28m0j53J16n9K84j48l37J46J96j02J55k45J4J72j25L12j08k58
6109a35K88k2k44L26jk15J93j31l14J57N0%L6rL33n16m1L19ok48M18j2k47K16
6133A95l02K10j59Q2N4%k85L15j47P0k53K09k66J78J26K00k83J5M66k47k80L44
6155B42n69L94n3J98l23j4M06k22k66j67L63j09K84j77m0J1j11j38L29J64l67
6176a65J04J90l86K94j48Q6J60o5m7K51m74P0mp4K70k85L44j97J23N8O6r3j1L68
6200D35p02M59q9nK70m14J43m0n4J08l17J69m3O0o2L27m03J43J49P8m29J11J14
6223Hr3N6M7L70j48Ql41J18j11J8j58K34j25j12K49N4k59J97q7J73k45K04O5J16
6247B38j85M0J08p6k04K30k27q7J14j68J36Jj04K35r0k52L16J35j28j51Q2p6K27
$$ y = [136, 62, -83, 45, 5, -148, -32, -91, 193, 45, -292, -146, 50, -52, 103, -142, -128, 44, -81, 231, 123, -135, 153, 131, -113, 213, 212, -3, 190, 59, -255, -98, -48, -48, -12, -21, 312, -204, -245, 74, 68, -180, 238, 226, -21, 195, -107, 103, -56, 26, 80, 80, -205, 110, -37, 33, -220, -11, -277, -99, 27, 227, -56, -41, 425, 178, -102, 242, -327, 67, 14, 212, -111, -125, 281, 59, -207, -374, -11, -120, 164, -13, -53, -42, -153, -291, 38, 202, -165, -61, 129, -257, 37, -111, -25, 135, 70, 23, 274, -200, -130, -134, -208, 62, -223, 121, -76, 47, 105, 171, 78, 67, 435, -267, 192, 103, 98, 368, -46, 97, 57, 3, 111, -206, -37, -80, -20, -82, 245, -158, -15, 134, 212, -217, -106, 8, -85, -29, 18, 388, 240, 248, -93, 25, -86, -68, -226, 8, -117, -229, 20, 74, -185, 12, -75, 98, -147, 57, 122, 238, 53, 93, 201, 125, -79, 151, -76, -163, -49, -217, -81, -80, -184, 51, -39, -291, 25, 160, 32, -119, -37, -113, 114]
6270A14m95O38j87K9Q6o15L94J97k8k2p0n8J01j42LP8J6L1M0j11QK42l38K17k28
6295a00rL61k17q2Q7m0P3k62L38P5j15J02j95J56k50J40K4j8j65J01m1Oj12L34
6319A91m52L3J34P1k59K70m7P5J16k31K4m9j19J82R3k21L85o1O0m6k86K83p4j50
6343g8J24q0m14N07Mk63J58J53l67L58m55M81L2k28J13j72K8K95J15j34k60j19
6365b02mK25j98K70K0l62L64O0l93J21L21k90Nq7J25o7j8K06j54P5m2Kk10K44
6389A1m0O1p8K42j39N8k9j48l2j16J4K04l1K39n83J81L87k88j17L40q7O3l9k06
6413a33oJ73j84M7L6j05K74K3p6j47J38q6L8j79J43K13j8j89j56o7M84j55n5m2
6437b9J64j99M4M0N5oj83p2O9J69j49J76Rk16K30q5j4n9K0J30K0k1n6k03M4K32
$$ y = [114, -381, 257, 70, 99, 185, -430, -36, 161, 133, 111, 41, -17, 84, -58, -55, 23, 39, 70, 110, -1, 7, 249, -89, 128, -100, -109, 252, 35, -47, 40, 0, 73, -189, 149, 224, 109, 211, 16, 172, -78, 62, 86, 68, -97, 4, -37, -31, -143, 191, -261, -228, -94, -23, -282, -12, -59, 16, 132, -99, -75, -124, -243, -61, 32, -189, 196, 135, 195, 149, -137, 146, 72, -78, 46, -34, -448, 59, 63, -200, -42, 111, -256, 102, -353, 128, 160, -68, 45, -127, -99, 196, 311, 177, -83, -202, -206, 19, -179, 91, 111, -251, 113, 173, -220, -99, 222, -68, -63, -150, -25, -92, -110, 96, -58, 17, -25, -23, -233, 11, -29, 32, -46, 196, 57, 115, 86, -62, -94, -210, -196, 8, -23, 216, -367, -186, 201, -87, -204, 136, 49, 112, 73, -133, -139, 34, -150, -103, -67, -172, 102, 125, 49, -98, 40, -46, -8, -187, -44, 169, 151, -38, -194, -261, 223, 68, 13, -29, 135, -64, -20, 20, 75, 69, -114, -186, -117, 52, -97, 79, 88, -128, 102, 17, 3, -56, -36, 94, 114, 93, 37, -166, -122, 110]
6463A10o2l69j04M56M4n5k73K36p1L00l35n5L49l89M11l37j27K45l3K23k77J37
6485B4J34l97J5K29J38j86J41k01R9l8O8k07M06k11Jj01J93j14M9k04J85rL7J0
6509F1j52R5K40k52o4L39m04K47j46L03J2P3k37n2j26J89k62j60K83L2qj60k2
6532a71RM68J68p13M02l90K95J46j43Qj24m2R7k00K68p3J65l46M13l25O5J61j06
6555C2j51L51k54k7n3k76K29j01L27N1o8J65j41j72p3L20j33J44k28J39J80l21
6577f0O4Lk17K61K4L3j59j07j99K64j61K19o1J98k74R5m9K56Q2j18P0k02MO6j88
6602a56l1J89j28o6J98O2K4k32n6J40M1nN2l7M0k31K74J30j55j31L14j74j24j9
6626h1J77k35J79j67L04j31l56J10J69k10P8j42j3L84l20L34L7n5M5j02M2r2j50
$$ y = [110, 48, -321, -425, 31, 75, 20, -253, -17, -88, 212, -123, -178, 171, -218, 193, -144, -271, -26, -59, 164, -113, 24, 158, -239, -224, 5, 143, -43, 98, -103, -4, -42, 26, -181, 225, 14, 15, -86, 107, -7, 42, -162, 23, 14, 51, 61, -91, 4, 244, -8, -72, 267, -137, 110, -36, 267, 279, 352, 115, 63, -63, 126, -136, -296, -13, 19, 11, -149, -171, -162, 306, 474, -239, 163, -227, 68, 214, 71, 79, -45, -87, 10, -190, 78, 5, 170, -176, 237, -88, -23, 138, 32, -119, 232, -22, -49, -102, -378, -149, -250, 77, 128, 60, 225, 84, -88, -161, 159, 26, 170, -58, 81, 261, -60, 4, 7, -210, 51, 75, 108, -51, -158, -357, -93, -254, -35, -96, 102, -172, -77, -126, 130, 212, 94, 164, -38, -34, 32, -156, -187, 2, -126, -192, 6, 68, 92, -140, -196, -56, -15, -20, 32, -5, 35, -196, 78, 208, 53, -78, 236, 62, -62, -81, 96, -139, 40, -127, 177, 46, -310, -200, -31, -241, -163, -305, -318, 66, -254, 80, 117, 62, 107, 5, 47, -45, -195]
6649a95J9Q8J02J90j76n9K4j86J32K8k29K65p4m0j26N6R0J37M0q4J24k62m8K65
6673H1P9l27M43m84M6K19k26O1P1k15L08l1O8j87MJ45J52j90p9Q2P8K17n38l9
6697b62J11K97l21R5l07M65j62J90l4J93l01pO7k4o0J22k04J83k05J25j23J83
6719B1m6j06q8l4K74r6R6L9oj20J29L5j61O3R7L28m53q0Q4j20j44J20Q2K61j72
6744Cj19j12J19K60j64M1J1k00K37j91j9O1K70j59l6J26j00J37o2k12K90k45j3
6767g7K35l28M49l90M6O9r7R8PJ19j41J5m9K6j9J21l7K4J80k45J04J4k25K55j32
6792B2J73l54K23J66k88L7O8j74J60J0j34K05k67o1K01Nk92N92j43m5q3o0J28
6815H9l83k1L37j60J0N24n43J43K48m49J00K36r5L14k35N4o4J04j15j7j22J57
$$ y = [-195, -176, -88, 14, 204, 28, -31, -7, -193, -61, -33, -262, 3, -71, -111, -237, -181, -91, 46, 86, 2, 126, -136, -184, 81, 160, -167, 276, -208, -162, 57, -169, -108, -37, -252, 56, 25, 93, -94, -90, 55, 207, 17, -62, 20, 98, 315, -223, -262, -151, 146, -175, -80, -387, 78, -84, 106, 72, 265, -36, -43, 24, 0, -60, 62, -142, 41, -164, -39, -162, 21, -25, -131, -219, -253, 21, -75, 21, 60, 54, -66, 63, 98, -63, 0, 97, 425, -28, -108, -24, -144, -288, -168, -86, 175, 3, -116, -228, -109, 151, -13, 28, 39, -161, 76, -115, -134, -73, 197, 38, 2, 128, 28, 165, 103, -109, 181, -64, -77, 158, -170, 279, -111, -65, 4, -93, 5, 12, 131, -10, 5, -44, -18, -37, 84, 47, 71, 251, 6, 110, 124, -101, 154, 22, 195, -159, 64, 230, -58, -21, 47, -127, 33, 43, -91, 114, -153, -214, -13, -8, -300, 292, 149, 104, 21, -39, 89, -294, -315, 22, -138, -128, 396, -147, -4, 244, -205, -105, 131, 36, 350, 115, 169, 105, 209, 94, 77, -45, 112]
6837A12j2l13J41q1l7M1P9q4J57j78M63l88j22oP5%L11j02l0M1k78J38L43k66
6861DK96k85j41K74k18j9j70M12j34K76n32K95j25K92j15j20j25L4j65Q5K71j77
6883h7K55L7m48P4L11k2k90L63j70q9J84k74K02K01j80r5j63O7R5j04J31k58K85
6906B5J01m3k27J10j06L17j23L0j04L24k52rj33l0M27l09P9q4R0j5J55j77l5p3
6930f2j50L13j73L29l32Q9k44L01L4Kj53j31M21om1o1M1l31J48j4j10R0K80l30
6954i0J45J39o1k43l2J55m3k14L64j96R3J78k32l4J30j98J49k99N8K14J00k30
6976a47J11j96K28J52k60k75N02k58J57l41l1O38k45J1K21j79k3J24k38o1K93
6997A83k20J34o3K0k30K23JM2j37j23L54m16K84j36Q5j65m7K49k09R8M30k25l23
$$ y = [112, 100, -213, -72, -153, -190, -149, -70, -154, 3, -175, 288, -100, -222, -228, -153, -153, 158, 56, 26, 67, -211, -73, 270, 4, 300, 15, -126, 148, -70, -89, -259, 153, 19, 295, -237, 58, -67, 225, 110, -10, -135, -101, -266, -181, 90, -87, 168, 205, -243, -169, 142, 120, -170, 193, 23, -66, 118, -156, 46, 247, 67, -28, -191, -124, -29, -133, -2, -260, 25, 126, 83, -144, -34, -140, 177, 54, 84, -20, 304, 52, 43, -90, -120, 307, -2, 77, -7, 83, 68, 223, 46, 11, -62, -212, 101, -72, 257, -75, 14, -230, 71, 105, 107, -46, -177, 244, 238, 197, 136, 177, -154, -6, -20, -130, -40, 240, -90, 55, 194, 133, -110, -142, 13, -30, -244, 120, -76, 17, 195, -37, -71, 59, -139, 10, -289, -231, -17, 83, -147, -36, -232, -4, 148, -112, -387, 115, -143, 14, -327, -358, 280, 35, 46, 267, 88, 65, 189, -49, -110, 183, -37, 97, 34, 54, -176, 47, 48, 90, -47, -170, 184, -232, 52, -84, 1, -164, -211, 38, -171, -73, 357, 132, -191]
7020a91J83J38k15J46j01k70L32J50m13K90L5j55K69k84j6L96n33J92K26J00Q3
7041C62j78l25L97j95k40K97M9k48k2J55O7m22K58K5r6L55m1k87J01l6L5O1k57
7064a85K01o7j21O9K82l36J67L33n69J18K00j52K47j75l7M5K68n25L28j64J17
7085D4P6j94K75j58q8K08q4mJ73k7l46j11L42k82J50Q7j46qj29k3M13j89J56l76
7109b41J83k03k35M03M0J21l9R9k85J56J01j90K21q6j33K13l8RJ17j40R9k55R9
7132A6R5k24q2L33Op7j38q3J09J77j86N72m82j41L1O4J69k23j22M29j59k50J48
7155a8j47j11L65l9J96J58k86J45m80k3n9K54J76k3J05m34K79r4l9L65k59J76
7177B07j50J51m25L24l69K10J51q1J23p6J25K0j80P6n6l8k55J97K55p0j63J53
$$ y = [-191, -8, 130, -85, 61, -40, -310, 22, 172, -241, 49, 84, -71, 198, -86, -102, 294, -239, -47, 179, 279, 362, 184, -141, 256, 61, -179, 118, 167, -81, -103, 52, 119, -303, -45, -20, -116, 239, 198, -89, 12, -24, 11, 72, -185, 16, -51, -172, -103, 179, -157, 10, 343, -226, -108, 92, -60, 187, 12, -25, 20, 288, -237, 91, -73, 44, 120, -74, 201, 43, -45, 163, 79, 75, 248, 221, -125, -236, 106, -176, -26, 61, -85, -93, -222, -245, 168, -21, 135, -241, -58, -261, -496, -93, -53, 68, 29, 128, -157, -1, 100, -90, 131, 45, -88, 125, 87, 96, 213, 73, 172, -83, 16, 111, -113, -195, 138, 144, 67, -71, -154, -45, 132, -54, 518, 36, -105, -74, -10, 159, -64, -186, 243, 84, -166, -18, -165, -276, 89, 50, 246, 404, 118, 263, -217, -240, -299, -45, 131, 108, 213, -221, 58, -36, -75, 290, 31, 207, 57, 208, -217, 107, -262, -52, 99, 18, 141, 65, 190, 210, 30, 106, 50, 12, -243, -46, 209, 139, -24, 129]
7199A29k62J35j24L18k79J30k7N4J53k21k65L41j66J78M6l77k9L69l96P8L34k16
7221i7M38r9k84L99k45j03n6j04J44K8m5j23J65j05R5J53j61J68l14K74o7N9k92
7244a72O8J43k86J0K7K11o3P7L22k10l06K8l5J95OJ41j92J01N6j43k9j2r5J48
7268a0O5Kk8P8j98l0R6O7K9Q1j50LLm47M42j61j06L87k91J49j19K67l79L35j92
7293a07j49L55k1R7J44o50M50k50J55k41K07R0k62K20J2m2m6j21J26O9k5j35p
7316a31L31j24M1j4k36M30m94L8K6K64j16L7m3j22K32j79P8l06K97J98mj78k44
7339b19j1K07K22j43k04n9L7P7N7N6j14L4K52j11k0q1j59Q4J93N6P6k39l9K67
7363B19k30K34j23P3k58L53k15l38M34j19L5J29l32m0K50k9q9K31j34J56o8p4
$$ y = [129, -133, 2, -122, 196, -83, 47, 20, 74, 227, 6, -259, 82, -84, 94, 140, -237, -266, 103, -293, -215, 119, -97, 341, 242, -42, 357, 112, 9, -47, -151, -7, 21, -24, -147, 18, -87, 8, 161, 0, 168, -146, 128, 61, 120, -172, -104, 39, -247, -237, -210, 1, -62, 15, 337, 127, -179, -151, -186, 9, 15, 156, -36, 65, 121, -22, -51, -63, -158, -10, 55, 57, 29, 107, -91, -121, -25, 42, 71, 152, 2, 5, 8, -439, 3, -158, -264, 123, -168, -19, -138, 129, -250, 85, -107, -256, 99, 78, 175, 319, -331, 119, -131, 24, -217, -10, 80, -182, 38, 50, 8, -38, -159, -33, 36, 11, -124, -131, 200, 76, 117, 103, -133, 297, -197, -159, -133, 131, 15, 52, 9, -113, 119, -60, 18, -288, 9, 207, 203, 25, -219, -230, -23, 199, 56, -148, -207, -170, -93, -36, 20, -94, -60, 192, 81, 61, -20, -179, -95, 98, 154, 230, -9, -48, 219, -11, 223, 100, 173, -85, 268, 53, -285, 149, 30, 65, 194, -138, -178, 72, 43, -46, 185, 51, 207, 139, 65]
7385F5j35L46k25K8l18J3K00o7K8J51K7m00K81K14k39j35J36J87J3j97K15k48
7407f0p3j9J68J19j26P2k56J52o4M6m2M2K65k46q3J79q3K73k03j22M0K03k60K69
7431A91j73r0L00j1j19o5O0p4n9k32N67j9l79L4L96j70k02O6l13N43j83L9L11
7454D18o08K20k5K04k08q3M1N1Lj31p3J80J39L37n85L70k99K0n9K24k67l1Q1k18
7478b99K57j87j07K38K41j67j67R6J4J44k80L53j12L1R3j29M8j69n0K31Q9l09
7500a41J97j10o1J41j05Q8Jk48J53J47J36k70o5K26k4%j37j54J19K28Ml81K61
7523EjOL86l81n0J20p6J00K66k78O0j39l6M9J35k70J25J0j98J53q0J54jl8k34
7548b13N9J58l18M68k27p1j51L05r4N5M3J47R4l61K08l73K54pj21J87J13j96K1
$$ y = [65, -70, 276, 51, 79, -239, -226, -26, -93, -65, 86, 113, -287, -6, 208, -31, -166, -30, 157, 170, -27, 188, -60, -133, -152, 16, 135, 9, 81, -175, -23, -87, -41, -83, -41, 224, -22, -105, 74, -9, 264, 61, -61, -21, 182, -78, 191, 18, -72, 228, 217, 98, 33, 93, 19, -40, -272, 295, 276, -103, -69, 327, 157, -45, 21, -292, 251, 68, 107, 418, -190, 30, 5, 209, 1, -82, -41, 10, 13, -118, -191, -11, 128, 465, -120, 250, -49, -29, -88, 136, -131, -162, -81, -299, -42, -229, -336, -98, 143, -24, -191, -95, -81, 63, -217, 136, 24, 55, 148, 19, 67, -102, -152, 79, 168, -141, 56, -54, -115, 26, -79, 9, 10, -238, -85, 62, 198, -72, -137, 89, 65, 65, -72, -226, -107, 121, 125, -256, 5, 4, 10, 396, 15, -35, 85, 9, 109, 375, 97, 157, 18, -18, 31, 166, -104, 21, 31, -167, -14, -94, 60, 59, 21, -213, -154, 4, -314, 154, -73, -144, -295, 10, -84, -29, 14, 161, 255, -106, 102, -271, -17, -24, -145, 42, 155, -41, -20]
7571b0M9K79n34P7J82j05M0J00j98K14p0L2k8l7o4J50n0o1J84j3m50J83Q3M3K24
7596B10l55L85m35N0K89J46k30M0K81l85J2j14J19k5K35k8k43K20k59K27j33O5
7618G2m9k3k1p8M29k66l7k03L09k42K18n5l20L75n0O2j91N1jJ78l42O3j96L62
7642D5k7J34l34L69k14R9Q1l38J14J06K4j43J40P4j00j41J98k46J40J17q7j45
7664a34J39J02j62j91K03J16O6l60J60K12L8j45N9j4o9k56K30K44k88j19N18m66
7686a17jJ92k78L98l31OM22l49K87j32J40q1k28N6l9M75m32P7O1l95L50p9o6J41
7710G7J8j68l8r9o1O20l59K63k63rj08J39J42j68jQ1J1j51p6M60l72j6j76J74
7734h0J60j31J74o1k0j77M22n05K4J07j1J26r2L14k07k4k74M03j77l51N20j80
$$ y = [-20, 29, 308, -226, -149, 33, -72, -32, 68, -130, 84, 14, 46, 18, -19, -83, 67, 17, -44, 140, 127, -323, -140, -57, -14, 210, -145, 240, -195, -145, 144, 290, 60, 100, 381, -4, 8, -106, 13, -12, 223, 195, -48, 172, -87, 140, 7, 72, 23, 0, -21, -99, 330, 64, 27, -176, 133, -109, 109, 54, -266, 109, 59, 121, -70, -19, -20, 158, -184, -121, -317, 45, 18, 152, -182, 187, -27, 72, 153, -185, -71, 35, 59, -84, 56, 130, 30, -111, 87, -159, -19, 98, 11, -134, 5, 107, -55, -246, -43, 73, 139, -221, -61, 151, 189, 44, 103, 89, 20, -236, -6, 238, -50, -169, 349, -117, -118, 74, -204, 194, -137, -131, 291, -58, 229, 97, 237, 156, -72, -16, -55, 420, -12, 65, 126, -269, 81, 2, -64, 77, 95, -73, -111, -210, -271, 349, -10, 253, -10, -19, -127, 12, 154, -14, -15, 66, 77, -74, -150, 310, -62, -78, -254, -80, 80, -51, 123, 62, 42, -135, 287, -218, -194, -87, -98, 28, -64, 250, 43, 19, -255, 148, -29, -380, 140, -40]
7756d0R8l63J58K30j43J46j11j14J25J88l69K75r7J65k83J40j83M3J09N3j33L9
7778f7k2J71J78k80l7O7L4j70K80m0R5K4k13r9K09J98k69j60J7l1kJ00q7J58j26
7803g2j45L51m11L28j63j03J37l2M8m9N4o4K1K06j25nJ32p0J18n0o3k0j96K21
7827D8O9Q2l39M2n6K71k91K71J48j77J45p5j18J70n03M40Km07K28r9J94O2n9l48
7851c00J33K25J25J01k40k11J16K04k94K55j47m7RPJ9j26K32n3j62M68k80Kn5
7874a9j2q0Q9K06j31p8Q8k03k01J64K4J14k3J64l59J4K90k61O20n34j53M25j57
7897a3O6J54j10j00l8J1J31J66m32J48K9K09p9Q8k68j28L58q5J08l5k9j8q7k73
7921b27K02l03N00j44j89L43q9k55K31k06k3K16J4k82K01O9p5J24l12J58K6m2
$$ y = [-40, 58, -305, -147, 83, -60, 86, -25, -139, -14, 174, -195, 80, -17, 148, -135, 5, -178, -135, -26, 27, -106, -67, -89, 82, 260, -20, -57, 10, 44, -126, 154, 114, 209, 233, 20, -79, 130, 328, 59, -101, -84, -115, -117, -17, -104, 54, -72, -217, 134, -277, 51, -112, -215, -78, -110, -62, -111, -57, -121, -100, 106, -19, -24, 108, 38, 156, 106, 43, 23, -173, 48, 117, 199, -140, -98, -154, 117, -174, 97, 245, 68, 213, 138, 20, 190, -313, 127, 129, -278, -50, -149, 45, 107, 48, -300, -167, 58, 183, 284, 44, -167, -51, 153, -141, 114, -33, -80, -71, -64, -45, -171, 61, 8, -154, 314, 34, 36, -19, -31, -111, -22, 184, 53, -25, 63, -140, -341, -177, -153, -39, -62, 102, -257, -243, 47, -214, 406, -128, -281, 144, -13, 53, 207, 97, -3, -41, -30, 101, 267, -165, -17, 12, 221, 142, 230, -38, -166, 192, 107, 215, 180, 151, 133, 46, -227, -25, -328, 172, 28, -161, 182, 93, -162, 69, -137, -160, 56, 70, -212, -11, 58, -17, 107, -205, -47, -21, -63]
7943f3K19l15K62n7J5K38j33r6j96N23l85l05N45k22p8k11k1L35J91l69J90k33
7965a66L36j39k41K47l5q4M5k05O39m31O1J83j82k11L08o3j70j18O11m36J88k99
7987a62O3O10m30k4J97Jq7K41m17K52m19K19R1J22j67j73L02k56q8j33J41R3k38
8010b62p7J18nJ75o7P3j85J29O8J74j18r2M7M3j00p7J62r9q2K35p6l63K17P7j4
8035i9%O3O2J06j75KJ3J39j52J5J99k99J85N2j58P4M6L7l89M02j92JN1K3l5l1
8061f0Q1k9K69j69m6J39k69J03j28L8KK11j53k09L38n3j04j76N03l23J57q1j06
8084f5K60l09J8K33j88p2J01M2n5L97k60p8j1P2J34j18k68M0N08n23j39K15K60
8107A94q7k56K54q8j09J90jm15L85l8%m0N9K81m10j81K78M9Q0q0j45r8J18j00
$$ y = [-63, 156, -159, 103, 46, 61, 299, 166, 70, -126, 397, 12, -293, 252, 30, -48, -259, -280, 55, 246, -123, 67, -166, 170, 31, -210, 37, 2, -82, -37, -242, 397, -34, 27, 210, 28, -183, 125, 62, -108, -226, 385, -51, 137, -162, -99, 511, 81, 57, 254, 255, 168, 409, -8, 244, -175, 44, 135, 257, 90, -83, 219, -37, -125, -258, -117, -24, -262, -339, -221, -226, -51, -118, -45, -230, -101, -33, 141, 23, -69, -22, 21, -79, -156, 6, -93, -175, 60, -16, -379, -162, -85, -99, -99, -36, 26, 132, -43, -41, -28, 111, -41, -26, 173, -126, 59, 111, -47, 27, 73, 110, -279, 123, -69, -68, -17, 6, -29, -60, 21, -8, 261, 92, 46, 185, -84, 19, -109, -71, -69, 142, -11, -220, 118, 65, -39, -215, 288, -35, 122, 41, -65, 195, -114, -96, 137, -51, -123, -22, 20, -35, 362, 102, 24, 13, 85, 219, 101, -167, -127, 381, -142, -281, -66, 194, 107, -149, 105, 17, -92, 98, 97, -318, 67, 29, 29, -11, 48, 329, -81, -262, 16, 65, 145, 65, -80, -178, -60, -160]
8131a60o1K14Q5rJ26Pj12k02J85j72L34k10J40k83J96K9J9N3k67J7q7K53l07J93
8155a9R4j6Q7k39M6J38j90n6J89m7j78J59n2J15n7Q5L0p9q8R0Oj39K30L9n4l62
8181b68K83j35J83K55k41j51J4K04j34J80
$$ y = [-160, -221, -7, 78, 69, 195, 202, 90, -112, 73, -99, 235, 25, 165, -118, 78, 107, 126, 179, -88, -71, -158, 95, -212, -19, 75, 59, 146, -93, -47, 91, -99, -155, 34, -13, -191, -32, -84, 31, -26, 59, 89, 10, -78, 12, 18, -121, 109, 148, 94, -268, 15, -120, 63, 318, 77, -74, -60, 144, 10, 190]
8191A90
$$ Imaginary data points
##PAGE= N=2
##DATA TABLE= (X++(I..I)), XYDATA
0@%%%%%%%%%%%qJ6j6J6k4L2l9M7n6O4p2Q8j05J29j52J76k06K36k70L10l52M00
33B14m55N13n79O50p28Q16r12J016j129J253j389J539j701J878k073K284k516
50a319K773l056L368l714M100m535N029n595O249p015P928r038J0421j2206J4605
65G995j8021K3318l2734N4617k06644j15681K20135M1939L2197n5281L7246O3732
77E2818M9245M0455K8603n9452j9386j0555M051M101n4569o7862j2863m6566k3158
90a15138J9345L0142L3580l1123r4970n770P1586J08346R8221L292l3658L692
102H7545O075L6210J5224o4695p2538n4278j5282M6227k483n6206l2455j6213
114a22869K6938M9442J8748M5337L8133k8864l2070j5212K0859O6321K0265j5950
$$ y = [0, 0, 0, 0, 0, 0, 0, 0, 0, 0, 0, 0, -8, 8, -8, 8, -16, 16, -23, 24, -32, 32, -40, 48, -57, 72, -80, 96, -110, 126, -144, 166, -186, 214, -241, 272, -307, 343, -385, 431, -481, 535, -594, 659, -730, 809, -892, 986, -1087, 1197, -1319, 1454, -1602, 1766, -1948, 2152, -2383, 2646, -2949, 3300, -3715, 4213, -4825, 5596, -6610, 7995, -10026, 13292, -19442, 35175, -171469, -287150, -67015, -25076, 7121, -48160, -10914, 52818, 102063, 142518, 171121, 111669, 92283, 81728, 85779, 89880, 35311, -32551, -45414, -91980, -115138, -95793, -65651, -32071, -63194, -158164, -163934, -92348, 15998, 114219, 117511, 83853, 87545, 93620, 129830, 145054, 80359, 7821, -46457, -61739, -15512, -17995, -74201, -106656, -122869, -95931, -46489, -27741, 17596, 55729, 26865, -5205, -20417, 442, 66763, 87028, 71078]
126G1078j0118l7090p791K6877o555l2003o7903n6872M3399O0500R397j5724l6520
139e9325M210M8798K5696L2430K6019k3886k0551k1144k1602J0196o638q022J7990
152D171j1473j0487J6371J1095K0024j3210n6710j0106K6809L2296K8606k6928
164A0458l8102K084Q598L1454K9342j7874j6956j4856j5414J7635j013k0836P876
177a7604O017J6285K4174m988J1393J4663k6922k4413k0227r317K5092j432k4126
190c1405n902j4468J0693L8572J5937J3023l994k0376K0582J8423j1190q297k0421
203A177l856K1427n456k825M088k0876j0399j1290k0422Q091J201l386J9400P99
217b2327L455K6192J7600K7788J6993j9015k836r6j4166n353k9802l3086k534
$$ y = [71078, 60960, 23870, 16079, 42956, 36401, 4398, -63505, -120377, -76978, -16478, -7081, -22805, -59325, -55115, -6317, 19379, 51809, 77828, 53942, 33391, 12247, -9355, 841, -5797, -13819, 4171, -7302, -17789, -1418, 9677, 29701, 16491, -40219, -50325, -23516, 8780, 37386, 10458, -27644, -25560, -16962, 14492, 43834, 25960, 9004, -5852, -21266, -3631, -4644, -25480, -17604, -11587, 4698, 28872, 23884, 35277, 49940, 23018, -1395, -21622, -30939, -5847, -7279, -31405, -37307, -51775, -41082, -2510, 13427, 26450, 22456, 2080, 22662, 41085, 29895, 21598, 1177, -2679, 18748, 13292, 10467, 14555, -6321, -16720, -28010, -48432, -40341, -39140, -42526, -23126, -22327, -18872, 7320, 24920, 52708, 69701, 50686, 47850, 47754, 33588, 28235, -1567, -34653, -37187]
230c7187q580J364J3399r487M775J0818j906J8633J0002l016J8229O142M645J6220
244D4051n991L582J2845j4700r634j4488k6114m835j7699k5858j597p501L571
257f4368K4870R846K0488K3904M297K1275J5700p164L306j1088j3371K933j8543
270A2085j4465j46j5290l077q54j5830L250j944q600J2586K967L991K2405Q397
284E475J7580K2058q32R221M889j4362m472j8034k5974p019j9033j2995L628r265
298d9135N681J5397J274J6523J2823q37J4869K615k903J1355n847j144Q281r147
312A9805N29n9j5976p53q835j9161r40r919p150J1442o64J0119J8962K470J5481
327A5351J4730j744R463l905j3747l72j5393j2314K192j0943j032O029o206R282
$$ y = [-37187, -45767, -44403, -31004, -40491, -35716, -24898, -26804, -8171, 1831, -1185, 17044, 23186, 27831, 44051, 38060, 41642, 54487, 39787, 30153, 15665, -10449, -15284, -32983, -58841, -60438, -67939, -64368, -39498, -29652, -9164, 14740, 19037, 40312, 56012, 48848, 52154, 41066, 27695, 30628, 12085, -2380, -2526, -17816, -20893, -21747, -37577, -34327, -36271, -44871, -32285, -29318, -25327, -2922, 5475, 23055, 45113, 44281, 53502, 58391, 44029, 39557, 21523, -4451, -11470, -30503, -43498, -39870, -49135, -43454, -28057, -26783, -10260, 2563, 1726, 16595, 19210, 16307, 27662, 21815, 20671, 28952, 19805, 20334, 20275, 4299, 3546, -5289, -24450, -25390, -35309, -42459, -31017, -31681, -21562, -2600, -130, 15351, 30081, 28337, 37800, 33895, 20148, 19776, 4383, -7931, -5739, -16682, -17714, -11685, -17891, -8609]
341h609O277o864P356l279o565J0957j302L272J0578o762L545P252o437P476p20
356A6175j2335M87j1984j1456M595p241J502J1498j853J2373J2807n22R696m186
370A9556j5105M57q346k997P741j0507m400K059p037J2742R837k608Q557k034
384G915n439Q069p063l874M697q328M467Q914l049P906j809j4846l649j3109p692
399b6890J2007Q05K933M885q322R363J6321N158J2621r65r134N509o204q850m746
414D491k1361r317L503k055J1884P920n053N562m633o948J0565M125R586J3989
428B2258p335j951L608l165J1159m6j5552l342r099m850M415j6896j5849m478
442d1123m082J9828K2731O442J2976K381l859Q077l850j450Q958p386n557n996
$$ y = [-8609, -2332, -9196, -1840, -5119, -11684, -727, -2029, 1243, 11821, 5059, 8604, 15856, 9419, 16895, 16175, 3840, 4327, -7657, -19113, -14518, -21759, -20257, -8759, -10612, 1761, 14568, 14046, 23742, 19556, 4451, 4908, -3438, -6435, 1306, -9201, -13601, -11542, -18579, -5837, 4000, 1392, 9949, 7915, 2476, 10545, 3482, -392, 4305, -4023, 444, 9358, 6309, 14215, 12406, -2440, -6089, -19198, -26890, -14883, -14078, -11145, -6260, -14582, -5219, 11102, 16260, 28881, 27916, 18782, 24291, 18087, 9237, 4491, -16870, -26187, -22684, -24739, -12855, -4935, -9988, -4426, -9059, -16007, -5442, -1317, 8269, 22258, 14923, 12972, 16580, 13415, 24574, 24528, 8976, 5634, -3465, -8315, -3900, -20796, -36645, -41123, -45205, -25377, -2646, 3796, 16772, 19153, 15294, 23371, 19521, 18071, 27029, 19643, 14086, 8090]
456H090j6770R34K016q478k98q865m545J6459N768n13l690j6116O056K2983J5200
471A8231J8006J191j1546J377o669r270j298j4697q217Q33j1817p39K079l755
485b6291J1265L140l193J3037J0049J3235J1560j6095j6178l061J331J9371R615
498B7785j2669p375j0279n902P120r010j1278r82m527J0384J1761k425O948M376
512C927j249J0039P62L568J4612m091j3033j5655k1980K723J4616L605L767r688
526h077r611J2074P704J580j214j5290M92J5535N196O333l876j2432L683L28j182
541A243R648k379j891j392j7771q401K794L567J6729N238q954K432L226Q524J1305
556B3918j4426j6765l620l57J4295O850j4287o226m025J928J6040L748r7N063
$$ y = [8090, -8680, -7746, -5730, -14208, -14506, -23371, -27916, -11457, -5689, -6202, -9892, -26008, -19952, 3031, 18231, 36237, 37428, 25882, 27259, 20590, 11320, 10022, -4675, -12892, -12059, -23876, -24615, -22536, -26291, -15026, -11886, -15079, -2042, 8007, 21242, 32802, 16707, 529, -2532, -1201, 18170, 27785, 15116, 7741, -2538, -8440, -1320, -10330, -21608, -22590, -27117, -16733, -4972, -7397, -449, 3927, 2678, 12717, 13479, 17047, 31659, 27568, 14535, -1120, -23100, -20377, -5761, -2156, 1611, -8077, -17688, -5614, 2090, 3670, 2456, -12834, -12342, 3193, 8389, 14722, 10846, -1586, 2097, 2425, 1243, 10891, 8512, 6621, 5229, -12542, -20943, -18149, -14582, 2147, 7385, -1569, 863, 4089, 12613, 23918, 9492, -7273, -10893, -11250, 3045, 9895, -4392, -10618, -14643, -12715, 3325, 7073, 6976, 12039]
570A2039o991k181L38q993M772O317k819J891o079l561J2703k15p877r400j5085
585b5141N978J7057L589K678p493p836J3838J1612N920M148j1598n978L085p943
599A916l980n132r988M302Lm392P763L742M132O477r432l120P341N310J3419J931
615B0292j3294k193N09N067J1096r507j3773m947o899L326O47j2359o96K349K294
630a8088J3977N299M038J1389o30J55J885p019K667L249q170m802j0161p907R379
645d739J663m300l593j0480L049J1115l09K705j054k443J2096Q643L337P064m579
660A8175k651L757q194n202l943j0710l74l897r600L718K572M695R545m114j76
675f399P610J682Q170K895q042J529J255M51P081n953p616Q67n297J47l54j1338
$$ y = [12039, 5048, 2867, 3205, -5788, -1016, 5301, 2482, 4373, -1706, -5267, 7436, 7221, -656, -10056, -25141, -19163, -2106, 1483, 4161, -3332, -11168, 2670, 14282, 20202, 24350, 12752, 6774, 9859, 1916, -2064, -7196, -17184, -12882, -12879, -17271, -9508, -5766, -1634, 4843, -4589, -7709, -368, 4942, 18361, 20292, 6998, 4805, 5314, 10381, 21477, 11970, -1803, -6750, -13649, -10323, -9676, -22035, -22731, -20382, -18088, -4111, 1188, 5226, 16615, 15985, 16140, 18025, 11006, 13673, 16922, 8752, 3950, -6211, -14118, -4739, -3076, -7376, -10969, -21449, -18400, -7285, -7594, -4889, -5943, -8386, 3710, 12353, 15690, 22754, 18175, 15524, 19281, 11087, 5885, 1942, -8768, -9142, -13039, -22639, -18921, -16349, -11654, -2109, -6223, -6399, 1211, 2893, 11063, 13958, 5916, 7445, 8700, 9151, 16232, 10279, 2663, 3530, -1767, -1620, -1974, -13312]
691a3312j180M83m001O116J542J853J1671K533K129N552m296K090L513o941q26
706F926m333p371N093p74m472J347n548J807O635m340O18k03m526N772K048j534
722b855P084l78J316P253l734j022O09p282J540j259p768J827j036j609N282k694
738d726n26O597k093K678K096o841J645O66l252N502j470k174O644j141J598K925
754H128n794L40P55n534K123k225m859M486k019p99N308k713J822L768m980K259
770F6J59m461M829J77j631N509j888J201N655l693l50O8o723J332j913o437K333
787e767l357k404O035q79K769O190k757L193K775m076M315O57k894M137l351k187
803B399L851m770o26Q82o844Q3q50m880L111j326l290N621N48M470R007q4L131
$$ y = [-13312, -14492, -14009, -18010, -11894, -10352, -8499, 3172, 5705, 7834, 13386, 9090, 11180, 14693, 7752, 6926, 2593, -4778, 315, -459, -4931, -3584, -9132, -7325, -690, -5030, -4412, -4615, -9141, -3369, -1321, -2855, 4229, 3851, 5167, 12420, 8686, 7664, 8273, 991, 2531, 1272, -6496, -4669, -5705, -7314, -2032, -4726, -5252, 1345, -748, 1930, 4026, -2815, -1170, -504, -3756, 1746, 276, -1898, 4746, 3605, 5203, 8128, 2334, 2674, 3429, -2105, 18, -2207, -7066, -2580, -4599, -5398, -90, -2803, -981, 2787, -2193, 66, 225, -4236, 593, 770, -861, 4648, 2760, 3961, 9616, 5923, 5573, 5641, -1082, 250, -1663, -8100, -5767, -9124, -11528, -5493, -6372, -3603, 2587, -170, 3023, 5798, 1722, 6037, 6694, 3800, 7937, 4586, 2399, 6250, 1480, 854, 1736, -5108, -5025, -5875, -10755, -7644, -8970, -12260, -6639, -6091, -1621, 7386, 7302, 10433]
820A0433K606m797J930n67n158J725m748n267J495m793q90K334n222K042K322
835f555k096N609J857j933M649j021J528Q450M48K973K152p387j540k124p373
850b363J068m499n502J898l741Q35N564k554K879M525m83P376M665j400K974l610
866G632m180L791j299Q25K599o774k335k310o711J549k014m043L463q44J380P767
882a504J00K857L930k509N041M206p17L079m515q121r31m534n52L843m025m45
898d797J97m613L677P65l258L985r01J213P678L73J817K951m837J097J858k227
914D978M045j724o711j811o373k494M713j825J943J919k930M304L314j881L219
929B686l146k189O035Q74J625K526n631j208J267l519L639J40l707J534m574m057
$$ y = [10433, 13039, 8242, 10172, 9605, 4447, 6172, 1424, -3843, -2348, -7141, -8031, -5697, -10919, -8877, -6555, -8651, -3042, -1185, -3118, 1531, 510, 2038, 10488, 10936, 13909, 16061, 8674, 7134, 5010, -2363, -1295, -5794, -11296, -9398, -13139, -12304, -6740, -9294, -6415, -1890, -2373, 5003, 9668, 8268, 11242, 7632, 3452, 7243, 5944, 6769, 9368, 2594, 259, -2051, -8762, -7213, -9227, -13270, -9807, -10651, -9271, -1504, -1404, 1453, 5383, 2874, 7915, 12121, 11404, 14483, 9968, 1847, 916, -3618, -4170, -327, -4352, -4797, -4600, -9213, -5536, -4771, -8029, -4044, -4945, -3732, 3946, 4319, 6136, 9087, 4250, 5347, 7205, 4978, 9023, 7299, 588, -1223, -7596, -10090, -5377, -7202, -5259, -3340, -6270, -1966, 1348, -533, 2686, -460, -2649, 3386, 4260, 5885, 8411, 2780, 1572, 2839, -680, 2959, 3099, -608, 926, -3648, -7705]
945g705L038k300J686M109k814K666L452p60M328j844n166K463j093J842N246
960G148l815k131K18l982L509J257l640K216j455l283K422l525j225L611k193
975d868K641L209j974N177J525l156J594l803r88N607j148p05n4n907J431K241
991H22k889J933k504k934L736j227j425K031l259K740M628j329L863J660j586
1006D260L681j984m438J868k971n0K273n487j193J50k179L628R5l662K965J86
1022b858O90M537k889J8L884r65L691J278l837K649m53k980O56n316l155K301
1038b749k694j19J139m287L741L276r15M074j119n08N425o87k76J658l797J762
1054C924J809l975J74j555l052L308k540l947Q01k625J500M114k810J794K489
$$ y = [-7705, -4667, -6967, -5281, -1172, -3986, -1320, 2132, 1372, 5700, 3856, -1310, 1153, 60, 1902, 7148, 3333, 1202, 1420, -2562, 947, 2204, -1436, 780, -675, -3958, -1536, -5061, -6286, -2675, -4868, -2227, 982, -992, 4185, 5710, 2554, 4148, 345, -643, 4964, 3816, 3111, 3057, -2850, -1419, 822, -2067, -134, -2638, -5572, -1836, -3063, -4488, -2457, -5716, -2976, 1652, 323, 4186, 5846, 4260, 7941, 5957, 1519, 3387, 416, 366, 2639, -2848, -4041, -3891, -6070, -2442, -2347, -6009, -3044, -2858, -2168, 2369, -520, -502, 3382, 2417, 6108, 7386, 3549, 6198, 5745, 2765, 3421, -1895, -5050, -2749, -5443, -5562, -4423, -8710, -4969, -1693, -2608, 1466, 347, -161, 5264, 4577, 4301, 5959, 2162, 3924, 5733, 1758, 1932, 377, -2675, 633, -1907, -5854, -5053, -7678, -6178, -2064, -4874, -3080, -591]
1069e91J56O013R51k838K416k257n8K495m229j122L13l421Q96j065l592K649k62
1086c546q11K851l015QM598r24J889J665k780M389K531j371J896m400l301K476
1102B155k365q16N47m611J026J154k310K594l29p95M590n09m72K531j720J283
1118A953K492l709J305Q65q69L600k205m097M8k818L96K752l625J79R55k023L849
1135i52N36j793L120K7J6L855k542k02J504k748P65n1k921K901M99k102J481m105
1153b712j533K935j605J039J021l277K904J755j206K565j421o01M040j104k74
1168B526J287l323R1O59l013K083o7k074K979k099k260J722j830P69K580k632
1184b602J306J439j051L217l7k006K893j017j6K373k823p35M8l187J442N8k426
$$ y = [-591, -435, 5578, 6529, 3691, 6107, 3850, 3792, 6287, 2058, 936, 1249, -2172, -1276, -2341, -5933, -3284, -3546, -4357, -1506, -4521, -4513, 85, -839, 1050, 2715, -65, 4324, 6855, 5484, 7380, 2980, -321, 2155, -210, -1026, -479, -5090, -4064, -2910, -5220, -2626, -2955, -3750, 840, 331, -141, 2390, 670, 1953, 4445, 736, 2041, 2906, 2037, 5637, 3432, -665, -617, -3435, -3039, -287, -3912, -3733, -2778, -4801, -952, -416, -2209, 911, 938, 954, 4809, 2267, 2065, 3569, 821, 1586, 1535, -1386, 1515, 2014, -88, 1393, -2712, -4245, -1310, -2915, -1876, -855, -4132, -1228, 527, -679, 1886, 465, -136, 3904, 2800, 2526, 3813, 490, 581, 1240, -1773, 310, 243, -1831, 1148, -951, -3211, -1489, -3319, -2550, 30, -2602, -1296, 143, -908, 2309, 2272, 266, 3159, 2142, 2126, 4499, 1676, 941, 989, -2198, -756, -698, -3124]
1201c124K274o02j195J996k040j04L088j726J437J814k051K597P40j571K099j455
1217B177j094K499k558p73P14l855M57M52k344K170j76o98L037j475k71K741j090
1234h7J326K000j972K035r9k191K207j186j607J270k241n30Q17l178O20J84k182
1251d814K431M90l37L191k4m82K551j914R63K189k067P78K2l053J281j045j517
1268a357J386j888r83J566k096Q90J023k171K112Q24p69L650L08o63K085k029
1284A888m59K191k022L22L31l151L62r43j898K391j618n78K111j622J003J977
1300B85j479J112R26j392K899P49o70J908k496j273J634k142K57O75k562M79o41
1317a731k063K191p85l96K536j225J032K151j300Q44O71k257J921Q43j095K342
$$ y = [-3124, -850, -1452, -2647, -651, -2691, -2795, 293, -1433, 4, 1818, -233, 2364, 3104, 1533, 3632, 2177, 1083, 3582, 1024, 251, 965, -2890, -2433, -1981, -4325, -2155, -2331, -3029, 8, -1467, -1738, 1003, -87, 1239, 3239, 1267, 3302, 3203, 1012, 3219, 2033, 426, 1696, -545, -1075, -258, -3436, -2816, -2632, -4814, -2383, -1893, -2230, 961, 937, 455, 3006, 1092, 2055, 4244, 2177, 2955, 2977, -76, 1205, 160, -1357, 29, -1859, -2842, -1276, -3372, -2482, -1459, -3630, -1518, -694, -1463, 2187, 2495, 1832, 3917, 1888, 1429, 3620, 1598, 1920, 2251, -900, -538, -1481, -3379, -988, -2606, -3184, -1073, -2695, -1692, 285, -1194, -82, 844, -548, 2351, 3100, 2430, 4338, 1842, 569, 2203, 61, 318, 993, -1569, -1090, -1731, -3794, -1603, -2388, -2784, -248, -1473, -441, 1710, 410, 1254, 1925, -332, 1589, 2432, 1337, 3679]
1333C679j736j549R04k473j06J225k085Q80M1k119K005K32j166K022p87O02K333
1350A902p17J052P28k661J104M2j668K302p73j535R94k292k60R19j716J090L56
1367a133j613K060K6n94J987q61p0K206o64Q73J200k138O2m29j830J578p08r94
1385a042R60j476n55J263j372J68J030j662K169O57p19K456n98p68K342j558L64
1402A659J527j985L08o36k524J041o31j378J805j201m71J830r75L00J582j644
1418a393J502R80n85K029j23j063J460j043n62J188k513K04M9k405N19k65j363
1435c384J604l62n75K486q35Q77K154j701J330M87j445J872j19j393J103j306
1451G93j047J149j904l97K66j519P69L70j135J279R0l34K367m14P81J775j433
$$ y = [3679, 1943, 394, 1298, -1175, -1281, -56, -2141, -1261, -1220, -3339, -1334, -1102, -2268, -246, -1033, -431, 1902, 1185, 2237, 2965, 304, 1408, 1450, -218, 2084, 1311, -224, 770, -1522, -1782, -863, -2579, -1489, -1133, -2746, -686, -660, -1254, 733, -128, -198, 2008, 1344, 2217, 3417, 1279, 1341, 912, -918, 660, -48, -1042, -82, -1558, -2113, -850, -2222, -2054, -1024, -2686, -517, 140, -579, 1877, 1279, 511, 2853, 1295, 1659, 3186, 1201, 1509, 873, -1651, -610, -1241, -2619, -814, -2015, -2486, -656, -1631, -1331, 251, -1393, 109, 1089, 504, 2533, 2410, 1347, 2807, 1764, 1202, 2390, -123, 81, 130, -2275, -1756, -2021, -3384, -1780, -2142, -2717, -231, -1066, -189, 1965, 264, 1594, 2081, 636, 2508, 2389, 996, 2099, 793, -254, 895, -1009, -1406, -1140, -2659, -1890, -1520, -2655, -1376, -1286, -1620, 747, 333, 1114, 2889, 1456]
1468A456N87P14j899P40l8j999Q60j030q17J143j335k30Q93j809Q38J108o95J675
1486A62L27q14J858l10J11J375j123R7N67j903N78l46k549P94m04j016J713p07
1504a590J35J536j588K39J276o98J860M01j134J415l72n15J224j284n00P06j703
1521e92P27K78k077N73o48j137J707k09L38J874r22L79J059j226J175M84j220
1538E63J501j045q11J316j214o88O42j862O67R51r81O86q51j595J516J23M49J997
1556A364p66L05P15j020Q72k1j180Q72o21q83J106j125l61O04j643K80J130q25
1574a197J457J24j603P88k63j22K194l42k07Q59r26N97L2j125K28m15j419J147
1592a93l56n44J118j699K00R55n15Q61J167r66O27l67q62J686n22j71J408j204
$$ y = [1456, 2043, 2757, 858, 1598, 1560, -439, 421, -609, -1426, -283, -1618, -1848, -955, -2764, -1926, -818, -1513, 162, 489, -325, 1533, 1223, 1334, 2709, 1586, 1683, 2250, 347, 925, 579, -1970, -1176, -1580, -2596, -883, -1590, -1455, 81, -1507, -1268, 8, -690, 1170, 1571, 437, 1852, 1480, 965, 2189, 905, 405, 1111, -592, 135, 413, -1664, -1091, -1739, -2876, -1169, -1378, -1040, 834, -88, 291, 1350, 124, 1299, 1783, 563, 2064, 1019, 208, 1524, 310, -378, 264, -1598, -931, 20, -961, -275, -1126, -2721, -1205, -1082, -633, 1364, 598, 903, 1618, 598, 1470, 1449, 269, 1141, 520, -363, 743, -382, -743, -139, -1782, -1502, -372, -1197, 260, 384, -1219, -431, -694, -816, 1378, 1036, 829, 1688, 762, 1359, 1391, 266, 494, 79, -1340, -193, -549, -1093, 25, -1674, -1474, -519, -1034, -173, 994, 28, 655, 288, -574, 1112, 590, 419, 1827, 623]
1610F23J71Q73j827K19l78j477R38q4l26J077r19j79J071r01R62J351n68J036
1628A662m53r65O34m04n53J206j318J77R55j578O73k8j706P77l77l28J351r9k28
1647f02R04m94L41J155n13P50J40j636J216r11r43Q51j299l6Q27p33L20Q01j289
1666a151Q16j88p96J507l30j4J170p70O4J023n99N02M07j233O26q66j213R62j160
1685a243J27Q68q82N08Q00p06O25P4p30J033K04p59J357r53j86M76p24O62L74
1704I25r73O72n88p46M85j153r5J071q42M53Q22m07R31N86q93N42j38l35Q75n91
1724F01n47L73r70kP09o51N72Q8q23M95m49m87P35o45N72O19m25O76R66j060O98
1745A045k95r60R32l43o96R79j263l21N63n25N80N35o87P16j23q54Q62n55J23
$$ y = [623, 794, 1667, -160, 59, -319, -1796, -858, -942, -1268, -191, -1110, -1289, -218, -1119, -157, 1194, 626, 1662, 1209, 244, 878, 474, -79, 1127, -191, -14, 941, -637, 36, 8, -1698, -921, -1298, -1626, -275, -374, -602, 302, -192, 149, 1304, 791, 1541, 1681, 45, 1261, 350, -593, 258, -1041, -1077, -250, -983, -663, 138, -1151, -335, -523, -1319, 188, -142, -156, 1014, 244, 308, 1331, 732, 1234, 1641, 408, 1034, 168, -1045, -83, -1243, -1116, -248, -1130, -622, 178, -528, 97, 171, -559, 474, 678, -81, 1276, 323, 137, 613, -111, 551, 925, -48, 624, 36, -710, -225, -1378, -1473, -402, -1244, -791, 31, -376, 555, 1141, 248, 790, 652, 317, 1192, 601, 54, 427, -543, -545, 164, -487, 85, 173, -650, -155, -604, -1091, -356, -1001, -429, 190, -235, 441, 1407, 347, 1045, 750, -210, 722, 379, -317, 662, -601, -922, -359, -884, -304, 231, -456, 260, 137, -717, 145, -410, -287]
1764b87P37n85N3J086p83N69Nj155P88o01j75Q73r72m13L41o60N46P11l88P16
1784D06K64p44P90m60l73O18j129N71P07p02O42p8n33L68o35k45M79K9m91L47
1804a69q87M48M55n56Q02M80n41P95l39j63K45j094J55N89r19N27N15m40M62k81
1824H4p23Q63j80m48O24q72J46M31m57O26N44p63O68J50m17N87p50l87M06p33
1844f01K38L72n12P08J21n20P41n93k07N69q06k89R48o69N41j0o98Q76K63l66
1864A06N93j76k05K34r22jN00p72K94L68m18O00n7m28O24o17l59Q53n35J86K87
1885A55p37Q43o1k98R37k17l02M17j013O5L82j007K21J22n57J231J12p02J162
1904G53p19l26M04k61k8N21n56N46n0m27R14m63m49R09q38L6L71r14J70j10p51
$$ y = [-287, 450, -135, -82, 1004, 221, 790, 795, -360, 428, -173, -348, 525, -447, -860, -519, -1179, -633, 78, -310, 406, 670, -74, 716, 256, -117, 501, -628, -57, 650, -52, 590, 512, -21, 347, -288, -533, -54, -25, -516, -169, -1056, -608, -153, -709, 93, 573, 32, 827, 488, 325, 570, -524, -369, 220, -699, -172, 343, -97, 365, 84, -639, 224, 44, -404, 220, -652, -506, -75, -532, 94, 638, -125, 543, 693, 276, 863, 113, -274, 132, -601, -363, 9, -503, 205, 326, -194, 547, -46, -253, 316, -490, -779, 169, -500, 41, 31, -667, 209, 472, 106, 699, 523, 318, 552, -370, -371, 129, -643, -349, 19, -399, 201, 144, -284, 340, -277, -636, 217, -318, -132, 155, -582, 261, 200, -98, 839, 622, 320, 737, -276, -211, 171, -836, -615, -493, -1050, 181, 293, -409, 753, 34, -292, 112, -149, -177, 344, -212, 334, 284, -143, 771, 308, -141, 768, -70, -34, 337, -577, -407, -517, -1268]
1925a268N65M50j10R09k4q0M54p98P9K48m52J18K23m95P69l42l87L73l44k33O51
1946C06n98nL63q43M25O1k40O42M42k40O36o85l09N39n94NP5n23N81J05m44N15
1968B14m50m12P62m89O5N46o62L40q4m17O18J24r4O14Mn39O46q27j77L40r57P08
1990a27l42q4P71n97k47L75J78l9O55o51L77j9o02M15j04J8L62J6j36N68m52k89
2012D6M7o79J43p4j85M38l5M6M89k56j10P09k70R2L51j015K00L11o94P33Kl64
2034g5L88P6m15K76m65l6k19j28J46N77l41L21K5l35N86m21P13J79o47j31J29
2055B03m56J42j26o22J210l26j30N59o96J21K84m50j13J86j75N94J5k67N20o21
2075a48L29N60n32K16j94o40M21m14m00L63J11j11P76m60M58Q7o83K2K65k85P28
$$ y = [-1268, -703, -253, -363, 546, 522, 442, 896, 98, 177, 425, -27, 91, 314, -181, 588, 246, -141, 232, -112, -345, 306, -292, -297, 66, -777, -352, -291, -531, 111, 553, 313, 949, 264, -45, 494, -100, -95, -20, -543, 38, 143, -301, 214, -236, -648, 114, -375, -310, 236, -426, -86, -170, -587, 31, 155, 61, 675, 679, 140, 786, -41, -218, 122, -835, -127, -469, -553, 218, -379, -626, -251, -73, -112, 543, -108, 269, 250, -352, 63, -41, -23, 339, 355, 219, 787, 335, 46, 93, -586, -443, -517, -702, -264, -299, -253, 236, -20, -130, 579, 309, 401, 752, -263, -63, 248, -446, 287, 289, -75, 313, 389, -26, 250, -215, -251, -470, -598, -452, 125, -216, 105, 130, -205, 381, -40, 673, 852, 205, 74, 203, -253, -111, -237, -859, 351, 25, -105, 454, -242, -121, 163, -287, -400, -214, -389, 205, 220, -47, 473, -148, 181, 741, 209, 425, 231, -409, 12, -402, -802, -439, -328, -439, 337, -123, 335, 422, -261, -239, 26, -259, 469]
2096D69l14k48P92o08L4O07m27o5o6m61j17ql81J94M50m11N59J9M01K08n69R3
2118A51M29q01P77m55p1L22k89j90L09k12RL94l49n2l18j69L85k31k01O17j05
2139e0K14K50K0k60M91m81J23j01l86J17j8j47J30K4k33N44k56JM44o37K21p4
2161f4k08L23k8k85O37J9J1J1m49K86j52r5K92n27m77L75j54j5L71k57N11N8j66
2184A7K56q5k07J88k45j71M29j94K27L08m95J58q4k86K28j94l22M07k89j10L22
2205a42p9M67J21j64L75j89m07J75q8l99J86j25O4N95l81K27l80o3K47o1m73Q21
2227C27l90j72J65n8M2K22j57L62J46l97K21k25l36j28J2K87r4q5O04m5l84J39
2249E6K38k72K67j94l16M28k75j25M06k08R5j90J45J83P7l92m5J40m28L24l10
$$ y = [469, 155, -93, 699, 91, 125, 732, 305, 240, 174, -287, -404, -412, -793, -599, -149, -560, -1, 18, 419, 627, 58, 151, 580, -221, 556, 101, 30, 352, 63, -127, 182, -30, -21, 373, 24, -28, -346, -515, -130, -361, -562, 55, -50, 164, 414, 434, 174, 665, 184, 307, 206, -180, -63, -81, -228, -98, -74, -307, 237, -19, -18, 426, -211, 10, -64, -272, 51, 23, -262, 375, 394, 405, 416, -33, 253, 101, 6, 298, -229, -706, -331, -485, -500, -129, -386, 125, 183, 17, 273, 188, -19, 169, -76, -247, 182, -12, 215, 523, 28, 186, 102, -184, 44, -150, -472, -65, -354, -464, -142, -221, 246, 367, 203, 578, 389, -18, 157, 69, -330, -144, -269, -205, 390, 9, 236, -144, -207, 40, -21, -494, 327, -63, -235, -70, -128, -86, 136, -21, 341, 487, 90, 311, 86, -250, -378, -366, -79, -173, -258, 346, 301, -83, 56, 294, 22, 289, 95, -221, 207, -68, -193, 213, 5, 100, -90, 55, 238, 315, -77, -122, 18, -410, -86, -396]
2270c96J15M24L6J7n9N8M7l36q3j4K9J2K97l72M06R5m82K88K25o4J21m25k11K88
2294A6r1j65L17l9N7J86l24K24o1l67K33N1k99L92k17O2R4q5M81j34k14J06o2
2317A61j25p9K16n05L26m91J08L15R5k08M01m36L02N0k93K57k38M26j20n5J27
2338B34j54K31j89O5k02L18l14l94M41n02J25J92l19K63M00k28Q8J02MM7k3l55
2360a70L79l27qK15j38J08j9j5%K55n61J49l0Q0j56K4L15L1j83K19L67k48m4J71
2384D14J6l76k79L2L09m59J34J09j08J81Rk38K00K42l71R0K00m51L26J90j58M70
2406D82l57L54q0l51n3p9j29O1l15M44k81K02k66L02k10M29L12m64o9N7J83R9
2428B71l23L07p8j07R1j2L4j12J84m58J59n48L59j84J83M2n7K00J52J36l30N05
$$ y = [-396, -281, 143, 179, 196, 137, 195, 242, -94, -177, -191, -162, -150, 147, -225, 181, 276, -206, 82, 307, 243, 364, -61, -272, 16, -75, -240, 77, 38, 95, 281, -43, 181, 120, -247, -14, 37, -262, 130, -87, -25, 69, -16, 465, 331, 117, 223, 161, 36, -43, 173, -332, -6, -497, -389, -74, 21, -187, 214, -222, 80, 130, -163, 94, -144, 282, 162, 107, 234, 80, 311, 122, 187, -15, 303, -11, -405, 36, -466, -341, -149, -468, -205, 195, -33, 55, 157, 161, 208, 185, -170, 209, -118, -126, 89, -49, 59, 40, 25, 25, 280, -281, -132, -162, -82, -238, -214, 101, 132, -51, 168, 535, 287, 243, 414, 430, 54, -225, -193, 116, -343, -209, -100, -208, -27, -18, -256, -56, 186, -185, -95, 105, -346, -20, 170, 12, 482, 125, 479, 399, 48, -5, -84, -213, -152, -467, -23, -304, -102, -368, -66, -276, 153, 465, 1, -68, -11, 172, 271, -52, 255, 177, 70, 161, 149, 183, 71, 255, -203, -44, -592, -233, -417, -234, -192, -249, -49, 103, 239, -91, 414]
2450D14k61m0L6l3J53j38p9j65J14k52K12j6k71J42J4j80K01j56p8N21j21K83
2472C00N2N5j11Om8K97m08q6K11k99j39q3p0K9K03k37R7j02j17L32j79J60K77
2495A40K69j01m5r6J89L02l86L31n28j24m7l41LP1j44K57L71j92k7L85l32o2K56
2518A49M3j88K71j13L20k55j8K99o45J42o9mJ22k69l93K50j69J09L65J51N8Om1
2541A21J70o1k9P5nj53k46J87k12J58m24J79O7j32l58M34k44L06J20l43N07rJ14
2564B22L34l73J93R6n77J35M8l10L5j18j3J5l8J55j11K14l31O61j05r0N6l8J86
2587B46L21n24L05j11k2M7j94j32O3l84J87n3r3j49J90k16L84O3j9J92J23K13
2609D37O4k44q8J36j24j41j45O1L29k51k22K17m04j17J66q5K28q9J0J29L22k88
$$ y = [414, 153, 113, 149, 116, 269, 131, 52, -113, 1, -251, -39, -55, -326, -184, -170, -350, -149, -305, -383, 138, 17, 300, 352, 407, 296, 302, 254, 551, 143, 57, 268, -31, -170, -253, -323, -294, -91, -328, -231, -333, -450, -118, -297, -137, 140, 409, 308, 263, 167, 356, 658, 272, 603, 75, -49, -96, -437, -434, -363, -507, -250, 121, -71, -98, 287, -45, -107, 149, 192, 4, 275, 162, 482, 227, 209, 508, -137, 5, -64, -68, 54, -215, -608, -358, -527, -418, -53, 98, 156, 162, 121, 291, 230, 201, 276, 271, 118, -128, 59, -153, 5, -419, -240, -173, -305, -663, -229, -473, -167, -47, -390, 117, 108, 222, 556, 183, 376, 472, -105, 30, 78, -232, -197, -315, -328, -313, -351, -196, -307, -93, -424, 237, 132, 42, 98, 60, 246, 567, 43, 348, 237, 215, 262, 68, -64, -1, -385, -198, -251, -344, -493, -303, -519, -135, -72, -91, 101, 224, 437, 501, 257, 169, 305, 181, 40, -105, -44, 285, 34, -188, 29, -375, -492, -326, -411, -183, -272, -262, -133, 189, -99]
2631i9K98K37l21K82j45J7kj50j99K79n38K15j52Qj17N2k1J48l70L87J18K49l68
2654a92K81o4N30j7j32j06K65l29O3l67J53j64l89K26m82L21K33j82p4L39j57
2675b44K32K93j93K74P2k26L17j62o3P1n59L00q2j83j35J87m59L9N9K1L10j15
2697b46L63pj58J92J85l1K46j75k01j48K00l67M08n83J25J53k02q3L0M1q7N7J29
2720a59O3n8L35J88J36p0M88k99j56j65j42k18k33j65K88l24K12J1j65J69R9j87
2742c52N7K64J87J06n0N4K26k38Q0J67m07p1L9k26J49k18k95J91K28j93K70j33
2764a65k44O56n5j20N8Q1L03m83J28P7O7j24K1o0k74J43l84K02j05K48j51J06
2786g5k26O02l40k3K59k73K01K23k43j55L07j25K03j32j49p7J64j44M4j48J03
$$ y = [-99, 199, 436, 115, 397, 252, 269, 267, 117, -82, 197, -341, -126, -278, -270, -387, -335, -356, -208, -578, -191, -73, 176, -192, 89, 25, 555, 538, 406, 300, 565, 236, 299, -68, 85, -79, -468, -242, -724, -403, -170, -352, -426, -87, -244, -12, 281, 88, 362, 434, 208, 525, 363, 300, 371, -188, 112, 30, -153, -288, -101, -560, -521, -462, -441, -131, -246, 117, 110, -48, 144, 329, 298, 544, 369, 168, 20, 220, -147, 261, -322, -197, -44, -246, -329, -299, -258, -345, -288, -159, -96, -154, 181, 369, 505, 435, 923, 624, 468, 303, 161, -57, -290, -455, -167, -491, -279, -268, -433, -264, -165, -352, -295, -31, 156, 262, 212, 266, 492, 254, 334, 501, 94, 23, 62, -164, -15, -233, -528, -337, -109, -302, -32, -165, -409, 247, 192, 72, 130, 211, 514, 31, 159, 236, 303, 179, 200, 140, -134, 9, -375, -173, -278, -30, -181, -75, -301, 301, -39, -62, 197, -76, 125, 348, 105, -50, 257, 132, 335, 203, 54, -23, 141, -3, 41, -107, -4]
2807dO9l11P0j35J7K88q6KL37j42M3J13l6m4m8l09K92j72p2K09j65J57J42l41
2831a26M1k59j82M65J47n65O07j82l62N55q7K26P6q3j89KJ21O9p0m15K0j79Pl6
2855c99J46J1j89K09L4K97L8o6Nk5M14M7j99Pr5k4j28q3j97J25l24K4J0r9L33
2880a28j25Q3L03k60K72J02j53J99J55l60J72o3q1L55m14k88L19n61P0J56k51
2901d98K31K00m7J64k18L4O37l19l29O37j61k00J69m41L72Q9m86M98l47l58m9
2922d22J1j21N97m43R6K53k44M49r6NK01k04m8K97k64K30k26k39J93l90%J97J02
2945f6j99J28j43K7N47m09J09R4l53K11K33k72Q03p97k18Q18n06j25K17l98K45
2966e4J89k79L3J85l59P1J3K59L69o37L9J31J3K75n0m47L43K01l99N56l39M9O9
$$ y = [-4, 65, -246, -176, -311, -294, -6, -92, -90, 247, 105, 148, 261, 225, 181, 133, -176, 116, -56, -128, 81, -84, 73, 215, -126, -85, -344, -526, -61, 86, -479, 128, -54, -416, 139, 52, 278, 354, 271, 82, 84, 205, 274, 204, -211, -191, -370, -363, -399, -253, -242, -431, -222, -188, 109, 147, 81, 86, 61, 475, 522, 323, 330, 235, 211, 83, 0, -197, -72, -396, -372, -362, -461, -128, -253, -170, 133, -127, 145, 247, 94, 293, 448, 88, 260, 197, 116, 471, 57, -231, 88, -473, -403, -247, -498, -267, -67, -114, 50, -168, -134, 503, 184, -145, 492, 331, 131, 300, -141, 231, 320, -166, 332, -15, -373, -422, -411, -532, 65, -378, -282, -29, -273, 176, 80, 85, 286, 82, 34, 331, 67, 297, 71, -168, 25, -365, -365, -168, -66, -265, -137, -280, -253, 294, -115, -6, 88, -265, -54, 179, -93, 710, -87, -305, 513, 7, -118, 99, -299, -54, 135, -144, -111, 74, -285, -214, -201, 58, 427, -210, -171, -40, -27, 248, 198, -249, 94, 295, -104, 452, 113, 162, 231]
$$ [...]
8191c7
##END NTUPLES=NMR FID
##END=
