##TITLE=1H_Pr 5257
 200.13MHz, CDCl3,
 24 sc
 
 14.1.2025
##JCAMPDX= 6.0         $$ Bruker NMR JCAMP-DX V2.0
##DATA TYPE= NMR FID
##DATA CLASS= NTUPLES
##ORIGIN= UXNMR, Bruker Analytische Messtechnik GmbH
##OWNER= pz
$$ XWIN-NMR		Version 3.5
$$ Tue Jan 14 15:51:39 2025 Russian Standard Time (UT+4h)  she@DPX200
##.OBSERVE FREQUENCY= 200.1305
##.OBSERVE NUCLEUS= ^1H
##.DELAY= (6, 6)
##.ACQUISITION MODE= SIMULTANEOUS
##.ACQUISITION SCHEME= undefined
##.AVERAGES= 8
##.DIGITISER RES= 18
##SPECTROMETER/DATA SYSTEM= spect
##.PULSE SEQUENCE= zg30
##.SOLVENT NAME= CDCl3
##.SHIFT REFERENCE= (INTERNAL, CDCl3, 0, 14.3821)
##AUDIT TRAIL= $$ (NUMBER, WHEN, WHO, WHERE, WHAT)
$$ ##TITLE= Audit trail, XWIN-NMR		Version 3.5
$$ ##JCAMPDX= 5.01
$$ ##ORIGIN= Bruker BioSpin GmbH
$$ ##OWNER= she
$$ F:/spectra/data/she/nmr/H-C/1/audita.txt
$$ ##AUDIT TRAIL=  $$ (NUMBER, WHEN, WHO, WHERE, WHAT)
(   1,<2025-01-14 15:50:30.34 +0400>,<she>,<DPX200>,
      <created by zg, POWCHK disabled, PULCHK disabled
       configuration hash MD5:
       00 E9 B6 7A A2 85 ED C7 34 08 36 98 17 FE 4E 26
       data hash MD5: 16K
       A7 8A 2C DC 53 0F 78 D5 2B 39 E1 29 03 B0 BB 1D>)
$$ ##END=
$$ 
$$ hash MD5
$$ 35 85 18 8E 6C D4 F2 0F 28 08 F0 83 28 F7 A2 64
##$RELAX= 
##$RELAX= 
##$RELAX= 
##$RELAX= 
##$RELAX= 
##$RELAX= 
$$ Bruker specific parameters
$$ --------------------------
##$DU= <F:/spectra>
##$EXPNO= 1
##$NAME= <H-C>
##$PROCNO= 1
##$TYPE= <nmr>
##$USER= <she>
##$AMP= (0..31)
100 100 100 100 100 100 100 100 100 100 100 100 100 100 100 100 100 100 
100 100 100 100 100 100 100 100 100 100 100 100 100 100 
##$AQSEQ= 0
##$AQ_mod= 1
##$AUNM= <au_zg>
##$AUTOPOS= <>
##$BF1= 200.13
##$BF2= 200.13
##$BF3= 200.13
##$BF4= 200.13
##$BF5= 200.13
##$BF6= 200.13
##$BF7= 200.13
##$BF8= 200.13
##$BYTORDA= 1
##$CFDGTYP= 0
##$CFRGTYP= 5
##$CHEMSTR= <none>
##$CNST= (0..31)
1 1 145 1 1 1 1 1 1 1 1 1 1 1 1 1 1 1 1 1 1 1 1 1 1 1 1 1 1 1 1 1 
##$CPDPRG= <>
##$CPDPRG1= <>
##$CPDPRG2= <>
##$CPDPRG3= <>
##$CPDPRG4= <mlev>
##$CPDPRG5= <mlev>
##$CPDPRG6= <mlev>
##$CPDPRG7= <mlev>
##$CPDPRG8= <mlev>
##$CPDPRGB= <>
##$CPDPRGT= <>
##$D= (0..31)
0 0.7 0 0 0 0 0 0 0 0 0 0.03 0 0 0 0 0 0 0 0 0 0 0 0 0 0 0 0 0 0 0 0 
##$DATE= 1736855429
##$DBL= (0..7)
120 120 120 120 120 120 120 120 
##$DBP= (0..7)
150 150 150 150 150 150 150 150 
##$DBP07= 0
##$DBPNAM0= <>
##$DBPNAM1= <>
##$DBPNAM2= <>
##$DBPNAM3= <>
##$DBPNAM4= <>
##$DBPNAM5= <>
##$DBPNAM6= <>
##$DBPNAM7= <>
##$DBPOAL= (0..7)
0.5 0.5 0.5 0.5 0.5 0.5 0.5 0.5 
##$DBPOFFS= (0..7)
0 0 0 0 0 0 0 0 
##$DE= 6
##$DECBNUC= <off>
##$DECIM= 32
##$DECNUC= <off>
##$DECSTAT= 4
##$DIGMOD= 1
##$DIGTYP= 9
##$DL= (0..7)
0 120 120 120 120 120 120 120 
##$DP= (0..7)
150 150 150 150 150 150 150 150 
##$DP07= 0
##$DPNAME0= <>
##$DPNAME1= <>
##$DPNAME2= <>
##$DPNAME3= <>
##$DPNAME4= <>
##$DPNAME5= <>
##$DPNAME6= <>
##$DPNAME7= <>
##$DPOAL= (0..7)
0.5 0.5 0.5 0.5 0.5 0.5 0.5 0.5 
##$DPOFFS= (0..7)
0 0 0 0 0 0 0 0 
##$DQDMODE= 0
##$DR= 18
##$DS= 0
##$DSLIST= <SSSSSSSSSSSSSSS>
$$ [...]
##$SUBNAM0= <"">
##$SUBNAM1= <"">
##$SUBNAM2= <"">
##$SUBNAM3= <"">
##$SUBNAM4= <"">
##$SUBNAM5= <"">
##$SUBNAM6= <"">
##$SUBNAM7= <"">
##$SUBNAM8= <"">
##$SUBNAM9= <"">
##$SW= 18.0518050122584
##$SWIBOX= (0..15)
0 0 2 0 0 0 0 0 0 0 0 0 0 0 0 0 
##$SW_h= 3612.71676300578
##$TD= 16384
##$TD0= 1
##$TE= 0
##$TE2= 300
##$TE3= 300
##$TEG= 300
##$TL= (0..7)
0 120 120 120 120 120 120 120 
##$TP= (0..7)
150 150 150 150 150 150 150 150 
##$TP07= 0
##$TPNAME0= <>
##$TPNAME1= <>
##$TPNAME2= <>
##$TPNAME3= <>
##$TPNAME4= <>
##$TPNAME5= <>
##$TPNAME6= <>
##$TPNAME7= <>
##$TPOAL= (0..7)
0.5 0.5 0.5 0.5 0.5 0.5 0.5 0.5 
##$TPOFFS= (0..7)
0 0 0 0 0 0 0 0 
##$TUNHIN= 0
##$TUNHOUT= 0
##$TUNXOUT= 0
##$USERA1= <user>
##$USERA2= <user>
##$USERA3= <user>
##$USERA4= <user>
##$USERA5= <user>
##$V9= 5
##$VALIST= <valist>
##$VCLIST= <CCCCCCCCCCCCCCC>
##$VD= 0
##$VDLIST= <DDDDDDDDDDDDDDD>
##$VPLIST= <PPPPPPPPPPPPPPP>
##$VTLIST= <TTTTTTTTTTTTTTT>
##$WBST= 1024
##$WBSW= 4
##$XGAIN= (0..3)
0 0 0 0 
##$XL= 0
##$YL= 0
##$YMAX_a= 203279
##$YMIN_a= -194578
##$ZGOPTNS= <>
##$ZL1= 120
##$ZL2= 120
##$ZL3= 120
##$ZL4= 120
##$ABSF1= 10
##$ABSF2= 0
##$ABSG= 5
##$ABSL= 3
##$ALPHA= 0
##$AQORDER= 0
##$ASSFAC= 0
##$ASSFACI= 0
##$ASSFACX= 0
##$ASSWID= 0
##$AUNMP= <proc_1d>
##$AZFE= 0.1
##$AZFW= 0.1
##$BCFW= 1
##$BC_mod= 2
##$BYTORDP= 1
##$COROFFS= 0
##$CY= -3
##$DATMOD= 1
##$DC= 2
##$DFILT= <>
##$DTYPP= 0
##$F1P= 0
##$F2P= 0
##$FCOR= 0.5
##$FTSIZE= 0
##$FT_mod= 4
##$GAMMA= 1
##$GB= 0.15
##$INTBC= 1
##$INTSCL= 1
##$ISEN= 128
##$LB= 0.25
##$LEV0= 0
##$LPBIN= 0
##$MAXI= 10000
##$MC2= 0
##$MEAN= 0
##$ME_mod= 0
##$MI= 1.114404
##$NCOEF= 0
##$NC_proc= 0
##$NLEV= 6
##$NOISF1= 3.799351
##$NOISF2= 2.8
##$NSP= 1
##$NTH_PI= 0
##$NZP= 0
##$OFFSET= 14.38212
##$PC= 1
##$PHC0= 247.9228
##$PHC1= 11.39222
##$PH_mod= 1
##$PKNL= yes
##$PPARMOD= 0
##$PSCAL= 0
##$PSIGN= 0
##$REVERSE= no
##$SF= 200.129724274929
##$SI= 16384
##$SIGF1= 3
##$SIGF2= 2
##$SINO= 400
##$SIOLD= 16384
##$SREGLST= <1H.CDCl3>
##$SSB= 0
##$STSI= 0
##$STSR= 0
##$SW_p= 3205.1282051282
##$SYMM= 0
##$S_DEV= 0
##$TDeff= 0
##$TDoff= 0
##$TI= <>
##$TILT= no
##$TM1= 0
##$TM2= 0
##$TOPLEV= 0
##$USERP1= <user>
##$USERP2= <user>
##$USERP3= <user>
##$USERP4= <user>
##$USERP5= <user>
##$WDW= 1
##$XDIM= 8192
##$YMAX_p= 0
##$YMIN_p= 0
$$ End of Bruker specific parameters
$$ ---------------------------------
##NTUPLES= NMR FID
##VAR_NAME=  TIME,          FID/REAL,        FID/IMAG
##SYMBOL=    X,             R,               I
##VAR_TYPE=  INDEPENDENT,   DEPENDENT,       DEPENDENT
##VAR_FORM=  AFFN,          ASDF,            ASDF
##VAR_DIM=   8192,          8192,            8192
##UNITS=     SECONDS,       ARBITRARY UNITS, ARBITRARY UNITS
##FACTOR=    0.0002768,     1,               1
##FIRST=     0,             0,               0
##LAST=      2.2672688,     0,               0
##MIN=       0,             -194578,         0
##MAX=       2.2672688,     203279,          0
$$ Real data points
##PAGE= N=1
##DATA TABLE= (X++(R..R)), XYDATA
0@%%%%%%%%%%%%%%%%%%%%%%kRj5J6j6J9k6L1l5M5n7O6p8R4j10J26j43J66j92K19
$$ 0 0 0 0 0 0 0 0 0 0 0 0 0 0 0 0 0 0 0 0 0 0 0 -2 7 -8 8 -8 11 -15 16 -19 26 -31 35 -43 51 -59 67 -76 90 -102 117
42A17k49K84l24L65m10M62n20N83o50P24q05Q93r89J092j205J330j465J611j770
$$ 117 -132 152 -172 193 -217 245 -275 308 -342 382 -423 470 -519 573 -632 698 -767 844 -926
61i26J943k134K345k576K837l158L628m748P301J58637p4324j65868J95613Q4709
$$ -926 1017 -1117 1228 -1348 1489 -1669 1959 -2789 4512 163149 88825 -77043 118570 203279
75B03279k53069j16588K26522L4255j89980N7106K27176j00987k15589R0905J54487
$$ 203279 -49790 -166378 60144 94399 -95581 -38475 188701 87714 -127875 -36970 117517
86A17517j34840q1742J86692P2508k08030o8245J33664k4610j55852P1949J63384
$$ 117517 -17323 -99065 87627 160135 -47895 -116140 17524 -7086 -162938 -90989 72395
97G2395n7454j16567R5659R0294r2802n0556J16732K1905j28594l4442R2589L6
$$ 72395 14941 -101626 -5967 84327 -8475 -59031 57701 79606 -48988 -83430 9159 9195
109I195n5063O1740J03328l4122p9427J2047K5681n4072l0318N7134L8347m5399
$$ 9195 -45868 15872 119200 85078 5651 17698 43379 -10693 -41011 16123 54470 9071
121I071l6665J8019j301m4444n512N4533K9903k1346l433L0271j6308o4071k2003
$$ 9071 -27594 -9575 -10876 -55320 -60832 -6299 23604 2258 -1175 29096 12788 -51283 -73286
134g3286L5460M984j4732M4456P1801r202m8041M780J7477m6217k4009N8603M1134
$$ -73286 -37826 -32842 -47574 -3118 68683 59481 11440 16220 33697 -12520 -36529 22074 63208
147F3208m4900k3730L1412j1370n8459J8049O6565m092m5625J7673K0991n0436
$$ 63208 18308 -5422 25990 14620 -43839 -25790 40775 36683 -8942 8731 29722 -20714
159b0714l6996M4394K3602m3230j3872M0391k25l2333K6477N4881r892l7816N985
$$ -20714 -57710 -13316 10286 -32944 -46816 -6425 -6650 -38983 -12506 42375 32483 -5333 652
172F52P003l4278j2319M3463K8654j4897l750J7431j1679k8652L842K4505l070
$$ 652 7655 -26623 -38942 4521 33175 18278 14528 31959 20280 -8372 -4530 19975 16905
185A6905j3565L988O279j6252j5372L219O955q602m313J3167J7124j139n502P33
$$ 16905 3340 7328 13607 -2645 -18017 -14798 -7843 -16445 -20758 -7591 9533 8394 2892 3625
199C625m546k2204j2974J4804K1193K590N579J5209m096k7271m213J9983N208
$$ 3625 -921 -23125 -36099 -21295 -102 2488 8067 23276 19180 -8091 -12304 7679 12887
212A2887r445J1413J1563k1395k2061J3622J4479j3454k577J8409l506k6842L536
$$ 12887 3442 14855 26418 5023 -17038 -3416 11063 -2391 -4968 13441 9935 -16907 -13371
225a3371K3769l791j7227J0062N694k4577j1839K6173J4214j1025L723J6328j5730
$$ -13371 10398 6607 -10620 -558 5136 -19441 -31280 -5107 9107 -1918 1805 18133 2403
238B403k3474J0759K0486p597m119J6775P05k4105m80J9096j497j3326R224P539
$$ 2403 -21071 -10312 10174 2577 -1542 15233 15938 -8167 -8647 10449 8952 -4374 4850 12389
252A2389j7123r081J8612P010j3440j260Q543j1921j4209J3725J6202o220m707
$$ 12389 -4734 -13815 4797 11807 -1633 -2893 5650 -6271 -20480 -6755 9447 3227 -1480
265a480Q736o515j8656L826J8469J133n554P894K034j6742n155J4948N659q961
$$ -1480 7256 741 -17915 -14089 4380 5513 -41 7853 9887 -6855 -12010 2938 8597 -364
279c64L549P248j1930j1479J2680J1117p964l572P934o247j5402M923J7627j563
$$ -364 3185 10433 -1497 -12976 -296 10821 2857 -715 7219 972 -14430 -9507 8120 6557
293F557q350N697J601j6607n187J7317Q210r496P41P693r831j3732J0467J5863
$$ 6557 -1793 3904 5505 -11102 -16289 1028 9238 -258 483 8176 -1655 -15387 -4920 10943
307A0943n844p713P971M19j6063j220J8315L716j2496O53Q049r197j0423J3236
$$ 10943 5099 -2614 5357 5776 -10287 -11507 6808 10524 -1972 -1319 6730 -2467 -12890 346
321C46J3994r600j0310O946j0j4164K799J9609J396j4364l86Q492r096p638J5740
$$ 346 14340 4740 -5570 1376 1366 -12798 -9999 9610 11006 -3358 -3744 4748 -4348 -11986 3754
336C754J2655j3223j1429O609m7j1653O558K0636o52j5050J7O072r586n092J5535
$$ 3754 16409 3186 -8243 -1634 -1681 -13334 -6776 13860 13208 -1842 -1825 4247 -5339 -10431 5104
351E104R679j2751r486N618j937q471Q430J7297j661j1299Q5K119r074l598J0955
$$ 5104 14783 2032 -7454 -1836 -3773 -12244 -3814 13483 11822 523 608 2727 -6347 -9945 1010
366A010N584q939m113N273P51m446N554P944k691o971N38K671k392j922K558p24
$$ 1010 6594 -2345 -6458 -1185 -434 -4880 674 8618 5927 -1044 -506 2165 -227 -2149 409 -315
382c15n789j360N058P316M171Q92j384o206q341m291M333O639J762j390j821m246
$$ -315 -6104 -7464 -2406 4910 9081 9973 8589 2383 -5958 -10249 -5916 723 2485 1095 -726 -4972
398d972n552K775J1448Q055j256l491n145j0234p935O248J0776L968j94J606l659
$$ -4972 -10524 -7749 3699 11754 10498 7007 1862 -8372 -16307 -10059 717 4685 4491 6097 2438
413B438q023P02J1033O031j783j764m294j2394q163M588Q223L866M966M755k988
$$ 2438 -5585 -4883 6150 12181 10398 8634 4340 -8054 -16217 -11629 -3406 460 5426 10181 7193
428G193p009j932P13k217j800J693N9k526R35K915j45o99K669J995K312N403L106
$$ 7193 184 -1748 -1035 -3252 -5052 -3359 -3300 -5826 -4891 -1976 -2121 -2820 -151 1844 4156 9559 12665
445A2665l840o985n690o971l063P759J1701M688N61J125o982j0763r3Q685Q07
$$ 12665 8825 1840 -3850 -10821 -13884 -6125 5576 10264 10825 11950 4968 -5795 -5888 2797 3604
460C604l508J132m098j3775m110J3569J0129R1O265M977j3005j5074O041R639
$$ 3604 96 1228 -2870 -16645 -20755 -7186 2943 3034 9299 14276 1271 -13803 -7762 1877
474A877l856P02J1450m674j7977K67J6413K134j902J4441P112j9709j5149O723
$$ 1877 -1979 -1277 10173 5499 -12478 -12211 4202 6336 4434 18875 25987 6278 -8871 -2148
488b148n50j3384O313J8688l507j3138Q867R693j3955r282J3142L169j4764J845
$$ -2148 -2698 -16082 -9769 8919 5412 -7726 1141 10834 -3121 -12403 739 3908 -10856 -9011
502i011J5898n236j6556N620R938q470j188K1662J0259j2717n347M789j1354j4437
$$ -9011 6887 1651 -14905 -9285 653 -7817 -9005 12657 22916 10199 4852 9641 -1713 -16150
516a6150J0266J6064m621n003Q360j183j4644J870J5283p90r478J407j496j5298
$$ -16150 -5884 10180 5559 556 8916 7733 -6911 -5041 10242 9452 -26 1381 -115 -15413
530a5413o108J4126Q070l779L810N359r874r725R287J0371k695J113O176q038
$$ -15413 -21521 -7395 675 -3104 706 6065 -3809 -13534 -4247 6124 3429 4542 10718 2680
544B680j4323J626J0390K58K615J2651K106j2360l490N438o423q889N465N694
$$ 2680 -11643 -10017 373 631 3246 15897 18003 5643 2153 7591 1168 -7721 -2256 3438
558C438q048k980J0761J877j1698m25P419n800p536J0683J0451p963p489N344
$$ 3438 -4610 -7590 3171 5048 -6650 -7075 344 -5456 -12992 -2309 8142 179 -7310 -1966
572a966j960j1675M583J8531L588o925M919L724j2403q016J0990P023q203k350
$$ -1966 -3926 -15601 -11018 7513 11101 4176 9095 12819 416 -7600 3390 10413 2210 -140
586a40P997l918j1707N367J2552l373r041K520J191j1606l794J2642O180p729
$$ -140 7857 3939 -7768 -2401 10151 6778 -2263 257 1448 -10158 -13952 -1310 4870 -2859
600b859k891M843n165q921O649J4259K25n501L497J910r687m325R799O291n869
$$ -2859 -5750 -907 -6072 -14993 -8344 5915 6140 639 4136 6046 -3641 -7966 1833 8124 2255
615B255r86P363j177p948K389P902m386j0015K281M715m462k574Q280L965j1093
$$ 2255 1269 8632 7455 -493 1896 9798 5412 -4603 -2322 2393 -2069 -4643 3637 7602 -3491
630c491o852M648O88m685N404J1166k645j0538L40M467l612j650J0757N982p829
$$ -3491 -10343 -5695 -5007 -9692 -4288 6878 4233 -6305 -5965 -1498 -5110 -6760 3997 9979 2150
645B150m253N843O72n913K975P828l820q428K693N681l370j912O517o36j0843
$$ 2150 -2103 3740 4412 -1501 1474 9302 5482 -2946 -253 5428 2058 146 6663 6027 -4816
660d816m203N809J570k528M705N046o426q174K079M043j842K323O666l94p320
$$ -4816 -9019 -3210 -1640 -4168 537 5583 -843 -9017 -6938 -2895 -4737 -2414 4252 3858 -3462
675c462r70M589K80l00M601J583n103l402K824L389n24R54J645m156n831J0L132
$$ -3462 -4432 157 437 137 4738 6321 1218 -2184 640 4029 3505 4459 6104 1948 -3883 -3873 -741
692g41J860J676J879k324n850l112P66J880K428K660L03k773k249L84R52K012
$$ -741 1119 2795 4674 2350 -3500 -6612 -5846 -3966 -1538 1122 1425 -1348 -3597 -3213 -2261 -249
708b49K430N41k131j426M80J185J108J894M46l419k944J178J676J506K010J337
$$ -249 2181 2722 591 -835 -355 830 1938 3832 4278 859 -2085 -907 769 2275 4285 5622
724E622l494n452j147J032J103K578L322j209m464k680J134R15J264L128J391
$$ 5622 2128 -3324 -4471 -3439 -2336 242 3564 2355 -2109 -4789 -3655 -2740 -1476 1652 3043
739C043l407l651R50K044J126J929K858k135m205j148K420J610J057J909m41m293
$$ 3043 -364 -4015 -3065 -1021 105 2034 4892 2757 -1448 -2596 -176 1434 2491 4400 3959 -334
755c34l064J038K328J550J012O96k759m383k57K318J711Q08O12m65l600j421K155
$$ -334 -3398 -2360 -32 1518 2530 3226 467 -3916 -4173 -1855 -144 664 1276 811 -2789 -4210 -2055
772b055L213J094J43r55k671k989J077L634K676O59k44k672l186q18K179L102
$$ -2055 1158 2252 2395 1440 -1231 -4220 -3143 491 3167 3826 3582 910 -2276 -3094 -915 2187
788B187J341q2k394k997j942M80K810K818R80j038k380k111r1R55J951J125j236
$$ 2187 3528 3446 1052 -1945 -3887 -3407 -597 2221 3201 2163 -217 -2328 -2419 -1464 487 1612 376
805C76j964j254J046J498J508J679k99k365k423N83J729J114M81M56k337l195
$$ 376 -1588 -2842 -1796 -298 1210 2889 2590 225 -2198 -1615 114 1228 1709 2165 -172 -3367
821c367M27K795K401R81J192k309m200k623J824K866J323R64l68l120l751N72
$$ -3367 -2940 -145 2256 3237 4429 2120 -2080 -4703 -2879 -13 1310 2274 1906 -1214 -4965 -4393
837d393M022K935J273L43j867m947l418K500L465J598J025Q46k681l802J64L706
$$ -4393 -371 2564 3837 4180 2313 -2634 -6052 -3552 -87 1511 2536 3382 701 -3101 -2937 769
853G69J386MM45q35l949k531K610K887o25O8J440p36k341M12L271K27l358o24
$$ 769 2155 2159 2604 1769 -2180 -4711 -2101 786 161 229 1669 933 -1408 -996 2275 2502 -856 -1480
871a480O47j658p13L649L528k397k981J126N06j697J559M988q28n634k537J144
$$ -1480 -833 -2491 -3204 445 3973 1576 -1405 -279 227 -1470 89 5077 4249 -1385 -3922 -2778
887b778l26J19N446M496l338n452J04N60j735J555O572j65o468k945J832q86o71
$$ -2778 -3104 -2985 2461 6957 3619 -1833 -1729 -1169 -2904 -1349 5223 5058 -1410 -4355 -2523 -3409 -4080
904d080O387N270l760n702P64L19l095J206O869M6n769j355L042j021j813M630
$$ -4080 2307 7577 3817 -1885 -1121 -802 -3897 -2691 4178 4224 -1545 -2900 142 -879 -2692 1938
920A938M226m063m572K554J023l244n7M465l93n333L70M838J44k266K054J712
$$ 1938 6164 2101 -2471 83 1106 -2138 -2195 2270 1877 -3456 -3086 1752 1896 -370 1684 3396
936C396m846l782L510L518k154J16K805k218n107Q67N739J766j482J251k19n119
$$ 3396 -1450 -5232 -1722 1796 -358 -242 2563 345 -4762 -3895 1844 3610 2128 3379 3160 -1959
952a959l407L201L879J83l63J448k227m445J85M611J651o76j26m95m324k867K947
$$ -1959 -5366 -2165 1714 1897 1534 2982 755 -3690 -3505 1106 2757 2081 1955 1460 -2864 -5731 -2784
969b784L612O61j08L33j828l067n3L560K357r51o51j92k199j551J395L954J60
$$ -2784 828 1489 1381 1714 -114 -3181 -3234 326 2683 1732 1081 889 -1310 -2861 -1466 2488 2648
986B648j327l84n62j530Q0K952J207j939k294m35p4m03J671K979k41l152j832
$$ 2648 1321 937 375 -1155 -1075 1877 3084 1145 -1149 -1584 -1658 -2061 -390 2589 2348 -804 -2636
1003b636L90k14J184K841J794k482k739l49N31K44K246K441k31l075j352Q33M03
$$ -2636 -2246 -2460 -1276 1565 3359 877 -1862 -2211 -1680 -1436 810 3251 3020 -55 -1407 -574 -171
1020a71J155J971M26k660k418n9J013R68J507Q86j680l039j130Q30J735J487J520
$$ -171 984 2955 3381 721 -1697 -1756 -743 225 1732 2618 938 -2101 -3231 -2401 -666 821 2341
1037B341r12k441k427L51J444J977J550K94j651k102m56J176J548K314M3j289
$$ 2341 1429 -1012 -3439 -3088 -1644 333 1883 2177 526 -1576 -2032 -856 692 3006 3049 1760
1053A760k130j244L17J917J653N84q92k571j621o0J525J732Q72j89k224k194n65
$$ 1760 -370 -1614 -1297 620 2273 2857 1965 -606 -2227 -2287 -762 970 1842 1653 -571 -2765 -3330
1070c330P85J641J725O40q18j795o14Q33R65J169O54m98j949o44P90J932R94J22
$$ -3330 -2545 -904 821 1461 643 -1152 -1766 -933 32 1201 1855 1357 -592 -1236 -446 1486 2480 2602
1088B602m26j629k099J50J741K023K30j357j496k198j786J606L465J421m70j611
$$ 2602 2176 547 -1552 -1402 339 2362 2592 1235 -261 -2459 -4245 -2639 826 2247 1777 166
1104A66j490k304m50L281K731k07j594k01j385j278J851L700O62j397j094n40
$$ 166 -1324 -3628 -4078 -797 1934 1727 133 -68 -1453 -2731 -880 2820 3482 2085 991 451
1120D51k130l90L444K102j394j987m8j295j468J962L555o34k217j067M27k367
$$ 451 -1679 -2069 1375 3477 2083 96 48 -1247 -2715 -753 2802 2168 -49 -1116 -689 -3056
1136c056m6L100J560j910j599J141Q8q38K063K279j239l193Q5J393l16Q29L331
$$ -3056 -3102 -2 1558 -352 -1951 -810 -722 -1560 503 2782 1543 -1650 -1565 -172 -488 341 3672
1153C672n5l498k016J350M79j35K473J997k699l487n87J105m46J575K982n30l451
$$ 3672 3617 119 -1897 -547 -68 -203 2270 4267 1568 -1919 -2506 -1401 -1847 -272 2710 2180 -1271
1170a271j514Q37N50L56K159J086j950k500J01J201O25J483J919r08l030o02P79
$$ -1271 -2785 -1948 -1398 -1042 1117 2203 253 -2247 -2146 -945 -320 1163 3082 2174 -856 -1458 -679
1187f79J098M93J861k93k308j805l9J387P84Q76O42j653k239l42J144R21Q90K98
$$ -679 419 912 2773 2480 172 -1633 -1672 -285 499 1375 2017 364 -1875 -2217 -1073 -152 738 1036
1205A036q30j828p83J031J544J075M94p60j960j728P90K113J216J306m15j503
$$ 1036 206 -1622 -2405 -1374 170 1245 1739 979 -981 -2709 -1919 194 1410 2716 2301 798
1221G98k289j15J037J612J087Pj132k296p45M55J192J324L43P9j859j234J27J294
$$ 798 -1491 -1606 -569 1043 2130 2137 1005 -1291 -2036 -1581 -389 935 1278 1357 -502 -1736 -1609 -315
1239c15R67L55l44j441j379p1J770J594K74K44j104j589n17J025J607R18m28p54
$$ -315 652 1007 663 -778 -2157 -2228 -458 1136 1410 1654 550 -1039 -1556 -531 1076 1994 1566 812
1257H12j407j299O19J819J315k00j067j226j399k88J767J830J63m48j512j267
$$ 812 -595 -1894 -1275 544 1859 1659 592 -634 -2033 -2321 -554 1276 1439 991 -521 -1788
1273a788n85O10K620J248l98j503j283j264L31J942J629N97r57j000j101p29R28
$$ -1788 -2373 -1763 857 2105 1707 204 -1079 -2343 -2012 -70 1559 2156 1199 199 -902 -1631 -703
1290g03J971P68q72j140p87o84N63J039J254n94r70q86O6K46Q54R07M79j437j339
$$ -703 1268 2036 1164 24 -763 -1447 -884 155 1409 815 -155 -1041 -975 -729 125 1032 1511 74 -1265
1309a265k77M75J051J189P68j156j594q24O38J028J151Q61p52j769j450K78Q04
$$ -1265 -1542 -1067 -16 1173 1941 785 -809 -1633 -995 33 1184 2045 1293 -476 -1926 -1648 -844
1326h44J308J224J82j371j787m03Q29P25J366N97r28k042j149N51J252J624P84
$$ -844 464 1688 1870 499 -1288 -1691 -862 -137 1229 1826 898 -1144 -2293 -1742 -490 1134 1918
1343A918m40j199j533p90R22J560J006J39r62j369o23M33R05R79M29o81j262n21
$$ 1918 1478 279 -1254 -2044 -1122 438 1444 1583 621 -748 -1371 -938 -33 946 1375 694 -568 -1089
1361a089J30R21J066J90p87r13q99M23P49J156L30m23j457l81l50M63J246J220
$$ -1089 -959 -38 1028 1218 431 -482 -1381 -958 -209 947 1277 854 -603 -984 -1334 -871 375 1595
1379A595j07j773q43l17N23R27J432M27j527j014o46k5R94J468O80q41j486p37
$$ 1595 1488 -285 -1128 -1445 -922 5 1437 1864 337 -677 -1323 -1348 -354 1114 1794 953 -533 -1270
1397a270%N71J269J382m51j975j051j00L43Q75J739O40j331j941R1L49L43J242
$$ -1270 -1270 -699 570 1952 1501 -474 -1525 -1625 -1282 -407 1332 1972 641 -1300 -1209 -860 -517 725
1415G25J241r76j769l47J83J44J260J193o2k038r58N13L39P67Q42J033j860j612
$$ 725 1966 990 -779 -1126 -943 -799 461 1654 1592 -446 -1404 -891 -552 215 1057 2090 230 -1382
1433a382K2P63J80O53J576p02j944n05P39K54O62Q03J22j849r14O55Q30L50M50
$$ -1382 -1360 -597 -417 236 1812 1110 -834 -1339 -600 -346 316 1119 1241 -608 -1522 -867 -37 313 763
1452G63M96r54j650Q1J324N14K60N05p37j825p84J312J416O8L17Q4j671j702O14
$$ 763 1259 305 -1345 -1264 60 574 834 1339 602 -1223 -2007 -695 721 789 1106 1190 -481 -2183 -1569
1471a569J947O31P0J08q20j928o99J621J548L6J19O4j433j702R05J625M67k20
$$ -1569 378 1009 1079 1187 367 -1561 -2260 -639 909 945 1064 1128 -305 -2007 -1102 523 990 770
1489G70M0n49j779k23J928Q31l02k57L09j230j249P97J804k61q18M89o30r28J64
$$ 770 810 261 -1518 -1741 187 1018 716 459 768 -462 -1711 -914 890 629 -189 300 -330 -1258 -1094
1508a094J847M52j085Qj73p40m17J164J374m47j137l07j37l32Q10J865J58j277
$$ -1094 753 1205 120 128 -45 -785 -1202 -38 1336 889 -248 -555 -692 -1024 -214 1651 1809 532
1526E32p41p54k95K11J474J251m35j311p81m05j81J279J370k3p15j393q9m74P93
$$ 532 -209 -963 -1258 -1047 427 1678 1243 -68 -849 -1254 -1435 -156 1214 1191 476 -917 -1006 -1480 -687
1545f87J058J060l11j313p24k70R50Q02O69K23r49j359l71N63Q44K37M96K28j490
$$ -687 371 1431 1120 -193 -917 -1187 -237 565 1234 1457 508 -851 -1222 -659 185 422 918 1146 -344
1564c44o30K29J017J35jN50j075j142j41J474O47k96N2j27j389l81J631P83k64
$$ -344 -974 -745 272 407 406 956 -119 -1261 -1402 72 719 423 475 348 -1041 -1422 209 992 728
1583G28l00K12r87j865J081K386P9j56o41o1j744l66J924J173q55m57M38j239
$$ 728 428 640 -347 -2212 -1131 1255 1334 1178 537 476 -1268 -1634 290 1463 608 151 589 -650
1601f50j405J112K050j18r69l7J54j697K16J660O32o92m18K55n29p96J066J631
$$ -650 -2055 -943 1107 989 20 -17 137 -1560 -1344 316 948 256 -162 93 -436 -1232 -166 1465
1619A465j19j223M1j43j335L18J465P67j299n7J39p21l13J512J020j041j282j83
$$ 1465 1346 123 164 21 -1314 -996 469 1236 -63 -120 19 -702 -1015 497 1517 476 -806 -989
1637i89L27k41O94J366O5j163j086J83M11K13O26J315j091j026p01M84k8O99J301
$$ -989 -662 -903 -209 1157 1222 59 -1027 -844 -433 -220 406 1721 630 -396 -1097 -613 -641 58 1359
1656A359L19j263j000J32p6M79M56N97k55j547m47Q45L36M50L37l37r60o17M09
$$ 1359 1678 415 -585 -453 -529 -50 406 1003 748 -799 -1246 -401 -65 385 722 385 -575 -1192 -783
1675g83N45M11N21k25m29j002N8O96O48M75o6j62r95q55Q27Q25R8J83k76j071
$$ -783 -238 173 694 469 40 -962 -904 -208 440 915 849 687 -308 -1163 -336 489 587 770 494 -577
1695e77l83O3J123M79M65l34j161q54m6O77J192M72k31o59j150m67N41J162P05
$$ -577 -960 -897 226 705 1170 836 -325 -1179 -1225 -548 644 1116 885 226 -924 -1391 -850 312 1017
1714A017l9o86m68p46r4P87P18P57p75n06k25m69K45J073N00q11n32j09k64j30
$$ 1017 978 292 -176 -922 -1016 -229 489 1246 471 -35 -260 -729 -484 589 1089 278 -254 -363 -627 -757
1734g57P95Q46Nq04p51l15K15N41J067n5r81k60j21k06N67J116K21o54p95q7j39
$$ -757 38 884 889 85 -666 -981 -766 -225 842 787 -194 -454 -575 -781 -214 902 1123 469 -326 -413 -552
1755e52J57Q91M23o57n20k90m47M05Q40Q62o0j158n31J12o44O88J172M33q27q72
$$ -552 -395 496 919 262 -258 -548 -995 -590 250 1112 1052 -106 -637 -525 -1169 -481 691 1124 297 -575
1775e75J72p81M54J212O88o93o64O5m54k51M71J149j95p23l27q7j91M68J442r0
$$ -575 -403 -1184 -730 482 1170 477 -187 -122 -576 -827 -356 793 598 -125 -452 -539 -730 -262 1180 1090
1795A090r93n88L32m71J63J093N73r76n64k04M35l73Q00Q86m52j221k10K81k49
$$ 1090 97 -491 -159 -630 -467 626 1199 223 -341 -545 -110 -483 317 1203 751 -470 -680 -399 -648
1814f48M96J094J82j608J00J30m70M39J119O00j194p39L5j09k91J147R65o35j349
$$ -648 -152 942 1124 -484 -384 -254 -724 -285 834 1434 240 -499 -464 -573 -864 283 1248 613 -736
1833g36K55K17o10Q00J337m10j149m87L82j68j9J502J03r10r32N79j17k55P99
$$ -736 -481 -264 -874 -74 1263 853 -296 -783 -401 -569 -588 914 1017 107 -825 -246 -363 -618 181
1852A81J047o93j522L42K15k47M02J264M4j476k25N08j84J70P61N76j201r38P49
$$ 181 1228 535 -987 -645 -430 -677 -275 989 1033 -443 -668 -160 -344 -174 587 1163 -38 -976 -227
1871b27q1m5N40J012o53j186K7N27J44j00J157m05j183o37R89M9QO87N10r50r26
$$ -227 -308 -353 187 1199 546 -640 -613 -86 58 -42 1115 710 -473 -1110 -121 -72 -64 623 1133 183 -743
1892g43J24O31l7L71Q37n43j473m74P93N62J62O55J31j004j011K58Q04r8M19N05
$$ -743 -619 12 -25 346 1183 640 -833 -1307 -514 48 210 865 996 -8 -1019 -761 43 -55 364 869
1912H69n27j071j38O04O35l6O96l12j022p11P91N24r2K65J66l94p16j12P02N07
$$ 869 342 -729 -867 -263 372 336 1032 720 -302 -1013 -222 302 210 475 641 247 -469 -581 121 628
1932F28p4K59l87j019k46Q00N52k31L5K79r65l99P04Q99j70m69K39l42r24K68
$$ 628 554 813 426 -593 -839 -39 513 282 317 596 -369 -768 -64 835 665 196 435 93 -831 -563
1952e63O76P41l74j66n2q65m51Q05J226m07l83P3m94j020O21R82O74n42J38p04
$$ -563 113 854 480 314 262 -603 -1054 -249 977 570 187 260 -234 -1254 -633 349 1023 481 619 -85
1972h5n73n3Q03P57l99k87p5p59q3O98O80l59K6J42o30n73K66R64M27n03m61j14
$$ -85 -658 -711 92 849 450 163 88 -671 -754 -56 624 265 291 433 -197 -770 -504 460 887 384 -77 -191
1994a91l52m5O60O34m93Q2m37j95k39O33M45N9n56m93L19k32N6N60Q40m14n87
$$ -191 -543 -588 72 706 213 295 -142 -337 -576 57 502 561 5 -488 -169 -401 -345 215 1055 641 54
2015E4n24l1r1M72J007j50n29o28q0J87J92M69O54m62p30n46K35P6M08L54L23
$$ 54 -470 -501 -592 -120 887 737 208 -420 -500 -313 -121 348 1002 540 -190 -736 -501 -425 -17 337 660
2036F60q67m75K90L78M60J15J67l92j104R8K98L30M46Q9o2n51m13p7P40L69l7
$$ 660 -207 -682 -392 -14 446 561 728 336 -768 -670 -372 -42 404 493 431 -120 -533 -610 130 499 462
2057D62J3m14q21J44N87M73J92k08o9p61k88L75M43M17q0m56j71n95R5Q06M54
$$ 462 475 61 -760 -616 -29 444 636 428 359 -402 -690 -315 128 545 465 9 -162 -757 -662 144 598
2078E98J78j24m94n24o97Q69R62j96o55P6l64r0M4O35O10p12L1k00j83p25O22
$$ 598 776 652 158 -366 -1063 -194 768 572 -83 -7 -371 -461 -417 218 828 116 147 -53 -236 -961 -339
2099c39J273k07q67k64K46k64OJ048M73j124o81N43j11l04N98P03k33r67k3O28
$$ -339 934 727 -140 -404 -158 -422 -416 632 1105 -19 -700 -157 -268 -572 26 729 496 -471 -494 134
2119A34n01JR29K69o81l73j58K6Q9K35R60j22j217k63L02M49o9O65N09j234o85
$$ 134 -367 -366 563 832 151 -222 -380 -354 -265 -30 930 808 -409 -672 -370 79 10 675 1184 -50 -735
2140g35N36M35k81M65N13n98r05k05M80N33p8K26J94r11o28L97R37k66J2N70m07
$$ -735 -199 236 -45 420 933 335 -570 -775 -295 238 160 386 580 -331 -959 -562 375 109 121 691 284
2161B84r75oP81L46m11L46o5o75p11R89N78J1l70O8j92j045J77J195J99m70N6
$$ 284 -691 -697 84 430 19 365 300 -375 -1086 -97 481 492 122 190 -2 -1047 -870 325 524 54 110
2182A10O8n17p45J092O22l5m29N9l23n13O5J378r6l99m54K1m55M8N77N24m1l24
$$ 110 178 -339 -1084 8 630 595 166 225 -98 -611 -546 832 736 337 -117 -96 -551 -503 74 598 557 233
2204B33r9n10k47K58P56K10o51k2k87q4J53N08Q31n58o38j64oP4J53N33m4m12
$$ 233 134 -376 -623 -365 391 601 -50 -72 -359 -443 -290 218 1049 491 -147 -311 -317 -243 -90 443 399 -13
2226a3k03o45N59J37O15P5j94l29m31R1M10L65J3k51j67n70l83Q34M68k22J86
$$ -13 -216 -861 -302 -165 450 525 331 2 -429 -338 72 437 450 199 32 -538 -921 -87 381 159 345
2247C45Q7o07q49M84Q21o8J69j0n24o95J53P72N26l11j51k78m37J08J13J031k77
$$ 345 432 -175 -1024 -540 281 213 382 372 -152 -847 -694 78 604 293 142 -136 -573 -465 -352 679 402
2268D02j91p4m77j46J33Q03L58n97J59m56n48J1P48K37k46J70j36p29nM22P66
$$ 402 211 137 -340 -486 -353 450 808 211 370 -86 -634 -623 125 362 116 286 150 -579 -584 -162 604
2289F04j86l26j8j86m85K88N15O4k3L3k89p09K13Q23K05k99k04l15l65m4N64O11
$$ 604 418 92 74 -112 -597 -309 206 270 247 280 -9 -718 -505 318 523 224 20 -295 -660 -704 -140 471
2311D71j59j51j98n2l92K46M50K91l06m47r1n7j99R03L94j96m46j1n60O6K72O83
$$ 471 312 161 -37 -89 -481 -235 215 506 200 -247 -338 -395 -594 309 703 507 61 50 -510 -444 -172 511
2333E11J49m10l55l11j31K64P14O6q5m82j52k37o5P89K88j17m48k57l1M2L8Q02
$$ 511 660 250 -105 -416 -547 -283 431 497 412 -70 -222 -459 -524 265 553 436 -12 -269 -300 -258 -220 582
2355E82K6l47n29K01j67j18O77P1P2o29l58L59Q0M19K46Rm23n59J3K55J59K82
$$ 582 608 261 -268 -67 -234 -352 325 396 468 -161 -519 -160 -80 339 585 594 171 -388 -375 -120 39 321
2377C21L92l82o39k04L71P9J24N94n05k96m19L58J47R4N31j70l74p97K06M93P5
$$ 321 713 331 -308 -512 -141 -62 62 656 151 -145 -564 -206 -59 35 566 396 22 -775 -569 -76 -1
2398aM06J5k98o46j05M01K53L20K34k76n78o15Q67N0J4L83M8n02p03L45M82K19
$$ -1 405 420 122 -524 -629 -228 25 345 579 303 -275 -890 -23 27 41 424 472 -30 -733 -388 94 313
2420C13j06m5j36n44O3J89L77O5J26k47j07n09J09P29J91k36k70K8k82R1k4M24
$$ 313 207 162 26 -518 -455 -266 111 176 302 55 -52 -561 -452 277 468 232 -38 -10 -292 -201 -225 199
2442A99K8j58n7k26k9N8M26N09p35K76l85k86j61L87P12on06j33j07j47J94M62
$$ 199 227 69 12 -214 -243 -185 241 750 15 291 -94 -380 -541 -154 558 552 46 -87 -194 -341 -147 315
2464C15L80l84m50J10k82k8L08P49k51n22l08m1J97k5M96M12p20m90J1L25N48
$$ 315 695 311 -139 -29 -311 -339 -31 718 467 -55 -363 -404 -207 -232 264 676 -44 -534 -523 -198 350
2485C50n05O63J18p86l97K57L67n1J31M36p42m39K32N47M2l8L03r2j018Q7N70
$$ 350 -155 508 626 -160 -557 -300 67 16 147 583 -159 -598 -366 181 223 185 488 396 -622 -535 35
2506C5o4J00K04L46p30n35M11M26k3Q9L00k74q60K81M32Q4j30j44M73p43l60M34
$$ 35 -29 71 275 621 -109 -644 -233 193 170 259 559 285 -575 -294 138 222 92 -52 421 -322 -682 -248
2528b48Q34n60J75J20j35o90K38L85L18k66k12m5p2n69N88Q00l37l81J85m52o57
$$ -248 586 26 201 321 186 -504 -266 119 437 171 -41 -86 -158 -727 -139 661 324 -57 128 -324 -981
2549i81O61P10Nl79L2lk41l15O46M26k55o03K89J5o53L70Q99n51l0j75k6j21j88
$$ -981 -320 390 395 16 48 45 -196 -511 135 561 306 -297 -8 7 -646 -276 623 72 42 -133 -159 -280 -468
2572d68M25Q11k86n21k00Q7l00L23N17J45m26n21J39K99j45L50M04n32l95K25
$$ -468 -43 768 482 -39 -239 -152 -452 -129 388 533 107 -414 -275 24 -121 229 633 101 -294 -69
2592f9j33j4K51K68K21q70p1J74L93k3J87j17l61j8J19Q7l65M67L72l68m43l64
$$ -69 -202 -216 35 303 524 -346 -417 -243 150 127 314 197 -164 -182 -63 24 -341 126 498 130 -313 -677
2614f77Q16k25K79Q7J38l50n66L12P8K05J40M00j94r94JM47L9K42J35O1n55r1
$$ -677 139 -86 193 280 418 68 -498 -186 -108 97 237 637 443 -551 -550 -103 -64 178 313 374 -181 -272
2636b72r1O30k32M0K5j21l43K46J47L25j65P9m47m30K1O14J52M8J32p2m36l07
$$ -272 -363 267 35 75 100 -21 -364 -118 29 354 189 268 -179 -609 -588 26 178 226 358 286 -150 -457
2658d57K59N25j55J86o4l50m09J41M39nL85j35n00o7k39L82L91K06m68J5k30j50
$$ -457 -198 327 172 358 294 -56 -465 -324 115 110 495 360 -140 -207 -446 -64 327 533 65 80 -150 -300
2680c00K6L09J28K04l15l2l90R0J79J25L52k77k67l25K42J79L45L32j27k70m52
$$ -300 -274 35 163 367 52 20 -370 -280 -101 24 376 99 -168 -493 -251 -72 273 605 478 208 -244
2701b44J8J90J90J18k26q7l02J34K64n5K50J18k88k35l32M26l40M09L74K4o90
$$ -244 -226 -36 154 272 46 -41 -343 -209 55 0 250 368 80 -155 -487 -61 -401 8 382 406 -284
2722b84oK89L1K91J00Q6m10l27K37m55L04N01J68j62m69k70L29O5L61k04o2k22
$$ -284 -290 -1 30 321 421 507 97 -230 7 -448 -144 357 525 363 -106 -376 -47 18 379 175 113 -109
2744a09k99L27K11m2K9L9q5l70J4L95O0n4L47j89m49j75L13L61k81K24j8k79n00
$$ -109 -408 -81 130 88 117 156 71 -299 -285 110 170 116 463 274 -175 -350 -37 324 43 267 249 -30 -530
2767e30K48P26j61k43J37m3l15k93L85K24Mk14J75l80k16L50O8K40O2Pk44m29
$$ -530 -282 444 283 40 177 134 -181 -474 -89 135 139 -75 100 -280 -496 -146 -78 162 224 231 -13 -442
2789d42J34M40R0j33K6J50m57P1L16j23J13j63K2j71j34K71K52o3K6p5j37j20
$$ -442 -308 132 222 89 115 265 -192 -121 195 72 185 22 44 -127 -261 10 262 199 225 150 13 -107
2811a07m6K04L18j15k53K0m51M38k24O17j53k27o2L5k48J58J05K94j43k56m05
$$ -107 -153 51 369 254 1 21 -430 8 -216 401 248 21 -41 -6 -254 -96 9 303 160 -96 -501
2832e01J93K12J8N64nn13o55N17k0k9L26K52k27R3l80L04n5m8J77R6l05l17J22
$$ -501 -308 -96 -78 486 481 -32 -687 -170 -190 -219 107 359 132 225 -155 149 94 46 223 319 14 -303 -181
2855a81lJ05K25L41l63l78J96j36O32l63N3q1n11O9L71o8L15K79j91n08k63K08
$$ -181 -184 -79 146 487 124 -254 -58 -194 438 75 128 47 -464 -395 -24 -92 223 502 311 -197 -460 -252
2877b52L1L82K00k43k24k42J50O6J14J83J78k19l47j20M8M20J26ok28j70j19J68
$$ -252 -221 161 361 118 -106 -348 -198 -132 -18 165 343 124 -223 -343 -295 125 251 245 17 -153 -272 -104
2899a04N7N41j09l21nm07n5K07M07j34R8j71k51J37m5J78M55k48nl99l97M01n8
$$ -104 -47 494 385 64 59 -348 -403 -196 211 77 175 4 -247 -110 -155 23 478 230 225 -174 -571 -170 -228
2922b28N64r0P5o07K25Q7m19N57mj38j61Q1j05j15J01M65k7k70j36J64j4k72N27
$$ -228 336 246 321 -286 -61 26 -393 164 160 22 -139 -58 -163 -278 -177 288 261 -9 -145 19 5 -267 260
2945B60K17m88k15L1J64q4M59M5j08m6m10P7k98L02K62Jl17j03j53K97jJ56L64
$$ 260 477 -11 -226 -195 -31 -115 344 389 281 235 -175 -98 -396 -94 168 169 -148 -251 -404 -107 -108 48 412
2968D12l63k55j74J39p4M23N8J97l76j00k27M88J42j2J37l20o65K71L40r5K88
$$ 412 49 -206 -380 -241 -315 108 166 363 -13 -113 -340 148 290 278 415 95 -570 -299 41 -54 234
2989B34rj4q1m59Q0L23J96J91j45l53m01L41m3J76O1J40k50m28L89j05K25j54
$$ 234 225 211 130 -329 -249 74 270 461 316 -37 -438 -97 -140 36 97 237 -13 -441 -52 -157 68 -86
3011h6J41l1j47M1j0J4K04Mj14j66N1K60k21R8L31k65m5j62k93K55M43k5r2j18
$$ -86 55 24 -123 -82 -92 -78 126 130 16 -150 -99 161 -60 38 369 104 59 -103 -396 -141 302 277 185 67
3035F7k50j18L19j38K30K30k84l22R2J38k37M96m7j22k44k3J01M9M62j64M4m65
$$ 67 -183 -301 18 -120 110 340 56 -266 -174 -36 -273 223 176 54 -190 -213 -112 -63 399 235 279 -186
3057a86Qj25o0O96L5o0m57P7m27M29j38L92J17m58M1l68K64L27m5K34k57j78j05
$$ -186 -178 -303 -363 333 368 308 -149 -72 -499 -70 -208 184 301 -157 -116 -484 -220 107 62 296 39 -139 -244
3080b44k17R1L24J89J10j25j65k14K87j21M29N8j79n21J68J67N4P4K78k02p57
$$ -244 -461 -370 -46 143 253 128 -37 -251 36 -85 344 402 223 -298 -130 37 91 165 443 241 -516
3101e16L98m6K83j51N15q6n67J0k33M57J87K1R6l45j89k71J93N87k18j21K47m86
$$ -516 -118 -164 119 -32 483 397 -170 -160 -393 64 251 272 368 23 -166 -437 -244 343 125 4 251 -235
3123b35J1j56N40J22n01N23k20m45K6M31J3J59q9j77q5j58L5K00L09k59J2Ml77
$$ -235 -224 -380 160 282 -219 304 84 -361 -335 96 109 268 179 2 -83 -241 -206 -6 303 44 56 60 -317
3146c17J47L32N3j40K08l07n1k18R0M94n7j33n4k07J26q6K71J14q7R9m08l12L08
$$ -317 -170 162 215 75 283 -24 -75 -293 -203 291 234 101 47 -160 -34 -120 151 265 178 277 -131 -443 -135
3169a35J84P3j34K65k52k45K35l22M48Q2m2n72J58q7J86L13nqk13l42K38kJ22
$$ -135 49 122 -12 253 1 -244 -9 -331 117 199 157 -415 -257 -344 -158 155 150 142 -71 -413 -175 -177 -55
3192e5K12j05n5P3l51L42k83N17o1k6m46k42L91K11J69k0n0m66L3J66K85m08K79
$$ -55 157 52 -3 70 -281 61 -222 295 234 208 -238 -480 -89 122 291 271 221 -245 -212 -46 239 -169 110
3215A10J41p7m70k8N6M27K92k23K5m95L2j25N67P0j61J75r5m45m2P4M41j21k3
$$ 110 251 174 -296 -324 -268 159 451 228 253 -242 -210 -335 232 302 141 316 221 -224 -266 -192 249 128 105
3238A05j10nj66J38K53j0J0j67k57mL09NJ29k08j28j03J49j29K02K34k9J47n70
$$ 105 -5 -10 -176 -38 215 205 215 48 -209 -213 96 101 230 22 -106 -209 -60 -189 13 247 218 365 -205
3261b05J55l00J28J15J44J83j91k63m0M10m22L39L64m80k15r2L70q3J99K97l50
$$ -205 -50 -350 -222 -107 37 220 29 -234 -274 136 -286 53 417 -63 -278 -370 0 -83 116 413 63
3282F3n29K00R6L09K8l6R0k2m4m39L18j54K41J44p9j48k55J53K8K07M1K15o74
$$ 63 -466 -266 -170 139 167 131 221 199 155 -284 34 -120 121 265 186 38 -217 -64 -36 171 212 427 -247
3305b47j22K53m0M98l74L58m65j94J31K28j55M87j86k46k08K31l21L59L59k61
$$ -247 -369 -116 -156 342 -32 326 -139 -333 -202 26 -129 358 172 -74 -282 -51 -372 -13 346 85
3325H5Q6kj84K6j39N7K12j2l99K09j04L44j78J73j3k75k61J85J9M06o8n3J16k70
$$ 85 171 169 -15 11 -128 -71 141 129 -270 -61 -165 179 1 174 161 -114 -375 -190 -171 235 167 114 230 -40
3349d0j2j71L97n0K12m37m5q5K85k34L82L3km5n50O1J65K23k9K44k20K67m95J85
$$ -40 -52 -223 174 124 336 -101 -146 -231 54 -180 202 235 233 188 -362 -301 -136 87 58 302 82 349 -146 39
3373C9N6k11L71j11l71J51K1r6J29J75j51L2k39J79L8K27l6k23j64k8q3L3M66
$$ 39 95 -116 255 144 -227 -76 -55 -151 -22 153 2 34 -205 -26 12 239 203 -20 -184 -212 -295 -262 204
3396B04J06J8l59J18q4P8k80M43j11R5j93k35j81L51L38K05j60l56Q0k05J50J10
$$ 204 310 328 -31 87 3 81 -199 244 133 228 35 -200 -381 -30 308 513 353 -3 77 -128 22 132
3418A32k9oj75PJ60j20NO7N8k29j3Pqk0L11q5K45j21l11j55J31L27Jk14K23k31
$$ 132 103 97 -78 -71 89 -31 -26 41 99 -130 -143 -136 -144 -164 147 62 307 186 -125 -280 -149 178 179 -35 188 -43
3444d3M7o9L36j28O2M3j90m14L02K61l93K60L1l80j55N0M91q4M2J67K9m39j15
$$ -43 4 -65 271 143 205 248 58 -356 -54 207 -186 74 105 -275 -430 -380 111 27 69 236 265 -174 -289
3467b89J76J21p0m8J06k72qo3M22L10l55J24l86R3O3J50J28o2j56k0n5j18J2N78
$$ -289 -113 8 -62 -110 -4 -276 -284 -347 75 385 30 154 -232 -139 -76 74 202 140 -16 -36 -91 -209 -197 381
3491C81m63K43j28k75j48M48J06j6O6j93k83Q0j09M78O5k85j46J11k23M6J56Q8
$$ 381 -82 161 33 -242 -390 58 164 148 214 21 -262 -182 -291 187 252 -33 -179 -68 -291 -245 -89 -1
3513aO0Q8l36K06j91l4K41K53l2k01j78k13O1K71L46p4k25k41K93k93J55L41K20
$$ -1 59 147 -189 17 -174 -208 33 286 254 53 -125 -338 -277 -6 340 266 41 -200 93 -200 -45 296 516
3536E16m20m56J89l72N11J93K17j71j74k83K02q0K07J39R8n37K51k75M4KK13P7
$$ 516 96 -360 -171 -543 -32 161 378 207 33 -250 -48 -128 79 218 316 -221 30 -245 -201 -199 14 91
3558I1p0j45R4K55l85L1K26j51r2m0j01L39r8M80m2m64j74J04%J54j17K79r1j53
$$ 91 21 -124 -30 225 -160 -129 97 -54 -146 -186 -287 52 -46 434 392 -72 -246 -142 -142 12 -105 174 83 -70
3582g0N3j19L39q0N7J37k57k19K03q1j1M42j01l37j02J69j59Q0L50j16j27R0k44
$$ -70 -17 -136 203 123 180 317 60 -159 44 -37 -48 394 293 -44 -146 23 -136 -56 294 178 51 141 -103
3605a03j05L23O1Q4j32l46K15j01n0L60l2k69l4o5j41K89M3K76j64m9k48n1J27
$$ -103 -208 115 176 260 128 -218 -3 -104 -154 206 174 -95 -129 -194 -335 -46 -3 273 109 60 -188 -239 -112
3628a12n8J47K17p3k28j75J77O2J68j0J67l52k05L20j70K14r9J94o8k88N3k3K36
$$ -112 -170 -23 194 121 -107 -282 -105 -43 125 115 282 -70 -275 45 -125 89 -10 184 116 -172 -119 -142 94
3651I4M2j19j80l7L31j60L9J49L46k09k97j70k20J64M98k24J9k15l7L44k77L42
$$ 94 136 17 -163 -200 131 -29 10 159 505 296 -1 -171 -391 -227 271 47 66 -149 -186 158 -119 223
3673B23j10J16l53j14J92k60K46J72K1o3j17k11J41J4L44m9k09p5L21k70q3J76
$$ 223 113 229 -124 -238 -46 -306 -60 112 133 70 -47 -258 -117 -103 241 192 -17 -92 229 -41 -124 52
3695E2K17k19m28M09j51j49J51J68N7Nk75N0j28L20J3J47m33j4K27l91K34M05
$$ 52 269 50 -378 31 -120 -269 -118 50 107 112 -163 -113 -241 79 92 239 -194 -208 19 -372 -138 267
3717B67k13R2l78k10J03L07J34rL6k2l33J9J71J91j76Q4J0j36k6J36m8k03N93
$$ 267 54 146 -232 -442 -339 -32 102 93 129 107 -226 -207 -36 155 -21 63 73 -63 -89 47 -1 -204 389
3740C89j45k76j6k04K62K11j07N7o5k15Q5o1N18l24j28j30J96k13K36nk23J37
$$ 389 244 -32 -48 -252 10 221 114 171 106 -109 -24 -85 433 109 -19 -149 47 -166 70 65 -158 -21
3762b1J35k50L26M8k83J42K52n7j9k55j92K52o4rJ1r0J03q3j57J85k3P0J54k85
$$ -21 114 -136 190 238 -45 97 349 292 273 18 -174 78 14 5 16 -74 29 -54 -211 -26 -49 21 175 -110
3786a10K36j39K45j27K78n87R0K7J03j08K31r8N6j28l12K09J36N2O3K05m20l6
$$ -110 126 -13 232 105 383 -204 -114 -87 16 -92 139 41 97 -31 -343 -134 2 54 117 322 -98 -134
3808a34R9J52j13Q9K6Ml37K99j50j48J56K40k19P0k99J52NJ15O1J55k51j15j92
$$ -134 -35 117 4 93 119 123 -214 85 -65 -213 -57 183 -36 34 -265 -113 -108 7 68 223 -28 -143 -335
3831c35J79K16J04M6J5p6k25J16p5nK83l22Q5k63K75Q2j38Q4J75l20J69p36O86
$$ -335 -156 60 164 210 225 149 -76 40 -35 -40 243 -79 6 -257 18 100 -38 46 221 -99 70 -666 20
3854B0L28l22r2LL32o69J57K13K22k76Qr1L0j43K69J78j28J79j94j77J93k47K91
$$ 20 348 26 -66 -63 269 -400 -243 -30 192 -84 -76 -167 -137 -280 -11 167 39 218 24 -153 40 -207 84
3877H4L7k40J8K36m26oO10j83j22j49L7k3j65K24L94j31p8j50j12O0j65L41Q5
$$ 84 121 -119 -101 135 -291 -297 313 130 8 -141 -104 -127 -292 -68 326 195 117 -33 -145 -85 -250 91 176
3900A76j07k07P7r0l6L31j78j0J76j09j72J72L1J4J47k81J08j97L50k90J60k01
$$ 176 69 -138 -61 -151 -187 144 -34 -44 132 23 -149 23 54 68 215 -66 42 -155 195 -95 65 -136
3922a36J74j76J21j16r5L25K27k71k06J61k24J24J36J08k05N4m3k50J8J57MO8
$$ -136 38 -138 -17 -133 -228 97 324 53 -153 8 -216 -92 44 152 -53 1 -42 -292 -274 -117 -113 -45
3944d5N3O8j26J67P9n0j47k04r6M7ML07m1N0k7K58l54K5N8K97j57j71O4J99m44
$$ -45 8 76 -50 117 196 146 -1 -205 -301 -254 -250 57 16 66 39 297 -57 -32 26 323 166 -5 59 258 -186
3969a86M3N2J47j16j08L47k66m9P2J42J84k76J47l20N5N2L43k40J06j19p4k61
$$ -186 -143 -91 56 -60 -168 179 -87 -136 -64 78 262 -14 133 -187 -132 -80 263 23 129 10 -64 -325
3991c25K52R5j12K81j4m47K91J3k75M43L4k17m8j15NL7L11R6k95N9j07k7K1l4
$$ -325 -73 22 -90 191 177 -270 21 34 -241 202 236 19 -29 -144 -139 -102 209 305 10 69 -38 -65 -44 -78
4015g8K49k35l68N03k62rJ80J74J95m71J66m5p7K79j70k7M5j2Nj16P8N0j00N1
$$ -78 171 -64 -432 71 -191 -200 -20 154 349 -122 44 -1 -78 201 31 4 49 37 42 -74 4 54 -46 5
4039EMj14j62J45N6J45K51l86j06J35J60l88M24n1k13n6J69K7O7l2j64M09m65
$$ 5 9 -105 -267 -122 -66 79 330 -56 -162 -27 133 -255 169 118 -95 -151 18 45 112 80 -84 325 -140
4062a40J2J27p0j99M80N5m4j88m29L70k01L99j34l1M4k46m8K41m2o5J47j37J76
$$ -140 -128 -1 -71 -270 210 265 221 33 -396 -26 -227 172 38 7 51 -195 -243 -2 -44 -109 38 -99 77
4085G7q6r8jK21M8j65q2k30M44k62K21L14j98m15J57j38L5M1K55k21L7J39k31
$$ 77 -9 -107 -108 113 161 -4 -86 -316 128 -134 87 401 203 -212 -55 -193 -158 -117 138 -83 -46 93 -138
4108a38J05K19l8j15o8J48k19K84j93K05q7j28O1k08l6J12J75j33K87k67n3N1
$$ -138 -33 186 148 33 -35 113 -106 178 -15 190 103 -25 36 -172 -208 -96 79 -54 233 -34 -87 -36
4130c6J69j2q1K2j15K53m63J33K02n2J78j71q9j54L6K19j14J0L47k50j4K8M3j06
$$ -36 133 121 40 62 -53 200 -263 -130 72 20 198 27 -62 -216 -180 39 -75 -65 282 32 18 46 89 -17
4154a7J82k20L37p1l47j03L28J19k45k7j14J72K8j94J25KK79j79O4j90L02k31
$$ -17 165 -55 282 211 -136 -239 89 208 -37 -64 -178 -6 22 -172 -47 -45 234 55 119 -71 231 0
4176@k03L71p8M6o1j71J03o1K91o2j56j24o4L55l27O17p30M61m32j7L3J36P7P4
$$ 0 -203 168 90 136 75 -96 7 -54 237 175 19 -105 -169 186 -141 476 -254 207 -225 -242 -209 -73 4 78
4200G8j60j23M8K13n2k22M76P6p00O61n12K8N45k42J4l35p2J53L35l17J02L39
$$ 78 -82 -205 -157 56 4 -218 258 334 -366 295 -217 -189 356 114 128 -207 -279 -126 209 -108 -6 333
4222C33m01k21K27J36j30J03J5j08r5j33K05j29M03j72k84K67n4j42K69J59j35
$$ 333 -68 -289 -62 74 -56 47 62 -46 -141 -274 -69 -198 205 33 -251 16 -38 -180 89 248 113
4243A13L7k06N3k85K72k87J92J38k2r3q0J38j2J63k73M10m72m2K54jj22K95l02
$$ 113 150 -56 -3 -288 -16 -303 -111 27 5 -88 -168 -30 -42 121 -152 258 -214 -256 -2 -3 -125 170 -132
4266a32K73k24k81M82j02J87l83K64l19j9J06K64O7j25o6J61j80J97j75J93j27
$$ -132 141 -83 -364 118 16 203 -180 84 -235 -254 -148 116 183 58 -8 153 -27 170 -5 188 61
4287F1M4j89j43L18J72m7j76o5K57l24J6J9L2j1J05J78l84j19R6nJ99J5Q5m22
$$ 61 105 -84 -227 91 263 216 40 -25 232 -92 -76 -57 -25 -36 69 247 -137 -256 -160 -165 34 49 134 -288
4311b88K08J67j16q8K31Ok36l4J98K47j21j64j43O7J20j21k69M09j32j43J49m
$$ -288 -80 87 -29 -117 114 120 -116 -150 48 295 174 10 -133 -66 54 -67 -336 73 -59 -202 -53 -57
4333e7j19k6J81P6J32l5j83l03J20K96J4k27N1O3k95J18K73L07l34n0J78k38j61
$$ -57 -176 -202 -21 55 187 152 -31 -334 -214 82 96 -131 -80 -17 -312 -194 79 386 52 2 180 -58 -219
4356b19K22l3k26L08k46J86k3K18l67J52J8J31k48J95l2k22L61l6n7j62o1K29
$$ -219 3 -30 -256 52 -194 -8 -31 187 -180 -28 -10 121 -127 68 36 -186 175 139 82 -80 -141 88
4378H8J77j13l73K68k1L03l93j17K22N9j30O0J14k37O5j86K22j0L42l77K60j3
$$ 88 265 152 -221 47 26 329 -64 -181 41 100 -30 30 144 -93 -28 -214 8 -2 340 -37 223 210
4400B10j3k36J41m1o4Q5L4k7k01N86l90J70q2l02k6N9K03kl64K63p9m7K1L02Q9
$$ 210 197 -39 102 61 -3 82 116 89 -112 474 84 254 172 -130 -156 -97 106 104 -260 3 -76 -123 -102 200 289
4425B89q2l43K9K72r6J62q8K79n68P4J1J15j23J09j03qQ0J35m9n7J44l65J49q7
$$ 289 207 -136 -107 165 69 231 143 422 -146 -72 -61 54 -69 40 -63 -71 9 144 95 38 182 -183 -34 -121
4449a21J10j2J99l57M80k2l50L2qm1%K70k37K93k66N8J24l05L06J61l82r9K21
$$ -121 -11 -23 176 -181 299 277 -73 -41 -49 -90 -90 180 -57 236 -30 28 152 -153 153 314 -68 -167 54
4472E4k29K57r0P3J10k12n6k25L02J98j08L20m82J55j15N5J85m20J55nj16K40
$$ 54 -175 82 -8 65 175 -37 -93 -318 -16 182 74 394 -88 67 -48 7 192 -228 -73 -78 -194 46
4494D6j06J27J30k18Q0n0J42l62R4L16k39R4j84M4r0k33M75K7oL9j37j59L14Q8
$$ 46 -60 67 197 -21 59 9 151 -211 -117 199 -40 54 -130 -86 -176 -409 66 93 87 126 -11 -170 144 232
4518B32p6n8k68K49J54m72K41O5L22m63j34N42j82l2m9K61l65j72K17j52J49Q
$$ 232 156 98 -170 79 233 -239 2 67 389 -74 -208 334 152 120 71 332 -33 -205 12 -140 9 17
4540A7K05k25Q3k06R7M02m79K37J68l71m1r8l4J73j2K25k35L02k68K3K07m8l59
$$ 17 222 -3 80 -126 -29 373 -106 131 299 -72 -113 -211 -245 -72 -84 141 -94 208 -60 -37 170 122 -237
4563b37K79K13m99L07K6k09k40L17M6Jp2O4J58k53j2L25J27k92j0J56L9j86L4
$$ -237 42 255 -244 63 89 -120 -360 -43 3 4 -68 -4 154 -99 -111 214 341 49 39 195 234 48 82
4586H2k41J36J13m47K75o8L01J15l29k3J51j23l3J44%n01K67j7N0L62j88r6J35
$$ 82 -159 -23 90 -357 -82 -150 151 266 -63 -86 65 -58 -91 53 53 -448 -181 -198 -148 214 26 -70 65
4609F5l11N8j29J76K51M5l15P8K02r3N8J43j44j07j48L34l33O6pj0R5J38L5k37
$$ 65 -246 -188 -317 -141 110 155 -160 -82 120 27 85 228 84 -23 -171 163 -170 -104 -111 -121 -26 112 147 -90
4633i0k36L19J55l72J46o7J02k28K79p0J13r7j20l7J10k5J03rj49j27L83N6j89
$$ -90 -326 -7 148 -224 -78 -145 -43 -271 8 -62 51 -46 -166 -203 -93 -118 -15 -24 -173 -300 83 139 -50
4656e0J82J61m0l37R2K1j89J63j31M03n47L42l78L35J45q3r9k1l2k57K64K99n37
$$ -50 132 293 253 -84 8 29 -160 3 -128 275 -272 70 -308 27 172 89 -10 -31 -63 -320 -56 243 -294
4679b94K16N2m9J44l95M81l18K72j23r8K02k6p2P7K77Ml62l2K71k40K57m95J95
$$ -294 -78 -26 -75 69 -326 155 -163 109 -14 -112 90 64 -8 69 346 350 -12 -44 227 -13 244 -251 -56
4702e6n7L08q5m2q4N2p5P1Qj96L26J23k05r5Q6j53J85p3q8p8L82k44q5L9N7M7
$$ -56 -113 195 110 68 -16 36 -39 32 40 -156 170 293 88 -7 79 -74 111 38 -50 -128 254 10 -75 -36 21 68
4728F8j19J49j49p2J72j02J26k67N06m65K28k42J72l8k60K61m7N7Pk1j12J32j22
$$ 68 -51 98 -51 -123 49 -53 73 -194 312 -153 75 -167 5 -33 -293 -32 -79 -22 -15 -36 -148 -16 -138
4751a38L08k34O7j88J99l05J78J33Jn2L2n9K2k9K08j73K15l43L04O4l17M27m01
$$ -138 170 -64 3 -185 14 -291 -113 20 21 -31 1 -58 -36 -65 143 -30 185 -158 146 210 -107 320 -81
4774h1k02m2J38J71p7K39J21l02K21j46P5Lq5j64L41L4j50k66L08k2j08L7j26
$$ -81 -283 -325 -187 -16 -93 146 267 -35 186 40 115 118 33 -131 210 244 94 -172 136 114 6 43 -83
4797h3L35j87j79L7O1J01q1n8J75k06J14J6o7L8K5j90J65J3L99n99M3M05k45L35
$$ -83 252 65 -114 -77 -16 85 4 -54 121 -85 29 45 -22 16 41 -149 16 29 428 -171 -128 277 32 367
4821C67m64K99k22J76k23J20L9j74K26n2J9rl12J86J21m2o8On3K0J32k77J01K10
$$ 367 -97 202 -20 156 -67 53 92 -82 144 92 111 102 -210 -24 97 55 -13 -7 -60 -40 92 -185 -84 126
4845A26o8m3M9k93K12k6j60K92J27j84N1k3m81L97O1k33K02pK64k89R0m22L13
$$ 126 58 15 64 -229 -17 -43 -203 89 216 32 83 60 -421 -24 37 -196 6 -1 263 -26 64 -358 -45
4868d5q0J55P5K73m80Q6k17K05K18k93j62J21L01k82J55m2j15q8j0K31L2J15j57
$$ -45 -125 30 105 378 -102 -16 -233 -28 190 -103 -265 -144 157 -125 30 -12 -127 -215 -225 6 38 153 -4
4891dP3m0q3n4J75k3j1L43p03K97J0m8J62j27J09J26k59Lj20l11O31j41j38J23
$$ -4 69 29 -54 -108 67 44 33 376 -327 -30 -20 -68 94 -33 76 202 -57 -54 -174 -485 146 5 -133 -10
4915a0k83L95p9J30k45J67M0k06K01j82k0K6J91k09M1k76K13K38k6j91j7j34M14
$$ -10 -293 102 23 153 -92 75 115 -91 110 -72 -92 -66 125 -84 -43 -319 -106 132 106 -85 -102 -236 178
4938A78p5n5lj0K45n75K34n5Q8j75K50l15K66O9L2R5n08N04N1o55L44J37j16p1
$$ 178 103 48 45 35 280 -295 -61 -116 -28 -203 47 -268 -2 67 99 194 -314 190 241 -414 -70 67 -49 -120
4962a20K15K66l17k74K35q3M6qQ1k16Q7j75K09j33J21N3o3L5j90J6J41J13J07
$$ -120 95 361 44 -230 5 -78 -32 -40 41 -175 -88 -263 -54 -187 -66 -13 -76 -41 -231 -215 -74 39 146
4985A46l3k04j2N1m0k5n3L6M7k7n3L32k17J59m17L28J70q5k31L04m5l42Q4J20
$$ 146 113 -91 -103 -52 -92 -117 -170 -134 -87 -114 -167 165 -52 107 -310 18 188 103 -128 176 131 -211 -127 -7
5009gJ42j94P9j11j7L81l16j26J19m4M21m48K38o6L0k18p7K36j04j4N2o5J21j97
$$ -7 135 -59 20 -91 -108 273 -43 -169 -50 -94 327 -121 117 51 81 -137 -214 22 -82 -96 -44 -109 12 -185
5033a85L7L6m3L06k49J17p3O2o6k26J42J52k25L32j53j39k9Q5J98j62j58M33k92
$$ -185 -148 -112 -155 151 -98 19 -54 8 -58 -284 -142 10 -215 117 -36 -175 -204 -119 79 -83 -241 192 -100
5056a00NK68j66J81r5L4k41K00j11K43K7k38J32m6j53L69m15J03j26K4n3l2K55
$$ -100 -95 173 7 188 93 127 -114 86 -25 218 245 7 139 93 -60 309 -106 -3 -129 -105 -158 -190 65
5079F5n3m4K40k6k27K85m46N0J15j45K24l7J9q0J44R2j72J18j86ql6L34k26J02
$$ 65 12 -32 208 182 -45 240 -206 -156 -41 -186 38 1 20 -60 84 176 4 122 -64 -72 -108 226 0 102
5103A02k29J70Q4k02P6P9k03K40j67J01m9J72l24L64k11j24J42l23O53l08O2j95
$$ 102 -127 43 127 -75 1 80 -123 117 -50 51 2 174 -150 214 3 -121 21 -302 351 43 105 -90
5125i0N6r7L1p4J86Q5n00K09m9J17M1k1P1J82l64N3Q6K16n3m2m7j40K07k6j1j58
$$ -90 -34 -131 -100 -174 12 97 -403 -194 -243 -126 -85 -106 -35 147 -217 -164 -78 138 85 43 -4 -144 63 37 26 -132
5151a32j21L53p2o8j95K1L99l27J97J65k24k40O9L71k44p3K31K2k18j10jL55k7
$$ -132 -253 100 28 -40 -235 -214 185 -142 55 220 -4 -244 -175 196 -48 -121 110 132 -86 -196 -197 158 131
5174A31j98O3J18l9j30K59l91J48k07J75O4j0j55M6L82m35J25L12m62K78j50J42
$$ 131 -67 -4 114 75 -55 204 -187 -39 -246 -71 -7 -17 -172 -126 256 -179 -54 258 -204 74 -76 66
5196F6Rl3L0j82n9J47K5J37K09m47J17o3l1o1l2L66k49L9j03Q1K01l13P1J99J9
$$ 66 75 42 72 -110 -169 -22 3 140 349 -98 19 -44 -75 -136 -168 198 -51 -12 -115 -34 167 -146 -75 124 143
5221A43k34J02j40Q6J88k35J61k03K89k63k27L85o7m3o1K67q0j14L07l16j61M11
$$ 143 -91 11 -129 -43 145 -90 71 -132 157 -106 -333 52 -15 -58 -119 148 68 -46 261 -55 -216 195
5243A95j79O2K0j70K71j98j57Lj2K62qp6j30j9l0J82J12j8l15L68o5M0k60J28
$$ 195 16 78 98 -72 199 1 -156 -153 -165 97 89 13 -117 -136 -166 16 128 110 -205 163 98 138 -122 6
5267Fj43J24L6r8n8QK88n8j99J16K24j6J3l81N1jM9J73J23j49k25J7L02lk02j96
$$ 6 -137 -13 23 -75 -133 -125 163 105 -94 22 246 230 243 -138 -87 -88 -39 134 257 108 -117 -100 202 199 -3 -199
5293a99K61n7K8R3l47L10R4k15j23r4K88Q0l32J69J33Lk81j34M37j43j81N0J82
$$ -199 62 5 33 126 -221 89 183 -32 -155 -249 39 119 -213 -44 89 92 -189 -323 114 -29 -210 -160 22
5316B2pJ15l26J31J8J12nK44k45j3k62J03J62j14j83L46R9m68K40oj38L71j03
$$ 22 15 130 -196 -65 -47 65 60 304 59 46 -216 -113 49 -65 -248 98 197 -271 -31 -37 -175 196 93
5339I3k30N9M6K20r8J0l19J95l0J33j33p9K55L92l71l17n3N74l65J88m10N96l89
$$ 93 -137 -78 -32 188 90 100 -219 -24 -54 79 -54 -133 122 514 143 -174 -227 347 -18 170 -240 356 -33
5362c3l06L09o6J42j16n6O6L69l11j51K66jp3M8j3l44J46K38j70J17j98K40j73
$$ -33 -339 -30 -96 46 -70 -126 -60 309 -2 -153 113 112 39 87 74 -270 -124 114 -56 61 -137 103 -70
5385g0O5%O2Qo9j1J8j75J69P1J57qk0k01N9k6j52JQ9j05L19l75L97k30Jk08O8
$$ -70 -5 -5 57 65 -4 -15 3 -172 -3 68 225 217 197 -4 55 29 -123 -122 -33 -138 181 -194 203 -27 -26 -234 -166
5412a66K53M4n0j29L0JP7l55M39j42l27QM19k5K31k97J27k09J08n6J65l66p0L83
$$ -166 87 131 81 -48 -18 -17 60 -295 144 2 -325 -317 102 77 308 11 138 -71 37 -19 146 -220 -290 93
5436I3k11n4L21k33j1N2J01P3K80l35j59P1R2j96K92N7n9k63KR4n8j07K20j05
$$ 93 -118 -172 149 -84 -95 -43 58 131 411 76 -83 -12 80 -116 176 233 174 -89 -87 7 -51 -158 62 -43
5460d3L34k73NJ22p4J69m16j30L18j40R7j7k22K06k03K70K4p3l9k9J0L0j08K67
$$ -43 291 18 23 145 71 240 -176 -306 12 -128 -31 -48 -270 -64 -267 3 27 -46 -85 -114 -104 -74 -182 85
5484H5j47K97l06J76K42l48J98l54M52r5m08L50l91M02j13m4L8j38QJ68l9o9N5
$$ 85 -62 235 -71 105 347 -1 197 -157 295 200 -208 142 -249 153 40 -4 34 -104 -96 72 33 -36 19
5507A9jO0l3r8j51J95j38K80n9k3k09J94j66J13K50j46k79J73L79kl79j22K88
$$ 19 18 78 45 -53 -204 -9 -147 133 74 51 -158 36 -130 -17 233 87 -192 -19 360 358 -21 -143 145
5530A45j72M4j39J77J6q8J34K90l37o9N8k59K09J83k85K62N9O2o0l04K10l70K26
$$ 145 -27 17 -122 55 71 -17 117 407 70 1 59 -200 9 192 -93 169 228 290 230 -74 136 -234 -8
5553hK81o78K51p3ML58l4P6j97kR6k13M04j15j48K2k97L18p3j05K55k03M6j08
$$ -8 273 -405 -154 -227 -223 135 101 177 -20 -22 74 -139 265 150 2 24 -273 45 -28 -133 122 -81 -35 -143
5577a43J79J13m9L0j75Q5J2o4J28k38K22j77J35M1j07K7m5L16j61l91K47k12L58
$$ -143 36 149 100 130 -45 40 52 -12 116 -122 100 -77 58 99 -8 19 -26 290 129 -262 -15 -227 131
5600A31r6k00K20j4np2J38q1n4J08j63L97k95n6J2j12RK02R6j76k78J71j40J21
$$ 131 35 -165 55 41 36 -36 102 21 -33 75 -88 309 14 -42 -30 -142 -133 69 165 -11 -289 -118 -258 -137
5624a37K52j86P5L7o0J21j27j24J31K56j15L33o04K00J11j12j01R5r3L92k93O2
$$ -137 115 -71 4 41 -19 102 -25 -149 -18 238 123 456 -148 52 163 51 -50 45 -48 344 51 113
5646A13j18K3j41P9J08k29K44Ll5m2K4j94J03L5k34K86J95l38NN5J65Q8k57J2
$$ 113 -5 18 -123 -44 64 -165 79 82 47 5 29 -165 -62 -27 -261 25 220 -118 -113 -58 107 195 -62 -50
5670e0J79k98K22k22N1J26q5Q4J69j77K6J5o3k8P0k09M18r4l4j69K32j19R0j9
$$ -50 129 -169 53 -169 -118 8 -77 7 176 -1 25 40 -23 -51 19 -190 228 134 100 -69 163 44 134 115
5694A15n9p9j89K5L2J47K96k21j29j21Q7j54L16k2o1k3J90l81K62q0O1n7J97N7
$$ 115 56 -23 -212 -187 -155 -8 288 67 -62 -183 -96 -250 66 44 -17 -40 150 -231 31 -49 12 -45 152 209
5718B09k79J32k78K34OL5k24K15j82J62Q8j32r1NN03n82J42k17K55J61j05q8R0
$$ 209 -70 62 -216 18 24 59 -165 50 -132 30 118 -14 -105 -100 403 -179 -37 -254 1 162 57 -31 59
5741E9p2N00p24K42r7J6J77l7j55K78m76L54j76j7M40o06J35J03Q1q7J5j06K31
$$ 59 -13 487 -237 5 -92 -76 101 64 -91 187 -289 65 -111 -128 312 -294 -159 -56 25 -62 -47 -153 78
5764G8l2K40m15Q1R5lj62k9K79J11j15j27P4m4O6q7k07L89k28n1N0NJ35k10j7
$$ 78 46 286 -129 -48 47 44 -118 -147 132 243 128 1 75 31 97 10 -197 192 -36 -87 -37 -32 103 -107 -124
5789a24P5j30J82J8J05l04M74k32k12K09j32J35K29o19O45k17l74K47R2k73J21
$$ -124 -49 -179 3 21 126 -178 296 64 -148 61 -71 64 293 -326 319 102 -272 -25 67 -206 -85
5810h5J26k42J29J32j34J03k15J56J32n0k64Q5M6N3j9jj17J84j12J44j13J52J00
$$ -85 41 -201 -72 60 -74 29 -186 -30 102 52 -212 -127 -81 -28 -47 -48 -165 19 -93 51 -62 90 190
5833A90k8k10P2j28J11m38J46L17R1K6j47J00p8j27J99r1K94l87j11J06M1K6m0
$$ 190 162 -48 24 -104 7 -431 -285 32 123 149 2 102 24 -103 96 5 299 -88 -199 -93 -52 -26 -66
5856f6j47K67K4K45k88l06L50N3k18j63J28P2N5k23P4K47l31L4M78l45J50j73
$$ -66 -213 54 78 323 35 -271 79 132 -86 -249 -121 -49 6 -217 -143 104 -227 -193 285 -60 90 -83
5878h3n6k0j36K20J25O7j8l70J94J53K3j56J61j66J08m3Nk49L23j94J17j15k6
$$ -83 -139 -159 -295 -75 50 117 99 -271 -77 76 99 -57 104 -62 46 3 8 -241 82 -112 5 -110 -136
5901a36j8M9J67n3K04p3j82J78l35J33R2j71J46j14K26o0j35j82L78N7l43M1p6
$$ -136 -154 -105 62 9 213 140 -42 136 -199 -66 26 -145 1 -113 113 53 -82 -264 114 171 -172 -131 -207
5924b07L65k73K49j45n0L72j47j04O1Jj27N9k1L8M1m7J94j88Qn2P0k89L94k93
$$ -207 158 -115 134 -11 -61 311 164 60 121 122 -5 54 33 71 112 65 259 71 79 27 97 -192 202 -91
5948i1K23l6P8j26L8j1j80J09J74O6l95Q5q4o7L84l78K05p0K2O02n85j20j8M49
$$ -91 132 96 174 48 86 75 -105 4 178 244 -151 -66 -150 -217 167 -211 -6 -76 -54 548 -37 -157 -175 274
5972B74L2j82j63j5O8J18j75k03QL48k38L50m22K57l6m03K46n9j23K25J12K19
$$ 274 306 124 -39 -54 14 132 -43 -246 -238 110 -128 222 -200 57 21 -382 -136 -195 -318 -93 19 238
5994B38k01j77L72l31J40P5l5m05M71k23J48J9j64J53l08J99L06k37k87K18J65
$$ 238 37 -140 232 -99 41 116 81 -324 147 -76 72 91 -73 80 -228 -29 277 40 -247 -29 136
6015A36J03k97M7J03k09J61O3K18m89l5N3J03k69L34J36k67J47j5R0j01q7L65
$$ 136 239 -58 -11 92 -117 44 107 325 -164 -199 -146 -43 -312 22 158 -109 38 23 113 12 -75 290
6037B90k81M9M7k05J24J07k49P6k10M66m07K58l7J40R3l05k4k0K0K54k09r8P4
$$ 290 9 58 105 -100 24 131 -118 -42 -252 214 -193 65 28 168 261 -44 -68 -88 -68 186 -23 -121 -47
6060d7pj2K37j7N5j49K80m92k29O89j06l98K19P2m2q6j96K83O5j90K30q5j36l19
$$ -47 -54 -66 171 154 209 60 340 -152 -381 308 202 -196 23 95 53 -33 -229 54 119 -71 159 74 -62 -381
6084c81J86O9N1K89l31K67j57M6K7K43j18l74J23q5k8J58J43l35K93j28j67L80
$$ -381 -195 -126 -75 214 -117 150 -7 39 66 309 191 -183 -60 -145 -173 -15 128 -207 86 -42 -209 171
6106A71j22j75M27l41pP3l2k76K28k00M7J55K8J59l52L02l34L37j79J17jj56J3
$$ 171 49 -126 301 -40 -47 26 -6 -282 -54 -254 -207 -52 -24 135 -217 85 -249 88 -91 26 25 -131 -118
6129a18N2J13j13L8j69L09K05m76J37k08M70l14o2L33k37K09j93J77m32L26k06
$$ -118 -66 47 -66 -28 -197 112 317 -159 -22 -230 240 -74 -136 197 -40 169 -24 153 -279 47 -159
6150a59K83k63J68j01K02p6j12J44l02J50P6j81r5N52m32M90l18j63k9M7r0K62
$$ -159 124 -139 29 -72 130 54 -58 86 -216 -66 10 -171 -266 286 -146 344 26 -137 -166 -119 -209 53
6172E3J55l6k33J41J91l05n9L29j39L8qj16m5j02K73J14j81m5J20l13K48k09K48
$$ 53 208 172 -61 80 271 -34 -93 236 97 135 127 11 -34 -136 137 251 70 25 145 -168 80 -129 119
6195A19k7j15M7J15j80k49L23j26J03L81l38j7k28P4J49j02j68J31j29K53O2R8
$$ 119 92 -23 24 139 -41 -290 33 -93 10 391 53 36 -192 -118 31 -71 -239 -108 -237 16 78 176
6217A76j39k78K12o9K0K59k38K61k21J49l69K4K53j54K98k40K20l60K15k26j31
$$ 176 37 -241 -29 -98 -78 181 -57 204 -17 132 -237 -213 40 -114 184 -56 164 -196 19 -207 -338
6238c38M29L47m92K82j84p1J85j52L1pq6lP3k07J66j49K40L4o6j19m1R5l7o0M1
$$ -338 91 438 -54 228 44 -27 158 6 37 30 -56 -59 14 -193 -27 -176 64 98 32 -87 -128 -33 -70 -130 -89
6263h9L17l06k51L26j37L29m00Q0oj59J14J43M0j7K21k72o3J70r4Pm7J48j21N36
$$ -89 228 -78 -329 -3 -140 189 -211 -131 -137 -296 -182 -39 1 -16 205 -67 -130 40 -54 -47 -94 54 -67 469
6287D69n02J23k6J42j1P8l13m44N74O1j91K18j28k97K99k86M46k82p3J92J36j92
$$ 469 -33 90 64 206 195 273 -40 -484 90 151 -40 178 50 -247 52 -234 212 -70 -143 49 185 -7
6309gn6L04k91Q1Q4jk96J71p9K81O0n46M35l9m41K94j2J75j38K6L8j07J39k36
$$ -7 -63 241 -50 31 115 114 -182 -11 -90 191 251 -295 140 101 -340 -46 -58 117 -21 5 43 -64 75 -161
6333a61K07j9L7R6l60j7R0P0M91m44o2j54K87j61L3KL33j52k71J11n5Q8K6Rk4
$$ -161 46 27 64 160 -200 -217 -127 -57 434 -10 -72 -226 61 -100 -67 -65 268 116 -155 -44 -99 -11 15 24 0
6358@J15j61K42n5k22Q1j70P5L83l46J64O9J44k70J62m60P0J21j60K77l8p4l1
$$ 0 115 -46 196 141 -81 0 -170 -95 288 -58 106 175 319 49 211 -249 -179 -58 -218 59 21 -53 -84
6381h4Q0j06q4K9K61j45m8J72j40k88K27K86j4l39J27QL22k21n0J86j80j24K40
$$ -84 -4 -110 -194 -165 96 -49 -97 75 -65 -353 -126 160 146 -193 -66 -58 264 43 -7 179 -1 -125 115
6404A15M3k91K83q3o9j39K55P4k48J37k0O9m1l05L51oj21j00R3Q1lj86R1p3K81
$$ 115 158 -133 150 67 -2 -141 114 188 -60 77 57 126 85 -220 131 125 4 -96 -3 78 75 -111 -20 -93 188
6429A88l4m8K6k30l1jJ70K61m10N6r2J40K4j75K84l66M51l79J56n5J75k75J49
$$ 188 154 106 132 -98 -129 -130 40 301 -109 -53 -145 -5 19 -156 128 -238 213 -166 -10 -65 110 -165 -16
6452a6p5j6J06j70K67j1k14J13l8J76L7o0l53L00R7j79M8Q2q7J64J06j24j81J30
$$ -16 -91 -107 -1 -171 96 85 -129 -16 -54 122 159 99 -254 46 143 -36 12 94 7 171 277 153 -28 102
6476A02l3J27l13K01J94k82l3N9J11l12O0L61j67k24J23j06J64j16p1M40k61j95
$$ 102 69 196 -117 84 278 -4 -37 22 133 -179 -119 242 75 -149 -26 -132 32 -84 -155 285 24 -171
6498a71K06k01L81J6j99j14PR0K72j01k30J9j58P4L29n37K81j85K45K21k85Q1
$$ -171 35 -166 215 231 32 -82 -75 15 287 186 -44 -25 -183 -109 220 -317 -36 -221 24 245 -40 41
6520D1k96J62N11m06J59l00J9K78m33J85L08j03j77L72n86K54J52k05J17op0J52
$$ 41 -255 -93 418 12 171 -129 -110 168 -265 -80 228 125 -52 320 -266 -12 140 -65 52 46 -24 128
6542A28k08N27m45J16J69j57q1KQ8oK38l80K8N9j22k20J65L3n6O1K46j06m35J50
$$ 128 -80 447 2 118 287 130 49 51 139 133 371 -9 19 78 -44 -264 -99 -66 -122 -61 185 79 -356 -206
6566b06J53K71k9j03j63J26M7k92M52k69j34J29J00k36m5M11l56Q1J20m14K35
$$ -206 -53 218 189 86 -77 49 96 -196 256 -13 -147 -18 82 -154 -199 212 -144 -63 57 -357 -122
6587a22l8L83k06P0l6O0k22P5L09k60J31K4o6k46l9Q8l2K48j57n8l8J43K0l9J92
$$ -122 -160 223 17 87 51 111 -111 -36 273 13 144 168 102 -144 -183 -95 -127 121 -36 -94 -132 11 31 -8 184
6612A84n1r3Q9k33K43j15J47k00n7k7K60k03j7P9n9J21r2k77M85j39j24J91M1
$$ 184 133 40 129 -104 139 24 171 -29 -86 -113 147 -56 -73 6 -53 68 -24 -301 184 45 -79 112 153
6635A53J47l41K0j16K92j4J62k12j34k19M83j15j38J13%j17o4j02K92n1K49k41
$$ 153 300 -41 -21 -137 155 141 303 91 -43 -262 221 106 -32 81 81 -36 -100 -202 90 39 288 47
6657D7k2l7K16o1l4o9j38L21l50K01n1J09L09l66J4r1j15J34K2ML3r5K13l79M13
$$ 47 25 -12 204 143 109 40 -98 223 -127 74 23 132 441 75 89 -2 -117 17 39 43 76 -19 194 -185 228
6682B28j93K83l38Q2O1j80J05J03N7j31j79RL9K95m10K73k14J42p0j81m9L07l0
$$ 228 35 318 -20 62 123 -57 48 151 208 77 -102 -93 -54 241 -169 104 -110 32 -38 -219 -268 39 9
6705Im1N4J55j93N4k21J89P0P4j18M8K0j30k31M23o4j38n9K24j06j05j9K90Oj26
$$ 9 -32 22 177 -16 38 -183 6 76 150 32 80 100 -30 -261 162 98 -40 -99 125 19 -86 -105 185 191 65
6730F5k39K60o9m5j3R1o9l26L33l41N77l53q8J98p3P2N9j06J44r9j39J35j3m8
$$ 65 -174 86 17 -28 -41 50 -19 -345 -12 -353 224 -129 -217 -19 -92 -20 39 -67 77 -22 -161 -26 -39 -87
6754h7M3J84j21ON29n67k70J96K10j93Rn3M8K42j06m6Q4J42l10R6k29K69k10K61
$$ -87 -44 140 19 25 554 -13 -283 -87 123 -70 -61 -114 -66 176 70 24 108 250 -60 36 -193 76 -134 127
6778A27l33J96N2k9j74o6M24j17j26K46l76K43p9j14M53k60N4k12j7k3J79Q6k22
$$ 127 -206 -10 42 13 -161 -227 197 80 -46 200 -176 67 -12 -126 327 67 121 -91 -108 -131 48 134 -88
6801h8J97j17j93J8J71j59K57J50k96Kn2K8L05j15k08M2J36j41J75j47l8m6M1
$$ -88 109 -8 -201 -183 -12 -171 86 236 -60 -58 -110 -82 223 108 -100 -58 78 -63 112 -35 -73 -119 -78
6824g8J16k33K23k7j8L24j89j92J12J22l11J46K4K50j39k91J17kJ21j03J79p8
$$ -78 38 -195 28 1 -17 307 118 -74 38 160 -151 -5 19 269 130 -161 -44 -46 75 -28 151 73
6846G3J91n56L86k77K22J44k14j88J06J26p6R9L1l67J61J87j62K0L12j03q5K06
$$ 73 264 -292 94 -183 39 183 -31 -219 -113 13 -63 36 67 -300 -139 48 -114 -94 218 115 30 236
6868B36l37q9K22J51m0o3l72K38l3q6K33J00j76j18K60k17j3r1L37L4j41O8k35
$$ 236 -101 -190 32 183 143 80 -292 -54 -87 -173 60 160 -16 -134 126 -91 -104 -195 142 176 35 103 -132
6891a32n7K02R4j68J23r7j16J56r1k02O34n36O7J26k09K08p9L8J27k70Q1P4J2
$$ -132 -189 13 107 -61 62 -35 -151 5 -86 -288 346 -190 -123 3 -206 2 -77 -39 88 -182 -101 -27 -15
6914a5J04k0K27l70l1K01k24K70k88K53k5J04O2k78j23j1K30j95J44k88K56k54
$$ -15 89 69 296 -74 -105 96 -128 142 -146 107 82 186 248 -30 -153 -164 66 -129 15 -273 -17 -271
6936b71L99r8M8R3m41J57L56m65M2J51J54M2l43J69J1k0N9K5j01J82l01J19R0
$$ -271 128 30 78 171 -270 -113 243 -222 -180 -29 125 167 -176 -7 4 -16 43 68 -33 149 -152 -33 57
6959E7l48J99R7o4K10l49M04j45j77M85n09J00j72L50N7k48J52M3K6m22l1K31
$$ 57 -291 -92 5 -59 151 -198 206 61 -116 369 -140 -40 -212 138 195 -53 99 142 168 -254 -285 -54
6981e4P0L0j95O1o0J06L55n07P2Nj88K52l9J60k03J65J33p9k14n3J33R4j1O7j83
$$ -54 16 46 -149 -88 -148 -42 313 -194 -122 -117 -305 -53 -92 68 -135 30 163 84 -130 -183 -50 44 33 100 -83
7006h3j8M8j85L97j76j9mj49J98l61M84j22Q4j34r8J65O4m86N57l2k99J77k73
$$ -83 -101 -53 -238 159 -17 -36 -40 -189 9 -352 132 10 94 -40 -138 27 91 -395 162 130 -169 8 -265
7029b65J65m2L68L8L2l40q0N7k21K40L7K16k29j58J10K38j82J25K5k36J10j57
$$ -265 -100 -142 226 264 296 -44 -124 -67 -288 -48 -11 205 -24 -182 -72 166 -16 109 134 -102 8 -149
7051a49K31l53K39RQPQ9L20m87J55M4K20l87j9K35k23o4M52j47k11J51l37K82
$$ -149 82 -271 -32 -23 -15 -8 81 401 -86 69 113 333 -54 -73 162 -61 -125 327 180 -31 120 -217 65
7074F5o9o0M05k27J16n00J74K38j71J50K2k14R2j55OQ0J96J07l6j97j56K52K5
$$ 65 -4 -64 341 114 230 -270 -96 142 -29 121 143 -71 21 -134 -128 -48 148 255 219 22 -134 118 143
7097A43j36n3M07l21k15qL17p9n0P8q5p0l2O5J13j43K45k80l5K32j50k4L9K13
$$ 143 7 -46 361 40 -175 -183 134 55 5 83 -2 -72 -104 -39 74 -69 176 -104 -139 93 -57 -81 -42 171
7121A71j38J51n1k56J92q3K5J49m09L97l13J58j07J90j19j35N24k06k77J38L16
$$ 171 33 184 133 -123 69 -14 11 160 -249 148 -165 -7 -114 76 -43 -178 346 140 -137 1 317
7142C17l76K40k39o3j99M14m7O2Q6r6k54L00k17m19N51P7j23j30K22j82Q8J72
$$ 317 -59 181 -58 -121 -320 94 47 109 195 99 -155 145 -72 -491 60 137 14 -116 106 -76 12 184
7164A84j30j7k41J84j45L88m79L04n7J29k64J16pj53L39j25r8j41J6K23j59M6
$$ 184 54 37 -204 -20 -165 223 -256 48 -9 120 -144 -28 -35 -188 151 26 -72 -213 -197 26 -133 -87
7186h7K05j80L1Q0n0k43K17J34j63K5j13j75M55l4j47K15l78o3P7RN13n48L77
$$ -87 118 -62 -31 49 -1 -244 -27 107 -56 -31 -144 -319 136 102 -45 170 -208 -271 -194 -185 328 -220 157
7209A57k57O9J56k41J48j42J47K29n9j6l29j9K06j12j27N3K92qk11L74j95K7o
$$ 157 -100 -31 125 -116 32 -110 37 266 207 191 -138 -157 49 -63 -190 -137 155 147 -64 310 115 142 136
7232A36N2M3k10J72k10o6J32r8J56m91M05L14j35k94J25j21k38J83L10o6o6j79
$$ 136 188 231 21 193 -17 -83 49 -49 107 -384 21 335 200 -94 31 -90 -328 -145 165 99 33 -146
7254a46J92R4r2j26O1k36R2K60j23o6K68n0l23M63l68J13N7l39M97l06j53o8K29
$$ -146 46 140 48 -78 -17 -253 -161 99 -24 -90 178 128 -195 268 -100 13 70 -269 228 -78 -231 -299 -70
7277g0q8k51L96N8j21L6J4P5l8J3j33J12J56k90J53J08N3k28K63j13j38O4O2m18
$$ -70 -158 -409 -13 45 -76 -40 -26 49 11 24 -109 3 159 -131 22 130 183 -45 218 105 -33 31 93 -325
7301c25M49J73n49M33P8R9n48M73l06K59k93Rj49J14q3M18j51j11k85J55O9r8
$$ -325 124 297 -252 181 259 358 -190 283 -23 236 -57 -48 -197 -83 -166 252 101 -10 -295 -140 -71 -169
7323a69L41j10p6J9K73k39k25J49K86K01l00m30N36l45K35o7pK16m09K06k50K17
$$ -169 172 62 -14 5 278 39 -186 -37 249 450 150 -280 256 -89 146 79 72 288 -121 85 -165 52
7345E2P8p0r9J76k71R3K33l37ll4J97k6k12j47L30l8J23k28J66j64J1K49J0J18
$$ 52 130 60 -39 137 -134 -41 192 -145 -148 -182 15 -11 -223 -370 -40 -78 45 -183 -17 -181 -170 79 89 207
7369B07r6L2j68j04J49K66j47l81K22K7O8k01J69o5M7L4k81J86J47K7j0q2k68
$$ 207 111 143 -25 -129 20 286 139 -242 -20 7 75 -126 43 -22 25 59 -222 -36 111 138 128 46 -222
7392b22K92j69J54qq8K34m0j14j10M1N4m4K05j70l44L79j16k0J38k29n3K85nk88
$$ -222 70 -99 55 47 -41 193 153 39 -71 -30 24 -20 185 15 -329 50 -66 -86 52 -177 -230 55 50 -238
7416b38J82J66K2J63r8j73N4j7j59j74M58J37l09p1j70KK77L91j92l82K79j87
$$ -238 -56 110 132 295 197 24 78 61 -98 -272 186 323 14 -57 -227 -225 52 443 251 -131 148 -39
7438c9O9k94pK97q7j02j3J25R6P7P6j19o8j9j97L74Q3j85N8R4k79O9j98J96l8
$$ -39 30 -264 -271 26 -61 -163 -176 -51 45 122 198 79 11 -8 -205 169 252 67 125 219 -60 9 -189 7 -31
7463c1J18O3j68p1K85k15lJ79j11J5l4n2M4j46L04j48N4j02j9J94k39L46r8l31
$$ -31 87 150 -18 -89 196 -19 -22 157 46 61 27 -25 19 -127 177 29 83 -19 -38 156 -83 263 165 -166
7487a66K83Ol12K89j39m6J83p5j76o7M06k97K27Q1k87J45J6l60R8M03n7l32L70
$$ -166 117 123 -189 100 -39 -85 98 23 -153 -220 186 -111 116 197 -90 55 71 -289 -191 212 155 -177 193
7510A93k4j96K28k1j09j88Lj42M71j96J30j28N8q7J09j10R5p5k36L34j51J80k74
$$ 193 169 -27 201 180 71 -117 -114 -256 215 19 149 21 79 -8 101 -9 86 11 -225 109 -42 138 -136
7533a36J19R6j43Q7K7K1l50M51k83J99Q3l41k2K35k83K38j2r4L38k28P9J25l83
$$ -136 -17 79 -64 23 50 71 -279 172 -111 88 171 -170 -192 43 -240 -2 -14 -108 230 2 81 206 -177
7556a77N4J26O9j74K6J03j98R7j8J08J29j59j00J43j97p4K38J61k85n4L3L58l8
$$ -177 -123 3 72 -102 -76 27 -171 -74 -92 16 145 -14 -114 29 -168 -242 -4 157 -128 -182 -149 209 171
7579A71N8k06Q0k6k25n6L06p8K45k04Q0j49j06R6j9O2J07l54J52n6J37N3l01J70
$$ 171 229 23 103 77 -148 -204 102 24 269 65 145 -4 -110 -14 -33 29 136 -218 -66 -122 15 68 -233 -63
7603f3K28J87m35J66L1l12K58m8j44j35J38M06p9j65J92k98o7j5K21K46n77o2
$$ -63 165 352 -83 83 114 -198 60 12 -132 -267 -129 277 198 33 225 -73 -140 -155 66 312 -265 -327
7625c27L47m41L59l67L86j01L00j56r3M7J21j00J50l11J19J31l5K3o2P1k63N41
$$ -327 20 -421 -62 -429 -43 -144 156 0 -93 -46 75 -25 125 -186 -67 64 29 52 -10 61 -202 339
7647C39k15k86K02RN8rj77j91L15l10L46j26J65kq1J33L9k22J28l1J47k7l52K52
$$ 339 124 -162 40 49 107 98 -79 -270 45 -265 81 -45 120 118 37 170 209 -13 115 84 231 204 -148 104
7671A04J66m98m5K12N6P8m08L91J68l54K61J16p0k73J98k43L49K2k12R8k5k55
$$ 104 270 -228 -273 -61 -5 73 -335 56 224 -130 131 247 177 -96 102 -141 208 230 18 116 91 -164
7693a64k4M47l87JJ70R9l35L52j35O1l68K67R0j46O4n6K95m27J37M9j41K15j67
$$ -164 -188 259 -128 -127 43 142 -193 159 24 85 -283 -16 74 -72 -8 -64 231 -196 -59 -10 -151 64 -103
7716a03J36J85j40l29J44K0L0j11K51K5J45l75q0K53q9J2p4P8l5j82L24m37N76
$$ -103 33 218 78 -251 -107 -87 -57 -168 83 108 253 -122 -202 51 -38 -26 -100 -22 -57 -239 85 -352 224
7739B24l18j18K76K7k98J80K80k79K71m26J53K7j5J47q9q5J45K5k28Qo6N8M0j1
$$ 224 -94 -212 64 91 -207 -27 253 -26 245 -181 -28 -1 -16 131 42 -43 102 127 -101 -93 -159 -101 -61 -72
7763g2QK43j13J08k83K5K79l85m4K88J18OK1j88j39J55J01r5L1j72M36l89Lk04
$$ -72 -64 179 66 174 -109 -84 195 -190 -234 54 172 178 199 11 -128 27 128 33 64 -108 328 -61 -58 -262
7787b62Q9J96j44Oo7L82m21M96k50l09K50L08k91p9L22k78J99m39K47J49Q1k20
$$ -262 -173 23 -121 -115 -182 200 -221 275 25 -284 -34 274 -17 -96 226 -52 147 -292 -45 104 185 -35
7809c5J4k6K53l2j86O4K4j73K42n3l74K51J18r6o3N3m9J64L1k3k86K44j52J65
$$ -35 -21 -47 206 174 -12 52 76 -97 145 92 -282 -31 87 -9 -72 -19 -68 96 127 104 -182 62 -90 75
7833G5q3J04j13J66R2j66o0j24m4J87o9J87k51n9K4l6K19P9j21k4j2J03J29k54
$$ 75 -8 96 -17 149 241 75 15 -109 -153 34 -35 152 -99 -158 -134 -170 49 128 7 -17 -29 74 203 -51
7857e1j17J71k14K76R1J64k64K67n88M18l00j5K84n0J03l87K19l43K97J1j04K58
$$ -51 -168 3 -211 65 156 320 56 323 -265 153 -147 -162 122 72 175 -212 7 -336 -39 -28 -132 126
7879A26J10k62o3j94K27q1O6r4M7M4K51k86Rq0J52o0J25m2K45j29k81J75R6Q6
$$ 126 236 -26 -89 -283 -56 -137 -71 -165 -118 -74 177 -109 -100 -180 -28 -88 37 -5 240 111 -170 5 101 187
7903A87k67j02J19q5K63k79J73K1J23m9P6k36J24k6k65L05J50m16M43O8j28l06
$$ 187 -80 -182 -63 -148 115 -164 9 30 153 104 180 -56 68 42 -223 82 232 -184 259 327 199 -107
7925a07m0p4L18O3l7k09o3M40j12k80m7J32J31N7k73j14J46K07k37K16m38N63
$$ -107 -147 -221 97 160 123 -86 -149 291 179 -101 -148 -16 115 172 -101 -215 -69 138 -99 117 -321 242
7947B42j93l73J87K73k73K32n7j81j33K45L78k50j77J31j50l9jJ86jj82K17q9
$$ 242 49 -324 -137 136 -137 95 38 -143 -276 -31 347 97 -80 51 -99 -138 -139 47 46 -136 81 -8
7969hn6n7K22o4N0rJ12K2n1o0J53n0j41j34o3J86q2n1L29l26M1k38P7J78J45N6
$$ -8 -64 -121 101 37 87 78 190 212 161 101 254 204 63 -71 -134 52 -30 -81 248 -78 -37 -275 -198 -20 125 181
7995A81j89K1O0k73L79j52l41M34M8k77J24j54N2N6R4J49k23j43J98PMn2L48l19
$$ 181 -8 13 73 -200 179 27 -314 120 168 -109 15 -139 -87 -31 63 212 -11 -154 44 51 55 3 351 32
8019C2k11Q3N8m8L4k08K13K02l78M50k89K54R5k56j71QK11j06M0m1n7J80k04J20
$$ 32 -179 -96 -38 -86 -52 -260 -47 155 -223 227 -62 192 287 31 -140 -132 79 -27 13 -28 -85 95 -109 11
8043A1j6J19m23J78L19r4k64n4L02J83j87o1J72j03L4j17n6J31k31J75j73K50
$$ 11 -5 114 -309 -131 188 94 -170 -224 78 261 74 13 185 82 116 -1 -57 74 -157 18 -155 95
8065I5k09NO4K45r7k02k16J84j3L53k10K31m93Q2J74j36K95j99J04r8L6O9j32
$$ 95 -114 -109 -45 200 103 -99 -315 -131 -144 209 -1 230 -263 -181 -7 -143 152 -47 57 -41 -5 64 -68
8088f8r1O3K86j88n6j46M04q5l17O3J70p1j78k0L38r2K68l10J28J6j05J53j63
$$ -68 -159 -96 190 2 -54 -200 204 119 -198 -135 35 -36 -214 -234 104 12 280 -30 98 114 9 162 -1
8111aN5j84J29M3j77J72k68L39kN5n3k78j9J29R2j04K27j48p4mP7J35j63J39J02
$$ -1 54 -130 -1 42 -135 37 -231 108 106 161 108 -170 -189 -60 32 -72 155 7 -67 -71 6 141 -22 117 219
8136B19k75J98%j60Q0Q3k50M8l8J48l85M35j56p6K99j93j46K66Q5m4k64K71N4
$$ 219 -56 142 142 -18 62 145 -105 -57 -95 53 -332 103 -53 -129 170 -23 -169 97 182 138 -126 145 199
8159A99j13M8j11k10L92m54L19j58K63k41j0J14j57o5K42k31N9L0j44K64K22j3
$$ 199 86 134 23 -187 205 -249 70 -88 175 -66 -76 38 -119 -184 58 -173 -114 -84 -228 36 258 245
8181B45q1m01K27N9K09m29K07J00o7j89
$$ 245 164 -237 -10 49 258 -171 36 136 69 -120
8191a20
$$ Imaginary data points
##PAGE= N=2
##DATA TABLE= (X++(I..I)), XYDATA
0@%%%%%%%%%%%qJ6j6J6k4L2l4M2n6O5p3Q8j04J26j50J71j96K26k60K98l39L84
$$ 0 0 0 0 0 0 0 0 0 0 0 0 -8 8 -8 8 -16 16 -18 24 -32 33 -40 48 -56 70 -80 91 -105 121 -139 159 -180 204
33B04m35M90n48O13o86P64q48R41j043J152j269J398j538J688j852K032k229K444
$$ 204 -231 259 -289 324 -362 402 -446 495 -548 604 -665 733 -805 883 -969 1063 -1166 1278
51A278k682K946l238L563l931M352m835N399o068O874p866R126j0776J3026j6282
$$ 1278 -1404 1542 -1696 1867 -2064 2288 -2547 2852 -3216 3658 -4208 4918 -5858 7168 -9114
66i114K1402l0591N1927j94175l4027K86710j26119q6974K13744R3302k61992
$$ -9114 12288 -18303 33624 -160551 -194578 92132 -33987 -120961 92783 186085 -75907
77g5907p1632K20225R187k01385P7458K08767j07530j85956J28669J37058j49666
$$ -75907 -147539 72686 81873 -119512 -42054 166713 59183 -126773 1896 138954 -10712
88a0712p7509J89239N9690j75485j5522J51939n2496j77998L9253J17087q6502
$$ -10712 -88221 101018 160708 -14777 -30299 121640 69144 -108854 -69601 47486 -39016
99c9016r3312J15870R1198j00267m3622J05916J6503j13254p527Q2166k7798q6733
$$ -39016 -132328 -16458 74740 -25527 -69149 36767 53270 -59984 -67511 14655 -13143 -99876
111i9876M1973Q9123q552l0523N6543L5348o2738n3414L8024L5003j7071r52M1180
$$ -99876 -57903 31220 22668 -7855 48688 84036 21298 -32116 5908 40911 23840 22888 64068
124F4068r479p2199m4554K9290K5567O05K8511N6066j3871p6939m1949J4123j3967
$$ 64068 54589 -17610 -62164 -32874 -7307 -6702 21809 77875 64004 -12935 -54884 -40761 -54728
137e4728k5266M0840O5290j4394m1075K3304L0485l7710k1321N3399K3799n0389
$$ -54728 -79994 -39154 26136 11742 -29333 -6029 24456 -13254 -34575 18824 42623 -7766
149g766j0944N1528k651n1716J2149M8875k3249l8579L9069M3227l6619k8580
$$ -7766 -18710 32818 30167 -21549 -9400 39475 16226 -22353 16716 59943 23324 -5256
161e256L1061J40o0371j1335M2418M27l6069J8943L6973j6384k5935K8595J9527
$$ -5256 25805 25945 -34426 -45761 -3343 -2916 -38985 -20042 16931 547 -25388 3207 22734
174B2734l1746k4476J8565M113j7917J3490M1039O438k2199o465N130j2449o241
$$ 22734 -9012 -33488 -14923 -10810 -28727 -15237 25802 32240 10041 3576 8706 -3743 -9984
187i984K3692K6187m475j9546j2331j1144j7351k334K2516K3494J580j1179k766
$$ -9984 13708 39895 35420 15874 3543 -7601 -24952 -27286 -4770 18724 20304 9125 6359
200F359n681j7579r112J5225R127j2353n609J6067L443j1336O584K0282q024k0477
$$ 6359 678 -16901 -26013 -10788 -1661 -14014 -19623 -3556 -113 -11449 -4865 15417 7393 -13084
214a3084P719J8492q466n733J9650N518k8133j0368J8510L384j3452J3870K0103
$$ -13084 -5365 13127 4661 -1072 18578 24096 -4037 -14405 4105 7489 -5963 7907 28010
227B8010j5765k4787R822J0079j7107m669K1155j822k4216K635K1893m122j1130
$$ 28010 12245 -12542 -2720 7359 -9748 -14417 6738 4916 -19300 -16665 5228 1106 -10024
240a0024J4115P275k3647j1092K0347Q933q833Q720J5418j5340k1838Q303J4090
$$ -10024 4091 11366 -12281 -23373 -3026 5907 -2926 5794 21212 5872 -15966 -7663 6427
253F427o976K753J7483k827k3282k371J2084l432n873J3641N299j7277q292J2843
$$ 6427 -549 2204 19687 16860 -6422 -8793 3291 -141 -6014 7627 12926 -4351 -12643 200
267B00K162q591O573R027j3469j3093J0196J0352n626K803J2108p276j8130K582
$$ 200 2362 -6229 344 9371 -4098 -17191 -6995 3357 -2269 534 12642 5366 -12764 -10182
281a0182J2845j863k057J3222J682j8483o419J2720K049p059Q317R415j3200j3957
$$ -10182 2663 800 -1257 11965 13647 -4836 -11255 1465 3514 -3545 4772 14187 987 -12970
295a2970R310R707p462k45J1585m776j7912Q03J5359k92o379Q790N151j6791r728
$$ -12970 -3660 6047 -1415 -1660 9925 5149 -12763 -11960 3399 3107 -3272 5518 10669 -6122 -15850
310a5850J3888R872q083J248J0556q349j8528M706J6518j131o747R744L628j7184
$$ -15850 -1962 7910 -173 1075 11631 3282 -15246 -10540 5978 4847 -1900 7844 11472 -5712
324e712q729J5515P685j0002J55J0723q822j6733P505J6782l679p551Q882L318
$$ -5712 -14441 1074 8759 -1243 -1088 9635 813 -15920 -8415 8367 4688 -2863 6019 9337
338I337j6762n346J5924M813j2023P3R857p261j1866J0823J4779o441r004O943
$$ 9337 -7425 -12771 3153 7966 -4057 -3984 5873 -1388 -13254 -2431 12348 5907 -3097 3846
352C846J696j3392k05J4822J332j2357j259N998n208l790J3415J1471p627j0179
$$ 3846 5542 -7850 -8055 6767 8099 -4258 -5517 481 -4727 -8517 4898 16369 8742 -1437
366a437J72l417p372M326J3737K826q325m261n21l433O93J1586R202k614p739
$$ -1437 -1265 -4682 -12054 -7728 6009 8835 510 -3751 -4272 -7705 -7012 4574 13776 11162 3423
381C423o352n613m178L908R719O768p10l777k002q15o84K287M598R77o586o238
$$ 3423 -2929 -8542 -12720 -8812 907 7675 6965 3188 1186 371 -313 1974 6572 7549 963 -5275
397e275n89M81n63L178O396P31m267R58L902j783m600P6l47o794k591P260N018
$$ -5275 -5864 -5383 -5946 -2768 3628 4359 92 1050 4952 3169 -1431 -1355 -1702 -8496 -11087 -3827 1191
414A191j601R16L414k353l190N929P694k115o333m199p392p584L256J3301R657
$$ 1191 -410 506 3920 1567 -1623 4306 12000 9885 3552 -647 -8039 -15623 -12367 934 10591
429A0591K924l27n791j1700o412L834P018M354J961m101j1106q100J232O335R627
$$ 10591 13515 13188 7397 -4303 -10715 -6881 137 4491 6452 2351 -8755 -16855 -15623 -9288 339
444C39J1554M173o386p846n528m808j031O464N927k665j541L925O67k139N518
$$ 339 11893 16066 9680 1834 -3694 -8502 -9533 -3069 2858 193 -1348 2577 3244 1105 6623
459F623P682m542q007J541r62j0010k090Q406p36q419O191J0983m431n318P730
$$ 6623 14305 9763 1756 3297 2335 -7675 -9765 -1359 -2095 -10514 -4323 6660 2229 -3089 4641
474D641J949j4382l912J2695Q59j1451L760Q448r976r199J6960J7053m799j643
$$ 4641 6590 -7792 -11704 991 1850 -9601 -5841 2607 -7369 -16568 392 17445 12646 11003
488A1003J0074j0956k6034j907J7305J018k683J5925O681k1434j3883J2383N263
$$ 11003 21077 10121 -15913 -17820 -515 503 -2180 13745 20426 -1008 -14891 -2508 2755
501B755p938Q542J5010j2829k2705J591O793p908J768K1408O220j4185j83J0482
$$ 2755 -5183 3359 18369 5540 -17165 -15574 -8781 -16689 -14921 6487 12707 -1478 -1661 8821
515H821o114j0275R243P511j2030o970J1918L250p367N921J2146o178j0022N733
$$ 8821 2707 -7568 1675 9186 -2844 -9814 2104 5354 -2013 3908 16054 9876 -146 5587
529E587M288j0434l999P485l323j1505L697R497l586m579P435J029j0056J010
$$ 5587 9875 -559 -4558 2927 -396 -11901 -8204 1293 -2293 -6872 563 1592 -8464 -7454
543g454J1377k64p160K542J35j2275m419J4687R847J16O779O219j2545j5383L320
$$ -7454 3923 3659 -3501 -959 -824 -13099 -17518 -2831 7016 7132 13911 20130 7585 -7798 -4478
558d478O890k679L189J2400l473j6772k909P481k812l082J2220O314j3222q430
$$ -4478 2412 -267 2922 15322 11849 -4923 -7832 -351 -3163 -6245 5975 12289 -933 -9363
572i363O076n97r678L716J1769m680r518P920J0438m686l222R965O71j4127k574
$$ -9363 -3287 -3884 -13562 -9846 1923 -2757 -12275 -4355 6083 1397 -1825 8140 8811 -5316 -7890
587g890J1680J144o056O683P712q018r558O855O554o962l257P480j203j2066o70
$$ -7890 3790 4934 -1122 5561 13273 5255 -4303 2552 9106 2144 -1113 6367 5164 -6902 -7572
602g572R588r51q496K035M597o218n378J0262Q854m642n515L194k248r828J954
$$ -7572 2016 1065 -7431 -5396 -799 -7017 -12395 -2133 6721 2079 -3436 -242 -2490 -12318 -10364
617a0364J4423N584n097J200L252q195q238P219R759k775l952M711r22j0179j817
$$ -10364 4059 9643 4546 5746 8998 803 -7435 -216 9543 6768 2816 7527 6605 -3574 -5391
632e391Q970J359q381l85N341m550o348P001P393o252p231L654J590o081K990
$$ -5391 3579 4938 -3443 -3828 1513 -3037 -9385 -2384 5009 -1243 -8474 -4820 -3230 -9311 -6321
647f321J1935K094q518j291L069m164l702R367Q411m517m404K602l50p069J831
$$ -6321 5614 7708 -810 -2101 968 -3196 -6898 2469 10880 6363 1959 4561 4211 -2858 -1027
662a027P980r33p309o5L177l721j931O253K303p292m306K423M10j920M543N908
$$ -1027 6953 6020 -1289 -1354 1823 -1898 -3829 2424 4727 -2565 -6871 -4448 -4038 -5958 -1415 4493
678D493l132o122p6J592q50K472O442J522m422k156O48k17j57L283K471k964k605
$$ 4493 1361 -4761 -4837 -3245 -4095 -1623 4819 6341 1919 -237 411 194 37 3320 5791 2827 222
695B22R6R88O64J571J005l276m368j713J78J774L331K780j607l843k975q23R57
$$ 222 318 1306 1970 3541 4546 1270 -3098 -4811 -4633 -2859 472 3252 1645 -2198 -5173 -5996 -5039
712e039L950M414M92k784k218j905j289K456M590K207j737j195o99j787j99L534
$$ -5039 -1089 3325 3817 1033 -1185 -3090 -4379 -1923 2667 4874 3137 1942 1243 -544 -743 2791
728B791K235k500l033n59q24j66K600L681j302m051k013k04n29J572M560R97l601
$$ 2791 5026 2526 -507 -1066 -1890 -2056 544 4225 2923 -1128 -3141 -3345 -3874 -2302 2258 3255 -346
745c46k842r8L09O08L502L412j810l604o93O78j3J789L704m07l868k203N96Q65
$$ -346 -3188 -3286 -2977 -2369 1133 4545 2735 -869 -1562 -884 -897 892 4596 4189 321 -1882 -1286 -421
763d21R62K783R34k844m022j309J177J112K397K412p44l725k461Q87J103J380
$$ -421 541 3324 4258 1414 -2608 -3917 -2740 -1628 769 3181 2437 -1288 -3749 -2862 -1759 -379
779c79J902K81k095k337N6J730J880J692J81j661k541j188J742K440J370kk212
$$ -379 1523 1804 -291 -2628 -2572 -842 1038 2730 2911 1250 -1291 -2479 -737 1703 3073 3071 859
796H59k961j439R42K939L495Q26k020l276k968j151J898L180K693m20k914k248
$$ 859 -2102 -3541 -2599 340 3835 4661 2641 -635 -3603 -4754 -2856 324 3017 2597 -317 -2565
812b565o68K55K823L889J150k640l300j483r80P28L478K785j021k433q63Q9l5
$$ -2565 -3233 -2978 -155 3734 4884 2244 -1056 -2539 -3519 -2791 687 3472 2451 18 -845 -756 -791
829g91J440K702J73l679j915K51K2J43K034J916k072k062Q67J861K59J89O42j514
$$ -791 649 3351 3524 -155 -2070 -1819 -1797 -1654 380 2296 224 -1838 -971 890 1149 1338 1980 466
847D66m185r11L117K446K97J143P34l643l424J813M131J406m69n22k191n104j700
$$ 466 -3719 -4630 -1513 933 1230 2373 3107 -536 -3960 -2147 1984 3390 2921 2399 208 -4896 -6596
864f596M391M191J271O91L20m451m638Q39M442J368l74N04q90n362j994M291M251
$$ -6596 -2205 1986 3257 3948 4268 -183 -4821 -3982 460 1828 1454 1958 1068 -4294 -6288 -1997 2254
881B254j51L07J861l000n296L29M629L4j853J270J418l701j684M707L191l112
$$ 2254 2103 2410 4271 1271 -4025 -3696 933 967 -886 384 1802 -1899 -3583 1124 4315 1203
897A203j244K302j537m034J775M608j905m627J126K777k446k2N837K063n705l440
$$ 1203 -41 2261 724 -3310 -1535 3073 1168 -3459 -2333 444 -2002 -2024 3813 5876 171 -3269
913c269J951l62k270L722N825k639o068J62K496j637Q46O669K272o403m338J038
$$ -3269 -1318 -1680 -3950 -228 5597 2958 -3110 -2948 -452 -2089 -1243 5426 7698 1295 -3043 -2005
929b005q25j748M326O231j953n746J12J143k260P34N412J948n396l345J427l14
$$ -2005 -2830 -4578 -252 5979 4026 -1720 -1608 -465 -2725 -1991 3421 5369 -27 -3372 -1945 -2259
945b259j486L111M810j934m110M80K042j274n2L328L25m244j749K265J202q41
$$ -2259 -3745 -634 4176 2242 -1868 -1388 654 -620 -672 2656 2981 -1263 -3012 -747 455 -386
961c86K004J882k144l440P95K880k54p06J235p30l772j749K778L144m72N07J10
$$ -386 1618 3500 1356 -2084 -1289 1591 1337 631 1866 1136 -2636 -4385 -1607 1537 1065 1572 1682
978A682k405l002N06L640K082q61k73j325l055j727K965M172R54o22o87j698l166
$$ 1682 -723 -3725 -3219 421 2503 1642 1369 44 -3011 -4738 -1773 2399 3353 2731 2044 346 -2820
995b820r9L664K575j214r80n71k232j406K082L278L0j672j040j074j644O50L077
$$ -2820 -2919 745 3320 2106 1126 555 -1677 -3083 -1001 2277 2307 635 -405 -1479 -3123 -2473 604
1012F04J720j643j511p85p82k42K580K910j3k037j422p96m06J516K750J181j577
$$ 604 2324 681 -830 -1615 -2397 -2639 -59 2851 2838 801 -621 -1417 -1823 -307 2443 3624 2047
1029B047j714j293m75M45K509J353j048k371j235l7K70J939J265k84j950j824
$$ 2047 333 -960 -1435 -990 1519 2872 1824 -547 -1782 -1819 -1549 390 1655 1371 -579 -2403
1045b403m95N01J775K072O56j609j949o58pK101K007J006j189j801j258j23J219
$$ -2403 -2898 -2397 -622 1450 2106 497 -1452 -2110 -2117 -16 1991 2997 1808 7 -1251 -1374 -155
1062a55J752J680q80k021j497n18Q65J531J736m08k550k271m07N38J676K224J457
$$ -155 1597 3277 2397 376 -1121 -1639 -774 757 2493 2085 -465 -2736 -3143 -2605 -929 1295 2752
1079B752j764k616j670p4J592J877K342K24j794k477p80J300J542K100J012j076
$$ 2752 988 -1628 -3298 -3372 -1780 97 2439 2663 869 -1608 -2388 -1088 454 2554 3566 2490
1095B490k424j429Q82Q81K37P87K21j992j585K42K271M82k09J78j697k346n26
$$ 2490 66 -1363 -481 400 637 1424 1645 -347 -1932 -1690 581 1063 854 1032 -665 -3011 -3537
1112c537K559J485l75J13o8k148j036K054K903K06j090J32j087k625P31L496J543
$$ -3537 -978 507 132 245 177 -1971 -3007 -953 1950 2156 1066 1198 111 -2514 -1783 1713 3256
1129C256j449p75P9k489j422L266L038n62k405j85j990k633J051M421J447j756
$$ 3256 1807 1032 1111 -1378 -2800 466 3504 2942 537 352 -1638 -4271 -3220 1201 2648 892
1145H92q64n74k532j161L430L145q18j430K22j179k140J095M213M96k071p2J42
$$ 892 28 -546 -3078 -4239 -809 2336 1518 88 310 -869 -3009 -1914 2299 2795 724 652 794
1162G94j391k66K585J533k282j439O9n08r26K241K258p44k665q13k15n37P97L059
$$ 794 -597 -863 1722 3255 973 -466 -397 -905 -1831 410 2668 1924 -741 -1554 -1769 -2306 -1509 1550
1180A550N01k079j638l60K04J09K586J785j266k522j18L36N5J704K216l51k148
$$ 1550 2051 -28 -1666 -2026 -1822 -1713 873 2658 1392 -1130 -1248 -912 -857 847 3063 2712 564
1197E64j730J98R6Q97K142Q08j499k781n74j6M99J692J651n66j971j420JN74R05
$$ 564 -1166 -968 -872 25 2167 2975 1476 -1305 -1879 -1895 -1396 296 1947 1381 -590 -2010 -2009 -1435 -530
1216e30J583J01j269j657J39P57J196J611j10j247j433n72R54J008J230P73j362
$$ -530 1053 1154 -115 -1772 -1633 -876 320 1931 1821 574 -859 -1431 -477 531 1761 2534 1172
1233A172k116j112M50J105J896J149o42k146j612n30R23J415J495K61j151k264
$$ 1172 -944 -2056 -1606 -501 1395 2544 1902 -244 -1856 -2386 -1463 -48 1447 1708 557 -1707
1249a707m17M42J268J626R18n03k283j375Q36R22R89J089j27j329j341k53R74
$$ -1707 -2124 -1682 -414 1212 2130 1627 -656 -2031 -1195 -273 716 1805 1678 349 -992 -1245 -271
1266b71J345N62N2p56j707j205O98J583M39Q5l53j519q71O35J580P28j27o46j168
$$ -271 1074 1636 1688 932 -775 -1980 -1282 301 740 825 472 -1047 -1918 -1283 297 1025 898 252 -916
1285i16r24p9J678J720M27p11j461j144m45J344J881Q78m09j498j208j316L42
$$ -916 -1840 -1919 -241 1479 1906 1195 -266 -1410 -1855 -511 1370 2248 1839 341 -867 -2183 -1841
1302a841K107J683M01j016j797j200m69J055K041N17m46j255r49o52M15J832J445
$$ -1841 266 1949 2350 1334 -463 -1663 -2132 -1077 964 1481 1035 -220 -1169 -1821 -1406 426 1871
1319A871m49r83j035p74p5J149J828j76r09q15o41n6P90J314R05j171j362o05
$$ 1871 1422 439 -596 -1370 -1445 -296 1532 1356 447 -368 -1009 -1065 -275 1039 1944 773 -589 -1194
1337a194J62O45J189M90p17j235o95J11O17J271Q27j6j471j309o04R04J293J225
$$ -1194 -1032 -387 802 1292 575 -660 -1355 -1244 -627 644 1471 1455 -16 -1325 -1929 -1025 268 1493
1355A493L14j114j608j060N84J256J472N81o33j370j613m65J148J690J069l73
$$ 1493 1807 693 -915 -1975 -1391 -135 1337 1918 1285 -85 -1698 -2163 -1015 675 1744 1371
1371A371r07j276o31L01J576R27j10o63j182j102MJ219J631J8n37o65q07o38Q05
$$ 1371 464 -812 -1443 -1142 434 1361 1251 588 -594 -1696 -1692 -473 1158 1176 639 -26 -833 -1471 -666
1390f66J762J37l09q66o64n00O6J349J059m75p31n19j003L01J269J264L6j379
$$ -666 1096 1233 924 58 -606 -1106 -1040 309 1368 893 162 -357 -1360 -1059 210 1474 1510 131
1408A31n41o55l61P84J816O03j512p82k26n80K01K053Q33o36j769j55j54l27J367
$$ 131 -410 -1065 -1426 -642 1174 1777 265 -517 -743 -1323 -1122 931 1764 1128 -641 -796 -950 -1277 90
1427I0J595j79j447r90j86p1Q35J750N85j385j377k84lq3J878J407p83j985p75
$$ 90 1685 1506 59 -931 -1117 -1188 -353 1397 1982 597 -780 -1064 -1067 -1150 728 2135 1352 -633 -1408
1446a408J41K23J027J587J89j776j145k33K78M07J761J039q94j687k62K84P1P60
$$ -1408 -1267 -1044 -17 1570 1759 -17 -1162 -1395 -1117 -710 1051 2090 1196 -491 -753 -469 -398 362
1464C62J227j95j722r45Q63j79M71J281L26j124j617M30N51J19N94Q60q17j822
$$ 362 1589 1394 -328 -1273 -410 -589 -118 1163 1489 365 -1252 -822 -271 -152 442 1302 485 -1337
1482a337k10J228Q06j1L58M61k149j019P18J508K96r6Q92j223j959L39J567P50
$$ -1337 -1547 -319 487 476 834 1295 -854 -1873 -1155 353 649 553 1445 222 -1737 -1398 169 919
1500I19K27L61l96k207r15J128J530J29J41K23j364j995O89J582P61k01N41o15
$$ 919 1146 1507 1111 -1096 -2011 -883 647 776 917 1140 -224 -2219 -1530 52 813 612 1153 538
1518E38j959o04R62J580j45N61j31o29j286J97J446L44j54j55m96r74j83R82J235
$$ 538 -1421 -2025 -1063 517 372 933 802 173 -1113 -916 530 874 720 565 69 -905 -1088 -106 1129
1537A129r5q35l07n81l08P62P95L49m45r18o00j17N34J000P96j52j209o12QN09
$$ 1129 1034 199 -108 -689 -997 -235 560 909 464 -454 -1054 -1171 -637 363 1159 1007 -202 -814 -806 -297
1557b97K71J013M43j141j280k86P46M20O73J024n8k054j041M41O37L68J081Q25
$$ -297 -26 987 1430 289 -991 -1277 -531 -111 562 1586 1528 -526 -1567 -1126 -489 -121 960 1785
1575A785j730j460k61J135J98N70J152n01j463q86P47K12K18O17Q45j400j176
$$ 1785 55 -1405 -1666 -531 -333 237 1389 888 -575 -1461 -714 -502 -284 333 1178 -222 -1398
1592a398J061J020o21L50J018p71j861J27J414N18m11N02n8j569j167J575J072
$$ -1398 -337 683 62 412 1430 659 -1202 -1075 339 857 446 948 890 -679 -1846 -271 801
1609H01l32j20L61r53j597M75J581N42l89J42Qj383p72J528J290l34l26K02r34
$$ 801 469 349 710 -243 -1840 -1365 216 758 369 511 519 -864 -1636 -108 1182 848 522 724 -210
1628b10j167K43J751Q70o68M8o28j219k95J095J165j12m49j48o57o99L81J108
$$ -210 -1377 -1134 617 1487 819 867 239 -980 -1275 -180 985 873 424 276 -381 -1080 -699 409
1646D09O08q60k22n96j00k80J160R87o60p09j72Kl87R53J164M0j097q30m46J04
$$ 409 1017 157 -65 -661 -761 -1041 119 1106 446 -263 -435 -433 -820 133 1297 1337 240 -590 -1036 -932
1666i32N60R18N39k18j116l88k17K56O95R74L7j477n37j79J11L31J135M10m45
$$ -932 -372 546 1085 867 -249 -637 -854 -598 97 1071 1108 -369 -906 -1085 -974 -643 492 902 457
1685D57j212n04O38O07O82L20j92j083p63P6N22Q59L79K49n92o68p11P30M03L42
$$ 457 -755 -1259 -621 -14 668 988 796 -287 -1050 -974 -452 407 786 1035 443 -225 -936 -206 197 539
1705E39O4q20l97n21O46O72L74r4k34n45n84J62P27O03j5j20p16q15j26Q95R09
$$ 539 603 -217 -614 -1135 -489 183 557 463 229 -316 -900 -738 -11 592 577 457 -259 -1074 -1200 -305 604
1726F04N45o91k55q92m03N04O37O56J28l60p69q37J36R29R90j36l73j81p48o86
$$ 604 1149 458 203 -689 -1092 -588 49 705 833 473 -296 -1133 -997 -68 922 786 413 232 -516 -1202
1746a202P12Q10K47j63j65p14m78L21J094M04k66k30n25r68M91Q39N46k62j47
$$ -1202 -490 320 567 404 239 -475 -953 -632 462 866 600 370 -155 -1123 -632 207 753 491 344
1765C44j22p00l33O75Q83k77J28l05j029j69M11J161Q3p46J80m35q13K34J399
$$ 344 222 -478 -811 -136 747 470 598 293 -736 -905 -494 667 750 4 184 -251 -1064 -830 569
1784E69O90j056k42k89m89k14J028J262m37n97R8p38q71Q27J403k53m75L9m25
$$ 569 1259 203 -39 -328 -817 -1031 -3 1259 822 225 323 -415 -1286 -459 944 691 216 255 -170
1803a70r81O15J106J95n07l68J7r33j64J391J037p70m67J16o37p23P90J411j07
$$ -170 -1151 -536 570 765 258 -110 -93 -1026 -1190 201 1238 468 1 117 -520 -1243 -453 958 851
1822H51r04N23o03r67R3J811J53r02j0J74j132j48J639M27n47k27O3q02m87R93
$$ 851 -53 470 -133 -1100 -1007 804 957 55 45 219 -913 -1061 578 1005 458 231 294 -508 -995 -2
1842bR26K8j132J24R1j254P82J391K5r92J16M0j116K1J382Q60j093o98M44l02
$$ -2 924 952 -180 -56 35 -1219 -437 954 979 -13 103 143 -973 -952 430 1290 197 -501 -57 -359
1862c59m60Q98J099l19j038R6l96m31M19J263M01j233k63l7o94J85J112R03l41
$$ -359 -819 79 1178 859 -179 -83 -479 -910 -491 772 1173 -60 -323 -360 -1054 -869 243 1146 805
1881H05r76p6k60k87P01J230o73p63J1K63n44P1J277N50j237k78K16l81pM46O73
$$ 805 -171 -247 -507 -794 -93 1137 464 -299 -288 -25 -569 -498 779 1329 92 -186 30 -351 -358 88 761
1902G61j68p22n14K16N7N54M41K21j007o53L68J15k41P20P87o88r22J64M58j31
$$ 761 593 -129 -643 -427 -370 184 625 846 -161 -814 -446 -331 -572 148 935 247 -675 -511 -53 -184
1922a84N64P14m20q80p92K48L45K84O84K60r09o85J52P71j77O08M59m79j059o17
$$ -184 380 1094 674 -206 -998 -750 -405 -121 563 823 -86 -771 -619 152 -25 583 1042 563 -496 -1113
1942a113Q64q7M48N79q9o89o18K80N98j81K42O52q40j186K06N38O19OL68j09j293
$$ -1113 -249 -336 112 691 602 -87 -705 -425 173 -8 234 886 46 -1140 -934 -396 223 229 597 488 -805
1963h05R6M80N68J19l0L41r67j019O61O82N6L20P9o32p82K85O62K28j55K23k12
$$ -805 -709 -229 339 458 428 769 -198 -1217 -556 126 182 502 581 -51 -833 -548 114 342 187 410 198
1984A98q71l47P40M92M17j55l66k53p54M23O94R1L73j85m02q82J8L10J046rj3
$$ 198 -673 -1020 -280 212 629 474 108 -145 -899 -476 218 309 682 497 95 -787 -769 -459 587 578 565
2005E65l38r41p2L94N65K91k24Q4k22n83j35P07N96k47q1m55n37OL66Q85J5j61
$$ 565 227 -714 -786 -392 173 464 240 324 102 -481 -616 91 687 440 359 -96 -633 -627 -261 624 639 478
2027D78l76m83q2L69N39J60j03m01j063N19J02L43N71K99r18m01J12k6K8O31M10
$$ 478 102 -381 -463 -94 445 605 502 101 -962 -443 -341 2 573 872 -46 -447 -335 -361 -333 298 708
2048G08j04j018m19M43J90K29P43J03j034l59J55Q5J78M70J41j48j019j51M44
$$ 708 604 -414 -833 -390 -200 29 772 875 -159 -518 -363 -278 -100 370 511 363 -656 -807 -363
2067c63N31Q9M89O5p45o55J71P37n4q9J66k52o71n22J119L71q9J32j5q12m79N72
$$ -363 168 257 746 811 66 -589 -418 319 265 176 342 90 -581 -1103 16 387 298 430 415 -397 -876 -304
2089c04Q78k22K24j84n36p62J00J059N16l68K32o88n61m87J001P98j28o44M23
$$ -304 574 352 576 392 -144 -906 -806 253 769 401 633 -55 -616 -1103 -102 696 568 -76 347
2108C47k48o59N4O22R69j113q9J33o47j21O11R22j63q26J07R3q84N49Q04R5n98
$$ 347 99 -560 -506 116 1085 -28 -117 16 -631 -752 -141 781 618 -208 -101 -8 -892 -343 461 556 -42
2129d2k20M0j10j99O51P71r4j254K21J32k72J12R32N8o49o39N18kPN01N79p14
$$ -42 -262 -222 -332 -531 120 891 797 -457 -236 -104 -376 -264 668 726 77 -562 -44 -46 -39 462 1041 327
2151C27r50k04O13Oj7P36J79r31m54K90O10l62M49Q49o78j279K18O09j44K14O93
$$ 327 -623 -827 -214 -208 -225 511 690 -241 -695 -405 205 -157 292 1141 463 -816 -598 11 -133 81 774
2172G74o5r07n91N10Q87m22R7N37m59r33N7O74J14k49L05J78r16k35P22L29k66
$$ 774 709 -198 -789 -279 608 186 283 820 361 -572 -515 159 273 24 329 507 -409 -644 78 407 141
2193A41o3J80k28o68k7Q97J59o9J23l62n32k07O37L03J85l07j18l98q4J1P19M37
$$ 141 78 258 30 -638 -665 232 391 322 445 83 -449 -656 -19 284 469 162 44 -354 -438 -427 292 729
2215G29l07l36k56k09j93M61N37J32k79p42J37j96L53N62L50r0r45j06J75J41
$$ 729 422 86 -170 -379 -572 -111 426 558 279 -463 -326 -522 -169 393 743 653 -292 -398 -223 -82
2235h2M19M08m45j81p53R3K89L64j51P47o40n39n0M60K17J10Q2K22p91k09L03
$$ -82 337 745 300 119 -634 -541 -252 112 -39 708 68 -471 -521 -61 156 266 348 570 -221 -430 -127
2256a27J66k06K49P61p53p29J13O88L3L0K9q8o01M7K77K32o3M02j64l50n91K67
$$ -127 39 -167 82 843 90 -639 -526 162 195 225 254 166 -435 -388 -111 121 58 460 296 -54 -645 -378
2278c78O62J1J52j37m24n21L99L99R4p1J26J26r60p8N08N16l73K84J5m24o35P17
$$ -378 284 295 447 310 -114 -635 -236 163 257 186 312 438 -522 -600 -92 424 51 335 350 -74 -709 8
2300HJ91rL07l1m37n13j20M63K81j78M60n2n87o86Q14K09K26M5j38n36m33K57
$$ 8 199 190 497 466 29 -484 -604 -141 140 -38 422 370 -217 -903 -89 120 346 391 253 -283 -716 -459
2322d59M68M03j37j24j14l45l39J033J42j76p3m40q9k92M18M97l34K73l54l08
$$ -459 9 412 275 151 37 -308 -647 386 528 352 279 -161 -250 -542 -124 373 39 312 -42 -350
2342c50m1j23Q54J58r6l33O0l88l37N59L29O6l94q4L4n58N99M65K48o28M1k57
$$ -350 -391 -514 340 498 402 69 129 -259 -596 -37 292 358 -36 -120 -86 -644 -45 420 668 40 81 -176
2364a76l64q2P64K29r8l92j51l58K88N88M13l4n41l22j19k10L35P53J4n56m94
$$ -176 -540 -622 142 371 273 -119 -270 -628 -340 248 661 627 86 -236 -355 -565 -230 523 537 -19 -513
2385e13L63k06o6O21L81j94o03J53m0oK7O55J8m33l73K78Nj70K06J31m17l23l5
$$ -513 -150 -356 -422 199 580 386 -217 -64 -104 -110 -83 572 590 157 -216 62 67 -103 103 234 -183 -506 -541
2408e41K78r1M42N26K2o55l71K03q6J92N08o0l59l39j24K34K02K16L47k6q05k90
$$ -541 -263 -354 88 614 636 -19 -390 -187 -273 -81 427 367 8 -331 -455 -221 -19 197 544 518 -287 -577
2430e77L75O8K35R8J35m5q94K43N18L05l14j01J96m72k04L34K35M9o0J30k24n05
$$ -577 -202 -134 101 199 334 289 -605 -362 156 461 147 46 242 -230 -434 -100 135 184 124 254 30 -475
2452d75K0O46J41k6m08O5k99j26M07L60J66m65o6j55P3l65Q05J13k70j24o4l08
$$ -475 -455 191 332 306 -102 -37 -336 -462 -55 305 471 6 -60 -215 -142 -507 298 411 141 17 -47 -355
2474c55l21O24N25K15p00k34N4k24L33J53L14k59k41k77L35j44M7R77m40p30P9
$$ -355 -676 -52 473 688 -12 -246 -192 -416 -83 70 384 125 -116 -393 -58 -202 -155 822 382 -348 -269
2495b69J79rj84P26J26n44m05L79p6j33N39Kj70n05j35L06j3J7L82M36n49q73
$$ -269 -90 -99 -283 443 569 25 -380 -1 -77 -210 329 331 161 -344 -479 -173 -186 -169 213 649 100 -773
2517g73P69m6J28R2M34m81m50n9K13J56j96P10k8p24m60Q23Q3k38J11M91m44n99
$$ -773 -4 -50 78 170 604 123 -327 -386 -173 -17 -213 497 469 -255 -715 108 191 -47 64 555 111 -488
2539d88J78K77K08q3L73j48m45m18M25M54j17l16M10m46l55J73N88K08j95%l70
$$ -488 -310 -33 175 92 465 317 -128 -546 -121 333 216 -100 310 -136 -491 -318 270 478 283 283 -87
2560h7%n53P97K48l07k36L90o17r0M49M48k33j26j14N4k13P1J58L95k76k43J70
$$ -87 -87 -640 157 405 98 -138 252 -365 -455 -6 442 209 83 -31 23 -190 -119 39 434 158 -85 85
2582H5l02j25J14Q45k47m23J57k95p5n5N58N19n23n24J29K3l90M11N49p8l49q5
$$ 85 -217 -342 -228 617 370 -53 104 -191 -266 -321 237 756 233 -291 -162 -139 -529 -118 431 353 4 -81
2604h1j86J93l8L32M82p67l87L47m9RJ82L65k71m71J16j04J14K22K92L39p54j22
$$ -81 -267 -74 -112 220 702 -65 -452 -105 -154 -145 37 402 131 -340 -224 -328 -214 8 300 639 -115 -237
2626b37j12L05rN97K71q02j53nJ67m22N32M33m17l69J2k9J11R2K99J79n15m46
$$ -237 -349 -44 -53 544 815 13 -140 -145 22 -400 132 565 148 -221 -209 -238 -127 -35 264 443 -72 -518
2648e18L88j69L44m0K48k34j10k14j42L83L16L5j41n47J06j04M99o8L76j06n50
$$ -518 -130 -299 45 5 253 19 -91 -305 -447 -64 252 287 146 -401 -295 -399 100 32 408 302 -248
2669b48j22J43J60K64Q1j27J63n56j08J03K46L61J80l17m67k32M12m7K73L9q5
$$ -248 -370 -227 -67 197 278 151 314 -242 -350 -247 -1 360 540 223 -244 -476 -64 -111 162 201 116
2690A16n14q9J8N35J37K20Q2k56k86l11K95k2K52J7j36j97k65J78M59N7K35k84
$$ 116 -398 -487 -469 66 203 423 505 249 -37 -348 -53 -75 177 194 58 -139 -404 -226 233 290 525 241
2712B41r9l70M4j43M27O6j20j23j89K74n2J52K09L7m05j74J11j72L27L97O9l77
$$ 241 142 -228 -184 -327 100 166 46 -77 -266 8 -44 108 317 354 -51 -225 -114 -286 41 438 507 130
2734A30j75k07l7M0P77N1k06o17J76l21k11R25j71j15k82j25J33J95N3N5L98o29
$$ 130 -45 -252 -289 -249 528 579 373 -244 -68 -389 -600 325 154 39 -243 -368 -235 -40 13 68 466 -163
2756a63j79J74q5L05n0L21j87k35k79K10J74p5L61ql56k43l4J31J24P1K26L0r12
$$ -163 -342 -168 -253 52 2 323 136 -99 -378 -168 6 -69 292 284 -72 -315 -349 -218 -94 -23 203 233 -679
2779f79O82R0P9j94K89J18n14k67J67O2K25J82J23n16l90N54j44K87m0N3j90l14
$$ -679 3 93 172 -22 267 385 -129 -396 -229 -167 58 240 363 -153 -543 11 -133 154 114 167 -23 -337
2801c37M6M07j07J78K89k47l58j44K2L23K77n9q7j51k21k97K38K58k8J58nl02
$$ -337 -291 116 9 187 476 229 -129 -273 -251 72 349 290 203 52 -169 -466 -228 30 2 160 155 -147
2823a47k68L84j2L97l16nm60l6k1O80K12n9j51m06l0k03J55O02o0k77j89j17j82
$$ -147 -415 -31 -43 354 38 33 -427 -463 -484 196 408 349 198 -208 -238 -441 -286 316 256 -21 -210 -327 -509
2846e09M30K86L9rl25P0j85K85M6O0j83j03K8k56K87j76L96J13l05l73lK72J2
$$ -509 -79 207 246 237 -88 -18 -203 82 128 188 5 -98 -70 -326 -39 -215 181 294 -11 -384 -387 -115 -103
2869a03J84J69k8n91K59k24K29L21j67O1j28k39l1M40k51J37N50j00p84o5M45
$$ -103 81 250 222 -369 -110 -334 -105 216 49 110 -18 -257 -288 152 -99 38 588 488 -296 -361 84
2890H4r6K90k8J97m10k70n7L69L21l0j17m31Q7l93M42J91J71o0Ml15m69M88j25
$$ 84 -12 278 250 447 37 -233 -290 79 400 370 253 -178 -91 -484 -42 149 320 260 264 -51 -520 -32 -157
2913a57L57J52k82l45J60k02J97K14L7J76k50l04P2K37J6J69m2l76J37n4j95O27
$$ -157 200 352 70 -275 -115 -317 -120 94 131 307 57 -247 -175 62 78 247 205 -171 -34 -88 -283 344
2935C44j05j23p6J25n42J52QL39K9j42k93J21j21L21Q8Q6j3m81J58j32N3K98K31
$$ 344 239 116 40 165 -377 -225 -217 122 151 9 -284 -163 -284 37 125 211 198 -283 -125 -257 -204 94 325
2958C25j96j62lk26l2K95J59k03k6Kj6mNM07o5j19l10M9L53k38O1K12l27j1K18
$$ 325 129 -33 -36 -262 -294 1 160 -43 -69 -67 -83 -87 -82 325 260 141 -169 -120 233 -5 56 268 -59 -70 148
2983A48k18r3L13J33K41m82j59k87M14R8r9J08k16o7lL1L21M5qL35l45n37j04
$$ 148 -70 -163 150 283 524 42 -117 -404 10 108 9 117 -99 -166 -169 -138 183 228 220 555 210 -327 -431
3006d31Q3K59K43j61q7Jj37L99j70J84j13mk69M5O1J86R0K51k83J46o23l5L59
$$ -431 -348 -89 154 -7 -94 -93 -230 169 -1 183 70 66 -203 -158 -97 89 179 430 147 293 -330 -365 -6
3029fj89N59k99k14j92M8J52K88n4K88l00k82k8J88R6R0N0j47l14O4R1J64M5j1
$$ -6 -195 364 65 -149 -341 -293 -141 147 93 381 81 -201 -229 -41 55 145 195 48 -266 -202 -111 53 98 87
3053H7J18n7m13K77k03K35pJ69k89J03k50L49N2k5L1j39j29k07J88J2K5J44R3
$$ 87 205 148 -265 12 -191 44 37 206 -83 20 -230 119 171 146 177 38 -91 -298 -110 -98 -73 71 164
3076A64l13M6j46J11J80M57m22O7k96k36K55L36j44M8k37Mj04L2J96J30K41k53
$$ 164 -149 -103 -249 -138 42 499 77 144 -152 -388 -133 203 59 107 -130 -126 -230 -198 -2 128 369 116
3098A16j37j46k22J3K65N76l82j0m2l93R8J39K45K95n45J51k08J1R6M5L2J59k34
$$ 116 -21 -167 -389 -376 -111 465 83 73 31 -362 -264 -125 120 415 -130 21 -187 -176 -80 -35 -3 156 -78
$$ [...]
8191A29
##END NTUPLES=NMR FID
##END=
