##TITLE=1H_Pr 5256
 200.13MHz, CDCl3,
 24 sc
 
 14.1.2025
##JCAMPDX= 6.0         $$ Bruker NMR JCAMP-DX V2.0
##DATA TYPE= NMR FID
##DATA CLASS= NTUPLES
##ORIGIN= UXNMR, Bruker Analytische Messtechnik GmbH
##OWNER= pz
$$ XWIN-NMR		Version 3.5
$$ Tue Jan 14 15:58:28 2025 Russian Standard Time (UT+4h)  she@DPX200
##.OBSERVE FREQUENCY= 200.1307
##.OBSERVE NUCLEUS= ^1H
##.DELAY= (6, 6)
##.ACQUISITION MODE= SIMULTANEOUS
##.ACQUISITION SCHEME= undefined
##.AVERAGES= 8
##.DIGITISER RES= 18
##SPECTROMETER/DATA SYSTEM= spect
##.PULSE SEQUENCE= zg30
##.SOLVENT NAME= CDCl3
##.SHIFT REFERENCE= (INTERNAL, CDCl3, 0, 14.3821)
##AUDIT TRAIL= $$ (NUMBER, WHEN, WHO, WHERE, WHAT)
$$ ##TITLE= Audit trail, XWIN-NMR		Version 3.5
$$ ##JCAMPDX= 5.01
$$ ##ORIGIN= Bruker BioSpin GmbH
$$ ##OWNER= she
$$ F:/spectra/data/she/nmr/H-C/1/audita.txt
$$ ##AUDIT TRAIL=  $$ (NUMBER, WHEN, WHO, WHERE, WHAT)
(   1,<2025-01-14 15:57:14.32 +0400>,<she>,<DPX200>,
      <created by zg, POWCHK disabled, PULCHK disabled
       configuration hash MD5:
       00 E9 B6 7A A2 85 ED C7 34 08 36 98 17 FE 4E 26
       data hash MD5: 16K
       C2 86 07 1E AB EC 94 6D B5 41 5B 1F 70 96 95 38>)
$$ ##END=
$$ 
$$ hash MD5
$$ 8F 33 42 40 3C 61 51 59 82 36 9E 67 A9 09 6E EC
##$RELAX= 
##$RELAX= 
##$RELAX= 
##$RELAX= 
##$RELAX= 
##$RELAX= 
$$ Bruker specific parameters
$$ --------------------------
##$DU= <F:/spectra>
##$EXPNO= 1
##$NAME= <H-C>
##$PROCNO= 1
##$TYPE= <nmr>
##$USER= <she>
##$AMP= (0..31)
100 100 100 100 100 100 100 100 100 100 100 100 100 100 100 100 100 100 
100 100 100 100 100 100 100 100 100 100 100 100 100 100 
##$AQSEQ= 0
##$AQ_mod= 1
##$AUNM= <au_zg>
##$AUTOPOS= <>
##$BF1= 200.13
##$BF2= 200.13
##$BF3= 200.13
##$BF4= 200.13
##$BF5= 200.13
##$BF6= 200.13
##$BF7= 200.13
##$BF8= 200.13
##$BYTORDA= 1
##$CFDGTYP= 0
##$CFRGTYP= 5
##$CHEMSTR= <none>
##$CNST= (0..31)
1 1 145 1 1 1 1 1 1 1 1 1 1 1 1 1 1 1 1 1 1 1 1 1 1 1 1 1 1 1 1 1 
##$CPDPRG= <>
##$CPDPRG1= <>
##$CPDPRG2= <>
##$CPDPRG3= <>
##$CPDPRG4= <mlev>
##$CPDPRG5= <mlev>
##$CPDPRG6= <mlev>
##$CPDPRG7= <mlev>
##$CPDPRG8= <mlev>
##$CPDPRGB= <>
##$CPDPRGT= <>
##$D= (0..31)
0 0.7 0 0 0 0 0 0 0 0 0 0.03 0 0 0 0 0 0 0 0 0 0 0 0 0 0 0 0 0 0 0 0 
##$DATE= 1736855833
##$DBL= (0..7)
120 120 120 120 120 120 120 120 
##$DBP= (0..7)
150 150 150 150 150 150 150 150 
##$DBP07= 0
##$DBPNAM0= <>
##$DBPNAM1= <>
##$DBPNAM2= <>
##$DBPNAM3= <>
##$DBPNAM4= <>
##$DBPNAM5= <>
##$DBPNAM6= <>
##$DBPNAM7= <>
##$DBPOAL= (0..7)
0.5 0.5 0.5 0.5 0.5 0.5 0.5 0.5 
##$DBPOFFS= (0..7)
0 0 0 0 0 0 0 0 
##$DE= 6
##$DECBNUC= <off>
##$DECIM= 32
##$DECNUC= <off>
##$DECSTAT= 4
##$DIGMOD= 1
##$DIGTYP= 9
##$DL= (0..7)
0 120 120 120 120 120 120 120 
##$DP= (0..7)
150 150 150 150 150 150 150 150 
##$DP07= 0
##$DPNAME0= <>
##$DPNAME1= <>
##$DPNAME2= <>
##$DPNAME3= <>
##$DPNAME4= <>
##$DPNAME5= <>
##$DPNAME6= <>
##$DPNAME7= <>
##$DPOAL= (0..7)
0.5 0.5 0.5 0.5 0.5 0.5 0.5 0.5 
##$DPOFFS= (0..7)
0 0 0 0 0 0 0 0 
##$DQDMODE= 0
##$DR= 18
##$DS= 0
##$DSLIST= <SSSSSSSSSSSSSSS>
$$ [...]
##$SUBNAM0= <"">
##$SUBNAM1= <"">
##$SUBNAM2= <"">
##$SUBNAM3= <"">
##$SUBNAM4= <"">
##$SUBNAM5= <"">
##$SUBNAM6= <"">
##$SUBNAM7= <"">
##$SUBNAM8= <"">
##$SUBNAM9= <"">
##$SW= 18.0517869722425
##$SWIBOX= (0..15)
0 0 2 0 0 0 0 0 0 0 0 0 0 0 0 0 
##$SW_h= 3612.71676300578
##$TD= 16384
##$TD0= 1
##$TE= 0
##$TE2= 300
##$TE3= 300
##$TEG= 300
##$TL= (0..7)
0 120 120 120 120 120 120 120 
##$TP= (0..7)
150 150 150 150 150 150 150 150 
##$TP07= 0
##$TPNAME0= <>
##$TPNAME1= <>
##$TPNAME2= <>
##$TPNAME3= <>
##$TPNAME4= <>
##$TPNAME5= <>
##$TPNAME6= <>
##$TPNAME7= <>
##$TPOAL= (0..7)
0.5 0.5 0.5 0.5 0.5 0.5 0.5 0.5 
##$TPOFFS= (0..7)
0 0 0 0 0 0 0 0 
##$TUNHIN= 0
##$TUNHOUT= 0
##$TUNXOUT= 0
##$USERA1= <user>
##$USERA2= <user>
##$USERA3= <user>
##$USERA4= <user>
##$USERA5= <user>
##$V9= 5
##$VALIST= <valist>
##$VCLIST= <CCCCCCCCCCCCCCC>
##$VD= 0
##$VDLIST= <DDDDDDDDDDDDDDD>
##$VPLIST= <PPPPPPPPPPPPPPP>
##$VTLIST= <TTTTTTTTTTTTTTT>
##$WBST= 1024
##$WBSW= 4
##$XGAIN= (0..3)
0 0 0 0 
##$XL= 0
##$YL= 0
##$YMAX_a= 140070
##$YMIN_a= -171706
##$ZGOPTNS= <>
##$ZL1= 120
##$ZL2= 120
##$ZL3= 120
##$ZL4= 120
##$ABSF1= 10
##$ABSF2= 0
##$ABSG= 5
##$ABSL= 3
##$ALPHA= 0
##$AQORDER= 0
##$ASSFAC= 0
##$ASSFACI= 0
##$ASSFACX= 0
##$ASSWID= 0
##$AUNMP= <proc_1d>
##$AZFE= 0.1
##$AZFW= 0.1
##$BCFW= 1
##$BC_mod= 2
##$BYTORDP= 1
##$COROFFS= 0
##$CY= -3
##$DATMOD= 1
##$DC= 2
##$DFILT= <>
##$DTYPP= 0
##$F1P= 0
##$F2P= 0
##$FCOR= 0.5
##$FTSIZE= 0
##$FT_mod= 4
##$GAMMA= 1
##$GB= 0.15
##$INTBC= 1
##$INTSCL= 1
##$ISEN= 128
##$LB= 0.25
##$LEV0= 0
##$LPBIN= 0
##$MAXI= 10000
##$MC2= 0
##$MEAN= 0
##$ME_mod= 0
##$MI= 1.114404
##$NCOEF= 0
##$NC_proc= 0
##$NLEV= 6
##$NOISF1= 3.799351
##$NOISF2= 2.8
##$NSP= 1
##$NTH_PI= 0
##$NZP= 0
##$OFFSET= 14.38212
##$PC= 1
##$PHC0= 249.5984
##$PHC1= 8.592219
##$PH_mod= 1
##$PKNL= yes
##$PPARMOD= 0
##$PSCAL= 0
##$PSIGN= 0
##$REVERSE= no
##$SF= 200.129724274929
##$SI= 16384
##$SIGF1= 3
##$SIGF2= 2
##$SINO= 400
##$SIOLD= 16384
##$SREGLST= <1H.CDCl3>
##$SSB= 0
##$STSI= 0
##$STSR= 0
##$SW_p= 3205.1282051282
##$SYMM= 0
##$S_DEV= 0
##$TDeff= 0
##$TDoff= 0
##$TI= <>
##$TILT= no
##$TM1= 0
##$TM2= 0
##$TOPLEV= 0
##$USERP1= <user>
##$USERP2= <user>
##$USERP3= <user>
##$USERP4= <user>
##$USERP5= <user>
##$WDW= 1
##$XDIM= 8192
##$YMAX_p= 0
##$YMIN_p= 0
$$ End of Bruker specific parameters
$$ ---------------------------------
##NTUPLES= NMR FID
##VAR_NAME=  TIME,          FID/REAL,        FID/IMAG
##SYMBOL=    X,             R,               I
##VAR_TYPE=  INDEPENDENT,   DEPENDENT,       DEPENDENT
##VAR_FORM=  AFFN,          ASDF,            ASDF
##VAR_DIM=   8192,          8192,            8192
##UNITS=     SECONDS,       ARBITRARY UNITS, ARBITRARY UNITS
##FACTOR=    0.0002768,     1,               1
##FIRST=     0,             0,               0
##LAST=      2.2672688,     0,               0
##MIN=       0,             -171706,         0
##MAX=       2.2672688,     140070,          0
$$ Real data points
##PAGE= N=1
##DATA TABLE= (X++(R..R)), XYDATA
0 0 0 0 0 0 0 0 0 0 0 0 0 0 0 0 0 0 0 0 3 -5 8 -8 8 -8 8 -15 16 -16 20 -24 25 -31 33 -39 45 -49 56 -61 70 -78
40 -78 86 -98 109 -119 133 -148 164 -179 198 -218 240 -264 292 -321 356 -391 433 -482 537 -600
60 -600 676 -766 876 -1017 1200 -1449 1813 -2405 3570 -12400 61825 58096 -28524 -49293 36860
75 36860 124420 35733 -58899 -41657 47126 77270 -41588 -118859 -46595 28976 13790 -105313
87 -105313 -133367 -2438 81015 44133 -41624 -29070 103064 127971 17219 -86390 -74917
98 -74917 28859 20019 -91719 -125853 -49212 64802 52235 -51330 -55326 19891 69888 14689
110 14689 -82438 -54558 29997 49797 -3583 -60244 -10099 50602 12586 -54535 -80900 -23055
122 -23055 21799 -29959 -66480 -34991 30566 47478 -24215 -51683 -898 41207 22519 -50635
134 -50635 -54758 17895 40696 -4543 -70901 -60954 14173 19077 -35729 -68666 -27842 52334 46031
147 46031 -17628 -39793 -7557 35192 -221 -66836 -62335 -13442 26440 7130 -30494 -3663
159 -3663 32657 30657 -9463 -47565 -27084 -5750 -21085 -36468 -32773 5365 23239 -3535 -13825
172 -13825 -3594 12007 3431 -32459 -27923 3717 18141 4028 -25846 -13994 15394 6878 -25326
185 -25326 -50275 -28425 11295 5111 -17442 -22198 5632 35640 14723 -18036 -21551 -470 18983
198 18983 177 -21644 -12131 4505 10356 -11511 -32751 -23718 -14378 -11816 -13234 -9120 13775
211 13775 22912 19278 18550 15304 11560 -6188 -24896 -20109 -11865 -10350 -18288 -20308 2577 16701
225 16701 6375 -11917 -17417 4083 16905 3786 -8230 -2134 22438 30714 5904 -15528 -16158
238 -16158 -3645 -2492 -22826 -28987 -11753 9301 16883 4957 1169 10457 13168 7173 -4171
251 -4171 -5278 4424 4695 2099 1946 3449 2566 -10323 -17955 -11006 -3383 -2838 -9577 -2893 19296 29106
267 29106 16971 -2439 -5012 9664 8405 -11789 -26158 -14619 12102 17928 -501 -12775 -2130
280 -2130 15725 10474 -13324 -20697 -3153 17990 16992 -218 -3246 8950 14995 2470 -16700
293 -16700 -17854 -5066 1963 -676 -3004 5250 14401 10361 779 -3126 -185 -783 -8608 -9658 2077
308 2077 12411 9065 -2709 -3385 7100 8215 -6396 -19834 -11637 10222 16445 2976 -7443
321 -7443 2669 19274 13206 -11567 -24047 -10311 10041 8720 -7638 -9826 8563 22562 12344
334 12344 -9683 -15392 -2264 7428 -54 -10484 -5395 10129 15269 5173 -5838 -5216 -293 -2772
348 -2772 -8551 -7603 2207 7933 5437 3259 6294 7469 -750 -11981 -11537 -764 4638 -1812 -7292
363 -7292 1976 15706 13362 -4442 -15701 -7407 6283 3810 -10056 -12184 5167 20796 13792
376 13792 -6105 -12146 -565 8121 -940 -15252 -11514 6154 16523 8454 -4222 -4276 3846 3781
390 3781 -5841 -12253 -6686 3431 6914 4923 4700 6346 4844 -1375 -5059 -3905 -2324 -4483 -5673
405 -5673 1022 10510 9865 92 -6483 -1385 5147 289 -10375 -10567 4545 16783 11074 -2515 -5341
420 -5341 4293 8723 -3179 -17277 -14334 1964 11706 4963 -3944 -35 10047 10467 -1244 -11278
434 -11278 -7963 1435 4315 656 -1355 2856 5828 2735 -2672 -5884 -5259 -5339 -4357 924 6476 7753
450 7753 3985 1499 4551 4844 -2728 -12101 -11980 -772 6690 2114 -5003 -1956 9077 11540 -1285
465 -1285 -12455 -9345 3794 9126 -61 -6565 80 10546 10003 -4371 -14139 -9671 -649 753
479 753 -4891 -5703 3383 11250 10133 2490 -2644 -1785 -2359 -4648 -5701 -4384 -1082 -548 -266 2036 1609
496 1609 -2666 -7578 -7524 -542 3117 421 -2341 1270 10451 9898 -2559 -12265 -11599 -2702 -1427 -10689
512 -10689 -13486 -4174 9428 11286 -668 -7372 -2569 5042 3369 -7955 -10988 -2328 6401 5581
526 5581 -4261 -9053 -4822 -2459 -4996 -10166 -10219 -2670 2437 4194 3958 2476 2494 -893 -3838 -4089 -6404
543 -6404 -7447 -7747 -4196 2482 2330 -2869 -6925 -5511 506 -1022 -7778 -8530 -1495 8997 8601 -1076
559 -1076 -6449 -3412 1911 -2489 -14235 -15790 -7137 3491 5199 -2075 -3309 2559 6714 2857 -7935
574 -7935 -11771 -6007 -1412 -194 -4074 -4711 -61 1574 511 -3978 -7147 -5229 -3177 -271 1174
589 1174 -67 15 -776 -10 -321 -5198 -9131 -9346 -4783 1602 1057 -2217 -1796 2281 6207 1698 -7249
606 -7249 -8090 -3109 3356 2267 -4432 -4699 325 4221 -159 -10496 -11865 -6169 664 2479 -1561
621 -1561 1072 8004 11774 9358 74 -5940 -5482 -4975 -5357 -8370 -8870 -3415 1372 5101 3477 247
637 247 670 1610 4107 4111 847 337 1970 4824 5141 -1766 -6640 -7184 -4149 -1230 -3937 -5845 -1634
654 -1634 4973 10365 6704 909 524 3985 6625 3093 -2977 -2025 2429 5389 1533 -6115 -7953 -4803
670 -4803 -1936 -1786 -4651 -1933 5897 11972 13518 8871 4970 4142 2563 149 -5211 -9431 -7101 -2441
686 -2441 2486 3117 299 667 2993 5739 4923 9 -1222 2345 7206 9089 3835 -65 1297 3627
702 3627 3063 -3410 -7510 -4359 2188 5567 3022 -406 2179 6833 8090 3319 -1742 23 4901
717 4901 7169 4996 522 174 2128 2115 -504 -4684 -4629 -1012 3128 5975 5183 4376 5033 6124 5658
734 5658 1159 -4048 -4982 -2137 2955 3809 1018 1070 4446 8021 5932 -1905 -5887 -2873 2224 3158
750 3158 -1854 -2741 2475 7728 7355 250 -3920 -650 4052 4522 47 -2139 2122 6325 5650 -36
766 -36 -4107 -2778 -54 401 -929 -1676 960 3952 5302 4624 1734 76 -90 1241 2747 1898 -255
783 -255 71 2619 4878 1784 -4109 -6752 -3717 828 1007 -2455 -1684 4969 11061 9416 1372 -2207
799 -2207 206 3711 393 -6968 -8243 -1811 4115 2835 -2806 -4445 12 3620 1985 -2010 -2587
814 -2587 2381 6166 6014 2733 -59 67 47 -1643 -4232 -5684 -5099 -2597 328 2512 1760 -63 406
831 406 2221 3602 1222 -2288 -2112 2408 5465 3229 -2935 -4544 -1174 1089 -2397 -8076 -7037 82
847 82 5961 4717 -139 -66 4467 6645 2109 -4600 -5940 -967 2576 1026 -2786 -3041 508 2586
863 2586 288 -3591 -4317 -1770 1342 2609 1979 1274 2116 2758 2612 729 -2820 -4725 -3659 -199 1520
880 1520 -451 -2124 -372 3070 4042 -390 -4693 -3868 1166 4008 743 -2785 -892 4018 5117 -41
896 -41 -5633 -4969 -230 2120 -565 -3599 -1471 3569 5314 1879 -2818 -3434 -658 622 -414 -2154
912 -2154 -1648 1349 3216 2992 100 -2238 -2660 -1176 -59 -611 -2043 -1721 1131 4220 3083 -1204
928 -1204 -3794 -1987 1241 1410 -2122 -3979 -137 5245 5348 -157 -3900 -2269 1750 1722 -2843 -5319
944 -5319 -1872 4284 4976 547 -2731 -1268 2263 1446 -2225 -4323 -1822 2538 3525 1650 -590 -569
960 -569 685 398 -1485 -2225 -2757 -1629 1247 2846 2057 89 -1530 -62 1230 -255 -3418 -4143 -508
977 -508 3949 3959 -527 -3157 -242 3903 2185 -4018 -6394 -1812 4322 4028 -1177 -3953 431 4450
993 4450 2318 -3889 -6284 -1613 3563 3084 -1099 -2337 1563 4252 1700 -2479 -4025 -1968 225
1008 225 103 -692 -211 1331 1609 1435 829 -111 -1665 -2595 -1015 1911 2201 -252 -1297 630 3509
1025 3509 1865 -3684 -5770 -1861 3501 3077 -1701 -3816 1687 6680 4033 -3346 -6310 -775 4074
1040 4074 2168 -3945 -4187 1739 6193 2659 -3590 -4662 129 2883 157 -3069 -2063 2815 4885
1055 4885 1934 -599 -1122 53 -36 -1851 -1472 -359 19 92 993 2722 2552 -250 -2383 -1006 2194
1072 2194 1633 -2079 -3438 1199 5614 3892 -2549 -4778 359 4647 1854 -4103 -4402 2542 7492
1087 7492 3723 -2929 -3905 2021 4844 -145 -5648 -4021 2340 5798 2299 -1995 -908 3254 3983
1102 3983 -267 -2968 -1579 1861 2444 716 669 1205 1303 52 -1062 -228 174 -1257 -1399 1673 4676
1119 4676 3956 401 -1106 1963 4207 1053 -4668 -4478 1170 5058 1926 -3266 -2751 3102 6046 1038
1135 1038 -4836 -3442 3510 6263 1870 -3149 -1113 4076 4606 -795 -4811 -3296 1296 2616 -256
1150 -256 -1526 812 3671 3464 1027 -461 -14 629 139 124 1008 1184 363 -45 1316 1936 163 -3137
1168 -3137 -2473 1378 4060 1484 -1202 80 4429 5751 1056 -4401 -3516 1927 3449 -862 -4531
1183 -4531 -1800 4288 4990 290 -3918 -1824 2859 3766 -333 -2955 -251 3928 3807 44 -2608 -1719
1199 -1719 394 472 -1481 -2033 -521 1577 2334 1836 1398 652 -349 -77 237 213 -1284 -2201 -309 1940
1217 1940 2241 -510 -3017 -1457 1707 2023 -1429 -3338 -380 3948 4017 122 -3562 -1548 1853 1324
1233 1324 -2890 -5391 -2258 2604 3132 -271 -2199 -481 2807 2284 -1025 -3021 -1492 1448 2265 253
1249 253 -1561 -1641 -377 200 -1166 -2307 -2780 -838 1264 1900 1268 -2 -47 1002 1589 -480 -3266
1266 -3266 -3414 -1097 1145 396 -2197 -2371 157 2292 1121 -2335 -3281 -500 2506 1861 -811 -1600
1282 -1600 21 2116 806 -2580 -4274 -2601 176 829 -774 -2073 -766 1695 1993 126 -2317
1297 -2317 -2238 -257 1420 408 -1627 -1930 -227 1728 806 -2330 -3924 -1751 780 1072 -827 -1774
1313 -1774 61 3015 2845 -571 -3145 -2426 46 430 -1715 -2788 -1442 1335 2365 492 -1365 -1763
1329 -1763 -107 1136 -81 -1704 -1362 -13 1499 1268 -267 -1955 -1773 -289 628 -156 -1850 -1485
1345 -1485 761 2956 1622 -1403 -2520 -685 1606 605 -2134 -3204 -227 3043 2484 -1188 -3301
1360 -3301 -479 2352 1535 -2063 -3048 -94 3325 2432 -1032 -2521 -607 1650 104 -2586 -3686 -891
1376 -891 1675 1960 76 -393 454 1283 727 -480 -1177 -1047 -798 -351 446 420 -320 -1349 -260 922
1394 922 750 -1289 -2176 227 2946 2601 -421 -2097 99 3021 1820 -2933 -4337 -1282 3018 2148
1410 2148 -1985 -3139 307 3899 2589 -1969 -3232 539 3856 2558 -1552 -1969 898 3033 915
1425 915 -2600 -3180 -757 1160 420 -1321 -856 1531 2018 1264 -309 -49 392 -437 -652 179 745 98
1443 98 -1050 -566 996 1282 -1031 -3073 -1068 1839 2200 -885 -2108 359 3585 2795 -1597 -3762
1459 -3762 -883 2920 1628 -2634 -3833 98 4401 2440 -2323 -3460 142 3680 1357 -2539 -2607
1474 -2607 1279 3690 1593 -1778 -2039 794 1650 -88 -2278 -1371 853 1721 740 -365 495 763 -96
1491 -96 -930 -379 527 -77 -714 11 1491 2141 -264 -2227 -533 1722 1715 -1534 -2873 -455 3464 2956
1509 2956 -1605 -3382 -231 3228 1544 -2551 -3870 286 3942 2236 -1891 -2876 788 3193 792
1524 792 -3070 -2887 377 2815 852 -1799 -1629 971 1992 214 -1700 -1438 307 799 230 -442 281
1541 281 659 432 -153 46 56 -712 -1370 -435 1178 1335 -278 -1365 157 2040 1224 -1605 -2514 -252
1559 -252 2690 1827 -1453 -2099 785 3360 1309 -2373 -3068 356 2660 1336 -1752 -1846 1152 2893
1575 2893 1347 -1771 -2321 42 1812 564 -1248 -1332 882 1962 1021 -526 -1146 -401 333 310 -521
1592 -521 -622 -36 679 1045 685 -183 -1219 -751 427 649 18 -1063 -872 920 2134 492 -1415 -1717
1610 -1717 -112 1264 57 -1712 -1492 844 2161 1178 -1167 -1901 191 1534 620 -1555 -1751 176
1626 176 1863 1416 -824 -1403 -188 944 735 -1295 -1574 -563 1432 1777 466 -1023 -804 609 923
1643 923 -101 -1691 -1692 419 1566 769 -729 -943 121 1257 539 -1445 -1608 -380 1235 1293 -399
1660 -399 -1118 -328 723 828 -794 -1627 -1016 459 1168 370 -632 -675 205 1010 187 -1159 -1715 -907 1064
1679 1064 1314 139 -1169 -715 833 1136 -626 -2108 -1488 345 1609 279 -1622 -1317 876 1753
1695 1753 96 -2281 -2113 334 1643 297 -1579 -1011 769 2095 575 -1484 -1523 47 1077 312
1711 312 -1425 -1236 135 1248 461 -827 -1017 -322 303 486 203 -572 -134 478 709 383 -585 -1121 -1039
1730 -1039 -13 506 -293 -1163 -551 1030 1987 580 -1504 -1383 375 1704 297 -1837 -1406 967 2082
1747 2082 565 -2020 -2299 270 1585 177 -1812 -1475 971 2264 1083 -1147 -1290 510 1434 28
1763 28 -2054 -1637 147 1401 213 -950 -945 196 761 209 -593 -741 -161 499 934 629 -312 -644 -272
1782 -272 235 266 -352 -1344 -1140 678 1525 223 -950 -1017 715 1629 154 -1513 -1214 1023 2398 626
1800 626 -1320 -1182 506 1855 357 -2052 -1824 658 2021 896 -916 -591 1001 1951 637 -1298
1816 -1298 -1380 303 1287 771 -344 -762 475 1063 690 -132 -705 -349 726 350 -77 -190 -192 169 929
1835 929 687 -296 -1239 -681 652 991 184 -1182 -632 950 1548 146 -1523 -1187 578 1658 319
1852 319 -1331 -849 1089 2010 690 -1550 -1416 523 1529 545 -1102 -1043 986 1737 955 -792 -1260
1869 -1260 177 1198 227 -729 -767 16 1347 1337 454 -488 -344 439 747 334 -483 -320 189 1486 535
1888 535 -598 -858 -338 756 825 -332 -945 -185 1290 1442 262 -1071 -698 802 1245 -56 -1400
1905 -1400 -1213 817 1465 54 -1041 -993 892 1570 355 -1234 -999 469 1513 970 -822 -887 11
1922 11 988 365 -866 -1250 -163 950 928 193 -720 -466 620 1090 -22 -1078 -911 -196 943 739
1940 739 -548 -850 -178 910 509 -640 -1146 -233 1320 1285 -56 -1008 -347 1393 970 -655 -1396 -885
1958 -885 565 1067 22 -933 -550 757 1251 224 -1132 -909 437 1205 361 -518 -633 90 917 398
1976 398 -672 -1206 -594 465 638 -268 -675 -362 685 1181 397 -691 -1202 -84 886 372 -815 -1462
1994 -1462 138 1308 867 -1089 -1473 -245 1060 1067 -341 -1283 -258 1399 1184 -186 -1479 -967 794
2011 794 919 -554 -1471 -583 1150 1357 30 -762 -834 464 1000 -10 -694 -736 161 963 761 -430 -750
2030 -750 -307 220 627 -146 -855 -185 818 1015 366 -471 -712 234 592 635 -1171 -1177 -9 1297 896 -724
2050 -724 -1247 -121 1062 839 -539 -1190 -419 1237 1446 -312 -1124 -639 800 1265 -80 -1473 -784
2067 -784 685 1298 209 -1231 -452 462 869 95 -1252 -990 207 1041 405 -641 -880 108 845 448
2085 448 -458 -839 -259 502 534 -163 -618 -235 -1 705 108 -514 -1050 -470 710 565 -180 -751 -92 878
2105 878 873 -353 -950 -627 773 1082 -57 -1275 -784 841 1484 35 -1613 -904 536 1631 23
2122 23 -1495 -842 883 1390 238 -1362 -1145 419 1401 23 -1388 -980 536 1310 444 -879 -1095
2139 -1095 -91 302 413 -639 -278 -196 498 323 -52 -496 -367 -83 166 186 -59 -607 -382 495 1035 -25
2159 -25 -1102 -795 390 1209 103 -1568 -908 823 1637 76 -1612 -1312 725 1646 235 -1533 -1105
2176 -1105 1275 1796 491 -1660 -1100 706 1493 -85 -1348 -978 517 1146 220 -734 -629 371 796
2193 796 55 -487 -90 -83 192 247 107 395 -23 -66 504 218 -180 -557 -539 455 1109 127 -825 -715 705
2214 705 1132 221 -1276 -650 815 1686 226 -1366 -941 969 1695 113 -1532 -1149 882 1499 179
2231 179 -1437 -710 606 1192 149 -999 -919 450 1179 -147 -753 -673 324 816 379 -508 -557 -99 170
2250 170 522 -175 -272 -292 39 360 403 -360 -762 -202 771 713 -49 -937 -168 1169 1024 -465 -1026 -481 792
2271 792 1299 204 -1096 -532 1078 1163 56 -1072 -830 611 1250 122 -870 -731 467 1256 407 -852
2289 -852 -983 109 1228 283 -734 -962 -35 792 585 -300 -1034 -281 717 575 -175 -694 -592 637 456
2308 456 326 -382 -437 438 682 299 -726 -651 4 798 800 -265 -329 -203 705 708 -93 -809 -266 539 870 436
2330 436 -906 -1061 42 826 480 -844 -887 322 1275 564 -618 -679 182 1324 807 -545 -1111 119
2348 119 1263 941 -569 -1128 60 975 729 -509 -920 15 760 838 -253 -1130 -223 741 589 -157 -838
2367 -838 -410 108 683 336 -596 -230 -95 403 248 -179 -531 -247 94 500 317 -745 -902 272 651
2386 651 305 -509 -957 92 1089 646 -651 -971 -24 1230 653 -755 -1033 -178 953 959 -693 -1411 -327
2405 -327 1102 778 -588 -1255 -203 873 552 -245 -1194 -197 685 694 -363 -625 -371 210 230 -162 -253 -167
2425 -167 -261 254 130 -133 -490 -441 28 573 349 -532 -411 130 569 335 -568 -993 -185 987 673 -527
2445 -527 -1083 -95 967 637 -360 -1083 -279 996 689 -683 -1210 -352 1001 730 -560 -1126 -164 806
2463 806 650 -615 -914 -379 744 754 -222 -493 -158 127 474 -162 -652 -241 301 572 5 -326 -338 -13
2483 -13 257 235 5 -268 -559 94 707 437 -563 -533 -31 390 755 -446 -1023 -311 764 567 -375 -874
2503 -874 32 1125 699 -452 -953 -367 734 614 -335 -1161 -43 851 1109 -313 -936 -399 861 581
2521 581 -295 -851 -477 365 691 -167 -579 -290 9 212 74 -222 -551 151 580 506 -209 -342 -315 95 425
2542 425 8 -404 -475 257 546 515 -722 -769 -54 792 599 -389 -892 95 892 553 -250 -705 -402 637
2562 637 613 -569 -997 -417 659 392 -285 -845 -155 616 681 34 -596 -464 344 794 20 -775 -357 -5
2582 -5 727 19 -314 -276 157 596 707 -384 -527 -76 672 291 51 -326 -247 190 680 278 -566 -473 186
2603 186 315 202 -326 -624 -14 1019 620 -310 -403 -280 343 393 -472 -1088 -448 614 896 172 -816 -422
2623 -422 730 666 76 -654 -502 183 476 5 -517 -548 229 1090 152 -743 -554 179 724 374 -376 -867
2643 -867 124 587 415 -207 -527 -230 333 557 -13 -484 -359 251 392 303 -226 -398 343 651 507 -239
2663 -239 -482 -183 321 468 -45 -628 -496 365 503 -44 -907 -301 572 705 100 -499 -589 43 671 78
2683 78 -541 -744 127 566 -39 -632 -584 113 409 375 -438 -566 -170 454 320 -98 -642 -212 614 588 -2
2704 -2 -521 -346 69 566 277 -542 -435 -40 423 282 -448 -542 231 694 463 -416 -411 -181 508 719 -82 -726
2726 -726 -408 324 515 -137 -703 -237 388 677 293 -471 -568 321 594 341 -715 -586 114 608 215 -403
2746 -403 -701 -101 865 567 -277 -404 -218 323 471 -136 -529 -231 135 357 149 -725 -308 22 496 -64
2766 -64 -579 -555 192 551 429 -142 -640 -171 133 450 -32 -521 -206 136 509 -106 -727 -263 349 746 63
2787 63 -398 -624 -52 523 53 -554 -619 -7 803 358 -275 -494 -34 474 450 -369 -621 -150 404 357 -310
2808 -310 -729 29 420 333 -211 -412 -370 180 516 60 -228 -393 33 343 75 -196 -245 -323 570 395 108
2829 108 -277 -185 299 716 63 -626 -286 256 799 -12 -503 -341 107 529 258 -558 -682 233 618 290
2849 290 -440 -767 67 353 395 -311 -353 -56 508 -9 -4 -444 -119 346 558 28 -457 -253 196 155 51 -335
2871 -335 -286 -89 361 203 -292 -522 3 564 243 -161 -705 -526 426 383 50 -261 -125 266 492 244 -647
2892 -647 -414 25 796 100 -576 -483 204 517 153 -476 -372 117 556 229 -257 -120 241 431 558 -69
2912 -69 -440 42 287 253 62 -291 -324 -65 212 -166 -311 -455 31 615 359 -291 -597 -312 386 300 -321
2933 -321 -630 -315 556 486 46 -644 -404 387 407 29 -333 -370 182 745 101 -471 -364 189 766 14 -290
2954 -290 -510 -72 769 53 -27 -523 -49 440 -3 -543 -576 -53 469 300 -167 -523 -563 250 382 -5 -259
2975 -259 -163 242 483 134 -151 -280 -289 247 422 -223 -466 -179 375 689 -28 -594 -326 125 455 317 -427
2996 -427 -56 302 910 -114 -355 -748 176 685 13 -722 -288 -24 507 176 -337 -482 -30 246 91 -234
3016 -234 -425 -62 379 229 -347 -492 -120 442 259 35 -611 -224 154 356 27 -242 -465 53 634 64
3036 64 -237 -203 -123 426 171 -355 -297 -423 335 408 25 -490 -108 61 555 219 -714 25 178 454 496 -667
3058 -667 -314 142 498 291 -411 -479 322 807 123 -611 -469 -211 634 265 -427 -347 47 313 196 86 -387
3079 -387 -237 93 114 -134 -271 -255 15 318 224 27 -250 137 406 -44 73 -548 -18 -93 417 51 -283
3100 -283 -196 133 306 153 -538 -451 48 516 312 -191 -302 231 579 240 -548 -409 126 571 419 -411 -429
3121 -429 9 421 350 -322 -357 -154 333 515 -199 -191 -218 393 453 -121 -403 46 52 468 72 -444 -354 36 58
3144 58 139 -331 -535 69 460 376 -135 -376 -341 -228 313 -50 -266 -238 285 542 35 -424 -544 -151 393 316
3166 316 -129 -266 -241 570 325 -257 -701 -47 371 134 -29 -565 -63 379 491 -113 -363 -255 613 128
3186 128 123 -424 -456 187 278 7 -340 3 3 5 148 63 -305 -136 13 253 -53 -182 -276 364 513 34 -135
3209 -135 -272 319 648 273 -333 -464 -28 665 495 -157 -163 -54 594 395 -253 -412 -151 515 458 -126 -687
3230 -687 151 277 317 -6 -293 -186 556 226 -110 -364 -205 270 234 -306 -319 25 54 103 27 -454 -461 -15 268
3253 268 210 -331 -596 154 109 200 -359 -388 -44 348 189 265 -238 -124 214 428 288 -83 -251 69 398 261
3275 261 -264 -406 94 179 371 -236 -811 71 276 309 -157 -336 -158 279 837 -224 -514 -79 406 93
3295 93 264 -172 -122 290 429 26 -202 -270 42 70 292 -242 -499 -29 432 317 -126 -498 -150 -4 197
3316 197 -4 -274 -74 257 244 162 -496 -278 148 179 90 -550 -275 89 584 -8 -38 -475 -200 554 270 -107
3338 -107 -163 -68 251 239 -229 -463 0 176 527 13 -286 -105 231 166 46 -133 -452 215 376 172 -203
3359 -203 -81 -61 630 80 -245 -206 41 276 119 -350 -549 -173 400 361 -304 -218 -294 -34 410 378 -222 -601
3381 -601 10 399 122 -172 -484 -14 541 475 -155 -271 18 276 141 -68 -486 -494 234 445 174 -221 -233
3402 -233 -13 310 311 -379 -218 4 129 22 -373 -177 16 231 290 -117 -387 77 255 351 94 -284 -440
3423 -440 327 80 -18 -361 -91 39 489 -80 -144 9 -97 247 430 -127 -435 -45 303 68 -9 -72 132
3444 132 466 32 281 -455 69 441 35 -116 -163 -18 77 238 -230 -439 7 98 583 118 -225 -274 -256 333
3466 333 57 -194 -257 -32 256 117 -307 -79 -299 199 236 320 -222 -207 248 345 79 -366 -280 181 517 19
3488 19 -109 -212 -335 206 215 -152 -172 -66 319 258 -393 -219 -141 211 242 -92 -145 -63 -77 158 16 -331 -262 -36
3512 -36 337 110 -284 -88 73 193 93 -198 -251 -111 167 177 -127 -84 136 78 137 -386 -221 -127 23 263
3534 263 122 -19 -72 227 445 328 -138 -49 -85 460 182 -193 -224 105 531 125 -273 -142 -118 242 204 -270
3556 -270 -309 -55 11 199 26 -288 -176 112 206 -14 -263 -120 -11 38 -148 -202 -100 -26 130 -51 -204 141
3578 141 149 24 -90 -139 -95 -115 15 84 109 -321 -261 88 99 8 -107 -21 -108 171 79 -93 -599 105 42 315 -197
3603 -197 -443 246 376 248 -48 -232 -89 581 130 -263 -105 -135 270 163 7 -325 -179 175 435 81
3623 81 -269 -5 108 68 179 119 73 38 1 627 110 -194 -121 -38 65 83 -20 -108 -212 204 26 -191 -162 -89
3647 -89 85 78 -233 -380 -54 377 250 -130 -174 -92 458 273 -202 -392 -217 354 141 -221 -300 -57 272 -39
3669 -39 -208 33 -117 220 442 186 -163 -111 84 167 187 13 180 130 220 55 83 -41 -412 -83 -66 179 -167
3692 -167 -477 -19 227 306 -221 -173 73 152 -66 -198 -88 42 308 -45 -229 -344 -167 -68 202 25 -60 -259
3714 -259 95 235 -25 -164 -232 233 267 -253 -55 -161 -40 166 -52 -132 -564 17 9 19 18 -154 169 29 39
3737 39 -158 -108 -16 22 86 227 -68 26 -65 243 -151 122 -235 27 76 214 -59 -305 5 50 335 26 -419
3760 -419 56 24 12 -133 -70 -251 284 464 -83 -321 145 79 212 56 -94 -381 85 267 86 96 -278 339
3782 339 119 85 -237 -77 68 453 -130 113 -173 336 215 -104 189 -153 -84 -134 45 -224 -226 -217 98 165 198
3805 198 -212 27 -108 -94 58 23 -480 29 149 165 46 -218 77 365 177 -42 -136 -107 -8 134 54 -147
3827 -147 -389 427 272 -21 -221 -68 28 362 -80 -144 -203 175 217 76 -29 -263 -222 43 319 -185 -260 90
3849 90 141 90 -278 190 -81 -8 -57 -245 -373 28 152 -13 47 -9 39 -156 -6 220 -39 -403 48 75 31
3872 31 -262 119 66 -150 104 199 -72 -305 113 266 -301 -93 -316 152 407 193 -254 -9 193 26 -263
3893 -263 25 -312 -11 320 118 -182 124 7 155 -64 -247 -109 88 64 -27 -96 -169 54 34 26 -38 -23 -33
3916 -33 -34 445 63 -128 22 -110 -33 -35 -292 -393 -18 207 237 -216 77 -50 83 140 -27 -21 -51 91 114 -225
3940 -225 -58 -231 198 148 -128 -312 -232 156 -4 238 1 -27 -51 326 37 66 -55 266 97 -70 -160 29
3962 29 -68 -39 108 -49 66 39 -134 133 210 -105 -268 -211 131 198 -12 -142 203 75 272 -67 -275 -206 -124
3985 -124 -121 17 -47 -133 -175 167 28 -236 97 169 80 -127 -141 -294 221 346 -117 -259 12 -4 195 142 97 -266
4009 -266 -456 -155 -158 17 -68 96 2 363 88 85 -12 98 1 69 -118 -153 64 3 -124 82 -129 -15 160 -124
4033 -124 -347 -239 -207 -177 273 -114 -135 -47 -72 287 -81 -150 -513 247 52 348 -76 -198 313 192 100 38 -126
4056 -126 104 -166 197 -35 -297 23 266 156 38 -146 -70 -37 187 31 -183 124 187 140 79 -216 75 -72
4078 -72 88 -178 -394 -221 -90 -88 -166 -268 101 -12 220 -59 224 -5 -99 -183 201 169 -190 -103 -334 163 -64
4101 -64 -47 -165 77 206 310 330 14 -118 121 283 -69 206 241 182 -10 -231 -59 -34 59 85 20 36 -208
4124 -208 23 185 -95 -256 -135 171 365 -73 -168 -126 26 122 82 96 -400 218 -115 -8 -40 -47 -74 200 -13
4147 -13 -17 -68 -328 -25 320 93 -45 -464 12 62 -87 -114 33 90 103 212 -177 -221 190 268 78 -263 -8
4170 -8 29 95 -150 -105 75 -112 274 231 -19 -134 70 -18 125 -181 59 -80 -21 -151 230 87 -118 -14 82
4193 82 -115 39 -187 -106 175 -18 75 258 -205 -165 78 166 -29 134 75 -80 327 -126 -27 -59 157 160 -118
4216 -118 -165 23 244 -111 122 -334 -178 196 252 -111 -137 -3 237 -37 128 53 -362 -44 169 -147 123
4237 123 -395 263 22 -123 -57 81 133 285 -130 70 162 -69 -157 -152 -11 -16 -236 90 120 -185 108 -145 112
4260 112 -93 43 133 -37 43 244 -276 56 64 -16 96 -73 -193 -159 -87 32 47 72 -69 -36 -26 17 -221 -71
4284 -71 -87 296 68 96 36 -15 -91 152 -136 77 -30 119 121 -99 -70 -127 -265 96 38 -179 -194 -131 215 -5
4308 -5 -63 -287 -68 34 -31 -92 102 -47 -16 -5 -117 164 -30 -25 68 142 246 97 92 40 178 -232 70 -6 29
4333 29 197 -45 -179 -165 286 161 -116 -151 90 154 154 248 -375 -64 -93 22 23 -109 86 -151 -81 14 111 -57
4357 -57 -119 237 61 -123 -131 15 -48 -56 -211 140 -188 -110 202 -103 -175 13 484 -95 63 38 -146 136 -16
4380 -16 165 -170 -99 -64 245 86 125 132 16 259 -75 -171 5 142 -18 36 78 -119 -363 56 -84 102 -64
4403 -64 -209 154 242 49 -217 -31 76 169 41 30 -93 -146 -59 -271 90 146 -13 224 212 -101 49 -144 -39
4426 -39 28 166 46 208 189 8 274 47 6 128 125 -22 -52 69 -246 -14 -123 -77 -204 39 15 -36 79
4449 79 -182 111 20 -3 -37 -80 55 -80 -52 -10 350 130 117 -311 312 22 180 -22 90 -168 -239 269 -284
4472 -284 -155 -226 80 -224 -64 156 447 -16 -10 77 -276 -118 176 111 -99 -20 155 131 -239 16 -10 58 -183
4495 -183 -348 341 -250 -287 -71 4 -353 166 24 -115 -167 -254 -269 181 156 4 -143 -200 35 -73 -357 -135
4517 -135 -94 170 71 147 43 26 236 -121 165 -51 -64 -197 103 292 167 264 71 170 162 96 -130 -9 -322
4540 -322 -96 169 -118 180 -13 107 81 -8 -264 4 61 23 -19 119 -88 -132 121 -11 -51 115 60 -125 -166
4563 -166 -151 9 97 -39 -133 -59 70 -193 -113 -86 -129 -338 147 158 91 -19 -82 -75 271 -311 117 -35 89 216
4587 216 -96 2 135 87 -348 -41 204 26 -57 151 12 75 -98 62 -72 135 -107 194 -80 121 -47
4608 -47 -241 -179 167 -117 -139 -25 -126 62 190 -135 25 -334 72 -102 -73 28 -134 13 106 22 165 -31
4630 -31 58 -150 151 55 -84 56 132 171 -31 80 87 -16 90 266 -105 -72 209 14 5 -44 118 178 -62 -125
4654 -125 -44 -205 -147 -50 -226 294 58 -191 152 263 85 38 -256 189 -84 124 -35 185 -150 45 171
4675 171 -124 -146 -227 305 186 157 88 -93 247 -89 -100 -139 84 284 -1 -78 132 357 -34 -273 -122 178
4697 178 -93 204 -24 -68 15 -18 -83 -117 129 257 13 -100 -147 129 -260 291 62 -111 77 89 265 -194
4719 -194 44 -251 -147 -123 -76 47 -51 89 22 95 45 -15 -81 68 -105 64 90 -116 41 325 126 -364 258
4742 258 -153 21 -11 -233 -222 -45 -107 -349 -284 -175 -96 -141 24 -63 -87 228 68 -50 -117 171 -148 -42 -52
4765 -52 -239 -5 -33 84 43 85 -138 87 130 213 64 -56 -105 -221 -124 140 -199 -49 45 62 103 288 -80 54
4789 54 -95 -113 -143 54 -315 30 -203 -133 65 306 154 -69 -344 133 111 -51 81 159 -27 147 62 90 -130
4812 -130 -42 41 -72 68 50 36 131 53 -90 -234 -9 -8 32 77 -39 3 -159 -1 123 -110 -313 -63 -245 -256
4836 -256 65 -17 -37 211 -98 147 313 -119 85 -1 72 366 -198 143 16 157 -61 -56 23 -47 -11 70 -41
4859 -41 93 88 96 22 137 -36 -368 92 -49 146 -217 161 -201 -180 -13 147 -51 35 96 -316 -178 93 -37
4882 -37 389 313 208 -61 177 -109 121 -125 -365 -75 -313 -42 418 102 144 260 370 220 -224 183 -177
4903 -177 20 82 -195 226 36 -190 184 21 20 -75 240 -326 -81 90 220 152 -249 -170 -13 42 -102 9
4925 9 -19 176 136 184 204 -57 -48 -73 53 63 -2 -149 -89 51 148 -69 -49 -116 113 32 141 -229 -27 39 115 -12
4951 -12 -55 60 -167 -68 -222 165 -214 -129 14 -12 23 40 -205 -162 -14 142 -11 -47 -73 162 259 -21 68 188
4975 188 -270 192 100 -358 -35 -160 54 -275 -145 -113 7 -8 -60 -32 -135 277 131 74 -121 37 -3 100
4997 100 105 163 -8 163 -150 -29 -108 107 -18 -77 123 -77 -69 -75 32 -183 9 122 127 136 9 85 62 -17 63 146
5023 146 28 -10 -11 -99 -144 112 51 45 245 -5 12 41 -39 -103 -101 137 114 58 55 318 -159 -117 12 75 -88 30 178
5050 178 38 54 -93 143 -61 -15 -66 -89 -120 101 -148 27 34 186 -121 66 102 25 257 -142 -99 93 -190
5073 -190 84 -104 -160 135 162 -30 256 -124 12 -30 -165 187 -155 -60 -222 18 -43 309 -108 38 -44 111
5095 111 5 269 94 40 -182 -75 -11 -183 -20 45 214 42 17 -197 14 -37 232 -289 36 38 98 105 -152
5118 -152 -43 31 -19 82 108 -61 132 219 -20 212 -254 -141 -204 -11 6 77 -423 -172 110 -154 -171 -299 91
5141 91 96 117 -169 -38 160 -56 31 -100 -90 -240 -177 -164 41 -49 26 -207 38 249 -82 69 78 -13 316 -55
5165 -55 -40 -28 -381 -227 -61 -201 -56 -25 237 60 88 -49 290 305 29 52 -77 149 151 -279 22 -159 87
5188 87 239 42 122 58 31 159 14 218 -202 28 461 7 65 -128 92 -150 60 93 -53 9 80 422 -282
5211 -282 41 -7 -143 234 -66 112 30 -281 119 -139 71 14 2 -7 -79 -210 37 -203 9 141 -65 22 361
5234 361 335 120 115 14 127 -185 69 -274 90 -96 -15 62 -44 -103 -30 82 120 -144 135 218 56 283 -80
5257 -80 167 -110 -291 93 -267 -33 -85 29 125 -66 -219 201 54 -80 43 -45 -191 -44 -69 89 53 122
5279 122 -374 131 449 310 -200 -107 197 81 -81 -106 -234 -21 -229 -32 81 -198 -127 67 68 -54 -97 17
5301 17 -198 -20 5 -23 -41 -132 48 -317 21 -144 -68 -235 -24 81 -242 36 -25 -196 99 -13 51 -73 201
5324 201 243 -96 -108 25 60 -200 122 58 17 -86 79 16 125 -29 42 153 168 -193 -296 -57 -31 -223 -249
5347 -249 -11 60 2 368 107 20 15 220 154 128 -47 -76 318 61 -65 -154 237 -38 -151 99 -146 -48 -151
5370 -151 -10 -121 201 -96 87 148 183 -128 -94 -238 -109 -167 -61 -31 120 61 -25 -34 -13 184 127 -156 -17 8
5394 8 -139 27 -144 -25 20 51 -130 8 -109 -65 -131 30 155 152 -117 -70 18 21 170 -63 -174 -121 83 -32
5418 -32 47 -218 44 141 268 255 -165 -293 44 -108 -295 67 26 251 153 23 101 -115 -50 -78 -236 -165 -276
5441 -276 174 116 -48 -3 240 184 -83 53 274 96 -287 211 44 13 44 -109 -43 -272 -210 -85 -47 -115 7
5464 7 57 115 -124 181 48 -39 6 139 -116 -208 -227 116 -207 -65 30 210 117 -298 -324 121 114 -157 -575 -69
5488 -69 92 16 -157 -123 -46 -33 -21 134 -109 -37 -120 -155 203 -14 -276 -329 53 71 4 -170 74 16 205 -131
5512 -131 -370 -59 80 -161 127 74 -13 -10 89 -310 -116 -29 116 155 191 276 -408 70 -159 -167 22 36 -92 -221
5536 -221 87 107 -146 -110 -340 402 -154 -144 -150 3 116 -20 -188 -249 -196 131 56 -57 27 -157 328 -180 -210
5559 -210 52 -170 237 -116 -67 -119 196 385 12 -173 60 -101 -281 -59 125 -89 -167 -3 72 134 -22 -65
5581 -65 -184 -13 -106 -112 -128 142 -82 95 -21 -47 65 -340 183 -44 -157 -49 167 66 -102 10 -9 23 134
5604 134 -114 -179 -220 91 -63 43 88 40 103 -49 37 -93 33 73 -95 115 96 -161 -193 49 248 -216 -103
5627 -103 57 -11 218 -45 31 157 -121 -34 160 286 -168 149 -9 -27 151 -278 53 -53 86 -109 -5
5648 -5 152 206 197 -28 5 -153 -29 162 31 8 -115 119 -23 83 -95 -145 21 -169 378 116 -115 -19 46
5671 46 94 183 -82 -66 -209 240 -179 164 71 -209 274 331 156 -600 197 71 49 -129 -96 103 42 -114 -147
5694 -147 -259 -86 116 176 204 -33 -204 -179 -55 -92 -21 128 -369 185 -15 12 -94 26 131 -123 -25 32 283
5717 283 100 2 22 -264 64 -248 -121 -93 -127 -348 -45 108 -101 36 -197 -78 -197 14 -229 -103 -98 -71
5739 -71 -128 -291 38 -16 -91 -7 207 -170 70 68 21 -168 -50 29 69 254 -75 -201 146 16 194 109 -154 -85
5763 -85 190 65 308 87 -154 87 234 271 -298 4 307 6 37 78 -119 -3 -51 268 -165 162 -33 -2
5785 -2 90 -40 -126 37 167 185 45 -36 78 -17 17 -14 -328 50 43 86 -40 29 -139 25 -360 218 71 -312
5809 -312 18 155 -160 105 161 -79 -108 -97 33 -1 -200 -160 415 234 -126 -150 -102 -206 -42 -112 -105 -139 -28 281
5833 281 -35 -5 -195 69 -6 50 -61 -57 106 6 95 59 18 -242 19 -6 -63 -260 135 39 221 103 -139 6
5857 6 124 -251 -260 240 -40 -27 133 -16 -97 -140 -124 20 -121 -104 -24 -78 -292 58 -121 -329 -114 17 18 144
5881 144 -164 -143 -6 231 -4 -100 -137 85 -133 -112 198 140 -39 133 -233 41 320 42 113 224 -218 191
5903 191 -43 29 264 -229 176 112 61 -340 221 -26 120 -80 248 188 -28 14 -393 138 51 -85 -55 -103 275
5926 275 179 -312 110 -224 -86 141 -47 -140 125 188 -10 -38 -76 -15 117 288 30 -63 -132 -334 204 14 -95
5949 -95 -139 101 99 105 22 49 -25 6 4 -178 -220 -53 424 20 -70 15 52 -81 241 172 -23 197 429 -52 52 -126
5975 -126 11 125 98 -68 -113 -353 -156 199 229 67 26 13 -12 155 104 71 -233 134 93 -88 -119 170 55
5998 55 -58 -35 -321 132 -438 -3 118 40 -248 -125 99 140 3 -37 -99 9 -30 -42 -82 -283 241 313 69
6021 69 -403 -179 183 228 92 -262 -246 -183 92 -40 65 -76 88 -16 240 58 53 -205 -52 139 -476 -83
6043 -83 -110 209 -74 -134 -177 115 -150 -26 29 -18 127 35 -69 -105 -86 23 -134 -206 56 102 -115 7 57 213
6067 213 89 -151 -105 -1 22 -73 118 161 69 309 -150 -11 -262 97 63 34 -118 157 75 105 119 -78 -122 -36
6091 -36 307 -19 -183 -73 -6 175 -32 194 102 158 10 133 119 14 108 -213 -99 321 34 -254 -168 271
6113 271 356 -30 45 143 -113 -101 140 -24 35 86 -67 112 -206 76 425 -199 -166 -10 -174 167 231 -38 10
6136 10 65 168 170 -24 82 -77 -133 336 -88 74 77 -85 71 243 192 -38 -2 72 21 -93 64 -16 107 84
6160 84 84 -268 -176 140 149 99 -41 1 -30 -36 137 18 -120 -148 80 425 -30 -282 -305 130 88 -247 -34 59 -4
6185 -4 109 34 -64 -63 57 -55 23 19 27 -58 136 22 -49 -69 -139 305 -301 -146 -54 -29 -86 -51 -129 -212 0 26 -38 -65
6213 -65 -99 -58 -244 117 113 -215 14 61 -172 -1 159 -80 -147 60 -152 -127 -126 -28 313 309 171 -28 24 -121 89
6238 89 -19 -153 -168 -39 -163 -194 -205 -48 52 204 33 -90 -63 -72 45 -100 -133 -163 -105 167 15 201 29
6261 29 21 113 168 251 254 -245 -87 240 -134 -217 -124 -69 -23 83 94 106 -150 85 -162 19 -67 76 -69 191 190 -50
6287 -50 -97 -158 234 114 -143 -109 65 131 307 52 102 52 254 -28 44 -62 -25 -152 59 9 -30 -1 -8 29 6
6312 6 5 -8 379 -113 160 -87 -60 11 -394 12 -75 14 33 180 -140 121 -205 183 80 286 -203 -35 -73 -57
6336 -57 22 58 -148 -97 126 -193 -108 -310 44 -52 190 90 -264 -262 -353 -59 90 68 47 -242 -55 220 -45 -295
6360 -295 -49 151 -44 78 187 122 -61 -94 36 -163 -205 23 19 -53 -196 30 284 375 46 -1 53 -335 114
6383 114 142 198 -114 143 215 -181 -235 -96 -51 159 223 113 -151 14 -187 201 41 30 40 -64 183 74 -241
6406 -241 -77 -12 -163 196 -302 -205 -85 -49 166 -124 -13 -262 33 256 134 -144 -249 177 5 92 -174
6427 -174 -286 59 168 -109 -3 -106 -15 34 418 51 13 269 32 278 -6 -89 98 96 37 -49 -159 -60 -54 -220
6451 -220 -58 -300 -258 185 267 -69 -155 53 108 259 107 -189 -209 28 -79 31 -39 -147 3 253 3 -63
6473 -63 31 -141 283 -36 182 -311 150 -99 81 254 -341 -57 45 108 -48 -223 -139 -21 -43 -164 -220 -24
6495 -24 45 -34 -148 -57 -157 -112 67 134 -153 15 -105 5 178 -52 300 49 -172 114 171 121 10 -4 182
6518 182 216 -13 -19 -238 3 150 -167 -18 -83 -23 1 12 103 97 313 94 149 -301 -35 13 261 -16 25 -246
6542 -246 -215 64 248 -280 -121 156 -170 93 -157 -23 -52 83 229 -21 -327 -287 -22 -23 -3 -135 -203 31
6564 31 241 191 23 -231 20 87 87 -95 -122 42 -227 256 -88 -119 -34 54 128 32 -425 -64 7 70 43 -151 6
6589 6 86 138 -151 -56 -133 -148 -45 14 183 -236 -206 284 197 -89 -497 182 79 134 81 -182 230 63 148 144 -248
6614 -248 -18 -144 239 287 72 -111 10 -157 -36 -41 79 -63 9 111 -47 210 -128 -101 362 -50 -82 77
6636 77 -131 -55 -3 -196 176 -54 -232 363 -61 -71 61 403 118 -143 -245 98 -19 166 0 -265 -218 -249
6658 -249 263 -187 -406 -42 45 -188 12 -443 -244 -89 135 -13 162 17 -142 17 92 231 122 60 25
6679 25 200 -47 -286 -302 -147 21 19 -152 -30 -31 -203 -40 -190 62 197 155 104 74 -120 257 73 -33 -166
6702 -166 -11 -65 218 135 -44 -18 85 -144 167 -219 -107 -81 -22 137 -168 -120 -188 -77 -238 93 -204 -48
6724 -48 -32 256 -185 39 -103 -100 165 81 123 -157 -36 -49 126 139 -60 289 176 218 119 200 -38 131 22 100
6748 100 -54 -34 6 81 41 -183 56 25 -17 35 -121 48 171 137 -2 -10 -131 -160 201 0 25 -23 -189 -254 75
6773 75 -1 -102 -105 -358 138 136 -230 -80 -125 318 6 -93 -31 -19 171 199 -152 74 -81 408 212 282 -139 13
6797 13 219 265 173 -195 10 53 302 300 -248 -153 -22 123 117 -40 -372 -22 -78 -89 -135 -189 -122 -140 74 -176 143
6822 143 -124 223 -83 -108 59 -292 -30 -48 82 -48 -106 53 -262 -214 57 -231 183 261 188 -45 -85 -159 222
6845 222 306 -32 12 -106 198 216 176 -223 24 19 281 172 253 -295 205 40 349 -254 -280 80 57 -13 82 -79
6869 -79 -106 50 137 -295 -237 -191 -77 331 22 -95 -148 -169 467 -40 13 -57 -243 -75 42 127 2 -115 -121 106
6893 106 -26 -54 -132 299 124 242 -257 42 -23 205 -111 47 -173 45 -42 -119 201 -146 199 202 243 -449 -64
6916 -64 102 112 188 -245 -41 365 104 212 176 -170 10 -98 94 130 42 55 36 -75 -173 -18 -3 272 -143
6939 -143 94 116 -1 216 289 246 -51 -361 -129 267 123 -43 -181 210 -56 293 -81 -154 -175 325 127 63
6961 63 -234 -175 189 18 -84 -9 123 193 -50 102 -235 -67 155 -101 -166 -176 40 -57 -5 188 162 -168 -101
6984 -101 337 22 24 -128 -74 -175 221 -103 138 -328 -14 69 58 -19 237 115 92 19 -146 -302 29 141 -33
7007 -33 305 -44 -205 68 89 93 -257 -205 302 155 283 -116 130 -97 324 182 -131 -80 152 94 153 120 162
7030 162 102 115 124 30 62 -9 58 -85 54 -37 -147 83 20 178 -291 88 -157 383 -60 -8 73 155 25 -1 113
7055 113 -325 -94 40 341 16 -193 -127 -172 277 370 -15 -356 -196 -79 -59 -14 -164 54 183 -80 294 -174
7077 -174 -226 281 215 47 -327 -59 -99 46 196 -188 -202 264 -108 -36 -195 246 42 -96 -86 177 -166 -11
7099 -11 51 -47 -139 -29 -54 24 -33 11 -284 -1 116 267 182 -126 -111 -6 163 -87 -130 130 256 43 62 -245
7123 -245 -342 -149 282 346 204 -267 73 282 236 -99 -64 -117 43 -144 20 -325 -155 294 185 44 179 45
7145 45 65 388 -79 -1 -158 -145 137 318 10 -390 158 55 13 193 -381 -118 -39 4 166 -323 -427 -62
7167 -62 74 -122 -118 -168 -8 27 -138 -245 -35 99 251 238 -351 -35 -285 41 225 29 -40 -5 -138 54 -132
7190 -132 16 -389 -73 -132 -34 -131 141 384 13 137 -258 -105 238 -287 151 158 -178 49 -72 61 79 26
7212 26 -133 -129 67 327 -50 -130 107 244 7 -32 -153 -31 -41 53 -117 -141 106 102 164 -17 -220 100 182 25
7236 25 -77 -137 -66 348 151 -39 -58 -333 210 -35 -122 -245 232 190 201 87 -268 -163 -75 -53 95 301 -178
7259 -178 -57 112 179 287 -190 142 -26 -248 8 20 -82 185 94 -156 -10 -132 -119 21 -75 -28 -377 95
7281 95 -12 -13 -105 -77 -100 41 -258 -113 176 -282 376 182 252 -51 137 75 141 -103 -151 132 71 133 85 -14 -118
7306 -118 213 52 290 -63 32 -130 -71 152 -190 -170 195 193 75 -77 32 -221 68 293 27 92 247 -91
7328 -91 113 74 -379 -64 -9 217 -34 -268 -89 96 67 -193 -102 -220 185 193 299 227 -51 41 92 78 -58 -99
7352 -99 78 -65 105 45 40 -43 -203 39 -31 39 18 -161 460 -135 7 110 29 141 -90 -1 34 64 134 110 58
7377 58 -142 -154 127 -70 -119 -33 -206 -260 62 -162 -7 -40 -155 132 -130 -138 -107 66 222 127 -35 -20 14 32
7401 32 0 -122 23 -60 -10 -48 393 -75 78 61 -24 330 -153 -30 315 173 70 -40 -183 56 85 -91 -160
7424 -160 -141 3 -38 59 -229 -316 216 -92 254 -222 -43 -114 129 -106 139 -296 10 45 37 133 -94 -176 -64
7447 -64 193 -10 -59 -97 -61 52 -86 -115 -272 -82 66 272 -118 102 -82 154 154 -247 -43 -259 49 13 -96
7470 -96 52 -80 130 -60 121 -103 -120 93 -162 231 40 83 -56 25 316 101 -210 -29 -54 75 25 89
7492 89 -2 148 -31 247 -129 -138 63 138 122 1 77 -34 46 45 -85 -141 80 -138 255 -154 87 7 9 -52 -3
7517 -3 43 -435 210 151 -185 4 111 3 38 -124 -186 36 318 20 32 -62 -124 100 360 427 -221 -85 37
7540 37 31 16 178 -38 -117 -58 -89 5 -39 38 -133 -72 -65 -278 -74 33 140 178 -136 -112 -107 91 279 -22 -194 -77
7566 -77 -24 124 -320 -190 27 37 70 -41 92 27 -111 -51 101 -212 -15 215 157 106 -112 120 -80 48 -78
7589 -78 35 -75 -9 7 170 -153 33 57 220 128 27 218 -81 -249 255 -82 -184 -141 33 228 -219 -160
7611 -160 -58 -74 227 -163 124 -28 -297 57 -17 146 -281 75 -7 213 129 -242 1 94 193 -107 -224 -266
7633 -266 -48 32 3 -143 -38 -33 108 112 113 -297 57 193 59 -12 242 -94 14 117 -170 130 129 -169 104 -186
7657 -186 132 -54 -24 34 66 210 -171 -39 -6 210 -126 -235 225 -22 -84 -196 245 110 -20 186 -137 -17
7679 -17 159 57 25 103 42 14 156 59 -107 -130 -240 -3 -206 24 105 18 31 280 29 34 -54 -201 -220 24 104
7704 104 -192 -71 -297 -97 -29 -186 -44 -238 237 345 -50 -106 -225 -142 85 128 -114 41 61 268 7 -216
7726 -216 18 106 37 128 -14 47 60 275 232 -82 -156 129 49 -29 -103 -67 -49 20 -161 -24 -99 -11 86 -134 -46 -231
7752 -231 154 -140 26 25 99 -119 11 6 -73 -126 -8 -267 -211 46 -98 78 112 5 380 131 -165 -74 115
7775 115 168 -67 45 60 43 -21 65 -26 -33 -76 108 95 -196 -169 81 212 216 -18 -91 -9 -26 -149 368 -70 168
7800 168 85 205 -214 -47 39 104 24 -211 13 -66 224 69 160 -83 -66 76 55 58 -126 -134 165 85 214 45
7824 45 -71 263 180 45 -150 -280 13 33 124 195 -82 -57 54 100 358 -136 -319 -54 32 481 128 -123 266
7847 266 395 37 -480 -176 146 9 182 -119 -150 -284 74 60 -33 -222 -192 144 85 -167 -112 28 -203 150
7869 150 158 -114 -19 -222 173 32 78 -141 -175 -87 33 -179 159 73 169 250 -92 -67 -62 43 84 13 -83 -85 55 148
7895 148 -284 -66 -142 -104 -51 113 36 4 -62 171 276 -64 -237 -70 38 -88 218 -161 -75 39 98 269 -99
7918 -99 117 167 277 100 21 127 -149 38 -103 170 -75 -169 169 21 34 161 -196 -186 143 -16 12 -3 -20
7941 -20 16 283 -24 -237 -37 337 -20 -166 -446 219 270 -359 -156 -157 137 16 419 15 -38 12 189 199 -12
7964 -12 -35 -30 304 -139 157 5 30 30 150 61 -168 125 77 20 132 -293 -240 -348 -59 -34 74 8 -66 8 85
7989 85 228 58 -116 268 8 177 10 -137 200 164 77 36 -53 110 131 -23 -7 199 -71 77 -81 -185
8011 -185 -218 213 238 209 -53 49 59 -37 142 78 150 -97 -39 61 -31 -46 164 -95 -129 -145 -279 28 -233 111
8035 111 -127 159 -388 -197 199 215 -411 15 4 66 178 199 -246 -89 -155 53 51 25 34 -158 330 -38 -171
8058 -171 -117 81 8 122 -151 26 -38 103 28 -81 -46 -8 152 140 17 -134 -184 22 -96 -20 313 119 -145
8081 -145 -26 67 4 -341 296 -155 29 -103 387 -53 188 -158 -192 10 99 45 206 96 97 -131 46 -59
8103 -59 -13 -340 -48 117 128 222 -250 -19 -349 291 -9 21 -31 -39 -215 23 -52 -220 -38 -14 138 -210 -56
8126 -56 -67 -91 9 -85 -112 -137 212 263 327 -97 -155 -6 346 326 -133 -12 65 -118 353 94 -65 162 170 -7
8150 -7 -150 -29 -70 162 -60 -166 -136 -59 7 -38 123 -46 262 -122 45 61 -57 -12 -175 138 41 -6 -185 -165
8174 -165 20 359 22 -323 305 7 -38 42 -176 132 -248 86 -108 -172 -54 143 -278
8191b78
$$ Imaginary data points
##PAGE= N=2
##DATA TABLE= (X++(I..I)), XYDATA
0 0 0 0 0 0 0 0 0 0 0 0 0 0 7 -8 8 -8 8 -16 16 -21 24 -32 32 -40 48 -56 64 -73 88 -97 113 -129 145 -165
34 -165 187 -211 236 -264 295 -329 366 -407 452 -500 553 -611 673 -743 820 -901 995 -1094
52 -1094 1208 -1332 1471 -1631 1811 -2016 2257 -2541 2883 -3305 3834 -4529 5482 -6879 9123
67 9123 -13345 24091 -116251 -171706 23081 29207 -38239 -109027 21504 140070 86012 -50292
79 -50292 -95827 -872 82508 -14418 -102538 -81699 28630 72361 -36576 -109304 -52697 16359
91 16359 16001 -81093 -94078 9646 68018 35136 -37859 -26018 66643 58714 -25772 -79764 -39029
104 -39029 47009 12158 -79768 -83799 -12888 48794 -13273 -98765 -55317 40952 80100 11290
116 11290 -55082 11371 85640 59210 -41329 -104556 -36051 26881 -14214 -75667 -73444 23353
128 23353 80904 22875 -33073 -25703 30045 39789 -35167 -65492 -23507 29243 34731 -17442 -21010
141 -21010 25621 35977 3114 -45964 -36069 13171 7824 -21535 -31099 5451 48335 17150 -27257
154 -27257 -22351 12639 33801 -9649 -43540 -7501 36826 41267 -8678 -38527 2904 33662
166 33662 15394 -28878 -39370 15040 43793 15507 -20243 -24714 14595 24304 -13243 -32781
178 -32781 -16531 24682 38662 12972 8295 21491 30228 16470 -19071 -25055 -13828 -13143 -14278
191 -14278 -15866 5056 25902 17752 10312 11009 20643 20934 -5323 -12377 5858 22371 20271 -6243
205 -6243 -11491 9155 13658 -4825 -31945 -28003 5852 18580 8819 -2063 9683 37697 35081
218 35081 9313 -7051 -4094 12522 7951 -8979 -9582 -922 9672 3263 -10342 -8857 -5070 -2116
232 -2116 974 4564 19557 24260 19260 18121 17415 15936 -615 -21716 -20820 -7450 1210 -5539 -14802
247 -14802 1311 23269 23942 4373 -13362 -1743 18689 15116 -2049 -9504 8811 28347 17287
260 17287 -7884 -18899 -8113 3749 -6546 -18696 -12426 8637 23074 15678 4947 7044 10905
273 10905 7348 -5052 -10079 -1949 2810 1406 -231 4118 10062 2053 -10626 -11033 -1078 5948 -1769
288 -1769 -8035 4576 21884 22340 2402 -13640 -5476 7602 1648 -17707 -22530 308 21917
301 21917 16628 -3980 -10234 5907 16447 1296 -19436 -18495 3949 18185 7386 -6751 -3355
314 -3355 9608 10204 -5933 -17426 -11271 1747 5779 381 1042 9534 12191 4162 -5234 -5899 -2554
329 -2554 -5735 -10978 -6039 6994 13214 4992 -4152 168 8300 4953 -11402 -18110 -3163 14621
343 14621 12515 -3248 -7943 6363 16331 3023 -18301 -20486 -1044 12929 4908 -8324 -4302
356 -4302 13568 19096 2439 -15045 -13381 786 5578 -3443 -8622 794 12630 11823 419 -6588
370 -6588 -4627 -1513 -4726 -7668 -3026 4639 6673 3310 3350 6301 3315 -6718 -12527 -6157 3921
385 3921 4371 -3697 -3565 8014 14993 5313 -11780 -15387 -2276 6013 -1125 -11543 -5438 12483
399 12483 18885 5462 -9844 -8866 3218 5460 -6525 -13675 -4995 10414 12609 1707 -6146 -3198
413 -3198 1806 -854 -8414 -8735 -1173 5512 6568 4990 5626 4577 -1300 -6239 -6465 -4088 -4707 -7523
429 -7523 -3816 6077 11296 4928 -5519 -6267 2420 4198 -4773 -12543 -5536 9973 13650 1720 -8878
444 -8878 -5546 4178 2196 -11173 -17301 -7308 8127 10438 1342 -2940 2485 8632 2914 -8895
458 -8895 -12755 -6621 -86 57 -2307 -651 2688 2276 -1069 -4708 -4431 -4225 -5194 -1942 3940 7656
474 7656 3775 -2463 -2068 1150 -889 -10245 -16985 -9128 3790 6768 -423 -4694 2717 12364 7146
489 7146 -6824 -13816 -5884 5776 3593 -6019 -8395 625 8550 2147 -10331 -13375 -5411 2951
503 2951 1709 -3397 277 7091 10626 5700 -2651 -4969 -5139 -6089 -6790 -6696 -2758 -687 -457 1943 3454
520 3454 2336 -2570 -6999 -2381 3895 4487 298 -2762 3961 9287 3499 -8469 -14890 -7917 552
535 552 -1800 -7656 -6633 5774 15686 9708 -1376 -5264 63 5810 -1052 -9288 -7753 716 8098
550 8098 4271 -3734 -4381 -740 2130 -1309 -5405 -2396 2805 6831 7217 4248 3401 433 -1569 -1575 -2739
567 -2739 -3103 -3420 -1927 4754 8045 5528 154 -2662 2084 4587 241 -4498 -3701 5461 11396 6335
583 6335 -1817 -4282 1442 4647 -1698 -7481 -5347 4534 13165 9440 3718 2635 5738 7179 -872
598 -872 -8296 -8491 -2805 3721 4142 1605 3759 6729 9346 6875 1766 238 208 3077 5007 3247
614 3247 1812 523 724 2928 519 -2952 -5243 -2209 5507 8597 6840 4574 5333 10265 9932 2347
630 2347 -3654 -4277 2746 5637 1020 -2506 -2001 3907 6257 -130 -5120 -3544 3807 10483 8896 6610
646 6610 8048 11439 12523 5411 -3731 -7157 -7178 -3391 -3475 -4540 -1217 3402 9456 11180 7685 4620
662 4620 3246 5203 6758 3399 853 257 2419 5626 2471 -3115 -6183 -4377 1147 1662 -1023 -1059
678 -1059 3787 11278 11799 5462 1160 1432 5491 4962 -822 -4403 -2077 2886 4359 -1440 -5662 -4922
694 -4922 -1162 2269 429 -613 3482 8284 11924 8955 3489 180 -1629 -1603 -3573 -6955 -7067 -3766
710 -3766 2320 6180 4314 1774 730 2813 4349 750 -3809 -4213 1013 6761 5052 108 -2170
725 -2170 442 3824 372 -5769 -7046 -2026 4549 4692 -553 -1907 1246 5067 2882 -3070 -4867
740 -4867 -1696 3034 4178 871 -1089 -289 1621 1403 -2507 -4802 -4215 -1389 2014 2518 1259 -110
756 -110 -715 671 7 -3579 -6440 -5512 52 5151 3898 814 138 3537 5317 -287 -8100 -9879
772 -9879 -4416 1114 -1016 -4925 -3498 2676 7416 3560 -3657 -4503 -48 4314 1745 -3229 -2768 1640
788 1640 3976 569 -5131 -7197 -5023 -2065 -1911 -2777 -1442 1444 3840 4682 2775 550 -1483 -1732
804 -1732 23 478 -1407 -3404 -2888 689 1716 -2227 -6941 -7243 -1423 2869 571 -2063 171 7054
820 7054 9885 4166 -3323 -4757 -1122 599 -3981 -8673 -6662 632 4447 1203 -3709 -3041 1186
835 1186 3162 665 -3230 -1260 2737 5071 3303 -529 -2307 -1980 -2262 -3159 -4954 -4942 -3545 -300
851 -300 2865 3662 1588 -481 78 2582 2073 -1790 -4093 -1909 2835 4380 -95 -4453 -3609 770
867 770 1425 -3424 -6825 -3407 3911 6434 2521 -1639 -125 3893 3449 -1658 -6079 -4219 516 2555
883 2555 606 -1937 -794 2048 2345 -365 -3358 -3567 -1023 1723 2650 1607 598 968 1831 1961 -575
900 -575 -3664 -4335 -1492 2317 2546 -246 -1554 1220 4227 2450 -3042 -5877 -2480 2622 3169 -1208
916 -1208 -2490 1028 5484 3791 -2451 -5713 -2840 1813 1873 -1638 -3043 466 4221 3853 -827 -3890
932 -3890 -2709 -431 431 -395 -1378 18 2528 3754 2532 -593 -2449 -2442 -844 484 -374 -1687 -940
949 -940 2384 4196 2359 -2475 -4017 -940 2334 1158 -2634 -2768 2226 6681 3845 -2380 -4558 -704
965 -704 2899 838 -4057 -4193 1519 5983 3922 -1182 -3076 -98 2140 207 -3505 -3407 356 3786
981 3786 2978 563 -693 241 826 -131 -1726 -1948 -1192 -43 1711 2775 1638 -794 -1873 -153 1348
998 1348 -25 -3279 -3167 1692 5486 3843 -1453 -3175 1323 4134 348 -5231 -5503 911 5738 2816
1014 2816 -2866 -2987 2259 4773 640 -5147 -4156 1509 5032 2188 -1651 -836 3049 3504 -210 -3955
1030 -3955 -3137 -296 965 387 -96 1492 2628 1609 1191 702 70 -1499 -2248 -1 2760 2283 -555
1047 -555 -1379 1734 4016 1063 -4403 -4588 978 5445 2549 -2777 -2247 3990 6743 1549 -5698 -5041
1063 -5041 1527 4851 666 -4712 -2089 4878 6150 681 -4416 -2936 2367 2941 -900 -3050 -248
1078 -248 3807 3610 150 -1548 -654 -23 -1031 -1761 -640 974 918 602 1954 3057 1555 -2183 -3364
1095 -3364 -382 2028 57 -3523 -2617 3196 5845 1465 -3913 -3170 2578 4982 -238 -5356 -2184
1110 -2184 4712 6624 217 -5393 -2686 2866 3123 -2570 -5955 -1830 4621 5139 411 -2069 302
1125 302 3162 1637 -2141 -3216 -1319 1248 801 -120 -254 492 -203 -1492 -1173 107 -458 -1500 -920
1142 -920 2347 4393 1658 -1878 -2076 1501 2086 -2675 -6423 -3874 2458 3931 -601 -4340 -1207 4131
1158 4131 4083 -1967 -5714 -2226 3522 3538 -1550 -4511 -643 2918 1709 -3746 -5682 -2364 1530 1342
1174 1342 -1116 -1442 1047 2921 1365 -744 -2131 -1544 -1552 -1361 -819 30 -875 -1036 -875 882 666 -2062
1192 -2062 -3714 -1720 2156 2559 -649 -2283 -298 3297 2377 -3329 -6036 -2682 1546 1390 -2706 -4153
1208 -4153 -105 4388 3155 -2137 -4216 -1000 2284 1167 -2798 -4215 -713 2527 1193 -2308 -3774
1223 -3774 -2205 -7 -201 -1490 -1736 -105 1903 2188 1110 -603 -2056 -2245 -1310 -679 -1753 -2746 -2305
1240 -2305 -45 2195 1062 -1855 -2180 -131 2127 427 -2434 -2766 855 3431 1743 -2599 -3833
1255 -3833 -1107 916 -373 -3227 -3795 265 3246 2888 -574 -1887 338 2069 1030 -2002 -3343
1270 -3343 -1461 1281 1441 -446 -2296 -1622 164 908 -533 -2352 -1977 777 2625 2634 189 -942 246
1287 246 1412 268 -2543 -3966 -2202 665 1721 -203 -1536 -542 1883 2199 -195 -2329 -1819 954
1303 954 2177 832 -1064 -1202 914 1586 -10 -2492 -2800 -938 1197 1333 -216 -496 298 2008 2074
1320 2074 -204 -2353 -2412 259 2037 586 -1661 -1291 786 2900 837 -2699 -3000 -10 2635 1569
1336 1569 -1220 -1579 1379 3552 1688 -2267 -3451 -534 1597 723 -1275 -1336 1028 3345 2261 -374
1352 -374 -1234 -203 450 435 -682 -1012 31 913 1385 1235 -85 -536 -695 456 1366 360 -452 -399 1504
1371 1504 3276 1043 -1782 -2839 -160 2135 338 -2607 -2437 1464 4447 2290 -1871 -2577 1137
1386 1137 3338 1034 -2709 -2877 1497 3556 1494 -2420 -2642 434 2039 -177 -2873 -1875 1569 3093
1402 3093 1760 -131 55 1623 1347 -202 -1180 -1124 -574 -94 -145 340 595 -170 -710 115 937 767 -886
1421 -886 -1397 1005 3184 2223 -1013 -2130 408 2812 677 -3860 -3918 589 3789 1907 -2318 -2372 1990
1438 1990 4486 1385 -3005 -2929 1478 3995 951 -2391 -1729 1751 2911 -589 -3357 -2517 375 1924
1454 1924 -30 -1486 267 2018 1967 -101 -807 -525 -128 -385 -809 40 720 292 -772 -19 1082 1014
1472 1014 -1160 -2556 -417 2198 1576 -1158 -1920 1058 3807 1569 -2965 -3671 184 3324 1123 -2942
1488 -2942 -2700 1714 4142 1195 -3388 -2871 1243 2823 320 -3196 -2411 2255 3766 545 -2501 -1779
1504 -1779 1192 1847 -548 -2489 -742 1508 1861 483 -824 266 753 -364 -894 -440 123 -131 -559
1521 -559 272 2116 1377 -827 -1708 -183 1442 688 -2291 -2425 740 3295 1620 -2333 -2521 751 3003
1538 3003 361 -2951 -2803 1244 3872 1085 -2612 -2329 1498 2549 -349 -3480 -2432 1247 2837
1553 2837 207 -2103 -962 1402 1686 -375 -2049 -1261 466 1082 -23 -440 98 297 199 -154 -46
1570 -46 -515 -1141 -628 525 1317 901 -592 -892 923 1754 -99 -2049 -1763 803 2148 700 -1542
1587 -1542 -1165 1259 2181 -105 -2664 -2206 796 2135 218 -2222 -1377 1618 2290 295 -2416 -1914
1603 -1914 254 1587 433 -1511 -905 642 1767 698 -1047 -1575 -761 625 214 -732 -1032 -136 1170
1620 1170 1187 181 -909 -969 175 662 151 -732 -1302 -77 1623 1168 -834 -1710 -918 366 740 -717
1638 -717 -1413 -562 1402 1547 505 -1542 -1155 418 851 -89 -1520 -1093 737 1586 923 -926 -1821 -35
1656 -35 1072 351 -834 -1559 -4 1755 1732 -165 -1601 -750 896 1170 -638 -2085 -834 1273 2174
1673 2174 535 -1367 -893 840 1075 -492 -1938 -1624 312 1737 202 -941 -815 316 1245 371
1689 371 -937 -798 65 705 973 -79 -477 -296 275 444 -355 -1152 -902 170 982 1002 207 -759 -167
1708 -167 1229 1126 -456 -1822 -872 1106 1869 5 -1714 -587 1219 1797 -427 -2471 -1135 1305
1724 1305 2141 409 -1557 -412 1777 2239 -10 -2106 -1514 613 1470 131 -1410 -709 1221 1666
1740 1666 406 -915 -432 644 1092 701 -108 -277 145 738 579 -1 -715 -928 -460 422 587 114 -493
1759 -493 505 1269 1516 232 -1214 -881 714 1402 -69 -1509 -816 1440 1739 -295 -2248 -1341 1204
1776 1204 1736 -145 -1762 -625 1983 2892 429 -1605 -895 909 1422 -419 -1605 -1289 757 1577
1792 1577 358 -929 -384 903 951 391 -504 -476 389 941 740 298 -197 -115 -175 411 199 -585 -500 -194
1812 -194 1249 1587 219 -442 -234 1060 1560 -53 -1324 -568 1499 1793 368 -1613 -999 1384 1601
1829 1601 -298 -2053 -1211 1337 2481 398 -1081 -996 1280 1603 -51 -1726 -1163 621 1195 381 -656
1846 -656 -364 890 1350 472 -633 -825 -290 508 521 -48 -557 -361 564 583 238 -458 -1115 96 933 928
1866 928 -2 -1096 3 1493 831 -578 -1553 -774 916 1031 -194 -1268 -699 1284 1457 -118 -1775
1883 -1775 -1243 1114 1249 -16 -1179 -434 962 1558 5 -1382 -1120 -20 690 -71 -802 -681 524
1900 524 1437 641 -271 -1104 -215 659 362 -319 -1339 -539 724 1042 293 -770 -653 131 941 351 -682
1919 -682 -750 370 1482 910 -544 -1331 -310 734 642 -784 -1470 -175 1009 1193 -198 -1369 -659
1936 -659 1125 915 -319 -1382 -699 864 938 118 -1230 -662 302 846 186 -1041 -1270 282 1011 742
1954 742 -111 -641 -279 656 771 -354 -1157 -773 388 1140 306 -946 -710 273 1254 464 -1115 -1111 319
1973 319 1497 792 -554 -1463 121 1588 729 -1075 -1843 -315 1312 833 -473 -1088 106 1239 871
1990 871 -669 -1055 -653 978 748 -73 -1052 -764 283 884 224 -894 -592 -88 674 386 -115 -717 -75
2009 -75 657 714 -106 -1147 -774 -44 876 239 -878 -830 284 1442 519 -1107 -1366 223 1096 241 -955
2028 -955 -989 256 1338 685 -1127 -1512 -607 1073 648 -459 -1276 103 1200 1043 -342 -1002 -224 549
2046 549 653 -133 -1027 -557 593 1228 323 -845 -600 115 757 426 -407 -593 99 881 826 -32 -891 -405
2066 -405 566 579 158 -880 -539 589 1205 329 -698 -803 69 1116 342 -1044 -1155 215 1195 1052
2084 1052 -420 -1194 -233 1255 945 -616 -1707 -456 1025 1198 -358 -1315 -412 1008 1062 -217 -1305
2101 -1305 -631 404 1245 155 -814 -477 693 1075 241 -851 -671 199 733 300 -653 -304 49 499
2119 499 45 -16 -634 -321 405 724 299 -393 -590 134 550 487 -620 -1071 -334 874 1030 -298 -1127 -306
2139 -306 1275 1340 -556 -1590 -656 1266 1207 -384 -1634 -615 1666 1312 -296 -1814 -547 967 1122
2156 1122 -335 -1451 -566 1079 1156 135 -1233 -597 748 681 -365 -431 -354 185 721 39 -253 -326 -356
2175 -356 -287 203 192 -62 -552 -301 1034 725 -205 -1007 -575 904 1112 -474 -1292 -336 1255 1512 -287
2194 -287 -1701 -641 1223 1023 -479 -1554 -552 1322 1436 -326 -1462 -434 1079 1222 -450 -1300
2210 -1300 -352 1314 969 -208 -825 -323 611 686 -288 -668 -350 257 357 244 103 -332 -251 370 514 111
2230 111 -411 -778 -210 663 725 -411 -1140 -361 706 893 -596 -1412 -369 1202 1300 -440 -1255 -536 1224
2249 1224 1027 -494 -1621 -526 1039 920 -379 -1115 -563 956 1186 -272 -1312 -696 742 1109 130
2266 130 -836 -491 657 908 158 -752 -810 -24 505 348 -375 -728 -109 574 533 -83 -922 -354 160 784
2286 784 322 -551 -435 185 500 474 -628 -859 -33 600 625 -438 -916 -272 898 762 -177 -1180 -782
2305 -782 750 794 -68 -1120 -673 833 1101 80 -1042 -820 433 939 -225 -927 -877 337 1312 374
2323 374 -633 -847 -11 903 493 -617 -1017 132 1023 380 -312 -913 -278 368 444 -565 -832 -340 424
2342 424 505 94 -406 -497 41 467 -16 -218 -525 -99 393 553 -101 -638 -433 269 1031 129 -922 -836 334
2363 334 1138 385 -807 -704 298 1349 506 -976 -994 50 1162 418 -834 -1013 270 1287 706
2380 706 -851 -960 189 1027 592 -449 -730 71 821 248 -372 -801 -204 423 461 -71 -506 -104 237
2399 237 243 35 -50 -654 -92 219 546 159 -549 -399 357 676 119 -554 -825 0 1040 353 -905 -752
2419 -752 148 1405 247 -1016 -947 242 1356 356 -803 -1101 282 1151 488 -691 -1056 -37 1261
2436 1261 440 -659 -866 204 1028 497 -210 -706 112 453 563 -209 -788 -190 666 354 66 -745 -478
2455 -478 108 155 134 -39 -195 -145 679 684 84 -539 -590 182 901 373 -932 -866 222 1129 386 -699 -769 -2
2477 -2 961 490 -912 -864 169 1227 742 -622 -801 408 1167 523 -705 -865 -38 768 664 -351 -734
2496 -734 -73 846 511 -330 -355 -377 694 587 249 -140 -90 203 347 249 -456 -710 -137 312 266 172 -363 -354
2518 -354 -21 564 98 -584 -505 427 922 708 -504 -767 171 820 418 -594 -929 -12 897 626 -445
2537 -445 -844 15 937 717 -540 -779 1 819 679 -619 -982 -377 422 668 -480 -524 -265 397 499
2556 499 -150 -489 -400 353 461 128 -317 -595 -63 223 473 -179 -650 -145 244 675 -39 -631 -619 298 530
2577 530 157 -466 -460 377 575 42 -931 -461 15 781 730 -96 -622 -188 1084 619 -410 -621 -255 783
2597 783 600 -330 -723 -457 561 869 -145 -865 -599 485 787 -50 -626 -439 407 843 74 -563 -215
2616 -215 154 440 317 -433 -270 18 520 266 -138 -506 -372 323 390 -104 -572 -353 203 888 274 -638
2636 -638 -548 41 689 235 -381 -835 -48 469 345 -281 -680 -209 442 595 -214 -657 -663 568 555 -52 -715
2657 -715 -601 242 825 -316 -582 -414 300 400 33 -582 -583 603 621 208 -389 -631 -158 405 352 -186 -567
2678 -567 -163 388 452 -175 -348 -377 296 628 281 -525 -342 371 611 427 -357 -775 41 391 418 -471 -529
2699 -529 -200 775 484 -134 -688 -393 566 527 -9 -639 -333 580 696 -191 -699 -409 205 657 -7 -452
2719 -452 -476 302 689 27 -172 -492 -65 466 383 -295 -601 104 534 393 -235 -552 -244 55 257 -30 -482
2740 -482 -301 149 469 34 -444 -210 -69 386 326 -55 -442 -13 408 373 -359 -542 -285 345 254 -420 -365
2761 -365 -229 161 492 66 -664 -369 387 618 315 -265 -679 -34 632 643 -253 -670 136 754 449 -306
2781 -306 -432 -286 395 679 -417 -451 22 180 533 -262 -396 58 -27 366 159 21 -246 40 295 76
2801 76 -167 -586 -22 174 177 -175 -425 46 324 500 -170 -649 -464 365 515 -110 -555 -537 297 593 268
2822 268 -656 -62 443 708 113 -681 -521 388 533 151 -368 -676 -27 466 319 -387 -356 -94 498 384
2842 384 65 -196 -303 168 494 -48 -240 -177 -31 570 101 -227 -500 -424 430 544 113 -437 -377 543 581
2863 581 -76 -532 -441 460 325 -131 -426 -451 446 632 272 -701 -315 -120 809 242 -661 -232 257 512 271
2884 271 -484 -391 210 462 134 -345 -577 47 392 269 -110 -313 -105 256 501 166 -286 -238 201 452 472
2905 472 -336 -662 -242 445 425 -121 -571 -6 635 659 36 -452 -255 650 474 -116 -637 -173 729 439 -174
2926 -174 -505 -179 134 744 -92 -636 -417 228 361 35 -267 -499 -55 120 368 -96 -423 -149 161 434
2946 434 296 -202 -257 134 511 155 -90 -334 -209 411 212 -272 -471 -241 -170 329 -418 -337 165 278 512
2967 512 -114 -666 -139 528 558 -96 -541 -290 255 270 -142 -421 -424 467 573 280 -448 -226 396 418 99 -490
2989 -490 -187 163 461 596 -475 -320 292 356 204 107 -195 -306 289 66 -107 -144 -172 223 306 270 -114 -237
3011 -237 232 501 330 -272 -530 -218 355 638 -61 -373 -197 448 668 -238 -550 -295 233 298 126 -144
3031 -144 -525 252 794 140 -579 -423 198 495 24 -477 -303 63 508 291 -71 -337 80 583 92 -410
3051 -410 -402 -200 184 92 -141 -320 -199 536 128 32 -461 -454 125 351 101 -164 -402 -43 188 327 206 -237
3073 -237 -360 276 787 87 -523 -536 357 520 150 -564 -377 162 553 1 -398 -337 374 551 85 -530 -233
3094 -233 -34 587 122 -220 -674 -24 611 228 -413 -242 111 384 232 -390 -282 -109 197 401 -20 -289
3114 -289 -518 60 82 221 -38 -608 -257 146 -53 -133 -105 243 266 467 -109 -388 -276 92 670 274 -499
3135 -499 -262 393 572 -115 -365 -363 183 449 -244 -707 -321 186 483 29 -402 -477 -145 240 272 -380 -358 -295
3157 -295 339 297 -145 -311 87 482 -19 65 -129 -322 -90 199 -145 -174 -184 40 -8 313 -92 -391 43 37
3179 37 346 -6 -542 -348 313 55 291 -424 -206 174 415 90 -652 -305 107 512 161 -107 -450 351
3199 351 441 224 -140 -308 40 406 268 -383 -423 41 407 397 -199 -669 -113 459 347 52 -329 -150 592
3220 592 335 -18 -155 -217 167 247 125 -85 -99 97 311 34 113 -308 -78 123 239 99 -195 -224 276 264
3242 264 248 -668 -189 41 354 180 -318 -382 4 460 290 -236 -533 55 301 129 -190 -436 -36 301 245
3263 245 -383 -654 -43 454 305 -136 -366 -285 388 190 -99 -375 -150 276 62 68 -246 -292 83 131 -47 -61
3285 -61 -171 -163 202 589 -121 -437 -107 192 348 57 -333 -102 -60 341 266 -343 -34 15 382 112 -229 -286
3307 -286 208 228 163 -216 -519 -129 324 325 -109 -339 -176 156 309 -95 -394 -196 288 311 -24 -45 -190 435
3329 435 71 -40 -493 -196 376 166 -207 -566 -353 -10 394 134 -140 -113 -77 229 443 -60 -395 -413 159
3350 159 131 -77 -198 -221 79 160 76 -62 -230 20 178 298 -214 -419 -105 446 232 59 -277 -57 302
3371 302 184 82 -297 -155 124 -14 -36 -297 -28 82 106 -28 -426 -153 -130 261 -76 -110 -304 161 358
3392 358 122 -33 -200 -233 366 223 -280 -233 -92 77 180 -154 -490 -109 113 275 -313 -105 -89 82 518
3413 518 87 -153 -102 67 197 -100 -230 -442 20 240 154 -107 -451 -310 90 341 -171 -87 -271 210 334
3434 334 376 -258 -252 -136 277 243 -320 -458 -14 322 193 -23 -172 -69 313 179 -185 -444 -76 262 258 32
3456 32 -208 -219 184 607 -157 -290 -239 3 317 95 -32 -71 -120 263 251 -19 -92 51 316 428 77 -146
3478 -146 -70 48 574 -30 -576 -18 69 163 -120 -205 -215 437 57 64 -484 -293 142 97 109 -199 -203 127 126 -23
3502 -23 -193 -175 93 65 352 -152 -165 -169 377 285 -127 -521 -265 -140 129 147 -445 -253 -99 507 42 -372 -162
3525 -162 -96 359 110 -21 31 -343 288 32 343 -311 -135 28 250 62 -11 -37 69 210 97 -116 -171 204
3547 204 461 83 -43 -320 280 185 -16 255 -163 -123 207 -35 -181 -423 37 174 282 -105 -453 -283 218
3568 218 100 -36 -330 -419 173 102 60 -382 -224 -181 262 206 -540 -362 -72 350 65 -137 -211 -54 110 380
3590 380 158 -304 -262 -9 85 26 -139 -197 14 146 85 220 -43 -119 334 119 204 -122 -58 515 68 114 -121
3613 -121 -361 70 324 325 -470 -305 418 286 271 -260 -310 -188 205 152 -88 -276 -164 440 -61 -117 -410 57
3635 57 212 122 -9 -38 -13 106 291 -98 -394 -27 55 467 110 31 -57 18 176 251 -113 -18 -37 -90 48 8
3659 8 -327 -63 215 294 135 -217 -85 63 295 25 -122 -111 -100 434 16 -90 -270 180 324 238 -127 -345
3681 -345 230 207 305 -130 -73 -28 -48 122 -113 -166 146 254 40 -109 -9 87 170 414 -93 -78 207 316 -214
3704 -214 -164 49 14 90 64 -222 -33 -180 377 392 70 60 -280 -247 -188 196 116 -491 -152 241 -179 92 -88
3727 -88 -40 -1 116 -164 -121 -278 36 13 -29 -174 -451 145 116 44 -401 -362 157 332 228 -307 -45 -134 282
3750 282 237 -163 -189 314 339 157 -205 -67 -294 22 91 90 -47 -404 246 43 218 46 31 -93 26 134
3772 134 -297 -9 -218 181 309 134 -180 -321 137 384 57 -341 -153 20 340 151 46 20 -79 -21 158
3793 158 4 -373 58 365 145 177 -96 36 95 147 -73 -207 -77 225 235 -132 -56 -27 49 252 -95 -341
3815 -341 3 -97 222 -55 32 -172 106 263 -133 99 -51 174 239 -63 -6 64 -335 -123 252 112 14 -67
3837 -67 249 181 -85 5 -194 50 204 134 -85 -255 50 -2 217 98 -208 -32 247 275 26 -176 -103 117
3859 117 143 -167 -17 -89 392 262 177 -40 -154 92 179 31 -26 147 -120 33 37 22 -271 246 -68 80 9
3882 9 83 -182 377 -55 38 176 -23 37 -172 90 -141 -224 -244 354 -108 -238 214 -178 213 265 57 -199 -21
3905 -21 236 207 215 -219 -125 74 -71 -201 -121 -233 -5 336 -198 6 -44 -3 265 -22 -199 -324 -184 71 -188
3928 -188 -99 -186 175 68 -31 -109 -32 -3 149 202 -68 211 -79 86 314 81 85 -17 -40 304 75 95 -233 250
3952 250 29 -260 -180 -174 243 37 249 -335 -265 96 104 289 -35 -329 -101 23 23 130 -43 -220 -105 176 184
3975 184 -109 -359 194 271 47 -19 -175 -24 157 -73 195 -229 59 217 -184 5 -143 26 155 -12 -29
3996 -29 -105 -67 -230 175 -1 -282 86 -57 190 328 101 -169 -221 287 -242 -216 -156 250 409 15 31 17 -446
4019 -446 130 97 -66 -207 136 95 261 134 -391 48 78 347 113 -352 -48 382 50 34 -23 -182 130 84
4041 84 -88 13 -82 -156 369 -214 -62 84 -25 434 -17 -281 -249 49 239 216 -246 -87 -70 -27 78 187
4063 187 -63 -85 -299 -117 -101 -136 31 -48 88 229 -257 -118 -184 241 177 195 -350 -337 -138 -20 15 -102 -363
4086 -363 151 258 -103 -134 -95 -99 -89 161 25 -137 52 189 425 -15 40 6 -15 21 -139 69 140 -19 121
4109 121 3 -157 154 96 -96 116 -202 78 283 -91 65 33 -41 74 -87 -68 96 -203 -335 112 141 186
4131 186 -205 -293 274 184 -57 -119 -190 -74 -48 67 -129 215 -15 181 24 -24 100 66 179 64 60 -256 -22
4154 -22 -35 109 -127 -211 -8 -82 284 101 -253 318 -85 -63 353 85 -97 55 253 64 -69 -208 -160 49
4176 49 204 -8 124 124 229 18 -200 -367 -174 75 -81 376 191 -254 -127 197 -96 -104 -188 177 14 214
4198 214 -38 -204 61 183 55 -86 -127 23 191 21 -8 20 -130 -28 190 106 -95 -34 214 -152 -204 -213 246
4221 246 -108 44 95 -108 -311 -18 65 299 -343 -56 210 274 304 171 -328 -117 167 187 -85 -269 10 185
4243 185 378 259 165 -174 18 202 -12 194 -216 33 -20 8 -15 -49 -92 181 16 223 -216 69 -114 30
4265 30 -57 -180 188 124 124 -323 -233 -100 190 243 285 -238 -138 -146 104 47 -153 -75 -184 90 6 -98 -48 12 -9
4290 -9 163 -22 -206 -143 -42 6 -2 -40 -196 -26 106 230 -8 -244 -82 158 158 -28 -8 189 251 98 42 -220
4314 -220 432 123 115 0 -160 78 -57 169 149 68 -46 -22 -9 42 -290 -239 -98 228 50 -67 -276 -305 27
4337 27 -126 -81 21 48 -96 -223 222 -159 -136 110 -147 99 67 100 -19 11 -199 -191 6 55 191 130 -136 -90
4361 -90 41 189 14 -174 42 6 -11 -95 -298 325 -93 126 20 -140 96 92 304 -84 23 -109 -254 -93
4383 -93 -37 -126 25 -86 -84 151 107 -109 63 -16 15 53 80 -183 248 6 123 -346 -13 45 177 265 -13 -175
4407 -175 -13 -80 -44 -99 -47 77 46 150 -332 80 -130 133 280 271 -201 81 206 216 40 165 44 48 -8 157
4431 157 -80 -24 -79 -24 -119 18 162 164 27 -115 8 -106 -124 3 460 7 -74 -237 79 -165 -217 -63 -225
4454 -225 -175 361 -38 -70 -421 -13 36 22 446 232 -126 -63 -20 136 -44 -84 -13 -28 -45 72 134 160 221 -10
4478 -10 -126 -95 183 48 -16 63 326 -196 20 -63 133 -193 1 -129 134 12 -146 -159 141 16 -123 -99
4500 -99 -356 54 189 167 -212 -3 -238 -313 233 -282 44 -59 143 62 -31 7 33 92 -21 -57 139 -90 53
4523 53 134 260 -52 -37 -149 111 -67 -239 -62 237 -265 66 -120 164 -177 -117 12 -19 15 -25 311 -56
4545 -56 -53 9 4 -33 -270 -38 135 -204 313 335 2 -159 -289 118 127 124 175 4 245 129 -45 184 -62 192
4569 192 -18 -62 143 -308 -11 130 166 -173 -180 -11 -120 -51 -56 -223 -124 140 72 -232 15 135 -28 192 -289
4592 -289 -32 -209 148 119 -60 51 -130 7 -81 63 -91 -76 -153 19 -171 170 -77 49 -60 132 137 -381
4614 -381 -64 -118 -271 -183 -107 7 -4 -102 71 225 37 59 -238 72 -180 -14 91 -40 289 5 -92 -57 267
4637 267 -101 -18 -133 -13 41 -5 -81 204 8 -94 140 -1 -52 119 -80 20 59 175 -60 108 62 138 243
4660 243 10 -102 -361 -166 -101 100 -289 98 139 -362 -70 -52 -209 53 -359 -172 -175 245 79 249 48 -94
4682 -94 -142 184 -177 -91 294 150 -130 -272 0 -204 10 -93 184 5 56 56 -20 153 10 28 13 -60 28 97
4706 97 132 -124 -185 75 41 22 -162 -142 101 -3 -22 -265 61 2 -57 -89 -12 -193 -311 -66 -186 -254 112 77
4730 77 82 140 -7 -103 130 134 -152 -44 -68 195 -160 35 -14 175 -107 49 -41 -208 129 -147 -136 21 138 -360
4754 -360 -41 166 -1 -159 -172 383 -8 -36 -253 -140 -103 114 96 217 76 -258 123 -1 103 -39 5 -56
4776 -56 -14 136 -55 109 -194 249 281 -1 5 -184 242 -126 -417 1 -34 -31 137 362 -192 -61 -96 -21 28 -136
4800 -136 -240 -198 -184 164 106 35 143 -140 132 -119 -27 -238 -192 111 -86 -98 226 -136 168 8 110 -211
4822 -211 -306 -10 117 -91 40 -152 -62 229 -158 -68 36 -54 40 -448 -138 -71 152 197 78 -27 -22 -122 -59
4845 -59 -172 31 -28 315 8 70 5 -107 -169 -40 61 48 123 -75 -27 32 95 -171 -171 109 69 -10 20 -311 85
4870 85 -18 -16 -14 26 -272 230 -159 -258 136 -32 159 -112 -93 122 -67 -12 180 22 -201 13 83 -192 99
4893 99 -44 280 -151 -47 -79 -306 -72 117 -35 27 210 -122 -47 -172 103 268 42 -197 -8 51 197 93
4915 93 48 -257 191 25 131 126 -126 263 213 -307 142 -352 -120 12 9 -115 7 123 107 102 -318 18 6 167
4939 167 -142 108 -150 25 -98 78 -55 -163 119 78 154 -84 -147 221 112 -34 206 226 -68 -11 122 -81
4961 -81 21 -132 105 215 8 -196 -89 -172 -10 -48 -59 -11 34 53 -130 53 -264 19 57 -65 2 -165 88
4984 88 97 -89 -110 -101 -310 -46 142 157 13 241 -27 -77 113 -296 132 104 342 -292 -110 117 -37 -19 -25 -188
5008 -188 17 230 351 107 -64 51 65 204 162 -153 87 134 195 116 -42 -134 -81 216 2 166 171 -141 -263
5031 -263 112 -3 55 51 96 292 -193 212 45 2 -25 115 48 -220 -52 -93 316 -131 -371 -210 19 188 27
5054 27 96 -28 391 77 116 0 29 107 28 68 -142 -24 84 13 30 -98 60 116 -119 92 -253 -114 22
5077 22 90 -53 61 44 -87 102 240 -246 35 -30 -88 -105 -158 -167 88 -91 -157 1 20 49 -33 23 -373 -23 -156
5102 -156 -227 -147 100 55 -39 19 77 30 96 44 -92 -195 -186 -116 152 -213 -266 -181 77 -81 123 -72 -100 5 128
5127 128 -41 -91 -260 -114 -34 -31 -122 389 57 -24 -212 -208 207 133 200 -365 -152 96 161 -181 -34 187 -142 12
5151 12 -109 -44 -25 -34 52 48 4 198 -105 104 52 -106 -144 -41 45 278 190 -323 24 -158 335 -99 163 -41
5175 -41 122 -318 39 -63 77 120 -29 53 -118 79 -187 28 -32 79 54 52 116 -16 36 -46 -38 63 129 -8
5199 -8 -90 174 55 77 -39 -345 67 -122 47 -102 228 89 -210 146 68 -4 -31 -250 -60 -18 8 -176 -221
5222 -221 189 222 -83 -40 -174 167 84 -14 -98 -48 248 160 66 -158 67 -188 -129 -140 -64 -86 -42 -59 125 -149 -24
5247 -24 224 74 -81 -253 -15 89 -291 85 192 -59 164 130 9 245 93 -58 -154 93 64 -204 -285 -114
5269 -114 87 199 -8 -36 -71 291 2 -43 -30 85 93 105 115 273 -17 29 -105 -55 -143 -292 -423 90 -85 -162
5293 -162 -145 55 75 80 -2 37 -110 242 -78 -88 65 153 23 -17 145 -61 -179 -305 59 -57 -138 112 -90
5316 -90 -123 108 -151 -332 -136 -23 95 -67 -170 -40 135 88 -322 271 -17 183 206 238 -349 19 -79 25
5338 25 -7 -161 62 -51 95 197 -13 -99 -75 -174 -140 -264 -63 -18 198 23 62 -88 -181 -225 245 331 -136 -216
5362 -216 -59 199 -45 122 -433 -117 -27 333 202 24 34 -150 345 -126 -70 33 -173 96 267 -311 93
5383 93 -11 -21 171 106 -38 31 19 225 -143 30 63 142 87 -93 34 -82 146 13 -70 -379 -237 125 122 107
5407 107 12 8 205 -213 454 323 -6 -211 180 81 -180 -218 -87 35 47 296 -52 -1 260 27 168 7
5429 7 -28 126 -163 -99 315 -182 102 110 -77 -81 -74 94 64 -37 -363 -75 22 205 -22 -17 -330 228 360 -68 31
5454 31 -241 -136 -47 190 30 -200 -115 -33 -237 -305 -220 219 -80 -144 -257 -100 -6 140 10 248 -29 -177 -75
5477 -75 -3 180 -111 -102 142 572 11 81 -39 -19 -85 200 -110 128 -129 3 -60 -175 -88 -13 -128 244 -20
5500 -20 -5 -327 -60 221 43 -52 179 180 -38 182 20 -122 -271 148 117 -117 -197 38 -13 12 -204 -146 -232 67
5524 67 -83 -243 -246 -47 203 92 221 34 11 -88 -21 173 261 -113 -128 106 228 77 87 49 -215 76 -170
5547 -170 31 -214 134 73 109 -6 -177 -233 241 -192 145 185 -130 236 197 -179 -154 25 35 -37 3 18 66 -8
5571 -8 -70 64 -162 -3 418 41 86 -98 18 156 148 192 -138 -63 -210 207 97 -27 -142 -93 -135 29 -77
5594 -77 40 -46 174 173 -157 -177 -171 115 319 103 -84 -85 61 238 168 -272 -80 -115 145 85 228 -124 -294 42
5618 42 141 -158 -374 9 128 40 -125 75 -260 513 218 -183 75 -155 63 205 -14 -58 42 -31 68 32
5640 32 -164 251 70 312 134 -168 95 -177 256 25 4 -159 92 162 -43 -132 -314 -65 -7 37 162 -37
5662 -37 134 38 -6 -182 27 -52 -213 -52 170 51 96 -143 89 216 -22 150 -79 109 -265 -59 -301 47
5684 47 127 46 322 60 -107 -52 -26 50 42 -6 -17 27 235 70 -162 20 501 123 109 -134 142 -63 169 13
5708 13 176 39 224 -20 34 -59 -223 -4 176 -161 -19 10 -11 376 -94 -81 51 1 72 222 -109 -126 -241
5731 -241 52 189 -118 -198 -25 -65 -106 35 -34 16 -188 -253 131 -114 -20 159 -398 69 75 -143 -14 258 44
5754 44 -17 -215 90 205 65 -10 41 -29 -114 124 -13 -288 -21 -56 101 -54 -205 -320 -4 -41 -6 -16 36 -211
5778 -211 65 166 32 -99 -105 -11 -97 -110 -335 132 138 147 96 147 98 -125 -87 348 113 -82 36 65 -175 30 -13
5803 -13 -154 98 130 167 -144 15 72 247 34 -90 96 -72 353 -5 -219 -206 54 2 60 4 135 -52 -35
5826 -35 215 -60 -8 -289 111 32 133 -57 29 128 -169 156 51 179 -19 -127 -131 -43 -146 104 175 -4 -67
5849 -67 -307 -12 194 -21 9 -49 282 -38 88 -81 -28 -216 216 222 -72 -2 1 84 -131 -208 -158 98 -153 -190
5873 -190 177 -158 -148 -152 190 6 -268 -24 4 41 134 -218 131 -68 187 -29 -191 -188 158 158 347 -169 -17
5896 -17 -133 -61 102 -39 -147 96 69 73 68 123 -87 -138 5 -117 3 -230 17 160 34 100 -286 -177 51
5919 51 -68 121 -163 94 227 309 -33 -82 164 -77 -252 311 201 -64 57 -108 299 145 -11 -68 -241
5940 -241 137 -234 -208 -49 -153 38 43 -47 -75 205 294 -129 17 303 194 -224 133 -17 -36 20 -34 -267 -77
5963 -77 -106 10 87 -82 2 -110 -80 76 276 115 66 -80 165 293 74 -168 -75 101 -101 -259 -24 -131
5985 -131 210 -3 -215 -125 -265 236 10 -20 -65 -319 182 137 211 -44 -170 -7 2 -110 -45 -24 5 187 89 199
6009 199 -165 37 133 -79 227 -174 175 226 -124 197 182 62 27 -113 117 79 -324 184 152 202 59 -219
6031 -219 -115 -146 37 215 -133 49 -284 178 -16 -9 -250 -64 -108 -126 54 -376 340 -137 26 243 -237 -69
6053 -69 194 46 161 -131 -37 -57 20 -140 -15 -135 44 138 106 -84 -236 73 300 42 193 -133 -19 113
6075 113 -108 -9 63 -133 -94 -102 61 -349 -94 265 -172 -7 -40 99 -126 -142 21 170 -117 -126 83 140 -13
6098 -13 -90 -199 332 73 -39 -383 -95 -449 284 127 -26 95 281 33 -38 -272 -228 246 271 158 -71 17
6120 17 66 45 138 41 83 104 39 -160 55 50 -269 233 38 86 -276 -21 -4 -44 87 91 42 2 112 234 -378 -154
6146 -154 111 65 267 112 -74 -82 132 82 -18 -147 244 -8 -29 -28 -299 93 112 365 -124 180 158 219 -128
6169 -128 -120 -188 -111 43 -82 101 -40 -56 45 258 188 150 138 138 -43 15 -9 11 292 -354 301 25 -111 91
6193 91 -295 137 -262 -248 69 -241 7 -51 -170 -58 -115 95 212 -1 -289 -24 121 114 -110 -200 -324 255
6215 255 -234 7 -91 -113 82 -47 -104 -268 111 111 114 247 -218 7 108 50 102 153 125 -95 -40 -44 45 158 57
6240 57 204 235 -120 61 6 -10 -83 180 -32 14 237 -19 -104 -141 -17 -125 343 12 74 118 24 73 80 -33 -115
6265 -115 72 -66 -29 -145 -38 7 161 -56 115 -489 9 26 64 256 -306 -177 -59 95 132 -21 2 -284
6287 -284 260 176 150 230 -358 111 265 -112 -35 215 191 295 -62 -221 -33 -17 56 208 -42 -66 -75 202 -78
6310 -78 161 98 -211 -59 72 -125 -190 -50 -52 88 27 34 -423 167 178 108 -71 -67 -128 232 -130 99 -105 -88 392
6335 392 328 -133 -16 117 170 -82 -338 -127 -114 42 -94 -337 -223 74 -129 18 215 -112 -105 175 85 -9
6357 -9 16 -35 -96 34 53 298 -24 -194 192 -42 243 -176 -238 22 6 -77 -111 53 229 280 0 -115 -34 80
6381 80 172 -214 -77 -201 54 227 -109 139 -470 192 105 35 31 -146 -84 187 139 109 116 -69 -88 296 -47 -129
6405 -129 60 -110 218 126 -195 172 -7 168 -19 -205 -144 -106 113 -246 -82 -2 -40 -263 -78 3 -225 20
6427 20 34 182 90 -78 -482 232 79 94 -154 -107 180 79 40 -153 -254 -32 -125 62 50 104 -41 403 29
6450 29 -267 -63 86 -7 -4 38 14 53 -34 -70 122 -82 23 -106 137 -7 -229 -403 86 103 -141 14 -136
6473 -136 -52 -143 -19 135 -264 4 333 132 68 -136 -55 -156 74 224 -148 -132 84 145 282 -109 -124 -85 18
6496 18 256 93 -328 -63 -119 47 -271 52 174 -3 -61 -210 12 -63 -94 231 -53 96 -162 -156 212 252 -240
6519 -240 -222 133 90 47 -6 195 22 337 -63 49 -180 -198 -46 136 41 -46 -48 -37 2 210 -10 -125 14 24
6543 24 -99 -57 -62 103 129 -38 -110 -122 185 586 162 -154 -19 -204 30 370 277 -93 159 62 -113 -99 -94 122
6567 122 93 194 282 90 3 -173 203 -46 -369 -177 -15 -164 131 104 -61 202 -8 240 148 -264 66 121
6589 121 133 197 -136 -337 191 116 -241 -53 20 -89 70 197 67 -274 -285 100 -21 -111 -63 -221 37 120 -103
6612 -103 -354 -24 132 62 32 16 -77 -248 286 -102 394 -56 -235 -73 231 -155 -165 -75 254 129 -166 28
6634 28 -177 27 140 -105 -158 -372 -294 -25 116 -190 -342 -118 223 398 -283 -183 -156 161 -97 -183 -55 222
6656 222 312 41 -15 -285 137 -38 321 -96 -4 50 162 -299 -89 -168 135 17 -42 -6 -36 -61 -153 174 435
6679 435 -26 -244 -121 7 180 128 -170 -236 -95 165 -129 -90 57 179 -16 -69 -361 -99 202 -104 -100 245
6701 245 49 -30 -120 217 -225 21 -32 107 9 -9 -56 66 1 30 -105 -380 -103 147 280 -162 -30 144 134
6724 134 -69 112 -204 124 65 53 -16 159 -74 99 -148 215 154 -355 159 208 -231 43 -33 -228 -66 198
6746 198 179 12 -29 23 -17 35 -121 -62 -114 156 -20 88 -104 4 167 173 -33 -279 -46 270 130 -50 -26
6769 -26 -58 387 28 -170 -121 -234 48 166 -74 -92 114 102 166 10 3 -242 -49 103 -45 107 101 -120 272
6792 272 -89 -105 -109 -44 -7 330 205 -281 -49 114 301 -8 142 -260 -47 109 179 -297 -245 -80 168 73 141
6815 141 -153 46 147 -51 -33 -198 -296 208 312 -209 -328 51 78 112 -19 -136 16 18 -54 -289 24 185
6837 185 145 -9 -8 7 -65 57 -95 -256 -22 11 145 397 134 -188 -6 151 -84 138 63 81 -58 201 247
6860 247 11 -150 -46 91 199 198 -100 -123 -187 239 -27 -444 91 -98 -74 -36 51 -309 206 -39 0 80 -93
6883 -93 -159 184 63 -39 -33 -67 148 -35 28 80 37 -252 30 491 -200 -138 -95 26 104 -225 -242 72 86 132 -141
6908 -141 -4 97 -137 300 93 50 -204 -164 118 -11 -96 122 -138 -28 96 -39 -204 -88 138 249 -213
6929 -213 -200 -89 91 -49 112 -125 -55 114 244 125 -192 -190 -155 94 -64 -118 -91 92 97 -45 -210 -79 -81 50
6953 50 -87 202 24 -204 178 -97 70 -45 63 223 -14 -126 8 215 17 316 37 -249 -175 -68 57
6974 57 13 -61 -34 -210 -166 190 -144 59 16 -130 150 182 -349 -117 331 27 -91 -289 38 -62 10 -59 -347
6997 -347 197 -28 346 -28 -236 57 -223 349 -61 131 -47 17 167 183 -92 -52 -145 31 -264 -5 -213
7018 -213 30 -31 127 37 -112 -183 55 -36 226 208 33 -42 90 -28 189 -257 140 180 -168 -171 220 -284 183
7041 183 96 -51 -204 -110 198 13 24 -121 -1 474 44 97 -238 -50 -144 115 181 -36 318 99 19 201
7063 201 -29 -176 68 -100 5 -55 -51 -33 118 58 -143 -41 -60 203 -40 35 -71 -254 11 -63 -145 -148 -257 -218
7087 -218 149 242 -52 -262 -55 75 122 -98 -242 -56 -187 251 63 204 -87 59 65 21 89 8 -197 99
7109 99 203 -76 -133 190 6 -153 -50 168 -185 -201 -68 -30 -153 310 121 164 -111 -98 -74 -60 140 9 195
7132 195 -50 -49 -174 56 36 -505 50 -152 150 -352 -252 -142 -236 271 -27 -24 -177 16 19 -93 -50 57 -253
7155 -253 151 -92 -158 -107 73 91 282 -66 -105 177 -155 -53 -222 28 -64 229 127 -222 84 -85 147 67
7177 67 -83 135 -77 87 227 42 53 -257 -42 -230 -12 62 -75 -156 34 76 48 -195 -117 6 -194 36
7199 36 43 -214 137 256 109 -76 120 168 238 -129 20 -42 13 -63 46 -176 -26 -40 245 -114 -51 -93 80 194
7223 194 269 85 -63 105 -190 -35 118 -12 0 -39 -83 225 55 -81 107 161 -112 -54 -295 -219 -2 108
7245 108 19 -77 162 -228 209 -121 -103 -174 216 -70 -323 -200 1 -14 438 -67 -147 -315 20 -92 163 -126
7267 -126 -95 -365 85 -125 150 21 -33 317 -54 105 -243 125 100 2 141 -7 -245 -112 -59 58 -154 98
7289 98 8 138 124 -55 -116 109 19 22 -146 -391 -38 -210 -73 -190 -141 -182 -74 287 88 51 -80 210 157 64
7313 64 -125 -148 -238 122 82 -127 -183 194 209 121 227 -26 -80 183 138 -186 -170 -157 148 -26 -10 49 -143 -32
7337 -32 48 43 -188 -158 12 47 144 -38 -290 -265 130 373 -14 128 -273 26 -76 122 -128 -33 330 164 81
7360 81 -336 -135 43 56 260 -131 -40 -118 127 156 -400 -103 -133 56 77 -254 -193 -143 -21 296 -358 -104 -141
7383 -141 68 -128 72 -254 -86 41 -11 62 4 76 -19 -5 52 13 -86 -180 116 401 -169 -266 -124 374 54 -87
7407 -87 -83 -238 71 262 -141 -45 62 -89 74 -19 13 1 105 -122 107 -104 -159 58 520 -71 96 -125 148
7430 148 251 370 -113 -354 -233 -46 60 -26 -329 -56 157 42 87 -176 -150 23 209 197 106 3 73 261
7452 261 -40 -223 -191 -226 29 -70 208 -272 -288 -45 -82 109 -218 -105 -51 211 124 -1 -92 158 24 -47 -63
7475 -63 -218 176 -25 -123 117 12 -50 206 101 313 -4 -54 93 117 42 -407 -299 81 59 101 -35 88 -12
7498 -12 174 45 258 -227 40 -43 114 106 -7 48 18 27 219 -376 133 77 254 153 -12 15 16 -26 60 28 -17
7523 -17 226 148 264 -66 -36 99 391 102 -91 -192 -38 294 261 81 82 60 -116 190 -16 -109 -153 85 18
7546 18 -295 -86 -167 178 8 151 55 -16 -17 95 71 71 -176 146 -65 -32 4 -192 126 228 -41 -29 -264 19
7570 19 -18 -76 95 -59 110 45 -9 -308 -149 284 47 -53 198 -50 -329 44 140 63 87 -217 90 -220 -7
7593 -7 92 61 -64 -201 -129 -250 -30 62 -65 25 -130 -275 -99 121 -218 -87 -153 52 40 106 -71 -11 214 51
7617 51 74 146 -81 -136 13 227 144 -115 -213 -102 111 67 148 -397 102 428 130 -8 -172 -9 -36 314 319 -180
7641 -180 -139 -24 176 208 60 -50 45 170 217 69 -224 -223 -122 15 -306 -427 -319 135 497 31 -285 -182
7663 -182 135 80 33 49 340 74 -22 120 60 -279 164 134 -45 -72 -323 -186 115 21 -98 -11 -46 -104 210 63
7687 63 6 -68 61 99 133 -141 -273 67 235 207 -195 -185 -290 18 30 0 -174 90 164 -55 -76 -141 -245 120
7711 120 70 -163 -80 -52 -111 95 -21 -65 -107 -58 228 93 -14 12 -165 79 -26 -45 -127 -24 -50 -107 50 -72
7735 -72 147 160 -47 114 42 8 -46 148 115 -167 -374 33 -114 117 -1 177 -159 -59 105 135 -165 -107 -71
7758 -71 -34 147 -345 -38 99 127 227 -187 -26 160 73 -142 91 -80 -282 -153 -4 -135 -265 0 -2 87
7780 87 -80 2 -129 327 -51 -72 -156 -144 369 199 174 -128 243 284 -90 62 137 55 -169 345 213 48 -81
7803 -81 -266 265 -253 -176 -13 -50 -26 206 144 -170 -157 -21 1 -1 -66 112 217 163 -151 -71 -201 36 -260 30
7827 30 -146 -171 151 -33 63 -181 -88 -150 10 190 -417 -286 154 119 54 107 68 -172 -10 138 -83 24 -326
7850 -326 187 114 174 -73 47 135 185 -10 183 -280 -97 86 -5 -180 -257 171 -185 43 -177 -90 -77 -220 155
7873 155 159 -274 -165 -111 267 -22 -358 -199 134 -81 -494 -103 -9 16 142 126 -11 -69 47 -131 132 49 -195
7896 -195 173 155 62 16 54 -322 212 38 -32 -5 86 -97 -11 -136 -159 47 18 107 -45 -37 -180 33 78 119 -15
7921 -15 -28 74 -63 327 -217 -66 66 -300 160 81 -29 -284 -49 156 -177 -148 -55 55 324 -248 -130 -118
7943 -118 71 -39 -84 -129 -107 -41 29 346 6 -154 -243 -188 181 35 10 -324 -60 51 82 21 -133 94 296
7966 296 18 236 6 -143 -45 161 -59 -402 -138 -125 233 31 45 92 5 96 -124 -101 65 222 -181 -72
7988 -72 -22 -29 0 43 194 128 67 124 253 290 -62 51 104 289 161 -6 80 -62 131 43 -112 71 116 -240 172
8013 172 -17 187 69 -193 248 277 77 152 58 -17 9 -467 27 89 45 162 39 -271 -186 -99 81 26 -68 108
8037 108 -121 263 -33 -268 -181 204 353 44 30 -315 -123 134 5 144 -151 58 -255 100 114 -54 161
8058 161 -276 -18 0 -140 -96 25 90 -232 212 147 141 -51 -14 176 -100 81 -96 148 243 -174 -129 383 132
8081 132 -268 32 30 -232 284 -71 -97 -65 -260 326 9 -78 -226 -120 13 189 -110 -207 -139 163 138 20 -5
8104 -5 213 -82 42 -52 -30 -20 95 -220 -246 76 119 -200 24 -166 -234 75 35 384 104 -66 -168 18 222
8127 222 215 -82 125 83 -90 -6 -14 -52 -232 -38 57 -121 -75 -104 187 233 34 -279 53 23 -74 214 -264 -160
8151 -160 82 137 -80 -80 -46 -79 -55 48 -15 96 296 323 255 -184 -101 -101 15 205 -170 -152 -208 -53 181 -1 51
8176 51 129 -104 -11 23 5 -102 -152 120 128 -113 33 -68 -30 283 -14
8191a4
##END NTUPLES=NMR FID
##END=
