##TITLE=1H_Pr 5255
 200.13MHz, CDCl3,
 24 sc
 
 14.1.2025
##JCAMPDX= 6.0         $$ Bruker NMR JCAMP-DX V2.0
##DATA TYPE= NMR FID
##DATA CLASS= NTUPLES
##ORIGIN= UXNMR, Bruker Analytische Messtechnik GmbH
##OWNER= pz
$$ XWIN-NMR		Version 3.5
$$ Tue Jan 14 16:09:12 2025 Russian Standard Time (UT+4h)  she@DPX200
##.OBSERVE FREQUENCY= 200.1311
##.OBSERVE NUCLEUS= ^1H
##.DELAY= (6, 6)
##.ACQUISITION MODE= SIMULTANEOUS
##.ACQUISITION SCHEME= undefined
##.AVERAGES= 8
##.DIGITISER RES= 18
##SPECTROMETER/DATA SYSTEM= spect
##.PULSE SEQUENCE= zg30
##.SOLVENT NAME= CDCl3
##.SHIFT REFERENCE= (INTERNAL, CDCl3, 0, 14.3821)
##AUDIT TRAIL= $$ (NUMBER, WHEN, WHO, WHERE, WHAT)
$$ ##TITLE= Audit trail, XWIN-NMR		Version 3.5
$$ ##JCAMPDX= 5.01
$$ ##ORIGIN= Bruker BioSpin GmbH
$$ ##OWNER= she
$$ F:/spectra/data/she/nmr/H-C/1/audita.txt
$$ ##AUDIT TRAIL=  $$ (NUMBER, WHEN, WHO, WHERE, WHAT)
(   1,<2025-01-14 16:08:03.73 +0400>,<she>,<DPX200>,
      <created by zg, POWCHK disabled, PULCHK disabled
       configuration hash MD5:
       00 E9 B6 7A A2 85 ED C7 34 08 36 98 17 FE 4E 26
       data hash MD5: 16K
       99 AE F7 AA 18 DD 2F 5E F4 52 B8 AC C9 FC 48 BA>)
$$ ##END=
$$ 
$$ hash MD5
$$ E4 F8 CB E1 29 BA 8B 8D 34 49 B7 91 23 A0 BB 03
##$RELAX= 
##$RELAX= 
##$RELAX= 
##$RELAX= 
##$RELAX= 
##$RELAX= 
$$ Bruker specific parameters
$$ --------------------------
##$DU= <F:/spectra>
##$EXPNO= 1
##$NAME= <H-C>
##$PROCNO= 1
##$TYPE= <nmr>
##$USER= <she>
##$AMP= (0..31)
100 100 100 100 100 100 100 100 100 100 100 100 100 100 100 100 100 100 
100 100 100 100 100 100 100 100 100 100 100 100 100 100 
##$AQSEQ= 0
##$AQ_mod= 1
##$AUNM= <au_zg>
##$AUTOPOS= <>
##$BF1= 200.13
##$BF2= 200.13
##$BF3= 200.13
##$BF4= 200.13
##$BF5= 200.13
##$BF6= 200.13
##$BF7= 200.13
##$BF8= 200.13
##$BYTORDA= 1
##$CFDGTYP= 0
##$CFRGTYP= 5
##$CHEMSTR= <none>
##$CNST= (0..31)
1 1 145 1 1 1 1 1 1 1 1 1 1 1 1 1 1 1 1 1 1 1 1 1 1 1 1 1 1 1 1 1 
##$CPDPRG= <>
##$CPDPRG1= <>
##$CPDPRG2= <>
##$CPDPRG3= <>
##$CPDPRG4= <mlev>
##$CPDPRG5= <mlev>
##$CPDPRG6= <mlev>
##$CPDPRG7= <mlev>
##$CPDPRG8= <mlev>
##$CPDPRGB= <>
##$CPDPRGT= <>
##$D= (0..31)
0 0.7 0 0 0 0 0 0 0 0 0 0.03 0 0 0 0 0 0 0 0 0 0 0 0 0 0 0 0 0 0 0 0 
##$DATE= 1736856482
##$DBL= (0..7)
120 120 120 120 120 120 120 120 
##$DBP= (0..7)
150 150 150 150 150 150 150 150 
##$DBP07= 0
##$DBPNAM0= <>
##$DBPNAM1= <>
##$DBPNAM2= <>
##$DBPNAM3= <>
##$DBPNAM4= <>
##$DBPNAM5= <>
##$DBPNAM6= <>
##$DBPNAM7= <>
##$DBPOAL= (0..7)
0.5 0.5 0.5 0.5 0.5 0.5 0.5 0.5 
##$DBPOFFS= (0..7)
0 0 0 0 0 0 0 0 
##$DE= 6
##$DECBNUC= <off>
##$DECIM= 32
##$DECNUC= <off>
##$DECSTAT= 4
##$DIGMOD= 1
##$DIGTYP= 9
##$DL= (0..7)
0 120 120 120 120 120 120 120 
##$DP= (0..7)
150 150 150 150 150 150 150 150 
##$DP07= 0
##$DPNAME0= <>
##$DPNAME1= <>
##$DPNAME2= <>
##$DPNAME3= <>
##$DPNAME4= <>
##$DPNAME5= <>
##$DPNAME6= <>
##$DPNAME7= <>
##$DPOAL= (0..7)
0.5 0.5 0.5 0.5 0.5 0.5 0.5 0.5 
##$DPOFFS= (0..7)
0 0 0 0 0 0 0 0 
##$DQDMODE= 0
##$DR= 18
##$DS= 0
##$DSLIST= <SSSSSSSSSSSSSSS>
$$ [...]
##$SUBNAM0= <"">
##$SUBNAM1= <"">
##$SUBNAM2= <"">
##$SUBNAM3= <"">
##$SUBNAM4= <"">
##$SUBNAM5= <"">
##$SUBNAM6= <"">
##$SUBNAM7= <"">
##$SUBNAM8= <"">
##$SUBNAM9= <"">
##$SW= 18.051750892319
##$SWIBOX= (0..15)
0 0 2 0 0 0 0 0 0 0 0 0 0 0 0 0 
##$SW_h= 3612.71676300578
##$TD= 16384
##$TD0= 1
##$TE= 0
##$TE2= 300
##$TE3= 300
##$TEG= 300
##$TL= (0..7)
0 120 120 120 120 120 120 120 
##$TP= (0..7)
150 150 150 150 150 150 150 150 
##$TP07= 0
##$TPNAME0= <>
##$TPNAME1= <>
##$TPNAME2= <>
##$TPNAME3= <>
##$TPNAME4= <>
##$TPNAME5= <>
##$TPNAME6= <>
##$TPNAME7= <>
##$TPOAL= (0..7)
0.5 0.5 0.5 0.5 0.5 0.5 0.5 0.5 
##$TPOFFS= (0..7)
0 0 0 0 0 0 0 0 
##$TUNHIN= 0
##$TUNHOUT= 0
##$TUNXOUT= 0
##$USERA1= <user>
##$USERA2= <user>
##$USERA3= <user>
##$USERA4= <user>
##$USERA5= <user>
##$V9= 5
##$VALIST= <valist>
##$VCLIST= <CCCCCCCCCCCCCCC>
##$VD= 0
##$VDLIST= <DDDDDDDDDDDDDDD>
##$VPLIST= <PPPPPPPPPPPPPPP>
##$VTLIST= <TTTTTTTTTTTTTTT>
##$WBST= 1024
##$WBSW= 4
##$XGAIN= (0..3)
0 0 0 0 
##$XL= 0
##$YL= 0
##$YMAX_a= 287115
##$YMIN_a= -432541
##$ZGOPTNS= <>
##$ZL1= 120
##$ZL2= 120
##$ZL3= 120
##$ZL4= 120
##$ABSF1= 10
##$ABSF2= 0
##$ABSG= 5
##$ABSL= 3
##$ALPHA= 0
##$AQORDER= 0
##$ASSFAC= 0
##$ASSFACI= 0
##$ASSFACX= 0
##$ASSWID= 0
##$AUNMP= <proc_1d>
##$AZFE= 0.1
##$AZFW= 0.1
##$BCFW= 1
##$BC_mod= 2
##$BYTORDP= 1
##$COROFFS= 0
##$CY= -3
##$DATMOD= 1
##$DC= 2
##$DFILT= <>
##$DTYPP= 0
##$F1P= 0
##$F2P= 0
##$FCOR= 0.5
##$FTSIZE= 0
##$FT_mod= 4
##$GAMMA= 1
##$GB= 0.15
##$INTBC= 1
##$INTSCL= 1
##$ISEN= 128
##$LB= 0.25
##$LEV0= 0
##$LPBIN= 0
##$MAXI= 10000
##$MC2= 0
##$MEAN= 0
##$ME_mod= 0
##$MI= 1.114404
##$NCOEF= 0
##$NC_proc= 0
##$NLEV= 6
##$NOISF1= 3.799351
##$NOISF2= 2.8
##$NSP= 1
##$NTH_PI= 0
##$NZP= 0
##$OFFSET= 14.38212
##$PC= 1
##$PHC0= 250.4899
##$PHC1= 4.59222
##$PH_mod= 1
##$PKNL= yes
##$PPARMOD= 0
##$PSCAL= 0
##$PSIGN= 0
##$REVERSE= no
##$SF= 200.129724274929
##$SI= 16384
##$SIGF1= 3
##$SIGF2= 2
##$SINO= 400
##$SIOLD= 16384
##$SREGLST= <1H.CDCl3>
##$SSB= 0
##$STSI= 0
##$STSR= 0
##$SW_p= 3205.1282051282
##$SYMM= 0
##$S_DEV= 0
##$TDeff= 0
##$TDoff= 0
##$TI= <>
##$TILT= no
##$TM1= 0
##$TM2= 0
##$TOPLEV= 0
##$USERP1= <user>
##$USERP2= <user>
##$USERP3= <user>
##$USERP4= <user>
##$USERP5= <user>
##$WDW= 1
##$XDIM= 8192
##$YMAX_p= 0
##$YMIN_p= 0
$$ End of Bruker specific parameters
$$ ---------------------------------
##NTUPLES= NMR FID
##VAR_NAME=  TIME,          FID/REAL,        FID/IMAG
##SYMBOL=    X,             R,               I
##VAR_TYPE=  INDEPENDENT,   DEPENDENT,       DEPENDENT
##VAR_FORM=  AFFN,          ASDF,            ASDF
##VAR_DIM=   8192,          8192,            8192
##UNITS=     SECONDS,       ARBITRARY UNITS, ARBITRARY UNITS
##FACTOR=    0.0002768,     1,               1
##FIRST=     0,             0,               0
##LAST=      2.2672688,     0,               0
##MIN=       0,             -432541,         0
##MAX=       2.2672688,     287115,          0
$$ Real data points
##PAGE= N=1
##DATA TABLE= (X++(R..R)), XYDATA
$$ [...]
$$ plain form
1993 330 -417 -356 -196 -785 -364 61 47 -63 764 221 -63 331 -124 -819 69 316 -108 436 701 370 -254
2014 -254 267 -41 -711 146 155 0 356 837 251 -59 463 -153 -611 247 111 -33 522 591 183 1 186
2035 186 -310 -659 -6 260 -148 464 352 9 -37 362 -218 -643 -104 -292 -112 628 564 36 92 164 -457
2056 -457 -604 -113 21 -160 425 343 175 83 -157 -471 -353 155 -357 -215 224 378 -226 75 103 -300 -264
2077 -264 -62 -570 -615 263 -145 -256 230 134 -670 -273 -336 -543 -194 332 69 -337 409 -53 -461 27 109
2098 109 -432 -177 636 61 -249 13 -173 -548 117 65 -40 158 824 -185 -19 370 -228 -328 176 153
2118 153 -77 308 469 -309 48 283 -405 -294 353 103 -359 223 -155 -422 164 344 -179 4 466 79
2138 79 -353 211 -288 -98 226 459 -36 -39 42 -464 -299 369 22 -329 138 125 -379 -113 211 -34 -200 1
$$ packed form
1993C30p47O1J60n89M21M25j4j10Q27n43k84L94m55o95Q88K47m24N44K65l31o24
2014b54N21l08o70Q57Rj55L56M81n86l10N22o16m58Q58j36j44N55O9m08j82J85
2035A86m96l49O53K66m08O12j12l43m6L99n80m25N39j88J80P40o4n28N6P2o21
2056d57j47M91J34j81N85q2j68r2k40l14J18N08n12J42M39J54o04L01K8m03L6
2077b64K02n08m5Q78m08j11M86r6q04L97o3k07L49N26k63m06P46m62m08M88Q2
2098A09n41K55Q13n75l10K62j86l75O65n2j05J98O66j009J66L89n98j00N04k3
2118A53k30L85J61p78L57K35o88J11O47k50m62N82l78k67N86J80n23J83M62l87
2138G9m32N64m99J90L24K33m95lQ1n06J65O68l47l51M67j3n04K66L24k45j66K01
$$ plain form
2160 1 40 -285 87 8 -521 99 432 105 -85 752 -113 -496 112 -326 -256 110 200 -259 79 340 -466 -177
2182 -177 136 71 -205 390 408 -65 149 182 -308 -344 557 312 -24 344 115 -227 80 135 -150 150 537 -131
2204 -131 -182 273 -237 -232 430 257 -307 182 42 -318 -104 317 44 93 319 130 -10 -12 169 -306 -134 349
2226 349 137 49 713 -114 -494 -26 42 -396 209 607 295 -22 118 -488 -625 -125 54 -471 287 255 82
2247 82 -197 -60 -362 -223 -37 -105 -71 690 355 -263 -3 487 75 -96 229 -379 -318 73 21 -420 379 405
2269 405 -282 -220 188 -331 -356 168 -112 199 555 -71 -382 -231 -154 -496 -510 321 61 62 712 260 -616 -155
2291 -155 -93 -433 -218 462 364 -251 -215 212 -322 -183 -88 -185 103 293 369 -28 77 90 -74 245 268 -293 -281
2314 -281 -159 -195 -25 397 67 72 408 22 -238 -136 429 -188 -223 206 205 10 340 -150 -619 -165 164 -31
$$ packed form
2160AL9l25L72p9n29O20L33l27j90Q37q65l83O08m38P0L66R0m59L38K61q06K89
2182a77L13o5k76N95J8m73K14L3m90l6R01k45l36L68k29l42L07N5k85L00L87o68
2204a31n1M55n10NO62j73n64M89j40l60K14M21k73M9K26j89j40kJ81m75J72M83
2226C49k12q8O64q27l80M68O8m38O05L98l12l17J40o06j37N00J79n25P58l2j73
2247H2k79J37l02J39J86o8L4P61l35o18K60M90m12j71L25o08O1L91n2m41P99K6
2269D05o87O2M08n19k5N24k80L11L56o26l11J51P7l42j4Q31k60JO50m52q76M61
2291a55O2l40K15O80r8o15L6M27n34J39R5r7K88J90P6l97J05J3j64L19K3n61J2
2314b81J22l6J70M22l30NL36l86k60J02N65o17l5M29jj95L30m90m69M54L29j95
$$ plain form
2336 -31 304 303 507 -271 87 -232 -52 245 -65 -246 -27 279 -251 -277 92 -174 -138 289 355 -283 231 -158
2358 -158 -449 -145 37 -122 -136 293 -192 -393 96 -65 -75 104 229 143 -224 208 -380 -379 -54 71 -67 409
2380 409 276 359 -175 54 192 -36 72 -206 -110 122 -92 -262 -33 180 -229 4 225 396 -446 163 331
2401 331 -42 90 297 29 46 83 -274 -132 71 138 0 388 112 -178 -101 139 -257 -72 -40 289 -75 207
2423 207 16 -341 -5 164 -172 -108 315 168 -115 599 -59 -405 -60 -286 119 189 21 -60 -312 -22 -215
2444 -215 -236 0 28 -555 -31 255 -241 129 281 -132 -278 23 106 -134 -67 78 -161 -19 64 5 -403 193
2466 193 -216 -191 412 400 -35 -23 417 -395 -217 33 -126 -359 91 119 -159 210 57 9 -74 169 -182 -32
2488 -32 135 367 -205 -84 61 -356 -14 -34 -327 -153 123 378 -23 112 12 -479 -172 210 -271 -38 160
$$ packed form
2336c1L35jK04p78L58l19J80K97l10j81K19L06n30k6L69k66L6M27O6o38N14l89
2358a58k91L04J82j59j4M29m85k01M89j61j0J79J25q6l67M32n88JL25J25j38M76
2380D09j33Q3n34K29J38k28J08k78R6K32k14j70K29K13m09K33K21J71q42O09J68
2401C31l73J32K07k68J7L7l57J42K03O7j38L88k76k90P7K40l96J85L2L29l64K82
2423B07j91l57L36J69l36O4M23j47k83P14o58l46L45k26M05P0j68q1k52K90j93
2444b15k1K36K8n83N24K86m96L70J52m13j46L01Q3k40O7J45k39J42Q3n9m08N96
2466A93m09K5O03j2m35J2M40q12J78K50j59k33M50K8k78L69j53m8q3K43l51J50
2488c2J67K32n72J21J45m17L42k0k93J74K76K55m01J35j00m91L07L82m81K33J98
$$ plain form
2509 160 392 -96 -88 -49 -455 -99 95 -345 -53 377 -188 -446 138 197 -339 217 162 -372 -62 264 -5 -85
2531 -85 201 154 -168 81 56 -8 -39 30 139 -118 350 -265 -201 -1 -379 -410 190 182 -188 -27 273 -64 -372
2554 -372 -262 -169 -127 77 149 -437 122 167 -236 -653 104 -144 -408 157 -139 -6 208 275 -288 -407 36 -27
2576 -27 9 447 93 -101 124 239 -143 44 20 11 -209 203 -186 49 76 178 -421 -54 -152 -249 -91 388 -309
2599 -309 95 431 308 -296 21 -89 -316 -26 199 154 45 320 -199 -156 8 -44 -205 162 496 207 162
2620 162 253 -189 -212 -199 -138 -250 178 130 -117 27 330 -354 111 -73 -146 -431 113 20 -74 86 -6 49 119 176
2644 176 -221 -171 31 105 55 181 242 204 -198 208 -158 -39 33 -210 51 486 150 -279 -177 -65 -442 -70
2666 -70 66 66 191 395 56 -259 26 -43 -66 100 378 277 -3 206 -36 -261 -185 -92 -182 465 30 -241 -20
$$ packed form
2509A60K32m88QL9m06L56J94m40K92M30n65k58N84N9n36N56n5n34L10L26k69q0
2531h5K86m7l22K49k5o4l1O9J09k57M68o15O4K00l78l1O00ql70J61L00l37l08
2554c72J10R3M2K04P2n86N59M5m03m17P57k48k64N65k96J33K14O7n63j19M43o3
2576b7L6M38l54j94K25J15l82J87k4rk20M12l89K35K7J02n99L67r8r7J58M79o97
2599c09M04L36j23o04L17j10k27K90K25m5j09K75n19M3J64n2j61L67L34k89m5
2620A62R1m42k3J3O1j12M28m8k47J44L03o84M65j84p3k85N44r3r4J60r2N5P0N7
2644A76l97N0K02P4n0J26O1l8m02M06l66J19P2k43K61M35l36m29J02J12l77L72
2666g0J36%J25K04l39l15K85o9k3J66K78j01k80K09k42k25P6R3r0O47m35k71K21
$$ plain form
2689 -20 425 172 31 164 59 -105 -52 196 -115 158 240 -39 -22 246 33 -56 -5 75 -120 -28 394 84 70
2712 70 217 26 -244 131 -10 -102 69 474 18 25 383 -149 -217 211 204 -127 259 -21 -27 9 177 -6 -258
2735 -258 341 -102 -305 278 0 -186 -39 136 111 -259 53 -195 -231 -101 -73 -81 203 403 -191 -49 73 -124
2757 -124 -396 247 130 48 323 3 -52 173 12 -177 -336 180 -66 -193 309 -276 -176 -85 -89 -119 -135 14
2779 14 -101 -139 250 94 -455 78 -20 -111 -199 264 -251 178 268 100 121 -46 -2 -479 -184 -219 -225 109 326 -38
2803 -38 -68 134 65 -433 63 -99 8 183 451 221 -25 64 -282 -386 79 -42 107 183 461 179 -53 -43
2825 -43 -382 -13 114 -180 -141 236 228 92 -175 86 -313 -259 -125 -171 65 282 256 -92 18 71 -77 -234 26
2848 26 -368 56 100 -44 25 90 94 -204 -133 31 -45 -232 -158 129 68 128 181 -182 -162 -206 -317 -143 383 -189 -115
$$ packed form
2689b0M45k53j41J33j05j64N3K48l11K73Q2k79J7K68k13q9N1Q0j95R2M22l10j4
2712G0J47j91k70L75j41r2J71M05m56PL58n32o8M28pl31L86k80oL6J68j83k52
2735b58N99m43k03N83k78j86J47J75k5l70L12k48l6J30K8qK84K00n94J42J22j97
2757a24k72O43j17q2K75l20n5K25j61j89j59N16k46j27N02n85J00R1ml0j6J49
2779A4j15l8L89j56n49N33r8r1q8M63n15M29R0j68K1j67M4m77K95l5oL34K17l64
2803c8l0K02o9m98M96j62J07J75K68k30k46Q9l46j04M65j21J49P6K78k82k32J0
2825d3l39L69J27k94L9L77qj36k67K61l99N4J34m6K36K17k6l48J10N3j48j57K60
2848B6l94M24M4j44O9O5Mk98P1J64p6j87P4K87o1O0N3l63K0m4j11J74N26n72P4
$$ plain form
2873 -115 157 114 -202 -385 58 -109 150 223 118 -30 108 -46 -250 -152 -101 -2 -128 115 59 -113 186 115
2895 115 62 184 -143 -341 123 58 84 31 80 92 -253 -221 -61 -227 107 179 53 151 37 -84 -38 128 163 -222
2919 -222 183 41 -113 114 187 -46 -24 172 -252 -120 -11 39 -243 470 160 -23 87 110 -332 -291 -18 -25
2941 -25 -156 421 -45 -452 -49 303 -290 -237 73 76 -144 309 38 -75 69 222 -40 102 101 0 -26 382
2963 382 149 -153 185 101 57 -31 57 13 164 422 92 20 85 36 -116 134 320 -185 -53 402 -171 -122 173
2986 173 -162 -48 84 238 3 39 295 133 -389 -275 -200 -394 -95 216 -256 246 189 -153 137 32 2
3007 2 -40 204 -62 -26 23 296 7 49 5 128 -224 -16 22 -278 117 8 -74 -69 225 -63 279 245 -413 -457
3031 -457 74 -195 -325 127 53 -197 -191 43 -200 4 134 34 -9 -52 -83 -137 209 -72 137 96 187 -224 -308
$$ packed form
2873a15K72m3l16j83M43j67K59P3j05j48J38j54k04R8N1R9j26K43n6j72K99p1
2895A15n3J22l27j98M64o5K6n3M9J2l45L2J60j66L34P2j26R8j14j21M6J66L5l85
2919b22M05j42j54K27P3k33K2J96m24J32J09N0k82P13l10j83J10K3m42M1K73p
2941b5j31N77m66m07M03L52n93N3L10Lk20M53k71j13J44J53k62J42jj01k6M08
2963C82k33l02L38q4m4q8Q8m4J51K58l30p2O5m9j52K50J86n05J32M55n73M9K95
2986A73l35J14J32J54k35L6K56j62n22J14P5j94K99L11m72N02n7l42K90j05l0
3007Bm2K44k66L6M9K73k89M2m4J23l52K08L8l00L95j09q2NK94k88L42l4o58m4
3031d57N31k69j30M52p4k50OK34k43K04J30j00m3m3l1n4L46k81K09m1R1m11q4
$$ plain form
3054 -308 418 92 -423 -217 177 -355 -250 51 -198 25 45 -194 -7 136 15 -261 262 220 -125 41 320
3075 320 82 -22 4 183 -292 -25 114 -96 362 228 -30 88 -132 -165 -283 -14 353 23 409 287 -245
3096 -245 -115 67 -107 -345 284 248 8 167 -195 -57 -115 119 -203 -111 271 -77 -39 280 282 -108 10 108
3118 108 -128 29 9 -73 -42 369 -89 -141 148 198 -157 -288 17 118 -134 203 73 -286 238 20 -449 -101
3140 -101 131 -309 -55 -30 162 -19 -169 110 -393 -109 312 -96 -143 247 -301 -212 -135 -338 -134 -63 221 -239
3162 -239 42 126 -245 -120 32 64 -20 294 197 -196 -194 270 102 116 174 75 -209 83 85 -353 -15 323 -379 -189
3186 -189 -35 -337 9 505 -114 125 114 150 -159 50 438 -104 -140 552 -100 138 92 -12 -63 -39 -5 -154
3208 -154 186 152 36 -52 130 -241 -119 -80 23 -112 32 328 8 -126 -209 -137 -264 149 -40 -203 -116 161
$$ packed form
3054c08P26l26n15K06L94n32J05L01k49K23K0k39J87J43j21k76N23m2l45J66K79
3075C20k38j04K6J79m75K67J39k10M58j34k58J18k20l3j18K69L67l30L86j22n32
3096b45J30J82j74k38O29l6k40J59l62J38n8K34l22R2L82l48L8L19Kl90J18R8
3118A08k36J57k0q2L1M11m58n2K89N0l55j31L05J01k52L37j30l59N24k18m69L48
3140a01K32m40K54K5J92j81j50K79n03K84M21m08m7L90n48Q9P7k03K04P1K84m60
3162b39K81Q4l71J25J52L2q4L14r7l93KM64j68J4N8r9k84K92Km38L38L38p02J90
3186a89J54l02L46M96o19K39j1L6l09K09L88n42l6O92o52K38m6j04n1K4L4j49
3208a54L40l4j16q8J82l71J22L9J03j35J44K96l20j34q3P2j27M13j89j63Q7K77
$$ plain form
3230 161 -155 4 299 94 -100 -44 248 23 386 148 -407 12 426 165 126 316 -21 -246 156 158 -328
3251 -328 201 222 -95 131 28 -92 216 -53 -74 -152 253 -36 -13 -74 18 83 -190 296 321 -222 61 -66 -45
3274 -45 -114 238 -229 -86 84 -98 -336 39 -74 -88 237 265 -62 23 103 -202 118 127 178 -267 141 45 -132
3297 -132 142 52 88 236 254 -277 8 229 132 2 34 17 -246 -198 50 -90 199 267 63 -132 -61 172 -137
3320 -137 -155 93 -64 -17 -1 -20 -217 98 327 -135 -85 165 -659 -406 100 -120 -366 175 123 151 -27 120
3342 120 -132 88 -73 260 273 367 109 -289 35 53 -334 -98 114 134 96 -67 -76 -17 233 51 -438 357 385
3365 385 -210 243 362 -154 -244 264 342 -138 170 68 -236 -72 134 -40 137 156 151 0 -57 138 -289 61
3387 61 85 -46 64 370 -8 -47 -104 -291 -135 220 81 -78 -111 40 -47 -432 25 167 -113 221 53 -254
$$ packed form
3230A61l16J59K95k05j94N6K92k25L63k38n55M19M14k61l9J90l37k25M02Km86
3251c28N29K1l17K26j03j20L08k69k1p8M05k89K3o1R2O5k73M86K5n43K83j27K1
3274d5o9L52m67J43J70j82k38L75j13j4L25K8l27Q5Q0l05L20RN1m45M08r6j77
3297a32K74r0L6J48J8n31K85K21r7j30L2j7k63M8K48j40K89O8k04j95P1K33l09
3320a37j8K48j57M7J6j9j97L15K29m62N0K50q24K53N06k20k46N41n2K8j78J47
3342A20k52K20j61L33J3R4k58l98L24J8l87K36K12K0l8j63rN9K50j82m89P95K8
3365C85n95M53J19n16r0N08P8m80L08j02l04J64K06j74J77J9nj51n7J95m27L50
3387F1K4j31J10L06l78l9n7j87J56L55j39j59l3J51q7l85M57J42k80L34j68l07
$$ plain form
3409 -254 236 -146 -202 -211 299 107 -66 142 -243 -368 218 -161 30 216 378 -73 -245 -91 0 72 176 196
3431 196 -35 262 58 -117 30 -139 -60 -93 294 221 -223 33 236 -172 -158 230 -45 174 308 66 -259
3452 -259 -17 -90 -138 -76 315 -160 -347 272 -134 -58 233 -84 -62 256 -73 -316 361 78 75 -69 345 373 -1
3475 -1 341 -189 -147 -167 175 42 250 354 216 17 -195 103 -351 -100 -11 -138 141 51 -20 -175 123 -323
3497 -323 -558 249 -104 -276 21 186 147 -153 219 -42 -174 280 137 -147 2 63 52 -154 331 -123 -168
3518 -168 -207 121 -45 82 255 87 65 132 22 -49 74 121 67 -89 -4 -237 -52 149 -131 -271 218 -158
3540 -158 -37 147 240 -52 129 -28 -91 12 437 -21 -68 271 -13 15 -154 141 -279 -73 93 -334 108
3561 108 242 -166 -595 188 136 -141 160 333 -94 86 164 192 3 73 -157 -358 -135 -66 -111 175 102 24 -85
$$ packed form
3409b54M90l82n6rN10j92j73K08l85j25N86l79J91J86J62m51j72J54R1P2J04K0
3431A96k31K97k04j75J47j69P9l3L87p3m44K56K03m08J4L88k75K19J34k42l25
3452b59K42p3m8O2L91m75j87O19m06P6K91l17K2L18l29k43O77k83lj44M14K8l74
3475aL42n30M2k0L42j33K08J04j38j99k12K98m54K51Q9j27K79r0p1j55K98m46
3497c23k35Q07l53j72K97J65l9l00L72k61j32M54j43k84J49O1j1k06M85m54m5
3518a68l9L28j66J27J73j68k2O7j10p1J23M7n4j56Q5k33J85K01k80j40M89l76
3540a58J21J84R3k92J81j57o3J03M25m58m7L39k84K8j69K95m20K06J66m27M42
3561A08J34m08m29P83n2k77L01J73m27J80P8K8j89P0k30k01K23O9m5K86p3p8j09
$$ plain form
3584 -85 304 -205 -332 74 155 102 164 354 -111 -39 284 -131 -680 214 57 -66 533 37 -79 -190 11 -474
3606 -474 -134 -48 -35 -187 412 103 -51 -150 -11 127 -226 244 -126 -202 619 236 352 -115 337 -15 -174
3627 -174 182 55 -112 39 160 -48 387 -19 86 -178 -61 -194 65 254 197 -84 197 12 -188 72
3647 72 94 -273 -251 378 227 -234 134 47 -268 249 135 -193 158 260 172 32 -31 -6 -514 192 47 -233
3669 -233 307 183 70 43 195 -191 124 -41 67 -254 6 91 76 -44 303 -38 -150 160 -271 -141 264
3690 264 196 -66 353 449 9 -85 51 -170 -87 131 290 -165 263 347 -201 -120 -323 -137 -94 -4 42 -2 -27 -54
3714 -54 100 -152 56 -265 -352 333 -13 -116 205 -43 -201 220 166 -14 -48 528 34 -9 358 -46 -242 237
3736 237 115 -486 35 295 -200 55 70 -122 143 61 -178 -367 -158 105 -152 23 240 144 -373 25 -43
$$ packed form
3584h5L89n09j27M06Q1n3O2J90m65P2L23m15n49Q94j57j23N99m96j16j11K01m85
3606d74L40Q6J3j52N99l09j54r9J39J38l53M70l70p6Q21l83J16m67M52l52j59
3627a74L56j27j67J51J21k08M35m06J05k64J17j33K59J89n7k81K81j85k00K60
3647G2K2l67K2O29j51m61L68q7l15N17j14l28L51J02q8j40o3K5n08P06j45k80
3669b33N40j24j13k7J52l86L15j65J08l21K60Q5j5j20L47l41j12L10m31J30M05
3690B64o8k62M19R6m40r4J36k21Q3K18J59m55M28Q4n48Q1k03J86M3R0M6m4k5k7
3714e4J54k52K08l21q7O85l46j03L21k48j58M21n4j80l4N76m94m3L67m04j96M79
3736B37j22o01N21K60m95K55J5j92K65q2k39j89K09K63k57J75K17r6n17L98o8
$$ plain form
3757 -43 -421 -121 -176 20 49 457 33 61 184 -403 -398 22 186 -42 141 141 -84 27 -65 -52 -308 159 251 -329
3781 -329 397 307 -161 92 59 123 -202 413 159 -208 114 192 -61 33 347 -37 -153 207 250 -376 180 222
3803 222 -281 183 258 146 -51 192 -71 -130 226 73 -18 -127 39 -324 -87 118 -112 144 388 108 -63
3824 -63 75 162 -346 -202 283 -132 -65 -115 43 -37 1 -127 -156 -116 44 -84 -64 366 279 -355 50 28 -218 162
3848 162 21 89 119 63 -51 -207 120 -155 79 -104 -160 -261 110 188 -181 296 373 -18 -207 114 -200 56
3870 56 177 79 129 223 420 35 32 213 86 -153 122 187 -74 62 88 0 -11 162 66 -110 32 19 11 220 245
3895 245 -95 170 269 -239 -161 -59 244 -104 318 94 -227 -15 128 -61 -80 489 -32 -159 75 81 -136 -4
3917 -4 45 -149 -90 53 -21 32 276 -56 -217 -367 63 -444 86 358 19 266 530 -334 -149 205 209 -112 99
$$ packed form
3757d3l78L00n5J96K9M08m24K8J23n87NM20J64k28J83%k25J11r2J3k56M67R2n80
3781c29P26r0m68K53l3O4l25O15k54l67L22P8k53R4L14l84j16L60M3o26N56M2
3803B22n03M64P5j12j97K43k63n9L56j53r1j09J66l63K37K05k30K56K44k80j71
3824f3J38Q7n08J44M85m15O7n0J58q0L8j28k9M0J60j28K0M30q7o34M05k2k46L80
3848A62j41O8L0n6j14j56L27k75K34j83n6j01L71P8l69M77P7l91j89L21l14K56
3870E6J21r8N0R4J97l85lJ81j27k39K75O5k61J36K6q8j1J73r6j76J42j3qK09K5
3895B45l40K65R9n08P8J02L03l48M22k24l21K12J43j89j9N69n21j27K34Ok17J32
3917dM9j94N9J43p4N3K44l32j61j50M30n07N30K72l39K47K64q64J85L54Ml21K11
$$ plain form
3940 99 188 149 154 385 176 48 339 11 -27 -222 -99 -42 -191 268 115 -298 170 130 -387 -124 37 -130 -210
3963 -210 29 201 71 140 -354 -50 180 21 -89 213 317 261 -179 343 -88 -224 297 122 -32 347 210
3984 210 -223 20 -20 -140 -210 -2 0 -193 -174 228 -153 40 201 -46 -274 153 -127 -56 183 149 -122 240
4006 240 -38 -74 21 41 37 20 163 -26 113 -159 233 -300 -314 -10 -282 37 369 9 7 336 333 141 -108 19
4030 19 -79 119 355 -10 -38 68 5 -37 12 212 -163 -114 238 -45 -196 152 -188 177 37 257 -30 -314
4052 -314 321 -147 -91 122 109 -104 348 69 112 -16 -24 -112 71 17 28 -43 141 -5 -58 9 268 -344 124 128
4076 128 -320 109 90 -17 -370 147 -48 -365 -186 168 -309 48 362 10 -227 267 -171 -366 -27 -24 -161
4097 -161 -65 348 3 -155 35 40 -38 168 204 -110 138 309 -104 -186 204 -88 -62 22 -249 -230 -289 35 -190
$$ packed form
3940I9Q9l9NK31k09j28K91l28l8j95J23N7j49M59j53m13M68m0n17K63J61j67q0
3963b10K39J72j30O9m94L04K30j59j10L02J04n6m40N22m31j36N21j75j54L79j37
3984B10m33K43m0j20p0K08Kj93J9M02l81J93J61k47k28M27k80P1K39l4k71L62
4006B40k78l6R5K0mj7J43j89J39k72L92n33j4L04k72L19L32l60kL29lj92k49J27
4030A9r8J98K36l65k8J06o3m2M9K00l75M9L52k83j51L48l40L65j40K20k87k84
4052c14O35m68N6K13j3k13M52k79M3j28qq8J83n4J1p1J84j46n3O7K59o12M68M
4076A28m48M29j9j07l53N17j95l17J79L54m77L57L14l52k37M94m38j95L39Lj37
4097a61R6M13l45j58J90Np8K06L6l14K48J71m13q2L90k92K6Q4k71J9n9L24k25
$$ plain form
4120 -190 80 145 108 -51 257 120 -228 319 43 -168 321 249 -40 -195 93 -134 -93 284 217 63 -45 100
4142 100 -23 -178 154 -329 151 225 32 -86 106 -41 18 95 135 41 -2 -12 -86 -24 152 73 69 31 386 -356
4166 -356 -179 234 66 39 256 134 -75 -31 167 -275 124 -55 -40 19 37 211 -201 100 -122 -228 27 251
4188 251 276 56 523 -41 -110 68 174 -218 -140 185 -176 44 208 -116 39 103 -114 -194 -17 112 -326 -2
4210 -2 146 217 -257 121 -225 -373 -44 78 161 83 556 -47 -101 242 73 -135 35 -42 6 89 165 92 96 178 -286
4235 -286 -225 179 -108 75 64 -143 -168 -53 -224 -164 48 195 -35 -327 278 102 -192 180 223 -228 -203 139
4257 139 112 -162 140 206 -72 16 170 -190 52 150 -275 12 127 7 124 45 -13 -8 136 185 -186 201 163
4280 163 -190 115 94 43 176 221 184 -318 76 190 -29 -78 40 106 -251 120 34 -251 219 64 -110 62
$$ packed form
4120a90K70O5l7j59L08j37l48N47k76k11M89p2k89j55K88k27M1L77o7j54j08J45
4142A00j23j55L32m83M80P4j93j18J92j47N9P7M0r4m3j0p4O2J76p9ml8L55p42
4166c56J77M13j68k7K17j22k09M4J98m42L99j79J5N9J8J74m12L01k22j06K55K24
4188B51K5k20M67n64o9J78J06l92P8L25l61K20J64l24J55O4k17q0J77J29m38L24
4210bJ48P1m74L78l46j48L29J22Q3p8M73o03n4L43j69k08J70p7M8Q3P6p3MQ2m64
4235b86O1M04k87J83j1k07k5J15j71O0K12J47k30k92O05j76k94L72M3m51K5L42
4257A39k7k74L02O6k78Q8J54l60K42R8m25K87J15j20J17p9n8NJ44M9l71L87l8
4280A63l53L05k1n1J33M5l7n02L94J14k19m9J18O6l57L71q6k85M70j55j74J72
$$ plain form
4302 62 129 63 -24 253 -85 -256 197 360 -185 147 213 -332 50 286 51 -271 202 -162 -422 -127 283 -108
4324 -108 -225 111 -281 -21 -3 -103 -51 125 -10 159 -151 180 21 -116 278 -405 -104 400 119 -98 109
4345 109 256 -235 -221 84 -15 -293 160 7 -302 -20 126 -325 98 109 10 93 137 34 15 -3 -113 -60 -94
4368 -94 296 -176 -245 178 49 -176 397 288 -233 36 163 -143 239 75 -39 -203 168 53 -144 9 23
4389 23 39 311 324 180 99 129 -56 -240 -124 54 40 191 221 192 -249 -18 -4 -149 -248 196 -106 -150 150 -23
4413 -23 -4 160 -183 -25 138 -121 -101 83 -140 -160 -69 19 -395 -153 -48 102 -178 316 -25 -269 -72 279
4435 279 -140 -80 104 -105 -4 157 30 -420 96 34 39 118 381 27 20 226 71 0 39 70 -107 -89 70 -394
4459 -394 112 210 29 -108 237 -45 -119 42 -90 4 174 339 204 -139 78 -63 -106 -86 -157 -184 184 152 -38
$$ packed form
4302F2O7o6q7K77l38j71M53J63n45L32O6n45L82K36k35l22M73l64k60K95M10l91
4324a08j17L36l92K60J8j00N2J76j35J69l10L31j59j37L94o83L01N04k81k17K07
4345A09J47m91J4L05r9k78M53j53l09K82J46m51M23J1r9Q3M4j03j9j8j10N3l4
4368i4L90m72o9M23j29k25N73j09n21K69J27l06L82j64j14j64L71j15j97J53J4
4389B3J6K72J3j44q1L0j85j84J16J78j4J51L0k9m41K31J4j45r9M44l02m4L00j73
4413b3J9J64l43J58J63k59K0J84k23k0R1Q8m14K42J05J50k80M94l41k44J97L51
4435B79m19O0J84k09J01J61j27m50N16o2NP9K63l54pK06j55p1L9L1j77J8J59m64
4459c94N06R8j81j37L45k82p4J61j32R4J70J65j35l43K17j41m3K0p1k7L68l2j90
$$ plain form
4482 -38 -55 323 95 -272 233 124 -160 68 -4 -17 -68 197 196 -99 114 11 28 101 349 -249 196 -64 116
4505 116 -23 171 23 -309 122 134 -88 181 202 -69 67 137 -98 -28 73 -14 63 11 296 -1 -75 125 -40
4528 -40 -149 288 -87 -356 308 161 -365 126 58 -304 196 337 -26 -73 294 -135 -75 187 241 -209 -148 286
4550 286 -109 18 100 115 -278 -122 -234 -162 -78 60 -161 -61 70 65 -112 256 161 -209 145 121 -156 276 229
4573 229 121 -258 53 82 -229 88 123 -60 -19 489 -21 -251 153 -153 -321 -1 12 -110 -33 399 -76 -54
4595 -54 136 -228 -115 -138 173 100 89 -40 -236 12 -80 -12 -389 290 34 -39 230 80 56 53 449 -71 -186
4618 -186 7 -68 -295 200 -80 -70 39 85 -35 -124 255 57 -86 229 357 392 229 349 -74 115 217 -222
4640 -222 42 179 164 -199 155 204 -331 -165 193 -74 226 103 202 133 324 -254 -347 111 -121 -212 -89 -35
$$ packed form
4482c8j7L78k28l67N05j09k84K28p2j3n1K65jk95K13j03J7P3K48n98M45k60J80
4505A16j39J94j48l32M31J2k22K69K1k71J36P0k35P0J01q7P7n2K85k97p4K00j65
4528d0j09M37l75k69O64j47n26M91o8l62N00J41l63m7L67m29O0K62N4m50O1M34
4550B86l95J27Q2J5l93J56j12P2Q4J38k21J00J31nj77L68r5l70L54k4k77M32m7
4573B29j08l79L11K9l11L17L5j83M1N08n10k30M04l06j68L20J3j22P7M32m75K2
4595e4J90l64J13k3L11p3j1j29j96K48r2O8l77O79k56p3K69j50k4lL96n20j15
4618a86J93p5k27M95k80J0J09M6j20q9L79j98j43L15J28L5j63J20m23J89J02m39
4640b22K64J37j5l63L54M9n35J66L58k67L00j23R9o9J91n78r3M58k32r1J23N4
$$ plain form
4662 -35 1 151 -91 -218 38 8 21 -216 106 430 -124 -37 103 -86 -102 -14 -357 66 59 160 24 -16 155
4685 155 93 -122 211 -179 -123 -9 99 -298 86 203 -202 -95 226 -260 -212 -245 13 -7 -66 16 -421 -113
4707 -113 32 -27 -42 185 -81 -147 264 55 -36 -305 191 -99 -118 33 244 -7 376 196 38 127 183 -208
4729 -208 -14 44 96 -207 82 -126 -39 -44 189 -2 41 180 -118 77 393 152 -112 -9 -52 -246 -288 119 63
4752 63 -172 246 -70 -123 -60 -172 -154 -87 70 -148 195 287 17 113 53 97 -367 121 75 -157 -201 -21 70 -12
4776 -12 19 -155 77 190 -160 -291 -84 191 -209 -14 17 -55 -426 206 142 -262 370 3 163 110 -37 -78
4798 -78 -109 320 -102 -80 -122 52 0 245 47 -184 -259 -55 106 -154 252 -115 73 302 -6 21 -313 84
4820 84 -101 -434 284 -88 30 -202 -10 123 -260 -45 -200 -161 66 -267 -140 316 -230 -108 72 429 -217
$$ packed form
4662c5L6J50k42j27K56l0J3k37L22L24n54Q7J40j89j6Q8l43M23pJ01j36m0J71
4685A55o2k15L33l90N6J14J08l97L84J17m05J07L21m86M8l3K58k0n9Q2m37L08
4707a13J45n9j5K27k66o6M11k09r1k69M96k90j9J51K11k51L83j80j58Q9N6l91
4729b08J94N8N2l03K89k08Q7nK33j91M3J39k98J95L16k41k64J03m3j94m2M07n6
4752F3k35M18l16n3O3j12J8O7J57k18L43R2k70R6o0M4m64M88m6k32m4J80R1q2
4776a2L1j74K32J13l50j31K07K75m00J95L1p2l71O32o4m04O32l67J60n3j47m1
4798g8l1M29m22K2m2J74n2K45j98k31p5K04J61k60M06l67J88K29l08K7l34L97
4820H4j85l33P18l72J18k32J92J33l83K15j55L9K27l33J27M56n46J22J80L57o46
$$ plain form
4841 -217 -189 335 239 155 178 167 -79 271 58 -92 -80 54 -152 -16 -74 218 -201 112 140 -7 -253 -188 -158
4864 -158 -70 186 81 43 275 -46 -64 -29 45 -7 -77 59 -1 68 -55 86 118 189 185 211 47 91 8 2 285 123
4890 123 -234 183 101 53 39 142 -122 38 340 78 -220 97 276 -187 10 290 -166 29 64 -107 13
4911 13 198 113 34 231 -144 168 -48 57 -289 -273 225 -189 -280 -88 48 -181 367 290 -54 -106 82 -73
4933 -73 -86 123 41 -60 133 -228 39 -24 -15 -199 23 -19 50 9 40 -59 -2 -35 17 37 -80 66 -251 -45 504
4958 504 166 -42 23 -185 -529 -129 137 -215 -151 314 49 -25 299 -41 -373 -135 249 101 104 219 -190 -126
4980 -126 236 101 -348 268 100 -52 177 88 -118 -86 149 86 -445 175 79 -188 168 66 -97 -65 101 70
5002 70 -246 257 206 -299 88 44 -77 -66 149 118 -61 209 -127 -156 -54 1 -208 9 -207 -51 -179 158
$$ packed form
4841b17K8N24r6q4K3j1k46L50k13j50J2J34k06J36n8K92m19L13K8j47k46O5L0
4864a58Q8K56j05l8K32l21j8L5P4n2p0J36o0O9j23J41L2P1mK6j64M4q3oK83j62
4890A23l57M17q2m8j4J03k64J60L02k62k98L17J79m63J97K80m56J95L5j71J20
4911A3J85q5p9J97l75L12k16J05l46J6M98m14r1J92J36k29N48p7l44n2J88j55
4933g3j3K09q2j01J93l61K67o3Rj84K22m2O9m1L1r9N7l3N2K0j17J46l17K06N49
4958E04l38k08O5k08l44M00K66l52O4M65k65p4L24l40l32K38L84j48LJ15m09O4
4980a26L62j35m49O16j68j52K29q9k06L2K35o3n31O20r6k67L56j02j63L2J66l1
5002G0l16N03n1n05L87m4j21J1K15l1j79K70l36k9J02N5k09K17k16J56j28L37
$$ plain form
5024 158 263 -344 38 34 -286 115 149 66 1 299 -26 -16 398 -52 -6 233 -16 66 -66 65 246 64 352
5047 352 -217 -270 175 155 -25 102 21 -152 -314 198 45 -173 112 -112 -196 -12 394 -117 -94 -246 -55 33
5069 33 292 292 -180 130 -141 -209 65 26 47 -228 -24 105 51 248 -4 43 -98 34 30 -233 170 56 323
5092 323 -32 -96 29 183 96 -169 -42 34 -110 -1 122 -232 -220 -88 149 -184 50 263 -255 123 51 114
5114 114 -306 -11 -164 -410 -14 361 -232 -145 152 -19 -36 -17 30 -217 299 -67 -64 156 36 -96 -262 -150
5136 -150 -59 -274 52 299 170 -94 138 -174 198 227 48 186 153 -1 -203 57 90 -143 -112 247 -202 -55
5158 -55 171 154 -399 -75 349 -350 238 -8 60 54 62 19 -252 292 61 -188 -131 -38 -8 -234 -58 29 20 247 43
5183 43 93 287 -147 -167 121 24 -95 -70 334 271 -77 34 129 -342 40 -35 12 175 289 323 285 223 156 -123
$$ packed form
5024A58J05o07L82ml20M01L4q3o5K98l25J0M14m50M6K39k49Q2j32J31J81j82K88
5047C52n69n3M45k0j80J27q1j73j62N12j53k18K85k24q4J84M06n11K3j52J91Q8
5069C3K59%m72L10k71o8K74l9K1k75K04J29n4J97k52M7j41J32mk63M03j14K67
5092C23l55o4J25J54q7k65J27P6j44J09J23l54J2J32K37l33K34K13n18L78p2O3
5114A14m20K95j53k46L96L75n93Q7K97j71j7J9M7k47N16l66LK20j20j32j66J12
5136a50R1k15L26K47j29k64K32l12L72K9j79J38l3j54k02K60L3k33L1L59m49J47
5158e5K26j7n53L24M24o99N88k46O8oQm3k71N44k31k49N7R3L0k26J76Q7rK27k04
5183D3N0J94m34k0K88r7j19K5M04o3l48J11R5m71L82p5M7J63J14L4l8o2o7k79
$$ plain form
5207 -123 141 94 -67 -28 296 -440 96 246 -126 -336 55 146 -390 274 282 68 -65 371 -109 -253 15 245
5229 245 -148 198 65 -61 143 316 -43 -331 202 -154 -97 -71 93 177 62 420 -157 -514 -107 123 -96
5250 -96 221 -152 -27 333 296 -17 -192 16 -195 -76 183 0 -232 156 72 -222 -7 -190 -227 -48 99
5271 99 -17 -80 -74 181 -99 293 58 -249 -125 1 -175 -3 -37 -43 -87 -80 -86 -194 -179 16 -41 -86 213 -166 -434
5296 -434 -158 -89 -285 80 78 317 -129 278 18 159 76 0 -12 -54 125 -190 145 49 -210 -127 145 -106 -394
5319 -394 -15 20 275 -91 32 -231 -73 246 -124 -309 -76 58 -26 109 388 -77 -68 -225 -487 36 51 321
5341 321 -97 127 152 64 21 150 -199 -370 -4 -65 -71 389 63 -148 155 277 -287 14 126 86 26 20 -43 -126
5365 -126 148 -54 -189 -261 155 -134 -129 315 69 -102 -107 -147 -438 -86 242 52 12 426 30 11 -69 -35 -132 -18
$$ packed form
5207a23K64m7j61L9L24p36N36J50l72k10L91R1n36O64Qk14j33M36m80j44K68K30
5229B45l93L46j33j26K04J73l59k88N33l56N7K6J64Q4j15L58n77l57M07K30k19
5250i6L17l73J25L60l7l13j75K08k11J19K59j83k32L88q4k94K15j83l7J79J47
5271I9j16o3OK55k80L92k35l07J24J26j76J72l4om4Poj08J5J95n7m5K99l79k68
5296d34K76O9j96L65kK39m46M07k60J41q3p6j2m2J79l15L35r6k59Q3K72k51k88
5319c94L79L5K55l66J23k63J58L19l70j85K33J34q4J35K79m65Rj57k62N23J5K70
5341C21m18K24K5q8m3J29l49j71L66o1oM60l26k11L03J22n64L01J12m0o0oo3q3
5365a26K74k02j35p2M16k89NM44k46j71nm0k91L52L28j90m0M14l96j9q0L4r7J14
$$ plain form
5389 -18 74 -39 -25 239 232 49 214 -112 -71 37 163 -62 83 31 -71 -313 69 -142 -307 227 -17 -241
5411 -241 121 -21 38 -237 44 -104 -344 322 -6 17 302 288 -84 -12 285 -307 -189 89 140 -178 131 27
5433 27 -568 31 107 -300 -93 -137 -33 78 379 199 34 -7 237 -274 -122 31 -138 -143 81 -71 112 9
5455 9 194 -244 17 -133 -61 -241 -56 11 -72 287 -215 2 -176 -8 -341 120 241 136 -174 204 244 -208
5477 -208 148 125 -161 71 89 79 92 61 -126 66 23 -164 -164 -67 198 -15 -221 257 53 -449 -10 -55 -356
5500 -356 -236 437 -74 -73 -26 -196 17 224 28 18 -182 166 52 374 221 -159 -90 23 -131 -165 111 -13
5522 -13 4 334 226 78 -100 300 96 -79 1 -94 -59 167 84 6 -16 160 -253 -164 41 79 50 158 -53 79
5546 79 -85 -32 -165 -121 45 119 -244 334 17 -240 51 57 -40 -181 241 82 0 43 284 -372 -88 108 -309
$$ packed form
5389a8R2j13J4K64pj83J65l26M1J08J26k25J45n2j02k42L82k11j65N34k44k24
5411b41L62j42N9k75K81j48k40O66l28K3K85j4l72P2K97n92J18K78N1l18L09j04
5433B7n95N99P6m07K07m4J04J11L01j80j65m1K44n11J52J53j69nK24j52J83j03
5455IJ85m38K61j50P2j80J85O7q3L59n02K17j78J68l33M61J21j05l10L78M0m52
5477b08L56k3k86K32J8j0J3l1j87J92m3j87%R7K65k13k06M78k04n02M39m5l01
5500c56J20O73n11JM7j70K13K07j96j0k00L48j14L22j53l80O9J13j54l4K76j24
5522a3J7L30j08j48j78M00k04j75Q0r5L5K26q3p8k2J76m13Q9K05L8k9J08k11J32
5546G9j64N3j33M4J66P4l63N78l17k57K91Or7j41M22j59q2M3K41o56K84J96m17
$$ plain form
5569 -309 -31 96 100 26 -108 313 5 16 25 -244 58 16 -173 87 60 -123 -276 306 58 -15 299 -225 30
5592 30 18 343 -173 168 -25 36 -280 32 -113 -147 -118 54 21 -57 145 169 56 59 102 -147 86 250 -129 -89
5616 -89 337 -146 -171 71 -282 -68 337 319 -27 162 -178 -182 164 154 114 14 265 -162 -400 -96 -104 70 -58
5639 -58 -62 -275 -4 179 -184 -145 178 187 -66 -112 70 -212 -68 46 124 27 118 27 -177 122 5 -129 31 271
5663 271 59 -265 43 -49 -91 111 96 -229 88 125 6 -69 182 82 -105 66 80 37 -253 3 -40 197 235
5686 235 217 -35 236 200 -476 49 44 -64 -256 228 -55 -2 501 -25 -22 31 48 8 125 154 -276 -93 294 95
5710 95 -262 112 168 -338 -57 2 -40 -43 -55 -62 -170 175 -91 -565 -73 134 -18 94 -10 -37 -63 29 116 -145
5734 -145 -246 48 171 -96 -107 29 -133 137 75 -193 262 91 -243 22 197 28 55 4 -45 144 19 163
$$ packed form
5569c09K78J27Mp4j34M21l08J1Rk69L02m2j89K60k7j83j53N82k48p3L14n24K55
5592C0j2L25n16L41j93O1l16L12j45l4K9J72l3p8K02K4j13LM3k49K33J64l79M0
5616h9M26m83k5K42l53K14M05j8l46J89l40mL46j0m0j00K51m27k38L04qJ74j28
5639e8mk13K71J83l63L9L23Rk53m6J82k82J44J14P8r7R1r1k04K99j17j34J60K40
5663B71k12l24L08r2m2K02j5l25L17L7j19p5K51j00j87J71J4m3k90K56m3K37L8
5686B35j8k52K71l6o76N25nj08j92M84k83N3N03n26LN3J7m0J17K9m30J83L87j99
5710I5l57L74N6n06K81N9m2lj2pj08L45k66m74M92K07j52J12j04k7k6R2Q7k61
5734a45j01K94J23k67j1J36j62K70o2k68M55j71l34K65J75j69K7n1m9J89j25J44
$$ plain form
5756 163 -129 177 54 30 363 281 -269 -33 79 -368 -97 364 -99 -136 -80 -43 -289 -204 169 -133 49 256
5778 256 6 119 186 159 -58 -19 16 -363 22 40 111 129 89 -122 -210 -49 -195 -145 328 147 -200 -143 191 -36
5802 -36 -56 102 85 -284 -35 189 43 82 398 -119 -199 349 132 52 -416 112 -193 85 296 -36 -52 70
5824 70 181 -156 -9 76 17 155 365 53 -128 -215 39 -252 42 -179 -354 56 257 -112 -374 174 -128
5845 -128 -167 98 124 -241 61 130 137 238 76 -140 -254 3 -99 230 377 100 -54 146 73 -228 -164 298
5867 298 -101 -164 358 50 84 228 79 -261 81 166 -518 196 -281 124 -219 342 343 -142 -234 -78 -228 204
5889 204 298 -16 -27 40 -313 -80 206 292 -147 -83 556 172 49 266 -15 -523 162 10 -384 150 127 40
5911 40 -328 289 152 -334 170 5 -156 85 258 174 43 -44 52 -33 -142 -228 -360 -100 118 -212 -29 401
$$ packed form
5756A63k92L06j23k4L33q2n50K36J12m47K71M61m63l7N6L7k46Q5L73l02J82K07
5778B56k50J13O7k7k17L9L5l79L85J8P1J8m0k11q8J61j46N0M73j81l47N7L34k27
5802c6k0J58j7l69K49K24j46L9L16n17q0N48k17q0m68N28l05K78K11l32j6J22
5824G0J11l37J47Q5n9J38K10l12j81q7K54k91K94k21j75M10K01l69k62N48l02
5845a28l9K65K6l65L02O9PJ01j62k16j14K57j02L29J47k77j54K00p3l01O4M62
5867B98l99o3N22l08L4J44j49l40L42Q5o84P14m77M05l43N61Jm85r2J56j50M32
5889B04R4l14j1O7l53K33K86Q6m39O4O39l84j23K17k81n08O85j52l94N34k3q7
5911D0l68O17j37m86N04j65j61K41J73q4j31q7R6q5j09q6j32K60K18l30J83M30
$$ plain form
5933 401 93 -69 70 80 -38 61 -50 -59 -13 308 -51 -21 90 16 -330 -283 136 130 145 190 -13 -111 40 214
5957 214 -106 119 92 66 99 318 -301 -144 22 -17 -346 61 -24 -189 182 305 -172 -77 -86 -173 -96 -159 -233 -36
5981 -36 279 137 170 43 32 -250 -104 302 -199 -39 119 -49 -182 68 128 -159 55 33 -92 -518 45 25
6003 25 -82 100 -32 -97 14 60 -175 12 -49 9 -198 469 152 -90 107 49 -159 147 50 -104 45 -17 -153
6026 -153 -124 14 -11 -26 -51 -38 -141 108 352 95 -56 109 -178 -48 99 36 -17 143 36 -301 -88 -173 -152
6049 -152 127 374 -107 0 61 1 -62 166 126 -196 -51 335 -12 -208 190 81 -210 -147 179 -223 18 121
6071 121 -7 -33 140 -213 25 -183 157 -30 -116 -168 -133 134 38 65 -173 183 -206 -256 -140 231 195 -50 247
6094 247 -130 -57 -90 -135 -329 7 -64 -97 -5 210 89 -187 187 -76 -267 29 91 -76 -9 198 103 -87 17
$$ packed form
5933D01l08j62J39J0j18R9j11rM6L21l59L0J11p4l46M7M19oJ5M5k03r8J51J74
5957B14l20K25k7k6L3K19o19J57J66l9l29M07q5j65L71J23m77R5rq7P7o3p4J97
5981c6L15j42L3j27j1k82J46M06n01J60J58j68j33K50O0k87K14k2j25m26N63k0
6003B5j07J82j32o5J11M6k35J87o1N8k07O67l17k42J97n8k08L06r7j54J49o2j36
6026a53K9J38k5j5k5J3j03K49K44k57j51J65k87J30J47o3n3J60j07l37K13q5K1
6049a52K79K47m81J07O1o0o3K28m0l22J45L86l47j96L98j09k91O3L26m02K41J03
6071A21j28k6J73l53K38k08L40j87q6n2L5K67r6K7k38L56l89n0J16L71l6k45K97
6094B47l77P3l3m5j94L36p1l3R2K15j21k76L74k63j91K96O2j67O7K07r5j90J04
$$ plain form
6117 17 -314 -81 16 47 -115 194 277 -58 -71 40 57 -13 -16 25 50 -57 25 -49 -153 28 76 113 186 -44 -157
6142 -157 293 208 15 -221 85 19 113 241 190 -126 58 258 -312 87 169 -147 -298 -34 103 44 10 -11 121
6165 121 -44 25 -191 156 -93 -25 -62 298 207 241 265 114 -144 -167 244 -245 -16 193 67 134 -85 341 -94
6188 -94 144 -110 -108 63 288 163 -178 152 128 -52 68 100 -41 -118 -58 51 -73 164 245 -150 -222 257 -179
6211 -179 300 274 137 -41 190 -25 -211 244 -7 -125 128 255 -126 118 2 -142 -150 83 -35 -5 267
6232 267 -84 -229 187 378 134 -287 126 -18 -297 183 344 29 -171 418 84 -11 124 2 186 -113
6252 -113 -68 20 -21 102 -240 -21 -78 60 -266 146 -167 76 238 191 113 102 -224 -125 -176 221 -123 -240 216
6275 216 12 324 49 -86 -45 -8 249 -275 -98 123 110 -284 73 19 -266 -52 74 -93 -75 177 17 -183
$$ packed form
6117A7l31K33R7L1j62L09Q3l35j3J11J7p0lM1K5j07Q2p4j04J81M8L7P3k30j13
6142a57M50q5j93k36L06o6R4J28n1l16J84K00n70L99Q2l16j51K64J37n9l4k1J32
6165A21j65O9k16L47k49O8l7L60r1L4K4j51k58k3M11m89K29K09j26O7k19M26m35
6188i4K38k54KJ71K25j25l41L30k4j80J20L2j41p7O0J09j24K37Q1l95p2M79m36
6211a79M79k6j37j78K31k15j86M55k51j18K53J27l81K44j16j44qK33j18L0K72
6232B67l51j45M16J91k44m21M13j44k79M80J61l15k00N89l34r5J35j22J84k99
6252a13M5Q8m1J23l42K19n7J38l26M12l13K43J62m7p8j1l26R9n1L97l44j17M56
6275B16k04L12k75j35M1L7K57n24J77K21j3l94L57n4k85K14J26j67J8K52j60k00
$$ plain form
6297 -183 80 -69 -108 212 -74 -103 -224 86 75 -185 51 -11 -149 64 220 -194 -94 56 -23 185 310 102
6319 102 -186 187 130 112 93 6 -184 -184 12 -351 26 66 -9 -273 304 198 -63 -129 -9 -209 272 362 -103
6342 -103 -85 195 110 -353 204 -330 120 13 -75 -47 -211 302 87 -251 256 -59 -163 -16 416 -328 25
6363 25 168 160 -205 139 155 -128 12 217 41 151 96 192 -64 220 -153 -192 150 -141 -134 -250 -48 -101 11
6386 11 226 -6 -95 220 -218 -161 -60 89 -248 -84 297 -10 106 53 -137 -52 -118 39 -160 100 185 81
6408 81 126 144 -176 -125 130 169 -73 151 -165 -86 -112 228 -84 -2 190 206 130 56 -186 -47 197 36 51 -212
6432 -212 119 -3 -419 47 170 -53 -106 276 168 33 137 105 -55 -163 160 17 316 354 95 -322 -125
6453 -125 88 -247 -138 52 -113 59 -10 19 -246 -145 -173 -238 262 179 53 47 -261 50 -27 178 -221 -139 221
$$ packed form
6297a83K63j49l9L20k86k9j21L10j1k60K36o2j38K13J56m14J00J50p9K08J25k08
6319A02k88L73n7j8j9q7j90%J96l63L77M0p5k64N77j06k61o6J20k00M81R0m65
6342a03J8K80q5m63N57n34M50j07q8K8j64N13k15l38N07l15j04J47M32p44L53
6363B5J43ql65L44J6k83J40K05j76J10n5R6k56K84l73l9L42k91Pj16K02n3J12
6386A1K15k32q9L15m38N7J01J49l37J64L81l07J16n3j90Q5o6J57j99K60Q5j04
6408H1M5J8l20N1K55L9k42K24l16P9k6L40l12Q2J92J6p6p4k42J39K44j61J5k63
6432b12L31j22m16M66J23k23n3L82j08j35J04l2j60j08L23j43K99L8k59m17J97
6453a25K13l35J09J90j65J72o9K9k65J01k8o5N00q3j26ol08L11p7K05l99Q2L60
$$ plain form
6476 221 67 -117 16 338 146 54 518 -254 -144 163 40 -13 -18 186 -310 54 193 -72 -95 271 22 -91
6498 -91 283 101 -255 143 -113 -297 122 -91 -204 53 18 55 -77 241 85 -69 -130 158 -37 85 202
6519 202 240 -134 323 125 -198 147 92 -240 -103 23 -1 -111 25 -38 -7 17 87 -212 267 256 -166 9 176
6542 176 0 -31 -78 14 55 326 1 128 235 104 -14 78 320 77 -173 241 231 -19 298 132 58 66 -267
6565 -267 -66 29 45 142 35 -23 -360 -60 46 8 -93 -154 162 -126 -108 70 185 -154 219 129 -119 35 61
6588 61 35 123 -225 129 -113 -61 24 102 -133 -97 152 -110 203 187 -89 69 184 13 71 -163 -118 -285 4
6611 4 251 -187 149 145 -103 -45 174 -360 -213 352 176 38 76 -10 -157 -89 -142 -213 156 178 27 -147 271 308
6635 308 -227 -108 -181 -216 151 54 14 -59 148 -73 -51 40 -136 -243 -117 -97 50 115 -177 -307 -355 17 -180
$$ packed form
6476B21j54j84J33L22j92r2M64p72J10L07j23n3nK04m96L64J39k65k3L66k49j13
6498i1L74j82l56L98k56j84M19k13j13K57l5L7j32L18j56j54o1K88j95J22J17
6519B02L8l74M57j98l23L45n5l32J37J26k4j10J36o3L1K4P0k99M79j1m22J75J67
6542A76j76l1m7R2M1K71l25J27J07j31j18R2K42k43k50M14j0k50L17j66p4Ql33
6565b67K01R5J6R7j07n8l37L00J06l8j01o1L16k88J8J78J15l39L73r0k48J54K6
6588F1k6Q8l48L54k42N2Q5P8k35L6K49k62L13j6k76J58J15j71N8k34M5j67K89
6611DK47m38L36mk48N8K19n34J47N65j76j38L8q6j47O8n3p1L69K2j51j74M18L7
6635C08n35J19p3l5L67r7m0p3K07k21K2R1j76j07J26K0J47O5k92j30m8L72j97
$$ plain form
6658 -180 47 41 168 -55 -164 9 90 -223 -111 -494 263 188 -70 36 311 90 -94 -230 -189 1 -22 -63
6680 -63 19 -299 -265 149 -95 -2 70 -274 -66 220 71 -191 127 32 35 175 -15 10 -95 260 1 111 113 -76
6704 -76 159 85 -49 -117 -64 152 -147 -248 -74 -230 -41 115 -146 -70 -42 149 176 -32 69 160 -136 57 101
6727 101 -201 218 95 -83 -54 114 81 205 12 27 -9 -232 13 -113 -264 279 -16 7 126 -39 88 -17
6749 -17 24 63 149 -46 15 -133 -90 196 -181 -132 45 -197 3 -332 18 -141 -146 -60 -351 119 41 -112 -87 219
6773 219 135 46 26 -321 -22 -13 45 -168 95 78 -198 54 -8 -166 -8 128 -118 20 114 49 150 174 -8 -179
6797 -179 23 70 390 24 -41 125 -130 -264 -164 -255 -129 127 -93 118 77 -236 -210 98 69 -197 207 -88
6819 -88 -55 185 303 258 -91 -117 -131 95 68 -77 177 31 85 112 282 168 255 -75 53 -157 64 -112 11
$$ packed form
6658a80K27oJ27k23j09J73Q1l13J12l83P57p5k58J06K75k21j84j36M1J90k3m1
6680f3Q2l18L4M14k44R3P2l44K08K86j49k62L18r5LJ40j90K5j05L55k59J10Kj89
6704g6K35p4j34o8N3K16k99j01J74j56J89J56k61P6K8J91K7k08J01R1k96J93M4
6727A01l02M19j23j78K9J68l3J24j93J5l6k23K45j26j51N43k95K3J19j65J27j05
6749a7M1L9Q6j95O1j48M3K86l77M9J77k42K00l35L50j59nQ6k91M70p8j53K5L06
6773B19q4q9k0l47K99RN8k13K63j7k76K52o2j58J58J36k46J38R4o5J01K4j82j71
6797a79K02M7L20l66o5J66k55j34J00r1J26K56k20K11m1l13K6L08k9k66M04k95
6819h8L3K40J18m5l49k6j4K26k7j45K54j46N4K7J70j14Q7l30J28k10K21j76J23
$$ plain form
6842 11 247 34 153 -23 90 -135 -103 -31 36 -150 -162 -67 -260 -57 -186 55 -205 167 -246 155 -76 -176
6864 -176 -104 73 144 -71 37 -112 156 59 18 -178 137 -229 147 -7 125 -62 227 10 -338 253 206 231
6886 231 12 193 -127 39 -87 126 -247 -18 168 -26 -53 39 69 -118 181 185 -159 198 81 119 53 -93
6908 -93 -334 -75 79 -35 -175 16 107 -87 -179 287 -55 -12 176 139 186 200 114 -252 74 108 -142 -69 -45 141
6932 141 -60 90 63 -134 17 182 76 -74 131 -4 21 259 -253 -264 302 100 -119 167 11 -127 136
6953 136 211 -32 -52 150 -74 -27 212 -104 -162 206 -49 -105 -114 53 -66 -143 117 16 -41 20 -34 -14 80 -91
6977 -91 -248 -37 -33 -11 -235 160 -215 -115 189 -5 146 -118 47 175 -9 82 269 -117 163 138 -93 -184
6999 -184 -82 -18 32 91 55 100 -145 -183 -186 38 1 76 157 157 94 -149 202 -13 -163 -242 -99 -144 265 -25 169
$$ packed form
6842A1K36k13J19j76J13k25L2P2O7j86j2R5j93K03j29K41k60L72m13M01k31j00
6864a76P2J77P1k15J08j49K68r7m1j96L15l66L76j54J32j87K89k17l48N91m7K5
6886B31k19J81l20J66j26K13l73K29J86j94k7R2L0j87K99Ml44L57j17L8o6j46
6908i3k41K59J54j14j40J91R1j94r2M66l42M3J88l7M7J4q6l66L26L4k50P3K4J86
6932A41k01J50k7j97J51J65j06j50K05j35K5K38n12j1N66k02k19K86j56j38K63
6953A36P5k43k0K02k24M7K39l16n8L68k55n6rJ67j19p7K60j01n7O1n4K0R4j71
6977i1j57K11MK2k24L95l75J00L04j94J51k64J65J28j84R1J87l86K80k5k31r1
6999a84J02O4N0N9l6M5k45l8lK24l7P5Q1%o3k43L51k15j50p9J43m5M09k90J94
$$ plain form
7024 169 -140 163 -206 -212 245 -39 -69 67 179 -72 145 221 58 82 115 29 183 -23 102 -83 -187 191
7046 191 172 132 39 -97 60 -68 -148 -82 -231 16 43 136 -58 131 -249 277 168 -250 68 24 -153 -102 0
7069 0 -213 32 75 63 -193 -44 -164 -79 183 -114 210 113 230 130 -232 86 -82 -84 -67 82 -89 -310 -39
7092 -39 13 -133 -205 -6 -185 219 188 80 30 -25 88 21 -99 -26 -167 -69 233 208 89 124 -99 -92 143 143 -110
7117 -110 -221 95 -135 -109 5 122 77 87 330 54 -21 119 14 207 -58 -221 134 17 -81 52 154 33
7139 33 6 194 -50 -149 65 -150 2 179 31 12 -106 -35 -167 71 -16 -155 14 -137 -48 -21 2 90 -179
7162 -179 309 108 -96 90 271 102 -200 114 313 170 11 275 97 87 -28 -60 110 -54 5 -60 -7 58
7184 58 -149 -79 -162 33 148 -290 257 -36 356 -137 158 -73 187 1 82 226 -177 89 59 106 65 126 -40
$$ packed form
7024A69l09L03l69oM57k84l0J36J12k51K17P6j63K4L3q6J54k06J25j85j04L78
7046A91j9m0r3j36J57j28q0O6j49K47K7R3j94J89l80N26j09m18L18m4j77N1J02
7069@k13K45M3j2k56J49j20Q5K62k97L24r7J17j00l62L18j68kJ7J49j71k21K71
7092c9N2j46p2J99j79M04l1j08n0n5J13o7j20P3j41R8L02k5j19L5k23PK35%k53
7117a10j11L16k30K6J14J17m5J0K43k76p5J40j05J93k65j63L55j17r8J33J02j21
7139C3k7J88k44r9K14k15J52J77j48j9j18P1j32K38q7j39J69j51Q9K7K3Q8k69
7162a79M88k01k04J86J81j69l02L14J99j43j59K64j78j0j15l2J70j64N9o5N3O5
7184E8k07P0q3J95J15m38N47k93L92m93K95k31K60j86Q1J44m03K66l0M7m1O1j66
$$ plain form
7207 -40 8 104 -64 82 -84 -116 34 153 67 -177 -13 -104 134 -31 194 117 -2 -105 -159 102 16 -122 -181
7230 -181 253 -49 72 51 163 -130 -118 -157 -155 199 109 186 -78 137 -289 -307 -82 -100 -191 -40 -141 57 -125
7253 -125 -129 -10 -101 -151 -273 -267 79 189 -95 -61 -282 -21 -97 271 -113 -7 16 -174 -61 82 5 -72 -90 143
7277 143 -167 -279 362 -103 57 -87 68 -60 -173 96 -129 29 267 71 180 18 -264 42 78 -197
7297 -197 5 -264 145 159 106 -186 47 -8 332 -268 52 -10 168 125 -264 102 23 162 124 214 -205 121 15
7320 15 -209 -194 -15 -216 71 128 -150 -365 68 158 -51 -82 -131 28 -151 3 -125 -107 55 40 171 236 12
7343 12 -363 -270 -85 10 -19 -7 -298 -134 188 121 -13 -103 14 -11 -197 194 -164 -85 6 74 -121 116 43 -232
7367 -232 -145 67 270 120 308 -100 -33 -108 -17 105 33 -160 -41 -176 -245 -298 -59 -202 -82 -192 -185 58 -33
$$ packed form
7207d0M8R6j68J46j66l2J50J19q6k44J64r1K38j65K25p7j19j03n4K61q6j38n9
7230a81M34l02J21k1J12k93J2l9KL54r0P7k64K15m26j8K25j8r1J51j01J98j82
7253a25mJ19r1n0j22OL46J10k84L4k21K61p6L68l84J06K3j90J13J43p7p7j8K33
7277A43l10j12O41m65J60j44J55j28j13K69k25J58K38j96J09j62k82L06L6k75
7297a97K02k69M09J4n3k92K33n5L40o00L20o2J78m3l89L66p9J39l8R0m19L26j06
7320A5k24J5J79k01K87N7k78k15M33R0k09l1m9J59j79J54j28J8J62j5J31O5k24
7343A2l75R3J85R5k9J2k91J64L22o7j34r0J17k5j86L91l58P9R1O8j95K37p3k75
7367b32Q7K12K03j50J88m08O7p5R1J22p2j93J19j35o9n3K39j43J20j10PK43r1
$$ plain form
7390 -33 34 69 172 157 -244 43 -180 -285 454 -163 104 -164 -121 -135 -95 209 -334 2 127 -174 -63 264
7412 264 62 83 -35 -110 25 151 253 175 91 196 -96 67 79 -157 -54 -58 23 65 121 6 -178 -53 -29 -42
7436 -42 40 -48 -22 -88 71 -192 27 161 86 284 -163 109 196 59 159 30 -146 203 7 -160 -14 -373
7458 -373 10 109 -56 120 36 97 -146 29 89 90 -119 -60 -164 -110 139 -150 -202 -264 270 -58 2 228 82 -185
7482 -185 180 -90 38 22 82 269 -28 36 39 230 18 56 -104 15 -179 -18 -4 -203 255 -163 54 111 165
7505 165 158 38 -76 142 -1 -43 -103 -42 -61 19 -15 190 -110 195 62 95 -186 -54 152 135 10 -3 176 -155
7529 -155 -99 -240 -249 -20 -130 320 -27 -76 22 -233 -97 -16 -117 -166 257 77 -161 -152 159 107 151 17 -91 96
7553 96 -52 71 32 -127 -49 19 38 437 -163 -84 180 111 -154 -81 -34 129 239 -156 24 297 -169 79 -31
$$ packed form
7390c3O7L5J03j5m01K87k23j05P39o17K67k68M3j4M0L04n43L36J25l01J11L27
7412B64k02K1j18p5J35J26J02p8q4J05k92J63J2k36J03mQ1M2N6j15j84J25K4j3
7436d2Q2q8K6o6J59k63K19J34p5J98m47K72Q7j37J00j29j76L49j96j67J46l59
7458c73L83R9j65J76q4O1k43J75O0Jk09N9j04N4K49k89n2o2N34l28O0K26j46k67
7482a85L65k70J28j6O0J87k97O4LJ91k12L8j60J19j94J61J4j99M58m18K17N7N4
7505A65pj20j14K18j43m2o0O1j9Q0l4K05l00L05j33L3k81J32K06j7j25j3J79l31
7529a55N6j41rK29j10M50l47m9R8k55J36Q1j01m9M23j80k38RL11n2M4j34j08J87
7553I6j48J23l9j59P8O8J9L99o00P9K64o9k65P3M7J63J10l95J80K73m66K48j10
$$ plain form
7576 -31 -261 -35 -4 246 179 22 58 185 -60 33 34 37 -67 129 48 -33 313 -179 -18 8 -46 -170 -117 168 111
7601 111 7 245 -111 -65 -99 -22 -100 -164 108 -8 -71 46 -56 45 49 81 -203 14 -76 -201 61 -2 2 -194
7625 -194 41 103 -53 201 -31 -49 251 250 -215 -61 -10 44 -86 114 23 21 145 -120 94 360 6 22 163
7648 163 -137 -169 -128 -30 103 -39 -89 -1 67 -132 153 -167 -249 -105 -213 -222 -231 -51 68 -9 -16 -236 130 -132 -56
7673 -56 23 -81 170 160 37 -135 -77 -104 -50 103 126 -3 21 -63 195 -223 -153 177 56 -135 -153 -7 253 89
7697 89 67 8 -242 52 107 8 82 401 -102 -308 -42 -160 -37 99 69 -41 61 -82 -35 195 -199 67 -56
7720 -56 384 159 198 169 -157 -121 -85 -211 24 52 -99 -20 -41 -140 220 41 14 84 -11 -63 -35 257 -119 -59 -102
7745 -102 130 -24 -111 38 26 -337 68 -26 -30 -318 219 -113 91 -10 47 253 -34 -30 80 3 99 -203 -252 -48
$$ packed form
7576c1k30K26L1K50o7j57L6J27k45R3JLj04J96q1q1L46m92J61K6n4j24N3K85n7
7601A11j04K38l56M6l4P7p8o4K72j16o3J17j02J01ML2k84K17r0j25K62o3Mj96
7625a94K35O2j56K54k32j8L00jm65J54N1N4j30K00r1kJ24k65K14K66l54J6J41
7648A63l00l2M1R8J33j42n0Q8O8j99K85l20q2J44j08rrJ80J19p7pk20L66k62P6
7673e6P9j04K51j0j23j72N8k7N4J53K3j29K4q4K58m18P0L30j21j91j8J46K60j64
7697H9k2n9k50K94N5r9P4L19n03k06K66j18J23J36l0j10J02j43M7K30l94K66j23
7720e6M40k25L9k9l26L6L6j26K35K8j51P9k1r9L60j79k7P0r5n2K8K92l76O0m3
7745a02K32j54q7J49j2l63M05r4mk88N37l32K04j01N7K06k87MJ10p7R6l02m9K04
$$ plain form
7769 -48 -268 -103 176 38 154 -208 -45 286 99 107 115 -40 -67 -70 -252 118 -29 309 -158 122 -13 -50 -49 224
7793 224 -98 -125 71 32 46 -179 176 108 82 -355 -17 65 -282 101 24 -96 119 99 -26 92 -231 -52 229
7816 229 77 36 56 -81 -213 268 6 123 -84 -47 -401 -115 78 121 -80 -63 48 83 -94 139 133 20 13
7839 13 -29 -21 -411 -154 -259 -356 -104 -3 96 93 -27 90 -82 -188 51 -34 192 210 -27 -55 145 121 -183 41
7863 41 -22 100 89 -54 -72 135 71 135 98 145 -173 -17 -76 -90 43 -11 17 231 -2 25 -436 159 -95 -229
7887 -229 28 207 11 -248 51 134 -359 -131 45 80 85 -334 204 -232 -10 -13 134 -53 -78 -171 -246 -6 -141
7910 -141 -61 -177 -124 -58 -81 -207 -153 152 60 -67 3 168 -84 84 55 -87 104 -104 202 -28 -24 194 -255
7933 -255 11 -77 -29 -135 63 -195 -20 -60 164 87 165 119 12 -175 113 205 -12 163 116 -128 118 -6 -291
$$ packed form
7769d8k20J65K79j38J16l62J63L31j87QQj55k7lj82L70j47L38m67K80j35l7JK73
7793B24l22k7J96l9J4k25L55o8k6m37L38Q2l47L83p7j20K15k0j25J18l23J79K81
7816B29j52m1K0j37j32M81k62J17k07L7l54K86J93M3k01J7J11L5j77K33oj13p
7839A3m2Ql90K57j05r7K52J01R9lj20J17j72j06K39q5K26J8k37k8K00k4l04K24
7863D1o3J22j1j43j8K07o4O4l7M7l18J56n9j4J33n4K8K14k33K7m61N95k54j34
7887b29K57J79j96k59K99Q3m93K28J76L5Nm19N38m36K22lJ47j87k5r3p5K40j35
7910a41Q0j16N3O6k3j26N4L05r2j27P0J65k52J68k9j42J91k08L06k30MK18m49
7933b55K66q8M8j06J98k58J75m0K24p7P8m6j07j87K88R2k17J75m7k44K46j24k85
$$ plain form
7956 -291 165 -26 -15 -94 82 289 151 45 -26 269 -178 -252 103 -62 0 -8 216 49 -196 -96 -206 84
7978 84 80 -42 270 29 295 74 -103 -95 -9 123 29 -172 -354 -32 82 -92 83 2 46 45 77 116 168 364 -70
8003 -70 146 -167 -87 -165 -216 -46 127 -22 57 -42 8 -106 -161 -28 -117 100 222 76 108 1 -122 -275 131
8026 131 89 -128 -297 -32 77 -77 -75 216 -49 46 -42 211 -144 3 -23 -312 0 217 -32 2 5 9 435 -126
8050 -126 -53 -26 16 -43 124 -135 -164 -48 -51 -65 -223 331 -56 204 43 119 184 -322 9 -143 -69 91 -135 237
8074 237 -163 -24 185 -114 -138 181 45 -86 -42 -47 35 17 -157 -375 138 91 102 209 6 -61 -278 -133 -15
8097 -15 -248 173 -26 0 -44 131 -158 -70 -229 -107 -185 28 -147 28 -63 59 -194 236 -8 -124 -19 213
8119 213 50 106 -104 0 68 -51 -311 138 -289 -169 219 -360 74 -231 -172 -190 32 123 314 150 194 -150
$$ packed form
7956b91M56j91J1p9J76K07j38j06p1K95m47p4L55j65O2qK24j67k45J00j10K90
7978H4mj22L12k41K66k21j77QQ6J32r4k01j82L22J14j74J75q1M4jL2L9N2J96m34
8003g0K16l13Q0p8n1J70J73j49P9r9N0j14n5J33q9K17J22j46L2j07j23j53M06
8026A31m2k17j69K65J09j54KK91k65R5q8K53l55J47k6k89L12K17k49L4LMM26n61
8050a26P3K7M2n9J67k59k9J16lj4j58N54l87K60j61P6O5n06L31j52P4J60k26L72
8074B37m00J39K09k99k4L19j36j31M4nQ2j8j74k18N13m7J1J07k03o7k17J45J18
8097a5k33M21j99K6m4J75k89Q8j59J22p8K13j75J75r1J22k53M30k44j16J05K32
8119B13j63N6k10J04O8j19k60M49m27J20L88n79M34l05N9j8K22R1J91j64M4l44
$$ plain form
8141 -150 2 -45 225 90 209 -95 68 -282 13 -109 -174 27 -101 -105 40 223 132 65 54 34 -90 -200 61
8164 61 -53 139 -165 33 -106 105 -231 -184 57 1 -97 65 8 -74 -86 -24 39 73 -28 296 -25 99 -201
8187 -201 5 -64 -82 18
$$ packed form
8141a50J52m7K70j35J19l04J63l50K95j22o5K01j28mJ45J83r1o7j1k0j24j10K61
8164F1j14J92l04J98j39K11l36M7K41n6r8J62n7q2j2O2O3L4j01L24l21J24l00
8187b01K06o9j8J00
8191A8
$$ Imaginary data points
##PAGE= N=2
##DATA TABLE= (X++(I..I)), XYDATA
$$ plain form
0 0 0 0 0 0 0 0 0 0 0 -3 7 -8 8 -8 16 -16 24 -24 32 -40 48 -56 64 -80 90 -104 122 -143 164 -190 215 -247
32 -247 279 -314 356 -401 449 -505 564 -629 698 -778 862 -956 1056 -1166 1288 -1419 1564
49 1564 -1725 1898 -2093 2305 -2545 2811 -3113 3458 -3851 4313 -4856 5507 -6312 7324 -8652
64 -8652 10477 -13148 17460 -25600 46531 -227040 -432541 -188669 -67126 212580 287115
75 287115 236240 123727 -56244 -228430 -251054 -221888 -56473 94910 198752 271094 189865
86 189865 33055 -50417 -204355 -262532 -175753 -123799 -22911 117565 132407 133546 95308
97 95308 -885 -61194 -116298 -113854 -33308 16290 127404 224996 190541 174882 115843 -38145
109 -38145 -82712 -86623 -87525 20730 115519 154336 166259 88599 -2079 -89262 -160631 -106801
$$ packed form
0@%%%%%%%%%lJ0j5J6j6K4l2M0m8N6p2Q8j04J20j44J70j94K26k65L07l54M05m62
32b47N26n93O70p57Q50r54J069j193J327j476J640j818K012k222K454k707K983
49A564l289L623l991M398m850N356n924O571p309Q164r169J0363j1819J3636j5976
64h652J9129k3625L0608m3060P2131k73571k05501K43872J21543K79706P4535
75B87115n0875j12513j79971j72186k2624K9166J65415J51383J03842P2342q1229
86A89865j56810q3472j53938n8177Q6779N1954J00888J40476J4842J139l8238
97I5308r6193o0309n5104K444Q0546M9598J11114R7592l4455j5659n9039j53988
109c8145m4567l911r02J08255R4789L8817J1923p7660r0678q7183p1369N3830
$$ plain form
121 -106801 -33694 34937 164456 180176 115168 88923 -9635 -84283 -43089 -8229 57328 136231
133 136231 140213 114767 36303 -53044 -85262 -125678 -97398 -5779 9241 42252 73303 -4317
145 -4317 -43657 -52787 -97824 -69731 -19845 5975 50387 56264 49025 31016 -29368 -42031 -56040
158 -56040 -98696 -57383 -29808 -40571 15620 24848 -16685 -17750 -58967 -105646 -102759 -96157 -52109
171 -52109 -1889 29591 70981 42261 -11765 -26391 -86353 -105197 -40960 -17449 25511 87622
183 87622 63510 27197 -7844 -66636 -83292 -75354 -39783 19593 36215 57246 59669 -4122
195 -4122 -20976 -20698 -51843 -8767 39200 37801 67200 68752 33695 21487 1840 -2784 6309
208 6309 6391 36470 39983 20699 43021 25294 -5086 21535 10064 -4817 29286 27915 25648
$$ packed form
121a06801P3107O8631J29519J5720o5008k6245r8558p4648M1194L4860O5557P8903
133A36231L982k5446p8464q9347l2218m0416K8280R1619J5020L3011L1051p7620
145d317l9340r130m5037K8093M9886K5820M4412N877p239j8009o0384j2663j4009
158e6040m2656M1313K7575j0763N6191R228m1533j065m1217m6679K887O602M4048
171e2109N0220L1480M1390k8720n4026j4626n9962j8844O4237K3511M2960O2111
183H7622k4112l6313l5041n8792j6656P938L5571N9376J6622K1031K423o3791
195d122j6854K78l1145M3076M7967j399K9399J552l5057j2208j9647m624R093
208F309Q2L0079L513j9284K2322j7727l0380K6621j1471j4881L4103j371k267
$$ plain form
221 25648 46370 37610 31600 20768 3644 6744 -9255 -3354 31107 19818 28727 49435 7018
234 7018 -9541 -5786 -37465 -26219 4224 11336 31008 33253 17555 -2007 -38506 -42513 -37080
247 -37080 -42767 663 24214 6324 21999 4194 -42980 -40390 -45123 -50047 -18586 -851 9311
260 9311 10969 -5820 -13399 -39001 -55681 -33380 -37299 -29242 11601 1893 -6755 8024 -20568
273 -20568 -36992 -27674 -35808 -26779 -10678 -345 12617 3983 2683 1382 -29112 -25002 -11141
286 -11141 -26563 519 26711 13681 25654 25962 -2491 -8218 -14348 -16710 -4201 5813 29742
299 29742 35289 22754 31649 11573 -16711 955 -2219 -4872 32835 39738 34750 44502 27223
312 27223 7635 -2112 -9470 -317 3676 18497 42589 29617 25987 30810 -3485 -11176 3942
$$ packed form
221B5648K0722q760o010j0832j7124L100j5999N901L4461j1289Q909K0708m2417
234G018j6559L755l1679J1246L0443P112J9672K245j5698j9562l6499m007N433
247c7080n687M3430K3551j7890J5675j7805m7174K590m733m924L1461J7735J0162
260I311J658j6789p579k5602j6680K2301l919Q057M0843r708q648J4779k8592
273b0568j6424R318q134R029J6101J0333J2962q634j300j301l0494M110J3861
286a1141j5422K7082K6192j3030J1973L08k8453n727o130k362J2509J0014K3929
299B9742N547j2535Q895k0076k8284J7666l174k653L7707O903m988R752j7279
312B7223j9588r747p358R153L993J4821K4092j2972l630M823l4295p691J5118
$$ plain form
325 3942 -7876 7250 33240 29072 30522 24937 6677 -5760 -20180 -14581 -4976 -6946 16628
338 16628 22828 248 6456 -4342 -32663 -19934 -13476 -17091 4156 11710 7552 4789 -6896
351 -6896 -12462 -24117 -29722 -12639 -16590 -14174 8818 -4220 -14149 -3028 -23441 -35334 -24944
364 -24944 -31564 -26981 -12525 -5612 1923 -1147 -1923 -5306 -27351 -24779 -15367 -24618 -1595 20526
378 20526 9961 17235 14931 -14159 -22897 -26338 -29398 -16885 -3116 13760 16827 6456 8544
391 8544 -7524 -24594 -6397 -2347 -266 29013 31581 21771 28622 17340 5192 7485 7825 11429
405 11429 9804 10323 14468 262 60 12091 646 5765 20361 4898 2814 11126 278 4194
419 4194 17536 21233 26477 26175 24568 16900 1462 6086 6028 -3762 11743 14331 -2059 5571 1555
$$ packed form
325C942j1818J5126K5990m168J450n585j8260j2437j4420N599R605j970K3574
338A6628O200k2580O208j0798k8321J2729O458l615K1247P554m158k763j1685
351f896n566j1655n605J7083l951K416K2992j3038r929J1121k0413j1893J0390
364b4944o620M583J4456O913P535l070p76l383k2045K572R412r251K3023K2121
378B0526j0565P274k304k9090q738l441l060J2513J3769J6876L067j0371K088
391H544j6068j7070J8197M050K081K9279K568r810O851j1282j2148K293L40L604
405A1429j625N19M145j4206k02J2031j1445N119J4596j5463k084Q312j0848L916
419D194J3342L697N244l02j607p668j5438M624n8r790J5505K588j6390P630m016
$$ plain form
434 1555 -14578 -7374 -5515 -10760 -7211 -7693 -8322 -10984 -8769 5182 4870 7149 20898 5255 -8515
449 -8515 -3413 -18018 -21141 -2149 561 2896 8424 -3307 -18847 -34099 -39710 -35897 -33200 -12494
463 -12494 5413 -881 4256 3325 -19572 -18358 -10198 -14449 425 13513 10502 8241 2646 -4411
477 -4411 -11815 -16264 -7369 -8641 -13526 -1701 -7690 -17227 -3472 -4473 -9247 5381 5211 -464 4461
492 4461 4554 5352 8293 14188 20785 13795 13032 15927 1166 1762 13712 5196 8146 16772 2615 -4305
508 -4305 -2721 -8276 -4246 5747 16179 20321 15336 14335 5135 -9503 244 8440 9709 30952
522 30952 37297 23252 18583 4628 -15886 -18257 -13501 -4812 4947 13310 18436 6462 -5632 -7360
536 -7360 -21208 -23427 -5867 -3855 1770 18296 14248 7791 8889 -499 -9702 -13503 -13839 -12615 -13148
$$ packed form
434A555j6133P204J859n245L549m82o29k662K215J3951l12K279J3749j5643j3770
449h515N102j4605l123J8992K710K335N528j1731j5540j5252n611L813K697K0706
463a2494J7907o294N137r31k2897J214Q160m251J4874J3088l011k261n595p057
477d411p404m449Q895j272m885J1825n989r537J3755j001m774J4628j70n675M925
492D461R3P98K941N895O597o990p63K895j4761N96J1950q516K950Q626j4157o920
508d305J584n555M030R993J0432M142m985j001r200j4638R747Q196J269K1243
522C0952O345j4045m669j3955k0514k371M756Q689R759Q363N126j1974j2094j728
536g360j3848k219J7560K012N625J6526m048o457J098r388r203l801l36J224n33
$$ plain form
551 -13148 -2683 5598 -235 4053 2482 -18548 -22649 -23277 -32223 -20828 -2890 3414 11619 13587
565 13587 4066 -9889 -21802 -21906 -21804 -14162 7549 13909 10580 15636 1494 -17240 -16319 -18512
579 -18512 -18808 -4147 4539 6159 6268 3365 -1067 -9750 -8097 -537 -3660 3207 13495 5862 6535
594 6535 13110 3994 2706 8460 3076 1003 3316 4105 4132 5334 11099 10170 2863 6964 3719 -5173
610 -5173 4212 9350 5771 15827 17888 7348 4930 1690 -4032 -3189 3291 11106 11153 12260 13922
625 13922 1360 -6709 -1853 -7208 -5215 9506 9604 6607 10442 2611 -6724 -8080 -8027 -6725 -4531
640 -4531 2611 5308 -1559 385 499 -10481 -6781 -1968 -9323 -4932 -16 -5448 -4467 -967 -3288
655 -3288 -5407 -5607 -4927 -9701 -11901 -4985 -6081 -7445 2619 394 -7024 -2745 -7313 -14322 -8721
$$ packed form
551a3148J0465Q281n833M288j571k1030m101o28q946J1395J7938O304Q205J968
565A3587r521j3955j1913j04J02P642K1711O360l329N056j4142j8734R21k193
579a8512k96J4661Q686J620J09k903m432q683J653P560l123O867J0288p633O73
594F535O575r116j288N754n384k073K313P89K7J202N765r29p307M101l245q892
610e173R385N138l579J0056K061j0540k418l240n722Q43O480P815M7J107J662
625A3922j2562q069M856n355J993J4721R8k997L835p831r335j356N3J302K194
640d531P142K697o867J944J14j0980L700M813p355M391M916n432R81L500k321
655c288k119k00O80m774k200O916j096j364J0064k225p418M279m568p009N601
$$ plain form
670 -8721 -5138 -4354 526 3729 1589 -4247 -5607 -5145 -10202 -4808 5261 2030 4677 9912 -480
685 -480 -4615 -1771 -6254 -5684 1856 5137 5277 5409 6028 1259 -4055 886 1786 -1018 8593 11329 5274
702 5274 10202 9848 1435 2388 3766 311 1396 5155 6617 4849 6400 9373 3086 738 4727 -1057
718 -1057 -2433 6094 4946 4261 10950 8513 2200 2359 -805 -4451 -4499 909 3795 2387 7228 7348
734 7348 -2041 -2085 -2095 -10053 -5641 825 -1073 1383 5293 702 -3806 -4732 -6127 -8719 -7146 -857
750 -857 -1150 -2464 3140 -998 -7901 -3829 -6127 -10370 -4196 -2473 -4646 -2170 -703 -3177 -5825 -4605
766 -4605 -3761 -7154 -3685 1209 -3048 -1201 3530 -3144 -4577 -361 -4766 -5691 -1060 -1503 -2354 151
782 151 2074 -291 -2146 1441 -16 -3757 2796 4303 448 6294 7533 1430 2756 3461 -1506 -1070
$$ packed form
670h721L583P84M880L203k140n836j360M62n057N394J0069l231K647N235j0392
685d80m135K844m483N70P540L281J40J32O19m769n314M941R00k804R611K736o055
702E274M928l54q413R53J378l455J085L759J462j768J551K973o287k348L989n784
718a057j376Q527j148o85O689k437o313J59l164l646m8N408K886j408M841J20
734G348r389m4j0p958M412O466j898K456L910m591m508r26j395k592J573O289
750h57k93j314N604m138o903M072k298m243O174J723k173K476J467k474k648J220
766d605Q44l393L469M894m257J847M731o674j433M216m405r25M631m43q51K505
782A51J923k365j855L587j457l741O553J507l855N846J239o103J326P05m967M36
$$ plain form
798 -1070 2439 2382 2106 4767 6712 1618 1003 3989 -431 -1020 5813 4004 3138 8950 6414 2113 4467
815 4467 3991 1104 1857 5129 3558 1330 4366 3643 -1673 1213 3275 -2000 674 3742 -2089 -2011
831 -2011 708 -2128 -2620 1077 2681 614 1286 3226 -999 -3496 312 -2328 -4381 1627 940 -3187
847 -3187 90 -1220 -6592 -5981 -5192 -7107 -6873 -3050 -1887 -3971 -664 1802 -3343 -2687 57 -5124
863 -5124 -5392 -248 -2727 -2232 3267 1894 -939 -1308 -2820 -7297 -8506 -4356 -3605 -2985 3890 4601 -650
880 -650 1008 -803 -6905 -4395 -371 -736 3274 8050 6567 3410 2737 1332 -3528 -2192 2371 628
896 628 2208 7297 3551 325 3288 -224 -3381 287 1619 519 2994 5449 4339 2959 5231
911 5231 4603 489 3487 4689 233 3136 6167 1782 2356 4136 -183 -2540 -674 -1370 -2323 456
$$ packed form
798a070L509n7k76K661J945n094o15K986m420n89O833j809q66N812k536m301K354
815D467m76k887P53L272j571k228L036p23n316K886K062n275K674L068n831P8
831b011K719k836m92L697J604k067O72J940m225k497L808k640k053O008o87m127
847c187L277j310n372O11P89j915K34L823J163k084L307K466n145O56K744n181
863e124k68N144k479M95N499j373k833l69j512m477j209M150P51O20O875P11n251
880f50J658j811o102K510M024l65M010M776j483l157o73j405m860J336M563j743
896F28J580N089l746l226K963l512l157L668J332j100K475K455j110j380K272
911E231o28m114K998J202m456K903L031m385N74J780m319k357J866o96r53K779
$$ plain form
927 456 3521 1585 543 2939 -1357 -4539 -53 -58 -1295 4524 5176 636 548 -920 -5563 -6264 -3037
944 -3037 -1549 -1382 2597 3300 -2342 -3289 -3375 -8140 -7237 -1593 -2098 -742 3619 1221 -2381 -2202 -3510
961 -3510 -6366 -5104 -1236 -747 -714 3457 2005 -2602 -751 -1974 -6437 -4013 -1733 -3501 -716 2793
977 2793 1398 -77 730 -389 -4518 -3161 -321 -1452 1219 6587 4383 2261 4112 -287 -4458
992 -4458 -1851 -890 -689 3470 6523 4474 2729 2778 -882 -4243 -885 1735 910 5028 7632 3403
1008 3403 2114 2450 -2311 -3160 683 1912 2393 5144 5744 2421 695 1787 -1132 -2262 2103 1702
1024 1702 666 4363 3373 -714 -36 147 -3493 -2736 -270 -734 -918 2066 2381 -827 48 394 -3838
1041 -3838 -3545 147 -1957 -1423 2808 1285 -1023 -334 -2158 -5449 -4427 -2118 -2583 -1076 2601 1232
$$ packed form
927D56L065j936j042K396m296l182M486nj237N819O52m540q8j468m643p01L227
944c037J488J67L979P03n642r47q6m765R03N644n05J356M361k398l602J79j308
961c510k856J262L868M89L3M171j452m607J851j223m463K424K280j768K785L509
977B793j395j475Q07j119m129J357K840j131K671N368k204k122J851m399m171
992d458K607R61K01M159L053k049j745M9l660l361L358K620q25M118K604m229
1008C403j289L36m761q49L843J229M81K751O00l323j726J092k919j130M365m01
1024A702j036L697r90m087O78J83l640P57K466m64j84K984L15l208Q75L46m232
1041c838K93L692k104N34M231j523k308O89j824l291J022K309m65J507L677j369
$$ plain form
1057 1232 -1985 -1235 -3112 -6669 -4096 -1063 -1921 1035 3231 155 -1851 -1529 -2784 -5040 -1757 1102
1073 1102 -26 1439 3436 -418 -2405 -660 -2823 -4149 65 763 -348 1567 2150 -359 -1195 473
1089 473 -544 -1610 2420 3276 962 3027 4145 139 743 2043 -710 -804 2266 1500 532 2840 2905
1106 2905 78 138 1082 -919 -1079 2262 2474 1411 4690 3167 -35 494 248 -2364 -224 2635 2283
1123 2283 2004 3786 1944 -1755 -1148 -702 -2904 -1077 2464 821 517 2393 -915 -3182 -1809 -1880
1139 -1880 -2588 -193 2327 1004 169 921 -1099 -3638 -1302 -948 -2642 -46 1255 -1546 -1199 -284
1155 -284 -2817 -3670 -1718 -1689 -2454 -108 793 -875 -486 664 -2101 -2930 -344 -1172 -2188 1229 1460
1172 1460 -594 681 177 -2720 -2599 -1245 -1481 -1157 2269 2517 551 1441 905 -2999 -2093 -197 -1265
$$ packed form
1057A232l217P50j877l557K573L033q58K956K196l076k006L22j255k256L283K859
1073A102j128J465J997l854j987J745k163j326M214O98j111J915N83k509q36J668
1089D73j017j066M030Q56k314K065J118m006O04J300k753r4L070p66r68K308O5
1106B905k827O0R44k001j60L341K12j063L279j523l202N29k46k612K140K859l52
1123B283k79J782j842l699O07M46k202J827L541j643l04J876l308k267J373p1
1139a880p08K395K520j323q35P52k020k539K336L54j694K596J301k801L47R15
1155b84k533q53J952K9p65K346R01j668L89J150k765q29K586q28j016L417K31
1172A460k054J275n04k897J21J354k36L24L426K48j966Q90n36l904R06J896j068
$$ plain form
1189 -1265 384 3880 3123 1696 2193 361 -2555 -1779 377 2 1686 4809 3543 1106 2174 17
1205 17 -3079 -1035 323 -110 2149 4140 2817 1367 1893 397 -2053 -62 773 -219 1559 3603
1221 3603 1093 481 1363 -847 -2128 -432 -298 -936 1044 2385 624 681 1198 -898 -2460 -221 -557
1238 -557 -1721 1049 1522 -629 -32 -12 -2594 -3068 -1675 -1791 -1747 618 1407 -645 -178 34 -2739 -2490
1256 -2490 -660 -1184 -995 1643 1027 -837 -317 -753 -3175 -2394 -835 -1190 -667 1638 1035 -761 -23
1273 -23 -503 -2847 -1471 57 -755 178 2279 471 -267 646 -21 -1664 -280 1050 -312 733 2472
1290 2472 465 -187 1319 209 -1253 506 846 -434 415 2010 436 362 1903 838 -241 1172
1306 1172 1275 -329 1017 2069 323 747 2011 189 -515 779 281 -734 504 1120 -259 66
$$ packed form
1189a265J649L496p57j427M97j832k916P76K156l75J684L123j266k437J068k157
1205A7l096K044J358m33K259J991j323j450N26j496k450J991Q35r92J778K044
1221C603k510o12Q82k210j281J696J34o38J980J341j761N7N17k096j562K239l36
1238e57j164K770M73k151N97K0k582m74J393j16M4K365P89k052M67K12k773K49
1256b490J830n24J89K638o16j864N20m36k422P81J559l55N23K305o03j796P38
1273b3m80k344J376J528q12R33K101j808p38R13o67j643J384J330j362J045J739
1290B472k007o52J506j110j462J759L40j280Q49J595j574p4J541j065j079J413
1306A172J03j604J346J052j746M24J264j822p04J294m98j015J238O16j379L25
$$ plain form
1322 66 1094 -253 -765 1182 670 -645 916 914 -1267 65 469 -1486 -562 1211 133 -322 783
1339 783 -334 -1836 -1383 -232 -1526 -657 1151 -82 -641 466 -1106 -2847 -974 -867 -1572 -64
1355 -64 1399 135 -375 312 -1095 -2515 -600 -213 -1205 262 1071 -583 -683 -17 -1340 -1968 -498
1372 -498 -618 -1323 657 1178 -194 257 1060 -426 -955 411 -152 -1084 995 1259 227 1145 1439 -625
1390 -625 -1061 52 -634 -691 1272 1857 787 1814 1240 -841 -918 111 -732 -191 2250 1988 1116 1534
1408 1534 1245 -865 -767 423 -383 679 2375 1531 615 1082 222 -1765 -852 -109 -913 -1 1701 683
1426 683 142 945 28 -1123 -525 137 -648 -29 1345 338 -217 1090 -65 -1491 -569 -853 -1620 -507
1444 -507 314 -89 53 877 -793 -1600 -935 -1062 -2056 33 769 -303 425 695 -1059 -1844 -691 -954
$$ packed form
1322F6J028j347n12J947n12j315J561kk181J332M04j955R24J773j078m55J105
1339G83j117j502M53J151j294Q69J808j233n59J107j572j741J873J07p05J508
1355f4J463j264n10O87j407j420J915L87r92J467Q09j654j00O66j323o28J470
1372d98j20p05J980N21j372M51Q03j486n29J366n63r32K079K64j032R18K94k064
1390f25m36J113o86n7J963N85j070J027n74k081p7J029q43N41K441k62q72M18
1408A534k89k110R8J190q06J062J696q44r16M67q60j987R13P43q04R12J702j018
1426F83n41Q03r17j151N98O62p85O19J374j007n55J307j155j426R22k84p67J113
1444e07Q21m03J42Q24j670q07O65j27r94K089P36j072P28K70j754p85J153k63
$$ plain form
1462 -954 -947 489 1068 148 438 756 -1466 -1644 -152 -759 -938 987 1028 -406 394 259 -1280 -919 147
1481 147 -468 -194 1218 1529 194 1023 1010 -773 -422 428 -887 -455 1236 770 487 1768 961 -654
1499 -654 -548 -249 -903 -172 1457 1580 1067 1770 1034 -899 -205 -81 -1210 77 1571 1056 1071 1534 106
1518 106 -678 -686 -508 -1100 82 1220 370 558 1145 -236 -1262 -272 -626 -1185 -175 738 172 737 1250
1537 1250 29 -1132 -372 -759 -1858 -223 286 -175 134 1120 -577 -1557 -704 -1416 -2203 -478 338 147
1555 147 786 1066 -281 -822 -601 -1303 -1368 277 598 -8 1116 529 -1216 -1379 -766 -1227 -950 762 715
1574 715 223 949 420 -1068 -725 -197 -987 -518 1134 586 433 1131 642 -408 -231 13 -871 -366 872
1593 872 667 526 1589 910 -866 -200 -415 -1117 -189 1178 610 1310 1860 960 -378 28 -553 -873 263
$$ packed form
1462i54PJ436N79r20K90L18k222j78J492o07j79J925M1j434Q00j35j539L61J066
1481A47o15K74J412L11j335Q29j3j783L51Q50j315M32J691m66k83J281q07j615
1499f54J06K99o54P31J629J23n13P03p36j933O94J24j129J287J494n15J5M63j428
1518A06p84qJ78n92J182J138q50J88N87j381j026R90l54n59J010R13n66N65N13
1537A250j221j161P60l87j099J635N09m61L09R86j697r80Q53p12p87J725Q16j91
1555A47O39K80j347n41K21p02o5J645L21o06J124n87j745j63O13m61K77J712m7
1574G15m92P26n29j488L43N28p90M69J652n48j53O98m89j050J77K44q84N05J238
1593H72k05j41J063o79j776O66k15p02R28J367n68P00N50r00j338M06n81l20J136
$$ plain form
1612 263 1273 1050 961 1553 20 -1048 -369 -1130 -1326 19 1168 473 1170 997 -220 -610 -549 -445 -977
1631 -977 122 562 37 429 789 -582 -684 -522 -1107 -1341 131 227 -214 398 950 -336 -673 -107 -825
1650 -825 -1126 -102 16 -295 908 539 -739 -682 -455 -1229 -1215 268 107 -152 744 281 -712 -653 -91 -944
1670 -944 -558 749 249 82 766 -144 -785 22 76 -241 270 926 237 90 473 -41 -786 13 255 -540
1690 -540 313 879 54 177 692 329 -473 715 383 -665 379 742 35 544 1070 275 -198 -75 -468
1709 -468 -808 305 237 259 473 830 114 -568 223 -420 -367 653 624 349 769 446 -247 -741 78 -381 -400
1730 -400 525 672 -140 94 -30 -883 -391 149 -356 -150 739 -29 -671 -12 209 -769 -6 93 -391 -115
1750 -115 522 -296 -520 406 238 -523 -270 -6 -822 -340 328 -209 -201 638 93 -804 61 -61 -959 98
$$ packed form
1612B63J010k23q9N92j533j068O79p61j96J345J149o95O97j73j217l90O1J04n32
1631i77J099M40n25L92L60j371j02J62n85k34J472R6m41O12N52j286l37N66p18
1650h25l01J024J18l11J203l69j278N7K27p74J4J483j61k59Q96m63r93N9N62q53
1670i44L86J307n00j67O84r10o41Q07N4l17N11O56o89j47L83n14p45P99K42p95
1690e40Q53N66q25J23N15l63q02J188l32j048J044L63p07N09N26p95m73J23l93
1709d68l40J113o8K2K14L57p16o82P91o43N3J020k9k75M20l23o93m94Q19m59j9
1730d00R25J47q12K34j24q53M92N40n05K06Q89p68o42O59K21r78P63R9m84K76
1750a15O37q18k24R26j68p61K53K64q16M82O68n37QQ39n45q97Q65j22q98J057
$$ plain form
1770 98 889 451 157 882 -178 -814 -354 -361 -557 385 795 323 524 679 -543 -1154 -83 -59 -15 561 902
1791 902 -18 268 395 -420 -587 491 10 -87 731 581 49 384 837 -306 -204 520 -148 -702 355
1810 355 375 -86 559 810 -211 -253 -213 -690 -823 403 337 557 703 766 -408 -318 -115 -784 -450 282 516
1831 516 86 900 385 -548 -466 -660 -861 -305 340 278 -18 552 19 -567 -344 -350 -865 -523 183 -368 -61
1852 -61 326 443 -347 79 -174 -681 -362 -205 -419 60 793 197 -277 58 133 -910 -525 146 -221 277
1872 277 882 160 -166 261 -416 -853 -228 148 9 494 1096 48 -46 140 -794 -741 64 342 -17 645
1892 645 494 -5 -61 302 -384 -431 145 77 -47 367 537 -191 316 312 -273 -341 341 -98 -419 311 351 125
1914 125 313 392 -367 -658 159 -384 -266 620 542 197 354 31 -683 -317 -155 -28 10 561 481 -166 183
$$ packed form
1770I8P91m38k94P25j060o36M60pj96R42M10m72K01J55j222o11J071K4M4N76L41
1791I02r20K86J27q15j67J078m81r7Q18j50n32L35M53j143J02P24o68n54J057
1810C55K0m61O45K51j021m2M0m77j33J226o6K20J46O3j174R0K03o69L34P32K34
1831E16m30Q14n15r33Q2j94k01N56O45o2k96N70n33n86K23on15L42P06n51L07
1852f1L87J17p90M26k53n07L19J57k14M79P33n96m74L35P5j043L85O71l67M98
1872B77O05p22l26M27o77m37O25L76j39M85O02j048r4J86r34N3Q05K78l59O62
1892F45j51m99n6L63o86m7N76o8j24M14J70p28N07mn85o8O82m39l21P30M0k26
1914A25J88P9p59k91Q17n43J18Q86p8l45J57l23p14L66J62J27L8N51q0o47L49
$$ plain form
1935 183 -160 -594 -272 12 -324 -134 583 240 -381 72 -273 -819 -166 -39 -256 -170 646 91 -418 607
1955 607 189 -612 -88 -193 -341 25 257 -130 34 705 -56 -452 10 -43 -544 -108 365 75 265 544
1975 544 -220 -517 126 -266 -722 228 467 285 453 449 -304 -206 -170 -357 -464 378 459 112 85 626 -160 -411
1997 -411 273 -356 -355 42 321 -12 945 664 -293 -60 110 -410 -375 24 269 -246 517 484 -335 -184 87
2018 87 -389 -192 63 -83 -66 399 679 -20 42 26 -491 -88 419 -64 -51 289 -42 -407 76 -208 -637 -241
2040 -241 353 -245 55 404 61 -391 102 -238 -692 -60 18 -298 -12 552 -57 -494 -162 -335 -481 -124
2060 -124 -224 -154 83 312 -65 -342 -60 -380 -351 500 164 -135 -28 384 106 -128 372 -123 -391 -8 16
2081 16 -178 73 566 -215 119 139 -266 -213 235 179 -89 487 426 179 27 497 -488 -370 245 -31 -203 559
$$ packed form
1935A83l43m34L22K84l36J90P17l43o21M53l45n46O53J27k17Q6Q16n55n09J025
1955F07m18q01N24j05j48L66K32l87J64O71p61l96M62n3n01M36M73k90J90K79
1975E44p64k97O43l92m56R50K39j82J68mp53R8L6j87j07Q42Q1l47k7N41p86k51
1997d11O84o29JL97K79l33R57k81r57K33J70n20L5L99K45n15P63l3q19J51K71
2018H7m76J97K55j46J7M65K80o99O2j6n17M03N07m83J3L40l31l65M83k84m29L96
2040b41N94n98L00L49l43m52M93l40m54O32P8l16K86N64o09m37L32j73j46L57
2060a24j00P0K37K29l77k77K82l20K9Q51l36k99J07M12k78k34N00m95k68L83K4
2081A6j94K51M93p81L34K0m05N3M48n6k68N76o1k47j52M70r85J18O15k76j72P62
$$ plain form
2103 559 430 -165 310 94 -401 -258 251 69 224 494 -48 -169 -119 159 -263 -3 588 191 -46 323
2123 323 -60 -483 -447 -13 -531 194 294 -14 190 167 -541 -388 143 -55 -340 -139 176 -340 166 387 -185
2144 -185 -72 238 -441 -556 -125 -347 27 198 382 -129 -238 190 -522 -315 233 345 -37 651 406 -62
2164 -62 -53 -248 -583 -586 415 136 26 575 347 -410 -604 -89 -492 -338 292 202 109 330 132 -378 -259 15
2186 15 -292 -296 438 217 189 554 -78 -201 -166 6 -505 -97 509 14 200 486 418 33 425 212 -635 -308
2208 -308 -33 -310 146 570 351 -21 325 -177 -699 -102 -125 -126 190 566 -130 -97 -50 -184 -541 164 296 -116
2230 -116 657 539 31 -169 22 -278 -206 353 472 -90 87 3 -298 -162 271 -263 93 52 -175 -320 74
2251 74 75 14 229 239 -172 -56 230 -138 -121 303 33 -85 76 132 -120 -614 94 -523 -52 536 208 -253
$$ packed form
2103E59j29n95M75k16m95J43N09j82J55K70n42j21N0K78m22K60N91l97k37L69
2123C23l83m23L6M34n18P25J00l08K04k3p08J53N31j98k85K01L15n16N06K21n72
2144a85J13L10o79j15M31k22L74J71J84n11j09M28p12K07N48J12l82O88k45m68
2164f2Rj95l35lJ001k79j10N49k28p57j94N15m03J54O30r0r3K21j98n10J19K74
2186A5l07mP34k21k8L65o32j23L5J72n11M08O06m95J86K86o8l85L92k13q47L27
2208c08K75k77M56M24k19l72L46n02n22N97k3jL16L76o96L3M7j34l57P05J32m12
2230a16P73j18n08k00J91l00P2N59J19n62J77q4l01J36M33n34L56m1k27j45L94
2251G4Jo1K15J0m11J16K86l68J7M24k70j18J61N6k52m94P08o17M71N88l28m61
$$ plain form
2273 -253 139 74 -314 -193 136 169 -137 643 215 -46 114 -210 -377 116 561 -14 295 656 160 -479 -166
2294 -166 70 -483 339 108 -49 63 502 -395 -101 352 38 -216 695 209 -152 -14 117 -177 -76 408
2314 408 228 -29 32 -152 -334 151 197 182 156 408 -237 -154 -173 -88 -135 -114 125 -101 170 287 -265 -178 -2
2337 -2 121 -180 350 145 -127 141 -7 -49 -72 322 -119 -154 200 -113 -356 329 96 -299 140 508 -208 -113
2359 -113 142 -162 -400 386 321 287 388 227 -266 -499 -44 -61 223 733 182 -167 167 -15 -282 -81 12
2380 12 -182 69 352 208 -107 -98 -146 -400 231 13 -97 153 269 49 -208 277 185 -75 -107 53 -20 -316
2402 -316 61 11 123 337 -50 -269 235 -41 -381 -77 89 -20 -2 128 7 -281 33 -181 -347 109 98
2423 98 59 236 475 -357 -374 -146 -216 -427 126 389 102 208 192 -229 -171 -26 -169 -147 384 319 -119 -37 219
$$ packed form
2273b53L92o5l88J21L29L3l06P80m28k61J60l24j67M93M45n75L09L61m96o39L13
2294a66K36n53Q22k31j57J12M39q97K94M53l14k54R11m86l61J38J31k94J01M84
2314D08j80k57O1j84j82M85M6j5k6K52o45Q3j9Q5m7K1K39k26K71J17n52Q7J76
2337bJ23l01N30k05k72K68j48m2k3L94m41l5L54l13k43O85k33l95M39L68p16R5
2359a13K55l04k38P86o5l4J01j61m93k33M55j7K84N10n51l49L34j82k67K01R3
2380A2j94K51K83j44l15Rm8k54O31k18j10K50J16k20k57M85r2k60l2J60p3k96
2402c16L77n0J12K14l87k19N04k76l40L04J66j09J8J30j21k88L14k14j66M56j1
2423I8l9J77K39q32j7K28p0k11N53K63k87J06j6m21N8J45j43K2N31o5m38Q2K56
$$ plain form
2446 219 14 -279 53 -271 -24 351 99 -116 151 148 31 -53 -40 -106 -421 242 222 -199 351 554 -154 -125
2468 -125 232 -288 -283 329 32 -85 382 -27 -254 -155 -49 66 -75 203 87 -14 315 55 -140 84 -77
2489 -77 -425 -33 127 -171 47 244 -251 -467 -109 -225 -426 122 289 -48 -95 131 22 -108 80 31 -89
2510 -89 28 306 -201 146 508 -235 -22 393 -74 -352 123 73 -505 -112 221 -414 31 264 -68 -180 -75
2531 -75 -65 -142 252 26 -175 -255 295 -254 -51 -19 -302 -116 313 74 5 -72 3 -277 -264 384 -77 -191 155
2554 155 148 -340 -43 67 -169 -172 343 54 -48 16 18 -136 286 234 -245 75 177 -168 32 133 -70 -85 131
2577 131 174 -101 -65 -31 -174 -153 85 -36 -71 234 -366 -120 341 53 -591 -58 -81 -285 -32 81 -117 -10
2599 -10 307 47 214 501 -67 -492 -104 -72 -308 -21 -1 78 -373 253 -159 -228 -225 -87 -44 -16 308 116 146
$$ packed form
2446B19k05k93L32l24K47L75k52k15K67lj17q4J3o6l15O63k0m21N50K03p08K9
2468a25L57n20NO12k97j17M67m09k27R9J06J15j41K78j16j01L29k60j95K24j61
2489g7l48L92J60k98K18J97m95k16L58j16k01N48J67l37m7K26j09j30J88m9j20
2510h9J17K78n07L47L62p43K13M15m67k78M75n0n78L93L33o35M45K33l32j12J05
2531g5J0p7L94k26k01q0N50n49K03L2k83J86M29k39o9p7P5k80J3O48m61j14L46
2554A55pm88K97J10k36lN15k89j02O4Kj54M22n2m79L20J02l45K00J01k03j5K16
2577A31M3k75L6L4j43K1K38j21l5L05o00K46M61k88o44N33k3k04K53J13j98J07
2599a0L17k60J67K87n68m25L88L2k36K87K0P9m51O26m12o9LJ38M3K8L24j92L0
$$ plain form
2622 146 273 -4 -181 -194 269 -245 -137 224 12 73 107 128 -315 -185 240 6 227 263 49 90 -9 -109
2644 -109 -350 14 63 -221 90 27 -195 108 397 147 -41 120 -43 -358 -8 -42 -4 -80 -38 -144 -241 6
2666 6 -109 -304 272 273 169 131 132 -84 47 263 73 -44 65 18 -259 11 220 -316 -244 164 -161 -91 192
2689 192 123 -81 -148 174 -162 -156 232 -24 -261 330 -2 -350 272 183 -187 112 344 -340 -179 260 -22 25
2711 25 71 -26 48 82 235 -82 0 -98 180 -14 95 -66 -270 134 144 -176 28 95 12 -110 433 -102 74
2734 74 343 -125 -74 -138 194 -123 -75 -209 -195 -302 -136 25 -115 119 91 -170 -99 30 -127 -157 206 -168 -5
2757 -5 250 -149 -206 -94 140 -85 -75 16 154 -270 166 -169 -38 28 175 40 198 163 -337 -231 88 -174
2779 -174 -227 185 73 -168 165 289 149 334 -40 25 -98 -31 -196 -212 462 107 -240 59 232 -169 -168 59
$$ packed form
2622A46J27k77j77j3M63n14J08L61k12O1L4K1m43J30M25k34K21L6k14M1r9j00
2644a09k41L64M9k84L11o3k22L03K89k50j88J61j63l15L50l4L8p6M2j06r7K47
2666Fj15j95N76Jj04l8Jk16J31K16j90j17J09m7k77K70K09n36P2M08l25P0K83
2689A92o9k04o7L22l36OL88k56k37N91l32l48O22q9l70K99K32o84J61M39k82M7
2711B5M6r7P4L4J53l17Q2r8K78j94J09j61k04M04J0l20K04O7q3j22N43n35J76
2734G4K69m68N1o4L32l17M8j34J4j07J66J61j40K34k8k61P1J29j57l0L63l74J63
2757eK55l99n7J12K34k25J0R1J38m24M36l35J31O6J47j35J58l5n00J06L19k62
2779a74n3M12j12k41L33J24j40J85l74O5j23O7j65j6O74l55l47K99J73m01JK27
$$ plain form
2801 59 -119 -221 172 -48 -438 230 29 -280 -196 -9 -57 -206 -2 415 -117 153 -12 -276 183 63 -31
2822 -31 231 307 -93 -205 16 -60 -124 -36 -129 -135 59 232 7 102 -2 51 -391 -2 200 -5 -71 270 -170 -148
2846 -148 213 -96 -240 -293 26 -123 54 4 35 -40 241 -385 -403 126 -28 -318 25 204 -24 -301 -4 -152
2868 -152 -295 31 -42 -151 304 98 -4 27 296 -57 -97 253 -215 -193 205 269 -70 172 -67 -375 -229 416
2890 416 -75 -188 83 232 -159 0 102 -321 -19 56 23 -108 82 -15 118 -168 -71 -16 52 256 -49 -161
2912 -161 187 -31 -158 169 133 125 34 40 -95 244 94 93 158 268 -188 -77 -108 126 -176 170 136 -162 -45 212
2936 212 -10 34 -63 223 18 139 328 -20 -2 -3 -77 -101 127 -120 35 480 305 -8 -139 -90 -219 -197 295
2959 295 179 91 225 -35 -190 -47 22 29 290 521 -21 32 363 -41 -192 -192 258 -246 -306 265 -19 -255 130
$$ packed form
2801E9j78j02L93k20l90O68k01l09Q4J87m8j49K04M17n32K70j65k64M59j20r4
2822c1K62P6m00j12K21p6o4Q8r3oJ94J73k25R5j04N3m42L89K02k05o6L41m40K2
2846a48L61l09j44n3L19j49J77n0L1p5K81o26j8N29j54k90L43J79k28k77K97j48
2868a52j43L26p3j09M55k06j02L1K69l53m0L50m68K2L98O4l39K42k39l08J46O45
2890D16m91j13K71J49l91J59J02m23L02P5l3j31J90r7J33k86R7N5O8K04l05j12
2912a61L48k18j27L27l6qr1Oj35L39j50jO5J10m56J11l1K34l02L46l4k98J17K57
2936B12k22M4r7K86k05J21J89l48J8jp4k4K28k47J55M45j75l13j31M9j29K2M92
2959B95j16q8J34k60j55J43O9PK61K31n42N3L31m04j51%M50n04o0N71k84k36L85
$$ plain form
2982 130 -43 96 53 46 -143 -119 264 95 117 8 199 70 -133 -60 -191 152 -117 -352 73 321 -100 -188
3004 -188 255 -201 -88 203 22 -21 59 155 -537 -139 17 -43 -58 381 60 -369 152 415 -192 -92 261 -401
3026 -401 -105 79 176 -145 -129 -17 -120 73 214 -131 -320 113 -243 -335 274 -214 144 26 -58 -141 124 13
3048 13 -91 -136 344 265 -166 35 212 -340 -66 221 -186 108 65 -265 165 -206 -243 -148 -91 -32 -373 -51 252
3071 252 -114 -271 60 -125 -126 28 207 -140 -135 141 -36 -54 246 -140 -284 -38 -48 -220 -120 29 22 -110 151
3094 151 140 -246 154 -21 -129 206 46 -103 144 436 -35 -297 154 -70 -237 183 49 -235 282 245 -66
3115 -66 -37 -18 -13 9 -4 316 111 467 64 -607 -185 281 -364 -340 230 89 -199 97 104 -144 291 113 -150
3138 -150 -241 -36 -155 47 246 118 -153 -76 274 -219 24 150 -70 128 224 120 37 18 -63 -434 -121 -62
$$ packed form
2982A30j73J39m3pj89K4L83j69K2j09J91j29k03P3j31L43k69k35M25K48m21q8
3004a88M43m56J13K91j81m3Q0R6o92L98J56o0j5M39l21m29N21K63o07J00L53o62
3026d01K96J84R7l21J6J12j03J93J41l45j89M33l56r2O09m88L58j18q4q3K65j11
3048A3j04m5M80p9m31K01J77n52K74K87m07K94m3l30M30l71l7R5N7N9l41L22L03
3071B52l66j57L31j85jJ54J79l47NK76j77j8L00l86j44K46j0j72J00J49pj32K61
3094A51j1l86M00j75j08L35j60j49K47K92m71k62M51k24j67M20j34k84N17l7l11
3115f6K9J9NK2j3L20k05L56m03o71M22M66o45K4N70j41k88K96Pk48M35j78k63
3138a50r1K05j19K02J99j28k71P7L50m93K43J26k20J98R6j04q3j9q1l71L13N9
$$ plain form
3160 -62 -311 -131 38 321 243 497 -35 -519 -246 -292 -106 34 372 -93 202 201 -35 -231 -56 -150 -347 45
3182 45 386 -2 -17 190 368 -89 209 -295 69 134 170 -50 -270 263 -162 -249 -79 -478 -291 -67 -23 -239
3204 -239 186 129 -99 -147 124 -52 -178 159 36 -118 253 37 -59 -196 -76 -50 -356 252 -68 -232 -1
3225 -1 6 -129 145 130 -167 -266 178 67 42 -34 30 -5 181 99 -70 -108 179 60 -142 212 -5 -311 168 -169
3249 -169 -189 -111 199 -484 51 267 46 293 160 246 -285 -66 113 -35 -120 188 -84 -64 -87 -143 -445 127
3271 127 59 -354 -25 123 19 -190 -99 91 -236 267 20 64 118 78 -197 -434 41 -363 -15 201 260 -250
3293 -250 26 76 -49 -1 14 -102 -252 52 54 -269 99 89 -93 -20 172 -87 -163 106 315 78 83 152 -57 87
3317 87 6 -343 -539 -80 -199 -269 301 -28 -286 39 -104 -272 -53 371 -20 47 -90 72 -196 221 5
$$ packed form
3160f2k49J80J69K83p8K54n32m84K73m6J86J40L38m65K95jk36j96J75r4j97L92
3182D5L41l88j5K07J78m57K98n04L64O5L6k20k20N33m25q7J70l99J87K24M4k16
3204b39M25n7k28m8K71j76j26L37j23j54L71k16r6j37J20K6l06O08l20j64K31
3225aPj35K74j5k97r9M44j11k5p6O4l5J86q2j69l8K87j19k02L54k17l06M79l37
3249a69k0P8L10o83N35K16k21K47j33Q6n31K19J79j48q5L08k72K0k3n6l02N72
3271A27o8m13L29J48j04k09R1J90l27N03k47M4N4m0k75k37M75m04L48K16N9n10
3293b50K76N0j25M8J5j16j50L04Kl23L68j0j82P3J92k59p6K69K09k37NO9k09J44
3317H7q1l49j96M59j19p0N70l29k58L25j43j68K19M24l91O7j37J62k68M17k16
$$ plain form
3338 5 -327 84 289 -70 -266 182 136 -25 6 284 -234 223 328 -211 -200 -80 94 -9 162 -111 -296 -30
3360 -30 221 -142 88 117 56 72 259 -133 -69 -146 38 -210 75 276 38 -185 242 -92 36 -9 14 -109 252
3383 252 141 -95 134 184 -98 -187 220 -293 -106 187 77 57 75 120 -39 154 273 -188 -350 267 139 183
3405 183 218 468 -215 -95 -38 -206 -1 -43 -145 96 325 305 -134 -69 265 -204 -151 244 5 -186 79 279
3427 279 -35 80 229 -362 -321 382 -89 -7 202 250 -376 114 33 -111 205 188 -67 -261 301 -39 -242 55
3449 55 161 -378 -13 169 -130 -162 160 -153 -147 27 119 -425 159 123 -197 -2 279 205 -1 212 -107 -302
3471 -302 43 134 -237 -38 200 23 127 191 -39 -307 -96 -181 -172 -271 225 66 -48 -82 -116 -69 53 154 -56
3494 -56 42 531 62 68 181 -101 -113 138 -163 150 395 -47 144 7 1 -216 -372 -107 -47 -415 244 -74 26
$$ packed form
3338El32M11K05l59j96M48m6j61L1K78n18M57J05n39J1J20J74j03J71k73j85K66
3360c0K51l63K30K9o1J6J87l92O4p7J84k48K85K01k38k23M27l34J28m5K3j23L61
3383B52j11k36K29N0k82q9M07n13J87K93j10k0J8M5j59J93J19m61j62O17j28M4
3405A83L5K50o83J20N7j68K05m2j02K41K29k0m39O5L34m69N3L95k39j91K65K00
3427B79l14J15J49n91M1P03m71Q2K09M8o26M90q1j44L16j7k55j94N62l40k03K97
3449E5J06n39L65J82k99l2L22l13OJ74R2n44N84l6l20J95K81p4k06K13l19j95
3471c02L45R1l71J99K38j77J04O4k30k68K11q5Rr9M96j59j14l4l4M7J22J01k10
3494e6R8M89m69OJ13k82j2K51l01L13K45m42J91j37ok17j56K65O0l68O59l18J00
$$ plain form
3517 26 258 39 -363 -53 4 -146 -210 231 99 -171 271 -240 -307 -34 50 1 -95 424 167 -261 73 83 -289
3540 -289 231 340 -19 139 265 131 -119 264 44 -543 -157 220 -164 -58 232 26 89 104 -285 50 22
3561 22 -187 65 138 48 -112 332 -35 -73 -79 274 -243 -233 -18 184 -352 130 27 -32 -95 56 -47 -33 20 72
3585 72 -168 15 381 -190 13 -68 -274 -281 79 -302 -369 -264 -9 -145 -82 44 -283 -107 -66 -331 -20 153
3607 153 61 -328 13 106 -107 43 174 -437 -18 130 317 12 30 223 -262 -236 69 -3 -129 137 124 63
3629 63 286 207 -212 42 76 -263 -20 131 -57 107 170 -247 -378 75 172 -66 228 108 7 -107 -99 -208
3651 -208 -280 202 196 -69 110 -19 -3 -74 30 -425 -348 155 247 -24 237 111 75 -198 20 -122 -188 155 -88
3674 -88 -238 217 338 173 132 230 -176 -233 51 -94 -194 485 76 -431 130 117 -256 -315 79 -47 32 271
$$ packed form
3517B6K32k19m02L10N7j50o4M41j32k70M42n11o7K73Q4m9r6N19k57m28L34J0l72
3540b89N20J09l59J58J26j34k50L83k20n87L86L77l84J06K90k06O3J5l89L35k8
3561B2k09K52P3r0j60M44l67l8oL53n17J0K15K02n36M82j03n9o3J51j03J4N3N2
3585G2k40J83L66n71K03q1k06pL60l81o7J05K55j36O3J26l27J76M1k65L11J73
3607A53r2l89L41R3k13J50J31o11M19J48J87l05J8J93m85K6L05p2j26K66j3o1
3629F3K23p9m19K54L4l39K43J51j88J64O3m17j31M53R7k38K94j20j01j14Qj09
3651b08p2M82ok65J79j29J6p1J04m55P7N03R2k71K61j26l6k73K18j42o6L43k43
3674h8j50M55J21j65m1R8m06n7K84j45j00O79m09n07N61j3l73n9L94j26P9K39
$$ plain form
3696 271 228 -276 84 -255 -192 83 134 -4 -25 113 -228 -37 310 -222 27 -107 240 -166 57 154 -20 -91
3718 -91 76 -10 -34 -95 134 1 -227 -106 -199 -338 144 3 -155 175 201 -50 -104 -114 -311 118 119 237 -213
3741 -213 -143 -4 -382 -22 291 -236 132 -121 -77 17 -51 -95 -165 137 135 47 7 191 7 -67 -49 226 217 160 300
3766 300 68 204 138 -165 206 -64 -202 -47 90 -19 -267 -124 -38 -131 -164 153 -69 124 1 0 -217 69
3788 69 -194 -181 167 277 151 25 274 -128 -171 -42 131 -185 69 39 90 -28 -32 -150 -84 125 132 24 244
3811 244 230 -25 46 50 5 -24 25 6 -188 110 -62 98 108 163 -200 124 -71 -178 -123 3 19 -83 -141 92
3835 92 -312 129 -43 23 -122 -82 -72 -276 187 -207 -372 -136 186 -35 -220 61 12 -18 272 41 -70 123
3857 123 133 -114 -109 59 163 -61 27 -303 -596 11 -70 -403 -157 226 -145 -71 190 92 -330 179 32 -213
$$ packed form
3696B71m3n04L60l39O3K75N1j38k1J38l41J91L47n32K49j34L47m06K23R7j74p1
3718i1J67q6k4o1K29j33k28J21r3j39M82j41j58L30K6k51n4j0j97M29JJ18m50
3741b13P0J39l78L60L13n27L68k53M4R4o8m4p0L02kq8m0J84j84p4J8K75rn7J40
3766C00k32J36o6l03L71k70j38J55J37j09k48J43Q6r3l3L17k22J93j23jk17K86
3788F9k63J3L48J10j26j26K49m02m3J29J73l16K54l0N1j18mj18O6K09Pj08K20
3811B44j4k55P1Mm5k9M9j9j94K98j72J60J0N5l63L24j95j07N5J26J6j02n8K33
3835I2m04M41j72O6j45M0J0k04M63l94j65K36L22k21j85K81m9l0K90k31j11J93
3857A23J0k47NJ68J04k24Q8l30k93O07q1l33K46L83l71P4K61r8m22N09j47k45
$$ plain form
3879 -213 175 127 45 -133 46 -80 -194 93 -279 -1 215 -31 -224 -351 230 -206 -247 -118 105 -154 62
3900 62 116 -562 303 172 -160 -21 19 97 35 56 -38 111 218 257 18 45 331 -102 221 300 -169 -376 190
3923 190 18 -161 -36 -21 77 36 67 -10 -104 184 270 -150 158 -153 -227 -74 177 -197 -147 208 -89 -344 176
3946 176 177 -37 -7 177 -21 -151 143 -13 -163 87 19 -173 129 -44 -222 -245 69 -127 163 189 73 -352
3968 -352 -61 -213 -160 -232 190 123 -177 306 85 -110 -53 47 -257 60 60 -70 -172 405 -38 -422 127 22
3990 22 -246 77 -91 -94 -31 464 -308 -177 57 -277 -150 155 -35 -302 208 1 -182 -56 133 -112 -212
4011 -212 -167 172 -117 102 68 -56 25 67 -48 -62 160 59 -51 278 191 2 8 7 101 -41 410 -71 231 17
4035 17 63 -399 -88 37 -176 191 145 95 -287 380 70 -133 -48 94 -206 236 165 46 64 99 186 -67 123
$$ packed form
3879b13L88m8q2j78J79j26j14K87l72K78K16k46j93j27N81m36m1J29K23k59K16
3900F2N4o78Q65j31l32J39M0P8o2K1r4J49J07L9k39K7K86m33L23P9m69k07N66
3923A90j72j79J25J5R8m1L1p7r4K88Q6m20L08l11p4J53K51l74N0L55k97k55N20
3946A76Jk14L0J84j98j30K94j56j50K50o8j92L02j73j78k3L14j96K90K6j16m25
3968c52K91j52N3p2M22o7l00M83k21j95N7J00l04L17%j30j02N77m43l84N49j05
3990B2k68L23j68lO3M95p72J31K34l34J27L05j90k67N10k07j83J26J89k45j00
4011b12M5L39k89K19l4j24Q1M2j15j4K22j01j10L29q7j89OjR4j42M51m81L02k14
4035A7M6m62L11J25k13L67m6n0l82O67l10k03Q5J42l00M42p1j19J8L5Q7k53J90
$$ plain form
4058 123 228 -27 41 66 -154 28 448 84 32 97 -60 -217 21 -107 -198 72 482 166 47 249 -353 -15
4080 -15 188 174 -231 -7 178 89 -20 12 -287 -194 44 257 -173 229 101 196 -208 -10 -53 -290 317 -7
4102 -7 -19 7 235 -174 -94 -172 -56 -106 204 164 43 213 438 77 -6 -302 -271 11 -323 77 -185 39 63 -81
4126 -81 201 -55 -288 -281 56 -114 -83 329 92 81 106 162 -172 -258 9 -246 -22 279 183 -113 113 121 -125 -59
4150 -59 -145 -56 -94 170 6 80 237 -139 -135 -330 216 -124 72 385 29 -59 387 67 -439 -65 226 -230 178
4173 178 270 68 -194 116 10 -451 64 40 -143 46 -116 -181 96 195 -220 -230 168 -6 -84 -93 186 -30 151
4196 151 238 -216 334 -105 -89 -45 239 -58 40 35 122 -73 31 -127 -43 -296 -242 167 81 25 253 -47 -193 -38
4220 -38 -316 -361 65 -57 102 280 328 117 146 94 75 35 12 -93 -75 304 100 212 -279 118 -17 -45 73
$$ packed form
4058A23J05k55O8K5k20J82M20l64n2O5j57j57K38j28r1K70M10l16j19K02o02L38
4080a5K03j4m05K24J85q9j09L2k99R3K38K13m30M02j28R5m04J98m3k37O07l24
4102gj2K6K28m09Q0p8J16n0L10m0j21J70K25l61q3k96L1K82l34M00k62K24K4j44
4126h1K82k56k33PL37j70L1M12k37j1K5N6l34q6K67k55K24L01r6k96K26Qk46O6
4150e9q6Q9l8K64j64P4J57l76Mj95N46l40J96L13l56q8M46l20n06L74K91m56M08
4173A78R2k02k62L10j06m61N15k4j83J89j62o5K77R9m15j0L98j74p8rK79k16J81
4196A51Q7m54N50m39J6M4K84k97R8nQ7j95J04j58Q4k53N4M09q6n6K28l00j46J55
4220c8k78m5M26j22J59J78M8k11K9n2j9m0k3j05J8L79k04J12m91L97j35k8J18
$$ plain form
4243 73 2 269 314 198 -28 258 -4 41 39 136 -289 36 40 251 -157 -91 21 -159 -28 37 -129 -69 268 53
4267 53 -99 141 -2 -166 -127 -75 169 144 -121 5 -24 286 -129 -136 -66 84 -157 -92 213 -82 -16 323 -367
4290 -367 -223 320 145 -184 110 -70 -95 237 312 -187 -257 -113 -78 -15 422 207 -115 175 214 -400 -288 258
4312 258 -209 -302 220 -13 -343 5 370 41 67 -43 -42 -44 107 117 3 279 -1 -163 -312 -49 -228 -45
4334 -45 53 -107 153 175 -37 57 -152 -147 -150 51 147 -69 -84 209 -287 -225 75 -115 3 31 -76 -146 21 168
4358 168 198 -17 9 127 -43 -64 -177 -401 57 115 64 -52 87 -120 -154 109 149 -129 236 56 47 -337 235
4381 235 153 -81 258 38 -10 183 254 -8 145 -3 -146 -23 9 266 76 123 -74 -427 38 73 11 -176
4403 -176 147 189 -293 190 113 -144 33 188 -102 -287 88 142 -304 -93 -297 -193 114 59 71 -243 -40 38
$$ packed form
4243G3p1K67M5j16k26K86k62M5kR7m25L25MK11m08O6J12j80J31O5j66O0L37k15
4267E3j52K40j43j64L9N2K44k5k65J26k9L10m15pP0J50k41O5L05k95O6L39o90
4290c67J44N43j75l29K94j80k5L32P5m99p0J44L5O3M37k15l22K90L9o14J12N46
4312B58m67r3N22k33l30L48L65l29K6j10JkJ51J0j14K76k80j62j49K63j79J83
4334d5R8j60K60K2k12R4k09NlK01R6k16j5K93m96O2L00j90J18K8j07p0J67J47
4358A68L0k15K6J18j70k1j13k24M58N8n1j16J39k07l4K63M0k78L65j80rl84N72
4381B35q2k34L39k20m8J93P1k62J53j48j43J23L2K57j90M7j97l53M65L5o2j87
4403a76L23M2m82M83p7k57J77J55k90j85L75N4m46K11k04J04L07n5J2l14K03P8
$$ plain form
4425 38 -275 174 256 -115 256 -26 -223 8 -152 -198 -105 260 211 -76 178 -64 -310 -41 -35 -400 -231 495
4447 495 37 -202 -24 179 -87 268 314 10 -60 192 6 -261 366 -36 -429 369 206 -36 -31 2 -103 -117
4469 -117 396 -22 -345 138 39 -300 -104 1 126 99 65 -33 106 486 -300 -270 179 -60 73 91 -75 -103
4491 -103 -312 417 -53 -171 -103 32 -15 58 45 21 -79 -25 -158 -364 236 42 -151 -41 -17 29 44 3 -123
4514 -123 116 175 34 -350 255 28 20 -206 152 -337 -36 199 -273 -121 204 59 -245 62 -27 -221 -312 24
4536 24 -122 16 51 211 -127 -78 241 -140 264 -143 -218 -267 19 26 -261 230 78 -378 -182 153 134 -166 118
4559 118 -47 -142 199 101 -146 3 148 -121 -59 220 -149 -53 239 -81 -221 -96 142 -412 -63 310 -28
4580 -28 124 51 124 -136 229 8 -85 -92 -148 -211 116 253 297 -9 353 -46 -128 -19 -238 -210 -38 64 67 -5 242
$$ packed form
4425C8l13M49Q2l71L71k82j97K31j60m6R3L65m9k87K54k42k46K69Ol65J69P26
4447D95m58k39J78K03k66L55M6l04p0K52j86k67O27m02l93P98j63k42NL3j05j4
4469a17N13m18l23M83r9l39J96J05J25k7l4r8J39L80p86L0M49k39J33J8j66k8
4491a03k09P29m70j18O8J35m7P3j3k4j00N4j33k06O00j94j93J10K4M6J5m1j26
4514a23K39N9j41l84O05k27qk26L58m89L01K35m72J52L25j45l04L07q9j94r1L36
4536B4j46J38L5J60l38M9L19l81M04m07p5m9K86Pk87M91j52m56J96L35j9l00K84
4559A18j65r5L41r8k47J49J45k69O2K79l69R6K92l20j40J25K38n54L49L73l38
4580b8J52p3P3k60L65k21r3pn6o3L27J37M4l06L62l99q2J09k19K8J72J02Lp2K47
$$ plain form
4605 242 -177 -122 -72 189 -178 227 180 264 -28 213 -114 -12 -3 64 174 -121 -22 43 -156 157 -196 136 101
4628 101 83 -56 73 411 -39 -194 354 24 -32 214 -61 -186 202 124 160 -7 456 26 125 187 -69 -197
4650 -197 -161 43 -168 254 102 305 132 42 -194 -117 21 -137 -242 102 54 -68 -11 204 -309 -314 -14 -114
4672 -114 -13 354 93 -291 60 177 61 130 100 11 70 163 25 -74 94 -212 -142 -176 -246 -286 147 241 -228 -3
4696 -3 124 78 -161 -81 49 -220 432 281 -18 56 326 11 -267 -164 24 -6 170 245 29 17 164 -77 -155
4719 -155 -135 61 193 135 200 -85 162 -5 -70 -61 131 64 -54 201 20 -177 135 130 -200 -281 56 151 -212 139
4743 139 135 31 195 273 -466 -36 140 -368 -133 227 358 -115 -60 -90 -278 -140 -61 -61 -186 198 114 -95 307
4766 307 -262 -202 -346 -69 -575 -236 246 -144 4 52 31 -103 0 354 -89 -157 93 -154 186 163 -125 -74
$$ packed form
4605B42m19N5N0K61l67M05m7Q4k92K41l27J02RO7J10k95R9O5j99L13l53L32l5
4628A01j8j39J29L38m50j55N48l30n6K46k75j25L88p8L6j67M63m30R9O2k56j28
4650a97L6K04k11M22j52K03j73r0k36P7J38j58j05L44m8j22N7K15n13nL00j00
4672a14J01L67k61l84L51J17j16O9l0q9N9R3j38r9J68l06P0l4p0m0M33R4m69K25
4696cJ27m6k39Q0J30k69O52j51k99P4K70l15k78J03J88l0J76P5k16j2J47k41p8
4719a55K0J96J32n8O5k85K47j67o5RJ92o7j18K55j81j97L12nl30q1L37R5l63L51
4743A39mj04J64P8p39M30J76n08K35L60J31m73N5l0j88J38P9%j25L84q4k09M02
4766C07n69O0j44K77n06L39M82l90J48M8k1j34J03L54m43o8K50k47L40k3k88N1
$$ plain form
4788 -74 -133 -413 -338 26 410 -202 187 322 121 -272 -49 -18 -150 -15 -86 47 -91 59 -141 -385 274 -222
4810 -222 54 -161 -244 -45 -1 14 68 -120 100 -252 -186 20 1 -97 120 78 -184 -77 58 -187 -165 79 -85
4833 -85 -158 116 209 -124 -96 79 -183 -42 64 -21 -25 231 119 -62 -8 40 -267 159 -229 -23 -64 63 114 -114
4857 -114 -16 197 -59 -129 57 -27 -78 155 -60 -159 183 27 -228 -18 -63 48 -8 -36 99 -130 -89 -108 -177 -19
4881 -19 -170 136 165 159 331 -301 52 -9 -235 88 115 -370 13 149 36 57 -18 -60 -85 90 185 -115 177 32
4905 32 17 -299 -174 177 -139 288 186 -49 -365 264 -86 183 128 -22 -257 9 148 -205 15 -38 32 -105
4927 -105 -16 -220 -116 165 42 -3 -55 231 -177 299 223 -202 -78 -122 -129 -66 85 -19 -109 -108 146 -447 -149 -52
4951 -52 -139 -91 86 -246 -178 -18 83 -181 27 -185 -104 -65 46 63 149 -65 224 -49 -111 53 87 -170 -56
$$ packed form
4788g4n9k80P5L64L84o12L89J35k01l93K23L1j32J35p1J33j38J50k00k44O59m96
4810b22K76k15q3J99M4J5N4j88K20l52O6K06j9r8K17m2k62J07J35k45K2K44j64
4833h5p3K74R3l33K8J75k62J41J06q5mK56j12j81N4M8l07M26l88K06m1J27N1k28
4857a14R8K13k56p0J86q4n1K33k15r9L42j56k55K10m5J11n6k8J35k29M1j9o9J58
4881a9j51L06K9oJ72o32L53o1k26L23K7m85L83J36j13K1p5m2k5J75R5l00K92j45
4905C2j5l16J25L51l16M27j02k35l16O29l50K69n5j50k35K66J39l53K20n3P0j37
4927a05Q9k04J04K81j23m5n2K86m08M76p6m25J24m4pO3J51j04r0JK54n93K98R7
4951e2q7M8J77l32O8J60J01k64K08k12Q1L9J11J7Q6k14K89k73o2J64L4k57J14
$$ plain form
4974 -56 -140 153 167 86 -127 -278 -113 -319 41 275 4 74 180 24 -77 -57 -43 -412 172 -20 -217 -75
4996 -75 88 -72 -188 93 -221 107 35 -72 -268 172 90 38 -171 -40 104 -288 111 -70 -115 339 252 -143
5018 -143 -66 67 -84 33 242 -188 -48 -243 155 -138 -195 94 110 -294 98 -59 -65 110 28 -96 90 309
5040 309 -274 22 90 20 -75 210 -31 179 26 209 -290 -257 12 -223 -74 221 121 -121 -81 -45 -51 64 85
5063 85 -55 120 64 58 227 91 214 -148 318 202 -112 -10 53 -105 44 305 131 -183 198 -68 -64 63
5085 63 254 -241 -107 -60 16 16 179 -214 -189 441 156 28 25 155 76 -278 -110 42 -200 161 -94 -340 -146
5108 -146 63 -97 -116 127 28 -417 224 80 -131 -174 -32 -38 -298 -99 -87 -210 -154 -3 116 -45 64 -42
5130 -42 -196 218 -241 -46 150 -32 -162 60 207 67 104 407 -100 -139 1 -110 -255 164 157 -343 -84 12
$$ packed form
4974e6q4K93J4q1k13j51J65k06L60K34k71P0J06j56j01K0J4l69N84j92j97J42
4996g5J63j60j16K81l14L28p2j07j96M40q2n2k09J31J44l92L99j81m5M54q7l95
5018a43P7J33j51J17K09m30J40j95L98k93n7K89J6m04L92j57oJ75q2j24J86K19
5040C09n83K96O8p0r5K85k41K10j53J83m99L3K69k35J49K95j00k42M0L6oJ15K1
5063H5j40J75n6oJ69j36J23l62M66j16l14J02O3j58J49K61j74l14L81k66MJ27
5085F3J91m95J34M7P6%J63l93K5O30k85j28lJ30p9l54J68J52k42L61k55k46J94
5108a46K09j60j9K43r9m45O41j44k11m3J42ok60J99J2j23N6J51J19j61J09j06
5130d2j54M14m59J95J96j82j30K22J47j40L7L03n07l9J40j11j45M19pn00K59R6
$$ plain form
5152 12 -126 -204 136 66 163 330 239 -377 0 -133 -246 -215 -155 -78 -121 318 -57 -198 -2 -14 -60 28 137 149
5176 149 72 386 -122 -5 88 0 -302 -105 -74 197 116 92 -167 -25 127 -82 -55 -146 46 114 -5 53 -97
5199 -97 -99 296 41 -59 -6 -52 -273 14 6 -277 174 19 -121 -114 222 -153 -26 124 -198 -234 -261 -52 91 143
5223 143 148 -91 -95 18 -23 48 192 61 -277 -203 -15 142 -297 -8 -20 -176 -53 -79 -53 -32 193 -126 80 -181
5247 -181 28 -132 214 359 -71 240 124 134 47 230 -63 -69 -70 -34 -66 103 193 22 108 -71 191 -254 157
5270 157 -15 40 -59 -86 -136 7 274 -474 14 109 -40 -203 -28 160 -383 47 135 -316 -30 -129 -123 51 92
5293 92 -202 -111 -59 -193 -199 -45 145 226 47 235 120 -333 -39 44 -182 167 182 28 -23 382 50 -116 74
5316 74 182 193 176 27 20 -49 134 -291 173 312 -2 -98 -44 57 -195 -222 192 1 176 -171 48 26 78 204
$$ packed form
5152A2j38p8L40p0R7J67r1o16L77j33j13L1O0P7m3M39l75j41J96j2m6Q8J09J2
5176A49p7L14n08J17R3q8l02J97L1K71q1k4k59J42J52k09K7r1J92O8j19N8j50
5199i7kL95k55j00N3m6k21K87qk83M51j55j40PL36l75J27J50l22l6k7K09J43N2
5223A43Nk39mJ13m1P1J44j31l38P4J88J57m39K89j2j56J23k6K6K1K25l19K06k61
5247a81K09j60L46J45m30L11j16J0q7J83k93ojL6l2J69R0j71Q6j79K62m45M11
5270A57j72N5r9k7n0J43K67p48M88R5j49j63J75J88n43M30Q8m51K86r9OJ74M1
5293I2k94R1N2j34oJ54J90Q1j79J88j15m53K94Q3k26L49J5j54n1M05l32j66J90
5316G4J08J1j7j49po9J83m25M64J39l14r6N4J01k52k7M14j91J75l47K19k2N2J26
$$ plain form
5340 204 -4 -62 325 29 66 44 -332 -153 140 -82 -72 -95 74 -162 -271 330 -207 -163 159 153 -155 -224 125
5363 125 69 -28 194 111 274 150 -35 37 57 -124 11 -63 198 -303 -179 23 -295 -8 71 72 28 146 7
5386 7 -95 -44 -113 -167 -120 404 91 -143 265 27 -6 -323 8 -164 -18 249 261 -116 27 131 49 69 114 -21
5410 -21 -240 82 92 -142 393 -41 -216 129 -89 -269 483 79 5 35 140 -155 -332 23 85 -104 149 288
5432 288 -283 169 296 -277 -318 -150 -77 -221 72 123 -282 233 287 97 -269 -58 -91 -58 80 -15 -101 319 164
5455 164 -40 -137 439 -39 -202 -135 114 -7 66 66 -321 145 222 -252 -428 38 -122 -260 222 26 22 161 -130
5478 -130 78 139 -94 -10 -180 94 148 -264 -89 -285 -96 88 280 -88 -172 210 -57 27 68 -20 -185 -160 25
5501 25 -111 235 304 140 -146 119 -55 -183 -148 316 -161 3 121 -4 -2 180 -39 11 184 56 69 164 128
$$ packed form
5340B04k08n8L87k96L7k2l76J79K93k22J0k3J69k36j09O01n37M4L22ol08o9L49
5363A25n6r7K22q3J63j24j85P2K0j81J35p4K61n01J24K02l18K87P9Jm4J18j39
5386Gj02N1o9n4M7N24l13k34M08k38l3l17L31j72J46K67J2l77J43J04q2K0M5j35
5410b1k19L22J0k34N35m34j75L45k18j80P52m04p4L0J05k95j77L55O2j89K53J39
5432B88n71M52J27n73m1J68P3j44K93N1m05N15N4j90l66K11l3L3J38r5q6M20j55
5455A64k04r7N76m78j63O7K49j21P3%l87M66P7m74j76M66j60j38M82j96mJ39k91
5478a30K08O1k33Q4j70K74N4m12J75j96J89J84J92l68q4L82k67Q4M1q8j65K5J85
5501B5j36L46O9j64k86K65j74j28L5M64m77J64J18j25KJ82k19N0J73j28J3R5l6
$$ plain form
5524 128 -377 -267 -19 -15 -207 126 39 -326 166 275 -13 -110 282 17 -299 292 75 -155 -38 118 -10
5545 -10 289 -27 20 183 -50 -72 -211 73 -145 -222 81 -97 -116 -49 109 43 -115 121 214 -206 47 258 -64
5568 -64 -15 177 -336 -150 331 33 244 240 -217 -199 36 246 -331 49 185 190 53 119 -109 -347 86 -240 -148
5591 -148 -117 123 63 -98 189 -30 -269 -95 -124 -235 243 224 -142 -51 -1 -253 -203 173 83 70 109 -102 -222
5614 -222 -9 124 -7 -145 3 -64 -121 90 243 48 62 171 -47 -14 -104 -198 -217 -51 181 -12 150 345
5636 345 111 -228 59 -209 -394 108 87 -189 181 -11 -139 -82 175 -159 -128 55 -36 -101 162 269 -360 -142
5658 -142 12 -282 -156 157 46 -42 217 62 -26 9 -78 110 90 72 -439 -279 180 -6 -64 298 99 -313
5680 -313 82 -99 -191 -25 26 314 -129 121 -13 121 169 131 -99 28 -25 -191 -259 148 -310 -448 3 -46
$$ packed form
5524A28n05J10K48Mj92L33q7l65M92J09k88r7L92k65l16N91k17k30J17J56j28
5545a0K99l16M7J63k33k2j39K84k18p7L03j78j9O7J58o6j58K36R3m20K53K11l22
5568f4M9J92n13J86M81k98K11mm57J8K35K10n77L80J36Nj37O6k28k38M33l26R2
5591a48L1K40o0j61K87k19k39J74k9j11M78j9l66R1N0k52N0L76r0j3L9k11j20
5614b22K13J33j31j38J48o7n7K11J53j95J4J09k18L3r0r4j9J66K32j93J62J95
5636C45k34l39K87k68j85N02k1k76L70j92j28N7K57l34L1J83r1o5K63J07o29K18
5658a42J54k94J26L13j11q8K59j55q8L5q7J88k0j8n11J60M59j86n8L62j99m12
5680c13L95j81r2J66N1K88m43K50j34J34M8l8k30J27n3j66o8M07m58j38M51m9
$$ plain form
5702 -46 -197 -103 404 -87 -44 -4 -85 -92 -75 49 -357 170 138 -63 11 232 40 -206 105 -153 -151 119 138 -124
$$ packed form
5702d6j51R4N07m91M3M0q1pJ7J24m06N27l2k01P4K21j92k46L11k58KK70J9k62
$$ [...]
8191d1
##END NTUPLES=NMR FID
##END=
