##TITLE=1H_Pr 5249
 200.13MHz, CDCl3,
 8 sc
 
 15.1.2025
##JCAMPDX= 6.0         $$ Bruker NMR JCAMP-DX V2.0
##DATA TYPE= NMR FID
##DATA CLASS= NTUPLES
##ORIGIN= UXNMR, Bruker Analytische Messtechnik GmbH
##OWNER= pz
$$ XWIN-NMR		Version 3.5
$$ Wed Jan 15 16:00:01 2025 Russian Standard Time (UT+4h)  she@DPX200
##.OBSERVE FREQUENCY= 200.1313
##.OBSERVE NUCLEUS= ^1H
##.DELAY= (6, 6)
##.ACQUISITION MODE= SIMULTANEOUS
##.ACQUISITION SCHEME= undefined
##.AVERAGES= 8
##.DIGITISER RES= 18
##SPECTROMETER/DATA SYSTEM= spect
##.PULSE SEQUENCE= zg30
##.SOLVENT NAME= DMSO
##.SHIFT REFERENCE= (INTERNAL, DMSO, 0, 14.3821)
##AUDIT TRAIL= $$ (NUMBER, WHEN, WHO, WHERE, WHAT)
$$ ##TITLE= Audit trail, XWIN-NMR		Version 3.5
$$ ##JCAMPDX= 5.01
$$ ##ORIGIN= Bruker BioSpin GmbH
$$ ##OWNER= she
$$ F:/spectra/data/she/nmr/H-C/1/audita.txt
$$ ##AUDIT TRAIL=  $$ (NUMBER, WHEN, WHO, WHERE, WHAT)
(   1,<2025-01-15 15:57:59.21 +0400>,<she>,<DPX200>,
      <created by zg, POWCHK disabled, PULCHK disabled
       configuration hash MD5:
       00 E9 B6 7A A2 85 ED C7 34 08 36 98 17 FE 4E 26
       data hash MD5: 16K
       5A D5 98 D5 A7 F2 FB 59 FC 0E 70 75 EA 12 B1 13>)
$$ ##END=
$$ 
$$ hash MD5
$$ 21 B6 6F 8C 90 99 91 EF 79 2E 2A 3E 24 0B CB E8
##$RELAX= 
##$RELAX= 
##$RELAX= 
##$RELAX= 
##$RELAX= 
##$RELAX= 
$$ Bruker specific parameters
$$ --------------------------
##$DU= <F:/spectra>
##$EXPNO= 1
##$NAME= <H-C>
##$PROCNO= 1
##$TYPE= <nmr>
##$USER= <she>
##$AMP= (0..31)
100 100 100 100 100 100 100 100 100 100 100 100 100 100 100 100 100 100 
100 100 100 100 100 100 100 100 100 100 100 100 100 100 
##$AQSEQ= 0
##$AQ_mod= 1
##$AUNM= <au_zg>
##$AUTOPOS= <>
##$BF1= 200.13
##$BF2= 200.13
##$BF3= 200.13
##$BF4= 200.13
##$BF5= 200.13
##$BF6= 200.13
##$BF7= 200.13
##$BF8= 200.13
##$BYTORDA= 1
##$CFDGTYP= 0
##$CFRGTYP= 5
##$CHEMSTR= <none>
##$CNST= (0..31)
1 1 145 1 1 1 1 1 1 1 1 1 1 1 1 1 1 1 1 1 1 1 1 1 1 1 1 1 1 1 1 1 
##$CPDPRG= <>
##$CPDPRG1= <>
##$CPDPRG2= <>
##$CPDPRG3= <>
##$CPDPRG4= <mlev>
##$CPDPRG5= <mlev>
##$CPDPRG6= <mlev>
##$CPDPRG7= <mlev>
##$CPDPRG8= <mlev>
##$CPDPRGB= <>
##$CPDPRGT= <>
##$D= (0..31)
0 0.7 0 0 0 0 0 0 0 0 0 0.03 0 0 0 0 0 0 0 0 0 0 0 0 0 0 0 0 0 0 0 0 
##$DATE= 1736942278
##$DBL= (0..7)
120 120 120 120 120 120 120 120 
##$DBP= (0..7)
150 150 150 150 150 150 150 150 
##$DBP07= 0
##$DBPNAM0= <>
##$DBPNAM1= <>
##$DBPNAM2= <>
##$DBPNAM3= <>
##$DBPNAM4= <>
##$DBPNAM5= <>
##$DBPNAM6= <>
##$DBPNAM7= <>
##$DBPOAL= (0..7)
0.5 0.5 0.5 0.5 0.5 0.5 0.5 0.5 
##$DBPOFFS= (0..7)
0 0 0 0 0 0 0 0 
##$DE= 6
##$DECBNUC= <off>
##$DECIM= 32
##$DECNUC= <off>
##$DECSTAT= 4
##$DIGMOD= 1
##$DIGTYP= 9
##$DL= (0..7)
0 120 120 120 120 120 120 120 
##$DP= (0..7)
150 150 150 150 150 150 150 150 
##$DP07= 0
##$DPNAME0= <>
##$DPNAME1= <>
##$DPNAME2= <>
##$DPNAME3= <>
##$DPNAME4= <>
##$DPNAME5= <>
##$DPNAME6= <>
##$DPNAME7= <>
##$DPOAL= (0..7)
0.5 0.5 0.5 0.5 0.5 0.5 0.5 0.5 
##$DPOFFS= (0..7)
0 0 0 0 0 0 0 0 
##$DQDMODE= 0
##$DR= 18
##$DS= 0
##$DSLIST= <SSSSSSSSSSSSSSS>
$$ [...]
##$SUBNAM0= <"">
##$SUBNAM1= <"">
##$SUBNAM2= <"">
##$SUBNAM3= <"">
##$SUBNAM4= <"">
##$SUBNAM5= <"">
##$SUBNAM6= <"">
##$SUBNAM7= <"">
##$SUBNAM8= <"">
##$SUBNAM9= <"">
##$SW= 18.0517328524113
##$SWIBOX= (0..15)
0 0 2 0 0 0 0 0 0 0 0 0 0 0 0 0 
##$SW_h= 3612.71676300578
##$TD= 16384
##$TD0= 1
##$TE= 0
##$TE2= 300
##$TE3= 300
##$TEG= 300
##$TL= (0..7)
0 120 120 120 120 120 120 120 
##$TP= (0..7)
150 150 150 150 150 150 150 150 
##$TP07= 0
##$TPNAME0= <>
##$TPNAME1= <>
##$TPNAME2= <>
##$TPNAME3= <>
##$TPNAME4= <>
##$TPNAME5= <>
##$TPNAME6= <>
##$TPNAME7= <>
##$TPOAL= (0..7)
0.5 0.5 0.5 0.5 0.5 0.5 0.5 0.5 
##$TPOFFS= (0..7)
0 0 0 0 0 0 0 0 
##$TUNHIN= 0
##$TUNHOUT= 0
##$TUNXOUT= 0
##$USERA1= <user>
##$USERA2= <user>
##$USERA3= <user>
##$USERA4= <user>
##$USERA5= <user>
##$V9= 5
##$VALIST= <valist>
##$VCLIST= <CCCCCCCCCCCCCCC>
##$VD= 0
##$VDLIST= <DDDDDDDDDDDDDDD>
##$VPLIST= <PPPPPPPPPPPPPPP>
##$VTLIST= <TTTTTTTTTTTTTTT>
##$WBST= 1024
##$WBSW= 4
##$XGAIN= (0..3)
0 0 0 0 
##$XL= 0
##$YL= 0
##$YMAX_a= 153285
##$YMIN_a= -167361
##$ZGOPTNS= <>
##$ZL1= 120
##$ZL2= 120
##$ZL3= 120
##$ZL4= 120
##$ABSF1= 10
##$ABSF2= 0
##$ABSG= 5
##$ABSL= 3
##$ALPHA= 0
##$AQORDER= 0
##$ASSFAC= 0
##$ASSFACI= 0
##$ASSFACX= 0
##$ASSWID= 0
##$AUNMP= <proc_1d>
##$AZFE= 0.1
##$AZFW= 0.1
##$BCFW= 1
##$BC_mod= 2
##$BYTORDP= 1
##$COROFFS= 0
##$CY= -3
##$DATMOD= 1
##$DC= 2
##$DFILT= <>
##$DTYPP= 0
##$F1P= 0
##$F2P= 0
##$FCOR= 0.5
##$FTSIZE= 0
##$FT_mod= 4
##$GAMMA= 1
##$GB= 0.15
##$INTBC= 1
##$INTSCL= 1
##$ISEN= 128
##$LB= 0.25
##$LEV0= 0
##$LPBIN= 0
##$MAXI= 10000
##$MC2= 0
##$MEAN= 0
##$ME_mod= 0
##$MI= 1.114404
##$NCOEF= 0
##$NC_proc= 0
##$NLEV= 6
##$NOISF1= 3.799351
##$NOISF2= 2.8
##$NSP= 1
##$NTH_PI= 0
##$NZP= 0
##$OFFSET= 14.38212
##$PC= 1
##$PHC0= 252.8981
##$PHC1= 14.9922
##$PH_mod= 1
##$PKNL= yes
##$PPARMOD= 0
##$PSCAL= 0
##$PSIGN= 0
##$REVERSE= no
##$SF= 200.129724274929
##$SI= 16384
##$SIGF1= 3
##$SIGF2= 2
##$SINO= 400
##$SIOLD= 16384
##$SREGLST= <1H.CDCl3>
##$SSB= 0
##$STSI= 0
##$STSR= 0
##$SW_p= 3205.1282051282
##$SYMM= 0
##$S_DEV= 0
##$TDeff= 0
##$TDoff= 0
##$TI= <>
##$TILT= no
##$TM1= 0
##$TM2= 0
##$TOPLEV= 0
##$USERP1= <user>
##$USERP2= <user>
##$USERP3= <user>
##$USERP4= <user>
##$USERP5= <user>
##$WDW= 1
##$XDIM= 8192
##$YMAX_p= 0
##$YMIN_p= 0
$$ End of Bruker specific parameters
$$ ---------------------------------
##NTUPLES= NMR FID
##VAR_NAME=  TIME,          FID/REAL,        FID/IMAG
##SYMBOL=    X,             R,               I
##VAR_TYPE=  INDEPENDENT,   DEPENDENT,       DEPENDENT
##VAR_FORM=  AFFN,          ASDF,            ASDF
##VAR_DIM=   8192,          8192,            8192
##UNITS=     SECONDS,       ARBITRARY UNITS, ARBITRARY UNITS
##FACTOR=    0.0002768,     1,               1
##FIRST=     0,             0,               0
##LAST=      2.2672688,     0,               0
##MIN=       0,             -167361,         0
##MAX=       2.2672688,     153285,          0
$$ Real data points
##PAGE= N=1
##DATA TABLE= (X++(R..R)), XYDATA
$$ plain form
0 0 0 0 0 0 0 0 0 0 0 0 0 0 0 0 0 0 0 0 0 0 0 -1 8 -8 8 -8 8 -8 10 -13 16 -16 17 -22 24 -26 31 -33 37 -42 45 -50 58
43 58 -62 70 -76 84 -92 103 -111 124 -136 151 -167 183 -203 227 -254 284 -321 364 -422 493 -587
64 -587 722 -923 1250 -1893 3568 -16455 -27504 25982 25677 39124 89081 119903 153285 143773
78 143773 86039 69407 32765 -14059 -12552 -36453 -65844 -58595 -65368 -51543 -46738 -83135 -75475
91 -75475 -55633 -54101 -11509 16853 20398 41589 41786 51846 71246 42398 36235 50099 32119
104 32119 34428 31145 -2129 -18851 -49554 -69702 -53089 -67092 -68763 -35194 -28436 -12098 11228
117 11228 6484 17596 18190 10848 41106 46824 38873 60610 55131 44926 44163 16025 4962 -7382
131 -7382 -40231 -36068 -37152 -58403 -46617 -42430 -44010 -26245 -29177 -18094 2860 -7298 5537
$$ packed form
0@%%%%%%%%%%%%%%%%%%%%%jRj6J6j6J6j6J8k3K9l2L3l9M6n0N7o4P0p9Q7r5J08
43E8j20J32j46J60j76J95k14K35k60K87l18L50l86M30m81N38o05O85p86R15j080
64e87J309j645K173l143N461k0023j1049N3486l05J3447M9957L0822L3382r512
78A43773n7734j6632l6642m6824J507k3901k9391P249o773J3825M805l6397P660
91g5475J9842J532M2592K8362L545K1191J97J0060J9400k8848o163J3864j7980
104C2119K309l283l3274j6722l0703k0148J6613j4003j671L3569O758J6338K3326
117A1228m744J1112N94p342L0258N718p951K1737n479j0205p63k8138j1063j2344
131g382l2849M163j084k1251J1786M187j580J7765k932J1083K0954j0158J2835
$$ plain form
144 5537 24110 13727 25673 36367 33009 44922 34625 25599 34682 11571 -2706 1593 -19683
157 -19683 -23538 -18332 -26497 -15158 -19516 -29287 -9594 -11430 -15875 3595 1233 4250 16756 10227
171 10227 19337 18533 -514 11379 14194 2268 13656 7536 -2700 -791 -17393 -18883 -15178 -33586
185 -33586 -22522 -5321 -8188 7975 12334 4534 11423 137 -1914 12594 978 5605 24858
198 24858 18603 23242 21736 3458 3415 -9570 -20709 -6303 -13492 -17700 -2444 -8732 -8037 -4886
212 -4886 -18069 -10411 -8182 -14441 6514 10824 4026 15737 10527 6250 11459 -783 4755 12358
226 12358 730 11421 15116 -2168 -537 -8126 -16643 -8627 -16640 -12004 4134 -4258 1433 11022
240 11022 -2270 -371 -1336 -7889 5324 2838 2061 18746 9850 5232 12751 -1472 -4558 -4462 -15130
$$ packed form
144E537J8573j0383J1946J0694l358J1913j0297r026R083k3111j4277M299k1276
157a9683l855N206q165J1339m358r771J9693j836m445J9470k362L017J2506o529
171A0227R110q04j9047J1893K815j1926J1388o120j0236J909j6602j490L705j8408
185c3586J1064J7201k867J6163M359p800O889j1286k051J4508j1616M627J9253
198B4858o255M639j506j8278m3j2985j1139J4406p189m208J5256o288O95L151
212d886j3183P658K229o259K0955M310o798J1711n210m277N209j2242N538P603
226A2358j1628J0691L695j7284J631p589q517Q016q013M636J6138q392N691R589
240A1022j3292J899r65o553J3213k486p77J6685q896m618P519j4223l086R6j0668
$$ plain form
255 -15130 -5158 -4863 -13131 783 -2133 -10346 129 -5526 -5116 3014 -4160 5882 12659 1743
269 1743 12283 13668 2852 10157 5767 1247 8225 -3061 -2869 3714 -11222 -9060 -4452 -14902
283 -14902 -8612 -7966 -11716 390 -4196 -4207 9680 1505 1868 11364 3233 7166 9289 1854 11380
298 11380 7830 -1016 9077 1434 -7385 -960 -10465 -10806 -6270 -14853 -5090 -656 -8547 3314 3892
313 3892 -3623 5056 1219 857 10239 2578 8190 15536 3741 7363 7685 -4763 -1704 -6045 -10916
328 -10916 -1917 -8741 -8558 1648 -8067 -6908 -483 -7901 -1270 1530 -1014 10966 8931 4371 14549
343 14549 6329 1271 7029 -1430 599 3474 -5116 2264 257 -11004 -4012 -8323 -14314 -5599 -8596
358 -8596 -4645 4544 -1534 5143 10246 -419 5624 6824 343 8334 6070 4122 12049 1514 -80
$$ packed form
255a5130R972K95q268J3914k916q213J0475n655M10Q130p174J0042O777j0916
269A743J0540J385j0816P305m390m520O978j1286J92O583j4936K162M608j0450
283a4902O290O46l750J2106m586j1J3887q175L63R496q131L933K123p435R526
298A1380l550q846J0093p643q819O425r505l41M536q583R763M434p891J1861N78
313C892p515Q679l837l62R382p661N612P346j1795L622L22j2448L059m341m871
328a0916Q999o824J83J0206r715J159O425p418O631K800k544J1980k035m560J0178
343A4549q220n058N758q459K029K875q590P380k007j1261O992m311n991Q715k997
358h596L951R189o078O677N103j0665O043J200o481P991k264j948P927j0535j594
$$ plain form
373 -80 4316 -8814 -7921 -4656 -11939 -5385 -4285 -7835 1583 -3326 -6211 3637 -2872 -1537 7394 2147
389 2147 7963 10485 3033 9778 6075 -2982 4170 -1232 -5596 922 -5240 -3728 90 -9218 -4302
404 -4302 -2154 -10501 -1705 -231 -3271 6160 3385 3737 10767 2163 3653 8995 -990 2479 4769
419 4769 -2668 2679 -958 -5782 654 -7156 -9923 -1689 -8797 -6338 346 -5077 1480 3233 -2155
434 -2155 6673 4094 -784 8332 4226 2509 8893 1955 4032 5718 -4482 376 -589 -9336 -2020
449 -2020 -3893 -7129 414 -4390 -3233 2544 -5831 -1559 3346 -3713 3171 5675 936 7768 3941
464 3941 544 6659 -1590 -2535 3347 -4567 -2192 2011 -4759 512 -1158 -6665 1107 -2879 -5861
479 -5861 3642 -968 65 6019 -65 4147 5138 -2795 3692 2657 -3684 3963 988 -1914 3458
$$ packed form
373h0M396j3130Q93L265p283O554J100l550R418m909k885R848o509J335Q931n247
389B147N816K522p452O745l703r057P152n402m364O518o162J512L818r308M916
404d302K148q347Q796J474l040R431k775L52P030q604J490N342r985L469K290
419D769p437N347l637m824O436p810k767Q234p108K459O684n423O557J753n388
434b155Q828k579m878R116m106j717O384o938K077J686j0200M858r65q747P316
449b020j873l236P543m804J157N777q375M272M905p059O884K504m739O832l827
464C941l397O115q249r45N882p914K375M203o770N271j670n507P772l986k982
479e861R503m610J033N954o084M212R91p933O487j035o341P647k975k902N372
$$ plain form
494 3458 -3423 -2962 833 -7726 -2821 357 -5976 1159 1829 -2431 3727 -737 -2160 4431 -2305 124
510 124 6006 -679 3160 4738 -1700 3244 -223 -4357 2570 -2466 -3546 3567 -2030 -587 2440
525 2440 -3926 148 305 -5407 2070 561 -3254 4708 494 -979 3961 -2290 -419 2342 -4574
540 -4574 1474 2333 -3549 2548 549 -2994 2837 -2893 -2276 3274 -3089 295 4505 -2142 2098 2146
556 2146 -2953 2806 -444 -2752 4216 -963 -1191 4459 -1993 -144 1543 -4905 369 -635 -5001
571 -5001 2483 -154 -2836 3527 -985 -1687 2809 -2985 576 2856 -2866 3138 3132 -1940 3865 401
587 401 -2078 2873 -2927 -1696 2545 -4275 -34 2153 -3651 933 72 -3778 2274 -770 -1542 5003
603 5003 -800 422 4943 -1724 1490 2130 -2977 2341 179 -3440 3176 -1442 -3761 1496 -4105
$$ packed form
494C458o881M61L795q559M905L178o333P135O70m260O158m464j423O591o736K429
510A24N882o685L839J578o438M944l467m134O927n036j080P113n597J443L027
525B440o366M074J57n712P477j509l815P962m214j473M940o251J871K761o916
540d574O048Q59n882O097j999l543N831n730O17N550o363L384M210o647M240M8
556B146n099N759l250k308O968n179k28N650o452J849J687o448N274j004m366
571e001P484k637k682O363m512p02M496n794L561K280n722O004on072N805l464
587D01k479M951n800J231M241o820M241K187n804M584q61l850O052l044p72O545
603E003n803J222M521o667L214O40n107N318k162l619O616m618k319N257n601
$$ plain form
618 -4105 -2877 381 -4870 25 1464 -3128 3738 2736 -1122 4708 1191 480 5232 -366 2057
633 2057 4636 -1911 1450 1800 -4574 -425 -2775 -5575 -226 -4588 -4039 1779 -3486 -1177 2769 -2337
649 -2337 2284 2921 -316 5527 3379 933 6544 1390 173 3899 -2233 -922 325 -5391 -944
664 -944 -2024 -6390 -442 -2972 -5185 802 -2630 -1036 3844 -563 3736 6136 340 5465 4746 -12
680 -12 4602 1104 -1066 3040 -2502 -2531 846 -6421 -3808 -2294 -7337 -2272 -2127 -4147 2200 -329
696 -329 -400 5916 1338 2633 6499 1288 4444 5265 -160 4468 1702 -3019 1497 -3248 -5395 -1518
712 -1518 -6162 -4742 -1350 -5986 -1541 -209 -3815 2184 1847 -487 5202 2884 3449 7417 2189 3406
728 3406 4966 -1452 1266 905 -4419 -351 -2717 -5764 -761 -5180 -5290 -349 -4845 -1831 1471 -1945
$$ packed form
618d105J228L258n251M895J439m592O866j002l858N830l517p11M752n598K423
633B057K579o547L361L50o374M149k350k800N349m362N49N818n265K309L946n106
649b337M621O37l237N843k148k446N611n154j217L726o132J311J247n716M447
664i44j080m366N948k530k213N987l432J594M880m407M299K400n796N125p19m758
680a2M614l498k170M106n542k9L377p267K613J514n043N065J45k020O347k529
696c29p1O316m578J295L866n211L156Q21n425M628k766m721M516m745k147L877
712a518m644J420L392m636M445J332l606N999l37k334N689k318N65L968n228J217
728C406J560o418K718l61n324M068k366l047N003m419j10M941m496L014L302l416
$$ plain form
744 -1945 3201 3831 857 6319 3929 1574 6325 1500 832 4104 -1616 188 943 -5173 -1647 -2648
760 -2648 -7102 -1674 -3522 -4887 347 -2615 -1064 3736 -1085 2917 5141 384 4568 4691 700
775 700 5287 1687 -607 3223 -2271 -2394 177 -5449 -3121 -1183 -5828 -1038 -1521 -4100 1574 -1109
791 -1109 -1606 4093 413 2012 5396 910 3706 4214 -714 3257 1446 -2392 1802 -1864 -3421 497
807 497 -3987 -2835 -362 -5331 -1476 -95 -4082 1550 717 -863 4487 1248 1000 5234 308 1901
823 1901 4217 -1262 1846 1756 -2593 1081 -1728 -4163 403 -3571 -3712 399 -3662 -1375 1255 -2657
839 -2657 1490 1683 -1351 3718 1976 -207 4723 854 1027 4031 -1150 613 1415 -3675 -168 -409
855 -409 -4512 167 -2037 -3743 908 -2543 -1911 1510 -2168 380 2936 -1410 3241 2774 -218 4302
$$ packed form
744a945N146O30k974N462k390k355M751m825o68L272n720J804P55o116L526j001
760b648m454N428j848j365N234k962J551M800m821M002K224m757M184J23l991
775G00M587l600k294L830n494j23K571n626K328J938m645M790m83k579N674k683
791a109m97N699l680J599L384m486K796N08m928L971j811l838M194l666j557L918
807D97m484J152K473m969L855J381l987N632q33j580N350l239k48M234m926J593
823A901K316n479L108r0m349L674k809k435M566l974j41M111m061K287K630l912
839b657M147J93l034N069j742k183M930l869J73L004n181J763Q02n090L507k41
855d09m103M679k204j706M651l451O32L421l678K548K556m346M651m67k992M520
$$ plain form
871 4302 946 -560 3501 -983 -710 2048 -2944 -653 467 -4077 -268 -1358 -4043 952 -1272
886 -1272 -2226 2487 -1056 339 3174 -1182 1941 3312 -982 3185 2261 -805 3291 -125 -1314 1537
902 1537 -2834 -1928 621 -4335 -1141 -84 -4065 701 -611 -2736 2128 -404 -651 3830 -301 1726
918 1726 4543 -62 2725 2487 -1495 2300 191 -2477 1551 -2115 -3182 524 -3843 -2224 -108
933 -108 -4094 -242 318 -2575 2760 1318 -833 4309 931 1133 4319 51 1604 3094 -1811 1336
949 1336 821 -3511 538 -2251 -4062 -219 -4031 -2999 440 -3413 -474 1651 -1850 2100 2232 -438
965 -438 4204 2026 935 4848 421 697 3096 -1865 -377 567 -4322 -649 -1847 -4612 -58 -2632
981 -2632 -3431 960 -2381 -824 2672 -1028 2402 3617 128 4216 3042 -138 3958 777 -373
$$ packed form
871D302l356j506M061m484K73K758m992K291J120m544L809j090k685M995k224
886a272r54M713l543J395K835m356L123J371m294M167r24l066M096l416j189K851
902A537m371R06K549m956L194J057l981M766j312k125M864k532k47M481m131K027
918A726K817m605K787k38l982L795k109k668M028l666j067L706m367J619K116
933a08l986L852N60k893N335j442k151N142l378K02L186m268J553J490m905L147
949A336n15m332M049k789j811L843l812J032L439l853K939K125l501L950J32k670
965d38M642k178j091L913m427K76K399m961J488R44m889L673j198k765M554k574
981b632p99M391l341J557L496l700L430J215l489M088j174l180M096l181j150
$$ plain form
996 -373 2191 -2070 -1679 416 -4103 -1560 -1364 -4658 -919 -1789 -3567 1365 -690 -511 3969 177
1012 177 1909 4467 403 3365 3240 -454 2965 618 -1978 1521 -2152 -2971 -11 -4200 -2602 -689
1028 -689 -4183 -584 -127 -2895 2263 800 -676 3991 992 1816 4727 725 2189 3498 -1298 1716
1044 1716 422 -2858 72 -1901 -3872 -457 -3532 -3136 141 -3631 -800 1500 -1640 2039 2306
1059 2306 -57 4007 2020 720 4253 594 519 2689 -1743 55 468 -3601 -507 -1794 -4454 -369
1075 -369 -2514 -2969 1053 -1989 -779 2237 -934 2242 3315 -320 3699 2315 -385 3483 491
1090 491 -743 2192 -2094 -1404 145 -3891 -1195 -850 -4128 -18 -1151 -2736 1808 -740 -570 3010
1106 3010 -332 1403 3706 -188 2799 2543 -907 2133 342 -1996 1402 -1912 -2252 553 -3257
$$ packed form
996c73K564m261L91K095m519K543J96l294L739q70j778M932k055J79M480l792
1012A77J732K558m064K962j25l694L419k347k596L499l673q19K960m189J598J913
1028f89l494L599M57k768N158j463j476M667k999Q24K911m002J464J309m796L014
1044A716j294l280K930j973j971L415l075L96L277l772K831K300l140L679K67
1059B306k363M064j987j300L533l659p5K170m432J798M13m069L094j287k660M085
1075c69k145m55M022l042J210L016l171L176J073l635M019j384k700L868k992
1090D91j234K935m286O90J549m036K696L45l278M110j133j585M544k548J70L580
1106C010l342J735K303l894K987k56l450L040j791k338L398l314l40K805l810
$$ plain form
1121 -3257 -1821 178 -3593 -295 397 -2428 1895 830 -652 3448 637 988 3378 -340 1409
1136 1409 2188 -1794 1179 445 -2450 987 -1209 -2652 639 -2269 -1971 836 -2588 -220 1609 -1807
1152 -1807 1632 1441 -1199 2923 677 -232 2972 -441 423 2214 -1537 427 933 -2684 503 18
1168 18 -2872 881 -1233 -2032 1540 -1856 -347 1827 -1655 872 1886 -1428 1900 1108 -981 2415
1184 2415 27 -941 2092 -1278 -570 1410 -2158 113 573 -2391 967 -218 -2207 1561 -722 -1313
1200 -1313 1799 -1184 -18 2088 -1228 1298 1305 -1434 2055 718 -1381 2107 -636 -834 1749 -1878
1216 -1878 -225 678 -2173 186 554 -2314 1250 -38 -1817 1839 -613 -477 2140 -1084 759 2030
1232 2030 -1219 1304 1099 -1402 1893 -38 -1489 1543 -1416 -814 1304 -2224 -551 354 -2481 417
$$ packed form
1121c257J436J999l771L298O92k825M323j065j482M100k811L51K390l718J749
1136A409P79l982K973p34k895L437k196j443L291k908K98K807l424K368J829l416
1152a807L439j91k640M122k246r09L204l413Q64J791l751J964N06l617L187m85
1168A8k890L753k114p99L572l396J509K174l482K527J014l314L328p92k089L396
1184B415k388r68L033l370P08J980l568K271M60k964L358j185j989L768k283n91
1200a313L112k983J166K106l316K526Pk739L489j337k099L488k743j98K583l627
1216a878J653R03k851K359L68k868L564j288j779L656k452J36K617l224J843J271
1232B030l249K523k05k501L295j931j451L032k959O02K118l528J673R05k835K898
$$ plain form
1248 417 167 -1690 1581 -413 -1038 2526 -759 334 2423 -934 874 1919 -1674 1716 391 -1514
1264 -1514 1427 -1002 -1499 975 -2068 -1298 898 -2297 34 512 -2101 1264 730 -595 2403 533
1280 533 -86 2804 -289 421 2304 -1408 375 632 -2295 465 -654 -2479 764 -1571 -1666 1134
1296 1134 -1853 -374 1447 -1169 983 1693 -775 2339 1359 -257 2780 112 -15 1831 -1221 -196
1312 -196 741 -2516 -184 -512 -2795 415 -1062 -1925 1024 -855 -219 2070 -478 831 2425 -295
1328 -295 2010 1575 -488 2130 166 -1034 1377 -1373 -1481 393 -2542 -1145 140 -2723 80 -123
1344 -123 -1889 1221 -5 -787 2374 116 952 2799 16 1252 1732 -1130 1164 304 -1743 966
1360 966 -1170 -1642 115 -1887 -1568 471 -2541 -195 745 -1449 1281 644 -74 2529 724 286 2801
$$ packed form
1248D17k50j857L271j994o25L564l285J093K089l357J808J045l593L390j325j905
1264a514K941k429m97K474l043P70K196l195K331M78k613L365n34j325K998j870
1280E33o19K890l093P10J883l712J783K57k927K760j119j825L243k335r5K800
1296A134k987J479J821k616K152P10k468L114r80j616L037k668j27J846l052J025
1312a96R37l257K332l28k283L210j477q63K949j879O36K289k548J309J594k720
1328b95K305m35k063K618j964j200K411k750j08J874k935J397J285k863K803k03
1344a23j766L110j226p82L161k258Q36J847k783J236M80k862K294q60k047K709
1360I66k136m72J757k002L19K039l012K346R40k194K730o37p18K603j805m38K515
$$ plain form
1377 2801 -89 331 1721 -1360 245 258 -2127 236 -1038 -2608 603 -1401 -1569 1019 -1287 5
1393 5 1137 -946 1336 1494 -688 2328 1294 -262 2080 -82 -309 1251 -1736 -128 266 -2488
1409 -2488 -363 -460 -2410 377 -674 -1552 1425 -945 -274 1744 -266 857 2064 -496 1534 1050
1425 1050 -857 1462 176 -1056 1048 -1496 -1397 472 -1902 -374 250 -2131 401 133 -1426 1704
1441 1704 -59 -428 1851 -2 490 1690 -825 961 1209 -1321 999 463 -1553 682 -537 -1470
1457 -1470 851 -1375 -801 938 -1510 20 1046 -1171 1505 499 -734 1684 193 -340 2122
1472 2122 -620 -346 1289 -1638 297 373 -1572 722 -308 -1811 807 -642 -538 1362 -1034 272
1488 272 1255 -1232 722 977 -1150 1142 42 -817 1420 -376 -616 1279 -1292 -221 771 -1612
$$ packed form
1377B801k890M20J390l081J605J3k385K363j274j570L211k004j68K588k306J292
1393EJ132k083K282J58k182L016j034j556K342k162k27J560k987J608L94k754
1409b488K125r7j950K787j051q78K977k370O71K018k010J123J207k560K030m84
1425A050j907K319j286j232K104k544R9J869k374J528O24k381K532k68j559L130
1441A704j763l69K279j853M92J200k515J786K48k530K320n36k016K235j219r33
1457a470K321k226N74J739k448J530J026k217K676j006j233K418j491n33K462
1472B122k742K74J635k927J935P6j945K294j030j503K618j449J04J900k396J306
1488B72R83k487J954K55k127K292j100q59K237j796k40J895k571J071R92k383
$$ plain form
1504 -1612 384 531 -1538 1133 -72 -1032 1178 -715 -310 1272 -1064 57 1003 -1201 719 671
1520 671 -1027 1325 -188 -1057 1059 -778 -371 950 -1056 360 939 -1375 466 215 -1127 1099
1536 1099 -258 -772 1181 -868 -464 1028 -1268 106 681 -1194 800 343 -1025 1484 -212 -541
1552 -541 1331 -647 -55 1172 -940 433 343 -1336 469 -108 -1292 961 -678 -700 1112 -698 -299
1569 -299 1197 -912 703 904 -937 1352 455 -819 1110 -435 -335 1023 -1086 -194 565 -1703
1585 -1703 98 255 -1303 574 -66 -798 1387 -589 -90 1390 -490 454 1560 -684 823 650
1601 650 -899 995 -420 -1025 863 -786 -1188 664 -1600 -554 308 -1215 543 437 -903 943
1617 943 476 -411 1445 7 -89 1579 -813 268 898 -1154 531 -102 -1218 464 -1013 -1189 907
$$ packed form
1504a612J996J47k069K671j205r60K210j893M05J582k336J121R46k204J920m8
1520F71j698K352j513q69K116j837M07J321k006J416N79k314J841k51j342K226
1536A099j357n14J953k049M04J492k296J374N75j875J994m57j368K509j696l29
1552e41J872j978N92J227k112J373r0j679J805n77j184K253j639k2J812j810L99
1569b99J496k109J615K01j841K289q97j274J929j545J00J358k109Q92P59k268
1585a703J801J57j558J877o40p32K185j976M99J480j880R44J106k244J507j73
1601F50j549J894j415o05J888j649m02J852k264J046Q62j523J758j06j340J846
1617I43m67q87J856j438r6J668k392J081O30k052J685o33j116J682j477j76K096
$$ plain form
1634 907 -933 -566 784 -832 336 1094 -624 1104 930 -489 1390 241 -155 1189 -734 -108
1650 -108 596 -1410 -169 138 -1616 33 -114 -1171 911 -550 -674 1021 -452 -12 1312 -455
1666 -455 984 1046 -519 1049 231 -746 808 -336 -920 510 -1215 -605 237 -1526 50 168 -1079
1683 -1079 529 213 -542 1442 146 -120 1720 -393 677 1117 -757 606 496 -1018 487 -191
1699 -191 -1171 515 -802 -710 505 -920 -79 838 -838 865 671 -657 1193 343 -351 1374 -5
1716 -5 -156 1196 -1111 -8 421 -1197 258 -334 -1494 170 -678 -872 646 -768 -3 1245 -798
1733 -798 627 934 -644 1038 976 -455 1232 -181 -133 874 -928 -553 562 -1107 -112 176 -1058
1750 -1058 244 20 -746 1117 -222 -425 1520 -133 341 1082 -751 555 337 -970 823 91 -1019
$$ packed form
1634I07j840L67J350j616J168P58j718J728j74j419J879j149l96J344j923O26
1650a08P04k006J241L07j754J649j47j057K082j461j24J695j473M40J324j767
1666d55J439O2j565J568q18r77J554j144n84J430j725O10Q42j763J576J18j247
1683a079J608l16p55J984j296k66J840k113J070M40j874J363j10j514J505o78
1699a91r80J686j317R2J215j425Q41R17j676J703j94j328J850q50o94J725j379
1716ej51J352k307J103M29j618J455n92j160J664q48j94J518j414P65J248k043
1733g98J425L07j578J682o2j431J687j413M8J007j802L75J115j669R95K88j234
1750a058J302k24p66J863j339k03J945j653M74P41j833J306k18j307J793p32j110
$$ plain form
1767 -1019 736 -940 -779 658 -946 -237 445 -1075 108 317 -923 790 185 -446 1370 -173
1783 -173 -83 1153 -692 88 533 -917 351 248 -1121 785 -287 -1014 658 -588 -429 732 -688
1800 -688 247 661 -851 721 420 -773 1074 293 -497 1042 -745 -451 779 -850 -74 582 -974
1817 -974 289 136 -925 982 -258 -562 925 -716 -22 1097 -509 408 512 -756 664 477 -768
1834 -768 987 -306 -748 893 -457 -216 614 -810 112 710 -1004 749 94 -821 785 -407 -273
1851 -273 768 -514 -301 690 -710 329 242 -1033 518 115 -835 972 -323 -313 959 -367 -29
1868 -29 684 -546 208 222 -1039 791 -107 -932 604 -353 -686 681 -795 -18 797 -698 343 557
1886 557 -631 926 14 -787 1032 -694 -322 796 -746 -81 259 -1179 269 169 -1134 477 -353
$$ packed form
1767a019J755j676J61J437j604P09O82j520J183K09j240J713o05o31J816j543
1783a73R0J236j845P80M45j450J268j03j369J906j072p27J672j246J59J161j420
1800f88R35M14j512J572l01j193J847p81p90J539j787K94J230j629P76O56j556
1817i74J263j53j061J907j240l04J487j641O94J119j606R17J04j268J420j87j245
1834g68J755j293m42J641j350K41Q30j424R22N98j714J753o55r15J606j192J34
1851b73J041j282K13R91j400J039q7j275J551m03r50J807j295J0J272j326L38
1868b9P13j230P54J4j261J830q98q25J536r57l33J367j476P77Q15j495J041K14
1886E57j188J557r12q01J819j726L72J118j542O65L40j438J448j00j303J611q30
$$ plain form
1903 -353 -481 1050 -610 244 1018 -557 620 587 -877 566 372 -739 882 -23 -580 919 -604
1920 -604 -303 371 -587 -128 89 -1228 641 254 -460 828 -107 -158 1056 -187 329 1112 -547 507
1938 507 352 -1044 586 -160 -870 438 -810 -962 536 -712 -222 555 -555 235 404 -468 904
1955 904 325 -435 1106 -178 -17 818 -523 84 581 -1103 74 -205 -1372 570 -385 -1045 532
1972 532 -300 -449 991 -573 186 884 -278 716 519 -457 922 277 -620 652 -464 -554 460 -1125
1990 -1125 -302 68 -1095 -182 30 -953 914 -19 -172 919 -85 191 1266 -334 235 640 -523
2007 -523 803 384 -759 408 -443 -955 342 -693 -588 592 -1106 -207 275 -630 932 207 -151
2024 -151 952 -33 -135 1048 -157 124 336 -612 498 396 -1170 426 -330 -1045 261 -833 -666
$$ packed form
1903c53j28J531j660Q54P74j575J177l3j464J443j94j111J621r05n57J499j523
1920f04L01O74r58M59K17j317J869l87p14J288r35n1J214j243N16P83j659J054
1938E07j55j396J630p46p10J308j248j52J498j248M90P77j110P90J69q72J372
1955I04n79p60J541j284J61Q35j341O07M97j684J177k79j167J942r55o60J577
1972E32q32j49J440j564P59O98j162R94j97r76J379o45q97J272j116r0J014j585
1990a125Q23L70j163R13K12r83J867r33j53J091j004K76J075j600N69M05j163
2007e23J326m19j143J167q51n12J297j035J05J180j698Q99M82r05J562p25l58
2024a51J103r85j02J183j205K81K12r48J110j02j566J596p56p15J306j094J67
$$ plain form
2041 -666 599 -605 283 779 -290 540 787 -439 1397 160 -539 721 -189 -246 686 -459 -75 405
2059 405 -968 50 74 -924 432 -253 -618 634 -245 -31 996 -205 392 911 -392 586 415 -394
2077 -394 704 -225 -685 700 -622 -319 531 -732 164 314 -825 470 277 -593 899 158 -225 626
2095 626 -35 186 954 -657 -29 433 -661 388 -85 -819 381 -482 -470 555 -535 -34 719 -500
2113 -500 264 730 -488 523 107 -378 845 -6 -154 598 -583 -300 484 -701 23 161 -830 433
2131 433 -209 -797 881 -268 -302 933 -438 76 475 -319 416 268 -540 420 -45 -798 554 -299 -420
2150 -420 328 -634 -220 645 -887 256 371 -383 647 292 -498 748 -394 -318 688 -463 27 643
2168 643 -757 592 239 -715 156 -3 -589 445 -327 -233 694 -444 116 669 -458 524 723 -578
$$ packed form
2041f66J265j204Q88M96j069Q30K47j226J836j237o99J260r10n7R32j145L84M80
2059D05j373J018K4r98J356o85l65J252q79K14J027j201N97N19j303R78j71q09
2077c94J098r29m60J385j322L03Q50j263Q96J50j139J295j93q70J492p41l83Q51
2095F26o61K21P68j611O28M62j094J049m73p34J200q63J2J025j090N01P53j219
2113e00P64M66j218J011m16m85J223q51j48P52j181K83P84j185P24J38r91J263
2131D33o42n88J678j149l4J235j371N14L99p94P35j48q08R60m65p53J352q53j21
2150d20P48r62M14Q65j532J143J15p54J030l55p90J246j142P6J006j151M90O16
2168F43j400J349l53r54Q71j59n86J034p72R4R27j138N60N53j127R82J99j301
$$ plain form
2186 -578 487 -333 -403 644 -836 -287 521 -730 -154 629 -647 84 251 -577 635 202 -217 683
2204 683 -103 203 877 -428 158 606 -684 204 -199 -767 463 -291 -561 687 -552 -110 310 -939
2222 -939 -29 593 -561 475 -49 -595 864 -101 -228 606 -369 -195 475 -807 114 210 -734 349 -162
2241 -162 -375 535 -204 -247 566 -82 13 367 -443 443 217 -325 413 167 -58 538 -552 -380 485 -619
2261 -619 -41 376 -735 370 238 -659 451 -65 -93 603 -342 44 687 -518 105 98 -905 138 57
2280 57 -559 212 106 -311 520 -426 -233 657 -616 312 495 -534 648 435 -203 559 127 -287 454
2299 454 -362 -148 650 -766 -157 253 -546 337 -18 -656 664 -151 -466 762 -332 -192 581 -357 382
2318 382 342 -499 448 -137 -564 474 -293 -528 357 -603 -193 140 -423 249 309 -434 614 210 -286 617
$$ packed form
2186e78J065q20p0J047j480N49Q08j251N76P83j276P31J67q28J212m33m19R00
2204F83p86L06O74j305N86M48j290Q88m03n68J230p54k70J248j239M42M20j249
2222i39R10O22j154J036n24n46J459r65j27Q34r75J74O70j282R21R6r44J083n11
2241a62k13R10p39m3Q13o48R5L54q10Q86k26n42P38k46k25N96j090J72Q65j104
2261f19N78M17j111J105j32q97J110n16k8O96r45L86O43j205O23pj003J043q1
2280E7o16P71j06m17Q31r46J93Q90j273R28J83j029J182k13o38P62m32m14P41
2299D54q16K14P98j416O09M10p99Q83l55o38J320q15l15J228j094J40P73r38P39
2318C82m0q41R47n85m27J038p67k35Q85r60M10L33n63O72O0p43J048m04m96R03
$$ plain form
2338 617 -33 -162 583 -388 165 568 -597 220 -114 -497 343 -68 -610 401 -326 -238 555 -554 123
2357 123 23 -712 614 202 -426 564 207 -657 466 -332 -121 375 -641 128 314 -547 181 -158 -635
2376 -635 332 23 -361 375 -366 195 521 -511 397 344 -217 547 191 -259 228 -371 -424 432 -341 -264 351
2397 351 -460 -158 315 -408 282 13 -465 114 -38 -115 840 81 -163 584 -226 -16 446 -363 171 23
2417 23 -717 486 -304 -275 290 -464 -175 362 -453 410 194 -429 463 -34 -189 482 -278 -348 409 -636
2437 -636 -39 290 -755 200 -176 -778 418 -135 -411 486 -167 39 286 -238 385 607 -339 314 188
2456 188 -277 189 -248 -440 231 -255 27 202 -599 -278 329 -393 -164 104 -268 647 101 40 547 -229
2476 -229 -59 314 -436 252 111 -575 -210 143 -374 283 -293 -358 257 -331 -221 306 -476 160 286 -210
$$ packed form
2338F17o50j29P45r71N53M03j165Q17l34l83Q40m11n42J011p27Q8P93j109O77
2357A23j00p35J326m12o28R90l57q64J123p98K11M96j016P69J86q61P28l39m77
2376f35R67l09l84P36p41N61L26j032R08n3n61P64l56m50M87n99n3Q56p73P7O15
2397C51q11L02M73p23O90k69m78N79j52p7R55p59k44P47q10K10M62q09N34j48
2417B3p40J203p90K9N65p54K89N37q15Q63k16o23Q92m97j55O71p60p0P57j045
2437f36N97L29j045R55l76o02J196n53k76Q97o53K06K47n24O23K22r46O53j26
2456A88m65M66m37j92O71m86K82J75q01L21O07p22K29K68l72R15n46o1N07p76
2476b29J70L73p50O88j41o86L65L53n17O57n76o5O15n88J10N27p82O36J26m96
$$ plain form
2496 -210 390 113 -265 400 -157 -152 369 -351 -87 268 -552 196 30 -238 340 12 -410 445 160 37 459
2517 459 -200 93 254 -198 92 355 -298 346 -404 -427 392 -320 -248 404 -398 -62 446 -694 190 373
2537 373 -315 523 132 -393 470 -80 -240 213 -427 153 365 -898 171 163 -504 441 -225 -349 337 -241
2557 -241 -19 422 -258 271 347 -397 201 196 -148 570 -137 -351 421 -170 -122 268 -555 29 242 -295 403
2578 403 185 -233 294 -88 244 352 -42 -125 332 -561 244 301 -368 216 69 -468 254 -48 -437 551 -382
2599 -382 138 260 -524 168 209 -269 337 166 -105 596 59 124 262 -189 45 74 -318 -193 -169 -413 333
2620 333 -92 -559 261 -120 -45 104 -123 -12 367 0 170 339 -85 210 289 -325 127 -339 2 157 -361
2641 -361 -161 175 -378 -136 -71 -250 480 237 -26 536 -67 27 324 -151 306 453 -196 203 240 -482 196
$$ packed form
2496b10O00k77l78O65n57NN21p20K64L55q20P48j66k68N78l28m22Q55k85j23M22
2517D59o59K93J61m52K90K63o53O44p50k3Q19p12P2O52q02L36N08j140Q84J83
2537C73o88Q38l91n25Q63n50j60M53o40N80K12j263J069qo67R45o66j24O86n78
2557b41K22M41o80N29P6p44N98nl44P18p07k14P72n91M8L90q23N84K13n37O98
2578D03k18m18N27l82L32J08l94q3M57q93Q05N7o69N84j47n37P22l02l89R88r33
2599c82N20J22p84O92M1m78O06j71k71P01n37O5J38m51K34K9l92J25K4k44P46
2620C33m25m67Q20l81P5J49k27J11L79l67J70J69m24K95P9o14M52m66L41J55n18
2641c61K00L36n53K42O5j79P30k43k63N62o03R4K97m75M57J47o49L99L7p22O78
$$ plain form
2662 196 -390 -357 28 -282 -78 303 -189 21 475 -245 193 94 10 271 -297 -56 145 -214 17 486 -427
2683 -427 103 71 -81 54 103 -192 234 -89 -224 214 -88 -95 212 -275 152 382 -201 235 -75 -354 419
2704 419 -321 -219 191 -158 -80 204 -478 -7 174 -476 366 39 -404 277 112 -38 586 -18 -79 175 -371
2725 -371 235 154 -146 202 -107 -208 184 -188 -154 61 -139 11 319 -5 141 202 -100 470 -82 -433 236
2746 236 -187 -57 341 -64 -206 367 -289 265 51 -148 106 -39 -259 311 -170 51 210 19 238 74
2766 74 -188 499 262 127 412 -85 -59 218 -462 50 176 8 221 197 -253 238 86 -372 -19 -176 -280
2787 -280 365 -452 123 372 -449 29 44 -274 -129 -86 -240 363 -38 -264 210 -321 -134 -67 -361 280 172
2808 172 -489 218 113 -287 308 76 -57 320 -326 193 263 -464 268 -37 -95 451 -140 -557 299 87 -48
$$ packed form
2662A96n86L3L85l10K04L81m92K10M54p20M38r9q4K61n68K41K01l59K31M69r13
2683d27N30l2j52J35M9k95M26l23j35M38l02pL07m87M27K30n83M36l10k79P73
2704D19p40J02M10l49P8K84o82M71J81o50Q42l27m43O81j65j50O24o04o1K54n46
2725c71O06q1l00L48l09j01L92l72L4K15k00J50L08l24J46O1l02N70n52l51O69
2746B36m23J30L98m05j42N73o56N54k14j99K54j45k20N70m81K21J59j91K19j64
2766G4k62O87k37j35K85m97K6K77o80N12J26j68K13k4m50M91j52m58L53j57j04
2787b80O45q17N75K49q21M78J5l18J45M3j54O03m01k26M74n31J87O7k94O41j08
2808A72o61P07j05m00N95k32j33L77o46N19P0p27P32l05n8N46n91m17Q56k12j35
$$ plain form
2829 -48 253 -19 55 399 30 167 230 -247 41 -226 -422 -9 -369 -51 72 -50 -36 170 -415 149 87 -194
2851 -194 276 -28 -118 456 -10 -194 275 45 87 -40 -157 271 89 -308 -107 -125 -405 247 -224 -65 403
2872 403 -221 285 215 215 -125 -13 -67 435 -207 -154 100 -208 -3 6 -109 -242 -54 75 -100 41 -119 138
2894 138 200 -174 423 -204 -32 175 -225 82 190 -360 305 117 -50 46 -119 -79 343 -143 -155 27 -50 51
2916 51 -108 -4 370 150 -191 342 65 -113 600 -163 -78 -36 -97 -155 -191 -251 -47 -8 7 181 -25 -72 314
2939 314 -114 11 39 153 227 230 -195 248 111 -53 446 -246 59 103 -225 40 -60 -82 143 15 -240 -34
2961 -34 -99 -73 184 -78 142 271 -276 215 69 -165 367 -118 60 189 -56 -160 179 27 -116 97 -57
2982 -57 -210 143 -26 -130 87 -85 99 18 -102 192 -364 -162 184 -367 -106 138 -246 112 -99 196 175
$$ packed form
2829d8L01k72P4L44l69J37O3m77K88k67j96M13l60L18J23j22J4K06n85N64o2k81
2851a94M70l04r0N74m66j84M69k30M2j27j17M28j82l97K01j8k80O52m71J59M68
2872D03o24N06p0%l40J12n4N02o42N3K54l08K05Rj15j33J88J29j75J41j60K57
2894A38O2l74N97o27J72K07m00L07J08n50O65j88j67R6j65M0M22m86j2J82p7J01
2916E1j59J04L74k20l41N33k77j78P13p63Q5M2o1n8l6o0K04L9J5J74k06m7L86
2939C14m28J25K8J14P4Lm25M43j37j64M99o92L05M4l28K65j00k2K25j28k55K06
2961c4o5K6K57k62K20J29n47M91j46k34N32m85J78J29k45j04L39j52j43K13j54
2982e7j53L53j69j04K17j72J84q1j20K94n56K02L46n51K61K44l84L58k11K95k1
$$ plain form
3003 175 -172 -258 442 -343 -93 186 -167 21 -67 -168 -56 -39 -225 354 -13 -162 42 -135 180 166 130 -179
3025 -179 296 -215 206 1 -7 176 -9 32 226 125 146 385 -225 198 0 -55 -52 -345 -45 114 -243 -229 65
3048 65 -176 187 -7 -248 10 260 -208 310 29 -23 59 -25 175 194 -153 -212 123 -200 -313 182 -111 65
3070 65 -271 -128 99 102 9 263 -50 124 54 -14 288 0 -72 40 -144 52 139 267 48 41 -146 -35 -161
3093 -161 -204 72 189 -144 123 195 -82 15 -13 184 225 -338 356 -280 -271 97 -87 52 252 -220 -123 414 -263
3116 -263 -95 69 -225 43 -55 -188 159 -246 64 105 -45 -59 101 -107 4 159 22 90 -110 -49 -58 119
3138 119 -256 271 64 -203 290 68 124 11 -28 33 65 -255 67 -8 -218 56 -357 -234 49 10 -33 64 -290
3161 -290 96 89 -211 283 94 -10 409 -134 244 230 -337 109 54 43 186 220 -161 -113 -116 -160 298 -58 -67 188
$$ packed form
3003A75l47q6P00p85K50K79l53J88q8j01J12J7j86N79l67j49K04j77L15j4l6l09
3025a79M75n11M21k05qJ83j85M1J94j01K1K39o10M23j98n5Lk93L00J59l57J4K94
3048F5k41L63j94k41K58K50m68N18k81n2Q2q4K00J9l47n9L35l23j13M95k93J76
3070F5l36J43K27Lr3K54l13J74p0o8L02k88p2J12j84J96Q7J28k19pj87J11j26
3093a61m3K76J17l33K67P2k77R7k8J97M1n63O94o36RL68j84J39K00m72R7N37o77
3116b63J68J64k94K68r8j33L47m05L10M1j50j4J60k08J11J55j37O8k00O1rJ77
3138A19l75N27k07k67M93k22N6j13l9O1L2l20L22p5k10K74m13J23K83l9m3R7l54
3161b90L86pl00M94j89j04M19n43L78j4n67M46n5j1J43L4l81M8lm4M58l56rK55
$$ plain form
3185 188 -181 3 570 21 92 -35 23 -8 -284 -92 196 -239 -206 -89 118 -128 29 -160 -117 260 -177 73
3207 73 18 -72 197 -78 291 221 214 67 -192 -357 93 -90 -100 246 131 180 -62 -71 150 8 -212 -2 -63 -224
3231 -224 366 -257 -133 220 -131 154 215 58 -60 -233 53 92 46 -40 -210 77 -25 271 53 97 91 -95
3253 -95 1 159 -447 229 186 131 195 60 -48 -73 -190 288 76 -75 58 -159 -259 -202 -173 -117 237 33 40 -4
3277 -4 -135 19 292 -110 -163 104 19 -26 77 -16 50 -241 -146 -70 -366 -101 54 -139 66 -144 -42 303 55
3300 55 45 189 291 21 4 -78 129 49 -164 240 337 181 -99 -106 140 392 -235 163 -12 -183 143 -7 232
3323 232 -33 231 -121 -174 -132 -110 -3 -197 -55 118 92 274 63 -154 200 40 -172 36 175 -66 160
3344 160 161 115 -57 -75 136 -11 -61 -46 294 -31 201 -98 -114 156 -89 -121 175 -130 33 124 -37 33 116 -125
$$ packed form
3185A88l69J84N67n49P1j27N8l1k76J92K88m35L3J17K07k46J57j89M3L77m37K50
3207G3n5r0K69k75L69p0pj47k59j65M50j83j0L46j15M9k42rK21j42k20K10o1j61
3231b24N90o23J24L53l51K85O1j57j18j73K86L9m6q6j70K87j02K96k18M4oj86
3253i5R6J58o06O76m3n5O4j35j08k5j17M78k12j51J33k17j00N7K9N6L54k04Pm4
3277dj31J54K73m02n3K67q5m5J03r3O6k91R5P6k96K65J55j93K05k10J02L45k48
3300E5j0J44J02k70j7q2K07q0k13M04R7j56k80pK46K52o27L98j75j71L26j50K39
3323B32k65K64l52n3M2K2J07j94J42J73k6J82k11k17L54j60k12K08J39k41K26
3344A60Jm6j72j8K11j47n0J5L40l25K32k99j6K70k45l2K96l05J63R1j61P0Q3k41
$$ plain form
3368 -125 -17 24 -2 30 82 -21 221 209 -34 25 -7 -57 78 -267 116 -163 21 -114 -101 47 -146 239 79
3391 79 159 -88 -112 21 -49 -20 279 -119 -59 -61 -101 -307 34 -34 -246 41 242 56 233 84 195 38 -27 -16
3415 -16 188 -30 -285 -188 311 -80 -122 -20 -135 80 78 173 -85 -203 -151 -95 -76 -30 61 -38 -232 41 -160 118
3439 118 201 -96 -93 31 56 167 176 112 -51 -67 145 -111 -290 39 93 -133 42 30 259 -124 -58 -140 -144 232 185
3464 185 63 71 -70 34 -201 -4 -222 203 -152 -37 -155 19 -112 -80 51 -154 -69 -306 128 144 124 136
3486 136 26 198 -282 26 -260 -64 -38 155 -62 288 103 -149 87 -357 -159 35 375 115 238 15
3506 15 155 94 -331 131 -34 264 17 -175 211 56 -144 8 -16 172 -377 86 -55 -222 -124 -280 -255 -258
3528 -258 221 61 114 166 -108 247 -65 58 108 60 128 -25 -37 90 -92 137 -44 -68 28 -60 6 -35 -1 -136
$$ packed form
3368a25J08M1k6L2N2j03K42j2k43N9l2n0J35l45L83k79J84j35J3J48j93L85j60
3391G9Q0k47k4J33p0K9K99l98O0km0k06L41o8k12K87K01j86J77j49J11j57o5J1
3415a6K04k18k55R7M99l91m2J02j15K15kR5k58j18N2N6J9M6R1r9j94K73k01K78
3439A18Q3k97LJ24K5J11Ro4j63j6K12k56j79L29N4k26J75j2K29l83O6q2mL76m7
3464A85j22Qj41J04k35J97k18M25l55J15j18J74j31L2J31k05Q5k37M34J6k0J2
3486A36j10J72m80L08k86J96K6J93k17L50j85k52K36m44J98J94L40k60J23k23
3506A5J40o1m25M62j65K98k47j92L86j55k00J52k4J88n49M63j41j67R8j56K5l
3528b58M79j60N3N2k74L55l12J23N0m8O8j53j2J27j82K29j81k4R6q8O6m1L4j35
$$ plain form
3552 -136 -215 -69 -56 -37 201 -220 -166 -163 -15 95 -243 -68 33 46 89 131 76 -20 102 -19 230 -99 -35 -142
3576 -142 -325 33 19 261 174 -2 296 263 -295 -4 312 61 63 228 -110 -58 -123 -46 4 89 143 69 -35 327
3600 327 17 113 4 163 -29 -119 108 141 277 -80 -286 43 -7 -12 -76 190 70 -43 169 -301 -50 114
3622 114 27 261 -97 291 -44 -198 88 209 10 -103 180 203 124 140 29 -304 93 -12 113 65 75 15
3644 15 -82 -117 -170 178 110 -44 129 -80 -272 158 286 29 -28 50 166 -58 -2 174 -38 29 105 180 -43 70
3668 70 -154 -7 18 98 351 -27 138 82 56 142 -68 -67 275 -197 104 -94 -111 -251 89 120 102 174 23 -2
3692 -2 -36 -97 -36 -352 -49 -26 52 -221 -196 -104 5 75 -120 -204 245 24 43 -141 71 -59 126 191 -130 -28
3716 -28 -271 206 71 -98 51 -57 67 -89 -57 189 35 -257 160 53 -66 380 20 -148 -8 -38 30
$$ packed form
3552a36p9J46J3J9K38m21N4LJ48J10l38J75J01J3M3M2n5r6J22j21K49l29O4j07
3576a42j83L58j4K42q7j76K98l3n58K91L16k51KJ65l38N2o5P7N0Q5N4p4j04L62
3600C27l10R6j09J59j92r0K27L3J36l57k06L29n0no4K66j20j13K12m70K51J64
3622A14q7K34l58L88l35j54K86J21j99j13K83K3p9J6j11l33L97j05J25m8J0o0
3644A5r7l5n3L48o8j54J73k09j92M30J28k57n7P8J16k24N6J76k12O7P6P5k23J13
3668G0k24J47K5Q0K53l78J65n6k6Q6k10JL42m72L01j98j7j40L40L1j8P2j51k5
3692bl4o1O1l16L03K3P8k73K5R2J09P0j95q4M49k21J9j84K12j30J85O5l21J02
3716b8k43M77j35j69J49j08J24j56L2K46j54k92M17j07j19M46l60j68J40l0O8
$$ plain form
3737 30 -137 -137 241 -290 -80 -122 -58 48 72 -9 221 45 -316 193 -310 -94 -90 -294 2 -211 50 308 -196
3760 -196 -262 -30 121 -19 -50 -293 52 221 6 18 190 -202 -161 282 -192 197 -157 152 -117 -44 71 29
3782 29 74 -33 287 -6 81 148 -4 -234 -3 -253 175 -3 -207 51 -82 -79 151 108 -125 -185 79 139 242
3805 242 23 83 64 -196 63 -218 -221 96 -9 135 15 101 -10 -134 146 2 -157 65 -250 -62 127 47
3827 47 171 79 12 -3 253 -73 -184 431 -136 41 -147 103 229 -233 196 90 85 146 101 71 -20 312 155
3850 155 128 79 -353 -39 -208 89 342 -352 -136 195 -83 -118 -122 56 34 49 50 -40 66 -434 135 -39 -163
3873 -163 73 -142 8 -110 -71 137 -144 -24 43 -35 33 -117 89 -167 -143 -114 -116 160 -18 96 30 32 333 -26
3897 -26 -46 -205 101 109 -85 -112 20 151 -151 -41 -47 -235 135 -195 -129 -181 17 249 121 60 -39 -184 -15 260
$$ packed form
3737C0j67%L78n31K10m2O4J06K4q1K30j76l61N09n03K16Mk04K96k13K61K58n04
3760a96o6K32J51j40l1k43L45J69k15J2J72l92M1M43m74L89l54L09k69P3J15m2
3782B9M5j07L20k93Q7O7j52k30K31k50M28j78k04K58j33LK30m3k33o0K64O0J03
3805B42k19O0j9k60K59k81lL17j05J44j20Q6j11j24K80j44j59K22l15J88J89q0
3827D7J24r2o7j5K56l26j11O15n67J77j88K50J26m62M29j06nO1m5l0r1L32j57
3850A55k7m9m32L14j69K97K53o94K16L31k78l5mJ78k2J5Jr0J06n00N69j74j24
3873a63K36k15J50j18L9K08k81J20O7p8O8j50K06k56K4K9kK76j78J14o6KL01l59
3897b6k0j59L06Qj94k7J32J31l02J10oj88L70l30O6n2J98K32j28o1r9j45J69K75
$$ plain form
3921 260 -70 -159 306 -128 -82 -79 -68 7 -104 -222 177 -354 -232 -211 -252 18 134 68 -14 -45 270 239 12 -78
3945 -78 105 -9 -123 67 230 118 50 143 34 172 -309 115 111 232 177 -102 157 185 280 -22 -7 -63 -84 -25
3969 -25 1 16 -55 -171 75 -181 -61 -238 -361 31 -5 -2 -7 47 -127 56 -109 -401 59 82 -102 -87 121 39
3993 39 156 -337 -123 20 -172 152 -209 -43 73 -25 100 -174 -22 213 94 47 9 21 -207 375 -217 -138
4015 -138 72 191 30 22 -74 -121 148 113 136 15 -66 -124 65 319 100 -15 151 62 38 -254 18 77 -94 -123
4039 -123 -346 271 -81 -31 -153 -135 47 186 59 -131 -212 -38 381 211 87 167 50 224 283 -28 -29 -59 -244
4062 -244 -37 -125 -236 -142 174 -37 240 -192 -95 48 -68 30 -71 95 180 102 203 55 40 -32 175 -170 -137
4085 -137 162 -219 -59 15 -96 -7 -121 -198 -212 -48 145 36 -184 5 -7 46 44 239 -125 -26 205 -1 -19
$$ packed form
3921B60l30q9M65m34M6LJ1P5j11j18L99n31J22K1m1K70J16o6q2l1L15l1k27r0
3945g8J83j14j14J90J63j12o8R3j09J38m81M24mJ21n5k79K59K8R5l02J5n6k1N9
3969b5K6J5p1j16K46k56J20j77j23L92l6LnN4j74J83j65k92M60K3j84J5K08q2
3993C9J17m93K14J43j92L24l61J66J16r8J25k74J52K35j19m7l8J2k28N82n92P9
4015a38K10J19j61qr6m7K69l5K3j21q1n8J89K54k19j15J66q9k4k92K72N9j71k9
4039a23k23O17l52N0j22J8J82J39j27j90q1J74M19j70j24Q0j17J74N9l11jl0j85
4062b44K07q8j11R4L16k11K77m32R7J43j16R8j01J66Q5p8J01j48j5p2K07l45L3
4085a37K99l81J60P4j11Q9j14p7j4J64J93j09k20J89j2N3kJ95l64R9K31k06j8
$$ plain form
4108 -19 -41 27 417 6 49 49 -31 44 29 91 -44 -48 47 43 249 64 -46 -116 -78 -62 -197 150 -59 8 189 -178
4134 -178 -343 86 -75 -158 208 -148 9 188 -54 -236 148 -61 187 61 -75 229 -1 -48 250 -115 74
4155 74 -199 156 86 -81 -186 203 11 179 348 67 77 -70 69 51 -111 -54 219 -174 53 53 36 -188 -48
4178 -48 -136 -227 161 -332 141 182 -458 -169 -117 -149 100 -153 26 100 -243 -134 204 206 133 -332 -307 -37 81 -71
4202 -71 -35 77 -137 109 -208 60 200 -21 -11 -40 -29 -160 132 -179 -129 -55 -267 -4 -179 -143 -176 -273 128
4225 128 92 -136 137 -294 -52 -22 -107 44 -7 128 31 0 -47 80 25 -24 70 11 -33 139 123 -232 17 -278
4249 -278 -36 -93 -23 -24 87 -78 -117 25 -41 31 -126 -344 180 -56 -13 -5 -31 12 -113 -178 -76 -129 -230 5 -34
4274 -34 -165 168 -100 -70 98 0 -67 38 127 189 202 54 93 160 -117 -316 -143 -37 -15 -63 33 100 87 195 -309
$$ packed form
4108a9k2O8L90m11M3%q0P5j5O2j35mR5mK06j85j10p0L8J6j35L47k09O7J81l67
4134a78j65M29j61q3L66l56J57J79k42j82L84k09K48j26j36L04k30m7K98l65J89
4155G4k73L55p0j67j05L89j92J68J69k81J0j47J39j8j62N7K73l93K27%j7k24J40
4178d8q8r1L88m93M73M1o40K89N2l2K49k53J79P4l43J09L38Kp3m65K5K70J18j52
4202g1L6J12k14K46l17K68J40k21J0k9J1j31K92l11N0P4k12K63j75L6l3r7M01
4225A28l6k28K73m31K42L0q5J51n1J35r7l1m7J27n5m9R4n9m4J72j6l55K49k95
4249b78K42n7P0jJ11j65l9J42o6P2j57k18N24k36M3Qk6M3j25o5J02n3j01K35l9
4274c4j31L33k68L0J68r8o7J05Q9O2J3j48L9O7k77j99J73J06K2m8R6O7j3J08n04
$$ plain form
4299 -309 -15 267 61 -17 49 105 184 -127 -255 23 5 -123 -32 16 53 61 -38 165 192 -18 -49 -167 -53 314
4323 314 -114 -212 191 81 -220 9 101 51 412 -272 118 11 -274 26 38 80 204 -254 -45 170 84 -44
4345 -44 -177 303 206 44 -120 -20 226 -63 -135 -128 -21 231 -162 -77 -201 -70 156 122 -139 58 340 -56
4367 -56 269 -232 192 -14 -70 192 72 -394 63 15 -197 149 -274 -201 -36 173 -89 54 -243 321 120
4388 120 89 34 -70 -446 4 -183 -18 106 -155 66 -81 -101 96 146 6 -24 12 -142 -82 -323 74 112 204
4411 204 -320 25 45 -26 78 -243 141 -94 -68 187 -110 117 138 -82 214 364 -172 99 254 88 90 -206
4433 -206 -251 58 213 -107 273 -163 122 81 -177 -94 -75 99 17 132 91 195 123 -75 31 -44 190 152 -5
4456 -5 257 98 -240 240 -197 -29 66 -73 16 99 162 185 -34 -306 -14 160 -48 267 -484 217 221 -15 -344
$$ packed form
4299c09K94K82k06p8O6N6P9l11j28K78j8j28R1M8L7Qr9K03K7k10l1j18J14L67
4323C14m28r8M03j10l01K29R2n0L61o84L90j07k85L00J2M2J24m58K09K15q6j28
4345d4j33M80r7j62j64J00K46k89p2PJ07K52l93Q5j24J31K26l4k61J97K82l96
4367e6L25n01M24k06n6K62j20m66M57m8k12L46m23P3J65K09k62J43k97N64k01
4388A20l1n5j04l76M50j87J65J24k61K21j47k0J97N0j40l0L6j54O0k41L97L8R2
4411B04n24L45K0p1J04l21L84k35K6K55k97K27K1k20K96J50n36K71J55j66Kk96
4433b06m5L09J55l20L80m36K85m1k58Q3J9J74q2J15m1J04p2j98J06p5K34l8j57
4456eK62j59l38M80m37J68R5j39Q9Q3O3K3k19k72K92J74k08L15p51P01Mk36l29
$$ plain form
4479 -344 243 51 -147 18 -315 312 -161 -245 -130 93 -318 6 65 -48 -99 -279 -3 316 88 -182 121
4500 121 -55 -266 69 13 315 79 264 383 8 117 55 -51 182 297 116 85 -96 -66 173 -558 -46
4521 -46 449 -27 80 98 -100 114 255 -124 -156 55 -15 -17 -35 -208 7 -155 -58 -11 -185 -6 170 85 75 -23
4545 -23 10 220 -110 143 194 -98 140 8 -339 113 -57 28 -19 -61 118 416 -170 48 221 -80 151 48
4567 48 -142 198 -9 -18 223 -10 58 -6 -293 68 108 -96 -29 -49 -177 76 312 0 7 35 29 301 -176 -141 -65
4592 -65 -222 -38 -86 -112 267 43 60 140 197 -21 -204 -296 113 0 -251 18 -7 209 24 -88 52 36 -122
4615 -122 -29 32 -106 70 -168 -167 48 300 -57 62 -297 142 -29 -128 -56 -17 -26 106 16 19 249 16 -189 -37
4639 -37 233 35 -45 307 -22 17 -355 -49 76 -171 -43 96 -321 107 166 69 83 -163 76 -26 81 225
$$ packed form
4479c44N87j92j98J65l33O27m73q4J15K23m11L24N9j13n1j80K76L19k28k70L03
4500A21j76k11L35n6L02k36J85J19l75J09o2j06K33J15j81l1j81L0K39p31N12
4521d6M95m76J07J8j98K14J41l79l2K11p0kj8j73K15j62R7M7j74J79J76q5j0r8
4545b3L3K10l30K53N1k92K38j32l47M52j70Q5m7m2J79K98n86K18J73l01K31j03
4567D8j90L40k07rK41k33O8o4k87L61M0k04O7k0j28K53K36l12PK8oK72m77L5P6
4592f5j57J84m8k6L79k24J7Q0N7k18j83r2M09j13k51K69k5K16j85j12J40j6j58
4615a22R3O1j38J76k38JK15K52l57J19l59M39j71r9P2L9rJ32r0LK30k33k05J52
4639c7K70j98q0L52l29L9l72L06J25k47J28J39m17M28N9r7J4k46K39j02J07J44
$$ plain form
4661 225 140 170 47 35 37 -117 -23 163 -43 -192 65 104 -89 -13 -211 131 -25 108 -14 120 -209 -204 41
4684 41 -186 144 -26 187 -34 -38 -244 261 164 -200 327 -65 175 104 -28 99 -148 -209 38 59 -158 -65 12
4707 12 65 -88 -109 -212 -67 -22 135 1 -533 83 91 184 114 -141 -106 207 -188 -115 190 -23 -2 130 -52 121
4731 121 65 -42 146 -267 -183 177 -200 70 254 -160 111 173 -256 270 384 -126 184 2 188 152 -64
4752 -64 -22 205 -223 183 45 -113 -155 -154 -240 -106 -439 50 -166 -130 -24 -6 -148 -14 -272 -412 135 174 -142
4775 -142 -307 186 -97 207 -174 181 -128 88 -59 -71 -313 137 -118 -39 21 13 -35 111 -2 -105 197 -143
4797 -143 154 115 -131 133 218 6 77 -15 79 160 126 204 -180 -93 89 273 -197 55 -79 -350 179 -78 51
4820 51 153 -300 -9 -160 -55 98 -101 -195 242 -21 72 502 7 74 -65 -178 -18 135 -261 190 -44
$$ packed form
4661B25q5L0j23j2Kj54R4J86k06j49K57L9j93P6j98L42j56J33j22J34l29NK45
4684D1k27L30j70K13k21mk06N05r7l64N27l92K40p1j32J27k47o1K47K1k17R3P7
4707A2N3j53k1j03J45M5J57j34n34O16QR3p0k55L5L13l95P3L05k13K1J32j82J73
4731A21n6j07J88m13Q4L60l77K70J84m14K71O2m29N26J14n10L10j82J86l6k16
4752f4M2K27m28M06j38j58m2Jq6J34l33M89k16L6J06J8j42J34k58j40N47L9l16
4775a42j65M93k83L04l81L55l09K16j47j2k42M50k55P9O0qm8J46j13j03L02l40
4797a43K97l9k46K64Q5k12P1r2R4Q1l4P8l84Q7J82J84m70K52j34k71N29k57J29
4820E1J02m53K91j51J05J53j99r4M37k63R3M30m95O7j39j13J60J53l96M51k34
$$ plain form
4841 -44 115 167 84 -55 142 -118 -86 219 -86 179 -73 -4 -196 35 39 -35 -15 91 227 286 234 -128 -133 -9
4865 -9 -38 31 49 -25 -1 186 -108 237 15 67 6 -13 -53 -102 -117 -42 225 -37 105 182 -125 -93 266 34 -193
4890 -193 -196 16 61 19 69 -3 23 -120 -14 -5 -117 -119 44 215 69 -332 224 52 -234 262 -27 -103 105 154
4914 154 71 -149 -418 -167 -155 -76 229 107 -53 38 70 55 119 51 77 -58 -71 -29 0 -101 207 233 44 65 9
4939 9 -50 416 129 222 54 37 72 16 -55 -11 -24 102 224 -257 71 165 -80 47 -13 -257 10 -105 -61 284
4963 284 -124 220 122 -43 -90 -226 -49 -254 81 -13 215 -3 -253 -206 52 36 -220 -260 -53 53 60 101 -129
4986 -129 -286 165 -206 -247 263 -107 -94 47 169 118 12 9 -45 44 169 45 216 -67 -193 37 57 -42 195
5009 195 -124 245 -150 159 287 260 175 144 -215 -83 164 -158 213 -159 42 236 -81 -101 187 -60 178
$$ packed form
4841d4J59N2q3j39J97k60L2L05l05K65k52O9j92K31Mp4K0J06J36N9n2l62nJ24
4865ik9O9J8p4K4J87k94L45k22N2o1j9m0m9j5P5K67k62J42P7l07L2L59k32k27
4890a93lK12M5m2N0p2K6j43J06Rj12kJ63J71j46m01N56j72k86M96k89p6K08M9
4914A54q3k20k69K51J2P9L05j22j60R1L2j5O4o8K6j35j3M2K9j01L08K6j89K1n6
4939In9M66k87R3j68j7L5n6p1M4j3J26J22m81L28R4k45J27o0k44K67j15M4L45
4963B84m08L44r8j65m7j36J77k05L35r4K28k18k50M7K58j6k56m0K07J06PM1k30
4986a29j57M51l71m1N10l70J3J41J22n1j06ln4Q9J25j24J71k83j26K30K0r9K37
5009A95l19L69l95L09J28k7q5l1l59J32K47l22L71l72K01J94l17k0K88k47K38
$$ plain form
5030 178 -227 -211 -125 -327 84 -66 -103 -186 201 -268 -222 269 -335 173 7 -44 5 113 -337 90 -109 -272
5052 -272 115 -59 206 -112 -23 -220 -217 -72 193 -179 -275 119 -221 -118 12 -192 -72 95 -179 -41 -163
5073 -163 100 143 -4 399 -36 171 339 210 -152 342 145 -98 68 75 118 8 -175 -95 -80 -278 168 50
5095 50 -205 1 47 -144 202 67 20 29 -129 228 128 -243 90 175 -178 66 -306 8 76 8 40 249 -40
5118 -40 131 -164 -60 84 147 -46 105 150 41 1 182 84 253 -34 51 -97 -323 127 59 -77 -251 -185 -90
5141 -90 252 -311 -112 106 81 -263 24 108 186 190 -384 90 197 11 -91 40 -106 259 -167 -214 51 -55
5163 -55 53 -197 -136 103 -149 -13 -2 172 93 148 79 -243 -44 -240 188 -130 -46 319 -162 -207 106 -130 -143
5186 -143 38 -361 59 -183 -35 332 -86 -200 -71 -216 43 280 100 67 249 -131 -214 -40 -236 162 281
$$ packed form
5030A78m05J6Q6k02M11j50l7q3L87m69M6M91o04N08j66n1M9J08m50M27j99j63
5052b72L87j74K65l18Q9j97LJ45K65l72r6L94l40J03J30k04J20J67k74J38j22
5073a63K63M3j47M03m35K07J68j29l62M94j97k43J66PM3j10j83Q0J5j98M46j18
5095E0k55K06M6j91L46j35m7Rj58L57j00l71L33Q5l53K44l72L14O8o8L2K09k89
5118d0J71k95J04J44O3j93J51M5j09m0J81r8J69k87Q5j48k26M50o8j36j74O6R5
5141i0L42n63J99K18k5l44K87Q4P8Mn74M74J07j86j02J31j46L65m26m7K65j06
5163e5J08k50O1K39k52J36J1J74p9N5o9l22J99j96M28l18Q4L65m81m5L13k36j3
5186a43J81l99M20k42J48L67m18j14J29j45K59K37j80l3J82l80q3J74j96L98J19
$$ plain form
5207 281 -74 346 36 65 142 180 284 247 -214 156 90 -169 179 -165 34 101 -116 -195 -51 -31 -91 46 -9
5230 -9 -181 151 -490 194 -147 -156 217 227 -288 -83 -95 -2 -40 -148 118 -57 -154 -164 -21 20 119 50 -60 31 -37
5255 -37 309 191 34 49 95 108 186 309 29 -128 -113 254 -1 -402 -354 197 -218 111 -132 -119 3 -31 65
5278 65 -44 -387 -123 258 -113 169 83 -224 263 -187 -125 260 -111 -228 -172 -50 11 -28 -245 159 186 -151
5300 -151 18 -109 58 95 -243 155 -6 27 6 109 -219 158 -78 -227 72 19 -343 34 -110 -154 -244 -187
5322 -187 -7 70 -65 -193 -26 -22 106 -278 -119 473 47 72 17 -354 70 -56 -45 -109 -94 92 146 86 -8 64
5346 64 -49 -28 -4 -382 -55 -226 0 213 4 -134 -366 -83 -69 -166 267 -82 -6 -358 233 -189 -386 238
5368 238 -188 -230 207 282 34 155 229 -144 -111 -129 17 -176 -198 81 39 -165 104 -316 104 -23 -7 46 44 -204
$$ packed form
5207B81l55M20l10K9P7L8J04l7m61L70o6k59L48l44J99O7k17p9J44K0o0J37n5
5230ij72L32o41O84l41rL73J0n15K05j2R3l8j08K66j75r7j0J43M1R9o9j10R1o8
5255c7L46j18j57J5M6J3P8J23k80j57J5L67k55m01M8N51m15L29k43J3J22l4R6
5278F5j09l43K64L81l71K82q6l07M87m50O2L85l71j17N6J22O1l9k17M04K7l37
5300a51J69j27J67L7l38L98j61L3k1J03l28L77k36j49K99n3l62L77j44m4r0N7
5322a87J80P7j35j28J67MJ28l84J59N92m26K5n5l71M24j26J1o4J5J86N4o0r4P2
5346F4j13K1K4l78L27j71K26K13k09j38k32K83J4r7M33l49P6l52N91m22j97O24
5368B38m26m2M37P5k48J21P4l73L3j8J46j93k2K79m2k04K69m20M20j27J6N3kk48
$$ plain form
5392 -204 115 166 35 -60 97 -207 176 -272 68 -12 -89 55 201 -15 201 222 -127 -133 128 -271 150 -49
5414 -49 -42 60 -69 2 150 190 316 146 -114 17 129 -45 353 -48 -80 3 -158 -11 -163 -508 73 -79
5436 -79 -184 205 21 -2 265 -57 -130 169 -32 132 118 -406 265 208 -9 328 112 108 1 -24 -29 286 25
5459 25 119 7 -74 -8 -40 -67 316 3 74 12 -102 100 -207 -29 90 -208 -105 -20 7 96 184 -153 -253 260
5483 260 -19 65 -57 -130 106 175 -183 393 52 -264 450 -253 -244 -129 -60 -97 -179 34 2 -62 -109 236 -76 -286
5507 -286 237 187 215 335 -136 -138 -153 -67 -21 -243 -389 -70 -47 238 -39 161 212 302 -19 143 242 -235 117 130
5531 130 -47 67 -162 70 -71 169 -41 157 -185 -54 -162 -150 70 -106 -12 87 13 102 178 -148 -110 93
5553 93 -223 -141 136 -180 184 -63 -334 54 -2 -96 123 149 33 237 -47 70 -55 86 14 -109 48 95
$$ packed form
5392b04L19N1j31r5J57l04L83m48L40q0p7J44J46k16K16K1l49oK61l99M21j99
5414d9PJ02j29P1J48M0J26j70k60J31J12j74L98m01l2Q3j61J47j52l45N81j52
5436g9j05L89j84k3K67l22p3K99k01J64j4n24O71n7k17L37k16mj07k5nL15k61
5459B5R4j12q1O6l2k7L83l13P1o2j14K02l07J78J19k98J03Q5K7Q9Q8l37j00N13
5483B60k79Q4j22p3K36O9l58N76l41l16P14p03RJ15O9l7q2K13l2o4m7L45l12k10
5507b86N23n0K8J20m71kj5Q6M6k22j46L19K3K85k77K00N1R0l21J62R9m77L52J3
5531A30j77J14k29K32j41K40k10J98l42J31j08J2K20j76R4R9p4Q9P6l26L8K03
5553I3l16Q2K77l16L64k47k71L88n6r4K19K6j16K04k84J17j25J41p2j23J57M7
$$ plain form
5575 95 51 42 106 -24 104 14 13 -15 122 -56 316 83 -211 -83 107 -97 41 -40 138 -73 -28 62 -9 -364
5599 -364 -46 253 -174 -52 28 -134 61 -100 8 -79 64 19 -160 -210 105 -81 -84 210 7 116 53 -187
5621 -187 121 151 71 9 -129 147 210 -193 -97 173 45 76 -259 -1 112 -206 -191 125 -54 -33 -75 76 -155
5644 -155 276 -14 54 56 -262 -4 249 -61 71 -14 -391 86 -26 -65 282 -87 105 96 -177 -54 162 -130
5666 -130 79 -139 -296 88 -26 -68 -173 33 107 139 126 148 -52 -237 194 -229 -85 159 -287 7 214 3
5688 3 274 280 26 -318 105 223 187 24 -96 98 -182 51 -26 -66 25 143 -195 -24 41 240 231 -247 -174 120
5712 120 -92 164 197 429 127 -12 -79 -50 88 250 -284 -59 -323 -110 133 319 245 -170 239 132 176 -162
5734 -162 272 80 145 -126 -65 -87 48 -39 194 2 -2 8 -67 161 -321 -225 18 120 57 228 37 109 108 -166
$$ packed form
5575I5m4rO4j30J28r0jk8J37j78L72k33k94J28J90k04J38q1J78k11M5R0p1l55
5599c64L18K99m27J22Q0j62J95j61J08q7J43m5j79n0L15j86lK94k03J09o3k40
5621a87L08L0q0o2j38K76O3m03R6K70j28L1l35K58J13l18J5L16j79K1m2J51k31
5644a55M31k90O8Kl18K58K53l10J32q5l77M77j12l9L47l69J92rk73J23K16k92
5666a30K09k18j57L84j14m2j05K06P4L2j3K2k00j85M31m23J44K44m46K94K07k11
5688CK71Ok54l44M23J18l6j63j20J94k80K33p7m0R1J18l38J71O5J99rm78P3K94
5712A20k12K56L3K32l02j39o7K9J38J62n34K25k64K13K43J86p4m15M09j07M4l38
5734a62M34j92O5k71O1k2J35q7K33j92mJ0p5K28m82R6K43J02o3J71j91P2jk74
$$ plain form
5758 -166 -91 9 75 -8 208 -5 150 301 -51 100 -92 8 127 -285 12 -59 156 188 16 -35 29 -135
5780 -135 -59 -20 -34 -6 100 -279 -209 -112 -277 -34 -60 -95 -324 59 -180 -254 63 314 352 -303 160 -29 162
5803 162 152 129 -264 211 43 65 265 -224 166 -125 -54 241 -226 18 -1 -284 -177 123 -60 -3 -155 -234
5825 -234 -43 -44 -243 -6 -8 -295 182 -96 -146 236 -8 21 148 -137 190 113 -16 210 358 47 38 -30 44 289
5849 289 74 -69 -30 73 151 4 35 239 -53 -277 -28 126 -109 48 -19 13 157 43 145 140 -7 209
5871 209 192 218 -62 -383 -232 60 105 -62 284 -6 365 -291 102 -23 -75 -21 -51 -138 184 77 -158 39
5893 39 190 -35 -136 -4 -178 211 146 -77 254 -102 67 -46 62 -53 -80 109 2 -60 26 241 212 -115
5915 -115 15 16 -182 97 6 -42 -40 -200 -5 -138 138 137 -114 -149 429 -106 198 133 70 -367 -21 58 171 218
$$ packed form
5758a66P5J00O6q3K16k13J55J51l52J51j92J00J19m12K97p1K15L2j72n1O4j64
5780a35P6L9j4K8J06l79P0R7j65K43k6l5k29L83k39p4L17K51L8o55M63j89J91
5803A62j0k3l93M75j68K2K00m89L90k91P1K95m67K44j9k83J07L00j83N7j52p9
5825b34J91jj99K37kk87M77k78n0L82k44K9J27k85L27p7j29K26J48l11ro8P4K45
5849B89k15j43L9J03P8j47L1K04k92k24K49J54k35J57o7L2J44j14J02nj47K16
5871B09j7K6k80l21J51K92M5j67L46k90L71o56L93j25n2N4l0q7L22j07k35J97
5893C9J51k25j01J32j74L89o5k23L31l56J69j13J08j15k7J89j07o2Q6K15k9l27
5915a15J30Jj98K79r1m8Kj60J95j33K76jk51l5N78n35L04o5o3m37L46P9J13M7
$$ plain form
5939 218 -51 3 13 -83 163 -222 134 136 -296 -94 108 -24 -19 -1 -92 -98 -25 -27 62 -228 -98 -114 -449 -142 -45 176
5965 176 391 151 -273 120 -158 -136 -109 -210 -248 -42 -89 39 90 -77 61 73 141 164 -25 -5 206 95 -114
5988 -114 105 -59 -78 135 -117 -189 308 36 6 -198 129 237 -103 -2 -54 -39 215 -18 -77 66 -137 50
6010 50 393 274 160 93 -176 -48 -73 -101 232 159 -469 247 -17 121 144 138 82 302 50 56 110 -105 -211 -123
6034 -123 -194 198 -23 -110 214 16 -29 -19 -255 51 -77 -315 -50 126 -107 122 -9 -164 99 -245 35
6055 35 -111 162 120 -9 -127 -82 -49 -61 77 0 12 92 -15 75 120 -130 -177 228 -182 68 -76 -446 94 -93
6079 -93 11 258 -370 88 197 -19 -86 261 -185 38 277 -51 146 224 119 185 -67 168 60 -229 -235 -77
6101 -77 -335 194 -184 44 -316 -232 218 167 -219 -68 161 -86 -112 65 54 75 -163 -237 -157 79 -125 8 -126
$$ packed form
5939B18k69N4J0r6K46l85L56Km32K02K02j32NJ8r1oP3kQ9k90J30j6l35L07R7K21
5965A76K15k40m24L93k78K2K7j01l8K06m7J28N1j67J38J2O8K3j89K0K11j11k09
5988a14K19j64j9K13k52p2M97k72l0k04L27J08l40J01n2J5K54k33n9J43k03J87
6010E0L43j19j14o7k69J28k5k8L33p3o28P16k64J38K3on6K20k52ON4k15j06Q8
6034a23p1L92k21q7L24j98m5J0k36L06j28k38K65J76k33K29j31j55K63l44K80
6055C5j46K73m2j29j18M5L3j2J38p7J2Q0j07R0M5k50m7M05m10K50j44l70N40j87
6079i3J04K47o28M58J09k16o7L47m46K23K39l28J97P8j05O6k52K35j08k89oJ58
6101g7k58N29l78K28l60Q4M50n1l86J51K29k47k6J77j1K1k38p4Q0K36k04J33j34
$$ plain form
6124 -126 9 29 -14 94 175 -13 63 51 187 -211 -60 -271 22 -69 34 271 -169 126 -204 -27 83 -93
6146 -93 -107 92 87 -99 38 -69 187 -52 -52 -150 159 54 -36 339 215 179 -6 -248 121 -192 35 -106 11
6169 11 25 186 -77 232 128 24 274 6 52 198 -42 290 5 -120 123 1 96 322 74 -250 -58
6190 -58 -48 253 -50 134 3 21 -70 111 55 -192 162 78 12 186 -119 21 -88 -232 -27 61 -94 -44 -26
6213 -26 -234 -340 -125 49 209 -203 -6 -200 70 117 15 -138 -111 309 92 4 -235 -103 -59 2 178 185 -327
6236 -327 -24 -35 -30 42 78 123 -281 -134 -281 -170 -97 156 243 -81 281 -88 -129 -109 -62 149 -36 119 63 15
6260 15 -116 249 -76 -119 172 34 245 118 49 112 320 74 -42 -59 -25 56 315 37 40 146 72 104 -138 -175
6284 -175 403 0 255 290 133 -74 143 -27 97 -171 -274 187 -49 103 -39 -181 -85 -81 -142 47 -142 136
$$ packed form
6124a26J35K0m3J08Q1j88P6j2J36l98J51k11K93r1J03K37m40K95l30J77J10j76
6146i3j4J99nj86J37j07K56k39%r8L09j05r0L75j24l6j85k42L69l13K27j41J17
6169A1J4J61k63L09j04j04K50k68M6J46k40L32k85j25K43j22R5K26k48l24J92
6190e8J0L01l03J84j31J8r1J81n6k47L54q4o6J74l05J40j09j44K05Q8j55N0J8
6213b6k08j06K15J74J60m12J97j94K70M7j02j53K7M20k17q8k39J32M4O1J76Pn12
6236c27L03j1NP2L6M5m04J47j47J11P3K53Q7l24L62l69m1K0M7K11j85J55n6m8
6260A5j31L65l25m3K91j38K11j27o9O3K08k46j16j7L4Q1K59k78LJ06p4L2k42l7
6284a75N78m03K55L5j57k07K17j70J24k68j03M61k36J52j42j42R6Mo1J89j89K78
$$ plain form
6306 136 -53 -66 129 -142 -36 93 87 162 65 196 -112 -291 52 12 26 57 -20 -40 -68 93 44 -49 143 58 93
6331 93 88 215 10 235 -62 -69 -74 32 -171 70 -143 127 244 -4 54 -16 99 245 -114 -14 71 13 -129 86
6355 86 77 -133 -82 -229 102 140 -170 -111 -201 99 88 -77 4 42 -121 140 -256 -117 59 167 -100 -48 149 -233
6379 -233 190 -47 -16 56 7 184 -56 94 -113 235 -38 -198 -58 -178 -199 -100 6 115 -27 166 -154 5
6401 5 -55 -225 -101 -111 51 180 45 181 -100 -81 -322 255 108 -38 80 -354 -43 129 -157 162 -186 -300
6423 -300 -62 35 140 154 -64 -93 -32 -267 -228 -6 118 7 0 -291 9 -113 -25 100 14 -53 64 -148 -297
6446 -297 289 -210 283 -124 -218 -220 9 49 268 93 -206 99 58 -61 -18 -241 -116 -120 -89 -289 33 12 342
6469 342 -185 -240 387 42 -213 -118 220 72 304 -135 -116 232 -147 31 -97 -18 -64 18 139 -196 -174 64
$$ packed form
6306A36j89j3J95k71J06J29oP5r7J31l08j79L43m0J4L1p7k0k8J61m9r3J92q5L5
6331I3nJ27k05K25k97pnJ06k03K41k13K70J17k48N8p0J15J46l59J00Q5n8j42K15
6355H6rk10N1j47L31L8l10N9r0L00j1j65Q1L8j63K61l96J39J76J08k67N2J97l82
6379b33M23k37L1P2m9J77k40J50k07L48k73j60J40j20k1R9J06J09j42J93l20J59
6401Eo0j70J24j0J62J29j35J36k81J9k41N77j47j46J18m34L11J72k86L19l48j14
6423c00K38R7J05J4k18k9O1k35L9K22J24j11pk91L00j22Q8J25q6o7J17k12j49
6446b97N86m99M93m07r4kK29M0K19j75k99L05m1j19M3k23J25mL1k00L22k1L30
6469C42n27n5O27l45k55R5L38j48K32m39J9L48l79J78j28P9m6Q2J21l35K2K38
$$ plain form
6491 64 16 -213 147 2 -85 124 -64 54 253 52 118 121 92 44 -137 -125 146 80 113 -16 35 41 295 -18 -248
6516 -248 35 -215 184 196 224 -37 139 -203 -46 17 -278 -105 38 -17 -154 116 15 73 -69 11 13 -199 161
6539 161 -108 -1 -113 158 -264 27 -111 65 16 -395 104 -44 147 129 -4 -87 294 -66 135 306 100
6560 100 57 269 105 6 101 -31 260 -43 -260 163 2 328 273 36 -68 -35 58 160 -19 -85 -33 -287 -160
6583 -160 -44 13 16 -119 -163 -41 -99 13 130 447 -63 128 -25 266 295 -167 -172 116 -177 -28 54 -396 2
6606 2 108 145 222 -18 -53 -86 87 12 93 -123 55 -30 65 48 -112 104 180 72 -5 -201 72 129 14 -278 23
6631 23 -275 101 110 -4 -58 31 11 210 11 -113 265 30 130 168 -84 -8 -98 176 -258 -60 23 256 80
6654 80 -116 162 116 228 -193 -107 -67 17 -16 -212 179 -180 -9 61 -159 -7 268 252 5 -87 -9 248 22
$$ packed form
6491F4m8k29L60j45q7K09j88J18J99k01O6Lk9m8j81J2K71o6L3j29N1OK54l13k30
6516b48K83k50L99J2K8k61J76l42J57O3k95J73J43n5j37K70j01N8j42Q0Kk12L60
6539A61k69J07j12K71m22K91j38J76m9m11M99j48J91j8j33q3L81l60K01J71k06
6560A00m3K12j64r9R5j32K91l03k17M23j61L26n5k37j04L3R3J02j79o6N2k54J27
6583a60J16N7Lj35m4J22n8J12J17L17n10J91j53K91K9m62nK88k93J49Q2m50L98
6606BJ06L7P7k40l5l3J73p5Q1k16J78q5R5j7j60K16P6j08p7j96K73N7j15k92L01
6631B3k98L76Rj14n4Q9k0J99j99j24L78k35J00L8k52P6r0K74m34J98Q3K33j76
6654H0j96K78m6J12m21Q6M0Q4l3j96L91l59J71P0k20J52K75j6k47r2P8K57k26
$$ plain form
6677 22 -32 77 -192 62 140 162 159 126 49 153 -24 -53 121 -96 41 497 -61 -69 66 194 -3 22 104 35 200
6702 200 -320 383 51 -85 4 14 38 131 0 4 248 155 176 -116 60 92 -248 72 218 -70 62 161 -45
6725 -45 253 168 86 197 1 211 223 349 -137 185 -256 31 -134 202 -219 -10 33 88 145 -148 193 -85
6747 -85 -136 -195 -133 174 -55 39 233 -87 -138 -225 176 161 172 149 -95 195 104 23 49 -162 -14 76 147 7 -19
6772 -19 -76 149 14 0 30 -56 -223 -69 49 -190 147 -27 105 -105 -102 -115 -173 -174 -103 29 -52 -24 -169 187 -15
6797 -15 -196 117 -135 259 177 -332 -269 67 198 292 -10 -16 -193 -85 92 -44 29 -210 183 -68 -15 -57 -202
6820 -202 96 39 -116 185 95 166 261 -166 -47 88 -194 106 330 68 -89 227 153 23 -154 -90 194 -143
6842 -143 9 -74 18 342 299 55 36 -52 -39 110 -103 10 -178 -40 163 -21 -131 -261 317 -169 87 220
$$ packed form
6677B2n4J09k69K54P8K2ll3p7J04j77k9J74k17J37M56n58qJ35J28j97K5Q2o9J65
6702B00n20P03l32j36Q9J0K4R3j31MK44r3K1k92J76L2l40L20J46k88J32R9k06
6725d5K98q5q2J11j96K10J2J26m86L22m41K87j65L36m21K09M3N5N7k93L41k78
6747h5n1n9O2L07k29R4J94l20n1q7M01j5J1k3k44K90r1q1K6k11J48R0P1j40k6
6772a9n7K25j35j4L0q6j67J54J18k39L37j74J32k10Lj3n8jP1J32q1K8j45L56k02
6797a5j81L13k52L94q2n09O3L36J31R4l02oj77J08J77j36P3k39L93k51N3m2j45
6820b02K98n7j55L01r0P1R5m27J19J35k82L00K24k62j57L16p4j30j77O4K84l37
6842a43J52q3R2L24m3k44j9q8J3J49k13J13j88J38K03j84j10j30N78m86K56J33
$$ plain form
6864 220 24 377 10 226 -109 -81 182 154 81 158 159 -237 94 -156 -44 31 188 -30 -1 0 -113 -23 -82 293
6888 293 -25 -239 156 274 187 -266 -59 63 -55 -190 27 9 -21 151 14 56 99 -16 -128 -179 -96 227
6910 227 179 -13 -61 -135 77 266 -251 -150 88 -22 19 108 130 116 -91 -281 259 114 -92 -207 242 -142
6932 -142 52 61 -333 -4 150 252 34 50 -88 129 -31 -83 -214 -249 -192 -199 -8 24 253 103 112 68 117 19 -136
6957 -136 209 117 -68 126 -63 -58 73 -238 91 -75 23 -82 130 100 -210 -43 -36 2 41 -86 -142 2 4 400
6981 400 -233 -37 -168 70 18 -47 92 -138 -31 -8 -30 81 302 -355 40 92 -102 141 95 216 13 228
7003 228 46 -37 54 -240 -70 53 -271 39 -11 -40 197 201 128 -15 -198 -78 86 130 243 -257 249 288 -35
7026 -35 -213 -146 -221 71 145 -165 -129 154 71 63 291 69 361 -5 -223 -196 -319 -102 115 -100 55 24 -111
$$ packed form
6864B20j96L53l67K16l35K8K63k8p3P7Jl96L31k50J12P5J57k18K9Jj13R0n9L75
6888B93l18k14L95J18q7m53K07J22j18j35K17j8l0J72j37M2M3j15j12n1Q3L23
6910B27m8j92m8p4K12J89n17J01K38j10M1Q9K2j4k07j90N40j45k06j15M49l84
6932a42J94Rl94L29J54J02k18J6j38K17j60n2j31l5N7pJ91L2K29j50Rm4M9r8j55
6957a36L45r2j85J94j89NJ31l11L29j66R8j05K12l0l10J67PL8L9j27n6J44KL96
6981D00o33J96j31K38n2o5J39k30J07K3k2J11K21o57L95N2j94K43m6J21k03K15
7003B28j82q3R1k94J70J23l24L10n0k9K37Mp3j43j83J20J64M4J13n00N06L9l23
7026c5j78O7p5K92P4l10L6K83q3qK28k22K92l66k18K7j23K17K17k15J55l1j35
$$ plain form
7049 -111 -36 -68 -41 -101 206 278 80 40 243 226 207 235 120 12 77 -33 200 -123 -46 -39 59 228 183 -15 -272
7074 -272 -280 77 70 210 62 -63 193 -169 -65 52 -18 -129 -24 64 -23 152 -77 -199 -140 51 79 35 -112
7097 -112 171 89 12 1 191 111 -48 -171 -51 -56 -315 -112 363 -104 -163 -14 12 -305 341 7 -2 117 88 57
7121 57 -165 -169 -44 -242 216 -66 -40 1 -134 307 -100 -134 4 74 -3 26 -197 35 7 -120 -9 -17 -209 85
7145 85 198 -142 -329 28 -218 -61 91 72 65 -257 -37 -64 39 -36 4 -32 136 31 -67 14 346 249 -313 -4
7169 -4 167 -311 -134 244 -37 0 27 41 15 -126 109 -126 26 135 80 29 -72 15 102 98 18 131 109 -196 -221
7194 -221 102 69 -31 -96 111 -281 -167 -149 -119 122 78 100 71 162 117 35 27 39 220 -12 244 -26 -253 -185 206
7219 206 83 106 -8 109 183 -19 35 134 -103 -26 122 -41 -61 169 64 -68 -38 -55 170 63 509 -105 327
$$ packed form
7049a11P5l2K7o0L07P2j98m0K03j7j9K8j15j08O5j10K33l23P7PR8J69m5j98k57
7074b72qL57pJ40j48j25K56l62J04J17p0j11J05Q8q7J75k29j22N9J91K8m4j47
7097a12K83q2p7j1J90q0j59j23J20nk59K03M75m67n9J49K6l17O46l34rJ19k9l1
7121E7k22mJ25j98M58k82K6M1j35M41m07l4J38P0p7K9k23K32k8j27J11qj92K94
7145H5J13l40j87L57k46J57J52j9pl22K20k7J03p5M0l6J68j05r8Q1L32r7n62L09
7169dJ71m78J77L78k81L7K7J4k6j41K35k35J52J09n5n1j01Q7Q7mq0J13k2l05k5
7194b21L23l3j00o5K07l92J14J8L0K41m4K2k9R1m5q2qJ2J81k32K56k70k27O8L91
7219B06j23K3j14J17P4k02N4R9k37P7J48j63k0K30j05j32L0j7K25j07M46o14M32
$$ plain form
7242 327 294 62 -50 101 72 -107 -24 -70 70 42 -60 220 82 18 -135 -439 -55 -29 10 -218 136 51 62
7265 62 -180 -12 36 -147 123 23 117 -124 -7 -36 -95 -178 78 231 -98 -78 -215 91 -12 -188 308 -60
7287 -60 -44 -347 -129 327 -251 113 -120 -4 -99 -92 -112 34 109 -40 -3 231 233 325 -86 -257 -37 -188 118 -70
7311 -70 -166 -58 173 6 177 -500 -75 -161 -34 -390 -93 -17 -75 115 132 160 -68 68 -171 284 17 124
7333 124 98 176 64 -329 -94 107 97 15 84 -67 172 281 84 50 50 -146 225 97 212 148 -241 82 167
7356 167 -117 -19 -104 13 -59 10 30 19 206 -52 -54 -381 -1 -7 207 191 122 56 -3 -32 -103 -102 -21 -161 -128 48 70
7383 70 -222 200 227 208 -158 22 -8 -132 -172 189 282 92 -55 61 323 -150 15 56 261 -159 -80 42 143
7406 143 -293 307 -60 -221 -22 -57 99 -85 -25 99 4 177 -114 -29 245 -44 -52 -123 97 -257 -45 -64 -98
$$ packed form
7242C27l3k32j12J51k9j79Q3m6J40k8j02K80j38o4j53l04L84K6L9k28L54q5J1
7265F2k42J68M8j83K70j00R4k41J17k9n9q3K56J53l29K0j37L06j03j76M96l68
7287f0J6l03K18M56n78L64k33J16r5Pk0J46P5j49L7K34KR2m11j71K20j51L06j88
7311g0r6J08K31j67J71o77M25q6J27l56K97P6n8J90J7K8k28J36k39M55k67J07
7333A24k6P8j12l93K35K01j0q2O9j51K39J09j97l4%j96L71j28J15o4l89L23Q5
7356A67k84R8q5J17p2O9K0j1J87k58kl27L80oK14j6o9o6n9k9p1JQ1j40L3J76K2
7383G0k92M22K7j9l66J80l0j24m0L61R3j90j47J16K62m73J65M1K05m20P9J22J01
7406A43m36O00l67j61J99l5J56j84O0J24r5J73k91Q5K74k89qp1K20l54K12j9l4
$$ plain form
7429 -98 96 -40 4 -65 -52 -24 16 134 45 -89 69 -85 186 -137 -272 -307 -287 122 -118 -94 -3 -30 170 108
7453 108 30 -16 456 -166 12 -16 33 -323 10 28 103 9 38 -59 216 6 -130 -413 -31 153 127 -11 -75 -80
7477 -80 142 41 49 107 71 -30 107 188 66 139 215 319 -86 -64 60 -98 -154 81 -195 -61 -244 -66 217
7500 217 -62 -27 60 82 -21 -5 -35 -196 152 -135 -51 -105 -55 -6 1 123 -256 -75 185 60 124 -135 -14 -35
7524 -35 -32 -142 -83 11 4 52 -118 -94 -35 -224 -5 -21 -53 -28 -170 123 182 -29 369 -473 -21 51 226 -79 -118
7549 -118 -89 -245 -26 163 151 -152 142 47 186 -50 -110 -68 -42 234 258 -75 175 -32 -90 -12 132 -201 -432
7572 -432 371 -170 62 -20 368 244 -48 -41 118 69 -17 50 -139 -136 -313 -280 63 -52 -208 -10 -272 -64 -16
7595 -16 -65 -87 -5 10 297 175 3 50 20 -2 38 -207 -141 76 182 111 56 112 -33 193 149 -75 10 -25 69 -238
$$ packed form
7429i8J94j36M4o9J3K8M0J18q9j34J58j54K71l23j35l5K0M09k40K4R1k7K00o2
7453A08p8m6M72o22J78k8M9l56L33J8P5r4K9r7K75k10j36k83L82J84k6j38o4n
7477h0K22j01QN8l6j01J37Q1j22P3P6J04m05K2J24j58n6K35k76J34j83J78K83
7500B17k79L5Q7K2j03J6l0j61L48k87Q4n4N0M9PJ22l79J81K60j25O4k59J21k1
7524c5Lj10N9R4pM8j70K4N9j89K19j6l2K5j42K93N9k11L98q42M52P2J75l05l9
7549a18K9j56K19J89j2l03K94r5J39k36o0M2K6K76K4l33K50k07n8P8J44l33k31
7572d32Q03n41K32q2L88j24k92PJ59m9q6O7j89Lj77L3L43j15j56J98k62K08M8
7595a6m9k2Q2J5K87j22j72M7l0k2M0k45O6K17J06p1n5N6j45K26m4k24Q5l5R4l07
$$ plain form
7621 -238 85 -36 -4 -160 33 8 -198 -272 74 11 -129 70 56 46 120 -292 -55 221 -57 -150 -135 180 -8
7644 -8 -157 138 62 270 71 -101 89 195 62 295 60 -101 -44 253 -101 40 276 288 110 78 29 176
7666 176 -49 222 -196 -133 268 228 -120 126 104 86 71 110 51 -106 -170 -262 41 187 11 -171 -184 78 345
7689 345 -91 -171 -14 75 -13 -103 56 167 -157 -128 173 23 145 45 276 -53 -103 -147 68 -101 -66 39 -111
7712 -111 2 -233 16 -78 -96 -29 87 -92 -95 -113 -44 -230 -127 -41 52 -284 -222 -108 -62 192 -47 83 -81 138
7736 138 -119 34 -51 -109 63 -80 -238 -51 -59 -108 -60 67 197 -166 101 63 284 -497 84 -30 -1 50 76
7759 76 118 119 37 -121 141 -9 -23 -34 -125 -87 147 -97 -280 -99 125 -32 108 -32 154 -145 -134 85 -329
7782 -329 -58 -111 44 3 -114 95 -181 212 68 125 -119 -66 -110 64 85 -41 -101 28 307 -43 -103 -67 -111
$$ packed form
7621b38L23j21L2j56J93k5k06p4L46o3j40J99j4j0P4m12K37K76k78r3J5L15j88
7644hj49K95p6K08j99j72J90J06j33K33k35j61N7K97l54J41K36J2j78l2m9J47
7666A76k25K71m18O3M01m0l48K46k2j8j5L9n9j57o4r2L03J46j76j82j3K62K67
7689C45m36q0J57Q9q8r0J59J11l24K9L01j50J22j00K31l29n0m4K15j69L5J05j50
7712a11J13k35K49r4j8O7J16j79lj8O9j86J03Q6R3l36O2J14M6K54k39J30j64K19
7736A38k57J53q5n8J72j43j58J87qm9M8J27J30l63K67l8K21p81N81j14K9N1K6
7759G6M2Jq2j58K62j50j4j1r1L8K34k44j83J81K24j57J40j40J86k99J1K19m14
7782c29K71n3J55m1j17K09k76L93j44N7k44N3m4J74K1j26o0J29K79l50o0L6m4
$$ plain form
7805 -111 13 121 -40 199 114 -183 -51 -30 31 147 -121 107 172 -109 92 -84 13 -139 -68 85 -4 268
7827 268 295 51 265 55 -215 223 -198 -168 141 143 95 262 -86 167 -55 25 259 -74 18 -74 -254 -132 -28
7850 -28 -21 83 109 52 175 -425 -131 54 54 -44 -27 -9 182 -133 18 -324 80 -255 85 -124 143 18 -16 -79
7874 -79 7 117 260 -149 -8 -81 -31 -427 106 -78 238 -190 -279 76 116 237 -76 -268 150 -421 85 186
7896 186 154 -155 224 -223 39 -50 -282 -34 -121 -79 164 -191 280 -45 -6 -194 20 -99 68 -189 119 -3
7918 -3 -96 -250 142 22 -174 145 -425 65 84 -157 -167 -99 -112 -43 -47 -243 -151 69 -86 -22 -327 92 -146 -175
7942 -175 -15 116 178 122 179 -353 73 31 -60 -217 -183 -144 -23 133 88 -71 -190 172 18 162 48 -97 141
7965 141 216 -64 41 -177 171 -52 64 -159 183 -106 71 82 -181 29 90 -84 217 -68 96 -82 -270
$$ packed form
7805a11J24J08j61K39q5k97J32K1O1J16k68K28O5k81K01j76R7j52P1J53q9K72
7827B68K7k44K14k10k70M38m21L0L09Km8J67l48K53k22Q0K34l33R2r2j80J22J04
7850b8PJ04K6n7J23o00K94J85%r8J7J8J91l15J51l42M04l35L40k09K67j25l4o3
7874g9Q6J10J43m09J41p3N0l96N33j84L16m28q9L55M0J21l13j92M18n71N06J01
7896A86l2l09L79m47K62q9k32K48q7M2K43l55M71l25L9j88K14j19J67k57L08j22
7918cr3j54L92j20j96L19n70M90J9k41j0O8j3O9mj96R2K20j55O4l05M19k38k9
7942a75J60J31O2n6N7n32M26m2r1j57L4L9J21J56m5j59j19L62j54J44j14j45K38
7965A41P5k80J05k18L48k23J16k23L42k89J77J1k63K10O1j74L01k85J64j78j88
$$ plain form
7986 -270 -118 -71 154 -216 17 379 86 -220 -38 -51 -197 12 310 231 206 89 -175 -248 -97 -220 46 -153
8008 -153 -211 140 470 200 169 -37 -169 138 -52 17 83 -46 177 11 -29 205 -84 13 -152 -160 109 197 69
8031 69 111 -240 315 90 64 42 -7 -105 -7 -102 86 33 -42 275 37 28 -169 158 -15 -81 -95 98 -109 -145 195
8056 195 -144 -49 -79 239 -31 -92 -351 246 159 431 149 206 -265 -328 -122 -64 -29 293 -47 4 208 -24 164
8079 164 386 -204 -165 -37 -8 -206 -30 28 -151 -260 16 16 343 -45 -289 204 -14 -21 93 -120 19 -234
8101 -234 27 1 -198 144 108 224 -249 -43 -211 73 116 -80 182 3 -260 -140 66 -97 159 -282 -18
8122 -18 -34 -285 -357 150 -190 37 309 173 375 -208 -42 113 49 -162 133 -378 181 -147 26 -193 -106 338
8144 338 -101 27 12 114 174 382 -268 -55 201 2 135 258 177 -123 -233 259 -16 86 -123 38 8
$$ packed form
7986b70J52M7K25l70K33L62k93l06J82j3j46K09K98p9k5j17k64p3J51j23K66j99
8008a53n8L51L30k70l1k06j32L07j90O9O6j29K23j66m0K34k89R7j65qK69Q8j28
8031F9M2l51N55k25k6k2m9r8R8r5J88n3p5L17k38rj97L27j73o6j4J93k07l6L40
8056A95l39R5l0L18k70o1k59N97q7K72k82N7m71o3K06N8L5L22l40N1K04k32J88
8079A64K22n90L9J28K9j98J76N8j79j09K76%L27l88k44M93k18pJ14k13J39k53
8101b34K61k6j99L42l6J16m73K06j68K84M3j96K62j79k63J20K06j63K56m41K64
8122a8j6k51p2N07l40K27K72j36K02n83J66J55o4k11K95n11N59l28J73k19Q7M44
8144C38m39J28j5J02O0K08o50K13K56j99J33J23q1l00j10M92k75J02k09J61l0
$$ plain form
8165 8 -49 136 278 -129 6 -180 -5 -7 43 -120 -75 330 268 152 -168 371 32 291 -9 -139 108 73 20
8188 20 131 -107 6
$$ packed form
8165Hn7J85J42m07J35j86J75kN0j63M5M05o2j16l20N39l39K59l00j30K47l5n3
8188B0J11k38J13
8191F
$$ Imaginary data points
##PAGE= N=2
##DATA TABLE= (X++(I..I)), XYDATA
$$ plain form
0 0 0 0 0 0 0 0 0 0 0 0 0 0 0 -8 8 -8 8 -8 16 -16 18 -24 28 -32 40 -48 55 -63 72 -81 95 -106 121 -137 154
35 154 -172 194 -218 244 -273 303 -338 373 -414 457 -505 558 -615 679 -746 823 -906 999
53 999 -1102 1218 -1348 1498 -1668 1867 -2102 2382 -2727 3163 -3734 4517 -5660 7495 -10951
68 -10951 19798 -99736 -167361 -86778 -81959 -19506 -16621 5253 26160 27618 43712 59164 29185
81 29185 66648 102108 102055 105168 77520 35254 23585 -16997 -30366 -29286 -68459 -74289 -51436
94 -51436 -59569 -50018 -53726 -62232 -32568 -19040 1032 48614 46511 43581 62418 51889 48702 39663
108 39663 13089 22982 17865 425 15621 -3373 -37502 -42168 -61523 -66908 -59226 -68860 -42592
121 -42592 -15919 -14319 18359 34629 25395 39306 37685 37506 51003 34250 36582 48297 23961
$$ packed form
0@%%%%%%%%%%%%%qJ6j6J6j6K4l2L4m2N2o0P2q8J03j18J35j53J76k01K27k58K91
35A54l26L66m12M62n17N76o41P11p87Q71r62J063j173J294j425J569j729J905
53I99k101K320k566K846l166L535l969M484n109N890o897Q251j0177J3155j8446
68a0951L0749j19534o7625Q0583M819O2453K885K1874K0907J458J6094J5452k9979
81B9185L7463L5460n3L113k7648m2266j1669m0582j3369J080l9173n830K2853
94e1436q133R551l708q506K9664J3528K0072M7582k103k930J8837j0529l187r039
108C9663k6574R893n117j7440J5196j8994l4129m666j9355n385P682r634K6268
121d2592K6673J600L2678J6270r234J3911j621j79J3497j6753K332J1715k4336
$$ plain form
134 23961 21199 20610 -5046 -9809 -23353 -39128 -32697 -50882 -56255 -34252 -40662 -34604 -11719 -10865
148 -10865 4851 14686 9831 27465 22296 11513 32561 28384 20100 29082 17025 14716 13207 -7968
162 -7968 -4630 -9493 -29140 -15673 -12833 -22122 -12491 -18242 -15452 -426 -8538 3916 19116 7217
176 7217 18523 26163 12381 13474 1771 -6447 6598 -3367 -1926 12925 -3718 -7161 -3398 -19585
190 -19585 -20024 -25303 -31631 -9654 -5314 -2751 19948 13555 7734 15176 4008 6951 8958 -1089
204 -1089 15906 20316 9914 20249 10854 -5400 -3116 -14025 -13492 -6582 -18235 -8362 109 -13882
218 -13882 -6921 -6434 -16275 -6063 -5686 -134 16369 7343 9160 19076 3207 2331 5427 -4741 3848
233 3848 4216 1372 14716 3668 -6738 493 -13380 -17490 -9052 -14679 -3591 3116 -2003 12492
$$ packed form
134B3961k762n89k5656m763j3544j5775O431j8185n373K2003o410O058K2885Q54
148a0865J5716R835m855J7634n169j0783K1048m177q284Q982j2057k309j509k1175
162g968L338m863j9647J3467K840r289R631n751K790J5026q112J2454J5200j1899
176G217J1306P640j3782J093j1703q218J3045r965J441J4851j6643l443L763j6187
190a9585m39n279o328K1977M340K563K2699o393n821P442j1168K943K007j0047
204a089J6995M410j0402J0335r395j6254K284j0909N33O910j1653R873Q471j3991
218a3882O961M87r841J0212L77N552J6503r026J817R916j5869q76L096j0168Q589
233C848L68k844J3344j1048j0406P231j3873m110Q438n627J1088O707n119J4495
$$ plain form
247 12492 9994 -2630 7395 1687 -2975 7325 1387 6850 13268 298 6443 6262 -10504 -4954
261 -4954 -6528 -14550 -5492 -10438 -9267 1221 -9655 -5351 4817 -5657 1357 7708 2433 12231
275 12231 9670 5067 16265 5704 1121 10622 -475 -1687 2873 -6893 -1785 -4388 -13834 -3780
289 -3780 -8335 -15609 -3677 -7413 -7461 2805 -1520 6161 11453 1781 11281 12023 271 8194 5449
304 5449 -508 6859 -376 438 5867 -7770 -5870 -2386 -15484 -10008 -7556 -11829 -453 -1815 -1299
319 -1299 10791 2019 1336 10550 876 3967 9103 2500 10565 7977 -426 7342 -1882 -10211 -2570
334 -2570 -9854 -10269 -3265 -9330 -2670 -49 -9094 370 420 -6716 4875 4654 4764 13598 7456 9029
350 9029 12213 -1415 1961 3585 -7318 -967 -720 -5736 810 -6476 -9439 -2604 -12823 -10547 -1198
$$ packed form
247A2492k498j2624J0025n708m662J0300n938N463O418j2970O145j81j6766N550
261d954j574q022R058m946J171J0488j0876M304J0168j0474P014O351n275R798
275A2231k561m603J1198j0561m583R501j1097j212M560r766N108k603r446J0054
289c780m555p274J1932l736m8J0266m325P681N292r672R500P42j1752P923k745
304E449n957P367p235Q14N429j3637J900L484j3098N476K452m273J1376j362N16
319a299J2090q772o83R214r674L091N136o603Q065k588q403P768r224q329P641
334b570p284m15P004o065O660K621r045R464N0p136J1591k21J10Q834o142J573
350I029L184j3628L376J624j0903O351K47n016O546p286k963O835j0219K276R349
$$ plain form
365 -1198 -6733 1172 6964 2653 11284 7139 1366 10535 3224 136 9200 2564 3101 6186 -3365
380 -3365 -109 -2927 -12937 -4965 -7082 -12087 -1326 -3918 -3765 3572 -3453 1115 5279 -3105 5474
395 5474 8429 1766 9627 7311 2388 7265 -1846 -3259 1745 -8100 -5444 -67 -8037 -2841 -2024
410 -2024 -7444 19 -4066 -5626 4642 -540 616 9969 3917 6493 9112 1234 6402 3291 -3763
425 -3763 4018 -601 -5459 1680 -4816 -5514 -1638 -10017 -5281 -2617 -9372 -317 1298 -3172 5654
440 5654 3453 2265 8192 1383 2653 8391 -447 3649 6693 -1522 3186 553 -5196 281 -6174
455 -6174 -7922 135 -6643 -4464 2390 -3796 394 2156 -3601 3215 1424 -2337 6913 2788 771
470 771 7571 852 1093 3170 -5070 -417 -106 -7323 718 -269 -5195 2062 -2596 -3538 1864 -4500
$$ packed form
365a198n535P905N792m311Q631m145n773R169p311l088R064o636N37L085r551
380c365L256k818j0010P972k117n005J0761k592J53P337p025M568M164q384Q579
395E474K955o663P861k316m923M877r111j413N004r845K656N377p970N196Q17
410b024n420P463m085j560J0268n182J156R353o052K576K619p878N168l111p054
425c763P781m619m858P139o496o98L876q379M736K664o755R055J615m470Q826
440E654k201j188N927o809J270N738q838M096L044q215M708k633n749N477o455
455f174j748Q057o778K179O854o186M190J762n757O816j791l761R250m125k017
470G71O800o719K41K077q240M653L11p217Q041r87m926P257m658r42N402o364
$$ plain form
486 -4500 -307 4683 -2456 4233 6351 -319 5062 2086 -1930 4026 -2277 -1810 4938 -2869 -660
501 -660 2557 -5055 -1361 -1723 -6884 528 -2172 -4026 4750 -417 -1078 4727 -1838 250 2671 -3148
517 -3148 3322 2948 -1935 5421 2108 -2065 3199 -2118 -2285 1987 -4621 286 3059 -3945 1943 1728
533 1728 -4018 1872 -1261 -2667 3637 -2079 -4 4962 -2556 791 2617 -3896 998 -375 -3753
548 -3753 3348 -1147 -2245 4217 -2400 -1699 2478 -3643 151 1564 -3282 3591 2088 -2192 4680
563 4680 135 -2107 3313 -2465 -580 3045 -3008 2087 2560 -4017 1725 -229 -4743 1167 -2666
578 -2666 -2538 2902 -2893 -28 3983 -2833 1160 2357 -3046 2502 857 -1683 4948 -249 -901 4199
594 4199 -2489 -1153 1677 -4753 222 -53 -4217 2607 -341 -3444 3246 -1289 -1870 3333 -1482 1854
$$ packed form
486d500M193M990p139O689K118o670N381k976m016N956o303M67O748p807K209
501f60L217p612L694l62n161P412k700j854Q776n167o61N805o565K088K421n819
517c148O470l74m883P356l313m173N264n317j67M272o608M907K773p004N888k15
533A728n746N890l133j406O304n716K075M966p518L347J826o513M894j373l378
548c753P101m495j098O462o617P01M177o121L794J413m846O873j503m280O872
563D680m545k242N420n778J885L625o053N095M73o577N742j954m514N910l833
578b666J28N440n795K865M011o816L993J197n403N548j645k540O631n197o52N100
594D199o688J336K830o430M975k75m164O824k948l103O690m535n81N203m815L336
$$ plain form
610 1854 4492 -1337 4029 2875 -2952 3075 -47 -3259 2117 -2608 -2080 1743 -4737 -1651 622
625 622 -5663 -1035 -516 -4078 2385 396 -211 5776 789 1160 5922 -484 1853 4062 -1557 2780
641 2780 1001 -2839 2308 -2426 -4739 -41 -5358 -4443 -203 -4772 -534 1433 -3192 3151 2153 -1220
657 -1220 4868 2107 1155 6364 1169 2395 4889 -2063 695 814 -5752 -806 -2240 -5836 -586 -4111
673 -4111 -4522 787 -4279 -1787 2552 -2074 2564 4505 829 6455 4247 1218 6314 1119 -469
688 -469 3662 -2464 -1691 431 -5294 -2056 -2559 -7369 -1608 -3777 -5720 680 -1985 -944 4518 608
704 608 3760 5968 951 5457 5266 244 4864 2164 -1024 2824 -2652 -3233 -721 -6859 -4368 -2189
720 -2189 -7054 -2106 -1459 -4197 1629 -280 -783 5275 1197 2478 7031 1761 4394 5733 3 3742
$$ packed form
610A854K638n829N366j154n827O027l122l212N376m725N28L823o480L086K273
625F22o285M628N19l562O463j989o07N987m987L71M762o406K337K209n619M337
641B780j779l840N147m734k313M698n317R15M240m569M238J967m625O343r98l373
657a220O088k761r52N209n195J226K494o952K758J19o566M946j434l596N250l525
673d111m11N309n066K492M339m626M638J941l676N626k208l029N096n195j588
688d69M131o126P73K122n725L238n03m810N761k169j943O400k665J041N462l910
704F08L152K208n017M506j91n022M620k700l188L848n476n81K512o138K491K179
720b189m865M948O47k738N826j909n03O058m078J281M553n270K633J339n730L739
$$ plain form
736 3742 1070 -3453 718 -3306 -5226 -725 -5450 -4400 -1044 -5521 -1801 -94 -3831 2136 2282
751 2282 -268 6126 3354 2532 6620 1501 2530 4390 -1683 1062 1161 -4195 -511 -2590 -5749 -1302
767 -1302 -4907 -5348 -161 -4108 -1738 2545 -1776 2624 3698 338 5367 3399 886 6007 1772
782 1772 709 4156 -1618 -975 712 -4789 -1612 -2254 -6287 -1040 -2630 -4556 957 -1806 -1446 2980
798 2980 -1082 1775 4439 -341 4180 4599 114 4452 1594 -950 2684 -2439 -2344 994 -4390 -2106
814 -2106 -285 -4777 -1053 -859 -3985 1371 -785 -1665 3926 52 1041 5183 318 2712 3691 -921
830 -921 2576 1059 -2319 2255 -945 -3386 956 -3574 -2940 -34 -4604 -1214 552 -3849 1283 1247
846 1247 -1549 3621 889 119 4510 -31 1609 4272 -1020 1560 2118 -2643 918 -771 -3679 794
$$ packed form
736C742k672m523M171m024j920M501m725J050L356m477L720J707l737N967J46
751B282k550O394k772q22M088n119J029J860o073K745R9n356L684k079l159M447
767a302l605m41N187l947K370M283m321M400J074l360N029j968k513N121m235
782A772j063L447n774O43J687n501L177o42m033N247j590j926N513k763L60M426
798B980m062K857K664m780M521M19m485M338k858k544L634n123R5L338n384K284
814b106J821m492L724J94l126N356k156q80N591l874R89M142m865K394R79m612
830i21L497j517l378M574l200k441M342m530O34K906m570L390J766m401N132l6
846A247k796N170k732p70M391m541J640K663n292K580N58m761L561j689k908M473
$$ plain form
862 794 -2759 -3332 1304 -3329 -1700 1260 -3013 654 1551 -1939 3070 1739 -213 4439 1142 477
878 477 3951 -564 455 2000 -2745 723 249 -3663 352 -1645 -3739 507 -2559 -2455 1680 -2447
894 -2447 205 2619 -1198 2680 2857 -633 3934 1748 -470 3826 -464 -510 2245 -2547 -1034 376
910 376 -4243 -630 -1129 -4263 753 -1589 -2638 2327 -1418 -517 3358 -942 2002 3758 -466 3711
926 3711 2959 -763 3312 -17 -1421 1811 -2216 -2156 568 -4428 -1552 -616 -4475 -152 -714 -3097
942 -3097 1933 -288 -589 4168 308 1914 4218 -139 2645 2991 -921 2318 522 -2309 1505 -2365
958 -2365 -3273 101 -4261 -2763 -257 -3892 -502 530 -2427 2563 1247 -519 4317 1450 1166 4859
974 4859 482 1820 3387 -1451 1153 453 -3568 228 -1982 -4152 -348 -3594 -2932 258 -3179 -466
$$ packed form
862G94l553n73M636m633J629K960m273L667Q97l490N009j331j952M652l297o65
878D77L474m515J019J545m745L468m74l912M015j997k094M246l066J04M135m127
894b447K652K414l817L878J77l490M567k186k218M296m290m6K755m792J513J410
910C76m619L613m99l134N016k342j049M965l745R01L875m300K944J756m224M177
926C711p52l722M075l329j404L232m027O0K724m996K876R36l859M323n62k383
942c097N030k221l01M757l860J606K304m357K784L46l912L239j796k831L814l870
958b365r08L374m362J498K506l635L390J032k957M990j316j766M836k867k84L693
974D859m377J338J567m838K604p00m021L796k210k170L804l246O62L190l437K713
$$ plain form
990 -466 1671 -1926 2113 2475 -228 4049 2585 1000 4724 621 253 3120 -1863 -485 110 -3775
1006 -3775 -601 -1576 -4426 -557 -2613 -3498 854 -2086 -599 2719 -545 2411 3772 317 3944
1021 3944 2780 115 3625 687 -870 2311 -1915 -1549 160 -4372 -2012 -1107 -4676 -710 -1092 -3152
1037 -3152 1749 -310 -518 3497 390 1804 4438 350 3004 3203 -462 2619 887 -2189 1437
1052 1437 -2395 -3253 -92 -3931 -2570 -387 -3858 -704 87 -2425 1985 1037 -343 3916 1130 1209
1068 1209 4361 433 1857 2928 -1540 975 612 -3193 -209 -1641 -3932 -365 -3349 -3006 348
1083 348 -2790 -484 1695 -1417 1911 2106 -195 3565 1641 423 3860 125 -48 2594 -2019 -397
1099 -397 732 -3600 -843 -1334 -4038 59 -1972 -2867 1351 -1443 -287 2470 -642 1640 3148 -301
$$ packed form
990d66K137l597M039L62k703M277j464j585L724m103l68K867m983J378N95l885
1006c775L174r75k850L869k056q85M352k940J487L318l264K956J361l455L627
1021C944j164k665L510k938j557L181m226L66J709m532K360R05l569L966l82k060
1037c152M901k059k08M015l107J414K634m088K654J99l665L081j732l076L626
1052A437l832q58L161l839J361K183l471L154P91k512M410r48j380M259k786P9
1068A209L152l928J424J071m468K515l63l805K984j432k291L567k984L43L354
1083C48l138K306K179l112L328J95k301L760j924j218L437l735j73K642m613J622
1099c97J129m332K757m91k704M097k031q95M218k794J156K757l112K282J508l449
$$ plain form
1115 -301 2927 1905 -459 2924 489 -983 1969 -2317 -1618 513 -3182 -1141 -170 -3335 43 -549
1131 -549 -2087 1650 -291 -579 2813 -269 1129 3128 -231 1878 1827 -1240 1888 739 -1889 1353
1147 1353 -1369 -1843 1094 -2360 -1085 573 -2975 -11 357 -2060 1818 899 -867 2970 235 194
1163 194 2988 -856 1111 2281 -1759 939 865 -2551 701 -828 -2102 1284 -1832 -1632 1261 -2273
1179 -2273 -190 1081 -1893 1395 964 -1413 2286 595 -561 2515 -243 -499 2278 -1248 439
1194 439 1327 -2055 851 -144 -2204 1257 -1021 -1899 1321 -1780 -1195 1551 -1693 577 1296 -1709
1210 -1709 1398 991 -1109 2282 173 -640 2295 -906 -35 1668 -1885 -11 698 -2269 549 -264
1226 -264 -2344 1159 -1030 -1840 1698 -1285 -241 1676 -1654 955 1496 -1177 2092 918 -989 2274
$$ packed form
1115c01L228j022k364L383k435j472K952m286O99K131l695K041R71l165L378n92
1131e49j538L737j941k88L392l082J398J999l359K109n1l067L128j149k628L242
1147A353k722m74K937l454J275J658l548K964L68k417L878r19j766L837k735m1
1163A94K794l844J967J170m040K698p4l416L252j529j274L386l116K00K893l534
1179b273K083J271k974L288m31k377L699j691j156L076k758k56K777l526J687
1194D39Q88l382K906r95k060L461k278q78L220l101N85K746l244K270P19l005
1210a709L107m07k100L391k109q13K935l201Q71J703l553J874P09k967K818q13
1226b64k080L503k189q10L538k983J044J917l330K609N41k673L269j174j907L263
$$ plain form
1242 2274 -152 -807 1855 -1176 -372 788 -2418 47 466 -2489 577 -354 -1716 1401 -1007 -703
1258 -703 1897 -816 475 2301 -899 1508 1510 -967 1700 150 -1093 1935 -1039 -1125 668 -2224
1274 -2224 -784 391 -2555 213 146 -2080 1363 181 -849 2467 -220 299 2441 -321 915 1766
1290 1766 -1233 1278 842 -2016 947 -1059 -1832 686 -2106 -1594 831 -2218 -310 677 -1538 1098
1306 1098 1166 -853 2494 901 89 2768 -82 165 1866 -1435 342 809 -2692 214 -808 -2537
1322 -2537 313 -1333 -2057 754 -1618 -606 1376 -1005 1476 1764 -444 2666 1171 -475 2203
1337 2203 268 -401 1567 -1282 -585 583 -2761 -363 -566 -2802 8 -601 -1815 1349 -734 -131
1353 -131 1945 -431 1057 2416 -432 1723 1755 -1002 1963 266 -1287 1105 -1426 -1570 560 -2513
$$ packed form
1242B274k426o55K662l031Q04J160l206K465M19k955L066r31j362L117k408L04
1258g03K600k713J291J826l200K407Kk477K667j550j243L028k974q6J793k892
1274b224J440J175k946K768o7k226L443j182j030L316k687N19K142k762J236Q51
1290A766k999K511m36k858K963k006p73K518k792N12K425l049J908R87k215K636
1306A098O8k019L347j593q12K679k850K47J701l301J777M67l501K906j022j729
1322b537K850j646p24K811k372J012J982k381K481K88k208L110j495j646K678
1337B203j935o69J968k849O97J168l344K398k03k236K810o09j214L164k083O03
1353a31K076k376J488J359k848K155L2k757K965j697j553K392k531j44K130l073
$$ plain form
1369 -2513 -1102 78 -2611 -255 -258 -1548 1276 249 -715 2466 422 381 2786 -79 1196 1908 -972
1386 -972 1067 120 -1716 703 -1106 -1946 423 -1703 -1005 557 -1711 64 780 -1266 1421 966
1402 966 -359 2298 621 -232 2183 -110 367 1667 -1292 128 562 -2333 266 -629 -2264 459
1418 459 -1485 -1468 1165 -1129 1 1835 -670 1217 1430 -730 1917 871 -369 1742 -235 -842
1434 -842 1214 -1310 -923 559 -2272 -487 166 -1956 550 -475 -1272 1492 -279 -287 2160 -411 312
1451 312 1964 -575 1136 1156 -1047 888 -11 -1198 974 -946 -1034 728 -1919 -662 507 -1749
1467 -1749 644 259 -1440 1683 207 -674 1870 -115 64 1754 -613 287 934 -1400 821 239
1483 239 -1551 701 -452 -1385 1113 -951 -509 1028 -1387 148 951 -985 857 933 -704 1066
$$ packed form
1369b513J411J180k689K356lj290K824j027r64L181k044m1K405k865J275P12k880
1386i72K039r47j836K419j809q40K369k126O98J562k268J775P16k046K687m55
1402I66j325K657j677q53K415k293M77J300k959J420M34k895K599q95j635K723
1418D59j944J7K633k294J130J834k505J887K13k160K647j046j240K111j977o07
1434h42K056k524L87J482k831J785O53k122K506j025p97K764j771qK447k571P23
1451C12J652k539J711K0k203J935q99j187K172j920q8J762k647J257J169k256
1467a749K393l85j699L123j476q81K544j985J79J690k367R00O47k334K221n82
1483B39j790K252j153r33K498k064M42J537k415J535Q03j936J842P6j637J770
$$ plain form
1499 1066 101 -646 1620 -711 -448 992 -1314 178 797 -1440 487 7 -1077 951 -210 -773
1515 -773 1068 -680 -134 1038 -1041 210 751 -1413 1175 -4 -890 1041 -521 -815 1303 -542
1531 -542 -50 1104 -1249 671 615 -1154 947 -61 -1056 894 -668 -790 1182 -997 52 1000 -1118
1548 -1118 683 579 -1098 1157 32 -656 1444 -530 -198 883 -749 218 1036 -846 461 -9
1564 -9 -1480 723 -444 -1308 901 -821 -646 1107 -1128 161 906 -670 1086 646 -692 1459 378
1581 378 -558 1492 -530 -474 1189 -1292 44 578 -1387 203 -121 -1291 904 -422 -911 1062 -903
1598 -903 -183 1311 -727 836 1234 -583 1150 478 -626 1107 -224 -595 875 -1314 -538 414 -1445
1615 -1445 -147 33 -1517 784 95 -719 1261 78 -87 1550 -124 574 1490 -675 608 589 -1443
$$ packed form
1499A066r65p47K266k331K63J440k306J492O19k237J927m80j084K028j161n63
1515g73J841j748N46J172k079J251N41k164K588j179q86J931j562k94K118j845
1531e42M92J154k353J920n6j769K101j008r95J950j562j22J972k179J049R48k118
1548a118J801j04j677K255j125o88K100j974L32J081j632R67Q18j882J307m70
1564ij471K203j167q64K209j722J75J753k235J289P45j576J756m40j338K151j081
1581C78r36K050k022N6J663k481J336N34j965J590l24j170K195j326m89J973j965
1598i03P20J494k038J563L98j817J733o72j104J733j331l71J470k189P76R52j859
1615a445J298J80j550K301o89q14J980j183j65J637j674O98R16k165J283j9k032
$$ plain form
1632 -1443 712 -201 -1108 605 -1065 -1153 536 -1381 -150 606 -1249 669 390 -591 1228 653 -152
1649 -152 1699 -7 3 1335 -881 189 686 -1403 126 -63 -1474 169 -761 -1364 714 -753 -499
1666 -499 1003 -903 282 1232 -589 1123 976 -274 1354 412 -467 990 -1031 -719 698 -1200
1682 -1200 -396 116 -1263 273 25 -1040 781 -176 -656 1259 -308 461 1447 -478 601 1136 -402
1699 -402 839 168 -938 548 -557 -904 506 -1136 -379 18 -1213 118 476 -979 861 293 -628
1716 -628 1499 -212 -22 1472 -298 26 968 -1042 519 373 -1241 439 -443 -1054 480 -855 -756
1733 -756 488 -917 104 840 -685 640 654 -694 1109 228 -349 1438 -141 -100 817 -762 -356
1750 -356 18 -1264 -117 -245 -1199 464 -132 -595 1231 -482 -179 1338 -220 636 1062 -394 918
$$ packed form
1632a443K155r13r07J713j670q8J689j917J231P56j855J918k79r81J819n75q05
1649a52J851j706J0J332k216J070M97k089J529j89j411J643r30o03K078j467K54
1666d99J502j906J185R50j821J712j47j250J628r42q79J457k021L12J417j898
1682a200Q04N12j379J536k48j065J821r57m80J915j567P69R86j925J079N35j538
1699d02J241o71j106J486j105l47J410j642P57L97j231J331L58j455J840n68r21
1716f28K127j711J90J494j770L24R42k010J561j46j614J680q82o11J534j335R9
1733g56J244j405J021P36j525J325J4j348J803q81n77J787j579M1R17j579M06
1750c56L74j282J147j28r54J663n96m63J826j713L03J517j558Q56M26j456J312
$$ plain form
1767 918 664 -788 715 -35 -986 637 -820 -193 500 -1062 40 548 -1371 616 332 -1009 814
1784 814 -119 -124 1086 -496 228 1153 -521 536 535 -1021 391 -186 -1068 677 -713 -667 448 -789
1802 -789 -187 628 -1032 367 293 -983 971 61 -445 1132 -117 -500 1090 -552 -142 772 -762
1819 -762 385 191 -1030 571 -103 -695 688 -433 -529 799 -496 270 704 -695 457 305 -981
1836 -981 796 -53 -878 853 -382 -415 872 -736 -69 522 -1090 499 245 -814 850 -165 -782
1853 -782 848 -584 -394 888 -907 84 392 -1015 535 110 -867 522 -319 -652 1025 -426 77
1870 77 724 -861 204 506 -842 622 328 -803 845 -320 -497 779 -775 -174 267 -874 132
1887 132 470 -695 565 444 -486 1049 -13 -310 1003 -483 -311 764 -925 9 147 -754 551
$$ packed form
1767I18k54j452J503p50r51J623j457O27O93j562J102N08j919J987k84j341J823
1784H14r33nJ210j582P24R25j674J057jj556J412n77q82J745j390M6J115j237
1802g89O02Q15j660J399p4j276J954r10n06J577j249l83J590j642M10R14j534
1819g62J147j94j221J601o74n92J383j121r6J328j295P66M34j399J152j52j286
1836i81J777q49q25J731j235l3J287j608O67N91j612J589k54j059J664j015o17
1853g82J630j432J90J282j795R91L08j407J550m25r77J389q41l33J677j451N03
1870G7O47j585J065L02j348J464k94j131J648j165j77J276j554O01M41j141J006
1887A32L38j165J260j21r30J535j062k97J313j486J72J075j689R34J38r01J305
$$ plain form
1904 551 -141 -726 979 -731 -238 674 -735 150 730 -527 545 930 -737 878 195 -566 997
1921 997 -484 -476 767 -478 26 238 -1041 141 88 -951 493 152 -737 872 -289 169 1075 -265
1939 -265 335 710 -541 405 158 -624 661 -536 -663 333 -909 -678 434 -857 -108 444 -734 493
1957 493 368 -644 1032 229 -174 1381 -159 13 801 -485 30 319 -904 391 112 -953 426
1974 426 -739 -852 805 -682 -168 519 -448 326 627 -408 1053 657 -482 994 -150 -220 878
1991 878 -601 -283 410 -1135 -155 -163 -1210 250 -45 -805 511 -359 -596 1249 -326 239 1021 -187
2009 -187 918 739 -671 938 130 -693 494 -531 -583 200 -1012 -472 384 -1021 200 -1 -496 791
2027 791 -59 -345 1237 3 274 942 -373 559 605 -464 582 35 -823 580 -342 -873 387 -883
$$ packed form
1904E51o92n85J705j710M93R12j409Q85N80j257J072L85j667J615o83p61J563
1921I97j481QJ243j245N04K12j279J182n3j039J444l41q89J609j161M58R06j340
1939b65O00L75j251R46k47p82J285j197j27R96j242K31J112j291P49N52j178J227
1957D93j25j012J676q03m03J555j540J72P88j286N15K89j223J295k79j065J379
1974D26j165j13J657j487N14O87r67P74L01j035J461l96j139J476j144p0J098
1991H78j479L18O93j545R80qj047J460k95p60J316q70k37J845j575N65P82j208
2009a87J105j79j410J609q08q23J187j025n2P83j212N40Q56j405J221k01m95J287
2027G91q50k86J582j234K71O68j315R32M6j069J046n47q58J403r22n31J260j270
$$ plain form
2045 -883 -563 491 -777 314 755 -779 683 529 -421 934 -88 -128 1248 -403 -157 569 -683
2062 -683 -150 457 -964 46 -420 -1108 553 -402 -583 840 -477 -69 1037 -624 345 757 -685
2079 -685 802 414 -713 735 -108 -216 432 -840 -399 470 -1000 249 129 -536 434 71 -392 823
2097 823 -132 -205 896 -275 106 941 -578 243 366 -703 532 -71 -695 595 -582 -396 609 -763
2115 -763 104 536 -644 314 373 -471 822 356 -439 927 -289 -353 543 -755 25 339 -807 -179 52
2134 52 -824 372 -300 -460 768 -273 -165 621 -520 75 617 -544 529 258 -306 456 -75 -597
2152 -597 527 -455 -431 572 -657 -125 309 -692 508 207 -327 801 -217 -254 684 -490 -74 665
2170 665 -625 243 485 -505 289 -80 -976 443 -248 -261 522 -498 -38 494 -390 268 479 -721 616
$$ packed form
2045h83L20J054j268J091M41j534J462j54r50J355j022m0J376j651K46P26j252
2062f83N33O07j421J010m66o88J661r55j81J423j317M08J106j661R69M12j442
2079f85J487l88j127J448q43j08O48j272M41Q69j470J249j20o65R70l63m63J215
2097H23r55p3J101j171L81Q35j519Q21J23j069J235o03o24J290j177J86J005j372
2115g63Q67M32j180R58N9q44J293m66p95J366j216o4Q96j298P80L14j146O28K31
2134E2q76J196o72j60J228j041J08P86j141N95N42j161J073k71n64P62n31n22
2152e97J124r82K4J003j229N32M34j001J200l01n34J128j018l7R38j174M16P39
2170F65j290Q68K42r90P94l69q96J419o91j3P83j020M60N32q84O58K11j200J337
$$ plain form
2189 616 122 -174 699 -321 -235 621 -761 15 298 -574 391 82 -604 662 53 -620 710 141 -63
2208 -63 862 -256 -143 252 -588 307 314 -737 702 89 -835 436 -508 -211 657 -717 -56 410 -473
2227 -473 260 180 -296 646 -5 9 898 -20 -72 509 -559 -20 157 -777 298 255 -796 293 -248 -445
2247 -445 399 -421 -63 530 -562 429 515 -347 630 331 -561 687 -494 -623 606 -611 -453 -88 -869
2266 -869 -58 104 -509 568 -341 -659 401 -68 -137 604 -242 127 640 -409 153 377 -537 491 -178
2285 -178 -269 249 -453 -433 335 -353 -115 243 -895 210 379 -504 758 44 32 686 -121 -213 459 -419
2305 -419 97 495 -583 -7 -22 -773 17 82 -339 495 -564 -254 429 -386 117 584 -501 286 501 -434
2325 -434 862 -41 -443 503 -166 -123 495 -823 26 515 -852 150 150 -383 642 -33 -203 459 -258
$$ packed form
2189F16m94k96Q73j020Q6Q56j382P76K83q72R65l09o86J266o09o73J330n69k04
2208f3R25j118J13L95q40Q95Pj051J439o13r24J271r44K97Q68j374O61M66q83
2227d73P33q0m76R42o51J4Q89r18n2N81j068N39J77r34J075m3j051J089n41j97
2247d45Q44q20L58N93j092R91Q6q62R77k99q92J248j181j29J229j217J58L65p81
2266h69Q11J62o13J077r09l18J060m69o9P41q46L69N13j049N62K24r14J028o69
2285a78r1N18p02K0P68o88K38L58j138J105J69q83J262p14j2O54q07r2O72q78
2305d19N16L98j078N76j5p51P90O5m21Q34j059L10O83q15N03M67j085P87K15r35
2325d34J296r03m02R46o69M3O18j318Q49M89j367J002%n33J025o75j70O62p17
$$ plain form
2344 -258 285 644 -423 304 217 -648 292 -104 -462 216 -228 -439 402 -458 -351 112 -572 188 443 -417
2364 -417 766 20 -303 907 9 -118 657 -518 114 650 -267 -142 138 -630 187 -312 -518 607 -472
2383 -472 -24 377 -321 39 718 -326 260 127 -498 450 -53 -179 505 -259 -561 412 -596 137 306
2402 306 -413 55 187 -589 259 326 -288 343 -402 -170 531 -234 102 217 -294 422 -101 -494 483 -28
2422 -28 -601 393 -431 18 201 -405 120 407 -388 302 -1 -265 737 141 -232 598 -20 -271 213 -532
2442 -532 69 203 -606 181 231 -471 210 78 -463 200 -456 48 554 -629 563 435 -415 449 34 -460
2462 -460 473 -166 -196 362 -215 -145 473 -786 -208 52 -481 328 37 -349 489 -141 35 424 -313 385
2482 385 287 -310 142 187 -590 120 -153 -306 477 -223 -49 406 -375 -22 486 -620 364 203 -374 423
$$ packed form
2344b58N43L59j067P27q7q65R40l96l58O78m44k11Q41q60J07M63o84P60K55q60
2364d17J183p46l23J210q98j27P75j175O32N36r17J25K80p68Q17m99k06J125j079
2383d72M48M01o98L60O79j044N86j33o25R48n03j26O84p64l02R73j008P33J69
2402C06p19M68J32p76Q48O7o14O31p45K32P01p65L36J15n11P16n23l93R77n11
2422b8n73R94q24M49J83o06N25K87p95O90l03k64J002n96l73Q30o18k51M84p45
2442e32O01J34q09P87N0p02O81j32n41O63o56N04N06j183J192j28q50Q64m15m94
2462d60R33o39l0N58n77P0O18j259N78K60n33Q09k91l86Q38o30J76L89p37O98
2482C85r8n97M52M5p77P10k73j53P83p00J74M55p81L53N08j106R84j61n77P97
$$ plain form
2502 423 130 -258 530 -76 -231 472 -374 80 16 -477 177 53 -414 321 -157 -286 434 -150 -122 205 -488
2523 -488 202 235 -311 418 149 -123 301 -234 -84 206 -311 -152 -35 -527 183 111 -412 231 87 -73 442
2544 442 211 -148 660 -280 5 360 -336 42 86 -285 143 89 -408 431 -324 -530 659 -303 -148 288
2564 288 -310 292 324 -79 552 70 -3 419 -30 -182 99 -391 -246 34 -380 22 247 -463 181 214 -340
2585 -340 549 -407 -160 253 -113 269 394 -302 259 213 -466 312 -113 -262 223 -178 -283 62 -297 59
2605 59 -51 -283 2 75 -243 488 157 14 499 -119 362 388 -212 78 238 -108 315 212 -381 185 -169
2626 -169 -295 83 -405 -134 326 -478 -3 471 -320 287 228 -323 420 172 -133 311 -271 121 334 -379
2646 -379 -75 119 -510 -64 -52 -248 246 -84 -146 290 289 127 208 -266 232 280 -186 156 -55 -190 415 -3
$$ packed form
2502D23k93l88P88o06j55P03q46M54o4m93O54j24m67P35m78j29P20n84K8L27o93
2523d88O90L3n46P29k69k72M24n35J50K90n17J59J17m92P10p2n23O43j44j60N15
2544D42k31l59Q08r40K85L55o96L78M4l71M28n4m97Q39p55k06J189r62J55M36
2564B88n98O02L2m03O31m82p3M22m49j52K81m90J45K80m14M02K25p10O44L3n54
2585c40Q89r56K47M13l66L82J25o96N61m6o79P78m25j49M85m01j05L45l59L56
2605E9j10k32K85P3l18P31l31j43M85o18M81K6o00K90J60l46M23j03n93N66l54
2626a69j26L78m88K71M60q04M75M74p91O07n9n51P43k48l05M44n82L92K13p13
2646c79L04J94o29M46J2j96M94l30o2M36jj62Q1m74M98M8m66L42k11j35O05m18
$$ plain form
2668 -3 -13 187 -264 -77 361 -123 251 -94 -500 196 22 -191 471 -438 72 341 -370 -21 362 -11 139
2689 139 38 -250 145 -136 -249 504 -298 -21 375 -384 322 296 -111 262 231 -178 525 -117 -133 63 -206
2710 -206 -2 127 -463 -64 196 -386 301 -83 -284 84 129 -413 554 -259 134 415 -397 100 255 -157
2730 -157 40 320 -317 -42 -238 -156 117 73 -68 294 -2 197 125 -416 396 38 -199 347 -56 -16 445
2751 445 -234 306 151 -406 -1 -31 -197 183 33 -345 105 -211 -212 150 -60 39 447 -130 209 193 -107 90
2773 90 -16 -55 -10 -172 -134 208 4 -86 187 -311 -276 -124 -159 358 48 110 207 -151 -67 653 -13 99 131 -184
2797 -184 75 96 -59 571 -374 -459 222 -318 -213 33 -362 56 57 -400 -44 209 -134 233 116 -327 192
2818 192 -27 -5 226 -143 -186 51 -532 148 -67 26 27 -182 -372 162 -99 -57 466 -321 31 169 -376 50
$$ packed form
2668cj0K00m51J87M38m84L74l45m06O96j74k13O62r09N10K69p11L49L83l73J50
2689A39j01k88L95k81j13P53q02K77L96p59P06k6m07L73l1m09P03o42j6J96k69
2710b06K04J29n90L99K60n82O87l84k01L68M5n42R67q13L93K81q12M97J55m12
2730a57J97K80o37K75j96Q2K73m4j41L62k96J99p2n41Q12l58k37N46m03M0M61
2751D45o79N40j55n57M05l0j66L80j50l78M50l16jL62k10R9M08n77L39j6l00J97
2773I0j06l9M5j62L8L42k04r0K73m98L5J52l5N17l10O2R7l58Q4P20o66J12L2l15
2797a84K59K1j55O30r45q5O81n40J05K46l95M18Jm57L56K53l43L67j17m43N19
2818A92k19K2K31l69m3K37n83O80k15R3Jk09j90N34k61M2N23p87L52J38n45M26
$$ plain form
2840 50 -124 -334 376 61 -151 99 -216 -95 11 -306 -113 3 -389 96 86 -480 340 -188 74 345 90
2861 90 110 341 -188 -61 55 -185 119 -196 -334 364 -15 -379 115 -477 96 184 -164 -232 92 -220 434
2882 434 89 -43 261 154 206 472 -140 96 122 -399 96 42 -307 -9 -234 -381 67 17 -113 134 -142
2903 -142 371 379 -160 253 77 -319 122 -85 -243 -1 -458 -301 74 -355 85 49 -215 -110 195 -313 150
2924 150 -63 -206 337 78 161 223 -200 -10 149 -351 136 -54 -327 -172 -125 -243 426 -337 -71 201 -368
2945 -368 117 228 -153 278 54 -42 213 186 -234 404 -210 -62 -17 -79 197 163 -322 178 52 -81 40 -55
2967 -55 -32 113 194 213 146 -370 146 -105 -116 361 -33 -21 149 -121 63 213 -233 31 51 -274 226 -23 -297
$$ packed form
2840E0j74k10P10l15k12K50l15J21J06l17J93J16l92M85j0n66Q20n28K62K71k55
2861I0K0K31n29J27J16k40L04l15j38O98l79l64M94n92N73Q8l48o8L24l12O54
2882D34l45j32L04j07N2K66o12K36K6n21M95n4l49K98k25j47M48n0j30K47k76
2903a42N13Qn39M13j76l96M41k07j58K42m57J57L75m29M40l6k64J05L05n08M63
2924A50k13j43N43k59Q3O2m23J90J59n00M87j90k73J55M7j18O69p63K66K72n69
2945c68M85J11l81M31k24r6K55k7m20O38o14J48M5o2K76l4m85N00j26j33J21r5
2967e5K3J45Q1J9o7n16N16k51j1M77l94J2J70k70J84J50m46K64K0l25N00k49k74
$$ [...]
8191b16
##END NTUPLES=NMR FID
##END=
