##TITLE=1H_Pr 5241
 200.13MHz, CDCl3,
 24 sc
 
 14.1.2025
##JCAMPDX= 6.0         $$ Bruker NMR JCAMP-DX V2.0
##DATA TYPE= NMR FID
##DATA CLASS= NTUPLES
##ORIGIN= UXNMR, Bruker Analytische Messtechnik GmbH
##OWNER= pz
$$ XWIN-NMR		Version 3.5
$$ Tue Jan 14 16:04:23 2025 Russian Standard Time (UT+4h)  she@DPX200
##.OBSERVE FREQUENCY= 200.131
##.OBSERVE NUCLEUS= ^1H
##.DELAY= (6, 6)
##.ACQUISITION MODE= SIMULTANEOUS
##.ACQUISITION SCHEME= undefined
##.AVERAGES= 8
##.DIGITISER RES= 18
##SPECTROMETER/DATA SYSTEM= spect
##.PULSE SEQUENCE= zg30
##.SOLVENT NAME= CDCl3
##.SHIFT REFERENCE= (INTERNAL, CDCl3, 0, 14.3821)
##AUDIT TRAIL= $$ (NUMBER, WHEN, WHO, WHERE, WHAT)
$$ ##TITLE= Audit trail, XWIN-NMR		Version 3.5
$$ ##JCAMPDX= 5.01
$$ ##ORIGIN= Bruker BioSpin GmbH
$$ ##OWNER= she
$$ F:/spectra/data/she/nmr/H-C/1/audita.txt
$$ ##AUDIT TRAIL=  $$ (NUMBER, WHEN, WHO, WHERE, WHAT)
(   1,<2025-01-14 16:02:45.68 +0400>,<she>,<DPX200>,
      <created by zg, POWCHK disabled, PULCHK disabled
       configuration hash MD5:
       00 E9 B6 7A A2 85 ED C7 34 08 36 98 17 FE 4E 26
       data hash MD5: 16K
       B8 EB 23 55 63 D1 CD 0A 29 B2 D2 AA 77 E8 DD AA>)
$$ ##END=
$$ 
$$ hash MD5
$$ 87 24 4E D3 84 1F 8B 4A 3E 5F 16 43 11 A1 56 DC
##$RELAX= 
##$RELAX= 
##$RELAX= 
##$RELAX= 
##$RELAX= 
##$RELAX= 
$$ Bruker specific parameters
$$ --------------------------
##$DU= <F:/spectra>
##$EXPNO= 1
##$NAME= <H-C>
##$PROCNO= 1
##$TYPE= <nmr>
##$USER= <she>
##$AMP= (0..31)
100 100 100 100 100 100 100 100 100 100 100 100 100 100 100 100 100 100 
100 100 100 100 100 100 100 100 100 100 100 100 100 100 
##$AQSEQ= 0
##$AQ_mod= 1
##$AUNM= <au_zg>
##$AUTOPOS= <>
##$BF1= 200.13
##$BF2= 200.13
##$BF3= 200.13
##$BF4= 200.13
##$BF5= 200.13
##$BF6= 200.13
##$BF7= 200.13
##$BF8= 200.13
##$BYTORDA= 1
##$CFDGTYP= 0
##$CFRGTYP= 5
##$CHEMSTR= <none>
##$CNST= (0..31)
1 1 145 1 1 1 1 1 1 1 1 1 1 1 1 1 1 1 1 1 1 1 1 1 1 1 1 1 1 1 1 1 
##$CPDPRG= <>
##$CPDPRG1= <>
##$CPDPRG2= <>
##$CPDPRG3= <>
##$CPDPRG4= <mlev>
##$CPDPRG5= <mlev>
##$CPDPRG6= <mlev>
##$CPDPRG7= <mlev>
##$CPDPRG8= <mlev>
##$CPDPRGB= <>
##$CPDPRGT= <>
##$D= (0..31)
0 0.7 0 0 0 0 0 0 0 0 0 0.03 0 0 0 0 0 0 0 0 0 0 0 0 0 0 0 0 0 0 0 0 
##$DATE= 1736856165
##$DBL= (0..7)
120 120 120 120 120 120 120 120 
##$DBP= (0..7)
150 150 150 150 150 150 150 150 
##$DBP07= 0
##$DBPNAM0= <>
##$DBPNAM1= <>
##$DBPNAM2= <>
##$DBPNAM3= <>
##$DBPNAM4= <>
##$DBPNAM5= <>
##$DBPNAM6= <>
##$DBPNAM7= <>
##$DBPOAL= (0..7)
0.5 0.5 0.5 0.5 0.5 0.5 0.5 0.5 
##$DBPOFFS= (0..7)
0 0 0 0 0 0 0 0 
##$DE= 6
##$DECBNUC= <off>
##$DECIM= 32
##$DECNUC= <off>
##$DECSTAT= 4
##$DIGMOD= 1
##$DIGTYP= 9
##$DL= (0..7)
0 120 120 120 120 120 120 120 
##$DP= (0..7)
150 150 150 150 150 150 150 150 
##$DP07= 0
##$DPNAME0= <>
##$DPNAME1= <>
##$DPNAME2= <>
##$DPNAME3= <>
##$DPNAME4= <>
##$DPNAME5= <>
##$DPNAME6= <>
##$DPNAME7= <>
##$DPOAL= (0..7)
0.5 0.5 0.5 0.5 0.5 0.5 0.5 0.5 
##$DPOFFS= (0..7)
0 0 0 0 0 0 0 0 
##$DQDMODE= 0
##$DR= 18
##$DS= 0
##$DSLIST= <SSSSSSSSSSSSSSS>
$$ [...]
##$SUBNAM0= <"">
##$SUBNAM1= <"">
##$SUBNAM2= <"">
##$SUBNAM3= <"">
##$SUBNAM4= <"">
##$SUBNAM5= <"">
##$SUBNAM6= <"">
##$SUBNAM7= <"">
##$SUBNAM8= <"">
##$SUBNAM9= <"">
##$SW= 18.0517599122864
##$SWIBOX= (0..15)
0 0 2 0 0 0 0 0 0 0 0 0 0 0 0 0 
##$SW_h= 3612.71676300578
##$TD= 16384
##$TD0= 1
##$TE= 0
##$TE2= 300
##$TE3= 300
##$TEG= 300
##$TL= (0..7)
0 120 120 120 120 120 120 120 
##$TP= (0..7)
150 150 150 150 150 150 150 150 
##$TP07= 0
##$TPNAME0= <>
##$TPNAME1= <>
##$TPNAME2= <>
##$TPNAME3= <>
##$TPNAME4= <>
##$TPNAME5= <>
##$TPNAME6= <>
##$TPNAME7= <>
##$TPOAL= (0..7)
0.5 0.5 0.5 0.5 0.5 0.5 0.5 0.5 
##$TPOFFS= (0..7)
0 0 0 0 0 0 0 0 
##$TUNHIN= 0
##$TUNHOUT= 0
##$TUNXOUT= 0
##$USERA1= <user>
##$USERA2= <user>
##$USERA3= <user>
##$USERA4= <user>
##$USERA5= <user>
##$V9= 5
##$VALIST= <valist>
##$VCLIST= <CCCCCCCCCCCCCCC>
##$VD= 0
##$VDLIST= <DDDDDDDDDDDDDDD>
##$VPLIST= <PPPPPPPPPPPPPPP>
##$VTLIST= <TTTTTTTTTTTTTTT>
##$WBST= 1024
##$WBSW= 4
##$XGAIN= (0..3)
0 0 0 0 
##$XL= 0
##$YL= 0
##$YMAX_a= 338075
##$YMIN_a= -443712
##$ZGOPTNS= <>
##$ZL1= 120
##$ZL2= 120
##$ZL3= 120
##$ZL4= 120
##$ABSF1= 10
##$ABSF2= 0
##$ABSG= 5
##$ABSL= 3
##$ALPHA= 0
##$AQORDER= 0
##$ASSFAC= 0
##$ASSFACI= 0
##$ASSFACX= 0
##$ASSWID= 0
##$AUNMP= <proc_1d>
##$AZFE= 0.1
##$AZFW= 0.1
##$BCFW= 1
##$BC_mod= 2
##$BYTORDP= 1
##$COROFFS= 0
##$CY= -3
##$DATMOD= 1
##$DC= 2
##$DFILT= <>
##$DTYPP= 0
##$F1P= 0
##$F2P= 0
##$FCOR= 0.5
##$FTSIZE= 0
##$FT_mod= 4
##$GAMMA= 1
##$GB= 0.15
##$INTBC= 1
##$INTSCL= 1
##$ISEN= 128
##$LB= 0.25
##$LEV0= 0
##$LPBIN= 0
##$MAXI= 10000
##$MC2= 0
##$MEAN= 0
##$ME_mod= 0
##$MI= 1.114404
##$NCOEF= 0
##$NC_proc= 0
##$NLEV= 6
##$NOISF1= 3.799351
##$NOISF2= 2.8
##$NSP= 1
##$NTH_PI= 0
##$NZP= 0
##$OFFSET= 14.38212
##$PC= 1
##$PHC0= 249.0775
##$PHC1= 11.39222
##$PH_mod= 1
##$PKNL= yes
##$PPARMOD= 0
##$PSCAL= 0
##$PSIGN= 0
##$REVERSE= no
##$SF= 200.129724274929
##$SI= 16384
##$SIGF1= 3
##$SIGF2= 2
##$SINO= 400
##$SIOLD= 16384
##$SREGLST= <1H.CDCl3>
##$SSB= 0
##$STSI= 0
##$STSR= 0
##$SW_p= 3205.1282051282
##$SYMM= 0
##$S_DEV= 0
##$TDeff= 0
##$TDoff= 0
##$TI= <>
##$TILT= no
##$TM1= 0
##$TM2= 0
##$TOPLEV= 0
##$USERP1= <user>
##$USERP2= <user>
##$USERP3= <user>
##$USERP4= <user>
##$USERP5= <user>
##$WDW= 1
##$XDIM= 8192
##$YMAX_p= 0
##$YMIN_p= 0
$$ End of Bruker specific parameters
$$ ---------------------------------
##NTUPLES= NMR FID
##VAR_NAME=  TIME,          FID/REAL,        FID/IMAG
##SYMBOL=    X,             R,               I
##VAR_TYPE=  INDEPENDENT,   DEPENDENT,       DEPENDENT
##VAR_FORM=  AFFN,          ASDF,            ASDF
##VAR_DIM=   8192,          8192,            8192
##UNITS=     SECONDS,       ARBITRARY UNITS, ARBITRARY UNITS
##FACTOR=    0.0002768,     1,               1
##FIRST=     0,             0,               0
##LAST=      2.2672688,     0,               0
##MIN=       0,             -443712,         0
##MAX=       2.2672688,     338075,          0
$$ Real data points
##PAGE= N=1
##DATA TABLE= (X++(R..R)), XYDATA
0@%%%%%%%%%%%%%%%qJ6j6J6j8K6l2L2m0M8n5O5p4Q5r8J12j27J45j62J82k06K34
37A25k60K86l22L60l98M42m92N43n98O60p27Q01q82R70j069J179j303J442j595
56h38J772j977K215k498K839l259L793m497N471o910R257j3729K5213j12787k57860
71c53795J76930K90106K1240k53259j40085J59156K87337P4418j99483j87165
81a24600J08914K29003l2334l00968j59957J71826K29878l2840k22840j02476
91b36394J75228K67971N2165k13141j69251J06892J82205p0999k53849p7207K03808
102c2572K01712n7196k32045j10682J62189K49572K9514j97821j10521J36651
112C8801J32050j33385k49690k9993K30647K06657n0393k21520j08945J38878
$$ plain form
0 0 0 0 0 0 0 0 0 0 0 0 0 0 0 0 0 -8 8 -8 8 -10 16 -16 16 -24 24 -31 34 -40 45 -53 59 -68 77 -85 97 -109 125
37 125 -135 151 -171 189 -209 233 -259 284 -314 346 -381 420 -462 508 -561 618 -685 757 -838
56 -838 934 -1043 1172 -1326 1513 -1746 2047 -2450 3021 -3889 5368 -8361 16852 -95935 -353795
71 -353795 -176865 113241 134481 -118778 -258863 -99707 187630 262048 62565 -124600
81 -124600 -15686 213317 180983 -119985 -279942 -108116 121762 88922 -133918 -236394
91 -236394 -61166 206805 258970 45829 -123422 -16530 165675 94676 -159173 -236380 -32572
102 -32572 169140 111944 -120101 -230783 -68594 180978 210492 12671 -97850 38801
112 38801 170851 37466 -212224 -242217 -11570 195087 144694 -76826 -185771 -46893
122d6893J87783l0256j81839k5802J92431J14839j61717k46777l0101K05900J87164
133A64732l7217j82367o6936J36924J18840j06434j85457K6966K26668J23391
143B19110j36722k13499l4591J58042J31298o2488j53338l477J67151Q2949j52881
154A554j88693L9238K15241J16227j02721j58867q106J34939O9595j20759j54616
165a56968M3550J98684P5543j54368j67292M1985J80639Q3231r7699j21748L3220
176d1223J45415L3801j67567j63424O1156J96361O1723j33439j19826O2851J55540
187I1368M2995j20201j11094O4687J58107J2425j81188j43505P4292J67381K9395
198H4662j21300p8664Q7819J49811J8689j39108j05891P8832J46469j4747j73900
$$ plain form
122 -46893 140890 110634 -71205 -97007 95424 210263 48546 -198231 -228332 -22432 164732
133 164732 127515 -54852 -121788 15136 133976 27542 -157915 -130949 95719 219110
143 219110 82388 -131111 -165702 -7660 123638 61150 -92188 -95665 71486 154435 1554
154 1554 -187139 -147901 67340 183567 80846 -78021 -86127 48812 118407 -2352 -156968
165 -156968 -113418 85266 160809 6441 -160851 -118866 61773 145004 47305 -74443 -41223
176 -41223 104192 137993 -29574 -192998 -131842 64519 126242 -7197 -127023 -64172 91368
187 91368 134363 14162 -96932 -32245 125862 138287 -42901 -186406 -112114 55267 84662
198 84662 -36638 -115302 -27483 122328 141017 1909 -103982 -25150 121319 106572 -67328
209f7328j01889R2941J42287J878j20521o0868J00159J45740K213j45364q5765
220i6517R4006J22613m9466j69500o6266J11997J32818r995j20270n3101J04360
231F79J31849k5347j48118n2390J19265J05668p5937j65294m7971J12826J21601
242G6831j6450j12507l3396J15210J08680o3650j52786k0677J37885R3556q0509
253E2187j47659l5744J01526R7231l3010j06527l956J33917Q9262r3037j49298
264i5108n81J33882P6597p4160j20144j7806R6104P2000o1724j09956K1806J50557
276G1467P4947j04460j33131J3719J18988N5231p4304j02377M016J05310N4135
287H3541r1919j14282M1601J55275N6055j05960j06973L1109J08162L4476q4117
$$ plain form
209 -67328 -169217 -76276 66011 67889 -52632 -113500 -13341 132399 134612 -10752 -96517
220 -96517 -2511 120102 70636 -98864 -165130 -53133 79685 69690 -50580 -103681 679
231 679 132528 107181 -40937 -93327 25938 131606 55669 -109625 -157596 -44770 76831
242 76831 60381 -52126 -85522 29688 138368 74718 -78068 -98745 39140 132696 52187
253 52187 -95472 -131216 -29690 67541 34531 -71996 -75952 57965 147227 54190 -95108
264 -95108 -95689 38193 114790 40630 -79514 -97320 -1216 70784 9060 -100896 -79090 71467
276 71467 146414 41954 -91177 -77458 41530 96761 22457 -79920 -75904 29406 83541
287 83541 -8378 -122660 -81059 74216 130271 24311 -82662 -51553 56609 91085 6968
298F968r5220K3729J15157L6230j12669j04502O2010J44867L0973j03891q0073
309g6421M5100R9833K0214r1427q8005M0361J14625J2794j24055q3098Q0080J29060
321G9061J0865r8005o1961N0559R3399Q430r7894p4828O0346J08951j4842j30612
333f6531o1260R1117J16058j010r0504m9348N5457Q6162r732j07216n5721Q4444
345h084J01407l9866j32114m3454R5323J00691q854q4252l6210O7051P8984l2719
357E7903j16329l4622J02546Q9692n6677j23537k7448R0853Q4565j8157p9257
368c0468k0729Q0366P0520n5475j17677j2791J09800P2709o4756j09511j4445
379i2457Q4443O9248k8968p6889j844R3499N7786p4835j12557P090J09902N5527
$$ plain form
298 6968 -88252 -64523 50634 86864 -25805 -130307 -68297 76570 107543 3652 -76421
309 -76421 -31321 68512 88726 -2701 -90706 -50345 64280 77074 -46981 -130079 -49999 79061
321 79061 89926 -8079 -70040 -19481 73918 82348 -15546 -90374 -30028 78923 64081 -66531
333 -66531 -127791 -36674 79384 78374 -12130 -61478 -6021 80141 70409 -36807 -92528 -8084
345 -8084 93323 53457 -78657 -122111 -26788 73903 65049 -19203 -55413 11638 90622 57903
357 57903 -58426 -93048 9498 99190 42513 -81024 -108472 -17619 66946 48789 -30468
368 -30468 -51197 29169 99689 44214 -73463 -86254 23546 96255 31499 -78012 -92457
379 -92457 -8014 61234 32266 -44623 -46467 47032 104818 29983 -82574 -75484 34418 89945
391H9945o8882r6520m718Q2097N6024m3529p4745J9949J05339M2449r0518j02265
403h5374K2165J05033M0736p2069q6073P860Q4470M0740o3013p1389M2297J12760
415G8143K7278r7760q7953L2428R4184K5281p4618p5248K3251Q7797K3565q0084
427b3736o3359N9251J10352J2778r3819o9591L7892Q1578R170q0159o4804M1465
439d2982R0894P334r0065n1953O8170R7820j96q5623n1822M6139P4663o764r2136
452c6521n6791N8746R1620o910r0579l6994P1465Q0831j3765q1485l6257N9667
464C027P4057k3070j03706m8223P1381Q5666j9781q4394k0443P3186O5279k7295
476D5684q0716k3422P3676P3880l6774j07915l5762P5932O9380l1072p2285k441
$$ plain form
391 89945 21063 -75457 -80175 1922 57946 14417 -60328 -40379 64960 107409 16891 -85374
403 -85374 -63209 41824 82560 10491 -75582 -67722 16748 57488 -5525 -76914 -34617 78143
415 78143 105421 7661 -80292 -47864 46320 71601 -3017 -78265 -55014 32783 56348 -23736
427 -23736 -87095 -27844 82508 95286 1467 -68124 -30232 51346 60516 -19643 -84447 -42982
439 -42982 47912 55246 -34819 -86772 -18602 79218 79022 -6601 -58423 -12284 62379 55615 -36521
452 -36521 -93312 -34566 57054 50144 -40435 -77429 -5964 74867 61102 -20383 -56640 3027
464 3027 77084 54014 -49692 -97915 -26534 59132 39351 -45043 -65486 7700 72979 45684
476 45684 -35032 -58454 15222 89102 52328 -55587 -91349 -15417 53963 22891 -49394 -51835
488e1835P1899N1647l8697q1559j0901Q5514O9354m9173j04222k1246P4080M9564
500D4425l8508n8879J1081P3613M2489n1413q4479O56R6720O1921n8958r4674
512e6006o381O6871L0430m5116n0215K4346Q0601L6300o5513q7828J4107J01994
524D3590M8906o5040p8143P472N8343J2089n4137m4980L6865Q9870L1477p6621
536I691q4415K5563R6324K9974o5172n7241K1388N1117j483o3134m4037M5735
548c5690R6143K4520q1535p2256L6642Q2581R596o4163m0416L2013N0101q782
560B8754o9881m4636N3547R5592J2228q2917n4358M7248O8854p670o4284k9366
572d6889M0339N2139j4486p7346l9360O3972Q9154n473q2970l5291N5892N7078
$$ plain form
488 -51835 20064 71711 33014 -48545 -59446 26068 95422 46249 -57973 -79219 -5139 44425
500 44425 5917 -52962 -41881 31732 74221 22808 -61671 -61015 35705 97626 38668 -56006
512 -56006 -62387 4484 34914 -10202 -60417 -36071 44530 80830 15317 -72511 -58404 43590
524 43590 92496 27456 -50687 -43215 15128 27217 -26920 -71900 -35035 54835 86312 9691
536 9691 -74724 -49161 47163 77137 11965 -45276 -23888 27229 25746 -37388 -81425 -35690
548 -35690 60453 84973 3438 -68818 -32176 50405 60001 -4162 -44578 -12565 37536 28754
560 28754 -41127 -85763 -32216 63376 75604 -7313 -61671 -14423 54431 46761 -17523 -46889
572 -46889 -6550 45589 31103 -46243 -85603 -21631 67523 62050 -20920 -56211 -319 56759
584E6759j9791o2821k1228M8232N2594k3968q2252k9673P2383P7862k1377p7235
596c0515j8282N7980M5203k6880o0462j2327N6225N1260l4189q5110j7884P5273
608B92O1407l2492o6436k510N7710L6047l3984o1101m998O5532M9108m3721q1596
621e6742n790P1869M1307m1868n5381J2116O3075L3029m2497o5142J471P0565
633B6012M0062n1900p0268J0054O7629K1567n2159n0317K2627P1335L3874m6697
645B1819o3830Q290O7600K1678o0241n5772K6819O5658R896n8384m8723K6300
657c8890P3368L1348m7974n3274K1843N9968m1o9664m4854L7456O5154P056n6807
670a5311m5164K8739O8892J8102n1562l8778L7623N5994j5886p4743l9780L9497
$$ plain form
584 56759 36968 -25853 -47081 1151 53745 29777 -52475 -82148 -9765 68097 46720 -30515
596 -30515 -48797 9183 54386 27506 -32956 -45283 10942 62202 28013 -57097 -74981 292
608 292 61699 29207 -37229 -39739 17971 54018 20034 -41067 -46065 19467 68575 24854 -56742
621 -56742 -62532 9337 50644 8776 -46605 -34489 28586 61615 19118 -46024 -44553 26012
633 26012 66074 14174 -56094 -46040 21589 43156 -9003 -59320 -36693 34642 68516 21819
645 21819 -42011 -33721 33879 55557 -4684 -60456 -33637 32021 41917 -16467 -65190 -38890
657 -38890 34478 65826 17852 -35422 -13579 46389 46348 -23316 -68170 -30714 34440 41496 -15311
670 -15311 -60475 -31736 37156 55258 3696 -35082 2541 58535 42649 -32094 -71874 -32377
682c2377O2160O073n3082l5530L8456O3542q16o1541k7575M8795N2686k2396p1659
695c3264l3230L9841N5954k571n4585k2932N2620O0228j7432o6373j9783N0491
707H964M4272k5648o3449k1834M4718N0355j5643o0289j2701O1193N2734k6416
719C6256o1022r123M7568L2446l1007n8753j1298N4588M8475k5749o2114n692
731d5425N9943L8320l3239n0969L572N0508K7063l8287o0819n078O0864M4628
743E1081l3144n6313O094N6418K0300m3280m4675J4038N7843K8329m1481o1548
755d6338M4O0110L0187m1879m4948K2243N5331P789n0544m4072J8403O1582K9375
768E7283m1472n4337J0468N5016R440n2937l5480L3325N5484M904m9217m2509
$$ plain form
682 -32377 29783 35856 -17226 -52756 -14300 49242 48426 -13115 -40690 8105 60791 38395 -33264
695 -33264 -66494 -26653 29301 26730 -27855 -50787 1833 62061 44629 -21744 -41527 8964
707 8964 53236 27588 -35861 -57695 -12977 37378 21735 -38554 -51255 9938 62672 36256
719 36256 -24766 -33889 13679 46125 15118 -43635 -54933 -345 48130 22381 -39733 -45425
731 -45425 14518 52838 19599 -31370 -27798 22710 49773 11486 -49333 -54411 6453 51081
743 51081 17937 -38376 -32282 24136 44436 1156 -43519 -29481 28362 56691 15210 -46338
755 -46338 -46294 13816 44003 2124 -42824 -20581 34750 42539 -8005 -52077 -33674 27908 57283
768 57283 15811 -38526 -28058 26958 36398 -16539 -52019 -18694 36790 41694 -7523 -50032
780e0032J9081N9522K2027m4325m1979K5324N1184q029n9978k9964L6229N2468
792C1528M931m4806l5726K5171N6856P701n2635l2082L8155M7569j7779n9616
804c0733k4288L5692M7670Q89m4921k7043L7108N6622o316n9805k3793M2410L8757
817D2249k3577n3902j5519L9200M4174o565n0049k0356M7280N2971j6679n7062
829a7835j3302M1666K6321l0363m8920p468M5071M5273j2767n4232j4933M9661
841H172M2717k5298m8428L08M2390J8129l5999m9804m516N0583M5593j8344n1892
854b6389m562M9464K6508l5673m1879J1810M5769J7035l8582n1325k266N2306
866B216L8685k5669m4387R442N0287J2392m3782l8207J6581M8103J7059l8090
$$ plain form
780 -50032 -30951 28571 50598 6273 -35706 -10382 40802 32773 -27205 -57169 -20940 31528
792 31528 36459 -8347 -44073 -18902 37954 45655 -6980 -39062 -907 46662 28883 -30733
804 -30733 -55021 -19329 28341 29230 -15691 -42734 -5626 50996 44680 -15125 -38918 3492 42249
817 42249 18672 -35230 -50749 -11549 32625 26060 -23989 -44345 2935 55906 39227 -17835
829 -17835 -31137 10529 36850 6487 -42433 -49901 -4830 40443 27676 -26556 -41489 8172
841 8172 50889 25591 -22837 -22529 19861 37990 1991 -47813 -52329 -1746 43847 25503 -26389
854 -26389 -30951 18513 45021 9348 -32531 -20721 25048 42083 3501 -47824 -50090 2216
866 2216 40901 15232 -29155 -19713 30574 42966 -816 -39023 -22442 25661 42720 4630
878D630m8617L848N1402K5026l6173l6630K2773M9967N467m5105l5846J7811M6103
891B4656J4352l8932m2111J4520M9920J0816m4425l0381K8816M7311K467m1419
903d410l0288J9380M4004P033m4158l5326K5698M8803k17m7719k4498L1145M2640
916C2087n53l9884k4734K6026M3747l063n0883k7797L4076M4994r162m6423j7808
929c9377L2458L8578m919m0934j8724L4579M1533j3403n3445j8775L8589L7360
941C3520j5398m3342j2238L3822L6217r900m1872j1726M1003L6057k3606n1459
953b8922r381M0219L0543j8589m0368q801L5435L2820j6246m1689j970M6303K8218
966D7572l2323m8325k113M0048K6006j9956l8330l907L8315K6840k5562m0392
$$ plain form
878 4630 -43987 -40139 11263 36289 116 -36514 -13741 36226 41693 -3412 -39258 -21447 24656
891 24656 39008 76 -42035 -27515 22405 33221 -11204 -41585 -12769 34542 37009 -4410
903 -4410 -34698 -15318 28686 35719 -8439 -43765 -18067 30736 30519 -17200 -41698 -10553 32087
916 32087 31534 -8350 -33084 -7058 36689 33626 -17257 -45054 -10978 34016 24854 -21569 -39377
929 -39377 -6919 31659 26740 -14194 -32918 1661 43194 29791 -23654 -42429 -3840 33520
941 33520 18122 -25220 -37458 -3636 32581 22681 -19191 -30917 10086 46143 22537 -28922
953 -28922 -38303 1916 32459 13870 -26498 -35299 136 32956 16710 -24979 -26949 19354 47572
966 47572 15249 -33076 -35189 4859 30865 10909 -27421 -31328 6987 33827 8265 -32127
978c2127R289N0037J9865l6874m3805K499L8081K1472k2492l6051L854M1998J8743
991C4489l5483l7017J9011N0007J3353l7426l8253N617L5743J6903k7568l3307
1003c3931J2660M4730R670m1839l1336K5343M6274P935l5608l2329Q494L4720
1015A4783J0898l2831l0194K1744M4237O31m4385k3601K9012M1411L816l4220
1027A301k9030J3017L4629L863l8834k4650L0635M1567q372m4338j6334L0883
1039e663L7724P97l4407k4712J7876L4271o479m3664j6275L7920L7091j5195m1279
1052b1995j0996L0360L3952k201l4793j9447K5046L1608j7269m6112q080M1576
1064A649L1279j7289l6276p237K9248K9618p939l6426j1954L3361K7532k5704
$$ plain form
978 -32127 -22838 27199 47064 10190 -33615 -31116 6965 28437 5945 -30106 -26252 15746 34489
991 34489 -994 -38011 -19000 31007 44360 6934 -31319 -25702 10041 26944 -624 -33931
1003 -33931 -21271 23459 33129 -8710 -40046 -14703 31571 39506 3898 -28431 -19937 14783
1015 14783 25681 -7150 -37344 -15600 28637 29268 -15117 -38718 -9706 31705 35521 1301
1027 1301 -27729 -14712 19917 23780 -15054 -39704 -9069 32498 24126 -20212 -36546 -5663
1039 -5663 32061 32858 -1549 -26261 -8385 25886 19407 -24257 -40532 -2612 34479 19284 -21995
1052 -21995 -32991 -2631 31321 29120 -5673 -25120 -74 31534 14265 -31847 -39927 1649
1064 1649 32928 15639 -20637 -27874 1374 30992 23053 -13373 -25327 8034 35566 9862
1076I862m4964o50M0125K4364j7734l1341k556L0855K5798j6868l8754l390L9127
1089A3874K2062l1142l9085N025L7100J7659j9981k8460K703L5083K2101k5128
1101A1811l9712M401M1233J4653l2981l2025J1055L4049J2546k3626k9139P228
1113b0507L9224J7961l0754l5366J2685L8540N845l3757k5168J4656L3259R206
1125B5824k7468k8584J1600L9425J0936l4099k6766J9937L4892m47l4090k1838
1137c0678J6666L3204O292l1219k5953J8335L7762J476l6448j8711K5597L2443
1149B8766m623l3725k0066J8473L2054O96l4499k0017K6201L5394p214l6815j2152
1162b7527K7809K8810o934l2836j6513K1727K9998p916l7452j2815L1991L0590
$$ plain form
1076 9862 -35102 -35752 4373 28737 11003 -20338 -22894 7961 33759 16891 -21863 -25253 13874
1089 13874 35936 4794 -34291 -29266 7834 25493 5512 -22948 -20245 14838 36939 11811
1101 11811 -27901 -23500 17733 32386 -595 -32620 -21565 12484 25030 1404 -27735 -20507
1113 -20507 18717 36678 5924 -29442 -16757 21783 27628 -6129 -31297 -16641 16618 25824
1125 25824 -1644 -30228 -18628 20797 31733 -2366 -29132 -9195 25697 25250 -8840 -30678
1137 -30678 -14012 19192 25484 -5735 -31688 -13353 24409 25885 -10563 -29274 -3677 28766
1149 28766 24143 -9582 -29648 -11175 20879 21575 -12924 -32941 -6740 28654 21440 -15375 -27527
1162 -27527 282 29092 22158 -10678 -27191 -5464 24534 16618 -20834 -33649 -1658 28932
1174B8932j1794l3475p046K7526K5061j0549l3244j2001K6959K7198j5082l7928
1186b5443o209L3390K4995j4550k8959k364K8431K1824j5903l5437o685L2026
1198E116K3657k1096l5133J380L2225J8438j7381k6398K413L1086J9053k1770
1210A1590l6636m82L4689J7359k5012k9013P526L1102J2225k0031k5739O154L4334
1223A8066J6335k7639l4144O728L4192R516k6805k3066J1661K8942R179k3259
1235b94k5160J1165L6242J0928l1544k9470J3637L1129L301k6778j8429J3390
1247a1883K7733N935k6760k3010J6844L7019M514l4575k2984J7513K7531j591
1259A6286k5152j4702J5621K7212Q85l1412k0082K4121L6360j983l4259j6527
$$ plain form
1174 28932 17138 -16337 -23383 4143 29204 18655 -14589 -26590 369 27567 12485 -25443
1186 -25443 -31652 1738 26733 12183 -16776 -19140 9291 31115 15212 -20225 -26910 5116
1198 5116 28773 7677 -27456 -26076 6149 24587 7206 -19192 -16779 14307 33360 11590
1210 11590 -25046 -25528 9161 26520 1508 -27505 -19979 11123 23348 3317 -22422 -16268 18066
1223 18066 34401 6762 -27382 -20654 13538 23054 -3751 -26817 -15156 13786 22965 -294
1235 -294 -25454 -14289 21953 32881 1337 -28133 -14496 16633 19934 -6844 -25273 -11883
1247 -11883 15850 21785 -4975 -27985 -11141 25878 30392 -4183 -27167 -9654 17877 16286
1259 16286 -8866 -23568 -7947 19265 20150 -11262 -31344 -7223 29137 27154 -7105 -23632
1271b3632J9088K2559n468k4798j1685J9926K7697n260l5479j5824K9491L3204
1283B9819p214l1239j0083J9542J7728r020k6115q949K4563K7558j0427l7368
1295b1205r226L1554K6854j1564k6460m472J9538J4837j2328k7846o311K9019
1307B390K5676j5964l5575j964L1930J9536j4772k3028o08K0124J3631j6441k9313
1320b4378r12L2697K1349k2195l1433M078L0641J4427j6286k0841J432K2214J1488
1333B2281k0942k9489N284L5985J4719k5467k6884Q086K7847R628j7048j8910
1345a4910N152K4486Q263k5848k7722J1841L4766R171k6214k1122J0576K3859
1357A2298N748j8745j7784R510K8169M912k9631k4049J5951L1345K733k5353j5772
$$ plain form
1271 -23632 -4544 18015 12547 -12251 -23936 -4010 23687 18427 -17052 -32876 -3385 29819
1283 29819 22605 -8634 -18717 825 18553 9533 -16582 -25531 -968 26590 16163 -21205
1295 -21205 -30431 1123 27977 16413 -10047 -14519 5019 19856 7528 -20318 -26629 2390
1307 2390 28066 12102 -23473 -25437 6493 26029 11257 -11771 -12379 7745 21376 4935 -24378
1320 -24378 -25290 7407 28756 6561 -24872 -20794 9847 24274 7988 -12853 -11421 10793 22281
1333 22281 1339 -28150 -22866 13119 27838 2371 -24513 -16427 11420 21048 4000 -14910
1345 -14910 -9758 14728 22991 -2857 -30579 -18738 16028 25199 -1015 -22137 -11561 12298
1357 12298 18046 -699 -18483 -8973 19196 24108 -5523 -29572 -13621 17724 20457 -4896 -20668
1370b0668J3363K2577K127k2524j7606J4954K9279J394l0807j7545J9101K5560
1382A9205l986k5179j1840J6498K3743r04k5723j5669J9110K7049m698k8790r576
1395b0760K2002K0284r298k6753j0505J8961K5207k491k6161j1136K2038K1910
1407B3298j1401k7117l724K4268J8256j1561k8053j0413K0492K3963o038k4576
1419a2606l422K4952J6385j7035k6267n58K4554J7190j2339k7937p251K2660J9123
1432A7449j1370k2736M216K7303J1556j9948k5150N10K3884J5378j4795k5646
1444a9349j744K5549J4300j7082k0316R044K6636Q208k0835k3228K962K3993J1906
1457B0044j8481k4393N062K7175R262k0063j6603J1886K4014M377k1541k1131
$$ plain form
1370 -20668 -7305 15272 17399 -5125 -22731 -7777 21502 22896 -7911 -25456 -6355 19205
1382 19205 15219 -9960 -21800 -5302 18441 17537 -8186 -23855 -4745 22304 17606 -11184 -20760
1395 -20760 1242 21526 12228 -14525 -25030 -6069 19138 16647 -9514 -20650 1388 23298
1407 23298 11897 -15220 -18944 5324 23580 12019 -16034 -26447 -5955 18008 11970 -12606
1419 -12606 -16028 8924 25309 8274 -17993 -18551 6003 23193 10854 -17083 -24334 -1674 17449
1432 17449 6079 -16657 -12441 14862 26418 6470 -18680 -18170 5714 21092 6297 -19349
1444 -19349 -21093 4456 18756 1674 -18642 -9598 17038 25246 4411 -18817 -15855 8138 20044
1457 20044 1563 -22830 -17768 9407 18669 -1394 -17997 -6111 17903 22280 739 -20392
1469b0392N995K5776Q918k2130k1792J0301K5463L573k0618j1765J4136K2171
1481A9636J516k4132k0441R600K7571N656k3765j6926J4197K1568k398k0899q886
1494a7703J6603K2441j66k6045j9322J2958K5931N90k3488r961J7825J7800p392
1507A0071k2360p835J8096K3438j576k6476j5749J7035K2113o730k2603m315K0749
1520C858J5883r965k2929p876J8306K2872m266k5618q993K0728J7039j2446k2366
1533a5773j35K0893J3833r939k2743o144J9763K0322r378k5069j481K3937J2863
1546B0949j5945k1071J200K0129J2421j1457k2191k774K3522J6499j5011k3546
1558a7275M072K4181Q897j6930j8765L223J9181J0302j4355k1974K361K6147J2292
$$ plain form
1469 -20392 -14397 11379 20297 -1833 -23625 -13324 12139 15712 -4906 -16671 -2535 19636
1481 19636 21152 -2980 -23421 -13821 13750 19406 -4359 -21285 -7088 14480 12082 -8817 -17703
1494 -17703 -1100 21341 21175 -4870 -24192 -11234 14697 15287 -8201 -18162 -337 17463 10071
1507 10071 -12289 -20124 -2028 21410 19834 -6642 -22391 -5356 16757 10027 -12576 -16891 3858
1520 3858 19741 9776 -13153 -21029 -2723 20149 15883 -9735 -18728 2000 19039 6593 -15773
1533 -15773 -15908 4985 18818 8879 -13864 -20008 -245 20077 10699 -14370 -15851 8086 20949
1546 20949 5004 -16067 -14867 5262 17683 6226 -15965 -18739 4783 21282 6271 -17275
1558 -17275 -13203 10978 19875 2945 -15820 -12597 6584 16886 2531 -19443 -17082 9065 21357
1571B1357j8269k0189Q099K1997M317j7038j6258M961K0208Q333j8142k1473P048
1584a5049K6609P903j9907j5200J0743J9517J104j8724j4957P464K2228N652k0814
1597c431j8778J1470K4580J935k0164j0193J3036J7778j183j9928j4962J0723
1609i117K2618K193k2410j4162J5253K1161k970j9972p495J4753J7286k815k1186
1622f863j2810J3636K1577k885k3322q419J7492J7942o189j9336n153J5645J6639
1635A7954m859k2362r850J7521J8861p738k2474m367J8832J4387p913j8209l865
1648a4082J7276J5140p963k2639n441K0140J5482j1347k1033q03J8554J2024r466
1661E842j7784j001J8627J3787j1925k2631r0K1450J1481j4416j8472K003J7961
$$ plain form
1571 21357 3088 -17101 -9002 12995 17312 274 -15984 -11023 9185 17518 -624 -22097 -15049
1584 -15049 11560 19463 -444 -15644 -4901 14616 15720 -3004 -17961 -10497 11731 17383 -3431
1597 -3431 -22209 -10739 13841 15776 -4388 -14581 -1545 16233 15050 -4878 -19840 -9117
1609 -9117 13501 15694 -6716 -20878 -5625 15536 12566 -7406 -14901 -148 17138 14323 -6863
1622 -6863 -19673 -6037 15540 12655 -10667 -19086 -1594 16348 10159 -9177 -14330 1315 17954
1635 17954 13095 -9267 -19117 -1596 17265 9527 -12947 -17314 1518 15905 7992 -10217 -14082
1648 -14082 3194 18334 10371 -12268 -17709 2431 17913 6566 -14467 -15270 3284 15308 5842
1661 5842 -11942 -12943 5684 19471 7546 -15085 -15175 6275 17756 3340 -15132 -13129 4832
1674D832J0257j1263j7481J692K0843J0724j6211k0249M539K1346P551j5579j6368
1687a5367L562J7891Q132j3065j6218N773K1690O319j9005j7195P689K0404M712
1700A5322j5561j4977N048J7712N825j5521j3833J0144K1506J595k0969j4025
1712a7734R984J8532L099j5495j2880P001J7402J935j8473j0817J5016K0215k655
1725A5130k0608j1718J1081J7111J017j5444j1021J0674J6897k887k0379p291
1737a7438J7552J8134n327j9780q817J1564J5599p02j6435q311J3414J5680p614
1750G519k1005l101J8499J5438p037j8166o453J1946J5322l548j7290n205J6478
1763C397J2373j1579j9288K01J9068J2489q344j6832n202J3452J4008o509j7642
$$ plain form
1674 4832 15089 3826 -13655 -11963 8880 19604 3393 -16856 -12317 9029 16580 1001 -15367
1687 -15367 -11805 6086 14218 1153 -15065 -9292 12398 18717 -288 -17483 -9794 10610 15322
1700 15322 -239 -15216 -10168 7544 13369 -2152 -15985 -5841 15665 17260 -3709 -17734
1712 -17734 -7750 10782 13881 -1614 -14494 -7493 9909 11844 -6629 -17446 -2430 17785 15130
1725 15130 -5478 -17196 -6115 10996 12013 -3431 -14452 -3778 13119 10232 -10147 -17438
1737 -17438 114 18248 12921 -6859 -15676 -4112 11487 10785 -5650 -13961 -547 15133 7519
1750 7519 -13486 -16587 1912 17350 10313 -7853 -14306 -2360 12962 9414 -7876 -13081 3397
1763 3397 15770 4191 -15097 -14896 4172 16661 8317 -8515 -13717 -265 13743 7234 -10408
1776a0408o45J8179Q421j4839j7668L377J8430J1010q080j6907k917J4853J1217
1789A4023j0623j6083M159J8754N038j6926j5562M423J7962R552q601j5242n43
1802i669J6457P168j4433j4723Q093J8623K254j6261j3398M555J6555Q241j0072
1815C390j4328M607J7287L006j7482j2406J0552J6451O17j5261j1185O229J6348
1828G825N408j3380j3237Q865J7880n89j8302r225J1025J4147j405j4197r048
1841a4233Q523J6785K107j6685j0514J2021J5888l708j7208n981J1378J2377l095
1854G655j4798p526J1088J7123j242j8196p499J3308J3295o372j5523k824J2562
1867A051J1196n221j5761o529J3690J6002m928j7238l827J4474R401q408j3742
$$ plain form
1776 -10408 -11053 7126 15547 708 -16960 -13583 4847 15857 7777 -9130 -12047 2806 14023
1789 14023 3400 -12683 -8524 10230 15268 -1658 -17220 -12797 5165 14717 6116 -9126 -9669
1802 -9669 6788 13956 -477 -15200 -7107 11516 13770 -2491 -15889 -11334 5221 13462 3390
1815 3390 -10938 -6331 10956 13962 -3520 -15926 -5374 11077 11694 -3567 -14752 -8523 7825
1828 7825 13233 -147 -13384 -4519 13361 12772 -5530 -14755 -3730 10417 9012 -5185 -14233
1841 -14233 -5710 11075 13182 -3503 -14017 -1996 13892 10184 -7024 -13005 -1627 10750 7655
1854 7655 -7143 -14669 -3581 13542 12300 -5896 -13395 -87 13208 6836 -8687 -11511 1051
1867 1051 12247 7026 -8735 -15264 -1574 14428 9500 -7738 -11565 2909 12310 3902 -9840
1880i840p87J2938J1109o725j6911m036J5149J3614q194j6017j41J4490P025q747
1894B927j2964J54J4070R651q716j7033o19J6584R659j0705j3707K590J3681N617
1908A1189r652j2351K183J5160P854j2095j5785L008J6385O608j1921j1194M221
1921f390J2990M008j0682j1924M622J6655N306j4603j4223N510J5357L423j1445
1934a396q662N437J3051K403j3074j1013P672J6475K722j5369j1423P436J2855
1947G114M98j0959p144P598J3525N95j4980j0156R924J5643q01j5140p794Q989
1961c088J0950j412j1841o010R685J4017j943j6054p653J1687J3584l940j3851
1974e869m751R577J0103k946j2678n302J1711J3156m080j6451m248J2848J0551
$$ plain form
1880 -9840 -10627 2311 13420 6695 -10216 -14252 897 14511 6317 -9700 -9841 4649 11674 2927
1894 2927 -10037 -9883 4187 13838 5122 -11911 -12530 4054 13713 3008 -10699 -8109 5572 11189
1908 11189 1537 -10814 -8631 6529 14383 2288 -13497 -10489 5896 12504 583 -10611 -6390
1921 -6390 6600 10608 -74 -11998 -7376 9279 14585 -18 -14241 -8731 6626 10049 -1396
1934 -1396 -10058 -4621 8430 10833 -2241 -13254 -5582 10893 13615 -1754 -13177 -5741 7114
1947 7114 7612 -3347 -10491 -2893 10632 11227 -3753 -13909 -3985 11658 10857 -4283 -12077 -3088
1961 -3088 7862 6450 -5391 -11401 -1716 12301 10358 -5696 -13349 -1662 11922 7982 -5869
1974 -5869 -10620 -1043 9060 6114 -6564 -11866 -155 13001 8921 -7530 -11778 1070 11621
1987A1621n929j2676k569R269R754m246j3128l517J3151J1941p373j5303j269
2000a0274J3615P335o509j1737j168J0382Q649n859j4536r34J5178R146r898j3436
2014a0046J914J2372O199p621j0917M60J1201P867r270j4062K122J5856N846j0886
2028A035j0807L723J1606M097q197j0498J643J2986O098j1626j2872N133J5098
2041G419K980j1401q371M944J1184L114r520j0845L894J4446K599j2928j0347
2054a2832P714J3189Q38j1305o604N536J1174K005j0876r491N906J3841L6j4383
2068e252p073R638J1913j607j0658n871O373J0782P56j2344p995R285J2710l705
2082F952j4333m128J0360R934j908j0259m966P130J0794k231j3809m663J1505
$$ plain form
1987 11621 5692 -6984 -9553 -284 9470 5224 -7904 -11421 1730 13671 6298 -9005 -10274
2000 -10274 3341 10676 4167 -7570 -8738 1644 10293 4434 -10102 -11036 4142 13288 3390 -10046
2014 -10046 -8132 4240 10439 2818 -8099 -7639 3562 11429 2159 -11903 -9781 6075 11921 1035
2028 1035 -9772 -6049 5557 9654 1457 -9041 -7398 5588 11686 60 -12812 -7679 7419
2041 7419 10399 -1002 -9373 -4429 6755 9869 349 -10496 -6602 7844 10443 -2485 -12832
2054 -12832 -5118 8071 8909 -2396 -9000 -3464 7710 9715 -1161 -10652 -4746 9095 9131 -5252
2068 -5252 -12325 -2687 9226 7619 -3039 -8910 -2537 8245 9001 -3343 -11338 -2053 10657 6952
2082 6952 -7381 -11509 -1149 8785 6877 -3382 -8348 -1218 9576 7345 -6464 -11127 378
2095C78J1167o238j3189k141J0395Q227k546j0406m096R115R789n269j3868j813
2109a0495J2939Q535p052j1819m93R544P725m289j1012j822J1364Q417q114j3255
2123i827R30J2895N989p817r936O85J0024O369o045j1523M62J2434O081r558j1458
2138a0295L795J2028L883q526r283J783J0566N824q101j1222L100J2424L185j0616
2152a455q571N459J1442K250q803r060K393J1471M016r700r066N581J1778K49
2166G984j1134o422O153J0904J752r700q696M116J1251J484j1103o449Q140J0704
2180H984k086j1192n283P013J0502Q67j0564p828O578J0379j530j1645l847R731
2194G9R175k807j0964m399P430R954j255j1089n670Q800R096m312j1060j497R779
$$ plain form
2095 378 11545 5307 -7882 -10023 372 8599 6053 -4353 -8449 666 10455 5186 -8682 -10495
2109 -10495 2444 10979 3927 -7892 -8385 1159 8884 4595 -6417 -8239 3125 11542 3428 -9827
2123 -9827 -8897 3998 9987 2170 -7766 -7081 2943 9312 3267 -8256 -7794 4640 10721 1163 -10295
2138 -10295 -6500 5528 9411 885 -8398 -6615 3951 9775 1674 -9548 -6448 5976 9161 -1455
2152 -1455 -10026 -4567 6875 9125 322 -8738 -6345 5126 9142 -558 -9624 -4043 7735 7984
2166 7984 -3150 -9572 -3419 7485 9237 -463 -9159 -5043 6208 7692 -3411 -9860 -1720 8984
2180 8984 6898 -4294 -9577 -2564 7938 8805 -1759 -9587 -3009 7370 5840 -5805 -9652 79
2194 79 9254 6447 -4517 -8916 -1486 8468 7213 -3876 -9546 -746 8350 4038 -7022 -8519 1260
2209A260P286l374j0059l606Q477R283l103j1940l158R944P363o194r777N52R815
2224B769O221m754j0186k462R649R008n843j1663n15J0467M734o922p794J465
2238e826R416N839o055j0878o64J1429O819p771j0302K173J0191K556p303p305
2252g681K330R851N328p143j0815J294J1603L888r107p701M669Q964Q09p740o699
2267h150K997R970N033r415r327M083J0870J265r538n561N553Q098O97q212o626
2282h263M018J0406K730j0536p584O340J0301j121r520l862N585P518n5q339o120
2297h502N485J0643k27j1239n155Q200Q298k588q738l019N800P278m97r235n598
2312i094P648J0349k821j1439k992R277O252l390p656k445O271P236k281j0415
$$ plain form
2209 1260 8546 5172 -4887 -8493 -16 9267 6164 -5776 -8934 1010 8373 2179 -7598 -7046 2769
2224 2769 8990 4236 -5950 -8412 1237 10245 4402 -7261 -7776 2691 7425 503 -7291 -5826
2238 -5826 3590 9429 3374 -7504 -8168 3261 10080 2309 -7993 -5820 4371 6927 -376 -7681
2252 -7681 -5351 4500 9828 2685 -8130 -6836 4767 8655 -452 -8153 -3484 5480 6289 -1451 -8150
2267 -8150 -5153 4817 9850 435 -8892 -4809 6061 7326 -2212 -7773 -2220 5878 6575 -1637 -8263
2282 -8263 -4245 6161 8891 -1645 -9229 -2889 7412 6291 -3229 -7091 -1506 6012 5957 -2382 -8502
2297 -8502 -3017 7626 7399 -3840 -8995 -795 7503 4915 -3823 -6842 -1042 6236 5739 -3496 -9094
2312 -9094 -1446 8903 6082 -5357 -8349 928 7180 3790 -3866 -6311 -40 7196 4915 -5500
2326e500l233R380Q504m844j0656m44Q196N718l684p864j805O976P173m109j0872
2341g064j112J0555O951o765r238N78Q218M390m191p690q87Q866N989o748r897
2356h045J023J1035M349p220p590J614P640L709n164p864J139R495M398p930r357
2371h768L368R930K602p310o203K250P870K900o393p863L171J0249K656r276p460
2386h277M471Q557J403p197n600L476Q029J815p942p227N161J0557P9r503n265
2401g463N015P651N7p330m968M400Q405J028r045n745O345R022j665q664m296
2416g253O139O735j021p718m324N896Q426j060j0022l122P656P302l019q646k608
2431f639N543O887j606q522k974P478P693l685r579j312Q406N597l621q097j969
$$ plain form
2326 -5500 -8733 647 9151 4307 -6349 -6793 1403 7121 3437 -4427 -6232 744 7917 3808 -7064
2341 -7064 -8176 2379 9330 2565 -6673 -6095 2123 6513 2322 -5368 -6255 2611 8600 1852 -8045
2356 -8045 -7022 4013 8362 1142 -6448 -4834 2806 6515 1351 -6513 -5374 4121 8519 589 -8768
2371 -8768 -5400 4530 7132 -178 -6381 -4131 3739 6639 246 -7617 -4446 5803 8459 -817 -8277
2386 -8277 -3806 4751 6154 -1043 -6643 -3167 4862 6677 -1265 -8492 -3331 7226 7305 -2198 -7463
2401 -7463 -2448 5203 5260 -2070 -7038 -2638 5767 6795 -2250 -7995 -1650 7372 5707 -2957 -7253
2416 -7253 -1114 5621 4600 -3118 -7442 -1546 6880 5820 -4202 -7324 332 7634 4615 -4031 -6639
2431 -6639 -1096 5791 4185 -4337 -7311 167 7860 4175 -5404 -6716 1690 7287 3666 -4431 -6400
2446f400O095O823k975q940j597R209N997n247q895M4P904M457l570p765j128
2461e988P201N377m812q238M90R501M831o818p388R75P045L795m165p375j55Q381
2477B657M699o612q242K587R530K526o378o369J794O521L184n478p135J550R395
2492D229L126p967o524M067P996R27o434n278K464P110K781o830p441L686R756
2507E668J076q443m775M440P367k71o810m750L252P899J572p990n667N195Q759
2522F522r67q522l169N355O243q13o982m582M108Q470m1q502l847O412P106l038
2538C753p801j930N758N892j246p319l945N443P664j764q819j951Q050N281m115
2553B951p495j148N604N476j347p717l269P095P048m057q398j67Q118L872m608
$$ plain form
2446 -6400 -305 6518 3543 -5397 -6994 2215 8212 2965 -5930 -5886 2018 6475 2905 -4860 -5988
2461 -5988 1213 6590 1778 -6460 -5970 3531 8362 1544 -5844 -4869 2176 5971 1806 -5569 -5724 2657
2477 2657 7356 744 -7498 -4911 4619 7145 767 -5602 -3808 2713 5897 419 -6716 -5166 4229
2492 4229 7355 -612 -7136 -3069 4927 5854 -580 -5858 -3394 3716 6497 -333 -7774 -4088 5668
2507 5668 6744 -1699 -6474 -2034 5333 5062 -1748 -6498 -3246 4653 6225 -1765 -7432 -2237 6522
2522 6522 5555 -2967 -6136 -781 5462 4649 -2333 -6915 -2807 5663 5622 -2880 -6727 -315 6791 3753
2538 3753 -4048 -5978 -220 5672 4426 -2893 -6838 -1395 6269 4505 -4314 -6265 1785 7066 2951
2553 2951 -4544 -5692 -88 5388 4041 -3676 -6945 150 7198 3141 -5257 -5424 2694 6566 1958
2568A958o355j009N794N439k672q402r22Q490M797n304p283J002P340K938m598
2583A213o295j21O997M679m458p854Q13Q283L808o978n521K293O468K137m909
2598E55o378J177P532L840o012p160K722Q152J117o269n145L406O397J602n804
2613b68o168J901Q470K676p325n715M440P191n47o448m222L944O410J438o765
2628i88n790L445Q329K81p268m105N206O101j222o431l495M041O807N49p489m858
2644f887N139P294j520p475k226N481N670j824o466l156M785O955j133q016k889
2659f268O481N812l052o938j075N445M890k044o775k293N802O266k765p818j186
2674e518O583M646l882o041j92N578M156k810p133q77P066N066m556p124M68O890
$$ plain form
2568 1958 -4397 -5406 388 5827 3155 -5247 -6169 2321 7118 1814 -5469 -4467 2873 5811 1213
2583 1213 -5082 -5203 1794 6473 2015 -5839 -5026 3257 7065 87 -5434 -3141 3327 5464 555
2598 555 -5823 -4646 2886 6726 714 -6446 -3724 4428 5545 -724 -5869 -2463 3934 5536 -268
2613 -268 -6436 -4535 3935 6611 -714 -6429 -1989 5202 4655 -1793 -6015 -2071 4339 5777 -988
2628 -988 -6778 -3333 4996 5277 -1991 -6096 -890 5211 3989 -2442 -5937 -1896 4911 5460 -2029 -6887
2644 -6887 -1748 5546 4026 -3449 -5675 -194 5476 3652 -2814 -5970 -1185 5770 4637 -3379 -6268
2659 -6268 213 6025 2973 -3965 -5040 405 5295 3251 -3524 -5817 -15 6251 3486 -4332 -5518
2674 -5518 1065 5711 1829 -4212 -4404 1174 5330 2520 -4613 -5490 1576 6642 2086 -5038 -4570 2320
2690B320K971m380n804M87O484L887m151p110N12P590L582n540n854J794N833
2705B621K443m901n174J077O439L643n530o435J892P739J722o094m696K216O248
2720C210J650m785n274J780P215J666n825n555L553O723J58o123l643K697O161
2735C608J193n397n150L107P188M24o895m181M885N994p90n731l273L206O040
2750D228L15o289l914M474O960j581p476k255N162M760j568n062k494L875N678
2765D813o73p400k628N904N976k941o952o89M589M481j914n506j989M776N457
2780E304k018p289j421O725M284m291n597J32N112L684k074n844j274N527N160
2795F120l943o796L50O292L299m354n029K99N123L445k533n903p43O811L605n235
$$ plain form
2690 2320 5291 911 -4893 -4406 2078 5965 1814 -5296 -4784 2806 6388 848 -5006 -3212 2621
2705 2621 5064 163 -5011 -3934 2505 6148 618 -5817 -3925 3814 5536 -558 -5254 -3038 3210
2720 3210 4860 75 -5199 -3419 3796 5462 -363 -5918 -2365 4358 4516 -1607 -5250 -2553 3608
2735 3608 4801 -596 -5746 -2639 4549 4973 -1922 -6103 -1218 4776 3986 -1745 -5018 -1812 4228
2750 4228 4543 -1746 -5660 -1186 5774 4193 -3283 -5538 -376 4384 2816 -2246 -4740 -865 4813
2765 4813 4140 -3260 -5888 16 5992 3051 -3901 -4590 -1 4480 2566 -2940 -4929 -153 5304
2780 5304 3286 -4003 -5424 1301 5585 1294 -4303 -4171 941 4625 2551 -3293 -4567 960 6120
2795 6120 2177 -4619 -4269 2023 5322 968 -4061 -3762 1361 4806 2273 -3630 -4373 2438 6043 808
2811H08o154J601O613J788m361m823R94N259L243l598n939J103O925J891n916
2826e66n141K809N833J555m035m652J259N567K443m975n379K853O799L54o241
2841a517m188L494N238Q29l954m089K044O085J111o554m216M399O654j353n867
2856a884k834L046M293J039m799l462L455N849m89o736l158N036N327j401n715
2871b433k021L650M422N6n582k784M212N929k066o810j247M785M286k117m859
2886b579j604M179M370j292n640j952N220M596l088o277j84N219L736k726m911
2901b933j383M713M384j976o639j21N732L135l859n433M02N182L380l033n099
2916c548j72M945L634l680n718J070O258J776m201m653J082M758K913k923m985
$$ plain form
2811 808 -5346 -3745 2868 4656 295 -4528 -3534 1725 4968 1370 -4569 -3466 3459 5350 -566
2826 -566 -5707 -2898 2935 4490 455 -4197 -2938 2629 5072 97 -5282 -2429 4370 4724 -1517
2841 -1517 -5705 -2211 3027 3856 -98 -4187 -2143 3942 5053 -1501 -5717 -1318 5336 3983 -1884
2856 -1884 -4718 -1672 2621 3660 -1139 -4601 -1146 4703 4214 -2522 -5680 -644 4683 3282 -2433
2871 -2433 -4454 -804 3618 3674 -1908 -4692 -480 5449 3383 -3427 -4674 111 4397 2280 -2579
2886 -2579 -4183 -4 4366 3074 -2566 -4518 702 5298 2210 -4067 -4251 968 4704 1978 -2933
2901 -2933 -4316 397 4781 2805 -3834 -3955 1777 4912 1053 -4380 -3978 1204 4584 1551 -3548
2916 -3548 -3720 1225 4859 1179 -4539 -3469 2789 4565 364 -4289 -3207 1551 4464 1541 -3444
2931c444J92N645K533n039m515J835N701J309m552m106J503N123K719m575m722
2946d393K027N993P30n541l666K815N198N47m094l744J713N558J172n044m110
2961d839L182N689l44n316k799L188M386R5m655l075K815N992j44o018l305M383
2977g65M815j554m447k235L386M159J04n122l204L978N623j028o229k087M477
2992a29M024k114m443j002L758M076q17n735k395M901M647k228n880l40M688K649
3008C660k264m183j194M306M296k103n841j230N494L914l383n153O93M197K729
3023C938k955l880p59M812L477k713n709j40O102K350m459l584O89M421K251l114
3039G27m347M06N217L360m901n187J936N507J054m074l077J079M131J845l147
$$ plain form
2931 -3444 -3252 2393 4926 -113 -4628 -2793 2908 4217 -335 -4441 -2938 2185 4904 329 -4393
2946 -4393 -2366 3627 4357 -1184 -4850 -2035 3163 3710 -384 -4128 -2415 3143 4315 -729 -4839
2961 -4839 -1657 4032 3688 -1628 -4427 -1239 3147 3242 -1413 -4488 -1673 4319 4175 -1843 -5148 -765
2977 -765 4050 2496 -1951 -4186 -800 3359 3463 -1659 -4863 -885 4738 3710 -2519 -4606 -129
2992 -129 3895 1781 -2662 -3664 94 4170 3353 -2382 -4777 124 4771 2543 -3337 -3677 1011 3660
3008 3660 1396 -2787 -3981 325 4621 2518 -3323 -4553 941 4855 1472 -3681 -2988 1209 3938
3023 3938 983 -2897 -3656 1156 4633 1920 -3789 -3929 2173 4523 64 -3520 -2831 1590 3841 727
3039 727 -3620 -3214 2003 5363 462 -4725 -2789 2718 3772 -302 -3379 -2300 1831 3676 529
3054E29m708J174N900J863n384l873K500M603M82l749k609J597M305J346m438
3069d62m625K895N728P97n655k907L005M100k0m177k197J804M961N79n046l838
3085e058L603N752p74n578j953L469L882p91l872k489K815N011o07n805k200M336
3101b59M489j640n025q14L043L480q37m037k513L927M751j781n767j210M776L371
3117C954k098m506m26L346K876j095m920j068M263M320k849n326J56M703K288
3132C618k735l881p9L701L473k495m886r17N637L268l881m456P77M505J661k519
3148G91l787j7M418K757l611m586R72N707J193l712l526J459L833J579l101l890
3164c521N93N205J949m364m186K502M477N79l957k722J795L858J718l904l780
$$ plain form
3054 529 -4179 -3005 2895 4758 -626 -4499 -1999 2604 3086 -663 -3272 -1675 2630 3976 -462
3069 -462 -5087 -2192 3536 4333 -1322 -4229 -1224 2876 2856 -1321 -3518 -1714 3247 3826 -1220 -5058
3085 -5058 -1455 4297 3523 -2055 -4008 -539 3343 2552 -1320 -3809 -994 4017 3410 -2395 -4595 -259
3101 -259 4230 2590 -2435 -3249 -206 3274 2437 -1600 -4113 -186 4565 2784 -2983 -4193 583 3954
3117 3954 1856 -2650 -3076 270 3146 2051 -2869 -3937 326 4646 1797 -3529 -3373 1330 3618
3132 3618 883 -2998 -3077 624 4097 1602 -3284 -4201 1436 4704 823 -3633 -2856 1649 3310 791
3148 791 -2996 -3013 1405 4162 551 -4035 -3063 2644 3837 125 -3401 -1942 1891 3470 369 -3521
3164 -3521 -2928 2277 4226 -138 -4324 -1822 2655 3234 -723 -3445 -1650 2208 3926 22 -3758
3179c758J407N343J092m938l166K885M141R0m088k397K109M136P16m438l406K655
3195a617N037m63m452k391L138L833l66l975k512K509M487j19m867k685M039M173
3211C769j488m831r09L468L314j168l908j866L019M270p45n311j611M231L637
3226C871k386m036m15L303L146j500m483j490M334L994k338n130j81M315K489
3241C493k432l625l28L589K890j765m696q18M934L008l300m363R08M118J743k528
3257H28l577j00L765L080k889m692M34N063J997m231l058J550L870J072k460l582
3273b930K48M379K527l650m318J497M767Q24m156k637K061L264J635l225l639
3288c353R25M799J342m052l496K655M479q92l677k017K129L433Q53l616l069K009
$$ plain form
3179 -3758 -2351 2992 4084 -854 -4020 -1135 3006 3096 -992 -3389 -1280 2856 3572 -866 -4272 -1617
3195 -1617 3420 2957 -1495 -3886 -748 3085 2719 -1256 -3768 -1259 3228 3109 -1758 -4443 -404 3769
3211 3769 2281 -2550 -3459 9 3323 2155 -1753 -3619 -600 3670 2925 -2386 -3997 234 3871
3226 3871 1485 -2551 -2966 337 3483 1983 -2500 -3990 344 4338 2000 -3130 -3311 1004 3493
3241 3493 1061 -2564 -2892 697 3587 1822 -2874 -3692 1242 4250 950 -3413 -2505 1613 3356 828
3257 828 -2749 -2849 916 3996 1107 -3585 -3151 1912 3909 -322 -3380 -1830 2040 3112 652 -2930
3273 -2930 -2682 1697 4224 574 -3744 -2247 2520 3344 -812 -3449 -1388 1876 3511 286 -3353
3288 -3353 -2428 2371 3713 -339 -3835 -1180 3299 2407 -1270 -3287 -1158 2275 3128 -488 -3557 -1548
3304a548M381Mm372k040L405L509j092l531k055K592L293N89l807l186L102M022
3320C266r61m520j232L846L014j422l752j704K506L968J28m891j783L569L836
3335C868k370m400k30L715K568j195l460j974L142L802j330m356j052M503K281
3350C512k747l670M08L061K496j291l972j336L861L623k708m081K66M283J825
3365C530l167l282L27L617K605k264m015m08M348K496l325l661J324L923Q99k827
3381A20k919M85L510K170k811l777O08M735J458l791k933J829L592M91k957k723
3397b913P73M322J342l381l835J868M475K35l542k555K221K873Q50l276k653J444
3413a752M151J026m071k856K581M020q39l402j823K245L200J30l759k019J926
$$ plain form
3304 -1548 2833 2837 -1535 -3575 -170 3339 2247 -1284 -3339 -747 2546 3135 -672 -3858 -756 3266
3320 3266 2305 -2215 -3447 399 3413 1991 -1761 -3465 -959 3009 3137 -1754 -3537 32 3868
3335 3868 1498 -2902 -3132 583 3151 1956 -1504 -3478 -336 3466 2136 -2220 -3272 1231 3512
3350 3512 765 -2905 -2497 564 3060 1769 -2203 -3539 322 3945 1237 -2844 -2578 1705 3530
3365 3530 363 -2919 -2592 1025 3630 1366 -2649 -3057 1291 3787 462 -3199 -1875 2048 2947 120
3381 120 -2799 -2314 1196 3366 555 -3222 -2614 2121 3579 -212 -3145 -1316 2276 2767 -190 -2913
3397 -2913 -2140 2182 3524 143 -3692 -1824 2651 2886 -656 -3211 -990 1883 2733 -543 -3196 -1752
3413 -1752 2399 3425 -646 -3502 -921 3099 2260 -1142 -2965 -720 2480 2610 -1149 -3168 -1242
3428a242M364k50m243j935L029L145r25l434j313K178L136p1l890k096L123L826
3444C402j411m100r90L316K745j216l240j605K776L470q68m369j149M014K723
3459C498j979l980m3L069K121j157l169j489L369L178k111m266L47M052K096k594
3475I42l451J38L003K050j327l531o97M067K562l162l860J169L924J524k555l218
3491b422K80K748K438k300l296M17M205J707l905l025J366L549Q40k348k422J2
3507b156L521J441k657l458J597M562K80l478k741K058K733R56k643k867J077
3522a775L614J167l661k650K175M145k28l824k076K369K588M00k633k638J630
3537a397M160K31m127k106K828L380j150l327j363K062K872L07l250k201J983
$$ plain form
3428 -1242 3122 2872 -1371 -3306 -277 2868 1943 -1491 -2804 -626 2510 2439 -1451 -3547 -424 3402
3444 3402 1991 -2109 -3099 217 2962 1746 -1494 -3099 -323 3147 2279 -2090 -3239 775 3498
3459 3498 1519 -2461 -2504 565 2686 1529 -1640 -3129 240 3418 1307 -2959 -2612 1440 3536 942
3475 942 -2509 -2371 632 2682 1355 -2176 -2873 1194 3756 594 -3266 -2097 1827 3351 796 -2422
3491 -2422 -2142 606 3044 744 -2552 -2135 2070 3777 -128 -3153 -1787 1762 2602 254 -2168 -2156
3507 -2156 1365 2806 149 -3309 -1712 2850 3130 -348 -3089 -1031 1702 2658 15 -2852 -1775
3522 -1775 1839 3006 -655 -3305 -1130 3015 2787 -1037 -3113 -744 1844 2244 -389 -3027 -1397
3537 -1397 2763 2994 -1133 -3239 -411 2969 1819 -1508 -2871 -809 2063 2370 -880 -3081 -1098
3552a098M230q49m198j075L253K853j388l321j169J780K969L04l639j812L323
3567A63L582k153m047j14L608J673j254l125j016K469K727r15l810o78M189K308
3583C607k825l514L44L132J517r38l215o75K978K505j728m140O54M031J425k614
3599E44l279Q92K401J963j907k887k49L936J825k794l521J197L837J015k956k122
3615b105O04K611J561k386l141O03M517Q98l580k749K093L088J84k685j875R78
3631a384L206R36l089k888J830M067M22l625k229K058K772N5k788k050J589L085
3647A967O30l370k448K562L277m75l247j511K012K668j4l136j664J777L373J1
3663B412m080j560L263K781j010l317q28K076K525m52l248j513K602L334j287
$$ plain form
3552 -1098 3132 2283 -1915 -2990 263 3116 1728 -1593 -2762 -982 1987 2291 -1348 -3160 163
3567 163 3745 1592 -2455 -2569 1039 2712 1458 -1667 -2683 -214 2513 1598 -2212 -2890 1299 3607
3583 3607 782 -2732 -2388 744 2261 1323 -1892 -2567 411 2916 1188 -2952 -2298 1733 3158 544
3599 544 -2735 -1843 558 2521 614 -2273 -2522 1414 3239 445 -3076 -1879 1958 2973 17 -2105
3615 -2105 -1501 1110 2671 285 -2856 -2253 2264 3162 -418 -3167 -1074 2014 2198 -487 -2362 -1384
3631 -1384 1822 2758 -331 -3219 -1389 2678 3100 -525 -2754 -696 2076 2131 -657 -2707 -1118 1967
3647 1967 2597 -773 -3221 -659 2618 2143 -1104 -2615 -603 2065 2051 -1085 -2749 -972 2401 2412
3663 2412 -1668 -3228 35 2816 1806 -1511 -2339 -263 2262 1810 -1438 -2951 -349 2985 1698
3678A698l649p58L229K237j524k843m77K040K670j105l475r25L655K298j978l318
3694b225J12K969J411j340k712q33K809K619k011l179j34L835J810k527k794K31
3710a959K946J483j849k507l19L271J948k346l478O48L683J287k670k182N86K699
3726A241J228k292k675O05L589J297l016k740J181L445M65k840j583R92K447J235
3742B579k701k735J165L804N05l361j652J509K703k89k125j679Q58L103R43l360
3758g33k523K356L355k97l566q83J960K143j17k493j465J442L412k69l314k219
3774c211K888L127j457k801l22J606K420o80k736j378K117L418r66l894r62L101
3790B70K319j512k849r5K075J709l93l099q63K371L193j391l904j42L082J684
$$ plain form
3678 1698 -1951 -2709 520 2757 1233 -1610 -2087 -47 2623 1518 -1957 -2882 773 3071 1093 -2225
3694 -2225 -2113 856 2267 927 -1785 -2618 191 2810 799 -2380 -2514 1321 3131 604 -2190 -1959
3710 -1959 987 2470 621 -1886 -2205 1066 3014 668 -2810 -2162 1521 2808 138 -2044 -1458 1241
3726 1241 2469 177 -2498 -1893 1696 2993 -23 -2763 -1582 1863 2328 -512 -2095 -1103 1344 2579
3742 2579 -122 -2857 -1692 2112 2617 -744 -2396 -887 1816 1527 -598 -2277 -1419 1684 2627 -733
3758 -733 -3256 -900 2455 2158 -1408 -2291 -331 1812 1695 -798 -2263 -821 2591 2322 -992 -3211
3774 -3211 -323 2804 1347 -1454 -1776 -170 2250 1570 -1166 -2544 -427 2991 2025 -1869 -2831 270
3790 270 2589 1077 -1772 -1867 208 1917 1524 -1575 -2438 -67 3126 1735 -2169 -2311 771 2455
3806B455j851k370p1K335K173j443l396o48L642K170j961l159N13K723R15j687
3822C40k034J3K579J513j776l000J31L442J532k578k384R46K468Q39j658k316
3838a943J54K989J644k375l047J006L550J95k637j668J356K210O14k024k260O04
3854a632L452R93l173k306J493L067J8k703j508J112K605P96k450k513J298L690
3870B239K17l218k076K210K620k22k764j250J614K146O26k774k125K264K611k80
3886A838l249r75K299K148m30k713r77J686K582l71l192j211K621K358r85k965
3902a536n79K306K058r58k679p29J861K631p30l456l08K718K019j793k696n2K459
3919E36J697j072k671p46K516K403j869k892L24K678J352j469k534OK015K106
$$ plain form
3806 2455 604 -1766 -1837 498 2671 1228 -2168 -2816 826 2996 1035 -2124 -1611 1112 2027 340
3822 340 -1694 -1681 898 2411 635 -2365 -2234 1208 2740 162 -2222 -1276 1192 2031 373 -1943
3838 -1943 -1789 1200 2844 469 -2578 -1572 1978 2173 -464 -2132 -776 1434 2048 24 -2236 -1632
3854 -1632 1820 2813 -360 -2666 -1173 1894 1912 -791 -2299 -1187 1418 2214 -236 -2749 -1451 2239
3870 2239 2456 -762 -2838 -628 1992 1770 -994 -2244 -630 1516 2142 -632 -2757 -493 2118 1838
3886 1838 -1411 -2386 -87 2061 1631 -1082 -2059 -373 2209 1838 -1354 -2565 56 2414 1429 -1536
3902 -1536 -2115 191 2249 1291 -1388 -2117 -256 2375 1645 -1811 -2119 599 2618 825 -1871 -1923 536
3919 536 2233 1161 -1510 -2256 260 2663 794 -2098 -1774 904 2256 787 -1747 -1741 274 2380
3935B380j185l051k54L032J441k065k732Q34K706Q44j525k624N89K449J813k205
3951D47k692M77L050R99k683j639Q28K544P79k284k268O86L076R09k599j981J485
3968h66K687M9k383j471J001K461N03k237k018R29L038N24k756j889J943K119
3984A634j96k082j405J341K416L97k449k295J725L032o69k657r91K135J950n86
4000A300k346j255J725K449%l157j106K190K559j474k373m54K204J738j030j927
4016i57j107J682K444n69k884o70K578J424j005k896N00J975J551j079k405o25
4032b043K060K221q70l518K22K879J259j609k295L47J707J317p51k706q5K466
4048F01J617j697k755Q23K891L12j630j836K52J790J591j341k723K75K926J085
$$ plain form
3935 2380 1195 -1856 -2110 922 2363 298 -2434 -1600 1106 1950 425 -2199 -1610 839 2652 447
3951 447 -2245 -1768 1282 2281 -402 -2041 -1213 1331 2110 -174 -2442 -1756 1320 2229 -370 -2351 -866
3968 -866 1821 1870 -513 -1984 -983 1478 1981 -256 -2274 -1345 1693 2217 -539 -2428 -485 1634
3984 1634 1438 -644 -2049 -708 1708 2105 -344 -2639 -914 2118 1449 -1208 -2199 -64 1886 1300
4000 1300 -1046 -2301 -576 1873 1873 -1284 -2390 -200 2359 885 -1488 -1942 262 2000 970 -957
4016 -957 -2064 -382 2062 1493 -1391 -2061 517 1941 936 -1960 -1460 515 2066 987 -1418 -2043
4032 -2043 17 2238 1368 -2150 -1928 951 2210 601 -1694 -1347 360 1677 926 -1780 -1865 601
4048 601 2218 521 -2234 -1411 1480 1792 162 -1674 -1422 368 1959 618 -2105 -1830 1096 2181
4064B181k401k032J201K177M62j518j921L38K229J660k075k476J019K640M82k656
4080f90j302J517J937L36j797j841M93K691Q58k417k201J984K491m70k526q56
4096a793J460J790M27k122j801P30L024n3k656j314K298K282q14k647o65J328
4112e26K020J87k314j269J344K463j38l113l55J674J979o86k178q16J534J884
4128A690l01k639q37K104J982j201k345l47K430J168n44k463m93J584K233p87
4144A234k922l65K316J841j484k392L10J981J322q41k353l86K196J237j170k555
4160b031N07K450P76j141k272L90K200J053j423k107J08K273J191k012j706M98
4176a246K496P39j665j836M88J710R87j305k191N72K782L47k308j876J506K143
$$ plain form
4064 2181 -220 -2252 -1051 1126 1588 70 -1851 -1513 716 2376 301 -2175 -1156 1484 1966 -690
4080 -690 -1992 -475 1462 1798 1 -1840 -1347 1344 2202 -215 -2416 -432 2059 1589 -937 -1793
4096 -1793 -333 1457 1884 -238 -2039 -1309 1715 1662 -994 -2308 -10 2272 1458 -1189 -1854 -526
4112 -526 1494 1681 -633 -1902 -558 1905 1767 -1346 -1701 -27 1952 1266 -912 -1728 -194 1690
4128 1690 1389 -1250 -2087 17 1999 798 -1547 -1894 536 1704 1160 -1303 -1796 -212 2021 1234
4144 1234 -1688 -2053 263 2104 620 -1772 -1462 519 1841 1000 -1353 -1739 457 1694 524 -2031
4160 -2031 -1524 926 1702 561 -1711 -1321 879 1932 509 -1598 -1490 783 1974 -38 -1744 -1246
4176 -1246 1250 1989 324 -1512 -1024 686 1673 368 -1823 -1251 1531 1878 -430 -2306 -800 1343
4192A343Kj623j473Q16J785Q43k130j635J071K693J15k299j484J345J956L01j892
4209b66j478J156K091K81k309j534J431K348l52k337m28J132J768j34j804j648
4225b083J449K404m62k471r62J973J971p76k042n38J333J474q1k065j018J984
4241I0K331j494k524j62J882J254o97j546p70J720J734q61k434n93K310K004j516
4258G28k255M2J963J210r93j673j69J494J712j538k512R0K603J242j684j770L10
4275a200J854Q92r98j967o8K006J385j726k383Q97K684M83j733j613N54J725N33
4292A325j314j476J28K697R71k542k047J396K463j35j313j726P49J703N65j202
4308B42k482J282K375N21k464j515J681J525L70j813j223Q35J758M93k240j598
$$ plain form
4192 1343 1345 -278 -1751 -935 850 1693 -437 -2072 -1001 1692 1807 -492 -1976 -631 1325 1626 -266
4209 -266 -1744 -588 1503 1784 -525 -2059 -628 1720 1368 -969 -1397 -265 1503 1369 -435 -2083
4225 -2083 -634 1770 1308 -1163 -2125 -152 1819 1043 -999 -1537 -204 1270 1189 -876 -1894 90
4241 90 2421 927 -1597 -1759 123 1377 680 -866 -1636 84 1818 957 -1477 -2070 240 2244 728
4258 728 -1527 -1485 478 1688 695 -978 -1147 347 2059 521 -1991 -1901 702 1944 260 -1510 -1200
4275 -1200 654 1546 548 -1419 -1487 519 1904 178 -2205 -1308 1376 1859 126 -1487 -933 792 1325
4292 1325 11 -1465 -1337 1360 2331 -211 -2258 -862 1601 1466 153 -1573 -824 879 1444 242
4308 242 -2240 -958 1417 1938 -526 -2041 -360 1165 1535 -278 -1501 -666 1092 1585 -655 -2253
4324b253J586K292l51k124r16J640J419l01j155j249P91K089J84k426j241J715
4340c00K031o25k104m14J341J353l54j849q71J596K009n21k390p64K163J486q65
4357I22k063J12R99J408j94k210o43J478K122r60k583K51J887Q49r92j626J31
4374a112J361J228o22k173m22K286J411j339k061K21J908R04j241j721R7J561
4390B86J389j011k573K73K678R98j888j659O13J776M94j375j319O0K386N90j654
4407F4j664N45K380Q9j615j392J052J472M33j573j216M29K044O85j816j937J258
4424g62K023P2j567j090Q04J218L95j221j515R21J903M21k439q50J261J819k55
4441A138j586r88O89J759L23k059j206J671J948m51k199l34J244J191n65j050
$$ plain form
4324 -2253 -667 1625 1274 -850 -1766 -126 1293 992 -163 -1412 -621 1468 1652 -774 -2015 -300
4340 -300 1731 1106 -998 -1412 -71 1282 928 -921 -1792 -196 1813 1292 -1098 -1862 301 1787 922
4357 922 -1141 -1029 -30 1378 1184 -1026 -1669 -191 1931 971 -1612 -1361 526 1375 383 -1243 -1112
4374 -1112 249 1477 855 -1318 -1740 546 1957 618 -1443 -1222 686 1590 349 -1372 -1275 286
4390 286 1675 664 -1909 -1636 1042 2040 152 -1507 -894 882 1376 1 -1318 -1258 1128 1718 64
4407 64 -1600 -1055 1325 1414 -201 -1593 -541 931 1364 -209 -1425 -996 1048 1733 -83 -2020 -762
4424 -762 1261 1333 -234 -1324 -520 698 1093 -128 -1643 -722 1181 1602 -837 -1687 -426 1393 1138
4441 1138 -448 -1436 -747 1012 1335 -724 -1930 -259 1689 1238 -961 -1295 -51 1140 575 -475
4457d75r19J170J753l96k103p86J572J984r69k012J93P68J380o2j905q45J791
4474A39J530p06k434k13J829J182q60j594O6J088J437q03j934m91K130J481j215
4491F32j791j4J593Q09j044j163r6J443J266j201k007L17J984R33j700j289O27
4508g01J463N58j103j575K44J554J092r95k285P87J666O28j483j317R84J309M86
4525A312j254j447K44K349O89k082j615J010K085j91j716n43M99J493M95j459
4541a31j538R32J721N95k010j046J213J560l79j426n26N31J663J12j494j339R75
4558e87J924k17j849n40J120J041J34j867m35Q80J720l3j989r32J171K076q36
4575G81j737k26J198J080n59j378n47J046J790m69j827n52J474J425j120j465
$$ plain form
4457 -475 -1394 -224 1529 1133 -970 -1756 -184 1800 831 -1181 -988 -220 1160 1098 -807 -1652 139
4474 139 1669 963 -1471 -1684 145 1327 467 -1127 -1061 27 1464 661 -1273 -1764 366 1847 632
4491 632 -1159 -1173 420 1229 185 -978 -1074 369 1635 434 -1573 -1256 728 1661 -39 -1328 -701
4508 -701 762 1320 217 -1358 -1114 440 1532 537 -1748 -961 705 1333 -150 -1467 -483 826 1312
4525 1312 58 -1389 -1145 1204 1893 -189 -1804 -794 1291 1100 -616 -1159 -660 833 1328 -131
4541 -131 -1669 -737 984 1579 -431 -1477 -264 1296 917 -509 -1035 -504 1159 1271 -223 -1562 -587
4558 -587 1337 1120 -729 -1269 -149 892 1026 -841 -1276 -396 1324 1291 -698 -1630 -459 1617 781
4575 781 -956 -1182 16 1096 537 -841 -1388 -342 1448 979 -848 -1400 74 1499 379 -1086
4591a086mJ213J179m89j616m99J386J273n16k063j5J551J095j080j565J38J376
4608B78R74p61j864K80J443J238j267j836N86J877J18r29j523N73J154J065q55
4625E51j805J95J994M33j449j375Q65J210O68j168j190L98J352Q88j400j734R01
4642f66J813J38j571o79M92J183M14j297j306Q77J555O54j713j408J274J334q5
4659A009j545p09P90J702K5j655q89O10J841j82j622o51J223J435n12j670n47
4676a347J000J385O9j677p74J007J758n94j986M9J414R51m04j323o90Q72J387
4693A097k30j834l32J455J567j217j585k70J801R61r99j136m45J202J452p30j647
4710h90j50J388R10q46j301k73J496P16n17j473k69J557J090j014j448r3K048
$$ plain form
4591 -1086 -1090 123 1302 813 -803 -1302 84 1357 841 -1222 -1237 314 1409 329 -1236 -1098 278
4608 278 1252 491 -1373 -1093 350 1588 321 -1515 -929 948 1066 137 -1386 -813 341 1406 551
4625 551 -1254 -1059 935 1368 -81 -1456 -591 619 1287 119 -1071 -673 679 1567 167 -1567 -666
4642 -666 1147 1285 -286 -965 -473 710 1124 -173 -1479 -602 953 1607 -106 -1514 -240 1094 1009
4659 1009 -536 -1245 -455 1247 1272 -383 -1272 -662 1179 997 -625 -1276 -53 1382 870 -800 -1347
4676 -1347 -347 1038 1107 -570 -1344 -337 1421 827 -1159 -1110 304 1255 851 -472 -1162 -290 1097
4693 1097 867 -967 -1299 156 1723 506 -1079 -1349 452 1413 414 -722 -1167 35 1487 757 -890
4710 -890 -1040 348 1258 412 -889 -1162 334 1050 533 -940 -1209 348 1438 424 -1024 -1117 931
4727I31M25j098j262K10J344R20j095j266j18J355J306j575j365N82J597K71j327
4744a65r24L21J468O71j099j542L00J915J1r08j496J119J098K36j375p51M12J226
4762E17Q75j580j334J077J622k08j521q34J025J101J79j262j135Q03J796j12j574
4779e65r84J287J704m34j590m03N64J239J34j668m06O38J765k23k196k40J365
4796a3J207o42j120p49J444R20n05j241p54J680J213o76j964R7J198J196p47j340
4814g96l69J177J006r8j957k91J499J150r88j448J9J394Q09n74j218j78J253R54
4832A344r04j538L17J458P12j278j151K23J373O82r45j130j86J644N01r15j705
4849a498M92J868K95j111j220N55J023P21q74j373L12J401P66j670q61N82J563
$$ plain form
4727 931 1356 258 -1004 -794 550 1470 375 -891 -1009 346 1652 77 -1288 -706 891 1162 -165
4744 -165 -1089 -768 700 1371 272 -1270 -970 945 956 48 -1448 -329 769 1005 -370 -1121 -709 517
4762 517 1392 -188 -1522 -445 1177 969 -552 -1386 -361 740 919 -343 -1478 -675 1121 1009 -565
4779 -565 -1549 -262 1442 1008 -582 -985 -421 818 952 -716 -1122 -484 1281 1058 -1138 -1378 -13
4796 -13 1194 552 -568 -1317 127 1047 542 -699 -1453 227 1440 764 -1200 -1103 95 1291 544 -796
4814 -796 -1165 12 1018 920 -1037 -1328 171 1321 333 -1115 -1096 298 1107 533 -685 -863 390 1344
4832 1344 440 -1098 -781 677 1389 111 -1040 -817 556 1238 293 -837 -1023 621 1122 207 -1498
4849 -1498 -1006 862 1157 46 -1174 -619 404 1125 251 -1122 -810 591 1357 -313 -1174 -592 971
4866I71J5q60r89K37J299K45q64j563R51J767m4j707p74J019J159J05j161j010
4884a204N93J456L84j299j477J183J492l02j395l53L86J495k07j009p73Q11J472
4901A253l55j250o75O75J618n05j411k72P63J278k97j257p98J038J459m34j963
4918a133j50J289J185o57j040k61P62R58k81j256o42J542Q17p55j616L23J203
4935B88Q34n23j024n22Q38J192n90j541k25J691P76q15j470N12R26N43o32j287
4953a029J92J074R73p83j664M30J187O48j207r73Q65R28K83m52j776P53J387K46
4971A082j148j311N02J563M38j386o77O20R71K52p98j587Q67J500L38j510q47
4988a131O88J227l3r68p60O61J047K66j569m85P96J536j62j387p06J009P59k06
$$ plain form
4866 971 986 126 -863 -626 673 918 54 -1509 -558 1209 1165 -542 -1316 -297 862 967 -194 -1204
4884 -1204 -611 845 1229 -70 -1547 -364 1128 826 -569 -922 -536 959 752 -257 -1030 -219 1253
4901 1253 898 -352 -1027 -352 1266 761 -650 -922 -159 1119 822 -435 -1233 -195 1264 830 -1133
4918 -1133 -1283 6 1191 534 -506 -767 -5 953 672 -584 -1226 316 1133 378 -1238 -915 288
4935 288 1122 599 -425 -947 -109 1083 493 -1048 -1273 418 1194 379 -1091 -579 347 890 258 -1029
4953 -1029 -837 237 1210 427 -1237 -807 380 1028 -179 -1152 -287 641 924 472 -1304 -551 836 1082
4971 1082 -66 -1377 -875 688 1126 -260 -937 -317 654 906 108 -1479 -612 888 1226 -284 -1131
4988 -1131 -443 784 751 -217 -977 -316 731 997 -572 -1057 -261 1275 1113 -274 -980 29 788 582
5006E82r20n78N99J607j90j537p50R80J485p38r44o23R01P88K3j214n65P92J595
5025A293n22j598q44J885Q26p39r26M0O83O98p4j492o06J643J313q50j728J52
5043h46J277O97o98j193J62O53R51m54j610k63J714J059j171j400K35J027R71
5060A111q61j016j69J080J032p33j520J5J694N15r01j481Q08Q57L26p80p91n6
5078h70J424Q29j072j302N85J213L60j302r60O68J196j94n47q37J93J179N53j229
5096a13j081O81J248K06j055j000O81J310j73p78j058N39J262L84j432o36P07
5113c08J438n88q14o33M73J227j10q51j034R31J390n57r76o27R80R90l82j269
5131g20j88O50J387l84j045r06J262J228p82r68l71R89R29n79j099n43R11J403
$$ plain form
5006 582 -338 -916 -317 1290 1100 -437 -1187 -207 1278 540 -404 -1027 -126 662 685 -529 -1094 -302 1293
5025 1293 771 -827 -1671 214 1040 301 -625 -585 98 796 722 -770 -1376 267 1580 730 -998 -846
5043 -846 431 1128 430 -763 -601 52 1003 549 -1061 -1324 390 1449 278 -1122 -887 140 1111
5060 1111 250 -766 -935 145 1177 444 -1076 -1061 633 1148 247 -1234 -426 431 757 -23 -814 -870
5078 -870 554 1383 311 -991 -406 807 1167 -135 -1095 -427 769 575 28 -809 -616 563 1116 -113
5096 -113 -1194 -513 735 941 -114 -1114 -433 877 704 -74 -1132 -593 669 1053 -379 -1015 -308
5113 -308 1130 542 -272 -905 -432 795 685 -166 -1200 -269 1121 564 -412 -1039 -59 931 549 -720
5131 -720 -908 -258 1129 745 -300 -1206 56 1284 502 -466 -837 152 1081 502 -597 -1140 -229 1174
5149A174n42j398k17J518M55o76j035l8J041O74n02j327j30J270P56n88j219J15
5167f69J172L51p85o71j2R40M82l04j553P3J272Q62r36j485N82J188L82o02j073
5186g86q8J325O07p53j430J34J560M33j080r89Q77P91J7n22j112K26J319N87q84
5205B32j278N19J262N5q72o71M21Q32M50j121j025M86J354M03j334n87M89J457
5223A072m55j019m98O12R13q2r37n25M61J635l82j384n03J015P66j55q50n18N91
5242b43J305k26j127r80R49J444m81j362M6R99O81l33j112n10Q89Q00n8j071o93
5261a083J165J045o34r67k19J033M93l04j113p00J270J036m98j451J62J361L82
5278I78q41q86j01J334K01n3j211l65J225O99p05j386L69J017P85j121q20P1J105
$$ plain form
5149 1174 632 -766 -983 535 990 314 -721 -759 282 956 454 -873 -1003 267 1023 435 -784 -669
5167 -669 503 854 69 -602 -614 326 808 504 -1049 -976 296 1158 222 -1263 -681 507 889 287 -786
5186 -786 -874 451 1058 305 -1125 -991 569 1002 -78 -1067 -190 601 618 96 -1016 -790 529 1116 232
5205 232 -1046 -527 735 790 -82 -753 -332 500 950 -171 -1196 -710 644 1047 -287 -874 -385 1072
5223 1072 617 -402 -900 -288 625 543 -394 -919 -458 1177 795 -589 -1092 -77 689 534 -316 -834 -243
5242 -243 1062 836 -291 -1271 -322 1122 641 -721 -675 324 1005 672 -440 -950 -61 739 681 -390 -1083
5261 -1083 82 1127 493 -474 -693 340 833 529 -584 -1284 -14 1022 524 -927 -765 596 978
5278 978 137 -749 -850 484 685 632 -579 -944 281 980 275 -1111 -742 275 1060 -61 -881 -810 295
5297B95O43n26j525M36R95O24r04j170O44J017K61o92q08j01J145O44p53j269
5315a044L45J156N90j073r55Q38P84K66q71j038L66J201L11q36j019O23J261j91
5333G14j123o54R39O17J57n97j118M22J592Q1j274o76P99J247p14j175l3L39J124
5352F67K04j147q16R38J167j86j429r4Q79P26m11j074K16L26P98k94q63p59R75
5371a77J257o02j439J14R89N70j95r46m91P45J098n35j084n8J053Q38j052p33
5389f48K07Q63N50q10p31k50R85R83p84j176j19J584L84r94q10J58Q82N88q01
5408F1r70r4J222R71j394o67K30J487m7o62r51J39J063M64n35j362M90J061M40
5427I46r20j186O65J235m3p29n08Q7Q58K54r09q57M02J505Q4j283l90P24R07k00
$$ plain form
5297 295 938 412 -1113 -677 318 942 38 -1132 -488 529 790 98 -710 -811 334 978 225 -1044
5315 -1044 -699 457 1047 -26 -981 -143 641 907 36 -1002 -636 565 876 40 -979 -356 905 714
5333 714 -409 -1063 -124 493 650 53 -1065 -643 949 1030 -244 -920 -121 1126 412 -763 -796 -457 667
5352 667 871 -276 -1092 -154 1013 827 -602 -696 183 909 498 -576 -360 -34 764 470 -393 -1152 -177
5371 -177 1080 478 -961 -847 142 712 517 -429 -920 -175 923 388 -696 -754 299 1137 85 -648
5389 -648 -441 422 972 162 -569 -819 166 1149 365 -811 -930 654 1038 44 -766 -608 274 862 61
5408 61 -909 -1003 219 1190 -204 -871 -641 846 799 137 -814 -675 388 852 317 -1045 -555 506 946
5427 946 26 -1160 -495 740 697 -32 -540 -453 405 659 -250 -1107 -705 800 884 -399 -789 -65 842 642
5447F42p48p95N95P15N07j333m86P33J040j34j294m85J041Q86m68n61p92O72J178
5466I13O8j395n07J061Q40o78q12pL67P78k16r79o69J457Q57o15r48m19J244L87
5486G27m15q68k23Q15O81k35j196j80R56R53o56j312K13J271L18l33j058l57P96
5505a03J294o48j183m0J140M48r19p57Q6J144J67k69j125k07J092Q75p89j167
5523i61K42J796j39r81p15M8R17M80p20q23K26R29M78p74q74P53Q46J01j078m03
5543f52M50M87M95l77j531M41J468J98j042p53O88N46J15q13j87N3R33L14j005
5562a72j054R71J204l76j228l60P16Q67p5p40m94L61Q92L87j339n51Q60J077q1
5581H65j655O0O99N83L05j113o31O60J247m19j098m49P76J245p95p76r4N10O23
$$ plain form
5447 642 -106 -901 -306 409 916 -417 -903 -170 870 736 -558 -1043 -2 884 416 -145 -937 -265 913
5466 913 981 -414 -921 140 980 302 -510 -517 -150 628 412 -567 -1236 221 1078 463 -485 -904 340 727
5486 727 312 -556 -779 36 717 482 -714 -894 62 1015 359 -953 -740 531 849 516 -542 -899 -103
5505 -103 1191 543 -640 -680 460 908 -11 -768 -682 462 629 360 -765 -972 120 995 206 -961
5523 -961 -719 1077 938 -43 -758 -710 207 687 -33 -856 -630 299 777 3 -871 -118 728 829 -249 -652
5543 -652 -202 285 780 403 -1128 -687 781 979 -63 -816 -128 418 533 -280 -467 -414 519 833 -172
5562 -172 -1226 -255 949 573 -655 -1015 -299 568 493 -247 -741 -380 512 899 -440 -991 -131 946 865
5581 865 -790 -730 -31 552 857 -256 -887 -227 1020 601 -497 -946 -170 1075 280 -496 -590 -80 543
5600E43j64p84m02J010R49o91j106j82J037N34o02m31l08M88O37j0r53l39J403
5619F29J86n75r22P3R73N66o95j081M73L47Q14p29r74J56J085P57j103q44P06
5638a58N32N06p84o83J74R63P23j506o53L93J157K97j039n24K56N11N10m47j244
5657a016M89J135M49j197j118J045Q94K23j037p60O49P96K75r70r28L64J638M1
5675I72j237m68O87Q62l00p71o69O04J040J95j158o88Q15R86k58r52m21R45N62
5694G46l01o83n04N15P93M3j146j65N28J090m32q95j19L52O37J29j062k36P30
5713B0R43l60q83n47Q96Q56o64o60j36P19P4L79p91n60P71J055j008r05K6R80
5733B05M70k67r53J0Q50N97p43p10l13J102P85p26j049J58R23L43o54o60J97Q49
$$ plain form
5600 543 379 -405 -807 203 1152 461 -645 -827 210 744 142 -289 -597 -109 528 518 -435 -774 629
5619 629 815 240 -682 -609 364 930 235 -846 -373 -26 788 59 -915 -759 326 1083 -20 -864 -158
5638 -158 374 880 96 -587 -413 550 1273 -233 -886 -493 664 961 -78 -602 -346 165 675 228 -1016
5657 -1016 -527 608 1057 -140 -1258 -213 681 904 -133 -893 -244 552 827 -143 -1071 -707 931 972
5675 972 -265 -733 -46 816 516 -255 -924 -320 720 915 -243 -931 -116 870 612 -340 -761 184 746
5694 746 445 -238 -742 -227 566 609 -537 -702 -174 916 484 -411 -530 -178 459 588 -474 -710 20
5713 20 963 603 -280 -827 69 925 261 -399 -535 184 258 637 -154 -714 57 1112 104 -801 -775 205
5733 205 675 408 -545 -535 315 912 169 -541 -854 248 1033 307 -742 -584 339 682 28 -632 -435 414
5753D14L99o03j197M51J266M8j082o08M39Q61J88m46p71J4J088M41p86j041L26
5772e99J445m09p34o6M6R49O8o71o04J47R17M77j376n01N71J192m03n08n89K97
5792c51Q35J04r12n26O72J095k31j335j03J007J97Kn80k12l9J055qr77n75N45
5812c37J164j29j278k28R15O65l63p26m61O51Q74l53p46m95J168N82q55n08j19
5831e79O80O12j04j157M5K67J177p13j162K12J126K8m87j39n20Q58N70m87j013
5850g86j00J107Q48q27r79R2R69K91n38j003N75P49K44m23q83k3Q29L99o20q84
5870i63N71Q59K71o68m73k87J103L03n88j094M85R48J70p69n02M50Q36j62m93
5889cp19L60R57K26j043o86N62Q46K33j057k24K76O66K35p91m85M13O60J85r15
$$ plain form
5753 414 813 210 -987 -536 730 778 -304 -912 -473 388 576 130 -641 -627 461 902 116 -925 -599
5772 -599 846 437 -297 -363 -317 632 700 29 -575 -428 489 966 -410 -911 -340 852 449 -59 -648 -351
5792 -351 484 588 -324 -850 -178 917 686 -649 -752 255 452 454 -126 -338 -377 678 670 -307 -882 -337
5812 -337 827 698 -580 -808 107 772 409 -317 -778 -127 747 394 -352 -847 321 903 48 -460 -579
5831 -579 101 713 609 -548 -503 -236 941 228 -934 -722 404 432 -55 -194 -714 144 714 227 -786
5850 -786 -886 221 1069 242 -737 -645 324 615 77 -926 -351 398 642 219 -664 -687 142 541 -79 -963
5870 -963 -392 467 738 70 -403 -690 413 716 128 -966 -481 467 637 -132 -634 -184 652 490 -3
5889 -3 -722 -362 595 821 -222 -908 -346 500 733 -324 -548 -272 394 629 -162 -647 -234 426 611 -304
5909c04o10P37Q58m44m68m01L68J075k65p89m35K29J461n36j183K2P18O43k44
5928D32o41n69P18O76o7j001j2N29N79m10o98o6Q20N90n22p82l30R00Q99p06q18
5949d79j40R12M47l63j258M21O72K49l3p60n49J000J111q68j005K20Q39N02r88
5968g0o28R4Q83K79n38n83J02N88N47n02q09K79Q04K48o90o23OJ098J24m34o01
5989d26k56J298J29p80p27O96P37K4o42m67K73N18L40p38q35M15J191j36p68m88
6009f42M70N74K31o99q20P60O97L31j262l69K75O91K03r13p4P29M62k02n30n73
6029f61N20N41K08j048j57N07N06Q4o16l88M51O67j82r58l13M97R69j52j030l4
6049e89Q23M82n17p11j65M35Q82m50n26k30P92N53p62o22J63N39M84m84j28m94
$$ plain form
5909 -304 -914 -177 681 237 -231 -632 -264 811 546 -243 -678 -449 1012 476 -707 -685 33 676 432
5928 432 -209 -778 -60 616 549 -452 -464 65 644 234 -464 -530 290 880 358 -424 -754 146 1045 339 -479
5949 -479 -619 293 740 377 -881 -460 212 461 428 -332 -881 119 1230 362 -643 -423 416 918 -70
5968 -70 -698 -604 279 558 20 -563 -461 127 674 172 -637 -358 446 694 4 -619 -613 485 609 175 -426
5989 -426 -682 616 745 -35 -762 -66 671 695 53 -414 -141 377 717 -21 -856 -441 750 614 -154 -642
6009 -642 -172 402 633 -66 -886 -126 571 902 -360 -729 -454 237 440 -473 -547 182 644 442 -88 -661
6029 -661 -141 400 608 -440 -597 -90 416 500 -116 -504 -53 614 432 -526 -839 -342 627 475 -555 -589
6049 -589 234 716 199 -512 -677 -242 640 190 -336 -566 226 779 17 -605 -442 97 581 97 -31 -525
6069e25P39J68L2j177J53P97P46o60r86N08N13J72k62o80p3O85L11j88r25J56
6089d96Q72K63q90m77N28L16O90n80q87j19J027M50p59o64K87R36j9o90j34J84
6109a62N09J42o29o41K72Q32M44j275j37M26P27Lq18j93K84O57K87q31o78N28
6129b53J000q7r68m25N44P47j93m81n09L07N65M30r61o05Q35O56j98q07j86N32
6149e7P29k23p88k03N62O39j69q52l46N20R09n02o26j28O59K44L88j387j54Q97
6169A12Q74p73p00j17M26N69m54k18k46O59N39j76r04j21L56Q28m13r92q8R89
6189A50J28r7n19k50O09K96j71q40K64O09L46l28o66L68M29J63m35l88j97P58
6209B29N24q62o99L35P97J1m06m68j58O84N68m80n36P2P86L51p78l64L10M46J36
$$ plain form
6069 -525 214 382 414 -763 -610 187 933 273 -713 -205 308 480 218 -462 -535 150 461 273 -652 -496
6089 -496 376 639 -251 -728 -200 116 806 226 -661 -780 247 697 -62 -726 -439 497 478 -212 -346 -162
6109 -162 347 489 -140 -781 -509 323 767 -508 -645 -219 508 511 -307 -500 -216 441 728 -103 -781 -253
6129 -253 747 660 -308 -733 -189 558 365 -116 -625 -318 247 677 -284 -889 -54 602 404 -403 -589 -57
6149 -57 672 449 -339 -542 20 659 490 -362 -708 -188 721 219 -407 -535 124 368 756 -631 -785 112
6169 112 986 213 -487 -604 -178 391 -63 -281 -527 132 671 495 -409 -530 -174 654 241 -751 -839 150
6189 150 278 181 -338 -588 21 317 146 -694 -430 179 525 197 -469 -101 328 491 56 -332 -529 229
6209 229 753 -109 -808 -473 324 335 -71 -539 -697 -13 555 75 -461 -389 397 748 -30 -394 -84 362 498
6230D98n48k34j07Q23j28j28o93J50O37K55p15o98R99O1K49l63p56K33R38K15
6250F88p93o04M16R30k57q19k32N87O37k12o45l32M31L09M59r85j18N96O13k15
6270D54p83J30M18L90k53q27l1J46J070m50p93k40Q05M52m27l12k69P27J36J01
6290D44n29n46R44J45k22r13M19N10M85n03q41J76L34P44m52o22m14J209K92m64
6310A96o28K32N30k14k56k88pN57O60m29r60K62O84M65p50n14P1Q27L57r09k41
6331c55k12J056J53o82n52M62M20Q4m41l03L08M35Qn59l46K03Q31q5n53o21N46
6352b03O26k24m70n4Q3M79L94p45o97M25R55J45r19k62N74L61j95n07j49L99K75
6373B91K71r34j70L56P74k6j248K09M53K68J16o05k33K78R22k33o74o40Q50N27
$$ plain form
6230 498 -50 -284 -391 432 304 176 -517 -367 270 525 -190 -888 111 172 421 58 -698 -465 473 688
6250 688 -105 -709 -293 637 380 -439 -671 -84 553 341 -304 -636 -205 104 563 -422 -540 56 669 454
6270 454 -329 -199 219 609 356 -471 -502 -356 714 264 -529 -769 36 488 61 -251 -520 207 343 444
6290 444 -85 -631 313 458 236 -677 -258 252 737 234 -607 -431 -97 647 195 -427 -841 368 660 196
6310 196 -432 -200 330 116 -140 -428 -435 122 782 353 -607 -345 339 804 54 -460 -389 438 795 -114 -355
6331 -355 -567 489 642 -40 -592 -130 290 374 -67 -370 -62 373 381 -178 -524 -321 510 425 -128 -749 -203
6352 -203 423 199 -271 -325 -242 237 631 -114 -811 -386 569 714 -205 -467 107 468 273 -234 -383 16 291
6373 291 562 -372 -542 -186 588 562 -686 -477 -24 244 360 -245 -478 -200 722 489 -185 -825 25 552
6393E52n20m67J00K54O64j55o18k92M60P02m01n63k41R77J45l07n54K1J90K96
6413B43m8n73L2L55O56l74q40o0Q91K57o20j86R6J59N54k46r13j92J201L79p55
6434A6m59N2P65J18n78n95J10Q74K94o38l11J46K76L85p63N9J5N08K25n00n12
6455e13J16P40K07n55q72O70O54j48p76O9K92L47R9j83p28K87R46M2r34m37O80
6476CQ0L24p03j32N00K98K09l38p96L72Q98l95p57Q5L12O01n46m08k7K26L87K84
6498D77n99m59P39O79q95j62j46N53J58r3m36l84K45J024k12o68l86M70O51n86
6518c0j43o5M04M86l32m12o17N90R03l81p13p2N07K84m58n68K73L57O95n27n17
6539c36n5O06m6j33n73M23M97K6l73m31L13L1O79m98n53J3O85J79n51k93K46O40
$$ plain form
6393 552 32 -435 -335 -81 583 428 -190 -482 -22 680 279 -284 -525 452 597 290 -264 -243 -53 243
6413 243 195 -378 -346 9 665 291 -549 -609 282 539 -81 -267 -171 -12 542 296 -617 -809 392 771 16
6434 16 -443 -391 374 492 -86 -681 -571 303 597 -41 -352 -206 70 455 -308 -249 -234 274 499 -1 -513
6455 -513 -397 343 550 -5 -877 -207 447 299 -477 -408 -116 231 330 147 -581 -294 652 694 -240 -677 3
6476 3 83 407 -296 -428 72 370 579 241 -555 -183 715 320 -437 -352 -40 561 15 -393 -420 -194 193 477
6498 477 -122 -581 158 837 -58 -220 -366 187 345 252 -184 -568 -323 701 489 -179 -565 -95 556 -30
6518 -30 -173 -238 166 652 320 -92 -709 -119 784 403 -310 -382 125 409 -49 -617 -344 13 708 181 -336
6539 -336 -391 215 169 36 -537 -114 383 409 36 -395 -82 -51 628 130 -423 -410 275 454 -97 -390 -144 496
6561D96l36j52n03Q3O30K13j95r62M44M64L91r17j98N79M02P5n80l35k27J153
6581E25k77m94l65N22M80j50l18l94L75L85K87n22m69M75L43J15q43p5L40K51
6601A91J1l99QK98L40j12m66m55L38Q68k75p86K48K62M15r7o95J62j3O88J34j005
6623c40j4L27L99k06n28j39M80N14j84o63k52M98O71l76p04RO44K68m19n36J1
6644e40P96O2j04m30l34Q00L65o98o03K49O07M27m90m33J2L64L66k18k76k42O21
6665C01L82o54p05P44R4L9m43j49J24N36K17l70p40K56P25m9n39k58J37N20J25
6686B93j05m46J53K87mj56o77O03O24p7o03l34K80M08J98l15n25L40L30O5p47
6707d08j70L94O18j68o12J49J66M75J49o22l48K57O98o8j000l08O86N89m59l63
$$ plain form
6561 496 160 8 -495 -412 218 431 236 -726 -282 182 573 -344 -542 37 439 514 -66 -401 -628 525
6581 525 248 -246 -611 -89 391 241 -77 -471 -96 289 576 54 -415 60 403 518 -325 -400 -60 191
6601 191 202 -197 -189 109 449 337 -129 -584 -246 622 347 -439 -191 71 486 389 -306 -144 -157 531 665 -340
6623 -340 -354 -27 372 166 -362 -501 -21 493 309 -354 -606 -108 563 187 -517 -508 136 404 -15 -551 -540
6644 -540 256 318 214 -216 -550 250 615 -83 -686 -437 170 597 107 -326 -314 50 416 198 -78 -320 301
6665 301 683 29 -676 68 162 201 -242 -391 -267 269 486 116 -624 -368 357 308 -231 -489 -352 168 293
6686 293 188 -258 -105 182 178 22 -655 -52 572 495 -108 -442 -162 246 444 129 -396 -56 274 339 -408
6707 -408 -578 -184 434 266 -346 -197 -31 444 593 -29 -377 -120 578 510 -490 -798 -112 477 18 -345
6727c45k65O42L80R8r04r0M39O82q6p59k07O03K18l04j28o33P23M63j62j053L62
6748c26O50J58k85m15j58N78J37n0m67l04L18O40m96l94m62R87J1k38j51r5O50
6769B88m8P1o99k53Q33L27m95m96J55L89K99l17o79K20N87M3J6q19O5R07P1n40
6791g5q79J005J40k8k71qQ5K06K16n25m61M58N51j99j93m61L47N94l91k50j25
6812b64J82L05K50m55o14N74N65M3n85m69O00J88k49j72l77O35j19K41k89o01
6832f11N34P69m70m00J8M00Q8R9n25m69O23N62k54o61qL82J42k88k56j8M50N67
6854F74o95k82j3K79O11m03m48j53N20K85j89l08k02nQ62m17n23L7P67K30l76
6875B51p56K67M09j38Q1l56q8N21K44m62l43J69N37K00n43o03L20N46P6j53p43
$$ plain form
6727 -345 -610 32 412 510 -394 -484 -45 637 551 -208 -415 188 406 102 -26 -659 64 527 365 -688 -326
6748 -326 324 482 197 -218 -376 202 339 289 -178 -482 -164 476 -20 -414 -876 111 122 -116 -267 -362 288
6769 288 240 311 -388 -641 192 519 24 -472 -317 72 371 54 -625 -405 182 225 241 -578 -513 394 465 -75
6791 -75 -954 51 191 163 -108 -116 -31 175 391 -134 -595 -137 414 215 22 -439 -92 502 111 -139 -264
6812 -264 -82 223 473 18 -596 -22 543 586 1 -468 132 320 71 -101 -478 157 38 279 -10 -611
6832 -611 -77 692 222 -178 -160 240 328 427 -98 -567 56 618 364 -297 -305 77 219 -69 -325 -343 107 674
6854 674 -21 -303 -316 -37 574 171 -277 -430 90 375 186 -122 -324 -329 533 116 -407 -370 397 627 251
6875 251 -505 -238 171 33 114 -242 -330 191 435 -27 -370 -201 336 536 -7 -610 -290 256 332 179 -564
6896e64K87N16L62m89q03M20Q23k54k83k67j71O40q5o3n68L00L38M40r09P3M18
6917A61J33Q2l66m74K40O48j9o48l63N05N00M2m30o14L49N85k4m34l73M36L13
6938B49J00l78k50N0M49Ll53j8L20J59o1k23l08J92M62k45m30j60M40K94k52k19
6960a79j52L73Q2K51n02l47O45K93j78p69j09O31J41M6l91k59N32L0j07l78J20
6981b27M53K32k25p31K97L29N4K8m13l07N28K31P4p96J58P14J35m40l15L06l3
7002E2J92k37l21j9L28M67m54o24N38O22Jp32j81J01K69n1P7k59p5N88K93n74
7024Am22L90J83M72o69j57Q8J84K57k12m23j41O93P0p13j1L44N54k41m88j04j0
7046c55N11M05o41k88K71L37L0l13k46L17Q7L24m75j52J75N28l10n44J1K62O77
$$ plain form
6896 -564 -277 239 601 112 -691 -271 552 298 15 -252 -423 217 132 69 -499 -199 139 579 -330 -257 161
6917 161 294 376 10 -464 -224 424 405 -243 -606 -101 399 441 11 -603 -254 331 307 -127 -500 -64 249
6938 249 349 -29 -279 -229 220 223 -130 -148 172 331 270 47 -261 -69 393 148 -282 -442 -2 292 40 -179
6960 -179 -331 42 124 375 -127 -474 171 464 286 -483 -592 39 180 226 -165 -424 108 138 31 -347 -227
6981 -227 226 458 233 -498 -201 128 182 210 -203 -510 18 249 323 -473 -315 399 534 94 -221 85 52
7002 52 244 7 -314 -333 -5 462 8 -616 -78 544 545 -187 -368 -267 2 -49 28 -231 -306 282 575 1
7024 1 -421 -31 152 624 -45 -202 -114 70 327 115 -308 -449 244 314 -399 -410 -66 488 247 -241 -345 -355
7046 -355 156 561 -80 -368 -97 240 270 -43 -289 28 115 439 -36 -188 -13 515 205 -339 -328 -66 611
7067F11o68l77L40L48Q8R4n95rJ6P32m17j66k19M17K63m59j81k07N68L61M2r21
7089c39j43O96J68k05n79J5M62L77m16l07lJ00O04l51l80p9O90N7k14n17L00K04
7111A40K32o14L8K88k5L18j73n66ON49K21n47Q7L0Q3K07l10j84k06O78K74m45
7133H1m89J92O51l90j44m5m1K22M70k40o90K10K65K84j63p84N09L89P8k38n73
7154d46L91K62K02k12n67rN40N38r68k59M67L12m7l55m20O99J16K39q06j15K21
7175b17O90q0o86J01L19L93p05J34j55L95J90J82q20j65N77J61k28l34k39M52
7195c5J83L74o87j47L35L23q3n70l2M48M06o55nj46M82J88l24k70j88N30N24l74
7217B77n06L28J88Ol48l34Q3J27O25k78m44j45O94Oj72n14J08P21p2k40l27LK29
$$ plain form
7067 611 -57 -434 -94 254 342 436 -159 -168 -152 580 163 -3 -222 195 458 -1 -182 -389 179 540 582 -339
7089 -339 -482 214 382 177 -402 -387 75 452 36 -271 -274 -174 430 79 -301 -380 310 367 153 -364 -64 140
7111 140 372 -242 -204 84 59 377 204 -362 -356 193 414 -133 -46 -16 67 274 -36 -220 -426 252 526 81
7133 81 -408 -216 435 45 -99 -144 -185 37 507 267 -423 -213 52 336 173 -611 -102 287 365 127 -446
7154 -446 -55 207 409 197 -370 -379 161 699 -269 -528 -61 251 204 -151 -571 128 244 483 -323 -438 -217
7175 -217 473 393 -293 -192 127 520 -185 -51 -206 189 379 561 -259 -424 153 314 86 -248 -487 -35
7195 -35 148 522 -165 -312 23 346 263 -307 -339 109 515 -140 -145 -291 191 379 55 -215 -403 127 651 277
7217 277 -229 99 287 293 -55 -389 -306 -179 446 168 -276 -421 273 279 107 -407 -299 422 350 110 -217 -214 15
7240A5K57m25l30J89N08K95n54j71J5P61k58j48o75J39O12j0k99k55K43N61k18
7261B52k62k71J40M11l06J42o75L26P30J87q72k83L65K98K22n56j61J98K60q6
7281E9j93k48L22L73J05n80O8K29Q6K98o77j59J43N07k49p9n78N55O95n16m31
7302b70Q7M89j18j00k20l01L06L97m0n94k7M13L69m39rk62L30K90j11o12J51K17
7324e4L50j7n98j0K85M98k17o03J89K79m6K10n07j96O26K91n23l37K03L49K49
7345D21o33j58M20j37M79j76k88k25Q73n7q51m08N71M41p7r6n34K47M63J92l86
7366H1m16J50N02k40j08l98L88R6m0o6j85j14O88j11k45q0R5N15j13m51j69J58
7388f3L61l31j79j53K77M68m7m19l2N9O06n28j74j89K50K60N8m96k83O24Q8L49
$$ plain form
7240 15 272 -153 -483 -294 214 509 -45 -216 -201 560 302 154 -521 -382 230 220 -79 -334 -91 470 252
7261 252 -10 -281 -141 270 -36 106 -569 -243 487 674 -198 -481 -116 182 404 -152 -313 -115 145 59
7281 59 -134 -382 -60 313 418 -162 -94 135 221 519 -158 -317 -174 333 84 5 -573 -18 677 161 -270
7302 -270 -183 306 188 88 -132 -433 -127 270 230 -364 -391 22 391 -48 -57 -319 11 301 190 -422 -271 -54
7324 -54 296 279 -319 -329 -44 454 237 -366 -177 102 56 266 -241 -437 189 480 -43 -380 -177 172 421
7345 421 -212 -370 50 -87 392 216 -72 -297 576 519 -332 -740 -169 272 195 99 -435 -188 275 467 81
7366 81 -335 -185 317 77 -31 -429 -41 55 15 -51 -236 -350 338 227 -18 -98 -3 512 399 -52 -221 -63
7388 -63 298 -33 -212 -365 -88 380 333 -86 -118 -59 547 19 -155 -344 -94 166 224 -272 -555 69 157 506
7410E06o95j84L55K49j1l98l68N40K93k5o12M4L07L27k90Km79N89L4pk66j65L26
7433G2K97l45j0m60O14q7p0l88K14L80K1N7m38k50P55J08k85n33K22J89M16n31
7455e2k54J89L54k4k73l83J91O44k37N2m69n7N67P5k59j72J88k0j09k3k58KN69
7478B41M9k11p64N11L34J37m43k1L4K18N45m75m17L47Q9J22j17l25j14K68R6k50
7500a46j58O1L90J32k97l49L26K62j42Mk90L7L84M1l95k30L24L92k6l79n1M73
7522C63Q5j41n35j4L02J85r5k65k20L22J95j8o12m6O81J7l39J10M2j5J36Kp51
7545f11L05Q8Q30l93p42L15K30R7m7l20L6J97L62k25l71j45N17J04l67l6M2P4
7567f0L71l90j78O6p3P26m50k13k98Q23j46k81j52K48L51k47j40m65L08L65L20
$$ plain form
7410 506 -189 -373 -18 231 220 -178 -546 -6 287 262 -350 -306 1 328 38 40 -439 150 184 177 -89 -254 72
7433 72 369 24 14 -446 168 81 11 -377 -163 217 238 295 -143 -393 362 470 185 -348 -126 63 479 -52
7455 -52 -306 -117 237 213 -60 -443 -252 392 155 207 -262 -319 248 323 64 -108 80 60 -49 -72 -330 -328 241
7478 241 290 79 -685 -174 160 297 -146 -167 -133 85 630 155 -262 85 174 296 179 -146 -260 8 104 -146
7500 -146 -304 -243 147 279 -18 -367 -41 221 79 83 -207 -170 214 255 -140 -370 -46 346 320 -59 -110 363
7522 363 448 307 -228 -242 60 245 150 -115 -335 -13 182 164 -448 -494 187 204 -135 -25 17 2 138 140 -611
7545 -611 -306 -218 612 219 -523 -208 22 119 72 -248 -212 -15 347 122 -249 -394 123 227 -140 -176 -134 -60
7567 -60 311 -79 -257 -191 -264 462 12 -201 -499 324 178 -103 -255 -7 344 97 -43 -508 -200 165 485
7588D85l58n91N11L08j58j44k29K3J99J44J27q02M49J58K16k36l55J97P7j78n8
7609b15J10j7L57J25l62k92J33M98j73j87j99J80M21j42j66k82l2K62J85l98k96
7630d90L16L85j81n28J88M19p2Q6j50j56J94K44%n51P4L57K48j27m27q8M6N51
7652C38l24p9m94M31K99k35j81j1N0L75j88n2k05J63M41n34j64K10k6M42l72k29
7674c45r7M74J61j32k58r1L72P9k96j07M0M51O4k83k97K25M11j63k26l26K4O03
7696B83m5l33l74K04N39r9l26j5J99J60L30m54m11L2M39R5l87k50L78J41L7j43
7718@k54L7N24N4m73l13K90N89L5o31n76O05L63k85j5J0j40J36L66n51r0J51P50
7741E82j65n43K01k76N85k08l55j79J37N21P8o25p0L93L59l97l32j4J54L99k18
$$ plain form
7588 485 127 -464 47 355 197 53 -176 -153 46 190 317 -485 -36 122 338 102 -253 -56 21 -157 -215
7609 -215 -105 -122 235 360 -2 -294 -161 337 164 -23 -222 -42 379 237 71 -211 -243 19 204 -194 -490
7630 -490 -174 211 30 -498 -310 109 37 123 -27 -183 11 255 255 -296 -222 135 383 256 -171 -259 -213 338
7652 338 14 -65 -559 -128 171 -64 -245 -256 -206 169 -19 -71 -276 -113 328 -206 -370 -160 -186 256 -116 -345
7674 -345 -442 32 193 61 -197 -288 84 163 -133 -240 -200 251 315 32 -265 -40 371 208 -18 -344 -320 283
7696 283 238 -95 -469 -265 274 175 -151 -166 33 193 523 69 -342 -310 129 224 -163 -413 -35 106 143 0
7718 0 -254 -217 307 361 -112 -425 -135 454 489 -142 -718 -113 250 -35 -50 -40 -180 -44 322 -229 -319 -168 582
7741 582 417 -126 75 -201 384 176 -179 -358 -221 300 378 -247 -317 76 435 38 -294 -308 -154 245 27
7762B7l9o54N40M14p3l10l86M20K37l21Q3r8K75J8J45l64j48M62n2R2p12K98J63
7785A7L03m73J91j62J73K30n6m35k53O74J30n13k27L52K47J2j65l21K14L34J42
7806D14m17j55N8K21j11J39k52M6K51K1k73j06q3K3N60l6o16L59J91r7m54L3K74
7829a0R5Q0r0n02L46K63J36o03j63K33N97j94l83K04o8J72K68n41r4K10K01j04
7851E3j08l31K86L40m45M2R0K61l9L00n52m6N0N37k94j74j44P6L30j01l24m1J1
7874b23M70k83L5l91K89L65j74m00J63J27N2kj90k28J65O14On52m0K32QM3n24
7897d38J29N34k4j56k04j45K84K84k69j09L2K82K12m59l10L39K43lm7n21J58O24
7919D36l1k87k88M5P42k49k02m48l5L78L25m09r3J1MO66n56m16M35L4O4K4n41
$$ plain form
7762 27 -12 -666 -126 288 215 -95 -481 -61 176 -145 -62 -160 115 133 278 -86 -234 228 176 268 -444 -146 17
7785 17 320 -153 38 -124 49 279 223 -212 -465 209 339 -174 -401 -49 198 210 45 -276 -62 272 414
7806 414 -3 -158 -100 121 10 149 -103 -57 194 215 -58 -164 -247 -224 336 300 -316 43 234 137 -317 -284 -10
7829 -10 85 165 75 -427 -81 182 318 -285 -448 -215 382 188 -195 9 -59 113 381 -160 -254 -44 157 53
7851 53 -55 -386 -100 240 -205 -163 -73 188 149 449 -103 -149 -99 438 144 -30 -174 -98 232 131 -193 -234 -223
7874 -223 247 -36 -1 -392 -103 262 88 -312 -149 -22 30 28 -162 -390 -225 389 395 -157 -197 35 43 86 -438
7897 -438 -309 225 201 45 -159 -304 -20 264 -5 -114 -82 200 412 -47 -357 -18 225 222 175 -346 -188 436
7919 436 405 118 -170 -125 617 368 166 -282 -317 61 386 -23 -116 -105 -101 565 9 -407 28 62 126 150 -391
7942c91P9K89L23n19o3K41L87l76J39l50K47k0K99k73l11K78J26Q4J16m53m2M49
7964B59m1k35k02N3M90j8k49m18J13Q32m15l66q9L29M16m36Jl27R3K95J66n0o26
7987d25K67M29j51n06J46M20o9j3k12o5J06K32J39o82L66L0M92n68j07j4N66M
8009C85m44N8l11N28J93l6p68mO08j6k84j27RK8M00r5r3j72M0K49p1l82k7M77
8033A45L20n00j51Q3K42j26J26l78nM58J22k0o21K05p4N23k23m66o2M22N2l6n91
8056e55O01K76L6k56m11N46j3j83q0k77J25L79L4k67k05m2O26j67l99j74N21Q5
8078B00k6K20q99K91N23k63j65K3n1M13j48k49j51J29M77p8l67j92M99J17k87
8099A6j49j73M36m2j08j43M1L41m3K00o43j52O22q4J02l80j37L57j2J21l2k86
$$ plain form
7942 -391 -312 -23 300 -219 -282 -41 346 -30 109 -241 6 -14 285 12 -299 -21 105 189 305 -148 -190 259
7964 259 218 -17 -219 -166 324 306 57 -361 -248 584 169 -197 -286 43 459 23 24 -303 -210 85 251 201 -425
7987 -425 -158 271 120 -386 -240 180 111 98 -114 -179 -73 159 298 -384 -18 12 504 -64 -171 -185 381 385
8009 385 -59 -1 -312 216 409 373 -395 -399 209 193 -91 -218 -209 -181 219 124 31 -141 -101 148 77 -305 -332 145
8033 145 465 -35 -186 -103 139 13 139 -239 -244 214 336 316 -305 -100 -174 349 126 -340 -402 20 72 36 -555
8056 -555 46 322 358 102 -309 237 224 41 -39 -316 -191 188 222 -45 -250 -292 334 167 -232 -406 115 200
8078 200 174 394 -505 -214 309 46 -119 -96 -147 266 118 -131 -282 -153 324 246 -121 -313 186 303 16
8099 16 -133 -306 130 88 -20 -163 -122 219 176 376 -267 -419 203 119 221 -159 -296 61 49 170 138 -148
8121a48j31P47n29l67N17J21k8j34j03J40Q3j6o7m09m1M14L81l94l53J14N52j87
8143A62m80K73j14K24K66k85k61J7L00J69k35k32L28j44K28m32J26j17M81k95
8163b1J46l31m8N98J8l24l29K89J19Mj53j97J45nJ27m00j39L39K10K58j74l72
8185b40K06J11K43l36l32L25
$$ plain form
8121 -148 -279 468 -61 -428 89 210 182 48 -55 85 168 152 85 -324 -365 49 430 36 -317 -203 349 162
8143 162 -318 -45 -159 65 331 46 -215 -198 102 271 36 -196 132 -12 216 -216 -90 -207 274 -21
8163 -21 125 -206 -254 344 362 38 -291 -2 117 121 -32 -229 -84 -89 38 -362 -501 -162 48 306 132 -240
8185 -240 -34 77 320 -16 -348 -23
8191b3
$$ Imaginary data points
##PAGE= N=2
##DATA TABLE= (X++(I..I)), XYDATA
0@%%%%%%%%%qJ6j6J6k4L2l3M1n6P2q8J04j20J44j71J96k33K72l12L61m17M80n45
32b89O18p04P96q95J007j130J265j414J575j750J943k154K384k635K910l209L536
49A854l896M293m728N209n748O347p021P786q660R670j0854J2268j3986J6126
63H660j8882K2582k7846L5991n0409Q3562l04764o4950N29228N6461j48534j48412
75b7313J01026O1607q9962k14902K593K61877K43149j76466m18018j87303K46499
86a97213L06144N6291j24151k0064J15678O7982j57211k47912l6109K71253K31610
97B66298j26924l28572j01045K02580K00129k7934j24330Q644J64204R4536j53958
108G3628k62126l3424K46870J81319j41004k51827j5222K13411J42557q2901j54225
$$ plain form
0 0 0 0 0 0 0 0 0 0 0 -8 8 -8 8 -16 16 -17 24 -32 40 -48 56 -64 80 -91 105 -128 144 -168 193 -224 256 -289
32 -289 329 -375 421 -474 533 -597 668 -746 829 -921 1022 -1132 1252 -1383 1527 -1682 1854
49 1854 -2042 2251 -2477 2732 -3016 3331 -3690 4096 -4564 5106 -5748 6520 -7466 8660
63 8660 -10222 12360 -15486 20505 -29904 53658 -251106 -316056 213172 269633 121099 -27313
75 -27313 73713 135320 45358 -169544 -166951 94926 338075 161609 -256409 -443712 -197213
86 -197213 108931 165222 41071 21007 136685 204667 47456 -200456 -236565 34688 266298
97 266298 139374 -189198 -290243 -87663 112466 84532 -39798 -31154 133050 227586 73628
108 73628 -188498 -221922 24948 206267 65263 -186564 -201786 11625 154182 71281 -82944
119h2944O070J72739R8548j49778k21596J8434K40207J14577j74937k15339K6398
130a67621K08205J17675r4626j52669R152J61630O7143j61867j76422P7549K41588
141A29737P5914j81525j89947K9130J75338Q4226j02632j29402M5477J68053L3455
152A37824j81908j48494J06515K25118N2634j64654j53856L5487J44552L8653
162I1871j29856j12940Q7729J84773J7975j78285j17963J10300J83111J5705j57148
173d728j18493O4031J43189N215j61764j07166J10003J81983N476j54805p1064
184a08123J20562J44737k8760j73389j04174R0913J54157p375j64446q5455J14889
195d6464J44040k6259j32140k2645J40840J29193n6361j91985j04260R6967J44209
$$ plain form
119 -82944 -76874 95865 194413 44635 -176961 -158527 81680 196257 21320 -194019 -167621
130 -167621 40584 158259 63633 -89036 -79884 81746 148889 -12978 -189400 -111851 129737
141 129737 205651 24126 -165821 -136691 38647 122873 20241 -109161 -63684 104369 137824
152 137824 -44084 -192578 -86063 139055 191689 27035 -126821 -91334 53218 91871
162 91871 -37985 -150925 -63196 121577 139552 -38733 -156696 -46396 136715 152420 -4728
173 -4728 -123221 -59190 83999 89214 -72550 -179716 -69713 112270 117746 -37059 -108123
184 -108123 12439 157176 128416 -44973 -149147 -58234 95923 88548 -75898 -161353 -46464
195 -46464 97576 71317 -60823 -83468 57372 186565 130204 -61781 -166041 -69074 75135
206G5135j7885j38063l6688J24399J00612o5798j31129k313J54390J31020o1038
217A32642j90912r3635R4996J10608m5109j14136J4956J44379Q0126q9890j41552
228i7527m990J51934J25093o4600j72149n6628J03120P1723q2638j05391M6483
239h5570J56061P4534r4135j40730n591J42812J01546q0773j48658r547J17329
250B7278M1465j06084r8097N4536J47853O4029r1993j27185J1047J39626P1984
261A34459j02514j27075K6280J18331K1136j09241q4242N6771J32975M7891r8222
272A6549j14919L4289J42332M7149j15222j03854M7935J06901p2j08577p0797
283a18286O4747J29383L2380j13429j05942N6748J41094K3283j16641p4265O5679
$$ plain form
206 75135 57250 -80813 -117501 6898 107510 41712 -89417 -91730 62660 193680 132642
217 132642 -58270 -151905 -56909 53699 8590 -105546 -90590 53789 133915 44025 -97527
228 -97527 -102517 49417 174510 109910 -62239 -118867 -15747 55976 -26662 -132053 -85570
239 -85570 70491 145025 50890 -89840 -95431 47381 148927 68154 -80504 -90051 27278
250 27278 68743 -37341 -135438 -80902 66951 130980 38987 -88198 -77151 62475 134459
261 134459 31945 -95130 -68850 49481 70617 -38624 -122866 -66095 66880 114771 16549
272 16549 -98370 -64081 78251 125400 10178 -93676 -45741 61160 61088 -47489 -118286
283 -118286 -53539 75844 108224 -5205 -111147 -54399 86695 109978 -6663 -80928 -15249
294a5249R2175k2617j15293o4556P5248J32838J9182j22457q9127P5053J24581
305H9778o370j10252m1925Q0800P9559l7593j21873o1960Q1679J28444L999j19619
317c5333o0624Q8308R9635l2876j02367j9060Q7855P3814m4677j25144n6626Q8564
329c8531J16268j6695j12826k8834R9108P6692n2062r6922o190R2387P1391n3131
341E0655j27874m3651R8315R9056l9264j03271K94J04206N6510o5036r2377M212
353e8225R8553O7271o4312j27625k5032J04821P6182n7746q7336K4232J02946
364E3729L8236p4464q8417J3640J05501O1297p5489j20156m484J02293M8787o9713
376i240o8741M2696R9029K5868q0480q6630K2448J09489N0150q4589j03440J7194
$$ plain form
294 -15249 76926 54309 -60984 -125540 -50292 82546 101728 -20729 -109856 -34803 89778
305 89778 83408 -26844 -68769 12031 91590 53997 -67876 -129836 -48157 80287 84286 -35333
317 -35333 -95957 -7649 91986 59110 -43257 -62317 25538 99352 54675 -70469 -127095 -38531
329 -38531 77737 61042 -51784 -80618 18490 95182 43120 -53802 -59992 32395 103786 50655
341 50655 -77219 -120870 -22555 76501 37237 -66034 -65740 38466 94976 29940 -62437 -58225
353 -58225 40328 107599 43287 -84338 -109370 -4549 71633 13887 -73449 -49217 53729
364 53729 91965 17501 -70916 -57276 48225 109522 34033 -86123 -90607 11686 60473 -9240
376 -9240 -77981 -35285 63744 89612 9132 -77498 -55050 54439 104589 20000 -83440 -66246
388f6246R4253K0908p8613n4299N5001R9891J9217q6505q3530L3987J09448L0809
400I4321r3031q2741L8619Q6773j229q6692m7231O3059J01550J3645r1866p3746
412g8569M9573J03556O159r8886o0682N4952P7120j6504q9208m1297O9140R8960
424G4314K822r5021n6020O5763R1679j6713r8839m1295O2596O7938k5583q8848
436e7207l4523P4391R2297j1864r4564l4251P8511P5836l5353r5416k7371O6324
448c190O2158l1914q9019k5401Q1736Q1433l0282r1454j1514Q7946O2237m9272
460D3464r2754j9502P0351N9118l7952q8044j2493Q7771O4451n0046q4687J0659
472d9664R3924N1235n6658r0510j3987P1623N2607m6367q1453P201R1096M2125
$$ plain form
388 -66246 28007 48915 -29698 -83997 -28996 70895 90112 3607 -79923 -45936 63512 94321
400 94321 1290 -81451 -42832 43941 42712 -43980 -91211 -28152 73398 87043 -4823 -78569
412 -78569 -28996 74560 80719 -18167 -78849 -23897 53223 36719 -52489 -93786 -24646 74314
424 74314 77136 -17885 -73905 -8142 83537 66824 -32015 -73310 -10714 57224 31641 -57207
436 -57207 -91730 -17339 74958 63094 -31470 -65721 12790 88626 53273 -42143 -69514 -3190
448 -3190 58968 27054 -61965 -87366 -5630 75803 45521 -45933 -57447 30499 92736 43464
460 43464 -49290 -68792 1559 60677 22725 -65319 -77812 9959 74410 24364 -60323 -49664
472 -49664 44260 95495 38837 -51673 -65660 5963 58570 12203 -69250 -62049 29047 71172
484G1172o7654p6083K6469R5546M4492n6986q4466r380O9644L8832n6741o9971
496g5126K9704R2496K1024p8624o7581L3716R2112M0877n4793p6936J247O8020
508B6136J9651p1584n7253N0611R1939O909q3444o1614L6370Q8739L5247n6866
520B4841o7380J8074O7799l124q5090m4562O5699Q8455l501q2239n4839L8832
532c7035Q4073K5781o1197n3420L6709O3121k4949r2171l0938P3594Q0113q033
544E5648p7102m8428M0971P7801J2058o5092l5621N2966N5040m3287r2400j9471
556h6917P4036P2872r906p1763l9632M5177O8199p530o9117j5583O9497M6608
568G5941n5344q9895j3723P0785O6833j2262o7485k7386N4840N6829l0900p2943
$$ plain form
484 71172 3518 -72565 -46096 49450 93942 36956 -47510 -56890 12754 51586 -5155 -75126
496 -75126 -45422 47074 68098 -10526 -78107 -44391 47721 88598 33805 -43131 -41884 26136
508 26136 45787 -25797 -83050 -32439 59500 66409 -17035 -78649 -42279 46460 81707 24841
520 24841 -42539 -24465 43334 40210 -44880 -89442 -23743 64712 61211 -21028 -75867 -37035
532 -37035 47038 72819 11622 -41798 -5089 58032 33083 -59088 -90026 -16432 63681 55648
544 55648 -21454 -69882 -28911 48890 60948 -4144 -39765 13201 68241 24954 -67446 -86917
556 -86917 -12881 59991 50085 -21678 -61310 -16133 52066 44536 -24581 -40164 29333 75941
568 75941 20597 -69298 -83021 -12236 54597 42335 -25150 -52536 2304 59133 28233 -44710
580d4710K712P9936M0064n8301q2508q820O4761N5959k1454o4763q674O7915M4715
593F6832n0663p2639J5086P9653L2324n4753o9396j782O1631M1667l6813o4283
605e3136Q320P7661L4888n9363o4152K1991P1230K1999n2067n7618R031O3821
617B2605L0015n3052o4292K1342P9558K2781o0027m9635L0328O4152J1718n6662
629a169n3305K0436O8994J8971o5482n7614L3102P3432Q952n9365l4795L9690
641h153O2718L437o3571n1840K9131O8431M542p0187m3854M4763O5955l117n8457
654b0202k6668M4929O1723k188o6459m4663L7523N9976j3131p1904k8972N3754
666a6282O0277q476n5574k1155M5554N5826j1656o8244l1154M9083N1503k8217
$$ plain form
580 -44710 -41998 37938 78002 19701 -62807 -71627 -6866 49093 27639 -37124 -45798 22117 66832
593 66832 16169 -56470 -41384 38269 70593 15840 -53556 -55338 6293 47960 11147 -53136
605 -53136 -44816 32845 67733 8370 -55782 -33791 37439 59438 7371 -50247 -41216 22605
617 22605 52620 -432 -64724 -43382 36176 58957 -1070 -50705 -20377 43775 55493 -1169
629 -1169 -54474 -34038 34956 53927 -11555 -69169 -36067 37365 46317 -13048 -47843 -8153
641 -8153 54565 58002 -5569 -57409 -28278 40153 44695 -25492 -69346 -24583 41372 38255 -20202
654 -20202 -46870 -1941 59782 57594 -8865 -53528 -16005 43971 30840 -41064 -70036 -16282
666 -16282 43995 35519 -20055 -41210 4344 60170 48514 -19730 -50884 -1801 49702 21485
678B1485p1855j8533N5934N4914j0013n0193j3593M9815M7029k9081p3102j7217
690e4410N9546M6674l4195o6365j1366N3172M5746j7308m7932k26O0590M0053
702G3979m6091p6543p603O1867L9126l4336n3969q09N1493L3960l0582n1088J0985
715b9611O9916L4683n2262o9877P4N4634K5785l4649m2353J1746N6130K6276m5012
728E480n5891J6610P0659K6536n1296n4005J1335M8220J3059m0977l9893K1279
740b8884O2904K2119n3931n4012K3271O3556J2077n1092l8002K4366M9049O330
752C7751m9104m2275K5553O3920J2676n7889m1592L4725N6336j977n3217k8776
764d3869L1399N1133M030n2312m0033L0565N7057m063o1221k6813M5699N2905
$$ plain form
678 21485 -50370 -68903 -12969 41945 31932 -18261 -31854 17961 64990 35909 -37193 -54410
690 -54410 5136 51810 17615 -48750 -60116 -6944 38802 21494 -26438 -26664 33926 73979
702 73979 27888 -48655 -56258 5609 44735 10399 -43570 -44379 7114 41074 10492 -40596 -29611
715 -29611 40305 74988 22726 -47151 -47077 7557 33342 -1307 -43660 -31914 24216 50492 5480
728 5480 -50411 -33801 36858 63394 12098 -41907 -30572 17648 30707 -10270 -50163 -28884
740 -28884 34020 56139 2208 -51804 -28533 35023 47100 -3992 -41994 -17628 31421 37751
752 37751 -11353 -53628 -28075 35845 48521 -9368 -50960 -16235 40101 38124 -15093 -43869
764 -43869 -12470 38663 42693 -9619 -49652 -19087 37970 33907 -27314 -54127 -8428 44477
776D4477q666n0330k4896L2059M7331k462n3754k9892M1280M9840k0972o4301
788d0286j7566N0406M8904p721m3650j8692L2617M0163j6245o0035j7538N3522
800C879M6337l0133o2066j1180M6801M1188r171l8140q287M1105L4971l4005o6992
813d5693r118N9751M0129l1247n1743k922M2752L1442j7018l8572J975N1995L1224
826F2955m5165o7771j902N6372K9386l0542l9072P246M2673K4511k7566m2560
838c1435P838N8475K5712m9509n8949P691M9857J7045l2806l2201J4373M6921
850B3012K1149l5814m4479J4950N7532J4908n2205m5707J8008M5816Q975l5879
862i734l0630J8239M9712J6164m2585l9454K5545N4345J461n4368l5873K4931
$$ plain form
776 44477 35811 -14519 -39415 -7356 39975 37513 -16241 -46133 -4853 44987 24015 -40286
788 -40286 -57852 -7446 41458 33737 -9913 -28605 4012 44175 27930 -32105 -49643 3879
800 3879 50216 20083 -41983 -53163 -6362 34826 25655 -12485 -20772 20333 55304 21299 -45693
813 -45693 -54811 4940 45069 13822 -37921 -40843 1909 33351 16333 -22239 -20264 31731 62955
826 62955 17790 -49981 -51883 4489 33875 3333 -35739 -28493 14180 38691 11125 -31435
838 -31435 -23597 34878 60590 11081 -47868 -40177 9680 26725 -6081 -38282 -23909 23012
850 23012 44161 8347 -36132 -21182 36350 51258 -947 -46654 -28646 17170 26145 -9734
862 -9734 -40364 -22125 27587 43751 1166 -38288 -12743 41602 43063 -11305 -47178 -22247
874b2247M3933N590l7988k9402K2976M8765N718m8070l0140L5762N0586p442n2971
887a4930k8375K6504M0478P99l8958k4207K9855M5978o301n1802k1633M1722M5284
900D4414j1196m7987k1278K7599L6240o715m3595j8729L8565M3317j5328n1699
912b6392j2811M2731L7335j4889m3555j4244L2308L4410j6619m9058j2691M4736
924A261L8394k2065m6243l311M2753K9811k1029m2994q154L9810L2743k5097n0754
$$ plain form
874 -22247 21686 27276 -10712 -40114 -17138 31627 37345 -10725 -40865 -5103 45483 38041 -14930
887 -14930 -43305 -16801 23677 24476 -14482 -38689 -8834 37144 30843 -20959 -42592 -870 44414
900 44414 33218 -14769 -36047 -8448 27792 21077 -22518 -41247 -2682 40635 25307 -26392
912 -26392 -39203 3528 40863 25974 -17581 -31825 483 34893 18274 -30784 -43475 1261
924 1261 39655 17590 -28653 -31964 10789 40600 19571 -23423 -31577 8233 40976 15879 -34875
$$ [...]
8191a46
##END NTUPLES=NMR FID
##END=
