##TITLE=1H_Pr 5219
 D2O
 8 sc, 
 15.3.2024
##JCAMPDX= 6.0         $$ Bruker NMR JCAMP-DX V2.0
##DATA TYPE= NMR FID
##DATA CLASS= NTUPLES
##ORIGIN= UXNMR, Bruker Analytische Messtechnik GmbH
##OWNER= root
$$ XWIN-NMR		Version 3.5
$$ Fri Mar 15 14:51:51 2024 Russian Standard Time (UT+4h)  she@DPX200
##.OBSERVE FREQUENCY= 200.1313
##.OBSERVE NUCLEUS= ^1H
##.DELAY= (6, 6)
##.ACQUISITION MODE= SIMULTANEOUS
##.ACQUISITION SCHEME= undefined
##.AVERAGES= 8
##.DIGITISER RES= 18
##SPECTROMETER/DATA SYSTEM= spect
##.PULSE SEQUENCE= zg30
##.SOLVENT NAME= D2O
##.SHIFT REFERENCE= (INTERNAL, D2O, 0, 15.7039)
##AUDIT TRAIL= $$ (NUMBER, WHEN, WHO, WHERE, WHAT)
$$ ##TITLE= Audit trail, XWIN-NMR		Version 3.5
$$ ##JCAMPDX= 5.01
$$ ##ORIGIN= Bruker BioSpin GmbH
$$ ##OWNER= she
$$ F:/spectra/data/she/nmr/H-F/1/audita.txt
$$ ##AUDIT TRAIL=  $$ (NUMBER, WHEN, WHO, WHERE, WHAT)
(   1,<2024-03-15 14:50:36.60 +0400>,<she>,<DPX200>,
      <created by zg, POWCHK disabled, PULCHK disabled
       configuration hash MD5:
       00 E9 B6 7A A2 85 ED C7 34 08 36 98 17 FE 4E 26
       data hash MD5: 16K
       4E 38 C1 9E 48 15 F5 EB FF C9 D7 04 33 C4 35 23>)
$$ ##END=
$$ 
$$ hash MD5
$$ B5 EF 3B 6B FF 9D 6C 19 F6 F1 DD 3E DF B5 D2 1C
##$RELAX= 
##$RELAX= 
##$RELAX= 
##$RELAX= 
##$RELAX= 
##$RELAX= 
$$ Bruker specific parameters
$$ --------------------------
##$DU= <F:/spectra>
##$EXPNO= 1
##$NAME= <H-F>
##$PROCNO= 1
##$TYPE= <nmr>
##$USER= <she>
##$AMP= (0..31)
100 100 100 100 100 100 100 100 100 100 100 100 100 100 100 100 100 100 
100 100 100 100 100 100 100 100 100 100 100 100 100 100 
##$AQSEQ= 0
##$AQ_mod= 1
##$AUNM= <au_zg>
##$AUTOPOS= <>
##$BF1= 200.13
##$BF2= 200.13
##$BF3= 200.13
##$BF4= 200.13
##$BF5= 200.13
##$BF6= 200.13
##$BF7= 200.13
##$BF8= 200.13
##$BYTORDA= 1
##$CFDGTYP= 0
##$CFRGTYP= 5
##$CHEMSTR= <none>
##$CNST= (0..31)
1 1 145 1 1 1 1 1 1 1 1 1 1 1 1 1 1 1 1 1 1 1 1 1 1 1 1 1 1 1 1 1 
##$CPDPRG= <>
##$CPDPRG1= <>
##$CPDPRG2= <>
##$CPDPRG3= <>
##$CPDPRG4= <mlev>
##$CPDPRG5= <mlev>
##$CPDPRG6= <mlev>
##$CPDPRG7= <mlev>
##$CPDPRG8= <mlev>
##$CPDPRGB= <>
##$CPDPRGT= <>
##$D= (0..31)
0 1.2 0 0 0 0 0 0 0 0.06 0 0.03 0 0 0 0 0.0002 0 0 0 0 0 0 0 0 0 0 0 0 
0 0 0 
##$DATE= 1710499835
##$DBL= (0..7)
120 120 120 120 120 120 120 120 
##$DBP= (0..7)
150 150 150 150 150 150 150 150 
##$DBP07= 0
##$DBPNAM0= <>
##$DBPNAM1= <>
##$DBPNAM2= <>
##$DBPNAM3= <>
##$DBPNAM4= <>
##$DBPNAM5= <>
##$DBPNAM6= <>
##$DBPNAM7= <>
##$DBPOAL= (0..7)
0.5 0.5 0.5 0.5 0.5 0.5 0.5 0.5 
##$DBPOFFS= (0..7)
0 0 0 0 0 0 0 0 
##$DE= 6
##$DECBNUC= <off>
##$DECIM= 32
##$DECNUC= <off>
##$DECSTAT= 4
##$DIGMOD= 1
##$DIGTYP= 9
##$DL= (0..7)
0 120 120 120 120 120 120 120 
##$DP= (0..7)
150 150 150 150 150 150 150 150 
##$DP07= 0
##$DPNAME0= <>
##$DPNAME1= <>
##$DPNAME2= <>
##$DPNAME3= <>
##$DPNAME4= <>
##$DPNAME5= <>
##$DPNAME6= <>
##$DPNAME7= <>
##$DPOAL= (0..7)
0.5 0.5 0.5 0.5 0.5 0.5 0.5 0.5 
##$DPOFFS= (0..7)
0 0 0 0 0 0 0 0 
##$DQDMODE= 0
##$DR= 18
##$DS= 0
##$DSLIST= <SSSSSSSSSSSSSSS>
##$DSPFIRM= 0
$$ [...]
##$SUBNAM2= <"">
##$SUBNAM3= <"">
##$SUBNAM4= <"">
##$SUBNAM5= <"">
##$SUBNAM6= <"">
##$SUBNAM7= <"">
##$SUBNAM8= <"">
##$SUBNAM9= <"">
##$SW= 18.0517328524113
##$SWIBOX= (0..15)
0 0 2 0 0 0 0 0 0 0 0 0 0 0 0 0 
##$SW_h= 3612.71676300578
##$TD= 16384
##$TD0= 1
##$TE= 0
##$TE2= 300
##$TE3= 300
##$TEG= 300
##$TL= (0..7)
0 120 120 120 120 120 120 120 
##$TP= (0..7)
150 150 150 150 150 150 150 150 
##$TP07= 0
##$TPNAME0= <>
##$TPNAME1= <>
##$TPNAME2= <>
##$TPNAME3= <>
##$TPNAME4= <>
##$TPNAME5= <>
##$TPNAME6= <>
##$TPNAME7= <>
##$TPOAL= (0..7)
0.5 0.5 0.5 0.5 0.5 0.5 0.5 0.5 
##$TPOFFS= (0..7)
0 0 0 0 0 0 0 0 
##$TUNHIN= 0
##$TUNHOUT= 0
##$TUNXOUT= 0
##$USERA1= <user>
##$USERA2= <user>
##$USERA3= <user>
##$USERA4= <user>
##$USERA5= <user>
##$V9= 5
##$VALIST= <valist>
##$VCLIST= <CCCCCCCCCCCCCCC>
##$VD= 0
##$VDLIST= <DDDDDDDDDDDDDDD>
##$VPLIST= <PPPPPPPPPPPPPPP>
##$VTLIST= <TTTTTTTTTTTTTTT>
##$WBST= 1024
##$WBSW= 4
##$XGAIN= (0..3)
0 0 0 0 
##$XL= 0
##$YL= 0
##$YMAX_a= 278560
##$YMIN_a= -197398
##$ZGOPTNS= <>
##$ZL1= 120
##$ZL2= 120
##$ZL3= 120
##$ZL4= 120
##$ABSF1= 10
##$ABSF2= 0
##$ABSG= 5
##$ABSL= 3
##$ALPHA= 0
##$AQORDER= 0
##$ASSFAC= 0
##$ASSFACI= 0
##$ASSFACX= 0
##$ASSWID= 0
##$AUNMP= <proc_1d>
##$AZFE= 0.1
##$AZFW= 0.1
##$BCFW= 1
##$BC_mod= 2
##$BYTORDP= 1
##$COROFFS= 0
##$CY= 11.3945322036743
##$DATMOD= 1
##$DC= 2
##$DFILT= <>
##$DTYPP= 0
##$F1P= 15.7292609196834
##$F2P= 12.9074282941183
##$FCOR= 0.5
##$FTSIZE= 0
##$FT_mod= 4
##$GAMMA= 1
##$GB= 0.15
##$INTBC= 1
##$INTSCL= 1
##$ISEN= 128
##$LB= 0.24
##$LEV0= 0
##$LPBIN= 0
##$MAXI= 10000
##$MC2= 0
##$MEAN= 0
##$ME_mod= 0
##$MI= 1.114404
##$NCOEF= 0
##$NC_proc= 0
##$NLEV= 6
##$NOISF1= 3.799351
##$NOISF2= 2.8
##$NSP= 1
##$NTH_PI= 0
##$NZP= 0
##$OFFSET= 15.70392
##$PC= 1
##$PHC0= -25471.12
##$PHC1= 8.58731
##$PH_mod= 1
##$PKNL= yes
##$PPARMOD= 0
##$PSCAL= 0
##$PSIGN= 0
##$REVERSE= no
##$SF= 200.130013532006
##$SI= 16384
##$SIGF1= 3
##$SIGF2= 2
##$SINO= 400
##$SIOLD= 16384
##$SREGLST= <1H.CDCl3>
##$SSB= 0
##$STSI= 0
##$STSR= 0
##$SW_p= 3612.71676300578
##$SYMM= 0
##$S_DEV= 0
##$TDeff= 0
##$TDoff= 0
##$TI= <>
##$TILT= no
##$TM1= 0
##$TM2= 0
##$TOPLEV= 0
##$USERP1= <user>
##$USERP2= <user>
##$USERP3= <user>
##$USERP4= <user>
##$USERP5= <user>
##$WDW= 1
##$XDIM= 8192
##$YMAX_p= 0
##$YMIN_p= 0
$$ End of Bruker specific parameters
$$ ---------------------------------
##NTUPLES= NMR FID
##VAR_NAME=  TIME,          FID/REAL,        FID/IMAG
##SYMBOL=    X,             R,               I
##VAR_TYPE=  INDEPENDENT,   DEPENDENT,       DEPENDENT
##VAR_FORM=  AFFN,          ASDF,            ASDF
##VAR_DIM=   8192,          8192,            8192
##UNITS=     SECONDS,       ARBITRARY UNITS, ARBITRARY UNITS
##FACTOR=    0.0002768,     1,               1
##FIRST=     0,             0,               0
##LAST=      2.2672688,     0,               0
##MIN=       0,             -197398,         0
##MAX=       2.2672688,     278560,          0
$$ Real data points
##PAGE= N=1
##DATA TABLE= (X++(R..R)), XYDATA
0 0 0 0 0 0 0 0 0 0 0 0 0 0 0 0 0 0 0 0 0 0 0 0 6 -6 8 -8 8 -8 8 -14 14 -16 20 -22 24 -28 30 -36 38 -44 48 -54 58
43 58 -66 74 -82 89 -98 109 -121 132 -143 158 -177 195 -216 237 -263 293 -327 367 -415 469 -541
64 -541 630 -745 894 -1071 1090 2465 127704 194908 113348 -12799 -114503 -135978 -90568
77 -90568 -31635 -4874 20265 65386 106119 112039 88909 35995 -38662 -102743 -130187 -129488 -95333
90 -95333 -16384 76720 126958 121547 82725 30602 -14916 -37793 -56728 -88996 -102133 -54851
102 -54851 33490 107405 123958 66888 -35645 -108359 -100342 -39455 19421 58205 78344 76777
114 76777 54663 11345 -56347 -118742 -122438 -61064 14088 61821 79639 75549 60109 44698
126 44698 20294 -27842 -79160 -96217 -75869 -39385 2499 43306 70597 80672 71425 29718
138 29718 -37354 -85848 -80804 -33809 21719 57642 55631 22592 -9262 -24171 -37052 -53094
150 -53094 -52122 -20193 33437 86156 106541 72443 3090 -54754 -78703 -78188 -63105 -35606 -798
163 -798 36716 68618 75286 48306 11003 -10402 -19871 -32237 -46223 -49842 -32136 9319 54021
176 54021 65630 32654 -16135 -47281 -49782 -28381 3521 29709 44938 52715 45499 11649 -37869
189 -37869 -74252 -78247 -49786 -3207 37013 53939 53811 49696 37882 9134 -29948 -60633 -67260
202 -67260 -44506 -4256 27682 36649 31480 25517 17905 3254 -16860 -33525 -34215 -13250 16179
215 16179 31687 26940 14003 2110 -10752 -26961 -41746 -43974 -21331 23737 65613 75517 47807
228 47807 1669 -38459 -57219 -53793 -38235 -18537 5413 31709 48786 46524 27329 2005
240 2005 -18454 -27896 -28290 -25235 -17368 313 23629 37350 29632 3234 -25905 -39058 -28654
253 -28654 -4909 15243 24736 27749 28081 22519 6048 -20564 -45470 -52912 -36923 -7170 21618
266 21618 40763 48380 43383 24889 -4823 -36352 -54234 -46741 -17534 15008 32654 30671 18143
279 18143 6244 -1137 -7970 -17370 -24196 -19625 -1881 20022 33314 30310 13623 -7731 -25614
292 -25614 -35893 -36088 -23377 1531 30156 48246 45621 23620 -5096 -26624 -35311 -34184 -27684
305 -27684 -15775 3818 27425 43870 41751 19798 -10114 -32113 -37218 -27292 -10212 7229 21511
318 21511 29366 26983 12282 -9946 -28781 -33780 -23180 -4600 12684 23785 29087 28657 19835
331 19835 821 -23840 -42768 -44880 -27440 1008 26999 40742 39975 27657 7903 -14578 -33282
344 -33282 -40078 -30780 -9365 13695 28089 29844 21858 9379 -4634 -18698 -29283 -29746 -16011
357 -16011 8055 30529 39210 29568 7978 -14723 -30127 -34991 -29337 -14786 5539 25966 38313
370 38313 36427 20554 -1791 -21557 -32966 -34255 -25900 -9363 11958 31325 39520 31089 8967
383 8967 -15969 -32235 -33849 -22609 -5153 11777 24175 29441 24748 10118 -9587 -26328 -32890
396 -32890 -26448 -10261 8882 24398 32519 30653 17634 -3425 -25154 -38046 -35859 -18849 4700
409 4700 24305 33252 30943 19583 2707 -14885 -28181 -32429 -24798 -7058 13353 27592 30948
422 30948 23256 7682 -10404 -24902 -30822 -25532 -9564 11268 27678 32316 24383 7686 -10878
435 -10878 -24585 -29585 -25459 -13204 4507 21897 31845 30116 17310 -2035 -20438 -30651 -29831
448 -29831 -19265 -2090 16260 28941 30662 20680 2952 -15418 -27090 -27796 -18851 -4243 11499
461 11499 23588 27550 21717 7745 -9875 -24511 -29669 -23263 -8547 8973 23310 29350 24702
474 24702 11268 -6187 -21830 -29511 -25851 -12852 4185 19159 27206 25426 15000 -287 -15709
487 -15709 -25936 -26785 -17387 -1641 14692 25405 26678 17863 2880 -12794 -23996 -26665 -19349
500 -19349 -4641 11524 23352 26528 19927 6319 -9245 -21249 -25994 -21576 -9179 6585 19986
513 19986 26220 22797 10920 -4852 -18638 -25482 -23182 -12345 2855 16850 24693 23407 13646
526 13646 -1085 -15210 -23627 -23543 -15065 -1040 13402 22949 24196 16547 2811 -11882 -22088 -24221
540 -24221 -17586 -4805 9776 20767 24278 18824 6531 -8075 -19659 -23826 -19228 -7870 6170
553 6170 18022 23415 20116 9439 -4695 -17108 -23149 -20595 -10664 2955 15336 22553 21593 12826
567 12826 -809 -14180 -22506 -22518 -14069 -590 12793 21315 22161 15168 2642 -10588 -19994 -22194
581 -22194 -16136 -4126 9054 18740 21564 16788 5966 -6940 -17446 -21949 -18482 -7718 6156
594 6156 17676 22337 18638 8251 -4984 -16043 -21275 -19224 -10492 2343 14413 21223 20243 12019
608 12019 -521 -12760 -20258 -20445 -13672 -1629 11163 19837 20799 14138 2345 -10171 -18489 -19781
622 -19781 -14147 -3875 7912 17112 20156 15847 5673 -6959 -17151 -20765 -16523 -6532 5473
635 5473 15661 20281 17679 8948 -3120 -14566 -20702 -18809 -9981 2065 13122 19222 18346 11020
649 11020 42 -11067 -18295 -18622 -11993 -1140 9779 17216 18295 12716 2855 -8110 -16745 -19352
663 -19352 -14471 -3884 8118 17001 19279 14396 4379 -6494 -14826 -18243 -15374 -7052 3809 13531
677 13531 18643 16942 8667 -2744 -12797 -18113 -17013 -9483 1334 11507 17580 17011 10085 -673
691 -673 -10678 -16378 -16186 -10340 -980 8643 15434 16964 12270 2671 -8171 -15899 -17608 -12709 -3222
706 -3222 7185 14874 17258 13705 5120 -5455 -14024 -17419 -14422 -6073 4239 12763 16437 14329
720 14329 7292 -2348 -11164 -15985 -14965 -8468 1269 10575 15849 15084 8887 -484 -9656 -15402 -15484 -9876
736 -9876 -537 8994 15148 15511 10248 1547 -7443 -13783 -15280 -11581 -3834 5580 13284 16110 12937
751 12937 4756 -4979 -12769 -15625 -12696 -5279 3844 11470 14836 12806 6149 -2564 -10340 -14290 -13154
766 -13154 -7301 1176 9269 14215 13957 8485 -281 -9051 -14410 -14291 -8846 -335 8114 13382 13910 9562
782 9562 1894 -6393 -12574 -14192 -10558 -3007 5599 12055 14081 11028 3965 -4451 -11211 -13919 -11467
797 -11467 -4834 3565 10647 13699 11702 5426 -2665 -9745 -13320 -12069 -6405 1535 8990 13181 12463
812 12463 7214 -596 -8183 -12680 -12664 -8054 -514 7173 12337 12992 8792 1387 -6423 -11864 -12861 -9119
828 -9119 -2241 5346 10982 12718 9780 3334 -4399 -10480 -12677 -10314 -4131 3442 9831 12581 10719
843 10719 4962 -2573 -9210 -12421 -11083 -5737 1667 8375 12092 11271 6497 -624 -7478 -11672 -11565
858 -11565 -7266 -430 6692 11228 11662 7942 1207 -5850 -10765 -11768 -8456 -2105 4971 10243 11750
873 11750 8905 2848 -4097 -9618 -11604 -9316 -3724 3229 8958 11483 9761 4510 -2338 -8335 -11276
888 -11276 -10079 -5196 1528 7637 11001 10268 5862 -739 -6970 -10677 -10555 -6453 -109 6243 10276
903 10276 10571 6975 935 -5432 -9848 -10583 -7522 -1726 4666 9396 10673 7990 2463 -3997 -8852
918 -8852 -10562 -8316 -3126 3165 8329 10458 8706 3801 -2439 -7752 -10255 -9018 -4378 1644 7073
933 7073 9996 9218 5117 -845 -6546 -9797 -9476 -5724 112 5854 9405 9523 6209 647 -5179 -9091
949 -9091 -9641 -6617 -1246 4540 8583 9553 7046 1996 -3673 -8113 -9600 -7467 -2713 3139 7660 9530
965 9530 7794 3253 -2480 -7247 -9371 -8101 -3784 1802 6735 9192 8306 4376 -1136 -6069 -8968
980 -8968 -8457 -4957 338 5553 8657 8620 5471 308 -5000 -8460 -8698 -5866 -832 4412 8000 8690
996 8690 6135 1485 -3785 -7606 -8690 -6564 -2053 3185 7221 8663 6892 2693 -2530 -6824 -8641
1011 -8641 -7254 -3198 2106 6461 8550 7417 3618 -1410 -5923 -8290 -7631 -4195 696 5391 8072
1026 8072 7748 4582 -146 -4803 -7785 -7897 -5129 -494 4278 7481 7976 5457 928 -3877 -7197 -7908
1042 -7908 -5708 -1562 3279 6806 7849 6056 2127 -2750 -6504 -7941 -6440 -2594 2187 6075 7807
1057 7807 6710 3232 -1558 -5714 -7766 -6955 -3635 1120 5253 7473 6937 3987 -454 -4671 -7150
1072 -7150 -7111 -4394 -133 4284 6999 7153 4725 560 -3796 -6734 -7223 -5076 -1078 3415 6637 7336
1088 7336 5371 1492 -2937 -6220 -7223 -5590 -2120 2175 5756 7186 6041 2625 -1715 -5394 -7104
1103 -7104 -6126 -3051 1178 4920 6956 6324 3395 -807 -4673 -6783 -6301 -3580 453 4187 6419 6335
1119 6335 4038 175 -3792 -6435 -6752 -4456 -561 3479 6208 6732 4808 1167 -2876 -5870 -6784 -5150
1135 -5150 -1576 2510 5497 6505 5162 2028 -1765 -4927 -6344 -5401 -2443 1433 4759 6389 5584
1150 5584 2717 -1183 -4570 -6254 -5740 -3146 697 4296 6332 5932 3441 -306 -3924 -5997 -5899 -3819
1166 -3819 -411 3232 5688 6162 4411 1011 -2804 -5517 -6109 -4440 -1233 2456 5144 5965 4536 1540
1182 1540 -2199 -5031 -5900 -4590 -1621 1891 4603 5766 4837 2210 -1253 -4442 -6115 -5389 -2738 940
1198 940 4305 6030 5485 2986 -523 -3792 -5711 -5536 -3254 92 3396 5434 5415 3409 346 -2750
1214 -2750 -4917 -5434 -3860 -821 2653 5083 5709 4073 782 -2674 -5020 -5559 -4133 -1238 2162 4771
1230 4771 5640 4473 1687 -1735 -4413 -5531 -4708 -2279 1012 3906 5500 5136 2798 -703 -3837 -5499
1246 -5499 -5004 -2668 573 3497 5006 4791 2889 -162 -3099 -4942 -4951 -3162 -205 2889 4810 5137
1262 5137 3598 804 -2539 -4918 -5591 -4087 -1035 2423 4906 5446 3981 1270 -1788 -4249 -5150 -4208
1278 -4208 -1889 1255 3834 5069 4394 2120 -968 -3698 -5059 -4649 -2421 734 3631 5114 4672 2366
1294 2366 -723 -3472 -4891 -4605 -2699 120 2913 4761 4931 3371 505 -2649 -4770 -5113 -3618 -804
1310 -804 2241 4475 5063 3816 1134 -1957 -4382 -4990 -3733 -1208 1716 3968 4763 3782 1549 -1313
1326 -1313 -3745 -4829 -4149 -1939 1051 3658 4928 4426 2379 -684 -3413 -4992 -4721 -2622 407 3321
1342 3321 4824 4558 2669 -19 -2625 -4222 -4500 -3088 -600 2121 4182 4759 3545 796 -2160 -4342
1358 -4342 -4869 -3556 -897 2040 4193 4706 3528 1057 -1698 -3749 -4511 -3782 -1669 1028 3443 4713
1374 4713 4272 2231 -767 -3415 -4868 -4313 -2288 650 3221 4594 4267 2534 -181 -2751 -4271 -4176
1390 -4176 -2702 -138 2426 4101 4367 2999 519 -2164 -4212 -4571 -3223 -767 2090 4113 4594 3391
1406 3391 990 -1761 -3780 -4526 -3534 -1307 1416 3557 4425 3679 1690 -986 -3191 -4379 -3891 -2012
1422 -2012 626 3093 4363 4145 2263 -430 -2919 -4273 -3998 -2297 252 2683 4022 4060 2615 122
1438 122 -2329 -3988 -4186 -2919 -620 2021 3825 4309 3145 854 -1797 -3740 -4353 -3335 -1024 1559
1454 1559 3536 4202 3383 1293 -1188 -3246 -4184 -3554 -1700 798 3028 4128 3707 1988 -542 -2884
1470 -2884 -4140 -3843 -2130 307 2666 4100 3853 2333 -80 -2452 -3871 -3913 -2559 -310 2133 3711
1486 3711 3976 2815 604 -1815 -3696 -4087 -3038 -911 1604 3510 4083 3179 1125 -1325 -3316 -4092
1502 -4092 -3313 -1369 1057 3057 3916 3406 1636 -681 -2833 -3855 -3578 -1908 486 2709 3927 3725
1518 3725 2136 -266 -2500 -3835 -3745 -2368 -6 2324 3720 3881 2582 280 -2021 -3558 -3868 -2782
1534 -2782 -721 1605 3379 3879 3062 965 -1432 -3261 -3851 -3132 -1202 1210 3085 3886 3238 1433
1550 1433 -995 -2993 -3833 -3278 -1605 680 2692 3782 3520 2009 -255 -2508 -3778 -3750 -2314 32
1566 32 2313 3719 3734 2425 309 -2010 -3528 -3722 -2587 -534 1751 3342 3646 2666 721 -1369 -3092
1583 -3092 -3654 -2937 -1070 1187 3127 3857 3093 1204 -1078 -2961 -3793 -3178 -1419 785 2699 3696 3419
1600 3419 1787 -424 -2481 -3578 -3462 -2021 125 2164 3514 3635 2307 134 -2057 -3439 -3591 -2299
1616 -2299 -276 1913 3280 3471 2496 543 -1640 -3185 -3593 -2659 -808 1352 3045 3586 2934 1199
1632 1199 -1008 -2863 -3711 -3150 -1415 838 2814 3657 3171 1612 -521 -2389 -3423 -3220 -1828 260
1648 260 2274 3335 3211 1966 -74 -1981 -3245 -3372 -2304 -288 1882 3366 3545 2328 386 -1786
1664 -1786 -3209 -3432 -2456 -622 1349 2978 3443 2678 1044 -1089 -2737 -3406 -2854 -1253 722 2595
1680 2595 3473 3028 1472 -617 -2491 -3463 -2985 -1408 603 2329 3296 2990 1645 -245 -1981 -3173
1696 -3173 -3159 -2023 -109 1918 3121 3294 2268 330 -1755 -3171 -3454 -2394 -489 1589 2949 3234
1712 3234 2379 698 -1203 -2529 -3132 -2573 -1106 920 2519 3266 2814 1204 -818 -2505 -3209 -2839 -1326
1729 -1326 655 2448 3311 2886 1454 -460 -2183 -3097 -2997 -1695 42 1849 2959 3058 2096 298 -1694
1746 -1694 -3015 -3122 -2231 -388 1582 2879 3137 2294 545 -1346 -2722 -3075 -2209 -662 1108 2505
1762 2505 2990 2457 1058 -811 -2364 -3168 -2732 -1265 714 2396 3234 2794 1374 -523 -2229 -3070 -2811
1779 -2811 -1539 304 1956 2868 2782 1680 49 -1626 -2756 -2949 -1993 -370 1497 2846 3108 2110 345
1796 345 -1564 -2781 -2986 -2092 -479 1254 2650 2973 2283 840 -974 -2388 -2989 -2517 -1146 662 2229
1813 2229 3027 2760 1386 -484 -2150 -2998 -2651 -1346 395 2057 2789 2578 1488 -143 -1707 -2666 -2668
1830 -2668 -1705 -101 1520 2658 2819 1958 361 -1503 -2701 -2947 -2181 -407 1327 2681 2919 2180 647
1847 647 -1128 -2357 -2801 -2268 -919 692 2167 2788 2375 1156 -516 -2038 -2782 -2520 -1325 417 1994
1864 1994 2875 2558 1371 -330 -1872 -2680 -2537 -1516 11 1575 2497 2681 1793 252 -1380 -2516 -2763
1881 -2763 -1977 -456 1258 2458 2745 2029 609 -1112 -2362 -2735 -2039 -670 902 2174 2616 2123 1018
1898 1018 -614 -1970 -2594 -2374 -1153 426 1929 2655 2447 1267 -297 -1805 -2614 -2411 -1435 150 1593
1915 1593 2482 2443 1591 103 -1412 -2377 -2519 -1774 -375 1227 2291 2556 1893 514 -1101 -2267 -2557
1932 -2557 -1984 -609 977 2165 2556 2021 801 -722 -1938 -2458 -2059 -961 506 1839 2496 2277 1204
1949 1204 -340 -1776 -2483 -2329 -1339 168 1628 2463 2303 1403 -73 -1420 -2341 -2366 -1545 -197 1208
1966 1208 2220 2406 1704 388 -998 -2154 -2417 -1792 -509 936 2115 2435 1903 677 -795 -1910
1982 -1910 -2411 -1903 -785 700 1825 2359 1990 993 -415 -1735 -2406 -2153 -1168 228 1537 2302 2277 1273
2000 1273 -70 -1476 -2266 -2277 -1352 1 1305 2136 2260 1500 236 -1141 -2048 -2239 -1604 -449 972
2017 972 1987 2275 1764 574 -803 -1911 -2265 -1864 -711 781 1876 2274 1890 850 -559 -1687 -2209
2034 -2209 -1925 -1004 326 1502 2185 2068 1177 -135 -1449 -2140 -2111 -1301 -23 1276 2100 2091 1367 145
2052 145 -1164 -2032 -2065 -1349 -218 1008 1890 2064 1543 458 -858 -1810 -2187 -1721 -561 660 1813 2188
2070 2188 1829 755 -576 -1676 -2175 -1794 -853 422 1468 1997 1835 983 -187 -1363 -2005 -1940 -1087 135
2088 135 1222 1945 1996 1164 -3 -1198 -1941 -2024 -1322 -146 1067 1893 2057 1387 237 -933 -1801 -2033
2106 -2033 -1528 -505 751 1646 2026 1655 644 -584 -1602 -1991 -1698 -754 526 1501 1944 1727 845 -388
2124 -388 -1428 -1846 -1717 -901 225 1246 1876 1773 1097 -30 -1211 -1850 -1901 -1192 -80 1151 1840 1865
2142 1865 1322 256 -897 -1763 -1868 -1209 -331 762 1561 1784 1346 548 -580 -1486 -1838 -1550 -601 522
2160 522 1495 1854 1572 659 -436 -1441 -1889 -1615 -740 327 1295 1807 1607 849 -143 -1116 -1664 -1722 -1103
2179 -1103 -95 1034 1739 1808 1215 143 -948 -1643 -1708 -1195 -183 817 1536 1720 1196 305 -636 -1395
2197 -1395 -1667 -1291 -461 531 1380 1761 1519 623 -516 -1436 -1835 -1574 -698 409 1353 1749 1518 816 -235
2216 -235 -1073 -1605 -1490 -953 16 944 1526 1566 1039 122 -856 -1558 -1650 -1103 -144 928 1570 1638 1106 155 -780
2237 -780 -1387 -1537 -1168 -327 605 1308 1579 1280 598 -421 -1210 -1631 -1417 -676 291 1218 1625 1392 720 -337
2257 -337 -1180 -1502 -1342 -689 161 940 1416 1283 797 99 -819 -1403 -1435 -992 -54 815 1482 1556 1014 104 -838
2278 -838 -1438 -1490 -1039 -152 668 1290 1428 1123 374 -448 -1122 -1478 -1201 -554 297 1121 1499 1278 557 -418
2298 -418 -1107 -1482 -1279 -547 356 1100 1460 1220 652 -175 -932 -1317 -1252 -775 -8 777 1410 1395 949 89 -791
2319 -791 -1372 -1397 -914 -146 773 1316 1349 927 199 -606 -1161 -1305 -891 -280 475 1081 1322 1091 445 -410 -1109
2340 -1109 -1353 -1172 -525 386 1124 1424 1188 552 -335 -967 -1294 -1134 -618 163 920 1229 1204 721 10 -739
2360 -739 -1226 -1309 -838 -104 715 1258 1309 878 138 -696 -1167 -1185 -858 -175 600 1097 1161 889 258 -449 -1031
2381 -1031 -1243 -1071 -392 355 1000 1324 1088 429 -359 -976 -1300 -1087 -505 316 934 1207 1019 574 -124 -751
2401 -751 -1169 -1094 -663 21 779 1137 1215 775 57 -670 -1174 -1149 -709 -26 644 1120 1136 743 129 -549 -1050
2422 -1050 -1085 -801 -217 491 999 1123 861 335 -378 -948 -1256 -977 -368 358 916 1199 987 421 -303 -837
2442 -837 -1113 -923 -414 195 729 1016 985 591 -59 -611 -1080 -981 -637 33 715 1090 1016 602 -35 -597 -1073
2463 -1073 -1057 -649 -30 561 995 1042 736 110 -432 -923 -1058 -808 -302 336 858 1079 890 357 -332 -860
2483 -860 -1128 -886 -361 318 809 1029 853 363 -217 -748 -964 -845 -423 181 663 1025 990 566 -30 -689
2503 -689 -1024 -1044 -604 19 634 972 981 630 48 -532 -888 -963 -655 -99 435 808 985 725 217 -369 -862
2524 -862 -985 -756 -264 410 811 1047 767 256 -332 -851 -1037 -797 -343 305 815 964 854 393 -123 -661
2544 -661 -1001 -827 -511 7 580 983 920 523 -94 -618 -906 -891 -479 94 565 823 849 513 32 -487 -846
2565 -846 -867 -600 -121 420 837 1001 692 232 -394 -837 -1030 -710 -226 380 830 910 755 227 -308 -705 -836
2586 -836 -768 -340 223 614 844 786 402 -104 -679 -869 -876 -412 126 679 989 869 437 -122 -652 -878 -812 -542
2608 -542 2 528 877 880 613 177 -452 -867 -886 -648 -227 373 869 986 699 216 -357 -805 -860 -588 -191
2629 -191 328 732 854 653 269 -221 -671 -879 -754 -296 176 635 946 842 421 -167 -645 -1029 -952 -433
2649 -433 106 620 882 804 480 -46 -512 -757 -783 -492 -107 411 751 879 628 131 -389 -849 -882 -665 -61
2670 -61 475 830 931 668 102 -398 -761 -878 -689 -260 242 666 819 769 422 -188 -668 -938 -917 -462 146
2691 146 669 899 817 457 -119 -631 -888 -727 -392 38 589 806 741 529 82 -447 -846 -874 -571 -65 469
2712 469 831 967 629 119 -426 -917 -902 -606 -144 379 742 870 603 230 -245 -650 -855 -784 -335 190 700
2733 700 917 775 348 -191 -687 -1014 -760 -338 195 623 890 772 374 -90 -538 -776 -762 -462 -100 443
2753 443 836 897 591 113 -483 -865 -929 -591 -60 457 823 856 543 87 -433 -729 -837 -609 -205 285 670
2774 670 802 774 329 -190 -716 -879 -822 -363 303 721 915 760 312 -191 -692 -801 -718 -355 91 576 858
2795 858 788 500 7 -479 -773 -867 -521 -42 542 890 892 501 0 -495 -861 -839 -489 -92 410 712 791 606
2817 606 164 -318 -700 -846 -671 -240 277 745 923 765 313 -271 -730 -863 -778 -282 233 674 786 736 375
2838 375 -147 -569 -796 -747 -482 87 468 881 824 462 -19 -570 -864 -900 -534 -1 506 840 824 565 67
2859 67 -475 -765 -824 -574 -184 314 760 875 651 278 -331 -736 -914 -715 -260 297 742 877 704 281 -244
2880 -244 -687 -871 -687 -319 154 561 814 809 419 -28 -540 -867 -818 -525 -55 583 874 871 536 -20 -515 -866
2902 -866 -881 -533 -17 472 762 836 559 133 -382 -725 -878 -697 -186 357 740 917 699 254 -343 -794 -911
2923 -911 -709 -247 264 663 808 751 252 -202 -643 -912 -757 -386 94 582 924 867 481 -88 -597 -872 -890
2944 -890 -524 23 553 824 855 548 0 -493 -767 -819 -571 -82 487 752 871 669 198 -339 -713 -909 -736
2965 -736 -256 349 761 940 770 248 -254 -675 -857 -696 -301 194 648 893 806 456 -93 -604 -907 -871 -467
2986 -467 74 582 876 853 502 -34 -554 -912 -868 -484 -7 520 855 872 575 37 -457 -800 -895 -633 -112
3007 -112 409 814 957 678 201 -376 -769 -955 -768 -264 316 800 942 755 273 -246 -704 -945 -792 -363
3027 -363 185 649 888 828 446 -132 -601 -872 -914 -486 63 605 982 863 605 2 -563 -884 -827 -624 -54
3048 -54 498 829 883 630 261 -362 -801 -946 -735 -204 333 748 972 717 266 -311 -810 -957 -776 -331 240
3069 240 690 930 806 423 -133 -665 -936 -867 -484 77 586 931 979 586 -48 -620 -965 -900 -551 -44 491
3090 491 900 884 631 59 -495 -847 -875 -684 -139 316 788 1023 743 220 -359 -833 -956 -766 -220 262 766
3111 766 1013 770 351 -221 -674 -951 -811 -387 171 651 951 934 574 -24 -606 -918 -953 -548 12 611 977
3132 977 935 605 36 -557 -900 -949 -596 -118 438 873 944 717 169 -393 -824 -959 -780 -275 335 840 978
3153 978 847 362 -293 -795 -1030 -844 -358 241 762 994 910 478 -119 -645 -949 -877 -522 65 676 972 941
3174 941 649 45 -549 -1024 -966 -546 -34 536 942 1027 688 188 -455 -838 -953 -743 -264 352 852 1031 836
3195 836 267 -285 -862 -1039 -891 -347 288 782 1101 855 406 -212 -725 -953 -885 -477 126 642 1033 987 630
3216 630 25 -595 -993 -1003 -613 -9 594 936 1041 680 60 -540 -914 -982 -671 -169 465 824 999 756 225
3237 225 -351 -840 -1046 -883 -330 330 822 1069 897 419 -256 -753 -989 -820 -399 197 702 920 934 540
3257 540 -43 -550 -1010 -946 -632 -13 619 979 1043 695 83 -515 -990 -1018 -679 -158 479 913 1037 719 213
3278 213 -394 -842 -1044 -869 -364 336 796 1024 877 388 -240 -795 -1094 -907 -380 172 742 1057 959 481
3298 481 -126 -670 -948 -938 -574 -4 583 956 1003 683 57 -551 -1013 -1048 -685 -170 533 965 1022 740 167
3319 167 -430 -891 -989 -746 -263 342 808 1034 825 355 -249 -811 -1044 -932 -471 236 776 1025 946 521 -168
3340 -168 -685 -1025 -935 -574 33 655 976 961 628 4 -600 -976 -1039 -711 -100 519 967 1080 727 191 -498
3361 -498 -956 -1068 -765 -220 380 903 1006 799 304 -332 -817 -1080 -903 -409 204 767 1075 980 529 -147
3381 -147 -723 -1036 -1004 -555 74 707 1031 986 587 -43 -565 -968 -990 -638 -64 539 987 1076 743 142 -459
3402 -459 -939 -1089 -766 -247 410 914 979 830 310 -327 -866 -1057 -878 -406 303 820 1042 928 489 -172
3422 -172 -766 -1018 -926 -476 130 706 1026 994 536 -42 -603 -1029 -983 -612 -47 612 950 984 679 123 -542
3443 -542 -920 -1055 -764 -202 420 869 1036 750 332 -380 -856 -1046 -896 -325 310 779 1030 888 410 -221
3463 -221 -752 -968 -884 -450 127 677 1006 989 529 -27 -670 -1031 -982 -581 -14 609 995 1054 667 62 -536
3484 -536 -963 -1018 -753 -196 450 898 1000 811 237 -383 -855 -1076 -849 -304 331 840 1078 886 351 -248
3504 -248 -818 -1012 -942 -410 212 740 1013 973 472 -78 -655 -980 -999 -593 -21 627 987 1063 608 34 -587
3525 -587 -999 -1041 -685 -79 519 907 1004 692 123 -364 -884 -1064 -810 -263 345 808 1020 872 386 -277 -768
3546 -768 -1047 -884 -407 251 792 979 891 477 -93 -652 -925 -960 -538 108 633 999 1011 647 -16 -576 -1003
3567 -1003 -967 -674 -67 552 978 987 679 178 -475 -980 -1049 -721 -208 359 874 1008 768 328 -275 -769 -1044
3588 -1044 -826 -348 251 829 1047 936 392 -210 -744 -1013 -885 -474 124 595 1002 968 590 -19 -577 -1014
3608 -1014 -1027 -665 -75 560 939 1029 681 82 -508 -1007 -983 -757 -157 456 869 1045 832 294 -380 -793 -1040
3629 -1040 -871 -377 304 779 1066 894 420 -229 -768 -999 -900 -510 164 728 1040 854 531 -37 -640 -939
3649 -939 -920 -588 -81 532 963 1040 689 142 -468 -978 -1009 -728 -217 429 930 1028 802 300 -358 -757 -943
3670 -943 -808 -340 244 774 987 880 449 -213 -757 -1070 -888 -432 178 752 945 951 461 -61 -667 -941 -967
3691 -967 -529 52 501 907 962 644 108 -468 -910 -1013 -732 -179 459 905 996 764 233 -412 -855 -941 -818
3712 -818 -240 288 839 989 848 407 -207 -742 -954 -887 -469 230 741 1021 979 532 -108 -675 -1012 -933 -508
3733 -508 64 583 976 917 612 63 -528 -902 -992 -682 -146 467 859 969 705 224 -389 -875 -1030 -741 -198
3754 -198 328 812 981 819 322 -270 -763 -917 -834 -396 150 744 950 940 532 -30 -680 -982 -921 -478 67
3775 67 619 969 950 541 -7 -567 -869 -871 -586 -48 457 862 999 682 183 -410 -881 -1023 -775 -248 383
3796 383 856 1039 749 344 -391 -799 -961 -811 -261 219 718 918 880 501 -102 -655 -936 -898 -527 58 626
3817 626 974 933 553 -36 -574 -931 -944 -615 -1 491 865 909 641 143 -378 -902 -952 -714 -202 342 813
3838 813 1011 798 273 -322 -734 -970 -788 -318 289 778 941 844 443 -135 -641 -915 -846 -456 46 625 917
3859 917 941 547 -11 -544 -951 -923 -580 -9 534 915 926 617 105 -422 -844 -889 -654 -208 308 747 968
3880 968 790 267 -303 -795 -966 -787 -260 310 797 948 768 341 -215 -703 -854 -818 -359 152 590 879
3900 879 884 526 -29 -545 -902 -932 -624 -21 585 953 964 591 43 -498 -845 -889 -607 -119 399 796 941 731
3922 731 245 -271 -711 -930 -752 -269 237 700 964 811 334 -285 -708 -931 -765 -369 189 663 975 866
3942 866 465 -69 -608 -878 -871 -602 6 514 862 896 572 51 -524 -835 -938 -661 -77 432 810 902 627
3963 627 142 -352 -717 -849 -717 -319 275 731 914 812 372 -208 -703 -972 -774 -379 209 725 993 790
3983 790 394 -74 -530 -909 -865 -496 22 494 835 868 537 48 -478 -935 -948 -577 -96 510 901 898 622 112
4005 112 -386 -762 -895 -658 -161 308 747 928 792 403 -220 -702 -973 -823 -384 181 685 962 850 383
4025 383 -112 -604 -836 -713 -418 32 530 819 811 547 24 -465 -849 -971 -660 -24 487 894 954 671 142
4046 142 -466 -804 -862 -655 -146 329 693 865 730 277 -197 -674 -856 -775 -396 151 732 931 853 416 -174
4067 -174 -693 -888 -810 -389 113 602 802 808 491 6 -484 -801 -810 -593 -128 422 862 928 628 85 -446 -856
4089 -856 -890 -594 -135 413 774 881 702 170 -261 -693 -827 -697 -280 218 629 908 739 370 -199 -706
4109 -706 -928 -803 -403 146 571 897 852 410 -52 -547 -840 -847 -494 -57 405 751 894 586 114 -428 -776
4130 -776 -945 -635 -105 452 738 872 625 181 -363 -722 -820 -684 -242 220 708 847 737 384 -161 -580
4150 -580 -878 -819 -396 153 639 872 857 443 -117 -609 -830 -766 -404 29 488 788 800 517 33 -416 -799
4171 -799 -831 -592 -189 413 834 913 641 179 -394 -832 -873 -633 -225 295 669 799 683 296 -166 -622 -807
4192 -807 -716 -419 85 575 934 833 431 -82 -593 -885 -836 -408 63 552 817 741 454 -20 -399 -755 -809
4213 -809 -571 -171 346 758 896 693 246 -378 -782 -911 -663 -146 344 727 803 656 172 -277 -591 -814
4233 -814 -643 -348 167 561 792 807 456 -1 -538 -890 -867 -465 59 535 813 794 469 -8 -466 -751 -772
4254 -772 -535 -106 349 664 805 647 162 -338 -692 -843 -645 -213 344 717 833 666 215 -256 -667 -774
4274 -774 -632 -316 234 569 776 727 400 -92 -535 -825 -741 -443 23 566 826 836 469 -46 -513 -806 -779
4295 -779 -464 -17 427 705 772 528 139 -373 -669 -851 -602 -205 313 701 872 673 223 -282 -736 -786 -683
4316 -683 -269 259 626 807 704 321 -128 -514 -825 -708 -422 17 588 827 779 497 17 -563 -803 -802 -478
4337 -478 -25 446 784 775 513 98 -371 -662 -773 -591 -190 318 676 853 652 276 -254 -697 -840 -673 -243
4358 -243 303 637 839 723 342 -111 -546 -735 -690 -314 20 516 753 786 471 0 -490 -820 -802 -474 -26
4379 -26 468 797 785 513 40 -395 -698 -756 -574 -155 356 664 782 656 244 -248 -682 -789 -665 -274 268
4400 268 665 832 677 315 -136 -645 -749 -671 -339 55 524 801 695 420 -9 -487 -815 -835 -510 8 430
4421 430 763 769 553 33 -369 -693 -786 -582 -138 340 655 763 575 198 -280 -626 -795 -726 -294 204 617
4442 617 856 646 301 -192 -599 -754 -656 -249 174 541 776 698 405 -25 -452 -740 -780 -494 -14 458 738
4463 738 807 543 87 -456 -714 -800 -514 -82 321 721 744 536 174 -323 -633 -749 -601 -240 216 642 825
4484 825 655 263 -191 -610 -807 -698 -346 151 569 749 641 319 -81 -444 -758 -683 -447 10 460 750
4504 750 747 541 86 -410 -704 -767 -531 -68 346 692 790 533 123 -333 -596 -737 -574 -153 194 639 778
4525 778 693 289 -111 -568 -754 -673 -285 152 574 808 616 305 -61 -451 -669 -635 -383 -4 415 650 724
4546 724 485 128 -416 -701 -713 -474 -87 403 710 790 520 97 -304 -659 -729 -547 -185 203 573 724 629
4567 629 286 -189 -520 -729 -609 -292 132 574 778 685 338 -76 -476 -730 -647 -319 37 360 678 667 416
4588 416 46 -337 -684 -737 -451 -88 352 644 731 510 114 -396 -585 -745 -547 -139 217 602 696 551 190
4609 190 -163 -520 -664 -640 -307 120 537 708 664 299 -150 -494 -733 -662 -302 66 445 688 669 429 -14
4630 -14 -379 -701 -677 -510 -108 361 625 737 484 111 -368 -659 -678 -503 -123 279 580 684 578 223 -190
4651 -190 -568 -655 -541 -262 163 573 713 693 354 -120 -507 -689 -609 -352 68 493 654 588 330 -64 -355
4672 -355 -624 -675 -453 -87 347 641 737 486 139 -374 -670 -708 -521 -165 295 566 708 494 203 -226 -513
4693 -513 -674 -524 -210 173 479 656 614 313 -60 -487 -706 -629 -343 55 497 701 631 353 -29 -409 -589
4714 -589 -700 -423 -66 348 630 627 439 157 -277 -659 -698 -513 -182 275 589 723 507 127 -260 -582 -641
4735 -641 -485 -197 237 478 654 573 295 -112 -394 -630 -585 -358 92 481 654 651 362 -89 -489 -627 -655 -395
4757 -395 -14 378 610 581 409 90 -313 -591 -700 -469 -97 230 648 637 509 174 -295 -563 -678 -522 -137
4778 -137 217 554 592 546 271 -125 -444 -608 -525 -298 67 410 655 565 381 -109 -435 -627 -614 -302 14 421
4800 421 608 615 382 77 -326 -540 -653 -487 -130 238 578 621 477 196 -247 -587 -721 -541 -169 246 475
4821 475 641 505 207 -188 -495 -575 -583 -239 44 440 623 569 348 -11 -384 -572 -540 -299 55 381 654 593
4843 593 301 -26 -334 -544 -570 -452 -98 283 536 549 386 156 -254 -557 -697 -498 -204 187 587 635 530
4864 530 214 -193 -522 -583 -485 -232 133 391 584 490 299 -84 -386 -609 -570 -324 6 360 633 606 295 -29
4886 -29 -334 -552 -612 -400 -88 282 463 520 396 150 -246 -500 -610 -479 -157 165 493 583 497 191 -182 -456
4908 -456 -634 -528 -250 159 414 619 480 274 -59 -390 -558 -526 -328 11 398 550 540 350 56 -289 -616
4929 -616 -576 -388 -28 323 574 571 395 83 -239 -490 -526 -407 -147 163 439 567 505 203 -204 -469 -625 -437
4951 -437 -218 155 490 628 504 233 -36 -381 -564 -486 -310 32 330 542 518 324 -4 -370 -585 -625 -400
4972 -400 -61 341 538 556 326 128 -273 -525 -584 -364 -121 211 430 500 411 146 -224 -469 -537 -523 -221 183
4994 183 421 547 477 221 -90 -440 -560 -464 -238 41 389 491 476 292 -41 -316 -521 -558 -348 -60 300
5015 300 584 559 390 48 -248 -558 -595 -384 -114 221 460 541 393 175 -106 -446 -511 -459 -174 116 392 572
5037 572 495 238 -96 -401 -576 -481 -157 120 348 490 478 181 -46 -248 -490 -550 -326 -8 301 470 512 326
5059 326 7 -310 -539 -590 -336 -87 224 502 500 355 80 -199 -414 -570 -417 -163 135 389 526 480 224
5080 224 -84 -377 -560 -453 -244 110 414 614 447 252 -43 -316 -457 -421 -261 19 317 465 476 331 47
5101 47 -245 -458 -501 -411 -64 271 485 518 345 70 -183 -447 -489 -384 -114 142 403 508 393 168 -110 -393
5123 -393 -510 -438 -210 79 391 500 444 256 -101 -380 -530 -430 -268 49 357 513 425 237 42 -283 -435
5144 -435 -464 -317 -90 276 468 476 380 84 -286 -529 -492 -360 -105 215 446 396 381 156 -57 -352 -482 -425 -171
5167 -171 81 290 521 466 260 -82 -313 -533 -506 -242 97 345 474 467 284 15 -243 -430 -450 -355 -94 216
5189 216 411 459 376 38 -237 -407 -467 -425 -95 256 361 460 365 108 -182 -376 -474 -363 -180 103 336 433 445
5212 445 239 -70 -323 -455 -484 -268 61 347 483 445 272 -62 -286 -437 -483 -273 -19 264 455 433 266
5233 266 17 -227 -472 -465 -335 -104 172 416 437 422 146 -201 -388 -460 -343 -110 156 365 437 399 234 -65
5255 -65 -290 -472 -343 -218 55 297 452 392 213 -15 -321 -479 -426 -252 -32 287 449 459 213 70 -220
5276 -220 -459 -466 -376 -109 179 411 466 396 69 -192 -414 -469 -341 -125 112 393 472 390 150 -147 -321 -398 -435
5299 -435 -216 75 375 448 443 256 -36 -252 -464 -471 -256 22 282 431 378 263 10 -265 -436 -396 -279 -68
5321 -68 209 397 464 358 72 -148 -435 -391 -330 -147 164 426 455 386 117 -104 -351 -423 -341 -139 72 291 428
5344 428 393 232 43 -278 -445 -444 -231 -1 282 410 409 236 41 -213 -428 -430 -262 -38 175 378 419 323 77
5367 77 -237 -368 -435 -347 -43 166 392 430 382 130 -115 -316 -460 -395 -175 169 355 416 349 170 -103 -321 -399
5390 -399 -443 -193 54 269 429 432 204 -43 -297 -415 -417 -236 -65 186 380 479 255 97 -205 -382 -391 -273 -48
5413 -48 138 416 395 330 120 -128 -338 -436 -373 -123 136 345 456 317 214 -69 -342 -436 -349 -158 102 279
5435 279 434 385 237 -28 -286 -412 -385 -292 -25 178 359 415 248 46 -225 -400 -492 -311 -47 255 377 380
5457 380 293 63 -205 -343 -411 -373 -95 119 351 401 333 129 -82 -269 -394 -392 -230 123 384 402 387 192 -80
5480 -80 -278 -380 -344 -211 52 175 382 401 251 55 -181 -447 -470 -279 -56 191 375 454 269 11 -187 -363
5502 -363 -402 -311 -45 151 282 353 327 170 -70 -320 -415 -359 -171 74 294 463 391 195 -38 -354 -451 -347 -198
5525 -198 37 269 374 361 197 45 -192 -323 -431 -232 -63 153 399 411 323 47 -198 -359 -396 -302 -88 182
5547 182 316 412 314 55 -124 -304 -402 -334 -158 55 264 403 404 207 -38 -305 -427 -399 -210 54 321 416 338
5570 338 163 -86 -229 -411 -377 -262 -75 195 383 428 327 113 -169 -373 -452 -326 -75 162 334 452 325
5591 325 81 -206 -372 -381 -273 -119 176 272 356 306 173 -33 -302 -424 -417 -173 -5 289 418 407 227 -75 -293
5614 -293 -457 -378 -252 8 201 362 331 283 46 -133 -404 -362 -339 -134 120 380 461 355 131 -167 -389 -426
5636 -426 -286 -120 172 318 425 290 161 -35 -228 -387 -346 -211 -36 253 398 368 253 -54 -286 -462 -397
5657 -397 -156 -4 249 367 377 208 15 -138 -369 -361 -289 -119 143 337 458 370 147 -121 -359 -431 -360 -118
5679 -118 127 318 431 323 96 -131 -234 -362 -341 -188 18 146 335 507 241 -40 -282 -457 -446 -277 11
5700 11 270 384 422 252 -9 -263 -378 -370 -228 -47 189 298 350 305 111 -112 -379 -426 -391 -129 147 393 490
5723 490 359 135 -89 -274 -409 -293 -163 60 326 329 374 208 37 -230 -425 -408 -266 15 233 377 395 205
5745 205 29 -230 -397 -391 -259 -24 148 354 376 251 114 -141 -317 -383 -311 -154 96 354 486 346 127 -51
5767 -51 -319 -382 -390 -91 136 304 422 345 188 -9 -238 -359 -381 -226 -71 215 396 439 225 7 -242 -432
5789 -432 -398 -249 -32 207 355 408 291 57 -174 -351 -350 -251 -100 84 359 422 367 178 -122 -360 -411 -421 -189
5812 -189 101 307 390 353 219 -20 -251 -408 -321 -225 10 166 342 347 226 57 -194 -334 -402 -215 -45 188
5834 188 430 393 280 5 -137 -316 -409 -234 -39 149 325 376 323 192 -76 -305 -424 -385 -240 118 252 413
5856 413 379 203 -14 -290 -383 -402 -132 44 204 333 359 211 24 -226 -314 -449 -295 -20 196 324 385 212
5878 212 79 -128 -354 -394 -314 -74 179 299 363 293 143 -149 -262 -351 -314 -88 64 267 394 353 181 -55
5900 -55 -345 -394 -388 -266 -22 271 383 339 208 34 -194 -334 -343 -213 -56 138 362 393 303 45 -149 -354 -404
5923 -404 -330 -88 121 317 409 318 56 -114 -312 -399 -362 -153 121 228 407 359 152 -89 -259 -401 -316 -209
5945 -209 -6 280 395 376 242 31 -245 -331 -331 -225 -62 169 355 412 252 32 -156 -287 -341 -292 -49 111
5967 111 310 372 253 145 -124 -248 -387 -318 -161 121 344 401 345 146 -24 -294 -379 -344 -196 -12 212 396
5989 396 396 249 16 -270 -435 -430 -295 -58 195 335 377 236 49 -168 -392 -423 -269 -108 199 328 411 268
6011 268 131 -105 -287 -424 -309 -213 86 258 432 384 202 -66 -296 -390 -303 -168 51 277 322 340 214 -8
6033 -8 -237 -374 -363 -265 -101 186 347 409 290 56 -193 -408 -432 -339 -87 152 299 368 329 157 -121 -291 -384
6056 -384 -335 -176 110 334 440 346 190 -60 -314 -405 -331 -223 64 238 427 365 190 -12 -181 -329 -403 -251
6078 -251 -91 229 344 346 266 82 -172 -305 -387 -323 -103 135 352 393 288 79 -155 -324 -370 -258 -172 112 262
6101 262 382 372 215 -12 -254 -343 -371 -157 35 269 360 389 236 29 -222 -341 -372 -237 -26 209 366 336
6123 336 257 14 -176 -336 -395 -274 -141 110 314 356 320 137 -140 -343 -383 -293 -92 59 260 330 320 150 -70
6146 -70 -230 -298 -298 -173 36 227 352 376 215 15 -240 -326 -384 -223 -15 183 336 341 250 56 -131 -278 -391
6169 -391 -265 -112 76 338 356 302 147 -83 -261 -382 -285 -160 117 254 358 349 150 -81 -266 -307 -283 -226 -10
6192 -10 223 345 277 188 -24 -227 -353 -369 -258 -19 213 347 413 299 20 -159 -324 -371 -229 -56 88 262
6214 262 389 309 148 -82 -320 -381 -295 -173 66 289 358 344 155 -75 -274 -380 -307 -213 15 258 350 274 237
6237 237 29 -156 -342 -388 -288 -37 147 306 371 301 15 -178 -277 -348 -303 -108 82 309 314 280 137 -123 -258
6260 -258 -322 -269 -162 77 247 319 355 195 -50 -284 -349 -329 -145 -43 262 356 301 240 -6 -217 -385 -342 -230
6283 -230 -32 115 273 342 308 70 -164 -313 -417 -294 -124 108 263 383 215 88 -117 -273 -341 -315 -147
6304 -147 54 231 333 313 210 -53 -204 -379 -292 -190 2 213 332 388 228 -43 -159 -295 -311 -229 -66 113
6326 113 326 327 262 97 -95 -314 -378 -304 -131 131 239 371 304 133 -88 -266 -324 -279 -144 67 239 321 290
6349 290 237 -71 -182 -329 -360 -212 13 222 262 330 229 37 -194 -281 -317 -198 -36 164 304 325 276 29 -127
6372 -127 -314 -364 -296 -147 87 233 313 292 87 -98 -246 -331 -293 -146 45 252 350 323 168 -21 -193 -352 -298
6395 -298 -180 13 219 354 352 221 5 -139 -340 -336 -235 -58 127 270 316 245 7 -99 -242 -314 -252 -68 65
6418 65 244 368 299 211 -82 -202 -362 -279 -188 42 199 298 357 139 -55 -245 -339 -321 -155 12 188 305 313 165
6442 165 -42 -174 -261 -363 -280 -60 105 330 343 205 114 -148 -227 -345 -272 -126 35 271 325 266 82 -84 -248
6465 -248 -347 -272 -135 10 269 316 276 148 -41 -182 -310 -310 -211 -7 238 338 294 205 42 -223 -247 -346 -254 -36
6489 -36 86 264 334 235 86 -112 -207 -318 -274 -124 78 236 322 298 147 -120 -226 -332 -281 -165 -5 278 351
6512 351 373 173 -37 -183 -269 -338 -196 -15 142 312 300 242 74 -150 -357 -319 -190 -72 140 282 309 281 106
6535 106 -190 -251 -303 -279 -140 51 276 292 281 84 -67 -168 -344 -268 -184 46 184 315 273 200 -21 -157 -287
6558 -287 -297 -176 -6 130 316 344 191 37 -154 -285 -265 -182 -76 142 262 312 238 109 -146 -215 -337 -208
6580 -208 -159 64 271 298 268 144 -46 -250 -337 -266 -209 18 188 306 308 177 8 -122 -262 -320 -183 -32 183
6603 183 276 318 250 59 -117 -231 -322 -184 -117 116 261 298 272 131 -66 -216 -242 -241 -87 28 167 294 218 120
6627 120 -18 -213 -304 -266 -157 2 221 250 250 122 77 -154 -263 -289 -208 6 110 283 278 221 34 -177 -221 -259
6651 -259 -215 -63 65 241 359 212 54 -60 -261 -328 -203 -108 58 186 286 234 114 -42 -184 -266 -280 -121
6673 -121 43 208 286 292 131 -18 -149 -250 -262 -169 -9 151 205 251 195 63 -80 -270 -262 -139 -49 132 309 293
6697 293 216 103 -66 -233 -242 -218 -139 10 230 263 250 156 -57 -166 -335 -303 -154 -2 106 263 246 194 15 -151
6721 -151 -195 -237 -190 2 164 207 301 228 69 -125 -247 -191 -208 -75 65 236 301 232 137 -33 -125 -209 -276 -62 88
6746 88 204 199 257 181 -75 -169 -273 -293 -152 -50 142 271 216 163 1 -131 -228 -251 -157 -40 114 242 263 174 -7
6771 -7 -124 -197 -232 -185 -51 110 207 242 259 39 -74 -165 -307 -243 -96 51 196 256 226 146 -9 -192 -225 -174 -103
6796 -103 -22 202 224 216 170 35 -102 -242 -244 -127 6 123 193 265 182 -3 -94 -211 -302 -140 -52 99 199 177 163
6821 163 43 -49 -185 -257 -244 -138 32 144 285 291 155 -1 -151 -232 -264 -129 9 113 245 206 145 -42 -147
6844 -147 -239 -231 -125 -62 109 232 233 181 34 -111 -190 -234 -234 -118 66 183 173 201 80 -2 -140 -208 -230 -96 102
6869 102 148 225 241 158 14 -135 -221 -259 -143 31 131 237 223 127 45 -106 -175 -236 -178 -31 104 219 196 113 61
6894 61 -111 -189 -222 -164 -139 85 155 262 198 112 5 -189 -236 -151 -125 52 135 226 191 100 -21 -121 -188 -248 -124 -35
6920 -35 130 231 206 168 23 -96 -243 -168 -202 -46 69 149 205 197 45 -56 -196 -262 -176 -72 81 206 254 188
6944 188 83 -12 -192 -220 -202 -124 44 168 252 234 86 -36 -115 -192 -183 -89 -25 126 210 187 147 65 -42 -163 -296
6969 -296 -210 -24 105 142 210 173 47 -54 -143 -174 -161 -54 34 166 201 156 116 -7 -154 -201 -132 -113 21 159 216
6994 216 185 110 -32 -118 -184 -161 -93 -24 136 198 195 113 61 -130 -167 -217 -166 -86 98 181 181 124 42 -18 -187 -211 -113 -78
7022 -78 8 98 225 168 84 -7 -176 -189 -254 -137 14 107 192 199 141 5 -101 -199 -200 -60 13 134 131 235 102 10 -107
7049 -107 -179 -231 -135 -74 35 195 158 155 86 -8 -179 -240 -163 -4 90 119 177 211 88 -18 -130 -142 -153 -74 4 97 218
7076 218 176 135 33 -81 -183 -217 -114 -44 100 165 242 133 37 -65 -123 -144 -125 -4 1 174 123 106 40 -48 -221
7101 -221 -232 -204 -132 33 182 221 148 131 2 -126 -198 -134 -69 -20 78 193 121 111 23 -87 -159 -162 -156 -17 84 175 159
7128 159 146 48 -93 -152 -110 -68 -23 108 145 155 156 59 -13 -149 -164 -212 -153 9 167 200 190 51 -73 -146 -133 -128 -44
7155 -44 22 86 180 144 120 28 -99 -139 -159 -121 -42 58 167 238 104 20 -98 -233 -183 -47 -38 97 162 147 117 31 -20
7182 -20 -125 -136 -114 -118 -6 96 98 143 94 -49 -149 -181 -137 -80 21 140 109 129 135 8 -81 -146 -139 -144 -24 52 131 150
7210 150 157 75 -64 -121 -174 -160 -55 112 149 192 68 20 -60 -162 -134 -106 -69 47 95 79 171 80 -5 -80 -136 -133 -115 -11
7238 -11 129 101 124 103 3 -105 -170 -145 -70 2 -2 154 175 130 35 -28 -137 -154 -94 -61 34 122 222 149 59 -98 -119
7265 -119 -150 -165 -34 60 107 139 64 60 3 -109 -157 -105 -66 -2 72 184 149 116 -21 -92 -102 -125 -57 30 59 204 138 89
7293 89 39 -88 -115 -152 -75 -22 66 112 216 122 19 -56 -120 -146 -135 -11 48 130 138 91 76 -91 -127 -109 -65 -83 -20 63
7321 63 183 156 94 4 -112 -109 -137 -102 13 128 100 99 123 -19 -38 -93 -120 -67 -9 33 96 134 99 58 -13 -56 -118 -128 -95
7350 -95 53 137 114 126 7 -66 -70 -140 -74 -50 -7 84 77 141 109 -62 -74 -128 -128 -130 -12 39 96 122 100 39 -65 -89 -97 -49
7380 -49 11 10 71 139 77 8 17 -116 -114 -122 -32 39 104 96 118 96 -28 -71 -132 -122 -76 16 101 128 64 62 -69 -49 -71 -120 -145 4
7412 4 66 81 66 75 38 -23 -120 -122 -103 -29 113 134 60 66 -15 -74 -75 -117 -44 -24 14 74 111 131 44 -58 -90 -152 -130 -35 11 79
7444 79 119 81 43 -49 -58 -60 -78 -61 10 75 96 141 103 25 -47 -98 -106 -63 -19 44 106 141 95 -14 -38 -82 -70 5 -77 52 25
7475 25 87 85 38 -8 -84 -116 -70 -70 -2 88 138 41 70 -8 -98 -95 -107 -69 23 74 98 83 45 31 1 -44 -144 -76 -103 77 62
7506 62 108 86 21 -64 -104 -157 -93 -26 16 63 130 61 13 -81 -48 -64 -109 -82 -21 72 24 54 65 -28 -74 -101 -124 -52 -22 63
7536 63 128 46 39 2 -65 -49 -67 -60 -38 52 105 90 118 33 27 -103 -96 -41 -6 72 136 89 55 17 -38 -104 -120 -15 9 36 88
7567 88 66 32 32 -26 -24 -142 -92 -85 -39 117 65 127 40 -40 -35 -87 -81 -9 12 23 18 87 39 33 -21 -102 -97 -83 -39 16 78 125 86
7600 86 -16 -61 -123 -76 -113 -22 20 95 32 77 21 -14 -14 -73 -67 -97 -48 62 100 112 36 -47 -76 -131 -115 -23 25 33 124 85 73
7631 73 37 -22 -67 -40 -35 -79 -43 119 78 92 50 -14 -96 -50 -127 -47 95 138 73 31 23 -21 -26 -62 -99 -24 -6 62 69 86 4
7662 4 22 -50 -70 -115 -87 -9 99 52 19 -16 24 -17 -96 -71 -61 -22 39 41 67 105 89 -29 -86 -92 -107 -14 35 76 161 88 -56
7693 -56 -85 -48 -86 -69 50 25 24 -3 62 19 -40 19 -98 -91 -62 -3 100 112 141 84 -23 -32 -114 -74 -78 1 60 96 109 91
7723 91 46 -16 -65 -52 -59 -92 31 52 67 81 25 -69 -78 -116 -62 -8 51 93 21 56 7 -15 -37 -56 -68 -33 -22 3 119 81
7753 81 109 28 -88 -96 -108 -30 46 67 96 87 78 4 -39 -85 -64 -81 6 53 38 62 44 20 -48 -42 -105 -92 -38 73 93 104 58
7784 58 -88 -52 -48 -132 -10 -35 -20 47 32 131 62 16 -30 -115 -85 -5 15 36 129 152 69 -29 -48 -59 -60 -2 1 43 67 89 76
7815 76 13 -22 -52 -88 -128 -78 30 113 161 116 -32 -118 -37 -58 -17 -13 35 59 54 83 81 60 6 -117 -57 -33 -34 102 56 118
7845 118 88 -15 -24 -87 -60 10 18 47 59 75 48 -53 18 -97 -43 -62 -58 -37 56 111 94 34 -47 -73 -113 -48 -3 -6 71 101
7875 101 68 32 -11 -4 -50 -13 -29 -58 -4 51 94 72 -1 -34 -69 -102 -37 -22 83 57 73 4 -45 -83 -18 -38 -9 -8 -19 50
7905 50 63 110 31 27 -65 -123 -160 -39 21 59 96 37 0 -9 -33 -36 -16 -52 12 18 63 97 10 43 -3 -60 -89 -70 -36 62 101 132
7937 132 56 -23 -17 -66 -122 3 -20 21 19 19 76 12 84 -41 -97 -93 -127 15 101 66 85 40 -45 -41 -108 -44 -11 90 101 46
7967 46 50 47 60 -13 -30 -52 -41 30 -5 59 113 116 71 -29 -68 -106 -57 -16 57 88 57 -15 -17 -42 -53 -22 -56 -92 -35 108 90
7998 90 92 61 -25 -75 -69 -122 -34 75 57 88 45 -24 -28 -30 -21 -4 7 11 -14 73 126 81 22 -53 0 -119 -74 -2 72 54 37 37 -18
8031 -18 -47 -29 -33 -96 -32 43 66 56 70 101 -6 -28 -122 -73 -58 -10 82 94 73 47 -8 -49 -26 -31 -32 5 95 47 79 -3 27
8062 27 -15 -35 -119 -96 -60 110 140 91 87 -18 -117 -62 -77 -34 -11 43 17 28 72 38 51 -53 -56 -104 -54 0 109 130 71
8091 71 -4 -54 -42 -66 -55 3 18 39 30 57 35 33 7 -76 -68 -69 -35 13 101 93 84 29 -8 -133 -61 -51 9 38 79 69 17 2 -37
8124 -37 -1 -92 -32 -57 -26 29 159 115 101 -2 -47 -149 -93 -30 -7 33 22 32 19 21 -43 18 -29 -12 13 -15 56 92 103
8153 103 53 -42 -106 -125 -111 22 100 62 59 62 -39 -32 -56 -26 -52 -30 -17 21 114 58 55 27 -35 -74 -66 -65 27 76 110 55 45 -55
8185 -55 17 -9 -46 -6 -19 -37
8191c7
$$ Imaginary data points
##PAGE= N=2
##DATA TABLE= (X++(I..I)), XYDATA
0 0 0 0 0 0 0 0 0 0 0 0 0 8 -8 8 -8 8 -16 16 -20 24 -32 34 -40 49 -57 66 -77 90 -105 119 -135 155 -174 197
34 197 -223 253 -284 317 -354 395 -440 489 -541 600 -664 734 -809 892 -983 1085 -1193 1315
52 1315 -1449 1601 -1767 1958 -2173 2423 -2712 3054 -3465 3970 -4610 5450 -6603 8296 -11040
67 -11040 16241 -29691 143761 278560 41860 -104253 -197398 -160074 -97999 -26232 -13271
78 -13271 12344 49248 90781 81208 53871 7121 -35193 -64081 -51224 -27881 4552 41906
90 41906 70949 46856 -10192 -60870 -76944 -64853 -25574 10763 26241 40308 82370 118821
102 118821 100908 19095 -90757 -177612 -180976 -91273 27156 101425 122658 111653 77964 27091
114 27091 -29434 -84048 -111958 -81476 -7595 48243 55020 34630 13316 12 -2727 -5436 -21507
127 -21507 -35163 -19018 17472 42160 45914 36150 13708 -16489 -44753 -71048 -87524 -64939
139 -64939 5089 83242 123693 111593 56595 -14407 -64406 -79787 -79480 -73286 -45248 8294 63811
152 63811 93811 81827 29166 -31517 -57682 -43193 -16567 2742 15775 23475 24265 17417 -2615
165 -2615 -33252 -50611 -36590 -7740 11260 19845 29799 44607 57842 52875 12751 -51295 -96891
178 -96891 -94918 -54057 132 46157 69704 69791 55478 28105 -14315 -55593 -68912 -47591 -8435
191 -8435 26607 40420 29390 9696 -1641 -8107 -20208 -31470 -27218 -3999 28377 52329 49639
204 49639 20172 -13981 -33665 -40192 -41724 -37458 -22029 6414 41406 64829 59311 29258 -3819
217 -3819 -26637 -41625 -50784 -49058 -29943 6641 47738 67826 50279 7120 -31846 -45998 -34316
230 -34316 -10042 10851 21134 24405 23562 13887 -6708 -28613 -39055 -32813 -13669 8653 24753
243 24753 33900 39586 38508 21542 -11540 -46303 -63347 -52368 -19026 16752 36951 39293 33126
256 33126 24432 11021 -8978 -30374 -41096 -31988 -6651 19057 31135 27858 15464 -670 -17677
269 -17677 -31472 -34975 -21650 7294 38044 51294 38484 8640 -19678 -34142 -34708 -29038 -21535
282 -21535 -9612 10218 32969 46462 41194 18554 -10099 -32115 -40504 -35821 -21237 195 23336
295 23336 38551 36686 17160 -9623 -28652 -31038 -19566 -4292 7682 16242 23554 26942 19501
308 19501 -1237 -27413 -43811 -39568 -17098 11180 32447 40719 36673 22895 1893 -21946 -40406
321 -40406 -44217 -30036 -4693 18963 31670 32382 25426 14055 -1418 -19378 -33338 -34563 -19211
334 -19211 6161 28275 35729 26671 7776 -11844 -26076 -31906 -27348 -11805 10832 31394 39566
347 39566 31290 11285 -10603 -26481 -33768 -33083 -24196 -6308 17502 38449 45169 32535 6151
360 6151 -20701 -36184 -36298 -24613 -7017 11131 25555 31826 26509 10090 -10857 -26632 -30624
373 -30624 -22795 -8014 8538 22754 31188 29763 16194 -6775 -29637 -40714 -34373 -14079 10315
386 10315 28635 35498 31162 18308 -23 -19647 -33554 -35563 -24277 -4022 16894 30437 32542
399 32542 24286 8790 -10106 -26857 -34343 -28039 -9667 13237 29968 33065 22712 5316 -11960
412 -11960 -24519 -29172 -24363 -11280 7039 24525 33547 29375 13849 -6081 -23440 -32773 -31048
425 -31048 -18748 374 20264 33788 34198 21023 380 -18979 -30133 -29823 -19387 -3767 12263
438 12263 24699 29226 22894 7352 -11144 -25504 -30023 -22744 -7039 10524 24231 29916 24860
451 24860 10118 -9099 -25177 -31742 -26124 -10683 7711 22216 28852 26308 14947 -1828 -18127
464 -18127 -28622 -29027 -18314 -476 17025 27553 28015 18530 2422 -14385 -25812 -27866 -19633
477 -19633 -3697 13502 25052 27079 19494 5063 -10874 -22741 -26773 -21636 -8572 8280 22402
490 22402 28098 23518 10299 -6742 -21006 -27463 -24078 -12336 3942 19013 26924 24785 13714
503 13714 -2244 -17034 -25294 -24278 -14897 -474 14294 24139 25075 16858 2360 -13106 -23777
516 -23777 -25394 -17756 -3864 11462 22650 25525 18979 5615 -9588 -21437 -25234 -19860 -7532
529 -7532 7368 19557 24819 20993 9522 -5387 -18311 -24464 -21576 -10798 3721 16803 23768
542 23768 22030 12395 -1901 -15510 -23514 -22712 -13661 364 14004 22531 22900 15161 1909 -12095
556 -12095 -21722 -23317 -16437 -3568 10383 20330 22886 17298 5654 -8125 -19034 -23026 -18488 -6993
570 -6993 7082 18527 22861 18725 7968 -5512 -17103 -22414 -19533 -9711 3748 15952 22232
583 22232 20218 11086 -1801 -13963 -21297 -21103 -13396 -790 12371 21373 22164 14434 1609 -11440
597 -11440 -20021 -21122 -14663 -3275 9043 18294 21113 15910 4826 -7842 -17638 -21086 -16627 -6196
611 -6196 6326 16772 21473 18201 7882 -5376 -16512 -21506 -18525 -8759 3661 14335 20112
624 20112 19035 11224 -759 -12508 -19913 -20065 -12493 -313 11472 18670 19297 12950 2096 -9389
638 -9389 -17610 -19745 -14427 -3305 9075 17716 19690 14437 4035 -7658 -16405 -19434 -15719 -6118
652 -6118 5904 15689 19660 16528 7673 -3825 -13834 -18950 -17669 -10025 1716 13071 19363 18190
666 18190 10261 -1294 -12017 -17636 -16919 -10485 -645 9471 16400 17504 12299 2374 -8754 -16690
680 -16690 -18174 -12940 -3047 7904 16111 18376 13977 4430 -6827 -15601 -18409 -14209 -5246 5174
694 5174 13616 17274 14960 7621 -2680 -12376 -17715 -16174 -8497 2111 11730 16858 15677 8931 -802
709 -802 -10250 -16176 -16095 -9909 -116 9618 15812 16030 10310 1051 -8355 -14932 -16213 -11717 -2956 7085
725 7085 14573 16849 12858 4124 -5961 -13724 -16518 -13360 -5413 4427 12666 16316 13789 6096 -3623
740 -3623 -11605 -15187 -13373 -6964 1753 9931 14754 14420 8624 -608 -9808 -15300 -14927 -8973 227 9099
756 9099 14529 14687 9640 1110 -7689 -13742 -14694 -10522 -2592 6148 12746 14711 11533 4194 -4792 -12190
772 -12190 -15117 -12263 -4807 4367 11690 14534 11946 5302 -3142 -10340 -13809 -12413 -6503 1891 9668
787 9668 13890 12959 7299 -1091 -8925 -13542 -13205 -8217 -104 8010 13216 13604 8834 1025 -7155 -12588
803 -12588 -13365 -9521 -2131 5864 11844 13438 10191 3139 -4991 -11166 -13256 -10472 -3966 3861 10459
818 10459 13159 11074 4944 -3109 -9934 -13140 -11411 -5528 2324 9252 12765 11618 6351 -1155 -8175
833 -8175 -12409 -12007 -7265 128 7425 11987 12237 7966 945 -6481 -11549 -12373 -8615 -1764 5684 10966
849 10966 12284 9089 2585 -4788 -10345 -12091 -9573 -3566 3758 9704 12098 10039 4348 -2894 -9074
864 -9074 -11925 -10447 -5116 1977 8333 11685 10741 5905 -1093 -7635 -11357 -10878 -6512 232 6806 10925
880 10925 11016 7178 716 -6008 -10516 -11184 -7756 -1598 5220 10094 11193 8232 2323 -4346 -9466 -11138
896 -11138 -8742 -3127 3615 8980 11021 9069 3795 -2804 -8359 -10827 -9358 -4454 1949 7706 10598
911 10598 9684 5192 -1129 -7051 -10407 -9906 -5767 398 6426 10051 10069 6335 345 -5703 -9758 -10090
927 -10090 -6811 -1107 4998 9159 10062 7293 1824 -4163 -8651 -10088 -7754 -2590 3530 8256 10001
942 10001 8102 3216 -2833 -7736 -9867 -8373 -3810 2114 7204 9771 8620 4429 -1345 -6585 -9409
957 -9409 -8865 -5120 507 6012 9234 9047 5653 127 -5378 -8915 -9152 -6070 -755 4764 8478 9140
973 9140 6392 1364 -4083 -8108 -9130 -6853 -2022 3407 7633 9117 7213 2686 -2810 -7281 -9151
988 -9151 -7509 -3199 2297 6834 8957 7709 3753 -1569 -6277 -8719 -7909 -4316 978 5756 8494
1003 8494 8105 4811 -216 -5159 -8210 -8286 -5261 -394 4636 7976 8380 5660 920 -4207 -7600 -8315
1019 -8315 -5941 -1497 3553 7171 8295 6303 2051 -2956 -6895 -8198 -6598 -2637 2351 6436 8174
1034 8174 6941 3194 -1792 -6062 -8186 -7173 -3643 1264 5625 7846 7234 4120 -515 -4977 -7615
1049 -7615 -7443 -4555 -66 4479 7323 7509 4952 599 -3987 -7083 -7588 -5339 -1056 3624 6879 7610
1065 7610 5503 1461 -3128 -6480 -7538 -5838 -2079 2462 6113 7590 6236 2608 -1883 -5736 -7409
1080 -7409 -6505 -3156 1367 5293 7364 6699 3548 -894 -4932 -7072 -6600 -3758 462 4346 6761 6747
1096 6747 4202 149 -4034 -6687 -6924 -4555 -530 3629 6470 6966 5008 1126 -3142 -6287 -7112 -5297
1112 -5297 -1553 2737 5888 6903 5446 2087 -1987 -5363 -6746 -5720 -2619 1516 5056 6707 5740
1127 5740 2876 -1093 -4690 -6533 -5947 -3234 742 4539 6660 6127 3397 -496 -4091 -6262 -6158 -3909
1143 -3909 -328 3457 6104 6487 4408 801 -3158 -5909 -6438 -4638 -1239 2578 5442 6412 4907 1680
1159 1680 -2235 -5195 -6262 -4852 -1796 1802 4733 5995 5091 2350 -1301 -4567 -6216 -5482 -2631
1174 -2631 1096 4427 6140 5667 3095 -594 -4081 -6074 -5868 -3444 225 3666 5637 5654 3740 381
1190 381 -2916 -5295 -5688 -4162 -911 2643 5280 5836 4244 1056 -2511 -5004 -5682 -4286 -1295 2249
1206 2249 4936 5724 4514 1548 -1917 -4601 -5598 -4744 -2274 1082 4167 5833 5329 2820 -831 -4141
1222 -4141 -5838 -5266 -2852 433 3560 5348 5114 3144 -51 -3231 -5118 -5096 -3251 -300 2821 4892
1238 4892 5248 3633 744 -2591 -5071 -5622 -3975 -887 2573 5013 5546 4071 1284 -1930 -4532 -5430
1254 -5430 -4375 -1812 1432 4112 5288 4614 2276 -907 -3694 -5196 -4832 -2630 661 3725 5273
1269 5273 4858 2468 -705 -3517 -4956 -4682 -2711 198 3101 4803 4972 3225 263 -2770 -4822 -5172
1285 -5172 -3671 -810 2490 4783 5456 3980 1087 -2209 -4584 -5146 -3853 -1238 1713 4008 4772 4037
1301 4037 1730 -1172 -3805 -4929 -4307 -2013 1098 3734 4951 4431 2265 -822 -3575 -5086 -4695 -2571
1317 -2571 645 3452 4950 4705 2796 -62 -2829 -4651 -4783 -3266 -516 2507 4474 4797 3431 850
1333 850 -2074 -4210 -4854 -3659 -1083 1938 4224 4909 3677 1110 -1852 -4051 -4625 -3646 -1568 1219
1349 1219 3525 4681 4252 2227 -815 -3489 -4985 -4542 -2417 633 3441 4897 4507 2463 -360 -3070
1365 -3070 -4453 -4329 -2629 -147 2385 4055 4383 3081 678 -2123 -4231 -4723 -3399 -669 2203 4226
1381 4226 4613 3352 859 -1920 -3932 -4547 -3533 -1358 1456 3686 4527 3870 1716 -999 -3420 -4566
1397 -4566 -4079 -2051 697 3287 4561 4209 2272 -513 -2991 -4346 -4150 -2368 180 2707 4214 4146
1413 4146 2615 121 -2366 -4001 -4113 -2906 -489 2125 3968 4413 3245 833 -1892 -3959 -4432 -3333
1429 -3333 -984 1673 3690 4340 3407 1310 -1241 -3399 -4320 -3643 -1653 880 3109 4254 3766 1971
1445 1971 -575 -2939 -4187 -3949 -2181 419 2807 4140 3975 2331 -160 -2520 -3988 -3972 -2531 -243
1461 -243 2157 3851 4089 2930 620 -1943 -3731 -4215 -3095 -891 1727 3644 4215 3300 1084 -1494
1477 -1494 -3446 -4186 -3413 -1335 1129 3180 4054 3534 1636 -823 -2947 -4032 -3656 -1971 530 2811
1493 2811 3986 3776 2153 -329 -2603 -3899 -3838 -2347 75 2346 3824 3881 2527 254 -2017 -3638
1509 -3638 -3868 -2867 -603 1760 3569 3994 3056 966 -1521 -3349 -3945 -3183 -1179 1272 3218 3937
1525 3937 3240 1378 -1058 -3071 -3879 -3345 -1581 700 2746 3814 3488 1961 -411 -2594 -3895 -3622
1541 -3622 -2082 147 2428 3805 3784 2359 191 -2126 -3705 -3818 -2584 -413 1853 3452 3753 2696
1557 2696 797 -1472 -3231 -3815 -2999 -1067 1334 3135 3931 3132 1221 -1150 -3060 -3849 -3256 -1506
1573 -1506 899 2874 3817 3296 1663 -589 -2609 -3682 -3424 -2039 184 2328 3691 3672 2301 73
1589 73 -2207 -3624 -3614 -2362 -308 1970 3382 3606 2526 538 -1751 -3288 -3621 -2613 -842 1440
1605 1440 3084 3607 2981 1150 -1167 -3109 -3869 -3152 -1274 999 2907 3627 3114 1514 -660 -2621
1621 -2621 -3598 -3282 -1821 287 2353 3496 3308 1987 -1 -2014 -3344 -3412 -2269 -168 1920 3376
1637 3376 3547 2319 269 -1789 -3189 -3486 -2482 -569 1519 3090 3544 2699 860 -1294 -2909 -3456
1653 -3456 -2879 -1233 855 2698 3564 3214 1500 -710 -2620 -3498 -3056 -1522 505 2326 3335 3103
1669 3103 1755 -189 -2105 -3233 -3143 -1977 58 1981 3221 3367 2356 293 -1837 -3226 -3493 -2497
1685 -2497 -404 1733 3161 3299 2395 731 -1298 -2752 -3233 -2672 -1060 963 2665 3323 2764 1270
1701 1270 -760 -2549 -3356 -2921 -1429 725 2526 3317 2957 1456 -550 -2233 -3104 -2910 -1673 116
1717 116 1943 3135 3163 2073 161 -1777 -3121 -3305 -2212 -356 1525 2993 3243 2325 576 -1465
1733 -1465 -2797 -3134 -2301 -675 1152 2547 3027 2430 977 -858 -2487 -3190 -2714 -1168 751 2516
1749 2516 3263 2854 1404 -589 -2341 -3189 -2902 -1537 367 2098 2988 2822 1723 14 -1731 -2796
1765 -2796 -2924 -2068 -333 1577 2865 3109 2147 338 -1512 -2829 -3067 -2116 -472 1374 2685 3003 2240
1782 2240 684 -1060 -2442 -2991 -2469 -1027 760 2319 3106 2749 1418 -624 -2359 -3103 -2748 -1384
1798 -1384 486 2109 2936 2739 1535 -205 -1825 -2819 -2734 -1679 -20 1581 2676 2823 1986 330 -1508
1815 -1508 -2775 -3012 -2105 -373 1470 2725 2969 2188 558 -1157 -2502 -2904 -2298 -851 860 2300
1831 2300 2900 2477 1184 -639 -2096 -2858 -2623 -1297 485 2123 2901 2649 1409 -420 -1916 -2703 -2456
1848 -2456 -1464 100 1653 2618 2630 1768 203 -1497 -2605 -2827 -1978 -410 1318 2629 2908 2155 504
1865 504 -1226 -2431 -2733 -2121 -618 992 2205 2666 2201 1011 -696 -2053 -2718 -2350 -1135 483 1974
1882 1974 2728 2461 1269 -423 -1873 -2692 -2478 -1336 237 1726 2579 2511 1546 -1 -1466 -2450 -2558
1899 -2558 -1778 -315 1292 2465 2685 1959 492 -1216 -2378 -2707 -1996 -583 991 2240 2568 2012 738
1916 738 -828 -2061 -2528 -2164 -907 633 1898 2564 2320 1198 -404 -1779 -2564 -2338 -1295 238 1767
1933 1767 2532 2408 1441 -127 -1488 -2449 -2394 -1548 -126 1297 2313 2446 1693 301 -1165 -2184 -2566
1950 -2566 -1832 -535 996 2159 2507 1945 642 -819 -2067 -2456 -2075 -782 674 1913 2431 2092 1014
1967 1014 -477 -1718 -2395 -2194 -1188 351 1701 2430 2333 1292 -137 -1583 -2379 -2313 -1410 20 1387
1984 1387 2211 2260 1492 211 -1178 -2147 -2281 -1707 -414 961 2011 2340 1751 518 -901 -1922 -2354
2001 -2354 -1875 -641 715 1918 2353 1917 791 -596 -1758 -2277 -1957 -1002 416 1620 2208 2107 1183
2018 1183 -167 -1497 -2225 -2137 -1252 75 1371 2195 2239 1285 64 -1258 -2097 -2157 -1471 -263 1034 1975
2036 1975 2121 1581 421 -901 -1873 -2190 -1697 -571 789 1844 2257 1859 698 -632 -1778 -2235 -1898
2053 -1898 -797 486 1567 2101 1893 989 -236 -1413 -2112 -1957 -1163 94 1323 2054 2027 1303 -5
2070 -5 -1256 -2038 -2065 -1299 -129 1156 1938 1978 1390 253 -995 -1817 -2049 -1591 -445 865 1754 2082 1720
2089 1720 614 -656 -1694 -2073 -1704 -772 527 1572 2008 1728 845 -451 -1495 -1952 -1737 -950 236
2106 236 1312 1919 1798 1104 -44 -1234 -1914 -1905 -1221 -15 1119 1892 1883 1310 181 -1048 -1774 -1904 -1374
2125 -1374 -342 820 1651 1925 1446 540 -640 -1511 -1917 -1556 -637 503 1537 1964 1691 718 -464 -1440
2143 -1440 -1891 -1654 -768 431 1330 1845 1658 879 -193 -1192 -1797 -1749 -1094 -14 1045 1832 1836 1212 88
2162 88 -1043 -1741 -1893 -1306 -201 931 1634 1742 1258 291 -758 -1452 -1709 -1398 -464 634 1392 1802 1506
2181 1506 673 -462 -1497 -1878 -1573 -698 463 1352 1814 1577 788 -288 -1277 -1692 -1562 -962 21 1032
2199 1032 1641 1596 1073 150 -863 -1641 -1751 -1180 -127 948 1625 1646 1151 209 -808 -1470 -1626 -1159 -327
2218 -327 604 1412 1635 1298 484 -504 -1313 -1692 -1444 -690 337 1341 1755 1514 699 -401 -1161 -1625 -1440
2237 -1440 -697 199 1027 1445 1437 892 10 -866 -1432 -1492 -992 -103 833 1486 1575 1117 105 -908 -1519 -1539 -991
2258 -991 -146 807 1413 1465 1146 360 -518 -1196 -1450 -1299 -529 394 1163 1541 1344 651 -359 -1145 -1541 -1369
2278 -1369 -604 281 1095 1449 1238 639 -198 -933 -1335 -1291 -800 -36 797 1400 1408 952 75 -810 -1488 -1458 -985
2299 -985 -154 808 1388 1450 952 224 -591 -1213 -1356 -951 -376 502 1111 1348 1142 498 -372 -1103 -1417 -1190
2319 -1190 -473 376 1110 1433 1180 515 -301 -1065 -1386 -1194 -570 190 907 1271 1273 759 22 -817 -1284 -1392
2339 -1392 -883 -61 760 1355 1381 918 104 -729 -1196 -1284 -863 -160 648 1149 1238 966 305 -443 -1041 -1272 -1047
2360 -1047 -426 428 1023 1318 1124 444 -330 -1109 -1341 -1152 -462 290 1010 1212 1138 598 -148 -808 -1196 -1142
2380 -1142 -707 29 711 1198 1178 770 38 -725 -1127 -1227 -782 -45 699 1152 1184 770 149 -591 -1044 -1101 -837
2401 -837 -210 465 1027 1183 991 365 -381 -996 -1272 -960 -407 377 989 1205 1010 423 -285 -885 -1147 -978
2421 -978 -536 185 760 1103 1051 607 -29 -714 -1109 -1108 -664 -3 716 1150 1149 736 75 -667 -1057 -1099 -720 -36
2443 -36 607 1040 1052 796 187 -422 -960 -1130 -838 -338 393 955 1201 940 389 -379 -940 -1072 -885 -367 325
2464 325 902 1061 890 402 -245 -766 -1029 -894 -502 162 655 1030 993 598 -39 -645 -1005 -1063 -584 49 694
2485 694 989 1005 649 81 -547 -965 -1027 -712 -171 463 869 998 731 291 -371 -853 -1043 -805 -295 390 869
2506 869 1027 821 245 -340 -841 -1022 -804 -316 290 763 937 819 405 -175 -632 -982 -920 -500 98 697
2526 697 1032 963 514 10 -638 -915 -932 -536 -23 555 940 914 547 43 -524 -848 -874 -661 -114 401 821
2547 821 948 757 231 -454 -895 -958 -717 -206 393 869 967 737 317 -207 -698 -936 -749 -370 171 659 919
2568 919 864 443 -124 -594 -944 -841 -483 56 635 959 819 439 -89 -625 -882 -875 -537 -46 485 876 895
2589 895 604 123 -462 -873 -1006 -681 -241 389 863 980 754 221 -345 -789 -954 -694 -165 349 653 869
2609 869 721 306 -185 -645 -908 -713 -379 178 597 942 874 439 -151 -660 -909 -876 -478 107 617 906 853
2630 853 494 -64 -533 -865 -888 -535 -74 418 758 834 613 121 -394 -808 -862 -656 -149 455 871 915 636
2651 636 181 -374 -767 -852 -620 -246 272 724 838 721 364 -156 -753 -886 -793 -469 136 690 902 847 420
2672 420 -133 -613 -911 -743 -446 24 502 753 793 509 87 -434 -769 -878 -562 -58 449 859 955 651 89
2693 89 -413 -816 -914 -571 -72 383 753 827 698 215 -252 -618 -837 -765 -385 123 597 872 760 389 -217
2714 -217 -722 -953 -827 -358 198 617 844 757 382 -92 -540 -789 -754 -475 -33 451 821 880 622 102 -434
2735 -434 -898 -914 -620 -101 504 860 863 608 124 -393 -706 -791 -546 -184 295 638 866 695 312 -206 -716
2756 -716 -934 -824 -341 274 789 962 750 319 -240 -639 -871 -764 -298 98 530 795 785 468 21 -504
2776 -504 -803 -849 -586 -93 481 900 892 594 25 -440 -813 -809 -506 -78 404 743 807 607 202 -309 -709 -880
2798 -880 -736 -291 284 704 925 784 284 -217 -783 -922 -727 -309 238 675 873 736 339 -131 -593 -773
2818 -773 -721 -408 87 512 859 877 511 -26 -582 -869 -895 -530 2 517 844 808 504 61 -392 -756 -808 -603
2840 -603 -161 315 725 848 666 299 -289 -756 -887 -790 -265 306 691 890 720 260 -293 -660 -843 -668
2860 -668 -324 137 565 827 766 457 -40 -558 -795 -797 -468 15 540 849 887 520 -50 -497 -846 -799 -514 -70
2882 -70 454 742 785 540 130 -355 -805 -914 -664 -256 306 736 917 692 229 -292 -800 -911 -682 -216 277
2903 277 667 823 771 309 -181 -590 -806 -779 -478 159 588 912 822 501 -51 -580 -896 -942 -445 52 546
2924 546 808 805 475 17 -511 -804 -829 -564 -133 370 743 852 646 188 -358 -718 -846 -723 -277 322 813
2945 813 877 719 252 -251 -644 -867 -732 -323 189 620 875 752 449 -129 -582 -819 -812 -490 69 584 876
2966 876 830 502 -12 -565 -859 -836 -515 -81 501 834 855 584 110 -439 -800 -876 -637 -161 360 750 950
2987 950 644 214 -329 -793 -873 -772 -236 278 721 862 750 312 -262 -611 -901 -741 -387 136 627 887
3007 887 816 432 -90 -627 -937 -832 -481 49 558 919 902 578 23 -577 -861 -859 -554 -127 458 825 905 697
3029 697 168 -353 -832 -920 -698 -191 351 784 943 701 283 -270 -740 -885 -742 -331 240 680 916 760
3049 760 399 -164 -627 -899 -829 -490 71 587 909 891 517 -49 -638 -954 -913 -538 18 525 887 919 618
3070 618 93 -407 -794 -878 -682 -131 391 808 951 756 270 -373 -781 -995 -794 -291 350 809 965 782
3090 782 326 -306 -785 -904 -861 -433 112 695 952 850 475 -106 -634 -951 -900 -545 52 625 958 896 584
3111 584 49 -517 -885 -956 -601 -98 453 949 996 721 221 -341 -765 -952 -774 -250 337 877 1024 776 297
3132 297 -332 -764 -1078 -811 -323 228 742 956 869 438 -138 -661 -967 -877 -541 -4 620 975 1014 568 9
3153 9 -534 -979 -961 -557 2 525 966 925 628 111 -416 -879 -988 -733 -244 395 838 973 832 314 -317
3174 -317 -804 -1003 -828 -361 318 750 1002 842 350 -250 -703 -930 -867 -478 119 621 966 870 589 -92 -690
3195 -690 -1035 -1012 -637 -42 630 933 1053 645 58 -566 -908 -977 -657 -161 378 877 1005 761 296 -300 -830
3216 -830 -1012 -838 -335 302 829 1014 823 311 -259 -831 -1070 -859 -469 141 722 951 875 493 -66 -616
3236 -616 -946 -1001 -580 -28 628 959 1017 677 47 -557 -965 -1040 -636 -108 519 901 974 710 231 -392 -841
3257 -841 -961 -823 -326 269 839 1005 869 357 -296 -788 -1071 -925 -424 171 699 1018 865 493 -126 -698
3277 -698 -1013 -946 -574 -22 667 990 996 641 10 -564 -931 -1014 -712 -97 562 910 1026 737 176 -544 -876
3298 -876 -1004 -749 -274 367 847 961 827 307 -283 -853 -1066 -931 -377 236 801 1075 910 453 -165 -683
3318 -683 -1082 -927 -533 95 654 1009 979 654 28 -563 -935 -1017 -654 -98 527 956 1049 716 136 -453 -942
3339 -942 -1032 -782 -255 441 897 1015 831 303 -363 -815 -1044 -887 -390 254 786 1012 886 500 -132 -782
3359 -782 -1057 -946 -481 123 736 1028 903 578 22 -629 -976 -1022 -669 -69 548 958 1016 763 119 -466 -978
3380 -978 -1004 -738 -211 440 898 1081 773 310 -358 -903 -1077 -854 -343 301 793 1019 864 375 -209 -808
3400 -808 -1023 -955 -492 119 721 1059 953 537 -57 -681 -1016 -954 -603 61 576 932 948 655 94 -492 -917
3421 -917 -1028 -770 -193 491 1003 1063 819 290 -396 -924 -1056 -847 -333 333 833 1048 885 378 -244 -790
3441 -790 -1038 -870 -407 146 690 979 948 546 -85 -676 -1066 -970 -558 47 631 1048 1025 648 86 -544 -947
3462 -947 -1013 -696 -130 525 928 1071 772 236 -392 -873 -1048 -856 -340 390 797 1086 863 366 -325 -870
3482 -870 -1038 -857 -403 240 787 1002 936 469 -93 -711 -975 -1010 -562 59 641 1028 970 680 47 -604 -934
3503 -934 -1005 -670 -77 591 946 1004 731 223 -433 -893 -1046 -804 -218 395 905 1017 902 362 -276 -860 -1049
3524 -1049 -833 -375 269 803 1033 914 444 -176 -710 -1023 -906 -564 76 673 1036 977 627 25 -576 -939
3544 -939 -1041 -656 -30 526 977 1050 725 115 -491 -940 -1011 -732 -216 375 813 934 817 317 -357 -805 -1094
3565 -1094 -857 -440 216 796 1017 895 471 -216 -753 -1016 -904 -501 152 664 953 890 509 -35 -612 -934
3585 -934 -939 -647 -44 565 953 1049 623 108 -513 -901 -984 -722 -155 460 924 988 774 237 -333 -839 -1036 -845
3607 -845 -370 235 821 992 796 424 -257 -771 -1050 -873 -451 148 740 1008 907 473 -22 -620 -961 -938
3627 -938 -536 -30 557 948 979 658 57 -506 -968 -1051 -690 -129 434 937 1009 726 211 -405 -876 -1021 -834
3648 -834 -242 269 774 945 881 423 -212 -758 -998 -918 -442 118 741 999 947 505 -152 -681 -915 -911 -563 93
3670 93 612 967 978 635 40 -503 -930 -994 -709 -104 477 890 1022 797 205 -468 -899 -1031 -776 -237 307
3691 307 766 914 825 312 -231 -724 -947 -926 -471 173 756 1047 882 452 -177 -699 -1033 -916 -507 100 674
3712 674 930 928 558 57 -554 -907 -924 -618 -152 458 925 1055 731 137 -506 -871 -1008 -728 -192 409 804
3733 804 968 718 280 -316 -782 -957 -835 -397 145 742 957 927 446 -140 -703 -1006 -975 -514 64 645 961
3754 961 913 584 -37 -568 -869 -910 -573 -110 474 831 972 731 177 -388 -845 -1024 -789 -224 451 858 986
3775 986 786 267 -350 -864 -911 -856 -318 267 727 939 830 455 -126 -714 -977 -858 -472 45 665 1030 928
3796 928 543 -39 -646 -964 -876 -504 30 576 901 910 652 127 -417 -881 -900 -690 -181 350 837 977 767
3817 767 211 -413 -848 -965 -780 -285 252 736 946 791 323 -195 -722 -934 -841 -423 106 619 942 873 535
3838 535 -29 -656 -946 -955 -547 39 597 903 948 630 8 -490 -827 -917 -718 -196 382 830 969 714 251
3859 251 -319 -847 -1005 -800 -269 247 788 934 752 342 -261 -724 -890 -782 -370 174 608 890 910 520
3879 520 -18 -567 -877 -918 -583 70 591 893 921 576 38 -548 -867 -917 -605 -74 442 839 914 673 223
3900 223 -321 -747 -989 -693 -262 323 820 967 776 282 -359 -804 -957 -781 -387 204 707 912 825 419
3920 419 -115 -612 -876 -902 -524 0 570 938 942 639 79 -558 -904 -902 -583 -58 495 892 894 627 104 -407
3942 -407 -749 -900 -706 -251 313 726 882 771 350 -234 -814 -1058 -865 -404 256 754 981 823 413 -155
3962 -155 -592 -877 -815 -471 61 566 864 917 579 38 -509 -782 -948 -578 -83 492 825 856 571 100 -437
3983 -437 -814 -888 -638 -201 264 671 967 810 334 -270 -727 -974 -818 -394 209 755 887 797 333 -207 -639
4004 -639 -885 -760 -384 150 545 847 775 534 30 -499 -816 -835 -552 -68 589 899 921 644 59 -506 -851
4025 -851 -899 -650 -105 361 716 872 696 290 -271 -737 -836 -739 -372 167 678 915 839 387 -225 -714 -945
4046 -945 -795 -378 128 618 864 804 452 -93 -533 -788 -794 -525 45 489 851 923 652 152 -405 -799 -909
4067 -909 -676 -91 429 795 853 648 203 -302 -658 -868 -622 -320 206 646 904 785 356 -203 -610 -898
4087 -898 -872 -340 224 657 959 817 466 -106 -476 -751 -750 -541 -4 446 762 784 672 82 -416 -790 -887 -612
4109 -612 -154 439 843 859 606 197 -398 -740 -826 -606 -246 300 726 814 695 351 -140 -591 -877 -818 -485
4130 -485 107 662 917 792 463 -93 -620 -871 -758 -417 44 540 766 756 513 120 -425 -724 -774 -604 -246
4151 -246 359 783 919 630 188 -337 -815 -885 -607 -200 380 721 794 616 287 -216 -656 -824 -721 -378 155
4172 155 619 864 794 446 -119 -587 -863 -835 -384 108 578 835 757 440 -42 -502 -666 -806 -545 -106 404
4193 404 787 918 684 179 -413 -826 -903 -670 -174 380 751 831 648 195 -340 -649 -774 -687 -316 149 588
4214 588 820 795 425 -119 -630 -825 -837 -469 128 558 915 767 434 -24 -463 -751 -748 -468 -100 421 668
4235 668 811 615 205 -335 -740 -791 -641 -258 312 748 859 608 193 -273 -723 -823 -654 -238 212 564
4255 564 768 666 388 -117 -602 -802 -756 -441 47 579 923 820 488 -62 -524 -813 -760 -429 36 428 702
4276 702 804 504 109 -332 -720 -784 -623 -168 314 703 870 618 202 -301 -743 -850 -665 -230 262 640
4296 640 773 639 304 -176 -565 -811 -760 -383 80 569 856 768 487 -7 -565 -788 -775 -471 17 505 824
4317 824 749 474 40 -335 -674 -731 -615 -152 270 674 789 585 192 -299 -710 -867 -696 -231 280 697 834
4338 834 648 285 -177 -610 -800 -649 -325 98 524 765 746 505 -40 -524 -743 -786 -490 48 541 808 756
4359 756 505 31 -409 -716 -733 -546 -95 302 625 822 622 232 -274 -634 -827 -712 -284 247 643 825
4379 825 682 220 -261 -604 -808 -677 -262 169 575 839 710 383 15 -468 -792 -752 -513 16 479 807
4399 807 846 490 5 -436 -751 -774 -514 -84 376 658 715 596 145 -293 -644 -788 -677 -267 260 627 797
4420 797 670 254 -284 -666 -820 -696 -299 144 535 765 695 389 -36 -503 -758 -714 -473 -39 432 729 797
4441 797 523 80 -413 -779 -808 -456 -86 394 720 758 531 118 -360 -555 -798 -596 -224 195 590 769 655
4462 655 296 -201 -629 -848 -695 -293 205 556 732 661 359 -96 -507 -702 -670 -403 -8 457 737 777 485
4483 485 118 -432 -704 -748 -467 -87 400 665 794 546 89 -322 -604 -749 -589 -221 199 578 751 647
4503 647 257 -219 -604 -762 -710 -326 152 578 782 706 324 -88 -483 -720 -661 -384 36 457 719 691 462
4524 462 52 -385 -716 -726 -450 -44 426 707 753 568 91 -358 -690 -743 -549 -187 244 599 766 620 255
4545 255 -210 -573 -757 -700 -389 157 601 696 679 343 -143 -527 -735 -718 -370 89 459 647 682 436 -7 -412
4567 -412 -651 -712 -482 -87 405 697 802 519 101 -260 -657 -706 -541 -176 318 576 723 582 176 -241 -567
4588 -567 -736 -597 -286 180 551 732 661 340 -138 -523 -743 -655 -324 96 488 700 707 432 -17 -382 -624
4609 -624 -693 -433 -100 369 665 714 507 106 -356 -713 -691 -496 -98 286 552 698 539 151 -245 -559 -747
4630 -747 -535 -296 163 513 675 598 292 -84 -538 -724 -624 -351 94 464 792 665 400 -62 -457 -602
4650 -602 -646 -414 -57 364 642 707 494 107 -363 -661 -702 -499 -126 321 596 725 505 150 -255 -554 -687
4671 -687 -588 -239 201 519 638 561 287 -116 -524 -672 -672 -343 104 488 768 624 369 -54 -424 -592 -630 -360
4693 -360 -43 397 627 710 426 64 -324 -598 -649 -529 -164 304 590 689 484 113 -275 -597 -707 -486 -235
4714 -235 220 532 649 551 228 -101 -473 -662 -554 -334 101 524 663 636 389 -69 -425 -648 -592 -345 24
4735 24 376 665 600 421 89 -289 -538 -648 -429 -145 294 575 687 533 182 -289 -606 -654 -461 -205 159
4756 159 570 644 515 203 -167 -453 -643 -589 -278 91 419 660 655 319 -30 -409 -678 -618 -365 21 402 661
4778 661 645 374 6 -358 -537 -622 -419 -95 276 568 695 472 101 -274 -572 -633 -524 -148 274 533 658
4799 658 485 202 -227 -474 -654 -517 -262 164 407 577 547 326 -11 -369 -575 -661 -354 100 414 641 572
4820 572 389 43 -373 -533 -543 -379 -50 302 564 596 426 132 -244 -524 -629 -499 -182 218 517 605 431
4841 431 189 -234 -518 -643 -480 -201 155 418 543 540 292 -97 -417 -606 -571 -307 23 429 587 609 347
4862 347 33 -429 -565 -596 -345 -38 330 537 528 404 111 -257 -498 -577 -527 -165 214 535 626 490 195 -188
4884 -188 -486 -633 -486 -260 144 426 593 499 201 -140 -393 -545 -496 -255 57 372 638 578 353 39 -403
4905 -403 -576 -534 -306 -5 332 549 544 399 49 -272 -525 -568 -393 -94 244 463 582 474 194 -188 -538
4926 -538 -619 -483 -188 160 514 585 464 204 -142 -453 -549 -486 -294 97 387 526 524 344 -16 -320 -518 -585
4948 -585 -384 -41 307 541 565 415 -25 -346 -479 -510 -377 -67 240 539 552 465 167 -214 -466 -556 -435 -234
4970 -234 142 430 610 483 235 -103 -490 -569 -513 -234 100 392 559 517 288 -31 -373 -469 -446 -299 -20 292
4992 292 532 550 409 38 -270 -515 -532 -359 -76 252 547 590 398 74 -183 -477 -558 -464 -198 144 420 515
5014 515 507 184 -151 -461 -572 -490 -229 81 412 511 479 221 -96 -341 -473 -489 -314 -5 286 513 552 371
5036 371 66 -297 -493 -482 -390 -63 270 536 521 384 51 -265 -421 -536 -397 -140 167 370 484 375 246
5057 246 -127 -399 -550 -473 -193 78 405 541 464 202 -78 -370 -490 -482 -267 6 306 535 459 257 23 -280
5079 -280 -476 -508 -340 -76 252 472 553 391 51 -218 -478 -523 -432 -118 158 399 481 365 116 -122 -352 -529
5101 -529 -435 -171 85 369 545 508 229 -80 -401 -487 -459 -212 35 321 484 496 279 47 -240 -440 -465 -343
5123 -343 -55 301 448 540 364 50 -263 -485 -547 -380 -130 252 419 489 343 86 -142 -416 -442 -430 -232 94
5145 94 342 475 468 222 -72 -356 -480 -515 -196 110 279 536 482 238 -24 -307 -420 -450 -256 -25 240 488
5167 488 514 391 84 -216 -432 -476 -357 -111 236 416 476 333 79 -156 -424 -495 -425 -196 107 356 444 421
5189 421 223 -115 -322 -466 -452 -225 76 385 460 505 230 -81 -331 -434 -433 -230 -44 281 462 475 270 66
5211 66 -245 -462 -467 -381 -96 154 426 517 365 73 -234 -402 -472 -324 -146 150 400 460 397 94 -79 -313 -458
5234 -458 -438 -240 95 309 446 453 240 -50 -305 -480 -394 -232 37 291 457 467 298 78 -257 -400 -479 -317
5256 -317 -31 218 411 430 355 93 -199 -414 -481 -391 -99 214 423 439 333 159 -136 -380 -416 -345 -147 81
5278 81 312 453 465 238 -83 -309 -429 -451 -217 -8 318 461 441 327 -23 -276 -436 -440 -250 -40 218 483
5300 483 443 324 88 -205 -371 -482 -370 -149 148 366 490 354 86 -132 -389 -431 -388 -161 155 354 477
5321 477 398 214 -90 -265 -431 -379 -270 66 327 457 432 280 29 -275 -395 -426 -250 -16 248 446 417 274
5343 274 73 -240 -365 -454 -311 -126 177 347 441 367 133 -153 -361 -429 -425 -167 107 344 428 394 150 -104 -333
5366 -333 -407 -388 -150 73 271 424 437 261 -11 -257 -376 -390 -282 -49 255 483 430 262 52 -207 -418 -405
5388 -405 -294 -69 188 377 410 306 108 -171 -397 -432 -356 -160 151 333 457 328 159 -118 -303 -376 -357 -186
5410 -186 93 312 410 344 284 22 -230 -352 -388 -234 -31 225 400 436 244 78 -248 -377 -376 -295 -45 237 333
5433 333 401 336 -14 -161 -350 -425 -310 -113 129 401 419 359 126 -98 -354 -361 -412 -155 91 309 417 351 215
5456 215 -42 -268 -387 -311 -222 -9 303 379 371 274 50 -189 -366 -405 -279 -19 239 366 462 312 87 -202 -390
5479 -390 -448 -326 -99 185 359 383 286 63 -105 -347 -441 -370 -196 69 322 466 401 194 -93 -363 -445 -345
5501 -345 -125 88 331 370 375 195 0 -151 -322 -380 -206 -25 181 363 449 281 38 -195 -433 -444 -274 -31
5523 -31 198 330 367 274 47 -127 -316 -435 -371 -162 57 264 395 380 198 -65 -275 -386 -400 -163 89 297
5545 297 433 350 190 11 -257 -389 -331 -236 8 195 322 422 284 57 -205 -392 -449 -369 -53 176 373 438
5567 438 298 157 -210 -375 -384 -286 -147 137 310 394 342 200 -15 -251 -396 -355 -224 86 298 439 444 223 -70
5590 -70 -307 -392 -378 -157 53 254 301 329 242 42 -201 -404 -413 -339 -65 197 388 390 330 88 -207 -398 -478 -281
5614 -281 -55 183 259 364 341 186 -118 -237 -354 -354 -182 74 262 429 420 240 4 -328 -383 -408 -153 87 266
5637 266 338 379 198 15 -221 -382 -352 -267 -87 189 319 365 354 72 -170 -414 -433 -388 -118 148 376 396 316
5660 316 141 -123 -303 -336 -315 -214 0 246 391 428 327 1 -273 -415 -445 -294 -9 321 515 348 251 -5
5682 -5 -265 -364 -320 -222 -27 172 360 400 266 125 -166 -379 -440 -410 -137 127 360 447 325 54 -117 -346 -355 -274
5706 -274 -126 102 237 331 356 216 -34 -148 -422 -387 -216 -18 294 431 342 279 -35 -280 -411 -391 -215 15
5728 15 154 320 334 261 62 -140 -320 -404 -303 -200 93 313 420 329 117 -124 -371 -390 -332 -143 146 284
5750 284 416 325 166 -49 -220 -344 -328 -260 66 244 318 436 285 0 -236 -382 -426 -294 -6 210 356 339
5772 339 270 32 -185 -306 -373 -301 -64 122 335 429 347 180 -128 -347 -419 -363 -164 26 315 451 335 186
5794 186 -52 -294 -369 -375 -209 29 231 348 380 199 -9 -195 -417 -371 -241 -13 198 398 362 285 34 -227
5816 -227 -388 -355 -310 -62 86 350 370 297 123 -108 -224 -352 -359 -154 67 352 452 373 144 -39 -261 -404
5838 -404 -346 -169 40 215 401 333 163 2 -166 -323 -382 -209 -34 214 349 410 271 108 -122 -382 -379 -309
5860 -309 -44 186 375 398 248 82 -106 -312 -415 -320 -170 61 286 409 308 208 -51 -298 -409 -387 -201
5881 -201 83 264 403 361 247 -10 -242 -346 -349 -192 -88 153 340 311 271 109 -196 -364 -369 -313 -100 201 379
5904 379 380 281 66 -147 -299 -377 -240 -158 91 270 371 301 158 -70 -227 -318 -357 -201 82 209 385 396 217
5927 217 -8 -182 -381 -317 -214 -12 245 324 367 259 99 -189 -294 -369 -252 -73 144 319 364 332 90 -169
5949 -169 -350 -409 -273 -154 60 231 362 306 134 -53 -246 -414 -278 -165 3 232 390 387 168 -7 -212
5970 -212 -335 -357 -245 11 214 393 420 269 54 -183 -364 -397 -251 -71 152 328 359 297 191 -175 -331 -404
5992 -404 -322 -128 81 276 378 292 67 -101 -264 -408 -336 -129 29 271 397 362 218 -12 -160 -332 -365 -198
6014 -198 15 200 338 446 230 44 -195 -334 -378 -263 -110 169 288 392 325 55 -152 -240 -362 -266 -134
6035 -134 110 287 352 363 155 -101 -294 -407 -368 -216 84 302 373 369 221 48 -236 -325 -400 -186 -7 219 327
6058 327 361 246 101 -137 -313 -370 -266 -74 154 288 376 252 156 -117 -264 -350 -308 -121 63 266 360 347 131
6081 131 5 -326 -330 -336 -190 57 215 384 383 226 -19 -232 -341 -350 -186 -40 223 290 355 321 41 -169 -365 -393
6105 -393 -292 -86 103 318 393 285 136 -122 -344 -366 -336 -134 42 300 358 306 112 -84 -300 -367 -353 -214
6127 -214 26 214 410 389 215 6 -201 -344 -390 -198 -2 237 360 378 231 38 -131 -303 -347 -277 -99 167
6149 167 296 378 318 127 -101 -343 -414 -389 -140 124 275 352 260 140 -101 -276 -351 -297 -198 18 189 249 350
6172 350 184 -9 -204 -352 -332 -238 32 258 339 302 224 82 -151 -345 -359 -263 -86 132 338 376 299 117 -118
6195 -118 -270 -371 -300 -165 100 263 381 346 187 -110 -247 -386 -332 -161 55 182 345 289 210 42 -217 -294
6217 -294 -334 -240 -40 200 307 435 273 26 -180 -329 -358 -221 3 145 236 387 287 64 -124 -274 -334 -287
6239 -287 -117 59 265 344 287 124 -91 -273 -398 -307 -163 54 248 385 324 155 -8 -197 -377 -347 -209 -10
6261 -10 187 278 323 219 72 -158 -276 -367 -253 -88 118 336 335 229 90 -129 -245 -332 -264 -95 80 277 349
6284 349 357 152 -101 -287 -349 -369 -155 45 200 309 300 226 -18 -201 -350 -341 -168 27 200 318 331 226 89
6307 89 -186 -268 -336 -254 -113 141 256 352 273 110 -105 -278 -364 -279 -124 87 214 329 291 156 -51 -207 -314
6330 -314 -275 -179 18 207 324 372 177 -34 -188 -367 -302 -231 -38 166 337 309 204 47 -194 -284 -287 -229 -81
6353 -81 147 299 343 284 83 -85 -292 -377 -256 -155 86 239 384 263 201 -10 -225 -293 -286 -210 19 175 351
6376 351 294 197 -5 -217 -322 -316 -261 -67 158 303 339 228 54 -162 -286 -345 -255 -66 151 343 310 328 141
6399 141 -33 -275 -286 -351 -124 66 237 382 256 185 -91 -222 -271 -314 -218 -26 155 263 314 193 -43 -145
6421 -145 -317 -349 -227 -81 159 297 337 289 88 -154 -240 -301 -215 -116 137 238 335 250 84 -121 -259 -309 -254 -143
6445 -143 73 194 349 324 152 -41 -251 -324 -289 -158 -37 222 275 295 172 -26 -175 -278 -303 -233 -80 156
6467 156 265 344 188 64 -143 -260 -284 -213 -72 135 276 358 301 92 -83 -214 -291 -265 -149 113 223 333
6489 333 300 170 -18 -215 -360 -296 -165 -2 166 275 283 177 -24 -190 -275 -349 -198 -54 160 206 290 263 55
6512 55 -150 -193 -270 -268 -72 97 215 305 276 129 -43 -264 -302 -270 -142 113 220 274 231 117 56 -171 -311 -261
6536 -261 -219 -23 149 293 275 180 -4 -148 -262 -349 -220 -84 121 256 323 232 70 -58 -281 -324 -214 -55
6558 -55 102 255 305 269 157 -43 -161 -281 -267 -146 29 161 353 256 145 -45 -160 -319 -280 -136 -12 185
6580 185 252 268 186 -17 -162 -334 -355 -259 -30 81 291 279 238 21 -139 -209 -290 -260 -109 146 242 248 253 178 -71
6605 -71 -185 -245 -219 -121 47 218 252 258 154 -38 -165 -278 -255 -164 -29 150 229 263 251 22 -149 -257 -262 -227 -66
6630 -66 127 232 256 194 40 -93 -213 -261 -221 -93 93 202 280 232 91 -55 -185 -310 -252 -88 48 227 324
6653 324 248 152 -18 -122 -305 -258 -165 -40 146 255 296 209 14 -127 -290 -334 -181 -91 95 197 269 224 75
6676 75 -99 -219 -319 -244 -69 75 198 224 269 105 18 -168 -280 -245 -114 37 218 259 240 201 30 -132 -280
6699 -280 -259 -219 -17 123 266 260 222 76 -120 -228 -260 -181 -35 130 195 265 193 77 -65 -239 -358 -235 -68
6722 -68 20 175 218 223 116 -52 -170 -228 -185 -175 -15 159 216 295 135 64 -144 -272 -261 -168 -17 187 252 232 211
6747 211 76 -136 -249 -295 -209 -40 98 182 250 198 88 -69 -258 -277 -229 -95 9 184 232 165 119 -24 -174
6770 -174 -317 -251 -176 -9 125 250 269 134 24 -105 -209 -251 -147 -51 170 199 278 177 54 -123 -234 -255 -193
6793 -193 -74 55 202 246 171 72 11 -175 -220 -188 -125 20 170 209 218 129 -9 -148 -219 -188 -154 48 151 225 286
6818 286 176 -2 -147 -223 -219 -172 -19 112 194 233 127 59 -22 -232 -254 -231 -110 90 215 220 254 56 -74 -163 -198
6843 -198 -207 -136 59 156 216 225 97 10 -171 -205 -238 -119 31 164 217 215 151 -14 -127 -187 -192 -146 -2 36 220 253 217
6870 217 29 -115 -196 -200 -149 -67 97 143 244 197 121 -84 -221 -214 -207 -107 56 136 214 214 87 -50 -130 -239 -187 -104
6896 -104 15 151 227 256 164 61 -105 -232 -211 -114 -87 142 246 200 183 44 -64 -143 -236 -196 -55 10 208 189
6920 189 175 56 -16 -189 -242 -219 -116 13 206 198 232 140 -40 -126 -182 -195 -141 36 61 212 150 115 49 -102 -201 -233
6946 -233 -116 -64 50 212 198 181 69 -96 -204 -188 -215 -77 64 193 222 139 79 -103 -128 -193 -235 -162 9 95
6970 95 274 219 98 -40 -116 -176 -183 -117 -18 153 160 226 89 51 -56 -199 -161 -105 -80 84 239 198 153 38 -56 -185
6996 -185 -216 -136 -46 52 159 173 172 99 -87 -127 -170 -216 -92 13 120 182 185 138 -11 -143 -187 -202 -58 -24 107 195
7022 195 199 122 -21 -114 -175 -162 -128 -22 98 150 205 166 86 -67 -149 -219 -170 -12 29 208 232 163 5 -67 -116 -170 -197
7049 -197 -76 15 64 188 189 179 -52 -85 -173 -234 -158 -7 50 173 216 89 -13 -76 -185 -281 -147 -46 52 186 211
7074 211 101 118 -2 -141 -178 -200 -39 22 151 222 191 86 -45 -162 -184 -146 -79 -22 91 129 86 88 -29 -106 -165
7099 -165 -176 -150 -11 64 143 193 97 -8 -158 -196 -166 -61 -68 72 190 181 159 68 -1 -135 -171 -145 -82 9 159 211 143
7126 143 109 14 -162 -215 -120 -34 39 144 132 133 114 -9 -97 -165 -166 -131 -10 -29 114 180 161 55 -59 -131 -168 -140 -8
7153 -8 55 140 160 139 42 -25 -114 -159 -90 -40 51 133 199 166 177 4 -121 -135 -197 -27 27 97 178 151 90 -8 -114 -85 -185
7182 -185 -56 -15 49 95 170 110 42 -48 -117 -123 -146 -30 58 138 131 156 34 -51 -106 -110 -95 -42 54 115 96 129 99 10 -43 -135
7212 -135 -170 -81 7 80 146 168 109 -11 -130 -115 -132 -113 -30 -3 120 99 97 4 -36 -160 -161 -159 -32 52 136 173 85 57 -55
7241 -55 -120 -185 -99 30 56 98 139 169 71 11 -20 -148 -126 -74 28 55 117 154 99 -25 -71 -96 -209 -35 -25 75 126
7268 126 151 86 -16 -56 -151 -107 -114 -60 55 98 196 127 53 1 -91 -166 -156 -19 84 169 188 127 49 -61 -101 -77 -94 -68
7296 -68 59 84 172 103 58 15 -32 -204 -193 -75 18 28 144 109 66 42 -31 -127 -122 -76 -50 18 108 128 107 6 -70 -132
7324 -132 -111 -180 -31 77 133 185 104 13 -4 -181 -123 -137 -37 5 102 144 42 25 43 -123 -118 -164 -104 -4 74 118 152
7351 152 108 -42 -95 -120 -158 -67 -39 31 133 93 62 15 -26 -47 -136 -109 -30 19 97 138 121 21 -35 -35 -92 -95 -35 48 119
7380 119 145 93 92 -22 -26 -123 -119 -50 39 50 104 147 97 -18 -77 -125 -164 -93 -12 38 127 78 33 20 -54 -95 -86 -136 11 45
7410 45 103 107 160 93 22 -105 -105 -105 -19 10 94 136 96 51 -17 -62 -90 -67 -60 15 34 54 107 79 29 -59 -158 -136 -108 -41 56 78
7442 78 126 65 -27 -19 -154 -123 -107 -72 40 27 66 62 90 2 -68 -104 -86 -97 32 44 156 100 50 -13 -42 -83 -141 -54 51
7471 51 112 114 108 57 39 -56 -13 -143 -41 -42 15 81 71 112 -54 -114 -139 -124 -88 -41 68 102 96 103 31 -7 -53 -59 -17 -35 29
7502 29 105 151 114 112 15 -46 -66 -129 -48 -14 110 80 81 56 -31 -28 -105 -64 -4 -37 9 41 117 64 6 -35 -83 -129 -96 -30 72
7533 72 121 99 47 33 -57 -105 -61 -80 -12 60 15 79 50 26 10 -8 -97 -145 -50 -12 89 119 95 -3 -50 -44 -96 -112 -104 -54 65
7564 65 83 24 46 -11 -42 -54 -107 -70 -28 37 61 85 76 27 2 -123 -53 -82 -107 -19 55 47 81 20 8 -66 -75 -62 -58 23 45 97
7596 97 137 84 37 -121 -49 -60 17 -34 1 49 79 40 2 -43 -60 -68 8 -39 46 83 88 83 57 -79 -52 -113 -55 -71 52 99
7626 99 96 91 -32 7 -71 -37 -48 37 -30 52 46 68 27 -17 -56 -90 -90 -98 -53 32 131 80 -2 -31 -69 -67 -37 -97 -23 49 54 32 83
7659 83 63 16 -34 -68 -66 -8 41 74 73 112 28 -54 -39 -59 -55 -9 63 118 48 83 73 -48 6 -39 -60 -38 -11 29 62 32 83
7690 83 -14 -69 -65 -102 -79 24 56 58 40 47 26 -15 -18 -45 -57 -50 31 124 91 85 39 -61 -105 -38 -69 -55 3 120 120 45 34 -15
7722 -15 10 5 -42 -25 -52 59 41 69 86 27 -37 -98 -101 -69 -3 78 95 51 11 -27 -62 -49 -73 -16 -47 -20 72 77 60 39 16
7753 16 -104 -53 -26 -7 87 110 100 79 69 -54 -73 -29 -36 -66 60 28 67 84 48 -6 -42 -75 -99 -55 -25 62 115 88 17
7782 17 -33 -120 -53 -22 -78 21 12 42 56 21 2 -18 -26 -75 -51 -44 31 97 86 92 37 -48 -105 -82 -74 -9 50 64 42 44 1 -5 -71 -78
7816 -78 -71 -119 -37 77 124 116 88 -13 -80 -114 -79 -56 -15 83 80 18 23 -19 -23 -28 -84 -47 -38 20 14 102 60 59 -1 -48 -62 -64 -16 5
7850 5 109 94 76 15 -35 -76 -65 -46 -38 11 -5 3 90 112 89 -39 -118 -138 -61 50 21 125 83 6 4 -110 -53 -15 -17 19
7880 19 19 -20 73 110 39 28 -47 -60 -105 -40 31 87 112 97 12 -73 -51 -76 -10 -44 -23 30 -15 3 61 -28 21 -57 -96 -62 -8
7911 -8 72 92 122 59 25 -101 -91 3 -23 -21 71 73 93 32 19 40 -22 -52 -92 -66 10 80 52 113 32 -106 -79 -125 -112 4
7941 4 20 44 84 -20 22 -18 -52 -46 -74 -55 -29 -4 40 40 73 14 -66 -127 -88 -38 -8 42 69 -10 74 -22 6 -36 -29 -41 -3 87
7973 87 63 86 106 20 22 -82 -137 -83 -54 77 71 110 50 27 3 -26 -36 -69 -101 -41 28 82 12 52 89 -17 -48 -80 -75 7
8003 7 75 107 88 57 39 -74 -38 9 -14 -53 -2 106 -17 23 63 52 -9 -101 -98 -65 20 25 73 115 -10 -15 -106 -101 -77 -30 47
8034 47 -22 62 22 46 66 -36 -27 -77 -45 -81 43 116 112 118 44 -107 -105 -84 -17 -19 65 37 74 79 28 17 -15 -55 -73 -36 -38 68
8066 68 83 93 8 -3 -72 -87 -62 -18 60 64 52 32 41 -3 -11 19 -66 -48 -20 23 67 125 96 4 -50 -95 -23 -37 27 104 114 110
8098 110 21 0 -24 -46 -61 -26 -65 -39 -8 32 148 64 52 -55 -117 -130 -15 18 98 82 24 15 -53 -92 -34 -59 -34 -48 -57
8127 -57 27 91 47 69 -68 -57 -150 -92 2 103 115 91 63 -12 -25 -52 -7 -16 0 -23 40 19 80 38 5 -86 -53 -121 -109 -9
8157 -9 56 144 95 37 3 -72 -79 -68 -28 25 25 -17 61 57 85 -1 -53 -104 -111 -62 21 85 120 90 52 -59 -120 -106 -41 2 23 51
8189 51 -41 39
8191C9
##END NTUPLES=NMR FID
##END=
